FailedConsole Output

Skipping 14,342 KB.. Full Log
pace/clang-stage2-Rthinlto/llvm-project/compiler-rt/test/fuzzer/AbsNegAndConstantTest.cpp -o /Users/buildslave/jenkins/workspace/clang-stage2-Rthinlto/clang-build/Build/tools/clang/runtime/compiler-rt-bins/test/fuzzer/X86_64DefaultDarwinConfig/Output/value-profile-cmp3.test.tmp-AbsNegAndConstantTest
: 'RUN: at line 4';   not  /Users/buildslave/jenkins/workspace/clang-stage2-Rthinlto/clang-build/Build/tools/clang/runtime/compiler-rt-bins/test/fuzzer/X86_64DefaultDarwinConfig/Output/value-profile-cmp3.test.tmp-AbsNegAndConstantTest -seed=1 -use_cmp=0 -use_value_profile=1 -runs=100000000 2>&1 | FileCheck /Users/buildslave/jenkins/workspace/clang-stage2-Rthinlto/llvm-project/compiler-rt/test/fuzzer/value-profile-cmp3.test
--
Exit Code: 137

Hide Details

Command Output (stderr): -- + : 'RUN: at line 3' + /Users/buildslave/jenkins/workspace/clang-stage2-Rthinlto/clang-build/Build/./bin/clang --driver-mode=g++ -O2 -gline-tables-only -fsanitize=address,fuzzer -I/Users/buildslave/jenkins/workspace/clang-stage2-Rthinlto/llvm-project/compiler-rt/lib/fuzzer -arch x86_64 -stdlib=libc++ -mmacosx-version-min=10.10 -isysroot /Applications/Xcode.app/Contents/Developer/Platforms/MacOSX.platform/Developer/SDKs/MacOSX10.15.sdk /Users/buildslave/jenkins/workspace/clang-stage2-Rthinlto/llvm-project/compiler-rt/test/fuzzer/AbsNegAndConstantTest.cpp -o /Users/buildslave/jenkins/workspace/clang-stage2-Rthinlto/clang-build/Build/tools/clang/runtime/compiler-rt-bins/test/fuzzer/X86_64DefaultDarwinConfig/Output/value-profile-cmp3.test.tmp-AbsNegAndConstantTest /Users/buildslave/jenkins/workspace/clang-stage2-Rthinlto/clang-build/Build/tools/clang/runtime/compiler-rt-bins/test/fuzzer/X86_64DefaultDarwinConfig/Output/value-profile-cmp3.test.script: line 2: 24176 Killed: 9 /Users/buildslave/jenkins/workspace/clang-stage2-Rthinlto/clang-build/Build/./bin/clang --driver-mode=g++ -O2 -gline-tables-only -fsanitize=address,fuzzer -I/Users/buildslave/jenkins/workspace/clang-stage2-Rthinlto/llvm-project/compiler-rt/lib/fuzzer -arch x86_64 -stdlib=libc++ -mmacosx-version-min=10.10 -isysroot /Applications/Xcode.app/Contents/Developer/Platforms/MacOSX.platform/Developer/SDKs/MacOSX10.15.sdk /Users/buildslave/jenkins/workspace/clang-stage2-Rthinlto/llvm-project/compiler-rt/test/fuzzer/AbsNegAndConstantTest.cpp -o /Users/buildslave/jenkins/workspace/clang-stage2-Rthinlto/clang-build/Build/tools/clang/runtime/compiler-rt-bins/test/fuzzer/X86_64DefaultDarwinConfig/Output/value-profile-cmp3.test.tmp-AbsNegAndConstantTest

Hide Details

--

Hide Details

******************** FAIL: libFuzzer :: value-profile-cmp2.test (3028 of 3037) ******************** TEST 'libFuzzer :: value-profile-cmp2.test' FAILED ******************** Script: -- : 'RUN: at line 5'; /Users/buildslave/jenkins/workspace/clang-stage2-Rthinlto/clang-build/Build/./bin/clang --driver-mode=g++ -O2 -gline-tables-only -fsanitize=address,fuzzer -I/Users/buildslave/jenkins/workspace/clang-stage2-Rthinlto/llvm-project/compiler-rt/lib/fuzzer -arch x86_64 -stdlib=libc++ -mmacosx-version-min=10.10 -isysroot /Applications/Xcode.app/Contents/Developer/Platforms/MacOSX.platform/Developer/SDKs/MacOSX10.15.sdk -fno-sanitize=address /Users/buildslave/jenkins/workspace/clang-stage2-Rthinlto/llvm-project/compiler-rt/test/fuzzer/SimpleHashTest.cpp -o /Users/buildslave/jenkins/workspace/clang-stage2-Rthinlto/clang-build/Build/tools/clang/runtime/compiler-rt-bins/test/fuzzer/X86_64DefaultDarwinConfig/Output/value-profile-cmp2.test.tmp-SimpleHashTest : 'RUN: at line 6'; not /Users/buildslave/jenkins/workspace/clang-stage2-Rthinlto/clang-build/Build/tools/clang/runtime/compiler-rt-bins/test/fuzzer/X86_64DefaultDarwinConfig/Output/value-profile-cmp2.test.tmp-SimpleHashTest -seed=1 -use_cmp=0 -use_value_profile=1 -runs=100000000 -max_len=64 2>&1 | FileCheck /Users/buildslave/jenkins/workspace/clang-stage2-Rthinlto/llvm-project/compiler-rt/test/fuzzer/value-profile-cmp2.test -- Exit Code: 137

Hide Details

Command Output (stderr): -- + : 'RUN: at line 5' + /Users/buildslave/jenkins/workspace/clang-stage2-Rthinlto/clang-build/Build/./bin/clang --driver-mode=g++ -O2 -gline-tables-only -fsanitize=address,fuzzer -I/Users/buildslave/jenkins/workspace/clang-stage2-Rthinlto/llvm-project/compiler-rt/lib/fuzzer -arch x86_64 -stdlib=libc++ -mmacosx-version-min=10.10 -isysroot /Applications/Xcode.app/Contents/Developer/Platforms/MacOSX.platform/Developer/SDKs/MacOSX10.15.sdk -fno-sanitize=address /Users/buildslave/jenkins/workspace/clang-stage2-Rthinlto/llvm-project/compiler-rt/test/fuzzer/SimpleHashTest.cpp -o /Users/buildslave/jenkins/workspace/clang-stage2-Rthinlto/clang-build/Build/tools/clang/runtime/compiler-rt-bins/test/fuzzer/X86_64DefaultDarwinConfig/Output/value-profile-cmp2.test.tmp-SimpleHashTest /Users/buildslave/jenkins/workspace/clang-stage2-Rthinlto/clang-build/Build/tools/clang/runtime/compiler-rt-bins/test/fuzzer/X86_64DefaultDarwinConfig/Output/value-profile-cmp2.test.script: line 2: 24177 Killed: 9 /Users/buildslave/jenkins/workspace/clang-stage2-Rthinlto/clang-build/Build/./bin/clang --driver-mode=g++ -O2 -gline-tables-only -fsanitize=address,fuzzer -I/Users/buildslave/jenkins/workspace/clang-stage2-Rthinlto/llvm-project/compiler-rt/lib/fuzzer -arch x86_64 -stdlib=libc++ -mmacosx-version-min=10.10 -isysroot /Applications/Xcode.app/Contents/Developer/Platforms/MacOSX.platform/Developer/SDKs/MacOSX10.15.sdk -fno-sanitize=address /Users/buildslave/jenkins/workspace/clang-stage2-Rthinlto/llvm-project/compiler-rt/test/fuzzer/SimpleHashTest.cpp -o /Users/buildslave/jenkins/workspace/clang-stage2-Rthinlto/clang-build/Build/tools/clang/runtime/compiler-rt-bins/test/fuzzer/X86_64DefaultDarwinConfig/Output/value-profile-cmp2.test.tmp-SimpleHashTest

Hide Details

--

Hide Details

******************** FAIL: libFuzzer :: value-profile-cmp4.test (3029 of 3037) ******************** TEST 'libFuzzer :: value-profile-cmp4.test' FAILED ******************** Script: -- : 'RUN: at line 2'; /Users/buildslave/jenkins/workspace/clang-stage2-Rthinlto/clang-build/Build/./bin/clang --driver-mode=g++ -O2 -gline-tables-only -fsanitize=address,fuzzer -I/Users/buildslave/jenkins/workspace/clang-stage2-Rthinlto/llvm-project/compiler-rt/lib/fuzzer -arch x86_64 -stdlib=libc++ -mmacosx-version-min=10.10 -isysroot /Applications/Xcode.app/Contents/Developer/Platforms/MacOSX.platform/Developer/SDKs/MacOSX10.15.sdk /Users/buildslave/jenkins/workspace/clang-stage2-Rthinlto/llvm-project/compiler-rt/test/fuzzer/AbsNegAndConstant64Test.cpp -o /Users/buildslave/jenkins/workspace/clang-stage2-Rthinlto/clang-build/Build/tools/clang/runtime/compiler-rt-bins/test/fuzzer/X86_64DefaultDarwinConfig/Output/value-profile-cmp4.test.tmp-AbsNegAndConstant64Test : 'RUN: at line 3'; not /Users/buildslave/jenkins/workspace/clang-stage2-Rthinlto/clang-build/Build/tools/clang/runtime/compiler-rt-bins/test/fuzzer/X86_64DefaultDarwinConfig/Output/value-profile-cmp4.test.tmp-AbsNegAndConstant64Test -seed=1 -use_cmp=0 -use_value_profile=1 -runs=100000000 2>&1 | FileCheck /Users/buildslave/jenkins/workspace/clang-stage2-Rthinlto/llvm-project/compiler-rt/test/fuzzer/value-profile-cmp4.test -- Exit Code: 137

Hide Details

Command Output (stderr): -- + : 'RUN: at line 2' + /Users/buildslave/jenkins/workspace/clang-stage2-Rthinlto/clang-build/Build/./bin/clang --driver-mode=g++ -O2 -gline-tables-only -fsanitize=address,fuzzer -I/Users/buildslave/jenkins/workspace/clang-stage2-Rthinlto/llvm-project/compiler-rt/lib/fuzzer -arch x86_64 -stdlib=libc++ -mmacosx-version-min=10.10 -isysroot /Applications/Xcode.app/Contents/Developer/Platforms/MacOSX.platform/Developer/SDKs/MacOSX10.15.sdk /Users/buildslave/jenkins/workspace/clang-stage2-Rthinlto/llvm-project/compiler-rt/test/fuzzer/AbsNegAndConstant64Test.cpp -o /Users/buildslave/jenkins/workspace/clang-stage2-Rthinlto/clang-build/Build/tools/clang/runtime/compiler-rt-bins/test/fuzzer/X86_64DefaultDarwinConfig/Output/value-profile-cmp4.test.tmp-AbsNegAndConstant64Test /Users/buildslave/jenkins/workspace/clang-stage2-Rthinlto/clang-build/Build/tools/clang/runtime/compiler-rt-bins/test/fuzzer/X86_64DefaultDarwinConfig/Output/value-profile-cmp4.test.script: line 2: 24179 Killed: 9 /Users/buildslave/jenkins/workspace/clang-stage2-Rthinlto/clang-build/Build/./bin/clang --driver-mode=g++ -O2 -gline-tables-only -fsanitize=address,fuzzer -I/Users/buildslave/jenkins/workspace/clang-stage2-Rthinlto/llvm-project/compiler-rt/lib/fuzzer -arch x86_64 -stdlib=libc++ -mmacosx-version-min=10.10 -isysroot /Applications/Xcode.app/Contents/Developer/Platforms/MacOSX.platform/Developer/SDKs/MacOSX10.15.sdk /Users/buildslave/jenkins/workspace/clang-stage2-Rthinlto/llvm-project/compiler-rt/test/fuzzer/AbsNegAndConstant64Test.cpp -o /Users/buildslave/jenkins/workspace/clang-stage2-Rthinlto/clang-build/Build/tools/clang/runtime/compiler-rt-bins/test/fuzzer/X86_64DefaultDarwinConfig/Output/value-profile-cmp4.test.tmp-AbsNegAndConstant64Test

Hide Details

--

Hide Details

******************** FAIL: libFuzzer :: value-profile-load.test (3030 of 3037) ******************** TEST 'libFuzzer :: value-profile-load.test' FAILED ******************** Script: -- : 'RUN: at line 2'; /Users/buildslave/jenkins/workspace/clang-stage2-Rthinlto/clang-build/Build/./bin/clang --driver-mode=g++ -O2 -gline-tables-only -fsanitize=address,fuzzer -I/Users/buildslave/jenkins/workspace/clang-stage2-Rthinlto/llvm-project/compiler-rt/lib/fuzzer -arch x86_64 -stdlib=libc++ -mmacosx-version-min=10.10 -isysroot /Applications/Xcode.app/Contents/Developer/Platforms/MacOSX.platform/Developer/SDKs/MacOSX10.15.sdk /Users/buildslave/jenkins/workspace/clang-stage2-Rthinlto/llvm-project/compiler-rt/test/fuzzer/LoadTest.cpp -fsanitize-coverage=trace-gep -o /Users/buildslave/jenkins/workspace/clang-stage2-Rthinlto/clang-build/Build/tools/clang/runtime/compiler-rt-bins/test/fuzzer/X86_64DefaultDarwinConfig/Output/value-profile-load.test.tmp-LoadTest : 'RUN: at line 3'; not /Users/buildslave/jenkins/workspace/clang-stage2-Rthinlto/clang-build/Build/tools/clang/runtime/compiler-rt-bins/test/fuzzer/X86_64DefaultDarwinConfig/Output/value-profile-load.test.tmp-LoadTest -seed=2 -use_cmp=0 -use_value_profile=1 -runs=20000000 2>&1 | FileCheck /Users/buildslave/jenkins/workspace/clang-stage2-Rthinlto/llvm-project/compiler-rt/test/fuzzer/value-profile-load.test -- Exit Code: 137

Hide Details

Command Output (stderr): -- + : 'RUN: at line 2' + /Users/buildslave/jenkins/workspace/clang-stage2-Rthinlto/clang-build/Build/./bin/clang --driver-mode=g++ -O2 -gline-tables-only -fsanitize=address,fuzzer -I/Users/buildslave/jenkins/workspace/clang-stage2-Rthinlto/llvm-project/compiler-rt/lib/fuzzer -arch x86_64 -stdlib=libc++ -mmacosx-version-min=10.10 -isysroot /Applications/Xcode.app/Contents/Developer/Platforms/MacOSX.platform/Developer/SDKs/MacOSX10.15.sdk /Users/buildslave/jenkins/workspace/clang-stage2-Rthinlto/llvm-project/compiler-rt/test/fuzzer/LoadTest.cpp -fsanitize-coverage=trace-gep -o /Users/buildslave/jenkins/workspace/clang-stage2-Rthinlto/clang-build/Build/tools/clang/runtime/compiler-rt-bins/test/fuzzer/X86_64DefaultDarwinConfig/Output/value-profile-load.test.tmp-LoadTest /Users/buildslave/jenkins/workspace/clang-stage2-Rthinlto/clang-build/Build/tools/clang/runtime/compiler-rt-bins/test/fuzzer/X86_64DefaultDarwinConfig/Output/value-profile-load.test.script: line 2: 24185 Killed: 9 /Users/buildslave/jenkins/workspace/clang-stage2-Rthinlto/clang-build/Build/./bin/clang --driver-mode=g++ -O2 -gline-tables-only -fsanitize=address,fuzzer -I/Users/buildslave/jenkins/workspace/clang-stage2-Rthinlto/llvm-project/compiler-rt/lib/fuzzer -arch x86_64 -stdlib=libc++ -mmacosx-version-min=10.10 -isysroot /Applications/Xcode.app/Contents/Developer/Platforms/MacOSX.platform/Developer/SDKs/MacOSX10.15.sdk /Users/buildslave/jenkins/workspace/clang-stage2-Rthinlto/llvm-project/compiler-rt/test/fuzzer/LoadTest.cpp -fsanitize-coverage=trace-gep -o /Users/buildslave/jenkins/workspace/clang-stage2-Rthinlto/clang-build/Build/tools/clang/runtime/compiler-rt-bins/test/fuzzer/X86_64DefaultDarwinConfig/Output/value-profile-load.test.tmp-LoadTest

Hide Details

--

Hide Details

******************** FAIL: libFuzzer :: value-profile-div.test (3031 of 3037) ******************** TEST 'libFuzzer :: value-profile-div.test' FAILED ******************** Script: -- : 'RUN: at line 4'; /Users/buildslave/jenkins/workspace/clang-stage2-Rthinlto/clang-build/Build/./bin/clang --driver-mode=g++ -O2 -gline-tables-only -fsanitize=address,fuzzer -I/Users/buildslave/jenkins/workspace/clang-stage2-Rthinlto/llvm-project/compiler-rt/lib/fuzzer -arch x86_64 -stdlib=libc++ -mmacosx-version-min=10.10 -isysroot /Applications/Xcode.app/Contents/Developer/Platforms/MacOSX.platform/Developer/SDKs/MacOSX10.15.sdk /Users/buildslave/jenkins/workspace/clang-stage2-Rthinlto/llvm-project/compiler-rt/test/fuzzer/DivTest.cpp -fsanitize-coverage=trace-div -o /Users/buildslave/jenkins/workspace/clang-stage2-Rthinlto/clang-build/Build/tools/clang/runtime/compiler-rt-bins/test/fuzzer/X86_64DefaultDarwinConfig/Output/value-profile-div.test.tmp-DivTest : 'RUN: at line 5'; not /Users/buildslave/jenkins/workspace/clang-stage2-Rthinlto/clang-build/Build/tools/clang/runtime/compiler-rt-bins/test/fuzzer/X86_64DefaultDarwinConfig/Output/value-profile-div.test.tmp-DivTest -seed=1 -use_value_profile=1 -runs=10000000 2>&1 | FileCheck /Users/buildslave/jenkins/workspace/clang-stage2-Rthinlto/llvm-project/compiler-rt/test/fuzzer/value-profile-div.test -- Exit Code: 137

Hide Details

Command Output (stderr): -- + : 'RUN: at line 4' + /Users/buildslave/jenkins/workspace/clang-stage2-Rthinlto/clang-build/Build/./bin/clang --driver-mode=g++ -O2 -gline-tables-only -fsanitize=address,fuzzer -I/Users/buildslave/jenkins/workspace/clang-stage2-Rthinlto/llvm-project/compiler-rt/lib/fuzzer -arch x86_64 -stdlib=libc++ -mmacosx-version-min=10.10 -isysroot /Applications/Xcode.app/Contents/Developer/Platforms/MacOSX.platform/Developer/SDKs/MacOSX10.15.sdk /Users/buildslave/jenkins/workspace/clang-stage2-Rthinlto/llvm-project/compiler-rt/test/fuzzer/DivTest.cpp -fsanitize-coverage=trace-div -o /Users/buildslave/jenkins/workspace/clang-stage2-Rthinlto/clang-build/Build/tools/clang/runtime/compiler-rt-bins/test/fuzzer/X86_64DefaultDarwinConfig/Output/value-profile-div.test.tmp-DivTest /Users/buildslave/jenkins/workspace/clang-stage2-Rthinlto/clang-build/Build/tools/clang/runtime/compiler-rt-bins/test/fuzzer/X86_64DefaultDarwinConfig/Output/value-profile-div.test.script: line 2: 24186 Killed: 9 /Users/buildslave/jenkins/workspace/clang-stage2-Rthinlto/clang-build/Build/./bin/clang --driver-mode=g++ -O2 -gline-tables-only -fsanitize=address,fuzzer -I/Users/buildslave/jenkins/workspace/clang-stage2-Rthinlto/llvm-project/compiler-rt/lib/fuzzer -arch x86_64 -stdlib=libc++ -mmacosx-version-min=10.10 -isysroot /Applications/Xcode.app/Contents/Developer/Platforms/MacOSX.platform/Developer/SDKs/MacOSX10.15.sdk /Users/buildslave/jenkins/workspace/clang-stage2-Rthinlto/llvm-project/compiler-rt/test/fuzzer/DivTest.cpp -fsanitize-coverage=trace-div -o /Users/buildslave/jenkins/workspace/clang-stage2-Rthinlto/clang-build/Build/tools/clang/runtime/compiler-rt-bins/test/fuzzer/X86_64DefaultDarwinConfig/Output/value-profile-div.test.tmp-DivTest

Hide Details

--

Hide Details

******************** FAIL: libFuzzer :: value-profile-mem.test (3032 of 3037) ******************** TEST 'libFuzzer :: value-profile-mem.test' FAILED ******************** Script: -- : 'RUN: at line 5'; /Users/buildslave/jenkins/workspace/clang-stage2-Rthinlto/clang-build/Build/./bin/clang --driver-mode=g++ -O2 -gline-tables-only -fsanitize=address,fuzzer -I/Users/buildslave/jenkins/workspace/clang-stage2-Rthinlto/llvm-project/compiler-rt/lib/fuzzer -arch x86_64 -stdlib=libc++ -mmacosx-version-min=10.10 -isysroot /Applications/Xcode.app/Contents/Developer/Platforms/MacOSX.platform/Developer/SDKs/MacOSX10.15.sdk /Users/buildslave/jenkins/workspace/clang-stage2-Rthinlto/llvm-project/compiler-rt/test/fuzzer/SingleMemcmpTest.cpp -o /Users/buildslave/jenkins/workspace/clang-stage2-Rthinlto/clang-build/Build/tools/clang/runtime/compiler-rt-bins/test/fuzzer/X86_64DefaultDarwinConfig/Output/value-profile-mem.test.tmp-SingleMemcmpTest -fno-sanitize-coverage=trace-cmp : 'RUN: at line 6'; not /Users/buildslave/jenkins/workspace/clang-stage2-Rthinlto/clang-build/Build/tools/clang/runtime/compiler-rt-bins/test/fuzzer/X86_64DefaultDarwinConfig/Output/value-profile-mem.test.tmp-SingleMemcmpTest -seed=1 -use_cmp=0 -use_value_profile=1 -runs=10000000 2>&1 | FileCheck /Users/buildslave/jenkins/workspace/clang-stage2-Rthinlto/llvm-project/compiler-rt/test/fuzzer/value-profile-mem.test -- Exit Code: 137

Hide Details

Command Output (stderr): -- + : 'RUN: at line 5' + /Users/buildslave/jenkins/workspace/clang-stage2-Rthinlto/clang-build/Build/./bin/clang --driver-mode=g++ -O2 -gline-tables-only -fsanitize=address,fuzzer -I/Users/buildslave/jenkins/workspace/clang-stage2-Rthinlto/llvm-project/compiler-rt/lib/fuzzer -arch x86_64 -stdlib=libc++ -mmacosx-version-min=10.10 -isysroot /Applications/Xcode.app/Contents/Developer/Platforms/MacOSX.platform/Developer/SDKs/MacOSX10.15.sdk /Users/buildslave/jenkins/workspace/clang-stage2-Rthinlto/llvm-project/compiler-rt/test/fuzzer/SingleMemcmpTest.cpp -o /Users/buildslave/jenkins/workspace/clang-stage2-Rthinlto/clang-build/Build/tools/clang/runtime/compiler-rt-bins/test/fuzzer/X86_64DefaultDarwinConfig/Output/value-profile-mem.test.tmp-SingleMemcmpTest -fno-sanitize-coverage=trace-cmp /Users/buildslave/jenkins/workspace/clang-stage2-Rthinlto/clang-build/Build/tools/clang/runtime/compiler-rt-bins/test/fuzzer/X86_64DefaultDarwinConfig/Output/value-profile-mem.test.script: line 2: 24187 Killed: 9 /Users/buildslave/jenkins/workspace/clang-stage2-Rthinlto/clang-build/Build/./bin/clang --driver-mode=g++ -O2 -gline-tables-only -fsanitize=address,fuzzer -I/Users/buildslave/jenkins/workspace/clang-stage2-Rthinlto/llvm-project/compiler-rt/lib/fuzzer -arch x86_64 -stdlib=libc++ -mmacosx-version-min=10.10 -isysroot /Applications/Xcode.app/Contents/Developer/Platforms/MacOSX.platform/Developer/SDKs/MacOSX10.15.sdk /Users/buildslave/jenkins/workspace/clang-stage2-Rthinlto/llvm-project/compiler-rt/test/fuzzer/SingleMemcmpTest.cpp -o /Users/buildslave/jenkins/workspace/clang-stage2-Rthinlto/clang-build/Build/tools/clang/runtime/compiler-rt-bins/test/fuzzer/X86_64DefaultDarwinConfig/Output/value-profile-mem.test.tmp-SingleMemcmpTest -fno-sanitize-coverage=trace-cmp

Hide Details

--

Hide Details

******************** FAIL: libFuzzer :: value-profile-strcmp.test (3033 of 3037) ******************** TEST 'libFuzzer :: value-profile-strcmp.test' FAILED ******************** Script: -- : 'RUN: at line 4'; /Users/buildslave/jenkins/workspace/clang-stage2-Rthinlto/clang-build/Build/./bin/clang --driver-mode=g++ -O2 -gline-tables-only -fsanitize=address,fuzzer -I/Users/buildslave/jenkins/workspace/clang-stage2-Rthinlto/llvm-project/compiler-rt/lib/fuzzer -arch x86_64 -stdlib=libc++ -mmacosx-version-min=10.10 -isysroot /Applications/Xcode.app/Contents/Developer/Platforms/MacOSX.platform/Developer/SDKs/MacOSX10.15.sdk /Users/buildslave/jenkins/workspace/clang-stage2-Rthinlto/llvm-project/compiler-rt/test/fuzzer/SingleStrcmpTest.cpp -o /Users/buildslave/jenkins/workspace/clang-stage2-Rthinlto/clang-build/Build/tools/clang/runtime/compiler-rt-bins/test/fuzzer/X86_64DefaultDarwinConfig/Output/value-profile-strcmp.test.tmp-SingleStrcmpTest : 'RUN: at line 5'; not /Users/buildslave/jenkins/workspace/clang-stage2-Rthinlto/clang-build/Build/tools/clang/runtime/compiler-rt-bins/test/fuzzer/X86_64DefaultDarwinConfig/Output/value-profile-strcmp.test.tmp-SingleStrcmpTest -seed=1 -use_cmp=0 -use_value_profile=1 -runs=10000000 2>&1 | FileCheck /Users/buildslave/jenkins/workspace/clang-stage2-Rthinlto/llvm-project/compiler-rt/test/fuzzer/value-profile-strcmp.test -- Exit Code: 137

Hide Details

Command Output (stderr): -- + : 'RUN: at line 4' + /Users/buildslave/jenkins/workspace/clang-stage2-Rthinlto/clang-build/Build/./bin/clang --driver-mode=g++ -O2 -gline-tables-only -fsanitize=address,fuzzer -I/Users/buildslave/jenkins/workspace/clang-stage2-Rthinlto/llvm-project/compiler-rt/lib/fuzzer -arch x86_64 -stdlib=libc++ -mmacosx-version-min=10.10 -isysroot /Applications/Xcode.app/Contents/Developer/Platforms/MacOSX.platform/Developer/SDKs/MacOSX10.15.sdk /Users/buildslave/jenkins/workspace/clang-stage2-Rthinlto/llvm-project/compiler-rt/test/fuzzer/SingleStrcmpTest.cpp -o /Users/buildslave/jenkins/workspace/clang-stage2-Rthinlto/clang-build/Build/tools/clang/runtime/compiler-rt-bins/test/fuzzer/X86_64DefaultDarwinConfig/Output/value-profile-strcmp.test.tmp-SingleStrcmpTest /Users/buildslave/jenkins/workspace/clang-stage2-Rthinlto/clang-build/Build/tools/clang/runtime/compiler-rt-bins/test/fuzzer/X86_64DefaultDarwinConfig/Output/value-profile-strcmp.test.script: line 2: 24191 Killed: 9 /Users/buildslave/jenkins/workspace/clang-stage2-Rthinlto/clang-build/Build/./bin/clang --driver-mode=g++ -O2 -gline-tables-only -fsanitize=address,fuzzer -I/Users/buildslave/jenkins/workspace/clang-stage2-Rthinlto/llvm-project/compiler-rt/lib/fuzzer -arch x86_64 -stdlib=libc++ -mmacosx-version-min=10.10 -isysroot /Applications/Xcode.app/Contents/Developer/Platforms/MacOSX.platform/Developer/SDKs/MacOSX10.15.sdk /Users/buildslave/jenkins/workspace/clang-stage2-Rthinlto/llvm-project/compiler-rt/test/fuzzer/SingleStrcmpTest.cpp -o /Users/buildslave/jenkins/workspace/clang-stage2-Rthinlto/clang-build/Build/tools/clang/runtime/compiler-rt-bins/test/fuzzer/X86_64DefaultDarwinConfig/Output/value-profile-strcmp.test.tmp-SingleStrcmpTest

Hide Details

--

Hide Details

******************** FAIL: libFuzzer :: value-profile-strncmp.test (3034 of 3037) ******************** TEST 'libFuzzer :: value-profile-strncmp.test' FAILED ******************** Script: -- : 'RUN: at line 3'; /Users/buildslave/jenkins/workspace/clang-stage2-Rthinlto/clang-build/Build/./bin/clang --driver-mode=g++ -O2 -gline-tables-only -fsanitize=address,fuzzer -I/Users/buildslave/jenkins/workspace/clang-stage2-Rthinlto/llvm-project/compiler-rt/lib/fuzzer -arch x86_64 -stdlib=libc++ -mmacosx-version-min=10.10 -isysroot /Applications/Xcode.app/Contents/Developer/Platforms/MacOSX.platform/Developer/SDKs/MacOSX10.15.sdk /Users/buildslave/jenkins/workspace/clang-stage2-Rthinlto/llvm-project/compiler-rt/test/fuzzer/SingleStrncmpTest.cpp -o /Users/buildslave/jenkins/workspace/clang-stage2-Rthinlto/clang-build/Build/tools/clang/runtime/compiler-rt-bins/test/fuzzer/X86_64DefaultDarwinConfig/Output/value-profile-strncmp.test.tmp-SingleStrncmpTest : 'RUN: at line 4'; not /Users/buildslave/jenkins/workspace/clang-stage2-Rthinlto/clang-build/Build/tools/clang/runtime/compiler-rt-bins/test/fuzzer/X86_64DefaultDarwinConfig/Output/value-profile-strncmp.test.tmp-SingleStrncmpTest -seed=1 -use_cmp=0 -use_value_profile=1 -runs=100000000 2>&1 | FileCheck /Users/buildslave/jenkins/workspace/clang-stage2-Rthinlto/llvm-project/compiler-rt/test/fuzzer/value-profile-strncmp.test -- Exit Code: 137

Hide Details

Command Output (stderr): -- + : 'RUN: at line 3' + /Users/buildslave/jenkins/workspace/clang-stage2-Rthinlto/clang-build/Build/./bin/clang --driver-mode=g++ -O2 -gline-tables-only -fsanitize=address,fuzzer -I/Users/buildslave/jenkins/workspace/clang-stage2-Rthinlto/llvm-project/compiler-rt/lib/fuzzer -arch x86_64 -stdlib=libc++ -mmacosx-version-min=10.10 -isysroot /Applications/Xcode.app/Contents/Developer/Platforms/MacOSX.platform/Developer/SDKs/MacOSX10.15.sdk /Users/buildslave/jenkins/workspace/clang-stage2-Rthinlto/llvm-project/compiler-rt/test/fuzzer/SingleStrncmpTest.cpp -o /Users/buildslave/jenkins/workspace/clang-stage2-Rthinlto/clang-build/Build/tools/clang/runtime/compiler-rt-bins/test/fuzzer/X86_64DefaultDarwinConfig/Output/value-profile-strncmp.test.tmp-SingleStrncmpTest /Users/buildslave/jenkins/workspace/clang-stage2-Rthinlto/clang-build/Build/tools/clang/runtime/compiler-rt-bins/test/fuzzer/X86_64DefaultDarwinConfig/Output/value-profile-strncmp.test.script: line 2: 24192 Killed: 9 /Users/buildslave/jenkins/workspace/clang-stage2-Rthinlto/clang-build/Build/./bin/clang --driver-mode=g++ -O2 -gline-tables-only -fsanitize=address,fuzzer -I/Users/buildslave/jenkins/workspace/clang-stage2-Rthinlto/llvm-project/compiler-rt/lib/fuzzer -arch x86_64 -stdlib=libc++ -mmacosx-version-min=10.10 -isysroot /Applications/Xcode.app/Contents/Developer/Platforms/MacOSX.platform/Developer/SDKs/MacOSX10.15.sdk /Users/buildslave/jenkins/workspace/clang-stage2-Rthinlto/llvm-project/compiler-rt/test/fuzzer/SingleStrncmpTest.cpp -o /Users/buildslave/jenkins/workspace/clang-stage2-Rthinlto/clang-build/Build/tools/clang/runtime/compiler-rt-bins/test/fuzzer/X86_64DefaultDarwinConfig/Output/value-profile-strncmp.test.tmp-SingleStrncmpTest

Hide Details

--

Hide Details

******************** FAIL: libFuzzer :: value-profile-set.test (3035 of 3037) ******************** TEST 'libFuzzer :: value-profile-set.test' FAILED ******************** Script: -- : 'RUN: at line 3'; /Users/buildslave/jenkins/workspace/clang-stage2-Rthinlto/clang-build/Build/./bin/clang --driver-mode=g++ -O2 -gline-tables-only -fsanitize=address,fuzzer -I/Users/buildslave/jenkins/workspace/clang-stage2-Rthinlto/llvm-project/compiler-rt/lib/fuzzer -arch x86_64 -stdlib=libc++ -mmacosx-version-min=10.10 -isysroot /Applications/Xcode.app/Contents/Developer/Platforms/MacOSX.platform/Developer/SDKs/MacOSX10.15.sdk /Users/buildslave/jenkins/workspace/clang-stage2-Rthinlto/llvm-project/compiler-rt/test/fuzzer/FourIndependentBranchesTest.cpp -o /Users/buildslave/jenkins/workspace/clang-stage2-Rthinlto/clang-build/Build/tools/clang/runtime/compiler-rt-bins/test/fuzzer/X86_64DefaultDarwinConfig/Output/value-profile-set.test.tmp-FourIndependentBranchesTest : 'RUN: at line 4'; not /Users/buildslave/jenkins/workspace/clang-stage2-Rthinlto/clang-build/Build/tools/clang/runtime/compiler-rt-bins/test/fuzzer/X86_64DefaultDarwinConfig/Output/value-profile-set.test.tmp-FourIndependentBranchesTest -seed=1 -use_cmp=0 -use_value_profile=1 -runs=100000000 2>&1 | FileCheck /Users/buildslave/jenkins/workspace/clang-stage2-Rthinlto/llvm-project/compiler-rt/test/fuzzer/value-profile-set.test -- Exit Code: 137

Hide Details

Command Output (stderr): -- + : 'RUN: at line 3' + /Users/buildslave/jenkins/workspace/clang-stage2-Rthinlto/clang-build/Build/./bin/clang --driver-mode=g++ -O2 -gline-tables-only -fsanitize=address,fuzzer -I/Users/buildslave/jenkins/workspace/clang-stage2-Rthinlto/llvm-project/compiler-rt/lib/fuzzer -arch x86_64 -stdlib=libc++ -mmacosx-version-min=10.10 -isysroot /Applications/Xcode.app/Contents/Developer/Platforms/MacOSX.platform/Developer/SDKs/MacOSX10.15.sdk /Users/buildslave/jenkins/workspace/clang-stage2-Rthinlto/llvm-project/compiler-rt/test/fuzzer/FourIndependentBranchesTest.cpp -o /Users/buildslave/jenkins/workspace/clang-stage2-Rthinlto/clang-build/Build/tools/clang/runtime/compiler-rt-bins/test/fuzzer/X86_64DefaultDarwinConfig/Output/value-profile-set.test.tmp-FourIndependentBranchesTest /Users/buildslave/jenkins/workspace/clang-stage2-Rthinlto/clang-build/Build/tools/clang/runtime/compiler-rt-bins/test/fuzzer/X86_64DefaultDarwinConfig/Output/value-profile-set.test.script: line 2: 24193 Killed: 9 /Users/buildslave/jenkins/workspace/clang-stage2-Rthinlto/clang-build/Build/./bin/clang --driver-mode=g++ -O2 -gline-tables-only -fsanitize=address,fuzzer -I/Users/buildslave/jenkins/workspace/clang-stage2-Rthinlto/llvm-project/compiler-rt/lib/fuzzer -arch x86_64 -stdlib=libc++ -mmacosx-version-min=10.10 -isysroot /Applications/Xcode.app/Contents/Developer/Platforms/MacOSX.platform/Developer/SDKs/MacOSX10.15.sdk /Users/buildslave/jenkins/workspace/clang-stage2-Rthinlto/llvm-project/compiler-rt/test/fuzzer/FourIndependentBranchesTest.cpp -o /Users/buildslave/jenkins/workspace/clang-stage2-Rthinlto/clang-build/Build/tools/clang/runtime/compiler-rt-bins/test/fuzzer/X86_64DefaultDarwinConfig/Output/value-profile-set.test.tmp-FourIndependentBranchesTest

Hide Details

--

Hide Details

******************** UNSUPPORTED: libFuzzer :: windows-opt-ref.test (3036 of 3037) FAIL: libFuzzer :: value-profile-switch.test (3037 of 3037) ******************** TEST 'libFuzzer :: value-profile-switch.test' FAILED ******************** Script: -- : 'RUN: at line 3'; /Users/buildslave/jenkins/workspace/clang-stage2-Rthinlto/clang-build/Build/./bin/clang --driver-mode=g++ -O2 -gline-tables-only -fsanitize=address,fuzzer -I/Users/buildslave/jenkins/workspace/clang-stage2-Rthinlto/llvm-project/compiler-rt/lib/fuzzer -arch x86_64 -stdlib=libc++ -mmacosx-version-min=10.10 -isysroot /Applications/Xcode.app/Contents/Developer/Platforms/MacOSX.platform/Developer/SDKs/MacOSX10.15.sdk /Users/buildslave/jenkins/workspace/clang-stage2-Rthinlto/llvm-project/compiler-rt/test/fuzzer/SwitchTest.cpp -o /Users/buildslave/jenkins/workspace/clang-stage2-Rthinlto/clang-build/Build/tools/clang/runtime/compiler-rt-bins/test/fuzzer/X86_64DefaultDarwinConfig/Output/value-profile-switch.test.tmp-SwitchTest : 'RUN: at line 4'; /Users/buildslave/jenkins/workspace/clang-stage2-Rthinlto/clang-build/Build/./bin/clang --driver-mode=g++ -O2 -gline-tables-only -fsanitize=address,fuzzer -I/Users/buildslave/jenkins/workspace/clang-stage2-Rthinlto/llvm-project/compiler-rt/lib/fuzzer -arch x86_64 -stdlib=libc++ -mmacosx-version-min=10.10 -isysroot /Applications/Xcode.app/Contents/Developer/Platforms/MacOSX.platform/Developer/SDKs/MacOSX10.15.sdk /Users/buildslave/jenkins/workspace/clang-stage2-Rthinlto/llvm-project/compiler-rt/test/fuzzer/Switch2Test.cpp -o /Users/buildslave/jenkins/workspace/clang-stage2-Rthinlto/clang-build/Build/tools/clang/runtime/compiler-rt-bins/test/fuzzer/X86_64DefaultDarwinConfig/Output/value-profile-switch.test.tmp-Switch2Test : 'RUN: at line 5'; /Users/buildslave/jenkins/workspace/clang-stage2-Rthinlto/clang-build/Build/./bin/clang --driver-mode=g++ -O2 -gline-tables-only -fsanitize=address,fuzzer -I/Users/buildslave/jenkins/workspace/clang-stage2-Rthinlto/llvm-project/compiler-rt/lib/fuzzer -arch x86_64 -stdlib=libc++ -mmacosx-version-min=10.10 -isysroot /Applications/Xcode.app/Contents/Developer/Platforms/MacOSX.platform/Developer/SDKs/MacOSX10.15.sdk /Users/buildslave/jenkins/workspace/clang-stage2-Rthinlto/llvm-project/compiler-rt/test/fuzzer/Switch3Test.cpp -o /Users/buildslave/jenkins/workspace/clang-stage2-Rthinlto/clang-build/Build/tools/clang/runtime/compiler-rt-bins/test/fuzzer/X86_64DefaultDarwinConfig/Output/value-profile-switch.test.tmp-Switch3Test : 'RUN: at line 6'; not /Users/buildslave/jenkins/workspace/clang-stage2-Rthinlto/clang-build/Build/tools/clang/runtime/compiler-rt-bins/test/fuzzer/X86_64DefaultDarwinConfig/Output/value-profile-switch.test.tmp-SwitchTest -use_cmp=0 -use_value_profile=1 -runs=100000000 -seed=1 2>&1 | FileCheck /Users/buildslave/jenkins/workspace/clang-stage2-Rthinlto/llvm-project/compiler-rt/test/fuzzer/value-profile-switch.test : 'RUN: at line 7'; not /Users/buildslave/jenkins/workspace/clang-stage2-Rthinlto/clang-build/Build/tools/clang/runtime/compiler-rt-bins/test/fuzzer/X86_64DefaultDarwinConfig/Output/value-profile-switch.test.tmp-Switch2Test -use_cmp=0 -use_value_profile=1 -runs=100000000 -seed=1 2>&1 | FileCheck /Users/buildslave/jenkins/workspace/clang-stage2-Rthinlto/llvm-project/compiler-rt/test/fuzzer/value-profile-switch.test : 'RUN: at line 8'; not /Users/buildslave/jenkins/workspace/clang-stage2-Rthinlto/clang-build/Build/tools/clang/runtime/compiler-rt-bins/test/fuzzer/X86_64DefaultDarwinConfig/Output/value-profile-switch.test.tmp-Switch3Test -use_cmp=0 -use_value_profile=1 -runs=100000000 -seed=1 2>&1 -- Exit Code: 137

Hide Details

Command Output (stderr): -- + : 'RUN: at line 3' + /Users/buildslave/jenkins/workspace/clang-stage2-Rthinlto/clang-build/Build/./bin/clang --driver-mode=g++ -O2 -gline-tables-only -fsanitize=address,fuzzer -I/Users/buildslave/jenkins/workspace/clang-stage2-Rthinlto/llvm-project/compiler-rt/lib/fuzzer -arch x86_64 -stdlib=libc++ -mmacosx-version-min=10.10 -isysroot /Applications/Xcode.app/Contents/Developer/Platforms/MacOSX.platform/Developer/SDKs/MacOSX10.15.sdk /Users/buildslave/jenkins/workspace/clang-stage2-Rthinlto/llvm-project/compiler-rt/test/fuzzer/SwitchTest.cpp -o /Users/buildslave/jenkins/workspace/clang-stage2-Rthinlto/clang-build/Build/tools/clang/runtime/compiler-rt-bins/test/fuzzer/X86_64DefaultDarwinConfig/Output/value-profile-switch.test.tmp-SwitchTest /Users/buildslave/jenkins/workspace/clang-stage2-Rthinlto/clang-build/Build/tools/clang/runtime/compiler-rt-bins/test/fuzzer/X86_64DefaultDarwinConfig/Output/value-profile-switch.test.script: line 6: 24195 Killed: 9 /Users/buildslave/jenkins/workspace/clang-stage2-Rthinlto/clang-build/Build/./bin/clang --driver-mode=g++ -O2 -gline-tables-only -fsanitize=address,fuzzer -I/Users/buildslave/jenkins/workspace/clang-stage2-Rthinlto/llvm-project/compiler-rt/lib/fuzzer -arch x86_64 -stdlib=libc++ -mmacosx-version-min=10.10 -isysroot /Applications/Xcode.app/Contents/Developer/Platforms/MacOSX.platform/Developer/SDKs/MacOSX10.15.sdk /Users/buildslave/jenkins/workspace/clang-stage2-Rthinlto/llvm-project/compiler-rt/test/fuzzer/SwitchTest.cpp -o /Users/buildslave/jenkins/workspace/clang-stage2-Rthinlto/clang-build/Build/tools/clang/runtime/compiler-rt-bins/test/fuzzer/X86_64DefaultDarwinConfig/Output/value-profile-switch.test.tmp-SwitchTest

Hide Details

--

Hide Details

******************** ******************** Failed Tests (1626): AddressSanitizer-x86_64-darwin :: TestCases/strncpy-overlap.cpp AddressSanitizer-x86_64-darwin :: TestCases/strspn-1.c AddressSanitizer-x86_64-darwin :: TestCases/strspn-2.c AddressSanitizer-x86_64-darwin :: TestCases/strspn_strict.c AddressSanitizer-x86_64-darwin :: TestCases/strstr-1.c AddressSanitizer-x86_64-darwin :: TestCases/strstr-2.c AddressSanitizer-x86_64-darwin :: TestCases/strstr_strict.c AddressSanitizer-x86_64-darwin :: TestCases/strtok.c AddressSanitizer-x86_64-darwin :: TestCases/strtol_strict.c AddressSanitizer-x86_64-darwin :: TestCases/strtoll_strict.c AddressSanitizer-x86_64-darwin :: TestCases/suppressions-exec-relative-location.cpp AddressSanitizer-x86_64-darwin :: TestCases/suppressions-interceptor.cpp AddressSanitizer-x86_64-darwin :: TestCases/suppressions-library.cpp AddressSanitizer-x86_64-darwin :: TestCases/throw_call_test.cpp AddressSanitizer-x86_64-darwin :: TestCases/throw_catch.cpp AddressSanitizer-x86_64-darwin :: TestCases/throw_invoke_test.cpp AddressSanitizer-x86_64-darwin :: TestCases/time_interceptor.cpp AddressSanitizer-x86_64-darwin :: TestCases/uar_and_exceptions.cpp AddressSanitizer-x86_64-darwin :: TestCases/unaligned_loads_and_stores.cpp AddressSanitizer-x86_64-darwin :: TestCases/use-after-delete.cpp AddressSanitizer-x86_64-darwin :: TestCases/use-after-free-right.cpp AddressSanitizer-x86_64-darwin :: TestCases/use-after-free.cpp AddressSanitizer-x86_64-darwin :: TestCases/use-after-poison.cpp AddressSanitizer-x86_64-darwin :: TestCases/use-after-scope-capture.cpp AddressSanitizer-x86_64-darwin :: TestCases/use-after-scope-dtor-order.cpp AddressSanitizer-x86_64-darwin :: TestCases/use-after-scope-goto.cpp AddressSanitizer-x86_64-darwin :: TestCases/use-after-scope-if.cpp AddressSanitizer-x86_64-darwin :: TestCases/use-after-scope-inlined.cpp AddressSanitizer-x86_64-darwin :: TestCases/use-after-scope-loop-bug.cpp AddressSanitizer-x86_64-darwin :: TestCases/use-after-scope-loop-removed.cpp AddressSanitizer-x86_64-darwin :: TestCases/use-after-scope-loop.cpp AddressSanitizer-x86_64-darwin :: TestCases/use-after-scope-nobug.cpp AddressSanitizer-x86_64-darwin :: TestCases/use-after-scope-temp.cpp AddressSanitizer-x86_64-darwin :: TestCases/use-after-scope-temp2.cpp AddressSanitizer-x86_64-darwin :: TestCases/use-after-scope-types.cpp AddressSanitizer-x86_64-darwin :: TestCases/use-after-scope.cpp AddressSanitizer-x86_64-darwin :: TestCases/verbose-log-path_test.cpp AddressSanitizer-x86_64-darwin :: TestCases/vla_chrome_testcase.cpp AddressSanitizer-x86_64-darwin :: TestCases/vla_condition_overflow.cpp AddressSanitizer-x86_64-darwin :: TestCases/vla_loop_overfow.cpp AddressSanitizer-x86_64-darwin :: TestCases/zero_page_pc.cpp Builtins :: TestCases/Darwin/os_version_check_test.c Builtins :: TestCases/Darwin/os_version_check_test_no_core_foundation.c Builtins-x86_64-darwin :: absvdi2_test.c Builtins-x86_64-darwin :: absvsi2_test.c Builtins-x86_64-darwin :: absvti2_test.c Builtins-x86_64-darwin :: addvdi3_test.c Builtins-x86_64-darwin :: addvsi3_test.c Builtins-x86_64-darwin :: addvti3_test.c Builtins-x86_64-darwin :: ashldi3_test.c Builtins-x86_64-darwin :: ashlti3_test.c Builtins-x86_64-darwin :: ashrdi3_test.c Builtins-x86_64-darwin :: ashrti3_test.c Builtins-x86_64-darwin :: bswapdi2_test.c Builtins-x86_64-darwin :: bswapsi2_test.c Builtins-x86_64-darwin :: clear_cache_test.c Builtins-x86_64-darwin :: clzdi2_test.c Builtins-x86_64-darwin :: clzsi2_test.c Builtins-x86_64-darwin :: clzti2_test.c Builtins-x86_64-darwin :: cmpdi2_test.c Builtins-x86_64-darwin :: cmpti2_test.c Builtins-x86_64-darwin :: comparedf2_test.c Builtins-x86_64-darwin :: comparesf2_test.c Builtins-x86_64-darwin :: compiler_rt_logb_test.c Builtins-x86_64-darwin :: compiler_rt_logbf_test.c Builtins-x86_64-darwin :: compiler_rt_logbl_test.c Builtins-x86_64-darwin :: ctzdi2_test.c Builtins-x86_64-darwin :: ctzsi2_test.c Builtins-x86_64-darwin :: ctzti2_test.c Builtins-x86_64-darwin :: divdc3_test.c Builtins-x86_64-darwin :: divdf3_test.c Builtins-x86_64-darwin :: divdi3_test.c Builtins-x86_64-darwin :: divmodsi4_test.c Builtins-x86_64-darwin :: divsc3_test.c Builtins-x86_64-darwin :: divsf3_test.c Builtins-x86_64-darwin :: divsi3_test.c Builtins-x86_64-darwin :: divtc3_test.c Builtins-x86_64-darwin :: divti3_test.c Builtins-x86_64-darwin :: divxc3_test.c Builtins-x86_64-darwin :: enable_execute_stack_test.c Builtins-x86_64-darwin :: eqtf2_test.c Builtins-x86_64-darwin :: extenddftf2_test.c Builtins-x86_64-darwin :: extendhfsf2_test.c Builtins-x86_64-darwin :: extendsftf2_test.c Builtins-x86_64-darwin :: ffsdi2_test.c Builtins-x86_64-darwin :: ffssi2_test.c Builtins-x86_64-darwin :: ffsti2_test.c Builtins-x86_64-darwin :: fixdfdi_test.c Builtins-x86_64-darwin :: fixdfti_test.c Builtins-x86_64-darwin :: fixsfdi_test.c Builtins-x86_64-darwin :: fixsfti_test.c Builtins-x86_64-darwin :: fixtfdi_test.c Builtins-x86_64-darwin :: fixtfsi_test.c Builtins-x86_64-darwin :: fixtfti_test.c Builtins-x86_64-darwin :: fixunsdfdi_test.c Builtins-x86_64-darwin :: fixunsdfsi_test.c Builtins-x86_64-darwin :: fixunsdfti_test.c Builtins-x86_64-darwin :: fixunssfdi_test.c Builtins-x86_64-darwin :: fixunssfsi_test.c Builtins-x86_64-darwin :: fixunssfti_test.c Builtins-x86_64-darwin :: fixunstfdi_test.c Builtins-x86_64-darwin :: fixunstfsi_test.c Builtins-x86_64-darwin :: fixunstfti_test.c Builtins-x86_64-darwin :: fixunsxfdi_test.c Builtins-x86_64-darwin :: fixunsxfsi_test.c Builtins-x86_64-darwin :: fixunsxfti_test.c Builtins-x86_64-darwin :: fixxfdi_test.c Builtins-x86_64-darwin :: fixxfti_test.c Builtins-x86_64-darwin :: floatdidf_test.c Builtins-x86_64-darwin :: floatdisf_test.c Builtins-x86_64-darwin :: floatditf_test.c Builtins-x86_64-darwin :: floatdixf_test.c Builtins-x86_64-darwin :: floatsitf_test.c Builtins-x86_64-darwin :: floattidf_test.c Builtins-x86_64-darwin :: floattisf_test.c Builtins-x86_64-darwin :: floattitf_test.c Builtins-x86_64-darwin :: floattixf_test.c Builtins-x86_64-darwin :: floatundidf_test.c Builtins-x86_64-darwin :: floatundisf_test.c Builtins-x86_64-darwin :: floatunditf_test.c Builtins-x86_64-darwin :: floatundixf_test.c Builtins-x86_64-darwin :: floatunsitf_test.c Builtins-x86_64-darwin :: floatuntidf_test.c Builtins-x86_64-darwin :: floatuntisf_test.c Builtins-x86_64-darwin :: floatuntitf_test.c Builtins-x86_64-darwin :: floatuntixf_test.c Builtins-x86_64-darwin :: getf2_test.c Builtins-x86_64-darwin :: gttf2_test.c Builtins-x86_64-darwin :: letf2_test.c Builtins-x86_64-darwin :: lshrdi3_test.c Builtins-x86_64-darwin :: lshrti3_test.c Builtins-x86_64-darwin :: lttf2_test.c Builtins-x86_64-darwin :: moddi3_test.c Builtins-x86_64-darwin :: modsi3_test.c Builtins-x86_64-darwin :: modti3_test.c Builtins-x86_64-darwin :: muldc3_test.c Builtins-x86_64-darwin :: muldi3_test.c Builtins-x86_64-darwin :: mulodi4_test.c Builtins-x86_64-darwin :: mulosi4_test.c Builtins-x86_64-darwin :: muloti4_test.c Builtins-x86_64-darwin :: mulsc3_test.c Builtins-x86_64-darwin :: multc3_test.c Builtins-x86_64-darwin :: multi3_test.c Builtins-x86_64-darwin :: mulvdi3_test.c Builtins-x86_64-darwin :: mulvsi3_test.c Builtins-x86_64-darwin :: mulvti3_test.c Builtins-x86_64-darwin :: mulxc3_test.c Builtins-x86_64-darwin :: negdi2_test.c Builtins-x86_64-darwin :: negti2_test.c Builtins-x86_64-darwin :: negvdi2_test.c Builtins-x86_64-darwin :: negvsi2_test.c Builtins-x86_64-darwin :: negvti2_test.c Builtins-x86_64-darwin :: netf2_test.c Builtins-x86_64-darwin :: paritydi2_test.c Builtins-x86_64-darwin :: paritysi2_test.c Builtins-x86_64-darwin :: parityti2_test.c Builtins-x86_64-darwin :: popcountdi2_test.c Builtins-x86_64-darwin :: popcountsi2_test.c Builtins-x86_64-darwin :: popcountti2_test.c Builtins-x86_64-darwin :: powidf2_test.c Builtins-x86_64-darwin :: powisf2_test.c Builtins-x86_64-darwin :: powixf2_test.c Builtins-x86_64-darwin :: subvdi3_test.c Builtins-x86_64-darwin :: subvsi3_test.c Builtins-x86_64-darwin :: subvti3_test.c Builtins-x86_64-darwin :: truncdfhf2_test.c Builtins-x86_64-darwin :: truncdfsf2_test.c Builtins-x86_64-darwin :: truncsfhf2_test.c Builtins-x86_64-darwin :: trunctfdf2_test.c Builtins-x86_64-darwin :: trunctfsf2_test.c Builtins-x86_64-darwin :: ucmpdi2_test.c Builtins-x86_64-darwin :: ucmpti2_test.c Builtins-x86_64-darwin :: udivdi3_test.c Builtins-x86_64-darwin :: udivmoddi4_test.c Builtins-x86_64-darwin :: udivmodsi4_test.c Builtins-x86_64-darwin :: udivmodti4_test.c Builtins-x86_64-darwin :: udivsi3_test.c Builtins-x86_64-darwin :: udivti3_test.c Builtins-x86_64-darwin :: umoddi3_test.c Builtins-x86_64-darwin :: umodsi3_test.c Builtins-x86_64-darwin :: umodti3_test.c Builtins-x86_64-darwin :: unordtf2_test.c LLVMFuzzer-Unittest :: ./Fuzzer-x86_64-Test/Corpus.Distribution LLVMFuzzer-Unittest :: ./Fuzzer-x86_64-Test/DFT.BlockCoverage LLVMFuzzer-Unittest :: ./Fuzzer-x86_64-Test/DFT.FunctionWeights LLVMFuzzer-Unittest :: ./Fuzzer-x86_64-Test/Entropic.ComputeEnergy LLVMFuzzer-Unittest :: ./Fuzzer-x86_64-Test/Entropic.UpdateFrequency LLVMFuzzer-Unittest :: ./Fuzzer-x86_64-Test/Fuzzer.Basename LLVMFuzzer-Unittest :: ./Fuzzer-x86_64-Test/Fuzzer.CrossOver LLVMFuzzer-Unittest :: ./Fuzzer-x86_64-Test/Fuzzer.ForEachNonZeroByte LLVMFuzzer-Unittest :: ./Fuzzer-x86_64-Test/Fuzzer.Hash LLVMFuzzer-Unittest :: ./Fuzzer-x86_64-Test/FuzzerCommand.Create LLVMFuzzer-Unittest :: ./Fuzzer-x86_64-Test/FuzzerCommand.ModifyArguments LLVMFuzzer-Unittest :: ./Fuzzer-x86_64-Test/FuzzerCommand.ModifyFlags LLVMFuzzer-Unittest :: ./Fuzzer-x86_64-Test/FuzzerCommand.SetOutput LLVMFuzzer-Unittest :: ./Fuzzer-x86_64-Test/FuzzerDictionary.ParseDictionaryFile LLVMFuzzer-Unittest :: ./Fuzzer-x86_64-Test/FuzzerDictionary.ParseOneDictionaryEntry LLVMFuzzer-Unittest :: ./Fuzzer-x86_64-Test/FuzzerMutate.AddWordFromDictionary1 LLVMFuzzer-Unittest :: ./Fuzzer-x86_64-Test/FuzzerMutate.AddWordFromDictionary2 LLVMFuzzer-Unittest :: ./Fuzzer-x86_64-Test/FuzzerMutate.ChangeASCIIInteger1 LLVMFuzzer-Unittest :: ./Fuzzer-x86_64-Test/FuzzerMutate.ChangeASCIIInteger2 LLVMFuzzer-Unittest :: ./Fuzzer-x86_64-Test/FuzzerMutate.ChangeBinaryInteger1 LLVMFuzzer-Unittest :: ./Fuzzer-x86_64-Test/FuzzerMutate.ChangeBinaryInteger2 LLVMFuzzer-Unittest :: ./Fuzzer-x86_64-Test/FuzzerMutate.ChangeBit1 LLVMFuzzer-Unittest :: ./Fuzzer-x86_64-Test/FuzzerMutate.ChangeBit2 LLVMFuzzer-Unittest :: ./Fuzzer-x86_64-Test/FuzzerMutate.ChangeByte1 LLVMFuzzer-Unittest :: ./Fuzzer-x86_64-Test/FuzzerMutate.ChangeByte2 LLVMFuzzer-Unittest :: ./Fuzzer-x86_64-Test/FuzzerMutate.CopyPart1 LLVMFuzzer-Unittest :: ./Fuzzer-x86_64-Test/FuzzerMutate.CopyPart2 LLVMFuzzer-Unittest :: ./Fuzzer-x86_64-Test/FuzzerMutate.CopyPartNoInsertAtMaxSize LLVMFuzzer-Unittest :: ./Fuzzer-x86_64-Test/FuzzerMutate.EraseBytes1 LLVMFuzzer-Unittest :: ./Fuzzer-x86_64-Test/FuzzerMutate.EraseBytes2 LLVMFuzzer-Unittest :: ./Fuzzer-x86_64-Test/FuzzerMutate.InsertByte1 LLVMFuzzer-Unittest :: ./Fuzzer-x86_64-Test/FuzzerMutate.InsertByte2 LLVMFuzzer-Unittest :: ./Fuzzer-x86_64-Test/FuzzerMutate.InsertRepeatedBytes1 LLVMFuzzer-Unittest :: ./Fuzzer-x86_64-Test/FuzzerMutate.InsertRepeatedBytes2 LLVMFuzzer-Unittest :: ./Fuzzer-x86_64-Test/FuzzerMutate.ShuffleBytes1 LLVMFuzzer-Unittest :: ./Fuzzer-x86_64-Test/FuzzerMutate.ShuffleBytes2 LLVMFuzzer-Unittest :: ./Fuzzer-x86_64-Test/FuzzerUtil.Base64 LLVMFuzzer-Unittest :: ./Fuzzer-x86_64-Test/Merge.Bad LLVMFuzzer-Unittest :: ./Fuzzer-x86_64-Test/Merge.Good LLVMFuzzer-Unittest :: ./Fuzzer-x86_64-Test/Merge.Merge LLVMFuzzer-Unittest :: ./FuzzerUtils-x86_64-Test/FuzzedDataProvider.ConsumeBool LLVMFuzzer-Unittest :: ./FuzzerUtils-x86_64-Test/FuzzedDataProvider.ConsumeBytes LLVMFuzzer-Unittest :: ./FuzzerUtils-x86_64-Test/FuzzedDataProvider.ConsumeBytesAsString LLVMFuzzer-Unittest :: ./FuzzerUtils-x86_64-Test/FuzzedDataProvider.ConsumeBytesWithTerminator LLVMFuzzer-Unittest :: ./FuzzerUtils-x86_64-Test/FuzzedDataProvider.ConsumeData LLVMFuzzer-Unittest :: ./FuzzerUtils-x86_64-Test/FuzzedDataProvider.ConsumeEnum LLVMFuzzer-Unittest :: ./FuzzerUtils-x86_64-Test/FuzzedDataProvider.ConsumeFloatingPoint LLVMFuzzer-Unittest :: ./FuzzerUtils-x86_64-Test/FuzzedDataProvider.ConsumeIntegral LLVMFuzzer-Unittest :: ./FuzzerUtils-x86_64-Test/FuzzedDataProvider.ConsumeIntegralInRange LLVMFuzzer-Unittest :: ./FuzzerUtils-x86_64-Test/FuzzedDataProvider.ConsumeProbability LLVMFuzzer-Unittest :: ./FuzzerUtils-x86_64-Test/FuzzedDataProvider.ConsumeRandomLengthString LLVMFuzzer-Unittest :: ./FuzzerUtils-x86_64-Test/FuzzedDataProvider.ConsumeRemainingBytes LLVMFuzzer-Unittest :: ./FuzzerUtils-x86_64-Test/FuzzedDataProvider.ConsumeRemainingBytesAsString LLVMFuzzer-Unittest :: ./FuzzerUtils-x86_64-Test/FuzzedDataProvider.PickValueInArray LLVMFuzzer-Unittest :: ./FuzzerUtils-x86_64-Test/FuzzedDataProvider.remaining_bytes LeakSanitizer-AddressSanitizer-x86_64 :: TestCases/Darwin/dispatch.mm LeakSanitizer-AddressSanitizer-x86_64 :: TestCases/default_options.cpp LeakSanitizer-AddressSanitizer-x86_64 :: TestCases/disabler.c LeakSanitizer-AddressSanitizer-x86_64 :: TestCases/disabler.cpp LeakSanitizer-AddressSanitizer-x86_64 :: TestCases/do_leak_check_override.cpp LeakSanitizer-AddressSanitizer-x86_64 :: TestCases/high_allocator_contention.cpp LeakSanitizer-AddressSanitizer-x86_64 :: TestCases/ignore_object.c LeakSanitizer-AddressSanitizer-x86_64 :: TestCases/ignore_object_errors.cpp LeakSanitizer-AddressSanitizer-x86_64 :: TestCases/leak_check_at_exit.cpp LeakSanitizer-AddressSanitizer-x86_64 :: TestCases/leak_check_before_thread_started.cpp LeakSanitizer-AddressSanitizer-x86_64 :: TestCases/many_tls_keys_pthread.cpp LeakSanitizer-AddressSanitizer-x86_64 :: TestCases/many_tls_keys_thread.cpp LeakSanitizer-AddressSanitizer-x86_64 :: TestCases/new_array_with_dtor_0.cpp LeakSanitizer-AddressSanitizer-x86_64 :: TestCases/pointer_to_self.cpp LeakSanitizer-AddressSanitizer-x86_64 :: TestCases/print_suppressions.cpp LeakSanitizer-AddressSanitizer-x86_64 :: TestCases/register_root_region.cpp LeakSanitizer-AddressSanitizer-x86_64 :: TestCases/sanity_check_pure_c.c LeakSanitizer-AddressSanitizer-x86_64 :: TestCases/suppressions_default.cpp LeakSanitizer-AddressSanitizer-x86_64 :: TestCases/suppressions_file.cpp LeakSanitizer-AddressSanitizer-x86_64 :: TestCases/swapcontext.cpp LeakSanitizer-AddressSanitizer-x86_64 :: TestCases/use_after_return.cpp LeakSanitizer-AddressSanitizer-x86_64 :: TestCases/use_globals_initialized.cpp LeakSanitizer-AddressSanitizer-x86_64 :: TestCases/use_globals_uninitialized.cpp LeakSanitizer-AddressSanitizer-x86_64 :: TestCases/use_poisoned_asan.cpp LeakSanitizer-AddressSanitizer-x86_64 :: TestCases/use_registers.cpp LeakSanitizer-AddressSanitizer-x86_64 :: TestCases/use_stacks.cpp LeakSanitizer-AddressSanitizer-x86_64 :: TestCases/use_stacks_threaded.cpp LeakSanitizer-AddressSanitizer-x86_64 :: TestCases/use_unaligned.cpp LeakSanitizer-Standalone-x86_64 :: TestCases/Darwin/dispatch.mm LeakSanitizer-Standalone-x86_64 :: TestCases/default_options.cpp LeakSanitizer-Standalone-x86_64 :: TestCases/disabler.c LeakSanitizer-Standalone-x86_64 :: TestCases/disabler.cpp LeakSanitizer-Standalone-x86_64 :: TestCases/do_leak_check_override.cpp LeakSanitizer-Standalone-x86_64 :: TestCases/high_allocator_contention.cpp LeakSanitizer-Standalone-x86_64 :: TestCases/ignore_object.c LeakSanitizer-Standalone-x86_64 :: TestCases/ignore_object_errors.cpp LeakSanitizer-Standalone-x86_64 :: TestCases/leak_check_at_exit.cpp LeakSanitizer-Standalone-x86_64 :: TestCases/leak_check_before_thread_started.cpp LeakSanitizer-Standalone-x86_64 :: TestCases/many_tls_keys_pthread.cpp LeakSanitizer-Standalone-x86_64 :: TestCases/many_tls_keys_thread.cpp LeakSanitizer-Standalone-x86_64 :: TestCases/new_array_with_dtor_0.cpp LeakSanitizer-Standalone-x86_64 :: TestCases/pointer_to_self.cpp LeakSanitizer-Standalone-x86_64 :: TestCases/print_suppressions.cpp LeakSanitizer-Standalone-x86_64 :: TestCases/register_root_region.cpp LeakSanitizer-Standalone-x86_64 :: TestCases/sanity_check_pure_c.c LeakSanitizer-Standalone-x86_64 :: TestCases/suppressions_default.cpp LeakSanitizer-Standalone-x86_64 :: TestCases/suppressions_file.cpp LeakSanitizer-Standalone-x86_64 :: TestCases/swapcontext.cpp LeakSanitizer-Standalone-x86_64 :: TestCases/use_after_return.cpp LeakSanitizer-Standalone-x86_64 :: TestCases/use_globals_initialized.cpp LeakSanitizer-Standalone-x86_64 :: TestCases/use_globals_uninitialized.cpp LeakSanitizer-Standalone-x86_64 :: TestCases/use_registers.cpp LeakSanitizer-Standalone-x86_64 :: TestCases/use_stacks.cpp LeakSanitizer-Standalone-x86_64 :: TestCases/use_stacks_threaded.cpp LeakSanitizer-Standalone-x86_64 :: TestCases/use_unaligned.cpp Profile-x86_64 :: ContinuousSyncMode/basic.c Profile-x86_64 :: ContinuousSyncMode/darwin-proof-of-concept.c Profile-x86_64 :: ContinuousSyncMode/multiple-DSOs.c Profile-x86_64 :: ContinuousSyncMode/online-merging.c Profile-x86_64 :: ContinuousSyncMode/pid-substitution.c Profile-x86_64 :: ContinuousSyncMode/set-file-object.c Profile-x86_64 :: ContinuousSyncMode/set-filename.c Profile-x86_64 :: Posix/gcov-dlopen.c Profile-x86_64 :: Posix/gcov-execlp.c Profile-x86_64 :: Posix/gcov-fork.c Profile-x86_64 :: Posix/instrprof-dlopen.test Profile-x86_64 :: Posix/instrprof-dynamic-one-shared.test Profile-x86_64 :: Posix/instrprof-dynamic-two-shared.test Profile-x86_64 :: Posix/instrprof-gcov-parallel.test Profile-x86_64 :: Posix/instrprof-get-filename-merge-mode.c Profile-x86_64 :: Posix/instrprof-shared.test Profile-x86_64 :: Posix/instrprof-value-prof-shared.test Profile-x86_64 :: Posix/instrprof-visibility.cpp Profile-x86_64 :: coverage-inline.cpp Profile-x86_64 :: coverage_comments.cpp Profile-x86_64 :: gcc-flag-compatibility.test Profile-x86_64 :: gcov-__gcov_flush-terminate.c Profile-x86_64 :: gcov-basic.c Profile-x86_64 :: gcov-dump-and-remove.c Profile-x86_64 :: infinite_loop.c Profile-x86_64 :: instrprof-basic.c Profile-x86_64 :: instrprof-bufferio.c Profile-x86_64 :: instrprof-darwin-dead-strip.c Profile-x86_64 :: instrprof-darwin-exports.c Profile-x86_64 :: instrprof-dump.c Profile-x86_64 :: instrprof-error.c Profile-x86_64 :: instrprof-gcov-exceptions.test Profile-x86_64 :: instrprof-gcov-multiple-bbs-single-line.test Profile-x86_64 :: instrprof-gcov-multithread_fork.test Profile-x86_64 :: instrprof-gcov-one-line-function.test Profile-x86_64 :: instrprof-gcov-switch.test Profile-x86_64 :: instrprof-gcov-two-objects.test Profile-x86_64 :: instrprof-get-filename.c Profile-x86_64 :: instrprof-hostname.c Profile-x86_64 :: instrprof-icall-promo.test Profile-x86_64 :: instrprof-merge-match.test Profile-x86_64 :: instrprof-merge.c Profile-x86_64 :: instrprof-merging.cpp Profile-x86_64 :: instrprof-order-file.test Profile-x86_64 :: instrprof-override-filename-then-reset-default.c Profile-x86_64 :: instrprof-override-filename-with-env.c Profile-x86_64 :: instrprof-override-filename.c Profile-x86_64 :: instrprof-path.c Profile-x86_64 :: instrprof-reset-counters.c Profile-x86_64 :: instrprof-set-dir-mode.c Profile-x86_64 :: instrprof-set-file-object-merging.c Profile-x86_64 :: instrprof-set-file-object.c Profile-x86_64 :: instrprof-set-filename-then-reset-default.c Profile-x86_64 :: instrprof-set-filename.c Profile-x86_64 :: instrprof-value-prof-2.c Profile-x86_64 :: instrprof-value-prof-evict.test Profile-x86_64 :: instrprof-value-prof-reset.c Profile-x86_64 :: instrprof-value-prof.c Profile-x86_64 :: instrprof-value-prof.test Profile-x86_64 :: instrprof-version-mismatch.c Profile-x86_64 :: instrprof-without-libc.c Profile-x86_64 :: instrprof-write-file-atexit-explicitly.c Profile-x86_64 :: instrprof-write-file-only.c Profile-x86_64 :: instrprof-write-file.c Profile-x86_64 :: runtime_infinite.c SanitizerCommon-Unit :: ./Sanitizer-x86_64-Test/Allocator.AllocatorCacheDeallocNewThread SanitizerCommon-Unit :: ./Sanitizer-x86_64-Test/Allocator.Basic SanitizerCommon-Unit :: ./Sanitizer-x86_64-Test/Allocator.LargeAlloc SanitizerCommon-Unit :: ./Sanitizer-x86_64-Test/Allocator.ScopedBuffer SanitizerCommon-Unit :: ./Sanitizer-x86_64-Test/Allocator.Stress SanitizerCommon-Unit :: ./Sanitizer-x86_64-Test/BVGraph.AddEdgesTest SanitizerCommon-Unit :: ./Sanitizer-x86_64-Test/BVGraph.BasicTest SanitizerCommon-Unit :: ./Sanitizer-x86_64-Test/BVGraph.LongCycle SanitizerCommon-Unit :: ./Sanitizer-x86_64-Test/BVGraph.RemoveEdges SanitizerCommon-Unit :: ./Sanitizer-x86_64-Test/BVGraph.ShortestPath SanitizerCommon-Unit :: ./Sanitizer-x86_64-Test/BVGraph.isReachable SanitizerCommon-Unit :: ./Sanitizer-x86_64-Test/CompactRingBuffer.int64 SanitizerCommon-Unit :: ./Sanitizer-x86_64-Test/DeadlockDetector.BasicTest SanitizerCommon-Unit :: ./Sanitizer-x86_64-Test/DeadlockDetector.CorrectEpochFlush SanitizerCommon-Unit :: ./Sanitizer-x86_64-Test/DeadlockDetector.LockContextTest SanitizerCommon-Unit :: ./Sanitizer-x86_64-Test/DeadlockDetector.MultipleEpochsTest SanitizerCommon-Unit :: ./Sanitizer-x86_64-Test/DeadlockDetector.RecusriveLockTest SanitizerCommon-Unit :: ./Sanitizer-x86_64-Test/DeadlockDetector.RemoveEdgesTest SanitizerCommon-Unit :: ./Sanitizer-x86_64-Test/DeadlockDetector.RemoveNodeTest SanitizerCommon-Unit :: ./Sanitizer-x86_64-Test/DeadlockDetector.TryLockTest SanitizerCommon-Unit :: ./Sanitizer-x86_64-Test/DeadlockDetector.onFirstLockTest SanitizerCommon-Unit :: ./Sanitizer-x86_64-Test/FastUnwindTest.Basic SanitizerCommon-Unit :: ./Sanitizer-x86_64-Test/FastUnwindTest.CloseToZeroFrame SanitizerCommon-Unit :: ./Sanitizer-x86_64-Test/FastUnwindTest.FPBelowPrevFP SanitizerCommon-Unit :: ./Sanitizer-x86_64-Test/FastUnwindTest.FramePointerLoop SanitizerCommon-Unit :: ./Sanitizer-x86_64-Test/FastUnwindTest.MisalignedFramePointer SanitizerCommon-Unit :: ./Sanitizer-x86_64-Test/FastUnwindTest.OneFrameStackTrace SanitizerCommon-Unit :: ./Sanitizer-x86_64-Test/FastUnwindTest.ZeroFramesStackTrace SanitizerCommon-Unit :: ./Sanitizer-x86_64-Test/FileSizes/SanitizerCommonFileTest.ReadFileToBuffer/0 SanitizerCommon-Unit :: ./Sanitizer-x86_64-Test/FileSizes/SanitizerCommonFileTest.ReadFileToBuffer/1 SanitizerCommon-Unit :: ./Sanitizer-x86_64-Test/FileSizes/SanitizerCommonFileTest.ReadFileToBuffer/2 SanitizerCommon-Unit :: ./Sanitizer-x86_64-Test/FileSizes/SanitizerCommonFileTest.ReadFileToBuffer/3 SanitizerCommon-Unit :: ./Sanitizer-x86_64-Test/FileSizes/SanitizerCommonFileTest.ReadFileToBuffer/4 SanitizerCommon-Unit :: ./Sanitizer-x86_64-Test/FileSizes/SanitizerCommonFileTest.ReadFileToBuffer/5 SanitizerCommon-Unit :: ./Sanitizer-x86_64-Test/FileSizes/SanitizerCommonFileTest.ReadFileToBuffer/6 SanitizerCommon-Unit :: ./Sanitizer-x86_64-Test/FileSizes/SanitizerCommonFileTest.ReadFileToBuffer/7 SanitizerCommon-Unit :: ./Sanitizer-x86_64-Test/FileSizes/SanitizerCommonFileTest.ReadFileToBuffer/8 SanitizerCommon-Unit :: ./Sanitizer-x86_64-Test/FileSizes/SanitizerCommonFileTest.ReadFileToBuffer/9 SanitizerCommon-Unit :: ./Sanitizer-x86_64-Test/FileSizes/SanitizerCommonFileTest.ReadFileToBufferHalf/0 SanitizerCommon-Unit :: ./Sanitizer-x86_64-Test/FileSizes/SanitizerCommonFileTest.ReadFileToBufferHalf/1 SanitizerCommon-Unit :: ./Sanitizer-x86_64-Test/FileSizes/SanitizerCommonFileTest.ReadFileToBufferHalf/2 SanitizerCommon-Unit :: ./Sanitizer-x86_64-Test/FileSizes/SanitizerCommonFileTest.ReadFileToBufferHalf/3 SanitizerCommon-Unit :: ./Sanitizer-x86_64-Test/FileSizes/SanitizerCommonFileTest.ReadFileToBufferHalf/4 SanitizerCommon-Unit :: ./Sanitizer-x86_64-Test/FileSizes/SanitizerCommonFileTest.ReadFileToBufferHalf/5 SanitizerCommon-Unit :: ./Sanitizer-x86_64-Test/FileSizes/SanitizerCommonFileTest.ReadFileToBufferHalf/6 SanitizerCommon-Unit :: ./Sanitizer-x86_64-Test/FileSizes/SanitizerCommonFileTest.ReadFileToBufferHalf/7 SanitizerCommon-Unit :: ./Sanitizer-x86_64-Test/FileSizes/SanitizerCommonFileTest.ReadFileToBufferHalf/8 SanitizerCommon-Unit :: ./Sanitizer-x86_64-Test/FileSizes/SanitizerCommonFileTest.ReadFileToBufferHalf/9 SanitizerCommon-Unit :: ./Sanitizer-x86_64-Test/FileSizes/SanitizerCommonFileTest.ReadFileToVector/0 SanitizerCommon-Unit :: ./Sanitizer-x86_64-Test/FileSizes/SanitizerCommonFileTest.ReadFileToVector/1 SanitizerCommon-Unit :: ./Sanitizer-x86_64-Test/FileSizes/SanitizerCommonFileTest.ReadFileToVector/2 SanitizerCommon-Unit :: ./Sanitizer-x86_64-Test/FileSizes/SanitizerCommonFileTest.ReadFileToVector/3 SanitizerCommon-Unit :: ./Sanitizer-x86_64-Test/FileSizes/SanitizerCommonFileTest.ReadFileToVector/4 SanitizerCommon-Unit :: ./Sanitizer-x86_64-Test/FileSizes/SanitizerCommonFileTest.ReadFileToVector/5 SanitizerCommon-Unit :: ./Sanitizer-x86_64-Test/FileSizes/SanitizerCommonFileTest.ReadFileToVector/6 SanitizerCommon-Unit :: ./Sanitizer-x86_64-Test/FileSizes/SanitizerCommonFileTest.ReadFileToVector/7 SanitizerCommon-Unit :: ./Sanitizer-x86_64-Test/FileSizes/SanitizerCommonFileTest.ReadFileToVector/8 SanitizerCommon-Unit :: ./Sanitizer-x86_64-Test/FileSizes/SanitizerCommonFileTest.ReadFileToVector/9 SanitizerCommon-Unit :: ./Sanitizer-x86_64-Test/FileSizes/SanitizerCommonFileTest.ReadFileToVectorHalf/0 SanitizerCommon-Unit :: ./Sanitizer-x86_64-Test/FileSizes/SanitizerCommonFileTest.ReadFileToVectorHalf/1 SanitizerCommon-Unit :: ./Sanitizer-x86_64-Test/FileSizes/SanitizerCommonFileTest.ReadFileToVectorHalf/2 SanitizerCommon-Unit :: ./Sanitizer-x86_64-Test/FileSizes/SanitizerCommonFileTest.ReadFileToVectorHalf/3 SanitizerCommon-Unit :: ./Sanitizer-x86_64-Test/FileSizes/SanitizerCommonFileTest.ReadFileToVectorHalf/4 SanitizerCommon-Unit :: ./Sanitizer-x86_64-Test/FileSizes/SanitizerCommonFileTest.ReadFileToVectorHalf/5 SanitizerCommon-Unit :: ./Sanitizer-x86_64-Test/FileSizes/SanitizerCommonFileTest.ReadFileToVectorHalf/6 SanitizerCommon-Unit :: ./Sanitizer-x86_64-Test/FileSizes/SanitizerCommonFileTest.ReadFileToVectorHalf/7 SanitizerCommon-Unit :: ./Sanitizer-x86_64-Test/FileSizes/SanitizerCommonFileTest.ReadFileToVectorHalf/8 SanitizerCommon-Unit :: ./Sanitizer-x86_64-Test/FileSizes/SanitizerCommonFileTest.ReadFileToVectorHalf/9 SanitizerCommon-Unit :: ./Sanitizer-x86_64-Test/MemoryMapping.LoadedModuleArchAndUUID SanitizerCommon-Unit :: ./Sanitizer-x86_64-Test/MemoryMappingLayout.DumpListOfModules SanitizerCommon-Unit :: ./Sanitizer-x86_64-Test/Printf.Basic SanitizerCommon-Unit :: ./Sanitizer-x86_64-Test/Printf.MinMax SanitizerCommon-Unit :: ./Sanitizer-x86_64-Test/Printf.OverflowInt SanitizerCommon-Unit :: ./Sanitizer-x86_64-Test/Printf.OverflowPtr SanitizerCommon-Unit :: ./Sanitizer-x86_64-Test/Printf.OverflowStr SanitizerCommon-Unit :: ./Sanitizer-x86_64-Test/Printf.OverflowUint SanitizerCommon-Unit :: ./Sanitizer-x86_64-Test/Printf.Padding SanitizerCommon-Unit :: ./Sanitizer-x86_64-Test/Printf.Precision SanitizerCommon-Unit :: ./Sanitizer-x86_64-Test/RingBuffer.Construct SanitizerCommon-Unit :: ./Sanitizer-x86_64-Test/RingBuffer.LargeStruct SanitizerCommon-Unit :: ./Sanitizer-x86_64-Test/RingBuffer.int64 SanitizerCommon-Unit :: ./Sanitizer-x86_64-Test/SanitizerCommon.AllocatorLeakTest SanitizerCommon-Unit :: ./Sanitizer-x86_64-Test/SanitizerCommon.AtomicCompareExchangeTest SanitizerCommon-Unit :: ./Sanitizer-x86_64-Test/SanitizerCommon.AtomicStoreLoad SanitizerCommon-Unit :: ./Sanitizer-x86_64-Test/SanitizerCommon.BasicBitVector SanitizerCommon-Unit :: ./Sanitizer-x86_64-Test/SanitizerCommon.BlockingMutex SanitizerCommon-Unit :: ./Sanitizer-x86_64-Test/SanitizerCommon.BooleanFlags SanitizerCommon-Unit :: ./Sanitizer-x86_64-Test/SanitizerCommon.CombinedAllocator32Compact SanitizerCommon-Unit :: ./Sanitizer-x86_64-Test/SanitizerCommon.CombinedAllocator64 SanitizerCommon-Unit :: ./Sanitizer-x86_64-Test/SanitizerCommon.CombinedAllocator64Compact SanitizerCommon-Unit :: ./Sanitizer-x86_64-Test/SanitizerCommon.CombinedAllocator64Dynamic SanitizerCommon-Unit :: ./Sanitizer-x86_64-Test/SanitizerCommon.CombinedAllocator64VeryCompact SanitizerCommon-Unit :: ./Sanitizer-x86_64-Test/SanitizerCommon.CommonFlags SanitizerCommon-Unit :: ./Sanitizer-x86_64-Test/SanitizerCommon.CommonSuffixFlags SanitizerCommon-Unit :: ./Sanitizer-x86_64-Test/SanitizerCommon.CompactSizeClassMap SanitizerCommon-Unit :: ./Sanitizer-x86_64-Test/SanitizerCommon.Conditional SanitizerCommon-Unit :: ./Sanitizer-x86_64-Test/SanitizerCommon.DefaultSizeClassMap SanitizerCommon-Unit :: ./Sanitizer-x86_64-Test/SanitizerCommon.DenseSizeClassMap SanitizerCommon-Unit :: ./Sanitizer-x86_64-Test/SanitizerCommon.FileOps SanitizerCommon-Unit :: ./Sanitizer-x86_64-Test/SanitizerCommon.GetRandom SanitizerCommon-Unit :: ./Sanitizer-x86_64-Test/SanitizerCommon.HandleSignalMode SanitizerCommon-Unit :: ./Sanitizer-x86_64-Test/SanitizerCommon.IntFlags SanitizerCommon-Unit :: ./Sanitizer-x86_64-Test/SanitizerCommon.InternalLowerBound SanitizerCommon-Unit :: ./Sanitizer-x86_64-Test/SanitizerCommon.InternalLowerBoundVsStdLowerBound SanitizerCommon-Unit :: ./Sanitizer-x86_64-Test/SanitizerCommon.InternalMemmoveRegression SanitizerCommon-Unit :: ./Sanitizer-x86_64-Test/SanitizerCommon.InternalMmapVector SanitizerCommon-Unit :: ./Sanitizer-x86_64-Test/SanitizerCommon.InternalMmapVectorEq SanitizerCommon-Unit :: ./Sanitizer-x86_64-Test/SanitizerCommon.InternalMmapVectorReize SanitizerCommon-Unit :: ./Sanitizer-x86_64-Test/SanitizerCommon.InternalMmapVectorRoundUpCapacity SanitizerCommon-Unit :: ./Sanitizer-x86_64-Test/SanitizerCommon.InternalMmapVectorSwap SanitizerCommon-Unit :: ./Sanitizer-x86_64-Test/SanitizerCommon.InternalScopedString SanitizerCommon-Unit :: ./Sanitizer-x86_64-Test/SanitizerCommon.InternalSizeClassMap SanitizerCommon-Unit :: ./Sanitizer-x86_64-Test/SanitizerCommon.InternalStrFunctions SanitizerCommon-Unit :: ./Sanitizer-x86_64-Test/SanitizerCommon.IntrusiveList SanitizerCommon-Unit :: ./Sanitizer-x86_64-Test/SanitizerCommon.IntrusiveListAppendEmpty SanitizerCommon-Unit :: ./Sanitizer-x86_64-Test/SanitizerCommon.IsAccessibleMemoryRange SanitizerCommon-Unit :: ./Sanitizer-x86_64-Test/SanitizerCommon.IsSame SanitizerCommon-Unit :: ./Sanitizer-x86_64-Test/SanitizerCommon.LargeMmapAllocator SanitizerCommon-Unit :: ./Sanitizer-x86_64-Test/SanitizerCommon.LargeMmapAllocatorBlockBegin SanitizerCommon-Unit :: ./Sanitizer-x86_64-Test/SanitizerCommon.LargeMmapAllocatorIteration SanitizerCommon-Unit :: ./Sanitizer-x86_64-Test/SanitizerCommon.LargeMmapAllocatorMapUnmapCallback SanitizerCommon-Unit :: ./Sanitizer-x86_64-Test/SanitizerCommon.LongLongIntFlags SanitizerCommon-Unit :: ./Sanitizer-x86_64-Test/SanitizerCommon.LowLevelAllocatorShouldRoundUpSizeOnAlloc SanitizerCommon-Unit :: ./Sanitizer-x86_64-Test/SanitizerCommon.MmapAlignedOrDieOnFatalError SanitizerCommon-Unit :: ./Sanitizer-x86_64-Test/SanitizerCommon.MultipleFlags SanitizerCommon-Unit :: ./Sanitizer-x86_64-Test/SanitizerCommon.PthreadDestructorIterations SanitizerCommon-Unit :: ./Sanitizer-x86_64-Test/SanitizerCommon.QuarantineBatchMerge SanitizerCommon-Unit :: ./Sanitizer-x86_64-Test/SanitizerCommon.QuarantineCacheMergeBatchesALotOfBatches SanitizerCommon-Unit :: ./Sanitizer-x86_64-Test/SanitizerCommon.QuarantineCacheMergeBatchesEmpty SanitizerCommon-Unit :: ./Sanitizer-x86_64-Test/SanitizerCommon.QuarantineCacheMergeBatchesOneBatch SanitizerCommon-Unit :: ./Sanitizer-x86_64-Test/SanitizerCommon.QuarantineCacheMergeBatchesSmallBatches SanitizerCommon-Unit :: ./Sanitizer-x86_64-Test/SanitizerCommon.QuarantineCacheMergeBatchesTooBigToMerge SanitizerCommon-Unit :: ./Sanitizer-x86_64-Test/SanitizerCommon.ReadBinaryNameCached SanitizerCommon-Unit :: ./Sanitizer-x86_64-Test/SanitizerCommon.RemoveANSIEscapeSequencesFromString SanitizerCommon-Unit :: ./Sanitizer-x86_64-Test/SanitizerCommon.ReservedAddressRangeInit SanitizerCommon-Unit :: ./Sanitizer-x86_64-Test/SanitizerCommon.ReservedAddressRangeMap SanitizerCommon-Unit :: ./Sanitizer-x86_64-Test/SanitizerCommon.ReservedAddressRangeUnmap SanitizerCommon-Unit :: ./Sanitizer-x86_64-Test/SanitizerCommon.SizeClassAllocator32Compact SanitizerCommon-Unit :: ./Sanitizer-x86_64-Test/SanitizerCommon.SizeClassAllocator32CompactGetBlockBegin SanitizerCommon-Unit :: ./Sanitizer-x86_64-Test/SanitizerCommon.SizeClassAllocator32CompactLocalCache SanitizerCommon-Unit :: ./Sanitizer-x86_64-Test/SanitizerCommon.SizeClassAllocator32CompactMetadataStress SanitizerCommon-Unit :: ./Sanitizer-x86_64-Test/SanitizerCommon.SizeClassAllocator32Iteration SanitizerCommon-Unit :: ./Sanitizer-x86_64-Test/SanitizerCommon.SizeClassAllocator32MapUnmapCallback SanitizerCommon-Unit :: ./Sanitizer-x86_64-Test/SanitizerCommon.SizeClassAllocator32SeparateBatches SanitizerCommon-Unit :: ./Sanitizer-x86_64-Test/SanitizerCommon.SizeClassAllocator64 SanitizerCommon-Unit :: ./Sanitizer-x86_64-Test/SanitizerCommon.SizeClassAllocator64Compact SanitizerCommon-Unit :: ./Sanitizer-x86_64-Test/SanitizerCommon.SizeClassAllocator64CompactGetBlockBegin SanitizerCommon-Unit :: ./Sanitizer-x86_64-Test/SanitizerCommon.SizeClassAllocator64CompactLocalCache SanitizerCommon-Unit :: ./Sanitizer-x86_64-Test/SanitizerCommon.SizeClassAllocator64CompactMetadataStress SanitizerCommon-Unit :: ./Sanitizer-x86_64-Test/SanitizerCommon.SizeClassAllocator64CompactReleaseFreeMemoryToOS SanitizerCommon-Unit :: ./Sanitizer-x86_64-Test/SanitizerCommon.SizeClassAllocator64Dense SanitizerCommon-Unit :: ./Sanitizer-x86_64-Test/SanitizerCommon.SizeClassAllocator64Dynamic SanitizerCommon-Unit :: ./Sanitizer-x86_64-Test/SanitizerCommon.SizeClassAllocator64DynamicGetBlockBegin SanitizerCommon-Unit :: ./Sanitizer-x86_64-Test/SanitizerCommon.SizeClassAllocator64DynamicIteration SanitizerCommon-Unit :: ./Sanitizer-x86_64-Test/SanitizerCommon.SizeClassAllocator64DynamicLocalCache SanitizerCommon-Unit :: ./Sanitizer-x86_64-Test/SanitizerCommon.SizeClassAllocator64DynamicMetadataStress SanitizerCommon-Unit :: ./Sanitizer-x86_64-Test/SanitizerCommon.SizeClassAllocator64FreePagesRangeTracker SanitizerCommon-Unit :: ./Sanitizer-x86_64-Test/SanitizerCommon.SizeClassAllocator64GetBlockBegin SanitizerCommon-Unit :: ./Sanitizer-x86_64-Test/SanitizerCommon.SizeClassAllocator64Iteration SanitizerCommon-Unit :: ./Sanitizer-x86_64-Test/SanitizerCommon.SizeClassAllocator64LocalCache SanitizerCommon-Unit :: ./Sanitizer-x86_64-Test/SanitizerCommon.SizeClassAllocator64MapUnmapCallback SanitizerCommon-Unit :: ./Sanitizer-x86_64-Test/SanitizerCommon.SizeClassAllocator64MetadataStress SanitizerCommon-Unit :: ./Sanitizer-x86_64-Test/SanitizerCommon.SizeClassAllocator64Overflow SanitizerCommon-Unit :: ./Sanitizer-x86_64-Test/SanitizerCommon.SizeClassAllocator64PackedCounterArray SanitizerCommon-Unit :: ./Sanitizer-x86_64-Test/SanitizerCommon.SizeClassAllocator64PopulateFreeListOOM SanitizerCommon-Unit :: ./Sanitizer-x86_64-Test/SanitizerCommon.SizeClassAllocator64ReleaseFreeMemoryToOS SanitizerCommon-Unit :: ./Sanitizer-x86_64-Test/SanitizerCommon.SizeClassAllocator64VeryCompact SanitizerCommon-Unit :: ./Sanitizer-x86_64-Test/SanitizerCommon.SizeClassAllocator64VeryCompactGetBlockBegin SanitizerCommon-Unit :: ./Sanitizer-x86_64-Test/SanitizerCommon.SizeClassAllocator64VeryCompactLocalCache SanitizerCommon-Unit :: ./Sanitizer-x86_64-Test/SanitizerCommon.SizeClassAllocator64VeryCompactReleaseFreeMemoryToOS SanitizerCommon-Unit :: ./Sanitizer-x86_64-Test/SanitizerCommon.SortTest SanitizerCommon-Unit :: ./Sanitizer-x86_64-Test/SanitizerCommon.SpinMutex SanitizerCommon-Unit :: ./Sanitizer-x86_64-Test/SanitizerCommon.SpinMutexTry SanitizerCommon-Unit :: ./Sanitizer-x86_64-Test/SanitizerCommon.StackDepotAbsent SanitizerCommon-Unit :: ./Sanitizer-x86_64-Test/SanitizerCommon.StackDepotBasic SanitizerCommon-Unit :: ./Sanitizer-x86_64-Test/SanitizerCommon.StackDepotEmptyStack SanitizerCommon-Unit :: ./Sanitizer-x86_64-Test/SanitizerCommon.StackDepotReverseMap SanitizerCommon-Unit :: ./Sanitizer-x86_64-Test/SanitizerCommon.StackDepotSame SanitizerCommon-Unit :: ./Sanitizer-x86_64-Test/SanitizerCommon.StackDepotSeveral SanitizerCommon-Unit :: ./Sanitizer-x86_64-Test/SanitizerCommon.StackDepotZeroId SanitizerCommon-Unit :: ./Sanitizer-x86_64-Test/SanitizerCommon.StrFlags SanitizerCommon-Unit :: ./Sanitizer-x86_64-Test/SanitizerCommon.StripPathPrefix SanitizerCommon-Unit :: ./Sanitizer-x86_64-Test/SanitizerCommon.ThreadRegistryTest SanitizerCommon-Unit :: ./Sanitizer-x86_64-Test/SanitizerCommon.ThreadRegistryThreadedTest SanitizerCommon-Unit :: ./Sanitizer-x86_64-Test/SanitizerCommon.ThreadStackTlsMain SanitizerCommon-Unit :: ./Sanitizer-x86_64-Test/SanitizerCommon.ThreadStackTlsWorker SanitizerCommon-Unit :: ./Sanitizer-x86_64-Test/SanitizerCommon.ThreadedTwoLevelByteMap SanitizerCommon-Unit :: ./Sanitizer-x86_64-Test/SanitizerCommon.TwoLevelBitVector SanitizerCommon-Unit :: ./Sanitizer-x86_64-Test/SanitizerCommon.TwoLevelByteMap SanitizerCommon-Unit :: ./Sanitizer-x86_64-Test/SanitizerCommon.VeryCompactSizeClassMap SanitizerCommon-Unit :: ./Sanitizer-x86_64-Test/SanitizerCommon.mem_is_zero SanitizerCommon-Unit :: ./Sanitizer-x86_64-Test/SanitizerCommonInterceptors.Printf SanitizerCommon-Unit :: ./Sanitizer-x86_64-Test/SanitizerCommonInterceptors.Scanf SanitizerCommon-Unit :: ./Sanitizer-x86_64-Test/SanitizerCommonInterceptors.ScanfAllocate SanitizerCommon-Unit :: ./Sanitizer-x86_64-Test/SanitizerMac.GetDarwinKernelVersion SanitizerCommon-Unit :: ./Sanitizer-x86_64-Test/SanitizerMac.GetMacosAlignedVersion SanitizerCommon-Unit :: ./Sanitizer-x86_64-Test/SanitizerMac.ParseVersion SanitizerCommon-Unit :: ./Sanitizer-x86_64-Test/SanitizerStacktracePrinter.RenderFrame SanitizerCommon-Unit :: ./Sanitizer-x86_64-Test/SanitizerStacktracePrinter.RenderModuleLocation SanitizerCommon-Unit :: ./Sanitizer-x86_64-Test/SanitizerStacktracePrinter.RenderSourceLocation SanitizerCommon-Unit :: ./Sanitizer-x86_64-Test/SlowUnwindTest.ShortStackTrace SanitizerCommon-Unit :: ./Sanitizer-x86_64-Test/SuppressionContextTest.HasSuppressionType SanitizerCommon-Unit :: ./Sanitizer-x86_64-Test/SuppressionContextTest.Parse SanitizerCommon-Unit :: ./Sanitizer-x86_64-Test/SuppressionContextTest.Parse2 SanitizerCommon-Unit :: ./Sanitizer-x86_64-Test/SuppressionContextTest.Parse3 SanitizerCommon-Unit :: ./Sanitizer-x86_64-Test/SuppressionContextTest.ParseType SanitizerCommon-Unit :: ./Sanitizer-x86_64-Test/SuppressionContextTest.RegressionTestForBufferOverflowInSuppressions SanitizerCommon-Unit :: ./Sanitizer-x86_64-Test/Suppressions.Match SanitizerCommon-Unit :: ./Sanitizer-x86_64-Test/Symbolizer.DemangleSwiftAndCXX SanitizerCommon-Unit :: ./Sanitizer-x86_64-Test/Symbolizer.ExtractInt SanitizerCommon-Unit :: ./Sanitizer-x86_64-Test/Symbolizer.ExtractToken SanitizerCommon-Unit :: ./Sanitizer-x86_64-Test/Symbolizer.ExtractTokenUpToDelimiter SanitizerCommon-Unit :: ./Sanitizer-x86_64-Test/Symbolizer.ExtractUptr SanitizerCommon-Unit :: ./Sanitizer-x86_64-Test/Vector.Basic SanitizerCommon-Unit :: ./Sanitizer-x86_64-Test/Vector.ResizeReduction SanitizerCommon-Unit :: ./Sanitizer-x86_64-Test/Vector.Stride SanitizerCommon-asan-x86_64-Darwin :: Darwin/abort_on_error.cpp SanitizerCommon-asan-x86_64-Darwin :: Darwin/fputs_puts_null.cpp SanitizerCommon-asan-x86_64-Darwin :: Darwin/malloc_zone.cpp SanitizerCommon-asan-x86_64-Darwin :: Darwin/print-stack-trace-in-code-loaded-after-fork.cpp SanitizerCommon-asan-x86_64-Darwin :: Darwin/print-stack-trace.cpp SanitizerCommon-asan-x86_64-Darwin :: Darwin/symbolizer-function-offset-atos.cpp SanitizerCommon-asan-x86_64-Darwin :: Darwin/symbolizer-function-offset-dladdr.cpp SanitizerCommon-asan-x86_64-Darwin :: Posix/access.cpp SanitizerCommon-asan-x86_64-Darwin :: Posix/arc4random.cpp SanitizerCommon-asan-x86_64-Darwin :: Posix/dedup_token_length_test.cpp SanitizerCommon-asan-x86_64-Darwin :: Posix/devname.cpp SanitizerCommon-asan-x86_64-Darwin :: Posix/devname_r.cpp SanitizerCommon-asan-x86_64-Darwin :: Posix/dump_instruction_bytes.cpp SanitizerCommon-asan-x86_64-Darwin :: Posix/feof_fileno_ferror.cpp SanitizerCommon-asan-x86_64-Darwin :: Posix/fgetc_ungetc_getc.cpp SanitizerCommon-asan-x86_64-Darwin :: Posix/fgetln.cpp SanitizerCommon-asan-x86_64-Darwin :: Posix/fgets.cpp SanitizerCommon-asan-x86_64-Darwin :: Posix/fpe.cpp SanitizerCommon-asan-x86_64-Darwin :: Posix/fputc_putc_putchar.cpp SanitizerCommon-asan-x86_64-Darwin :: Posix/fputs_puts.cpp SanitizerCommon-asan-x86_64-Darwin :: Posix/getc_unlocked.cpp SanitizerCommon-asan-x86_64-Darwin :: Posix/getmntinfo.cpp SanitizerCommon-asan-x86_64-Darwin :: Posix/getpass.cpp SanitizerCommon-asan-x86_64-Darwin :: Posix/getpw_getgr.cpp SanitizerCommon-asan-x86_64-Darwin :: Posix/getusershell.cpp SanitizerCommon-asan-x86_64-Darwin :: Posix/illegal_read_test.cpp SanitizerCommon-asan-x86_64-Darwin :: Posix/illegal_write_test.cpp SanitizerCommon-asan-x86_64-Darwin :: Posix/lstat.cpp SanitizerCommon-asan-x86_64-Darwin :: Posix/mmap_test.c SanitizerCommon-asan-x86_64-Darwin :: Posix/popen.cpp SanitizerCommon-asan-x86_64-Darwin :: Posix/posix_memalign-alignment.cpp SanitizerCommon-asan-x86_64-Darwin :: Posix/putc_putchar_unlocked.cpp SanitizerCommon-asan-x86_64-Darwin :: Posix/readlink.c SanitizerCommon-asan-x86_64-Darwin :: Posix/readlinkat.c SanitizerCommon-asan-x86_64-Darwin :: Posix/recursion-in-qsort.cpp SanitizerCommon-asan-x86_64-Darwin :: Posix/sanitizer_set_death_callback_test.cpp SanitizerCommon-asan-x86_64-Darwin :: Posix/sanitizer_set_report_fd_test.cpp SanitizerCommon-asan-x86_64-Darwin :: Posix/setvbuf.cpp SanitizerCommon-asan-x86_64-Darwin :: Posix/strlcat.cpp SanitizerCommon-asan-x86_64-Darwin :: Posix/strlcpy.cpp SanitizerCommon-asan-x86_64-Darwin :: Posix/sysctl.cpp SanitizerCommon-asan-x86_64-Darwin :: Posix/uname.c SanitizerCommon-asan-x86_64-Darwin :: Posix/wcsdup.c SanitizerCommon-asan-x86_64-Darwin :: Posix/weak_hook_test.cpp SanitizerCommon-asan-x86_64-Darwin :: allocator_returns_null.cpp SanitizerCommon-asan-x86_64-Darwin :: corelimit.cpp SanitizerCommon-asan-x86_64-Darwin :: ctype.c SanitizerCommon-asan-x86_64-Darwin :: fopen_nullptr.c SanitizerCommon-asan-x86_64-Darwin :: get_module_and_offset_for_pc.cpp SanitizerCommon-asan-x86_64-Darwin :: malloc_hook.cpp SanitizerCommon-asan-x86_64-Darwin :: max_allocation_size.cpp SanitizerCommon-asan-x86_64-Darwin :: onprint.cpp SanitizerCommon-asan-x86_64-Darwin :: options-help.cpp SanitizerCommon-asan-x86_64-Darwin :: options-include.cpp SanitizerCommon-asan-x86_64-Darwin :: options-invalid.cpp SanitizerCommon-asan-x86_64-Darwin :: printf-ldbl.c SanitizerCommon-asan-x86_64-Darwin :: pthread_mutexattr_get.cpp SanitizerCommon-asan-x86_64-Darwin :: sanitizer_coverage_inline8bit_counter.cpp SanitizerCommon-asan-x86_64-Darwin :: sanitizer_coverage_no_prune.cpp SanitizerCommon-asan-x86_64-Darwin :: sanitizer_coverage_stack_depth.cpp SanitizerCommon-asan-x86_64-Darwin :: sanitizer_coverage_trace_pc_guard.cpp SanitizerCommon-asan-x86_64-Darwin :: scanf-ldbl.c SanitizerCommon-asan-x86_64-Darwin :: strcasestr.c SanitizerCommon-asan-x86_64-Darwin :: strcspn.c SanitizerCommon-asan-x86_64-Darwin :: strnlen.c SanitizerCommon-asan-x86_64-Darwin :: strpbrk.c SanitizerCommon-asan-x86_64-Darwin :: strspn.c SanitizerCommon-asan-x86_64-Darwin :: strstr.c SanitizerCommon-asan-x86_64-Darwin :: symbolize_debug_argv.cpp SanitizerCommon-asan-x86_64-Darwin :: symbolize_pc.cpp SanitizerCommon-asan-x86_64-Darwin :: symbolize_stack.cpp SanitizerCommon-asan-x86_64-Darwin :: wcrtomb.c SanitizerCommon-asan-x86_64-Darwin :: wctomb.c SanitizerCommon-lsan-x86_64-Darwin :: Darwin/fputs_puts_null.cpp SanitizerCommon-lsan-x86_64-Darwin :: Darwin/malloc_zone.cpp SanitizerCommon-lsan-x86_64-Darwin :: Darwin/print-stack-trace.cpp SanitizerCommon-lsan-x86_64-Darwin :: Darwin/symbolizer-function-offset-atos.cpp SanitizerCommon-lsan-x86_64-Darwin :: Posix/access.cpp SanitizerCommon-lsan-x86_64-Darwin :: Posix/arc4random.cpp SanitizerCommon-lsan-x86_64-Darwin :: Posix/dedup_token_length_test.cpp SanitizerCommon-lsan-x86_64-Darwin :: Posix/devname.cpp SanitizerCommon-lsan-x86_64-Darwin :: Posix/devname_r.cpp SanitizerCommon-lsan-x86_64-Darwin :: Posix/dump_instruction_bytes.cpp SanitizerCommon-lsan-x86_64-Darwin :: Posix/feof_fileno_ferror.cpp SanitizerCommon-lsan-x86_64-Darwin :: Posix/fgetc_ungetc_getc.cpp SanitizerCommon-lsan-x86_64-Darwin :: Posix/fgetln.cpp SanitizerCommon-lsan-x86_64-Darwin :: Posix/fgets.cpp SanitizerCommon-lsan-x86_64-Darwin :: Posix/fpe.cpp SanitizerCommon-lsan-x86_64-Darwin :: Posix/fputc_putc_putchar.cpp SanitizerCommon-lsan-x86_64-Darwin :: Posix/fputs_puts.cpp SanitizerCommon-lsan-x86_64-Darwin :: Posix/getc_unlocked.cpp SanitizerCommon-lsan-x86_64-Darwin :: Posix/getmntinfo.cpp SanitizerCommon-lsan-x86_64-Darwin :: Posix/getpass.cpp SanitizerCommon-lsan-x86_64-Darwin :: Posix/getpw_getgr.cpp SanitizerCommon-lsan-x86_64-Darwin :: Posix/getusershell.cpp SanitizerCommon-lsan-x86_64-Darwin :: Posix/illegal_read_test.cpp SanitizerCommon-lsan-x86_64-Darwin :: Posix/illegal_write_test.cpp SanitizerCommon-lsan-x86_64-Darwin :: Posix/lstat.cpp SanitizerCommon-lsan-x86_64-Darwin :: Posix/mmap_test.c SanitizerCommon-lsan-x86_64-Darwin :: Posix/popen.cpp SanitizerCommon-lsan-x86_64-Darwin :: Posix/posix_memalign-alignment.cpp SanitizerCommon-lsan-x86_64-Darwin :: Posix/putc_putchar_unlocked.cpp SanitizerCommon-lsan-x86_64-Darwin :: Posix/readlink.c SanitizerCommon-lsan-x86_64-Darwin :: Posix/readlinkat.c SanitizerCommon-lsan-x86_64-Darwin :: Posix/recursion-in-qsort.cpp SanitizerCommon-lsan-x86_64-Darwin :: Posix/sanitizer_set_report_fd_test.cpp SanitizerCommon-lsan-x86_64-Darwin :: Posix/setvbuf.cpp SanitizerCommon-lsan-x86_64-Darwin :: Posix/strlcat.cpp SanitizerCommon-lsan-x86_64-Darwin :: Posix/strlcpy.cpp SanitizerCommon-lsan-x86_64-Darwin :: Posix/sysctl.cpp SanitizerCommon-lsan-x86_64-Darwin :: Posix/uname.c SanitizerCommon-lsan-x86_64-Darwin :: Posix/wcsdup.c SanitizerCommon-lsan-x86_64-Darwin :: allocator_returns_null.cpp SanitizerCommon-lsan-x86_64-Darwin :: ctype.c SanitizerCommon-lsan-x86_64-Darwin :: fopen_nullptr.c SanitizerCommon-lsan-x86_64-Darwin :: get_module_and_offset_for_pc.cpp SanitizerCommon-lsan-x86_64-Darwin :: malloc_hook.cpp SanitizerCommon-lsan-x86_64-Darwin :: max_allocation_size.cpp SanitizerCommon-lsan-x86_64-Darwin :: onprint.cpp SanitizerCommon-lsan-x86_64-Darwin :: options-help.cpp SanitizerCommon-lsan-x86_64-Darwin :: options-include.cpp SanitizerCommon-lsan-x86_64-Darwin :: options-invalid.cpp SanitizerCommon-lsan-x86_64-Darwin :: printf-ldbl.c SanitizerCommon-lsan-x86_64-Darwin :: pthread_mutexattr_get.cpp SanitizerCommon-lsan-x86_64-Darwin :: sanitizer_coverage_inline8bit_counter.cpp SanitizerCommon-lsan-x86_64-Darwin :: sanitizer_coverage_no_prune.cpp SanitizerCommon-lsan-x86_64-Darwin :: sanitizer_coverage_stack_depth.cpp SanitizerCommon-lsan-x86_64-Darwin :: sanitizer_coverage_trace_pc_guard.cpp SanitizerCommon-lsan-x86_64-Darwin :: scanf-ldbl.c SanitizerCommon-lsan-x86_64-Darwin :: strcasestr.c SanitizerCommon-lsan-x86_64-Darwin :: strcspn.c SanitizerCommon-lsan-x86_64-Darwin :: strnlen.c SanitizerCommon-lsan-x86_64-Darwin :: strpbrk.c SanitizerCommon-lsan-x86_64-Darwin :: strspn.c SanitizerCommon-lsan-x86_64-Darwin :: strstr.c SanitizerCommon-lsan-x86_64-Darwin :: symbolize_debug_argv.cpp SanitizerCommon-lsan-x86_64-Darwin :: symbolize_pc.cpp SanitizerCommon-lsan-x86_64-Darwin :: wcrtomb.c SanitizerCommon-lsan-x86_64-Darwin :: wctomb.c SanitizerCommon-tsan-x86_64-Darwin :: Darwin/abort_on_error.cpp SanitizerCommon-tsan-x86_64-Darwin :: Darwin/fputs_puts_null.cpp SanitizerCommon-tsan-x86_64-Darwin :: Darwin/malloc_zone.cpp SanitizerCommon-tsan-x86_64-Darwin :: Darwin/print-stack-trace-in-code-loaded-after-fork.cpp SanitizerCommon-tsan-x86_64-Darwin :: Darwin/print-stack-trace.cpp SanitizerCommon-tsan-x86_64-Darwin :: Darwin/symbolizer-function-offset-atos.cpp SanitizerCommon-tsan-x86_64-Darwin :: Darwin/symbolizer-function-offset-dladdr.cpp SanitizerCommon-tsan-x86_64-Darwin :: Posix/access.cpp SanitizerCommon-tsan-x86_64-Darwin :: Posix/arc4random.cpp SanitizerCommon-tsan-x86_64-Darwin :: Posix/dedup_token_length_test.cpp SanitizerCommon-tsan-x86_64-Darwin :: Posix/devname.cpp SanitizerCommon-tsan-x86_64-Darwin :: Posix/devname_r.cpp SanitizerCommon-tsan-x86_64-Darwin :: Posix/dump_instruction_bytes.cpp SanitizerCommon-tsan-x86_64-Darwin :: Posix/feof_fileno_ferror.cpp SanitizerCommon-tsan-x86_64-Darwin :: Posix/fgetc_ungetc_getc.cpp SanitizerCommon-tsan-x86_64-Darwin :: Posix/fgetln.cpp SanitizerCommon-tsan-x86_64-Darwin :: Posix/fgets.cpp SanitizerCommon-tsan-x86_64-Darwin :: Posix/fpe.cpp SanitizerCommon-tsan-x86_64-Darwin :: Posix/fputc_putc_putchar.cpp SanitizerCommon-tsan-x86_64-Darwin :: Posix/fputs_puts.cpp SanitizerCommon-tsan-x86_64-Darwin :: Posix/getc_unlocked.cpp SanitizerCommon-tsan-x86_64-Darwin :: Posix/getmntinfo.cpp SanitizerCommon-tsan-x86_64-Darwin :: Posix/getpass.cpp SanitizerCommon-tsan-x86_64-Darwin :: Posix/getpw_getgr.cpp SanitizerCommon-tsan-x86_64-Darwin :: Posix/getusershell.cpp SanitizerCommon-tsan-x86_64-Darwin :: Posix/illegal_read_test.cpp SanitizerCommon-tsan-x86_64-Darwin :: Posix/illegal_write_test.cpp SanitizerCommon-tsan-x86_64-Darwin :: Posix/lstat.cpp SanitizerCommon-tsan-x86_64-Darwin :: Posix/mmap_test.c SanitizerCommon-tsan-x86_64-Darwin :: Posix/popen.cpp SanitizerCommon-tsan-x86_64-Darwin :: Posix/posix_memalign-alignment.cpp SanitizerCommon-tsan-x86_64-Darwin :: Posix/putc_putchar_unlocked.cpp SanitizerCommon-tsan-x86_64-Darwin :: Posix/readlink.c SanitizerCommon-tsan-x86_64-Darwin :: Posix/readlinkat.c SanitizerCommon-tsan-x86_64-Darwin :: Posix/recursion-in-qsort.cpp SanitizerCommon-tsan-x86_64-Darwin :: Posix/sanitizer_set_death_callback_test.cpp SanitizerCommon-tsan-x86_64-Darwin :: Posix/sanitizer_set_report_fd_test.cpp SanitizerCommon-tsan-x86_64-Darwin :: Posix/setvbuf.cpp SanitizerCommon-tsan-x86_64-Darwin :: Posix/strlcat.cpp SanitizerCommon-tsan-x86_64-Darwin :: Posix/strlcpy.cpp SanitizerCommon-tsan-x86_64-Darwin :: Posix/sysctl.cpp SanitizerCommon-tsan-x86_64-Darwin :: Posix/uname.c SanitizerCommon-tsan-x86_64-Darwin :: Posix/wcsdup.c SanitizerCommon-tsan-x86_64-Darwin :: Posix/weak_hook_test.cpp SanitizerCommon-tsan-x86_64-Darwin :: allocator_returns_null.cpp SanitizerCommon-tsan-x86_64-Darwin :: corelimit.cpp SanitizerCommon-tsan-x86_64-Darwin :: ctype.c SanitizerCommon-tsan-x86_64-Darwin :: fopen_nullptr.c SanitizerCommon-tsan-x86_64-Darwin :: get_module_and_offset_for_pc.cpp SanitizerCommon-tsan-x86_64-Darwin :: malloc_hook.cpp SanitizerCommon-tsan-x86_64-Darwin :: max_allocation_size.cpp SanitizerCommon-tsan-x86_64-Darwin :: onprint.cpp SanitizerCommon-tsan-x86_64-Darwin :: options-help.cpp SanitizerCommon-tsan-x86_64-Darwin :: options-include.cpp SanitizerCommon-tsan-x86_64-Darwin :: options-invalid.cpp SanitizerCommon-tsan-x86_64-Darwin :: printf-ldbl.c SanitizerCommon-tsan-x86_64-Darwin :: pthread_mutexattr_get.cpp SanitizerCommon-tsan-x86_64-Darwin :: sanitizer_coverage_inline8bit_counter.cpp SanitizerCommon-tsan-x86_64-Darwin :: sanitizer_coverage_no_prune.cpp SanitizerCommon-tsan-x86_64-Darwin :: sanitizer_coverage_stack_depth.cpp SanitizerCommon-tsan-x86_64-Darwin :: scanf-ldbl.c SanitizerCommon-tsan-x86_64-Darwin :: strcasestr.c SanitizerCommon-tsan-x86_64-Darwin :: strcspn.c SanitizerCommon-tsan-x86_64-Darwin :: strnlen.c SanitizerCommon-tsan-x86_64-Darwin :: strpbrk.c SanitizerCommon-tsan-x86_64-Darwin :: strspn.c SanitizerCommon-tsan-x86_64-Darwin :: strstr.c SanitizerCommon-tsan-x86_64-Darwin :: symbolize_debug_argv.cpp SanitizerCommon-tsan-x86_64-Darwin :: symbolize_pc.cpp SanitizerCommon-tsan-x86_64-Darwin :: symbolize_stack.cpp SanitizerCommon-tsan-x86_64-Darwin :: wcrtomb.c SanitizerCommon-tsan-x86_64-Darwin :: wctomb.c SanitizerCommon-ubsan-x86_64-Darwin :: Darwin/abort_on_error.cpp SanitizerCommon-ubsan-x86_64-Darwin :: Darwin/fputs_puts_null.cpp SanitizerCommon-ubsan-x86_64-Darwin :: Darwin/print-stack-trace-in-code-loaded-after-fork.cpp SanitizerCommon-ubsan-x86_64-Darwin :: Darwin/print-stack-trace.cpp SanitizerCommon-ubsan-x86_64-Darwin :: Darwin/symbolizer-function-offset-atos.cpp SanitizerCommon-ubsan-x86_64-Darwin :: Darwin/symbolizer-function-offset-dladdr.cpp SanitizerCommon-ubsan-x86_64-Darwin :: Posix/access.cpp SanitizerCommon-ubsan-x86_64-Darwin :: Posix/arc4random.cpp SanitizerCommon-ubsan-x86_64-Darwin :: Posix/dedup_token_length_test.cpp SanitizerCommon-ubsan-x86_64-Darwin :: Posix/devname.cpp SanitizerCommon-ubsan-x86_64-Darwin :: Posix/devname_r.cpp SanitizerCommon-ubsan-x86_64-Darwin :: Posix/dump_instruction_bytes.cpp SanitizerCommon-ubsan-x86_64-Darwin :: Posix/feof_fileno_ferror.cpp SanitizerCommon-ubsan-x86_64-Darwin :: Posix/fgetc_ungetc_getc.cpp SanitizerCommon-ubsan-x86_64-Darwin :: Posix/fgetln.cpp SanitizerCommon-ubsan-x86_64-Darwin :: Posix/fgets.cpp SanitizerCommon-ubsan-x86_64-Darwin :: Posix/fpe.cpp SanitizerCommon-ubsan-x86_64-Darwin :: Posix/fputc_putc_putchar.cpp SanitizerCommon-ubsan-x86_64-Darwin :: Posix/fputs_puts.cpp SanitizerCommon-ubsan-x86_64-Darwin :: Posix/getc_unlocked.cpp SanitizerCommon-ubsan-x86_64-Darwin :: Posix/getmntinfo.cpp SanitizerCommon-ubsan-x86_64-Darwin :: Posix/getpass.cpp SanitizerCommon-ubsan-x86_64-Darwin :: Posix/getpw_getgr.cpp SanitizerCommon-ubsan-x86_64-Darwin :: Posix/getusershell.cpp SanitizerCommon-ubsan-x86_64-Darwin :: Posix/illegal_read_test.cpp SanitizerCommon-ubsan-x86_64-Darwin :: Posix/illegal_write_test.cpp SanitizerCommon-ubsan-x86_64-Darwin :: Posix/lstat.cpp SanitizerCommon-ubsan-x86_64-Darwin :: Posix/mmap_test.c SanitizerCommon-ubsan-x86_64-Darwin :: Posix/popen.cpp SanitizerCommon-ubsan-x86_64-Darwin :: Posix/putc_putchar_unlocked.cpp SanitizerCommon-ubsan-x86_64-Darwin :: Posix/readlink.c SanitizerCommon-ubsan-x86_64-Darwin :: Posix/readlinkat.c SanitizerCommon-ubsan-x86_64-Darwin :: Posix/recursion-in-qsort.cpp SanitizerCommon-ubsan-x86_64-Darwin :: Posix/sanitizer_set_report_fd_test.cpp SanitizerCommon-ubsan-x86_64-Darwin :: Posix/setvbuf.cpp SanitizerCommon-ubsan-x86_64-Darwin :: Posix/strlcat.cpp SanitizerCommon-ubsan-x86_64-Darwin :: Posix/strlcpy.cpp SanitizerCommon-ubsan-x86_64-Darwin :: Posix/sysctl.cpp SanitizerCommon-ubsan-x86_64-Darwin :: Posix/uname.c SanitizerCommon-ubsan-x86_64-Darwin :: Posix/wcsdup.c SanitizerCommon-ubsan-x86_64-Darwin :: ctype.c SanitizerCommon-ubsan-x86_64-Darwin :: fopen_nullptr.c SanitizerCommon-ubsan-x86_64-Darwin :: get_module_and_offset_for_pc.cpp SanitizerCommon-ubsan-x86_64-Darwin :: onprint.cpp SanitizerCommon-ubsan-x86_64-Darwin :: options-help.cpp SanitizerCommon-ubsan-x86_64-Darwin :: options-include.cpp SanitizerCommon-ubsan-x86_64-Darwin :: options-invalid.cpp SanitizerCommon-ubsan-x86_64-Darwin :: printf-ldbl.c SanitizerCommon-ubsan-x86_64-Darwin :: pthread_mutexattr_get.cpp SanitizerCommon-ubsan-x86_64-Darwin :: sanitizer_coverage_inline8bit_counter.cpp SanitizerCommon-ubsan-x86_64-Darwin :: sanitizer_coverage_stack_depth.cpp SanitizerCommon-ubsan-x86_64-Darwin :: scanf-ldbl.c SanitizerCommon-ubsan-x86_64-Darwin :: strcasestr.c SanitizerCommon-ubsan-x86_64-Darwin :: strcspn.c SanitizerCommon-ubsan-x86_64-Darwin :: strnlen.c SanitizerCommon-ubsan-x86_64-Darwin :: strpbrk.c SanitizerCommon-ubsan-x86_64-Darwin :: strspn.c SanitizerCommon-ubsan-x86_64-Darwin :: strstr.c SanitizerCommon-ubsan-x86_64-Darwin :: symbolize_debug_argv.cpp SanitizerCommon-ubsan-x86_64-Darwin :: symbolize_pc.cpp SanitizerCommon-ubsan-x86_64-Darwin :: symbolize_stack.cpp SanitizerCommon-ubsan-x86_64-Darwin :: wcrtomb.c SanitizerCommon-ubsan-x86_64-Darwin :: wctomb.c ThreadSanitizer-Unit :: rtl/./TsanRtlTest-x86_64-Test/Posix.CondBasic ThreadSanitizer-Unit :: rtl/./TsanRtlTest-x86_64-Test/Posix.ThreadLocalAccesses ThreadSanitizer-Unit :: rtl/./TsanRtlTest-x86_64-Test/Posix.ThreadSpecificDtors ThreadSanitizer-Unit :: rtl/./TsanRtlTest-x86_64-Test/ThreadSanitizer.BasicMutex ThreadSanitizer-Unit :: rtl/./TsanRtlTest-x86_64-Test/ThreadSanitizer.BasicRwMutex ThreadSanitizer-Unit :: rtl/./TsanRtlTest-x86_64-Test/ThreadSanitizer.BasicSpinMutex ThreadSanitizer-Unit :: rtl/./TsanRtlTest-x86_64-Test/ThreadSanitizer.BenignRaceOnVptr ThreadSanitizer-Unit :: rtl/./TsanRtlTest-x86_64-Test/ThreadSanitizer.FuncCall ThreadSanitizer-Unit :: rtl/./TsanRtlTest-x86_64-Test/ThreadSanitizer.HarmfulRaceOnVptr ThreadSanitizer-Unit :: rtl/./TsanRtlTest-x86_64-Test/ThreadSanitizer.LockedWriteThenRead ThreadSanitizer-Unit :: rtl/./TsanRtlTest-x86_64-Test/ThreadSanitizer.Memcpy ThreadSanitizer-Unit :: rtl/./TsanRtlTest-x86_64-Test/ThreadSanitizer.MemcpyRace1 ThreadSanitizer-Unit :: rtl/./TsanRtlTest-x86_64-Test/ThreadSanitizer.MemcpyRace2 ThreadSanitizer-Unit :: rtl/./TsanRtlTest-x86_64-Test/ThreadSanitizer.MemcpyRace3 ThreadSanitizer-Unit :: rtl/./TsanRtlTest-x86_64-Test/ThreadSanitizer.MemcpyStack ThreadSanitizer-Unit :: rtl/./TsanRtlTest-x86_64-Test/ThreadSanitizer.MemsetRace1 ThreadSanitizer-Unit :: rtl/./TsanRtlTest-x86_64-Test/ThreadSanitizer.Mutex ThreadSanitizer-Unit :: rtl/./TsanRtlTest-x86_64-Test/ThreadSanitizer.NoRaceWithOffset ThreadSanitizer-Unit :: rtl/./TsanRtlTest-x86_64-Test/ThreadSanitizer.RaceWithDeadThread ThreadSanitizer-Unit :: rtl/./TsanRtlTest-x86_64-Test/ThreadSanitizer.RaceWithOffset ThreadSanitizer-Unit :: rtl/./TsanRtlTest-x86_64-Test/ThreadSanitizer.RaceWithOffset2 ThreadSanitizer-Unit :: rtl/./TsanRtlTest-x86_64-Test/ThreadSanitizer.ReadReadNoRace ThreadSanitizer-Unit :: rtl/./TsanRtlTest-x86_64-Test/ThreadSanitizer.ReadWriteRace ThreadSanitizer-Unit :: rtl/./TsanRtlTest-x86_64-Test/ThreadSanitizer.ReportDeadThread ThreadSanitizer-Unit :: rtl/./TsanRtlTest-x86_64-Test/ThreadSanitizer.ReportRace ThreadSanitizer-Unit :: rtl/./TsanRtlTest-x86_64-Test/ThreadSanitizer.RwMutex ThreadSanitizer-Unit :: rtl/./TsanRtlTest-x86_64-Test/ThreadSanitizer.SimpleWrite ThreadSanitizer-Unit :: rtl/./TsanRtlTest-x86_64-Test/ThreadSanitizer.SimpleWriteWrite ThreadSanitizer-Unit :: rtl/./TsanRtlTest-x86_64-Test/ThreadSanitizer.SpinMutex ThreadSanitizer-Unit :: rtl/./TsanRtlTest-x86_64-Test/ThreadSanitizer.StaticMutex ThreadSanitizer-Unit :: rtl/./TsanRtlTest-x86_64-Test/ThreadSanitizer.ThreadDetach1 ThreadSanitizer-Unit :: rtl/./TsanRtlTest-x86_64-Test/ThreadSanitizer.ThreadDetach2 ThreadSanitizer-Unit :: rtl/./TsanRtlTest-x86_64-Test/ThreadSanitizer.ThreadSync ThreadSanitizer-Unit :: rtl/./TsanRtlTest-x86_64-Test/ThreadSanitizer.WriteReadRace ThreadSanitizer-Unit :: rtl/./TsanRtlTest-x86_64-Test/ThreadSanitizer.WriteThenLockedRead ThreadSanitizer-Unit :: rtl/./TsanRtlTest-x86_64-Test/ThreadSanitizer.WriteThenRead ThreadSanitizer-Unit :: rtl/./TsanRtlTest-x86_64-Test/ThreadSanitizer.WriteWriteRace ThreadSanitizer-Unit :: unit/./TsanUnitTest-x86_64-Test/Clock.AcquireRelease ThreadSanitizer-Unit :: unit/./TsanUnitTest-x86_64-Test/Clock.ChunkedBasic ThreadSanitizer-Unit :: unit/./TsanUnitTest-x86_64-Test/Clock.DifferentSizes ThreadSanitizer-Unit :: unit/./TsanUnitTest-x86_64-Test/Clock.Fuzzer ThreadSanitizer-Unit :: unit/./TsanUnitTest-x86_64-Test/Clock.Growth ThreadSanitizer-Unit :: unit/./TsanUnitTest-x86_64-Test/Clock.Growth2 ThreadSanitizer-Unit :: unit/./TsanUnitTest-x86_64-Test/Clock.Iter ThreadSanitizer-Unit :: unit/./TsanUnitTest-x86_64-Test/Clock.ManyThreads ThreadSanitizer-Unit :: unit/./TsanUnitTest-x86_64-Test/Clock.RepeatedAcquire ThreadSanitizer-Unit :: unit/./TsanUnitTest-x86_64-Test/Clock.VectorBasic ThreadSanitizer-Unit :: unit/./TsanUnitTest-x86_64-Test/Clock.releaseStoreAcquire ThreadSanitizer-Unit :: unit/./TsanUnitTest-x86_64-Test/Flags.Basic ThreadSanitizer-Unit :: unit/./TsanUnitTest-x86_64-Test/Flags.DefaultValues ThreadSanitizer-Unit :: unit/./TsanUnitTest-x86_64-Test/Flags.ParseDefaultOptions ThreadSanitizer-Unit :: unit/./TsanUnitTest-x86_64-Test/Flags.ParseEnvOptions ThreadSanitizer-Unit :: unit/./TsanUnitTest-x86_64-Test/Flags.ParsePriority ThreadSanitizer-Unit :: unit/./TsanUnitTest-x86_64-Test/MetaMap.Basic ThreadSanitizer-Unit :: unit/./TsanUnitTest-x86_64-Test/MetaMap.FreeRange ThreadSanitizer-Unit :: unit/./TsanUnitTest-x86_64-Test/MetaMap.MoveMemory ThreadSanitizer-Unit :: unit/./TsanUnitTest-x86_64-Test/MetaMap.ResetSync ThreadSanitizer-Unit :: unit/./TsanUnitTest-x86_64-Test/MetaMap.Sync ThreadSanitizer-Unit :: unit/./TsanUnitTest-x86_64-Test/Mman.AlignedAlloc ThreadSanitizer-Unit :: unit/./TsanUnitTest-x86_64-Test/Mman.Internal ThreadSanitizer-Unit :: unit/./TsanUnitTest-x86_64-Test/Mman.Memalign ThreadSanitizer-Unit :: unit/./TsanUnitTest-x86_64-Test/Mman.PosixMemalign ThreadSanitizer-Unit :: unit/./TsanUnitTest-x86_64-Test/Mman.Stats ThreadSanitizer-Unit :: unit/./TsanUnitTest-x86_64-Test/Mman.UsableSize ThreadSanitizer-Unit :: unit/./TsanUnitTest-x86_64-Test/Mman.User ThreadSanitizer-Unit :: unit/./TsanUnitTest-x86_64-Test/Mman.UserRealloc ThreadSanitizer-Unit :: unit/./TsanUnitTest-x86_64-Test/Mman.Valloc ThreadSanitizer-Unit :: unit/./TsanUnitTest-x86_64-Test/Mutex.ReadWrite ThreadSanitizer-Unit :: unit/./TsanUnitTest-x86_64-Test/Mutex.SpinWrite ThreadSanitizer-Unit :: unit/./TsanUnitTest-x86_64-Test/Mutex.Write ThreadSanitizer-Unit :: unit/./TsanUnitTest-x86_64-Test/Shadow.Celling ThreadSanitizer-Unit :: unit/./TsanUnitTest-x86_64-Test/Shadow.FastState ThreadSanitizer-Unit :: unit/./TsanUnitTest-x86_64-Test/Shadow.Mapping ThreadSanitizer-Unit :: unit/./TsanUnitTest-x86_64-Test/StackTrace.BasicBuffered ThreadSanitizer-Unit :: unit/./TsanUnitTest-x86_64-Test/StackTrace.BasicVarSize ThreadSanitizer-Unit :: unit/./TsanUnitTest-x86_64-Test/StackTrace.TrimBuffered ThreadSanitizer-Unit :: unit/./TsanUnitTest-x86_64-Test/StackTrace.TrimVarSize ThreadSanitizer-x86_64 :: Darwin/deadlock.mm ThreadSanitizer-x86_64 :: Darwin/debug_external.cpp ThreadSanitizer-x86_64 :: Darwin/dlopen.cpp ThreadSanitizer-x86_64 :: Darwin/external-dups.cpp ThreadSanitizer-x86_64 :: Darwin/external-ignore-noninstrumented.cpp ThreadSanitizer-x86_64 :: Darwin/external-swift-debugging.cpp ThreadSanitizer-x86_64 :: Darwin/external-swift.cpp ThreadSanitizer-x86_64 :: Darwin/external.cpp ThreadSanitizer-x86_64 :: Darwin/gcd-sync-block-copy.mm ThreadSanitizer-x86_64 :: Darwin/ignore-noninstrumented.mm ThreadSanitizer-x86_64 :: Darwin/libcxx-call-once.mm ThreadSanitizer-x86_64 :: Darwin/libcxx-future.mm ThreadSanitizer-x86_64 :: Darwin/libcxx-shared-ptr-recursive.mm ThreadSanitizer-x86_64 :: Darwin/libcxx-shared-ptr-stress.mm ThreadSanitizer-x86_64 :: Darwin/libcxx-shared-ptr.mm ThreadSanitizer-x86_64 :: Darwin/mach_vm_allocate.c ThreadSanitizer-x86_64 :: Darwin/main_tid.mm ThreadSanitizer-x86_64 :: Darwin/malloc-stack-logging.cpp ThreadSanitizer-x86_64 :: Darwin/malloc_size.mm ThreadSanitizer-x86_64 :: Darwin/no_call_setenv_in_symbolize.cpp ThreadSanitizer-x86_64 :: Darwin/norace-objcxx-run-time.mm ThreadSanitizer-x86_64 :: Darwin/objc-double-property.mm ThreadSanitizer-x86_64 :: Darwin/objc-race.mm ThreadSanitizer-x86_64 :: Darwin/objc-simple.mm ThreadSanitizer-x86_64 :: Darwin/objc-synchronize-cycle-tagged.mm ThreadSanitizer-x86_64 :: Darwin/objc-synchronize-cycle.mm ThreadSanitizer-x86_64 :: Darwin/objc-synchronize-nested-recursive.mm ThreadSanitizer-x86_64 :: Darwin/objc-synchronize-tagged.mm ThreadSanitizer-x86_64 :: Darwin/objc-synchronize.mm ThreadSanitizer-x86_64 :: Darwin/os_unfair_lock.c ThreadSanitizer-x86_64 :: Darwin/osatomics-add.mm ThreadSanitizer-x86_64 :: Darwin/osatomics-bitops.mm ThreadSanitizer-x86_64 :: Darwin/osatomics-list.mm ThreadSanitizer-x86_64 :: Darwin/osspinlock-norace.cpp ThreadSanitizer-x86_64 :: Darwin/realloc-zero.cpp ThreadSanitizer-x86_64 :: Darwin/signals-blocked.cpp ThreadSanitizer-x86_64 :: Darwin/symbolizer-atos.cpp ThreadSanitizer-x86_64 :: Darwin/symbolizer-dladdr.cpp ThreadSanitizer-x86_64 :: Darwin/variadic-open.cpp ThreadSanitizer-x86_64 :: Darwin/workerthreads.mm ThreadSanitizer-x86_64 :: Darwin/xpc-cancel.mm ThreadSanitizer-x86_64 :: Darwin/xpc-race.mm ThreadSanitizer-x86_64 :: Darwin/xpc.mm ThreadSanitizer-x86_64 :: aligned_vs_unaligned_race.cpp ThreadSanitizer-x86_64 :: annotate_happens_before.cpp ThreadSanitizer-x86_64 :: atexit.cpp ThreadSanitizer-x86_64 :: atexit2.cpp ThreadSanitizer-x86_64 :: atexit3.cpp ThreadSanitizer-x86_64 :: atomic_free.cpp ThreadSanitizer-x86_64 :: atomic_free2.cpp ThreadSanitizer-x86_64 :: atomic_free3.cpp ThreadSanitizer-x86_64 :: atomic_hle.cpp ThreadSanitizer-x86_64 :: atomic_norace.cpp ThreadSanitizer-x86_64 :: atomic_race.cpp ThreadSanitizer-x86_64 :: atomic_stack.cpp ThreadSanitizer-x86_64 :: atomic_store.cpp ThreadSanitizer-x86_64 :: bench_shadow_flush.cpp ThreadSanitizer-x86_64 :: benign_race.cpp ThreadSanitizer-x86_64 :: blacklist.cpp ThreadSanitizer-x86_64 :: blacklist2.cpp ThreadSanitizer-x86_64 :: cond.c ThreadSanitizer-x86_64 :: cond_cancel.c ThreadSanitizer-x86_64 :: cond_destruction.cpp ThreadSanitizer-x86_64 :: cond_race.cpp ThreadSanitizer-x86_64 :: custom_mutex0.cpp ThreadSanitizer-x86_64 :: custom_mutex1.cpp ThreadSanitizer-x86_64 :: custom_mutex2.cpp ThreadSanitizer-x86_64 :: custom_mutex3.cpp ThreadSanitizer-x86_64 :: custom_mutex4.cpp ThreadSanitizer-x86_64 :: custom_mutex5.cpp ThreadSanitizer-x86_64 :: cxa_guard_acquire.cpp ThreadSanitizer-x86_64 :: deadlock_detector_stress_test.cpp ThreadSanitizer-x86_64 :: debug_locate.cpp ThreadSanitizer-x86_64 :: debugging.cpp ThreadSanitizer-x86_64 :: deep_stack1.cpp ThreadSanitizer-x86_64 :: default_options.cpp ThreadSanitizer-x86_64 :: dlclose.cpp ThreadSanitizer-x86_64 :: dtls.c ThreadSanitizer-x86_64 :: exceptions.cpp ThreadSanitizer-x86_64 :: fd_close_norace.cpp ThreadSanitizer-x86_64 :: fd_close_norace2.cpp ThreadSanitizer-x86_64 :: fd_dup_norace.cpp ThreadSanitizer-x86_64 :: fd_dup_norace2.cpp ThreadSanitizer-x86_64 :: fd_dup_race.cpp ThreadSanitizer-x86_64 :: fd_location.cpp ThreadSanitizer-x86_64 :: fd_pipe_norace.cpp ThreadSanitizer-x86_64 :: fd_pipe_race.cpp ThreadSanitizer-x86_64 :: fd_socket_connect_norace.cpp ThreadSanitizer-x86_64 :: fd_socket_norace.cpp ThreadSanitizer-x86_64 :: fd_socketpair_norace.cpp ThreadSanitizer-x86_64 :: fd_stdout_race.cpp ThreadSanitizer-x86_64 :: fd_tid_recycled.cpp ThreadSanitizer-x86_64 :: fiber_asm.cpp ThreadSanitizer-x86_64 :: fiber_from_thread.cpp ThreadSanitizer-x86_64 :: fiber_longjmp.cpp ThreadSanitizer-x86_64 :: fiber_race.cpp ThreadSanitizer-x86_64 :: fiber_simple.cpp ThreadSanitizer-x86_64 :: fiber_two_threads.cpp ThreadSanitizer-x86_64 :: fork_atexit.cpp ThreadSanitizer-x86_64 :: fork_deadlock.cpp ThreadSanitizer-x86_64 :: fork_multithreaded.cpp ThreadSanitizer-x86_64 :: fork_multithreaded3.cpp ThreadSanitizer-x86_64 :: free_race.c ThreadSanitizer-x86_64 :: free_race2.c ThreadSanitizer-x86_64 :: getline_nohang.cpp ThreadSanitizer-x86_64 :: global_race.cpp ThreadSanitizer-x86_64 :: global_race2.cpp ThreadSanitizer-x86_64 :: global_race3.cpp ThreadSanitizer-x86_64 :: halt_on_error.cpp ThreadSanitizer-x86_64 :: heap_race.cpp ThreadSanitizer-x86_64 :: ignore_free.cpp ThreadSanitizer-x86_64 :: ignore_lib0.cpp ThreadSanitizer-x86_64 :: ignore_lib1.cpp ThreadSanitizer-x86_64 :: ignore_lib2.cpp ThreadSanitizer-x86_64 :: ignore_lib3.cpp ThreadSanitizer-x86_64 :: ignore_lib4.cpp ThreadSanitizer-x86_64 :: ignore_lib5.cpp ThreadSanitizer-x86_64 :: ignore_lib6.cpp ThreadSanitizer-x86_64 :: ignore_malloc.cpp ThreadSanitizer-x86_64 :: ignore_race.cpp ThreadSanitizer-x86_64 :: ignore_sync.cpp ThreadSanitizer-x86_64 :: ignored-interceptors-mmap.cpp ThreadSanitizer-x86_64 :: inlined_memcpy_race.cpp ThreadSanitizer-x86_64 :: inlined_memcpy_race2.cpp ThreadSanitizer-x86_64 :: interface_atomic_test.c ThreadSanitizer-x86_64 :: java_alloc.cpp ThreadSanitizer-x86_64 :: java_finalizer.cpp ThreadSanitizer-x86_64 :: java_find.cpp ThreadSanitizer-x86_64 :: java_heap_init.cpp ThreadSanitizer-x86_64 :: java_lock.cpp ThreadSanitizer-x86_64 :: java_lock_move.cpp ThreadSanitizer-x86_64 :: java_lock_rec.cpp ThreadSanitizer-x86_64 :: java_lock_rec_race.cpp ThreadSanitizer-x86_64 :: java_move_overlap.cpp ThreadSanitizer-x86_64 :: java_move_overlap_race.cpp ThreadSanitizer-x86_64 :: java_race.cpp ThreadSanitizer-x86_64 :: java_race_move.cpp ThreadSanitizer-x86_64 :: java_race_pc.cpp ThreadSanitizer-x86_64 :: java_rwlock.cpp ThreadSanitizer-x86_64 :: java_symbolization.cpp ThreadSanitizer-x86_64 :: java_symbolization_legacy.cpp ThreadSanitizer-x86_64 :: java_volatile.cpp ThreadSanitizer-x86_64 :: large_malloc_meta.cpp ThreadSanitizer-x86_64 :: libcxx/std_shared_ptr.cpp ThreadSanitizer-x86_64 :: libdispatch/after.c ThreadSanitizer-x86_64 :: libdispatch/apply-race.c ThreadSanitizer-x86_64 :: libdispatch/apply.c ThreadSanitizer-x86_64 :: libdispatch/async-norace.c ThreadSanitizer-x86_64 :: libdispatch/async-race.c ThreadSanitizer-x86_64 :: libdispatch/barrier-race.c ThreadSanitizer-x86_64 :: libdispatch/barrier.c ThreadSanitizer-x86_64 :: libdispatch/blocks.c ThreadSanitizer-x86_64 :: libdispatch/data.c ThreadSanitizer-x86_64 :: libdispatch/dispatch_main.c ThreadSanitizer-x86_64 :: libdispatch/dispatch_once_deadlock.c ThreadSanitizer-x86_64 :: libdispatch/fd.c ThreadSanitizer-x86_64 :: libdispatch/groups-destructor.cpp ThreadSanitizer-x86_64 :: libdispatch/groups-leave.c ThreadSanitizer-x86_64 :: libdispatch/groups-norace.c ThreadSanitizer-x86_64 :: libdispatch/groups-stress.c ThreadSanitizer-x86_64 :: libdispatch/io-barrier-race.c ThreadSanitizer-x86_64 :: libdispatch/io-barrier.c ThreadSanitizer-x86_64 :: libdispatch/io-cleanup.c ThreadSanitizer-x86_64 :: libdispatch/io-race.c ThreadSanitizer-x86_64 :: libdispatch/io.c ThreadSanitizer-x86_64 :: libdispatch/once.c ThreadSanitizer-x86_64 :: libdispatch/semaphore-norace.c ThreadSanitizer-x86_64 :: libdispatch/serial-queue-norace.c ThreadSanitizer-x86_64 :: libdispatch/source-cancel.c ThreadSanitizer-x86_64 :: libdispatch/source-cancel2.c ThreadSanitizer-x86_64 :: libdispatch/source-event.c ThreadSanitizer-x86_64 :: libdispatch/source-event2.c ThreadSanitizer-x86_64 :: libdispatch/source-registration.c ThreadSanitizer-x86_64 :: libdispatch/source-registration2.c ThreadSanitizer-x86_64 :: libdispatch/source-serial.c ThreadSanitizer-x86_64 :: libdispatch/suspend.c ThreadSanitizer-x86_64 :: libdispatch/sync-block-copy.cpp ThreadSanitizer-x86_64 :: libdispatch/sync-norace.c ThreadSanitizer-x86_64 :: libdispatch/sync-race.c ThreadSanitizer-x86_64 :: libdispatch/target-queue-norace.c ThreadSanitizer-x86_64 :: load_shared_lib.cpp ThreadSanitizer-x86_64 :: longjmp.cpp ThreadSanitizer-x86_64 :: longjmp2.cpp ThreadSanitizer-x86_64 :: longjmp3.cpp ThreadSanitizer-x86_64 :: longjmp4.cpp ThreadSanitizer-x86_64 :: lots_of_threads.c ThreadSanitizer-x86_64 :: malloc_overflow.cpp ThreadSanitizer-x86_64 :: malloc_stack.cpp ThreadSanitizer-x86_64 :: memcmp_race.cpp ThreadSanitizer-x86_64 :: memcpy_race.cpp ThreadSanitizer-x86_64 :: mmap_large.cpp ThreadSanitizer-x86_64 :: mmap_stress.cpp ThreadSanitizer-x86_64 :: mop1.c ThreadSanitizer-x86_64 :: mop_with_offset.cpp ThreadSanitizer-x86_64 :: mop_with_offset2.cpp ThreadSanitizer-x86_64 :: mutex_annotations.cpp ThreadSanitizer-x86_64 :: mutex_bad_read_lock.cpp ThreadSanitizer-x86_64 :: mutex_bad_read_unlock.cpp ThreadSanitizer-x86_64 :: mutex_bad_unlock.cpp ThreadSanitizer-x86_64 :: mutex_cycle2.c ThreadSanitizer-x86_64 :: mutex_cycle_long.c ThreadSanitizer-x86_64 :: mutex_destroy_locked.cpp ThreadSanitizer-x86_64 :: mutex_destroy_locked2.cpp ThreadSanitizer-x86_64 :: mutex_double_lock.cpp ThreadSanitizer-x86_64 :: mutex_lock_destroyed.cpp ThreadSanitizer-x86_64 :: mutexset1.cpp ThreadSanitizer-x86_64 :: mutexset2.cpp ThreadSanitizer-x86_64 :: mutexset3.cpp ThreadSanitizer-x86_64 :: mutexset4.cpp ThreadSanitizer-x86_64 :: mutexset5.cpp ThreadSanitizer-x86_64 :: mutexset6.cpp ThreadSanitizer-x86_64 :: mutexset7.cpp ThreadSanitizer-x86_64 :: mutexset8.cpp ThreadSanitizer-x86_64 :: pie_test.cpp ThreadSanitizer-x86_64 :: printf-1.c ThreadSanitizer-x86_64 :: pthread_atfork_deadlock.c ThreadSanitizer-x86_64 :: pthread_atfork_deadlock2.c ThreadSanitizer-x86_64 :: pthread_key.cpp ThreadSanitizer-x86_64 :: race_on_fputs.cpp ThreadSanitizer-x86_64 :: race_on_heap.cpp ThreadSanitizer-x86_64 :: race_on_mutex.c ThreadSanitizer-x86_64 :: race_on_mutex2.c ThreadSanitizer-x86_64 :: race_on_puts.cpp ThreadSanitizer-x86_64 :: race_on_read.cpp ThreadSanitizer-x86_64 :: race_on_speculative_load.cpp ThreadSanitizer-x86_64 :: race_on_write.cpp ThreadSanitizer-x86_64 :: race_range_pc.cpp ThreadSanitizer-x86_64 :: race_stress.cpp ThreadSanitizer-x86_64 :: race_top_suppression.cpp ThreadSanitizer-x86_64 :: race_top_suppression1.cpp ThreadSanitizer-x86_64 :: race_with_finished_thread.cpp ThreadSanitizer-x86_64 :: real_deadlock_detector_stress_test.cpp ThreadSanitizer-x86_64 :: restore_stack.cpp ThreadSanitizer-x86_64 :: setuid.c ThreadSanitizer-x86_64 :: setuid2.c ThreadSanitizer-x86_64 :: signal_block.cpp ThreadSanitizer-x86_64 :: signal_cond.cpp ThreadSanitizer-x86_64 :: signal_errno.cpp ThreadSanitizer-x86_64 :: signal_longjmp.cpp ThreadSanitizer-x86_64 :: signal_malloc.cpp ThreadSanitizer-x86_64 :: signal_pause.cpp ThreadSanitizer-x86_64 :: signal_write.cpp ThreadSanitizer-x86_64 :: sigsuspend.cpp ThreadSanitizer-x86_64 :: simple_race.c ThreadSanitizer-x86_64 :: simple_race.cpp ThreadSanitizer-x86_64 :: simple_stack.c ThreadSanitizer-x86_64 :: simple_stack2.cpp ThreadSanitizer-x86_64 :: sleep_sync.cpp ThreadSanitizer-x86_64 :: sleep_sync2.cpp ThreadSanitizer-x86_64 :: stack_race.cpp ThreadSanitizer-x86_64 :: stack_race2.cpp ThreadSanitizer-x86_64 :: stack_sync_reuse.cpp ThreadSanitizer-x86_64 :: static_init1.cpp ThreadSanitizer-x86_64 :: static_init2.cpp ThreadSanitizer-x86_64 :: static_init3.cpp ThreadSanitizer-x86_64 :: static_init4.cpp ThreadSanitizer-x86_64 :: static_init5.cpp ThreadSanitizer-x86_64 :: static_init6.cpp ThreadSanitizer-x86_64 :: suppress_same_address.cpp ThreadSanitizer-x86_64 :: suppress_same_stacks.cpp ThreadSanitizer-x86_64 :: suppressions_global.cpp ThreadSanitizer-x86_64 :: suppressions_mutex.cpp ThreadSanitizer-x86_64 :: suppressions_race.cpp ThreadSanitizer-x86_64 :: suppressions_race2.cpp ThreadSanitizer-x86_64 :: thread_detach.c ThreadSanitizer-x86_64 :: thread_detach2.c ThreadSanitizer-x86_64 :: thread_end_with_ignore.cpp ThreadSanitizer-x86_64 :: thread_end_with_ignore2.cpp ThreadSanitizer-x86_64 :: thread_end_with_ignore3.cpp ThreadSanitizer-x86_64 :: thread_exit.c ThreadSanitizer-x86_64 :: thread_leak.c ThreadSanitizer-x86_64 :: thread_leak2.c ThreadSanitizer-x86_64 :: thread_leak3.c ThreadSanitizer-x86_64 :: thread_leak4.c ThreadSanitizer-x86_64 :: thread_leak5.c ThreadSanitizer-x86_64 :: thread_name.cpp ThreadSanitizer-x86_64 :: tiny_race.c ThreadSanitizer-x86_64 :: tls_race.cpp ThreadSanitizer-x86_64 :: tls_race2.cpp ThreadSanitizer-x86_64 :: tsan-vs-gvn.cpp ThreadSanitizer-x86_64 :: unaligned_norace.cpp ThreadSanitizer-x86_64 :: unaligned_race.cpp ThreadSanitizer-x86_64 :: vfork.cpp ThreadSanitizer-x86_64 :: virtual_inheritance_compile_bug.cpp ThreadSanitizer-x86_64 :: vptr_benign_race.cpp ThreadSanitizer-x86_64 :: vptr_harmful_race.cpp ThreadSanitizer-x86_64 :: vptr_harmful_race2.cpp ThreadSanitizer-x86_64 :: vptr_harmful_race3.cpp ThreadSanitizer-x86_64 :: vptr_harmful_race4.cpp ThreadSanitizer-x86_64 :: write_in_reader_lock.cpp UBSan-AddressSanitizer-x86_64 :: TestCases/Float/cast-overflow.cpp UBSan-AddressSanitizer-x86_64 :: TestCases/ImplicitConversion/integer-arithmetic-value-change.c UBSan-AddressSanitizer-x86_64 :: TestCases/ImplicitConversion/integer-conversion-incdec.c UBSan-AddressSanitizer-x86_64 :: TestCases/ImplicitConversion/integer-conversion.c UBSan-AddressSanitizer-x86_64 :: TestCases/ImplicitConversion/integer-sign-change-blacklist.c UBSan-AddressSanitizer-x86_64 :: TestCases/ImplicitConversion/integer-sign-change-incdec.c UBSan-AddressSanitizer-x86_64 :: TestCases/ImplicitConversion/integer-sign-change-summary.cpp UBSan-AddressSanitizer-x86_64 :: TestCases/ImplicitConversion/integer-sign-change.c UBSan-AddressSanitizer-x86_64 :: TestCases/ImplicitConversion/integer-truncation.c UBSan-AddressSanitizer-x86_64 :: TestCases/ImplicitConversion/signed-integer-truncation-blacklist.c UBSan-AddressSanitizer-x86_64 :: TestCases/ImplicitConversion/signed-integer-truncation-incdec.c UBSan-AddressSanitizer-x86_64 :: TestCases/ImplicitConversion/signed-integer-truncation-or-sign-change-blacklist.c UBSan-AddressSanitizer-x86_64 :: TestCases/ImplicitConversion/signed-integer-truncation-or-sign-change-summary.cpp UBSan-AddressSanitizer-x86_64 :: TestCases/ImplicitConversion/signed-integer-truncation-summary.cpp UBSan-AddressSanitizer-x86_64 :: TestCases/ImplicitConversion/signed-integer-truncation.c UBSan-AddressSanitizer-x86_64 :: TestCases/ImplicitConversion/unsigned-integer-truncation-blacklist.c UBSan-AddressSanitizer-x86_64 :: TestCases/ImplicitConversion/unsigned-integer-truncation-summary.cpp UBSan-AddressSanitizer-x86_64 :: TestCases/ImplicitConversion/unsigned-integer-truncation.c UBSan-AddressSanitizer-x86_64 :: TestCases/Integer/add-overflow.cpp UBSan-AddressSanitizer-x86_64 :: TestCases/Integer/div-overflow.cpp UBSan-AddressSanitizer-x86_64 :: TestCases/Integer/div-zero.cpp UBSan-AddressSanitizer-x86_64 :: TestCases/Integer/incdec-overflow.cpp UBSan-AddressSanitizer-x86_64 :: TestCases/Integer/mul-overflow.cpp UBSan-AddressSanitizer-x86_64 :: TestCases/Integer/negate-overflow.cpp UBSan-AddressSanitizer-x86_64 :: TestCases/Integer/no-recover.cpp UBSan-AddressSanitizer-x86_64 :: TestCases/Integer/shift.cpp UBSan-AddressSanitizer-x86_64 :: TestCases/Integer/sub-overflow.cpp UBSan-AddressSanitizer-x86_64 :: TestCases/Integer/summary.cpp UBSan-AddressSanitizer-x86_64 :: TestCases/Integer/suppressions.cpp UBSan-AddressSanitizer-x86_64 :: TestCases/Integer/uadd-overflow.cpp UBSan-AddressSanitizer-x86_64 :: TestCases/Integer/uincdec-overflow.cpp UBSan-AddressSanitizer-x86_64 :: TestCases/Integer/umul-overflow.cpp UBSan-AddressSanitizer-x86_64 :: TestCases/Integer/usub-overflow.cpp UBSan-AddressSanitizer-x86_64 :: TestCases/Misc/bool.cpp UBSan-AddressSanitizer-x86_64 :: TestCases/Misc/bool.m UBSan-AddressSanitizer-x86_64 :: TestCases/Misc/bounds.cpp UBSan-AddressSanitizer-x86_64 :: TestCases/Misc/builtins.cpp UBSan-AddressSanitizer-x86_64 :: TestCases/Misc/coverage-levels.cpp UBSan-AddressSanitizer-x86_64 :: TestCases/Misc/deduplication.cpp UBSan-AddressSanitizer-x86_64 :: TestCases/Misc/enum.cpp UBSan-AddressSanitizer-x86_64 :: TestCases/Misc/log-path_test.cpp UBSan-AddressSanitizer-x86_64 :: TestCases/Misc/missing_return.cpp UBSan-AddressSanitizer-x86_64 :: TestCases/Misc/monitor.cpp UBSan-AddressSanitizer-x86_64 :: TestCases/Misc/nonnull-arg.cpp UBSan-AddressSanitizer-x86_64 :: TestCases/Misc/nonnull.cpp UBSan-AddressSanitizer-x86_64 :: TestCases/Misc/nullability.c UBSan-AddressSanitizer-x86_64 :: TestCases/Misc/objc-cast.m UBSan-AddressSanitizer-x86_64 :: TestCases/Misc/print_summary.c UBSan-AddressSanitizer-x86_64 :: TestCases/Misc/unreachable.cpp UBSan-AddressSanitizer-x86_64 :: TestCases/Misc/vla.c UBSan-AddressSanitizer-x86_64 :: TestCases/Pointer/alignment-assumption-attribute-align_value-on-lvalue.cpp UBSan-AddressSanitizer-x86_64 :: TestCases/Pointer/alignment-assumption-attribute-align_value-on-paramvar.cpp UBSan-AddressSanitizer-x86_64 :: TestCases/Pointer/alignment-assumption-attribute-alloc_align-on-function-variable.cpp UBSan-AddressSanitizer-x86_64 :: TestCases/Pointer/alignment-assumption-attribute-alloc_align-on-function.cpp UBSan-AddressSanitizer-x86_64 :: TestCases/Pointer/alignment-assumption-attribute-assume_aligned-on-function-two-params.cpp UBSan-AddressSanitizer-x86_64 :: TestCases/Pointer/alignment-assumption-attribute-assume_aligned-on-function.cpp UBSan-AddressSanitizer-x86_64 :: TestCases/Pointer/alignment-assumption-blacklist.cpp UBSan-AddressSanitizer-x86_64 :: TestCases/Pointer/alignment-assumption-builtin_assume_aligned-three-params-variable.cpp UBSan-AddressSanitizer-x86_64 :: TestCases/Pointer/alignment-assumption-builtin_assume_aligned-three-params.cpp UBSan-AddressSanitizer-x86_64 :: TestCases/Pointer/alignment-assumption-builtin_assume_aligned-two-params.cpp UBSan-AddressSanitizer-x86_64 :: TestCases/Pointer/alignment-assumption-openmp.cpp UBSan-AddressSanitizer-x86_64 :: TestCases/Pointer/alignment-assumption-summary.cpp UBSan-AddressSanitizer-x86_64 :: TestCases/Pointer/index-overflow.cpp UBSan-AddressSanitizer-x86_64 :: TestCases/Pointer/nullptr-and-nonzero-offset-constants.cpp UBSan-AddressSanitizer-x86_64 :: TestCases/Pointer/nullptr-and-nonzero-offset-summary.cpp UBSan-AddressSanitizer-x86_64 :: TestCases/Pointer/nullptr-and-nonzero-offset-variable.cpp UBSan-AddressSanitizer-x86_64 :: TestCases/Pointer/unsigned-index-expression.cpp UBSan-AddressSanitizer-x86_64 :: TestCases/TypeCheck/Function/function.cpp UBSan-AddressSanitizer-x86_64 :: TestCases/TypeCheck/PR33221.cpp UBSan-AddressSanitizer-x86_64 :: TestCases/TypeCheck/misaligned.cpp UBSan-AddressSanitizer-x86_64 :: TestCases/TypeCheck/null.cpp UBSan-AddressSanitizer-x86_64 :: TestCases/TypeCheck/vptr-corrupted-vtable-itanium.cpp UBSan-AddressSanitizer-x86_64 :: TestCases/TypeCheck/vptr-non-unique-typeinfo.cpp UBSan-AddressSanitizer-x86_64 :: TestCases/TypeCheck/vptr-virtual-base-construction.cpp UBSan-AddressSanitizer-x86_64 :: TestCases/TypeCheck/vptr-virtual-base.cpp UBSan-AddressSanitizer-x86_64 :: TestCases/TypeCheck/vptr.cpp UBSan-Minimal-x86_64 :: TestCases/alignment-assumption.c UBSan-Minimal-x86_64 :: TestCases/implicit-integer-sign-change.c UBSan-Minimal-x86_64 :: TestCases/implicit-signed-integer-truncation-or-sign-change.c UBSan-Minimal-x86_64 :: TestCases/implicit-signed-integer-truncation.c UBSan-Minimal-x86_64 :: TestCases/implicit-unsigned-integer-truncation.c UBSan-Minimal-x86_64 :: TestCases/nullptr-and-nonzero-offset.c UBSan-Minimal-x86_64 :: TestCases/recover-dedup-limit.cpp UBSan-Minimal-x86_64 :: TestCases/recover-dedup.cpp UBSan-Minimal-x86_64 :: TestCases/test-darwin-interface.c UBSan-Minimal-x86_64 :: TestCases/uadd-overflow.cpp UBSan-Standalone-x86_64 :: TestCases/Float/cast-overflow.cpp UBSan-Standalone-x86_64 :: TestCases/ImplicitConversion/integer-arithmetic-value-change.c UBSan-Standalone-x86_64 :: TestCases/ImplicitConversion/integer-conversion-incdec.c UBSan-Standalone-x86_64 :: TestCases/ImplicitConversion/integer-conversion.c UBSan-Standalone-x86_64 :: TestCases/ImplicitConversion/integer-sign-change-blacklist.c UBSan-Standalone-x86_64 :: TestCases/ImplicitConversion/integer-sign-change-incdec.c UBSan-Standalone-x86_64 :: TestCases/ImplicitConversion/integer-sign-change.c UBSan-Standalone-x86_64 :: TestCases/ImplicitConversion/integer-truncation.c UBSan-Standalone-x86_64 :: TestCases/ImplicitConversion/signed-integer-truncation-blacklist.c UBSan-Standalone-x86_64 :: TestCases/ImplicitConversion/signed-integer-truncation-incdec.c UBSan-Standalone-x86_64 :: TestCases/ImplicitConversion/signed-integer-truncation-or-sign-change-blacklist.c UBSan-Standalone-x86_64 :: TestCases/ImplicitConversion/signed-integer-truncation.c UBSan-Standalone-x86_64 :: TestCases/ImplicitConversion/unsigned-integer-truncation-blacklist.c UBSan-Standalone-x86_64 :: TestCases/ImplicitConversion/unsigned-integer-truncation.c UBSan-Standalone-x86_64 :: TestCases/Integer/add-overflow.cpp UBSan-Standalone-x86_64 :: TestCases/Integer/div-overflow.cpp UBSan-Standalone-x86_64 :: TestCases/Integer/div-zero.cpp UBSan-Standalone-x86_64 :: TestCases/Integer/incdec-overflow.cpp UBSan-Standalone-x86_64 :: TestCases/Integer/mul-overflow.cpp UBSan-Standalone-x86_64 :: TestCases/Integer/negate-overflow.cpp UBSan-Standalone-x86_64 :: TestCases/Integer/no-recover.cpp UBSan-Standalone-x86_64 :: TestCases/Integer/shift.cpp UBSan-Standalone-x86_64 :: TestCases/Integer/sub-overflow.cpp UBSan-Standalone-x86_64 :: TestCases/Integer/suppressions.cpp UBSan-Standalone-x86_64 :: TestCases/Integer/uadd-overflow.cpp UBSan-Standalone-x86_64 :: TestCases/Integer/uincdec-overflow.cpp UBSan-Standalone-x86_64 :: TestCases/Integer/umul-overflow.cpp UBSan-Standalone-x86_64 :: TestCases/Integer/usub-overflow.cpp UBSan-Standalone-x86_64 :: TestCases/Misc/bool.cpp UBSan-Standalone-x86_64 :: TestCases/Misc/bool.m UBSan-Standalone-x86_64 :: TestCases/Misc/bounds.cpp UBSan-Standalone-x86_64 :: TestCases/Misc/builtins.cpp UBSan-Standalone-x86_64 :: TestCases/Misc/coverage-levels.cpp UBSan-Standalone-x86_64 :: TestCases/Misc/deduplication.cpp UBSan-Standalone-x86_64 :: TestCases/Misc/enum.cpp UBSan-Standalone-x86_64 :: TestCases/Misc/log-path_test.cpp UBSan-Standalone-x86_64 :: TestCases/Misc/missing_return.cpp UBSan-Standalone-x86_64 :: TestCases/Misc/monitor.cpp UBSan-Standalone-x86_64 :: TestCases/Misc/nonnull-arg.cpp UBSan-Standalone-x86_64 :: TestCases/Misc/nonnull.cpp UBSan-Standalone-x86_64 :: TestCases/Misc/nullability.c UBSan-Standalone-x86_64 :: TestCases/Misc/objc-cast.m UBSan-Standalone-x86_64 :: TestCases/Misc/print_summary.c UBSan-Standalone-x86_64 :: TestCases/Misc/unreachable.cpp UBSan-Standalone-x86_64 :: TestCases/Misc/vla.c UBSan-Standalone-x86_64 :: TestCases/Pointer/alignment-assumption-attribute-align_value-on-lvalue.cpp UBSan-Standalone-x86_64 :: TestCases/Pointer/alignment-assumption-attribute-align_value-on-paramvar.cpp UBSan-Standalone-x86_64 :: TestCases/Pointer/alignment-assumption-attribute-alloc_align-on-function-variable.cpp UBSan-Standalone-x86_64 :: TestCases/Pointer/alignment-assumption-attribute-alloc_align-on-function.cpp UBSan-Standalone-x86_64 :: TestCases/Pointer/alignment-assumption-attribute-assume_aligned-on-function-two-params.cpp UBSan-Standalone-x86_64 :: TestCases/Pointer/alignment-assumption-attribute-assume_aligned-on-function.cpp UBSan-Standalone-x86_64 :: TestCases/Pointer/alignment-assumption-blacklist.cpp UBSan-Standalone-x86_64 :: TestCases/Pointer/alignment-assumption-builtin_assume_aligned-three-params-variable.cpp UBSan-Standalone-x86_64 :: TestCases/Pointer/alignment-assumption-builtin_assume_aligned-three-params.cpp UBSan-Standalone-x86_64 :: TestCases/Pointer/alignment-assumption-builtin_assume_aligned-two-params.cpp UBSan-Standalone-x86_64 :: TestCases/Pointer/alignment-assumption-openmp.cpp UBSan-Standalone-x86_64 :: TestCases/Pointer/index-overflow.cpp UBSan-Standalone-x86_64 :: TestCases/Pointer/nullptr-and-nonzero-offset-constants.cpp UBSan-Standalone-x86_64 :: TestCases/Pointer/nullptr-and-nonzero-offset-variable.cpp UBSan-Standalone-x86_64 :: TestCases/Pointer/unsigned-index-expression.cpp UBSan-Standalone-x86_64 :: TestCases/TypeCheck/Function/function.cpp UBSan-Standalone-x86_64 :: TestCases/TypeCheck/PR33221.cpp UBSan-Standalone-x86_64 :: TestCases/TypeCheck/misaligned.cpp UBSan-Standalone-x86_64 :: TestCases/TypeCheck/null.cpp UBSan-Standalone-x86_64 :: TestCases/TypeCheck/vptr-corrupted-vtable-itanium.cpp UBSan-Standalone-x86_64 :: TestCases/TypeCheck/vptr-non-unique-typeinfo.cpp UBSan-Standalone-x86_64 :: TestCases/TypeCheck/vptr-virtual-base-construction.cpp UBSan-Standalone-x86_64 :: TestCases/TypeCheck/vptr-virtual-base.cpp UBSan-Standalone-x86_64 :: TestCases/TypeCheck/vptr.cpp UBSan-StandaloneStatic-x86_64 :: TestCases/Float/cast-overflow.cpp UBSan-StandaloneStatic-x86_64 :: TestCases/ImplicitConversion/integer-arithmetic-value-change.c UBSan-StandaloneStatic-x86_64 :: TestCases/ImplicitConversion/integer-conversion-incdec.c UBSan-StandaloneStatic-x86_64 :: TestCases/ImplicitConversion/integer-conversion.c UBSan-StandaloneStatic-x86_64 :: TestCases/ImplicitConversion/integer-sign-change-blacklist.c UBSan-StandaloneStatic-x86_64 :: TestCases/ImplicitConversion/integer-sign-change-incdec.c UBSan-StandaloneStatic-x86_64 :: TestCases/ImplicitConversion/integer-sign-change.c UBSan-StandaloneStatic-x86_64 :: TestCases/ImplicitConversion/integer-truncation.c UBSan-StandaloneStatic-x86_64 :: TestCases/ImplicitConversion/signed-integer-truncation-blacklist.c UBSan-StandaloneStatic-x86_64 :: TestCases/ImplicitConversion/signed-integer-truncation-incdec.c UBSan-StandaloneStatic-x86_64 :: TestCases/ImplicitConversion/signed-integer-truncation-or-sign-change-blacklist.c UBSan-StandaloneStatic-x86_64 :: TestCases/ImplicitConversion/signed-integer-truncation.c UBSan-StandaloneStatic-x86_64 :: TestCases/ImplicitConversion/unsigned-integer-truncation-blacklist.c UBSan-StandaloneStatic-x86_64 :: TestCases/ImplicitConversion/unsigned-integer-truncation.c UBSan-StandaloneStatic-x86_64 :: TestCases/Integer/add-overflow.cpp UBSan-StandaloneStatic-x86_64 :: TestCases/Integer/div-overflow.cpp UBSan-StandaloneStatic-x86_64 :: TestCases/Integer/div-zero.cpp UBSan-StandaloneStatic-x86_64 :: TestCases/Integer/incdec-overflow.cpp UBSan-StandaloneStatic-x86_64 :: TestCases/Integer/mul-overflow.cpp UBSan-StandaloneStatic-x86_64 :: TestCases/Integer/negate-overflow.cpp UBSan-StandaloneStatic-x86_64 :: TestCases/Integer/no-recover.cpp UBSan-StandaloneStatic-x86_64 :: TestCases/Integer/shift.cpp UBSan-StandaloneStatic-x86_64 :: TestCases/Integer/sub-overflow.cpp UBSan-StandaloneStatic-x86_64 :: TestCases/Integer/suppressions.cpp UBSan-StandaloneStatic-x86_64 :: TestCases/Integer/uadd-overflow.cpp UBSan-StandaloneStatic-x86_64 :: TestCases/Integer/uincdec-overflow.cpp UBSan-StandaloneStatic-x86_64 :: TestCases/Integer/umul-overflow.cpp UBSan-StandaloneStatic-x86_64 :: TestCases/Integer/usub-overflow.cpp UBSan-StandaloneStatic-x86_64 :: TestCases/Misc/bool.cpp UBSan-StandaloneStatic-x86_64 :: TestCases/Misc/bool.m UBSan-StandaloneStatic-x86_64 :: TestCases/Misc/bounds.cpp UBSan-StandaloneStatic-x86_64 :: TestCases/Misc/builtins.cpp UBSan-StandaloneStatic-x86_64 :: TestCases/Misc/deduplication.cpp UBSan-StandaloneStatic-x86_64 :: TestCases/Misc/enum.cpp UBSan-StandaloneStatic-x86_64 :: TestCases/Misc/log-path_test.cpp UBSan-StandaloneStatic-x86_64 :: TestCases/Misc/missing_return.cpp UBSan-StandaloneStatic-x86_64 :: TestCases/Misc/monitor.cpp UBSan-StandaloneStatic-x86_64 :: TestCases/Misc/nonnull-arg.cpp UBSan-StandaloneStatic-x86_64 :: TestCases/Misc/nonnull.cpp UBSan-StandaloneStatic-x86_64 :: TestCases/Misc/nullability.c UBSan-StandaloneStatic-x86_64 :: TestCases/Misc/objc-cast.m UBSan-StandaloneStatic-x86_64 :: TestCases/Misc/print_summary.c UBSan-StandaloneStatic-x86_64 :: TestCases/Misc/unreachable.cpp UBSan-StandaloneStatic-x86_64 :: TestCases/Misc/vla.c UBSan-StandaloneStatic-x86_64 :: TestCases/Pointer/alignment-assumption-attribute-align_value-on-lvalue.cpp UBSan-StandaloneStatic-x86_64 :: TestCases/Pointer/alignment-assumption-attribute-align_value-on-paramvar.cpp UBSan-StandaloneStatic-x86_64 :: TestCases/Pointer/alignment-assumption-attribute-alloc_align-on-function-variable.cpp UBSan-StandaloneStatic-x86_64 :: TestCases/Pointer/alignment-assumption-attribute-alloc_align-on-function.cpp UBSan-StandaloneStatic-x86_64 :: TestCases/Pointer/alignment-assumption-attribute-assume_aligned-on-function-two-params.cpp UBSan-StandaloneStatic-x86_64 :: TestCases/Pointer/alignment-assumption-attribute-assume_aligned-on-function.cpp UBSan-StandaloneStatic-x86_64 :: TestCases/Pointer/alignment-assumption-blacklist.cpp UBSan-StandaloneStatic-x86_64 :: TestCases/Pointer/alignment-assumption-builtin_assume_aligned-three-params-variable.cpp UBSan-StandaloneStatic-x86_64 :: TestCases/Pointer/alignment-assumption-builtin_assume_aligned-three-params.cpp UBSan-StandaloneStatic-x86_64 :: TestCases/Pointer/alignment-assumption-builtin_assume_aligned-two-params.cpp UBSan-StandaloneStatic-x86_64 :: TestCases/Pointer/alignment-assumption-openmp.cpp UBSan-StandaloneStatic-x86_64 :: TestCases/Pointer/index-overflow.cpp UBSan-StandaloneStatic-x86_64 :: TestCases/Pointer/nullptr-and-nonzero-offset-constants.cpp UBSan-StandaloneStatic-x86_64 :: TestCases/Pointer/nullptr-and-nonzero-offset-variable.cpp UBSan-StandaloneStatic-x86_64 :: TestCases/Pointer/unsigned-index-expression.cpp UBSan-StandaloneStatic-x86_64 :: TestCases/TypeCheck/Function/function.cpp UBSan-StandaloneStatic-x86_64 :: TestCases/TypeCheck/PR33221.cpp UBSan-StandaloneStatic-x86_64 :: TestCases/TypeCheck/misaligned.cpp UBSan-StandaloneStatic-x86_64 :: TestCases/TypeCheck/null.cpp UBSan-StandaloneStatic-x86_64 :: TestCases/TypeCheck/vptr-corrupted-vtable-itanium.cpp UBSan-StandaloneStatic-x86_64 :: TestCases/TypeCheck/vptr-non-unique-typeinfo.cpp UBSan-StandaloneStatic-x86_64 :: TestCases/TypeCheck/vptr-virtual-base-construction.cpp UBSan-StandaloneStatic-x86_64 :: TestCases/TypeCheck/vptr-virtual-base.cpp UBSan-StandaloneStatic-x86_64 :: TestCases/TypeCheck/vptr.cpp UBSan-ThreadSanitizer-x86_64 :: TestCases/Float/cast-overflow.cpp UBSan-ThreadSanitizer-x86_64 :: TestCases/ImplicitConversion/integer-arithmetic-value-change.c UBSan-ThreadSanitizer-x86_64 :: TestCases/ImplicitConversion/integer-conversion-incdec.c UBSan-ThreadSanitizer-x86_64 :: TestCases/ImplicitConversion/integer-conversion.c UBSan-ThreadSanitizer-x86_64 :: TestCases/ImplicitConversion/integer-sign-change-blacklist.c UBSan-ThreadSanitizer-x86_64 :: TestCases/ImplicitConversion/integer-sign-change-incdec.c UBSan-ThreadSanitizer-x86_64 :: TestCases/ImplicitConversion/integer-sign-change-summary.cpp UBSan-ThreadSanitizer-x86_64 :: TestCases/ImplicitConversion/integer-sign-change.c UBSan-ThreadSanitizer-x86_64 :: TestCases/ImplicitConversion/integer-truncation.c UBSan-ThreadSanitizer-x86_64 :: TestCases/ImplicitConversion/signed-integer-truncation-blacklist.c UBSan-ThreadSanitizer-x86_64 :: TestCases/ImplicitConversion/signed-integer-truncation-incdec.c UBSan-ThreadSanitizer-x86_64 :: TestCases/ImplicitConversion/signed-integer-truncation-or-sign-change-blacklist.c UBSan-ThreadSanitizer-x86_64 :: TestCases/ImplicitConversion/signed-integer-truncation-or-sign-change-summary.cpp UBSan-ThreadSanitizer-x86_64 :: TestCases/ImplicitConversion/signed-integer-truncation-summary.cpp UBSan-ThreadSanitizer-x86_64 :: TestCases/ImplicitConversion/signed-integer-truncation.c UBSan-ThreadSanitizer-x86_64 :: TestCases/ImplicitConversion/unsigned-integer-truncation-blacklist.c UBSan-ThreadSanitizer-x86_64 :: TestCases/ImplicitConversion/unsigned-integer-truncation-summary.cpp UBSan-ThreadSanitizer-x86_64 :: TestCases/ImplicitConversion/unsigned-integer-truncation.c UBSan-ThreadSanitizer-x86_64 :: TestCases/Integer/add-overflow.cpp UBSan-ThreadSanitizer-x86_64 :: TestCases/Integer/div-overflow.cpp UBSan-ThreadSanitizer-x86_64 :: TestCases/Integer/div-zero.cpp UBSan-ThreadSanitizer-x86_64 :: TestCases/Integer/incdec-overflow.cpp UBSan-ThreadSanitizer-x86_64 :: TestCases/Integer/mul-overflow.cpp UBSan-ThreadSanitizer-x86_64 :: TestCases/Integer/negate-overflow.cpp UBSan-ThreadSanitizer-x86_64 :: TestCases/Integer/no-recover.cpp UBSan-ThreadSanitizer-x86_64 :: TestCases/Integer/shift.cpp UBSan-ThreadSanitizer-x86_64 :: TestCases/Integer/sub-overflow.cpp UBSan-ThreadSanitizer-x86_64 :: TestCases/Integer/suppressions.cpp UBSan-ThreadSanitizer-x86_64 :: TestCases/Integer/uadd-overflow.cpp UBSan-ThreadSanitizer-x86_64 :: TestCases/Integer/uincdec-overflow.cpp UBSan-ThreadSanitizer-x86_64 :: TestCases/Integer/umul-overflow.cpp UBSan-ThreadSanitizer-x86_64 :: TestCases/Integer/usub-overflow.cpp UBSan-ThreadSanitizer-x86_64 :: TestCases/Misc/bool.cpp UBSan-ThreadSanitizer-x86_64 :: TestCases/Misc/bool.m UBSan-ThreadSanitizer-x86_64 :: TestCases/Misc/bounds.cpp UBSan-ThreadSanitizer-x86_64 :: TestCases/Misc/builtins.cpp UBSan-ThreadSanitizer-x86_64 :: TestCases/Misc/deduplication.cpp UBSan-ThreadSanitizer-x86_64 :: TestCases/Misc/enum.cpp UBSan-ThreadSanitizer-x86_64 :: TestCases/Misc/log-path_test.cpp UBSan-ThreadSanitizer-x86_64 :: TestCases/Misc/missing_return.cpp UBSan-ThreadSanitizer-x86_64 :: TestCases/Misc/monitor.cpp UBSan-ThreadSanitizer-x86_64 :: TestCases/Misc/nonnull-arg.cpp UBSan-ThreadSanitizer-x86_64 :: TestCases/Misc/nonnull.cpp UBSan-ThreadSanitizer-x86_64 :: TestCases/Misc/nullability.c UBSan-ThreadSanitizer-x86_64 :: TestCases/Misc/objc-cast.m UBSan-ThreadSanitizer-x86_64 :: TestCases/Misc/print_summary.c UBSan-ThreadSanitizer-x86_64 :: TestCases/Misc/unreachable.cpp UBSan-ThreadSanitizer-x86_64 :: TestCases/Misc/vla.c UBSan-ThreadSanitizer-x86_64 :: TestCases/Pointer/alignment-assumption-attribute-align_value-on-lvalue.cpp 22 warning(s) in tests

Hide Details

UBSan-ThreadSanitizer-x86_64 :: TestCases/Pointer/alignment-assumption-attribute-align_value-on-paramvar.cpp UBSan-ThreadSanitizer-x86_64 :: TestCases/Pointer/alignment-assumption-attribute-alloc_align-on-function-variable.cpp UBSan-ThreadSanitizer-x86_64 :: TestCases/Pointer/alignment-assumption-attribute-alloc_align-on-function.cpp UBSan-ThreadSanitizer-x86_64 :: TestCases/Pointer/alignment-assumption-attribute-assume_aligned-on-function-two-params.cpp UBSan-ThreadSanitizer-x86_64 :: TestCases/Pointer/alignment-assumption-attribute-assume_aligned-on-function.cpp UBSan-ThreadSanitizer-x86_64 :: TestCases/Pointer/alignment-assumption-blacklist.cpp UBSan-ThreadSanitizer-x86_64 :: TestCases/Pointer/alignment-assumption-builtin_assume_aligned-three-params-variable.cpp UBSan-ThreadSanitizer-x86_64 :: TestCases/Pointer/alignment-assumption-builtin_assume_aligned-three-params.cpp UBSan-ThreadSanitizer-x86_64 :: TestCases/Pointer/alignment-assumption-builtin_assume_aligned-two-params.cpp UBSan-ThreadSanitizer-x86_64 :: TestCases/Pointer/alignment-assumption-openmp.cpp UBSan-ThreadSanitizer-x86_64 :: TestCases/Pointer/alignment-assumption-summary.cpp UBSan-ThreadSanitizer-x86_64 :: TestCases/Pointer/index-overflow.cpp UBSan-ThreadSanitizer-x86_64 :: TestCases/Pointer/nullptr-and-nonzero-offset-constants.cpp UBSan-ThreadSanitizer-x86_64 :: TestCases/Pointer/nullptr-and-nonzero-offset-summary.cpp UBSan-ThreadSanitizer-x86_64 :: TestCases/Pointer/nullptr-and-nonzero-offset-variable.cpp UBSan-ThreadSanitizer-x86_64 :: TestCases/Pointer/unsigned-index-expression.cpp UBSan-ThreadSanitizer-x86_64 :: TestCases/TypeCheck/Function/function.cpp UBSan-ThreadSanitizer-x86_64 :: TestCases/TypeCheck/PR33221.cpp UBSan-ThreadSanitizer-x86_64 :: TestCases/TypeCheck/misaligned.cpp UBSan-ThreadSanitizer-x86_64 :: TestCases/TypeCheck/null.cpp UBSan-ThreadSanitizer-x86_64 :: TestCases/TypeCheck/vptr-corrupted-vtable-itanium.cpp UBSan-ThreadSanitizer-x86_64 :: TestCases/TypeCheck/vptr-non-unique-typeinfo.cpp UBSan-ThreadSanitizer-x86_64 :: TestCases/TypeCheck/vptr-virtual-base-construction.cpp UBSan-ThreadSanitizer-x86_64 :: TestCases/TypeCheck/vptr-virtual-base.cpp UBSan-ThreadSanitizer-x86_64 :: TestCases/TypeCheck/vptr.cpp cfi-devirt-x86_64 :: anon-namespace.cpp cfi-devirt-x86_64 :: bad-cast.cpp cfi-devirt-x86_64 :: bad-split.cpp cfi-devirt-x86_64 :: base-derived-destructor.cpp cfi-devirt-x86_64 :: cross-dso-diagnostic.cpp cfi-devirt-x86_64 :: icall/bad-signature.c cfi-devirt-x86_64 :: mfcall.cpp cfi-devirt-x86_64 :: multiple-inheritance.cpp cfi-devirt-x86_64 :: multiple-inheritance2.cpp cfi-devirt-x86_64 :: nvcall.cpp cfi-devirt-x86_64 :: overwrite.cpp cfi-devirt-x86_64 :: simple-fail.cpp cfi-devirt-x86_64 :: target_uninstrumented.cpp cfi-devirt-x86_64 :: vdtor.cpp cfi-devirt-x86_64 :: vtable-may-alias.cpp cfi-standalone-x86_64 :: anon-namespace.cpp cfi-standalone-x86_64 :: bad-cast.cpp cfi-standalone-x86_64 :: bad-split.cpp cfi-standalone-x86_64 :: base-derived-destructor.cpp cfi-standalone-x86_64 :: cross-dso-diagnostic.cpp cfi-standalone-x86_64 :: icall/bad-signature.c cfi-standalone-x86_64 :: mfcall.cpp cfi-standalone-x86_64 :: multiple-inheritance.cpp cfi-standalone-x86_64 :: multiple-inheritance2.cpp cfi-standalone-x86_64 :: nvcall.cpp cfi-standalone-x86_64 :: overwrite.cpp cfi-standalone-x86_64 :: simple-fail.cpp cfi-standalone-x86_64 :: stats.cpp cfi-standalone-x86_64 :: target_uninstrumented.cpp cfi-standalone-x86_64 :: vdtor.cpp cfi-standalone-x86_64 :: vtable-may-alias.cpp libFuzzer :: acquire-crash-state.test libFuzzer :: afl-driver-stderr.test libFuzzer :: bad-strcmp.test libFuzzer :: bogus-initialize.test libFuzzer :: buffer-overflow-on-input.test libFuzzer :: caller-callee.test libFuzzer :: cleanse.test libFuzzer :: counters.test libFuzzer :: coverage.test libFuzzer :: cross_over.test libFuzzer :: cxxstring.test libFuzzer :: dead-stripping.test libFuzzer :: deprecated-instrumentation.test libFuzzer :: dso.test libFuzzer :: exit-report.test libFuzzer :: exit_on_src_pos.test libFuzzer :: full-coverage-set.test libFuzzer :: fuzzer-alignment-assumption.test libFuzzer :: fuzzer-customcrossover.test libFuzzer :: fuzzer-customcrossoverandmutate.test libFuzzer :: fuzzer-custommutator.test libFuzzer :: fuzzer-dict.test libFuzzer :: fuzzer-dirs.test libFuzzer :: fuzzer-fdmask.test libFuzzer :: fuzzer-finalstats.test libFuzzer :: fuzzer-flags.test libFuzzer :: fuzzer-implicit-integer-sign-change.test libFuzzer :: fuzzer-implicit-signed-integer-truncation-or-sign-change.test libFuzzer :: fuzzer-implicit-signed-integer-truncation.test libFuzzer :: fuzzer-implicit-unsigned-integer-truncation.test libFuzzer :: fuzzer-oom.test libFuzzer :: fuzzer-printcovpcs.test libFuzzer :: fuzzer-runs.test libFuzzer :: fuzzer-seed.test libFuzzer :: fuzzer-segv.test libFuzzer :: fuzzer-singleinputs.test libFuzzer :: fuzzer-threaded.test libFuzzer :: fuzzer-timeout.test libFuzzer :: fuzzer-ubsan.test libFuzzer :: initialize.test libFuzzer :: large.test libFuzzer :: len_control.test libFuzzer :: max-number-of-runs.test libFuzzer :: memcmp.test libFuzzer :: memcmp64.test libFuzzer :: merge-control-file.test libFuzzer :: merge-posix.test libFuzzer :: merge.test libFuzzer :: merge_two_step.test libFuzzer :: minimize_crash.test libFuzzer :: minimize_two_crashes.test libFuzzer :: not-instrumented.test libFuzzer :: null-deref-on-empty.test libFuzzer :: null-deref.test libFuzzer :: overwrite-input.test libFuzzer :: read-binary.test libFuzzer :: recommended-dictionary.test libFuzzer :: reduce_inputs.test libFuzzer :: reload.test libFuzzer :: repeated-bytes.test libFuzzer :: seed_inputs.test libFuzzer :: shrink.test libFuzzer :: simple.test libFuzzer :: standalone.test libFuzzer :: strcmp.test libFuzzer :: strncmp-oob.test libFuzzer :: strncmp.test libFuzzer :: strstr.test libFuzzer :: swap-cmp.test libFuzzer :: symbolize-deadlock.test libFuzzer :: three-bytes.test libFuzzer :: trace-malloc.test libFuzzer :: ulimit.test libFuzzer :: value-profile-cmp.test libFuzzer :: value-profile-cmp2.test libFuzzer :: value-profile-cmp3.test libFuzzer :: value-profile-cmp4.test libFuzzer :: value-profile-div.test libFuzzer :: value-profile-load.test libFuzzer :: value-profile-mem.test libFuzzer :: value-profile-set.test libFuzzer :: value-profile-strcmp.test libFuzzer :: value-profile-strncmp.test libFuzzer :: value-profile-switch.test

Hide Details

Hide Details

Testing Time: 244.99s Unsupported : 904 Passed : 477 Expectedly Failed: 30 Failed : 1626 FAILED: test/CMakeFiles/check-compiler-rt cd /Users/buildslave/jenkins/workspace/clang-stage2-Rthinlto/clang-build/Build/tools/clang/runtime/compiler-rt-bins/test && /usr/local/Frameworks/Python.framework/Versions/3.7/bin/python3.7 /Users/buildslave/jenkins/workspace/clang-stage2-Rthinlto/clang-build/Build/./bin/llvm-lit --xunit-xml-output=testresults.xunit.xml -v -vv --timeout=600 /Users/buildslave/jenkins/workspace/clang-stage2-Rthinlto/clang-build/Build/tools/clang/runtime/compiler-rt-bins/test/builtins/TestCases /Users/buildslave/jenkins/workspace/clang-stage2-Rthinlto/clang-build/Build/tools/clang/runtime/compiler-rt-bins/test/builtins/Unit/X86_64DarwinConfig /Users/buildslave/jenkins/workspace/clang-stage2-Rthinlto/clang-build/Build/tools/clang/runtime/compiler-rt-bins/test/lsan/X86_64LsanConfig /Users/buildslave/jenkins/workspace/clang-stage2-Rthinlto/clang-build/Build/tools/clang/runtime/compiler-rt-bins/test/lsan/X86_64AsanConfig /Users/buildslave/jenkins/workspace/clang-stage2-Rthinlto/clang-build/Build/tools/clang/runtime/compiler-rt-bins/test/ubsan/Standalone-x86_64 /Users/buildslave/jenkins/workspace/clang-stage2-Rthinlto/clang-build/Build/tools/clang/runtime/compiler-rt-bins/test/ubsan/AddressSanitizer-x86_64 /Users/buildslave/jenkins/workspace/clang-stage2-Rthinlto/clang-build/Build/tools/clang/runtime/compiler-rt-bins/test/ubsan/ThreadSanitizer-x86_64 /Users/buildslave/jenkins/workspace/clang-stage2-Rthinlto/clang-build/Build/tools/clang/runtime/compiler-rt-bins/test/ubsan/StandaloneStatic-x86_64 /Users/buildslave/jenkins/workspace/clang-stage2-Rthinlto/clang-build/Build/tools/clang/runtime/compiler-rt-bins/test/cfi/Standalone-x86_64 /Users/buildslave/jenkins/workspace/clang-stage2-Rthinlto/clang-build/Build/tools/clang/runtime/compiler-rt-bins/test/cfi/Devirt-x86_64 /Users/buildslave/jenkins/workspace/clang-stage2-Rthinlto/clang-build/Build/tools/clang/runtime/compiler-rt-bins/test/sanitizer_common/asan-x86_64-Darwin /Users/buildslave/jenkins/workspace/clang-stage2-Rthinlto/clang-build/Build/tools/clang/runtime/compiler-rt-bins/test/sanitizer_common/lsan-x86_64-Darwin /Users/buildslave/jenkins/workspace/clang-stage2-Rthinlto/clang-build/Build/tools/clang/runtime/compiler-rt-bins/test/sanitizer_common/tsan-x86_64-Darwin /Users/buildslave/jenkins/workspace/clang-stage2-Rthinlto/clang-build/Build/tools/clang/runtime/compiler-rt-bins/test/sanitizer_common/ubsan-x86_64-Darwin /Users/buildslave/jenkins/workspace/clang-stage2-Rthinlto/clang-build/Build/tools/clang/runtime/compiler-rt-bins/test/sanitizer_common/Unit /Users/buildslave/jenkins/workspace/clang-stage2-Rthinlto/clang-build/Build/tools/clang/runtime/compiler-rt-bins/test/fuzzer/unit /Users/buildslave/jenkins/workspace/clang-stage2-Rthinlto/clang-build/Build/tools/clang/runtime/compiler-rt-bins/test/fuzzer/X86_64DefaultDarwinConfig/ /Users/buildslave/jenkins/workspace/clang-stage2-Rthinlto/clang-build/Build/tools/clang/runtime/compiler-rt-bins/test/asan/X86_64DarwinConfig /Users/buildslave/jenkins/workspace/clang-stage2-Rthinlto/clang-build/Build/tools/clang/runtime/compiler-rt-bins/test/asan/Unit /Users/buildslave/jenkins/workspace/clang-stage2-Rthinlto/clang-build/Build/tools/clang/runtime/compiler-rt-bins/test/tsan/X86_64Config /Users/buildslave/jenkins/workspace/clang-stage2-Rthinlto/clang-build/Build/tools/clang/runtime/compiler-rt-bins/test/tsan/Unit /Users/buildslave/jenkins/workspace/clang-stage2-Rthinlto/clang-build/Build/tools/clang/runtime/compiler-rt-bins/test/ubsan_minimal/x86_64 /Users/buildslave/jenkins/workspace/clang-stage2-Rthinlto/clang-build/Build/tools/clang/runtime/compiler-rt-bins/test/profile/Profile-x86_64 /Users/buildslave/jenkins/workspace/clang-stage2-Rthinlto/clang-build/Build/tools/clang/runtime/compiler-rt-bins/test/xray/X86_64DarwinConfig /Users/buildslave/jenkins/workspace/clang-stage2-Rthinlto/clang-build/Build/tools/clang/runtime/compiler-rt-bins/test/xray/X86_64HDarwinConfig /Users/buildslave/jenkins/workspace/clang-stage2-Rthinlto/clang-build/Build/tools/clang/runtime/compiler-rt-bins/test/shadowcallstack/arm64 ninja: build stopped: subcommand failed. [2/4] cd /Users/buildslave/jenkins/workspace/clang-stage2-Rthinlto/llvm-project/clang/bindings/python && /usr/local/Cellar/cmake/3.17.2/bin/cmake -E env CLANG_LIBRARY_PATH=/Users/buildslave/jenkins/workspace/clang-stage2-Rthinlto/clang-build/Build/lib /usr/local/Frameworks/Python.framework/Versions/3.7/bin/python3.7 -m unittest discover ........................................................./Users/buildslave/jenkins/workspace/clang-stage2-Rthinlto/llvm-project/clang/bindings/python/tests/cindex/test_diagnostics.py:101: DeprecationWarning: Please use assertRegex instead. '.*declared here') ..................................................................... ---------------------------------------------------------------------- Ran 126 tests in 1.306s

Hide Details

OK FAILED: tools/clang/runtime/CMakeFiles/check-compiler-rt cd /Users/buildslave/jenkins/workspace/clang-stage2-Rthinlto/clang-build/Build/tools/clang/runtime/compiler-rt-bins && /usr/local/Cellar/cmake/3.17.2/bin/cmake --build . --target check-all --config RelWithDebInfo ninja: build stopped: cannot make progress due to previous errors. Command failed: Command '['env', 'MALLOC_LOG_FILE=/dev/null', '/usr/local/bin/ninja', '-v', '-k', '0', 'check-all']' returned non-zero exit status 1 Command: ['env', 'MALLOC_LOG_FILE=/dev/null', '/usr/local/bin/ninja', '-v', '-k', '0', 'check-all'] [Pipeline] } [Pipeline] // timeout [Pipeline] } [Pipeline] // stage [Pipeline] stage [Pipeline] { (Declarative: Post Actions) [Pipeline] scanForIssues [Clang (LLVM based)] Sleeping for 5 seconds due to JENKINS-32191... [Clang (LLVM based)] Parsing console log (workspace: '/Users/buildslave/jenkins/workspace/clang-stage2-Rthinlto') [Clang (LLVM based)] Successfully parsed console log [Clang (LLVM based)] -> found 18 issues (skipped 37 duplicates) [Clang (LLVM based)] [-ERROR-] Can't create fingerprints for some files: [Clang (LLVM based)] [-ERROR-] - '/tmp/gotsan.OlP2fMkzYl/gotsan.cpp', IO exception has been thrown: java.nio.file.NoSuchFileException: /tmp/gotsan.OlP2fMkzYl/gotsan.cpp [Clang (LLVM based)] [-ERROR-] - '/tmp/gotsan.OlP2fMkzYl/gotsan.cpp', IO exception has been thrown: java.nio.file.NoSuchFileException: /tmp/gotsan.OlP2fMkzYl/gotsan.cpp [Clang (LLVM based)] [-ERROR-] - '/tmp/gotsan.OlP2fMkzYl/gotsan.cpp', IO exception has been thrown: java.nio.file.NoSuchFileException: /tmp/gotsan.OlP2fMkzYl/gotsan.cpp [Clang (LLVM based)] [-ERROR-] - '/tmp/gotsan.OlP2fMkzYl/gotsan.cpp', IO exception has been thrown: java.nio.file.NoSuchFileException: /tmp/gotsan.OlP2fMkzYl/gotsan.cpp [Clang (LLVM based)] [-ERROR-] - '/tmp/gotsan.OlP2fMkzYl/gotsan.cpp', IO exception has been thrown: java.nio.file.NoSuchFileException: /tmp/gotsan.OlP2fMkzYl/gotsan.cpp [Clang (LLVM based)] [-ERROR-] - '/tmp/gotsan.OlP2fMkzYl/gotsan.cpp', IO exception has been thrown: java.nio.file.NoSuchFileException: /tmp/gotsan.OlP2fMkzYl/gotsan.cpp [Clang (LLVM based)] [-ERROR-] - '/tmp/gotsan.OlP2fMkzYl/gotsan.cpp', IO exception has been thrown: java.nio.file.NoSuchFileException: /tmp/gotsan.OlP2fMkzYl/gotsan.cpp [Clang (LLVM based)] [-ERROR-] - '/tmp/gotsan.OlP2fMkzYl/gotsan.cpp', IO exception has been thrown: java.nio.file.NoSuchFileException: /tmp/gotsan.OlP2fMkzYl/gotsan.cpp [Clang (LLVM based)] [-ERROR-] - '/Users/buildslave/jenkins/workspace/clang-stage2-Rthinlto/clang-build/Build/tools/clang/runtime/compiler-rt-bins/llvm-lit: /Users/buildslave/jenkins/workspace/clang-stage2-Rthinlto/llvm-project/compiler-rt/test/lit.common.cfg.py', IO exception has been thrown: java.nio.file.NoSuchFileException: /Users/buildslave/jenkins/workspace/clang-stage2-Rthinlto/clang-build/Build/tools/clang/runtime/compiler-rt-bins/llvm-lit: /Users/buildslave/jenkins/workspace/clang-stage2-Rthinlto/llvm-project/compiler-rt/test/lit.common.cfg.py [Clang (LLVM based)] Post processing issues on 'green-dragon-22' with source code encoding 'UTF-8' [Clang (LLVM based)] Creating SCM blamer to obtain author and commit information for affected files [Clang (LLVM based)] Creating SCM miner to obtain statistics for affected repository files [Clang (LLVM based)] Resolving file names for all issues in source directory '/Users/buildslave/jenkins/workspace/clang-stage2-Rthinlto' [Clang (LLVM based)] -> resolved paths in source directory (4 found, 2 not found) [Clang (LLVM based)] Resolving module names from module definitions (build.xml, pom.xml, or Manifest.mf files) [Clang (LLVM based)] -> resolved module names for 18 issues [Clang (LLVM based)] Resolving package names (or namespaces) by parsing the affected files [Clang (LLVM based)] -> resolved package names of 6 affected files [Clang (LLVM based)] No filter has been set, publishing all 18 issues [Clang (LLVM based)] Creating fingerprints for all affected code blocks to track issues over different builds [Clang (LLVM based)] -> created fingerprints for 9 issues (skipped 9 issues) [Clang (LLVM based)] Copying affected files to Jenkins' build folder '/Users/Shared/Jenkins/Home/jobs/clang-stage2-Rthinlto/builds/3473/files-with-issues' [Clang (LLVM based)] -> 4 copied, 0 not in workspace, 9 not-found, 0 with I/O error [Pipeline] emailext Warning: echristo@gmail.com is not a recognized user, but sending mail anyway Warning: jpienaar@google.com is not a recognized user, but sending mail anyway Warning: okuraofvegetable@gmail.com is not a recognized user, but sending mail anyway Warning: brad@comstyle.com is not a recognized user, but sending mail anyway Warning: kazu@google.com is not a recognized user, but sending mail anyway Warning: aqjune@gmail.com is not a recognized user, but sending mail anyway Warning: craig.topper@intel.com is not a recognized user, but sending mail anyway Warning: echristo@gmail.com is not a recognized user, but sending mail anyway Warning: jpienaar@google.com is not a recognized user, but sending mail anyway Warning: okuraofvegetable@gmail.com is not a recognized user, but sending mail anyway Warning: brad@comstyle.com is not a recognized user, but sending mail anyway Warning: kazu@google.com is not a recognized user, but sending mail anyway Warning: aqjune@gmail.com is not a recognized user, but sending mail anyway Warning: craig.topper@intel.com is not a recognized user, but sending mail anyway

Hide Details

Begin Pre-Send Script... Sending email to: mschifer@apple.com echristo@gmail.com jpienaar@google.com okuraofvegetable@gmail.com brad@comstyle.com kazu@google.com aqjune@gmail.com craig.topper@intel.com Erik Pilkington <epilkington@apple.com> Azhar Mohammed <azhar@apple.com>
[Pipeline] } [Pipeline] // stage [Pipeline] } [Pipeline] // node [Pipeline] End of Pipeline ERROR: script returned exit code 1 Finished: FAILURE