FailedConsole Output

Skipping 10,600 KB.. Full Log
00000000000000000000000000000000000000000000000000000000000000000000000000000000000000000000000000000000000000000000000000000000000000000000000000000000000000000000000000000000000000#c7
 <   6> read packet: $OK#9a
 < 861> send packet: $G0000000000000000000000000000000000000000000000000000000000000000000000000000000000000000000000000000000000000000000000000000000000000000000000000000000000000000000000000000000000000000000000000000000000000000000000000000000000000000000000000000000000000000000000000000000000000000000000000000000000000000000000000000000000000000000000000000000000000000000000000000000000000000000000000000000000000000000000000000000000000000000000000000000000000000000000000000000000000000000000000000000000000000000000000000000000000000000000000000000000000000000000000000000000000000000000000000000000000000000000000000000000000000000000000000000000000000000000000000000000000000000000000000000000000000000000000000000000000000000000000000000000000000000000000000000000000000000000000000000000000000000000000000000000000000000000000000000000000000000000000000000000000000#c7
 <   6> read packet: $OK#9a
 < 861> send packet: $G0000000000000000000000000000000000000000000000000000000000000000000000000000000000000000000000000000000000000000000000000000000000000000000000000000000000000000000000000000000000000000000000000000000000000000000000000000000000000000000000000000000000000000000000000000000000000000000000000000000000000000000000000000000000000000000000000000000000000000000000000000000000000000000000000000000000000000000000000000000000000000000000000000000000000000000000000000000000000000000000000000000000000000000000000000000000000000000000000000000000000000000000000000000000000000000000000000000000000000000000000000000000000000000000000000000000000000000000000000000000000000000000000000000000000000000000000000000000000000000000000000000000000000000000000000000000000000000000000000000000000000000000000000000000000000000000000000000000000000000000000000000000000000#c7
 <   6> read packet: $OK#9a
 < 861> send packet: $G0000000000000000000000000000000000000000000000000000000000000000000000000000000000000000000000000000000000000000000000000000000000000000000000000000000000000000000000000000000000000000000000000000000000000000000000000000000000000000000000000000000000000000000000000000000000000000000000000000000000000000000000000000000000000000000000000000000000000000000000000000000000000000000000000000000000000000000000000000000000000000000000000000000000000000000000000000000000000000000000000000000000000000000000000000000000000000000000000000000000000000000000000000000000000000000000000000000000000000000000000000000000000000000000000000000000000000000000000000000000000000000000000000000000000000000000000000000000000000000000000000000000000000000000000000000000000000000000000000000000000000000000000000000000000000000000000000000000000000000000000000000000000000#c7
 <   6> read packet: $OK#9a
 < 861> send packet: $G0000000000000000000000000000000000000000000000000000000000000000000000000000000000000000000000000000000000000000000000000000000000000000000000000000000000000000000000000000000000000000000000000000000000000000000000000000000000000000000000000000000000000000000000000000000000000000000000000000000000000000000000000000000000000000000000000000000000000000000000000000000000000000000000000000000000000000000000000000000000000000000000000000000000000000000000000000000000000000000000000000000000000000000000000000000000000000000000000000000000000000000000000000000000000000000000000000000000000000000000000000000000000000000000000000000000000000000000000000000000000000000000000000000000000000000000000000000000000000000000000000000000000000000000000000000000000000000000000000000000000000000000000000000000000000000000000000000000000000000000000000000000000000#c7
 <   6> read packet: $OK#9a
 < 861> send packet: $G0000000000000000000000000000000000000000000000000000000000000000000000000000000000000000000000000000000000000000000000000000000000000000000000000000000000000000000000000000000000000000000000000000000000000000000000000000000000000000000000000000000000000000000000000000000000000000000000000000000000000000000000000000000000000000000000000000000000000000000000000000000000000000000000000000000000000000000000000000000000000000000000000000000000000000000000000000000000000000000000000000000000000000000000000000000000000000000000000000000000000000000000000000000000000000000000000000000000000000000000000000000000000000000000000000000000000000000000000000000000000000000000000000000000000000000000000000000000000000000000000000000000000000000000000000000000000000000000000000000000000000000000000000000000000000000000000000000000000000000000000000000000000000#c7
 <   6> read packet: $OK#9a
 < 861> send packet: $G0000000000000000000000000000000000000000000000000000000000000000000000000000000000000000000000000000000000000000000000000000000000000000000000000000000000000000000000000000000000000000000000000000000000000000000000000000000000000000000000000000000000000000000000000000000000000000000000000000000000000000000000000000000000000000000000000000000000000000000000000000000000000000000000000000000000000000000000000000000000000000000000000000000000000000000000000000000000000000000000000000000000000000000000000000000000000000000000000000000000000000000000000000000000000000000000000000000000000000000000000000000000000000000000000000000000000000000000000000000000000000000000000000000000000000000000000000000000000000000000000000000000000000000000000000000000000000000000000000000000000000000000000000000000000000000000000000000000000000000000000000000000000000#c7
 <   6> read packet: $OK#9a
 < 861> send packet: $G0000000000000000000000000000000000000000000000000000000000000000000000000000000000000000000000000000000000000000000000000000000000000000000000000000000000000000000000000000000000000000000000000000000000000000000000000000000000000000000000000000000000000000000000000000000000000000000000000000000000000000000000000000000000000000000000000000000000000000000000000000000000000000000000000000000000000000000000000000000000000000000000000000000000000000000000000000000000000000000000000000000000000000000000000000000000000000000000000000000000000000000000000000000000000000000000000000000000000000000000000000000000000000000000000000000000000000000000000000000000000000000000000000000000000000000000000000000000000000000000000000000000000000000000000000000000000000000000000000000000000000000000000000000000000000000000000000000000000000000000000000000000000000#c7
 <   6> read packet: $OK#9a
 < 861> send packet: $G0000000000000000000000000000000000000000000000000000000000000000000000000000000000000000000000000000000000000000000000000000000000000000000000000000000000000000000000000000000000000000000000000000000000000000000000000000000000000000000000000000000000000000000000000000000000000000000000000000000000000000000000000000000000000000000000000000000000000000000000000000000000000000000000000000000000000000000000000000000000000000000000000000000000000000000000000000000000000000000000000000000000000000000000000000000000000000000000000000000000000000000000000000000000000000000000000000000000000000000000000000000000000000000000000000000000000000000000000000000000000000000000000000000000000000000000000000000000000000000000000000000000000000000000000000000000000000000000000000000000000000000000000000000000000000000000000000000000000000000000000000000000000000#c7
 <   6> read packet: $OK#9a
 < 861> send packet: $G0000000000000000000000000000000000000000000000000000000000000000000000000000000000000000000000000000000000000000000000000000000000000000000000000000000000000000000000000000000000000000000000000000000000000000000000000000000000000000000000000000000000000000000000000000000000000000000000000000000000000000000000000000000000000000000000000000000000000000000000000000000000000000000000000000000000000000000000000000000000000000000000000000000000000000000000000000000000000000000000000000000000000000000000000000000000000000000000000000000000000000000000000000000000000000000000000000000000000000000000000000000000000000000000000000000000000000000000000000000000000000000000000000000000000000000000000000000000000000000000000000000000000000000000000000000000000000000000000000000000000000000000000000000000000000000000000000000000000000000000000000000000000000#c7
 <   6> read packet: $OK#9a
 < 861> send packet: $G0000000000000000000000000000000000000000000000000000000000000000000000000000000000000000000000000000000000000000000000000000000000000000000000000000000000000000000000000000000000000000000000000000000000000000000000000000000000000000000000000000000000000000000000000000000000000000000000000000000000000000000000000000000000000000000000000000000000000000000000000000000000000000000000000000000000000000000000000000000000000000000000000000000000000000000000000000000000000000000000000000000000000000000000000000000000000000000000000000000000000000000000000000000000000000000000000000000000000000000000000000000000000000000000000000000000000000000000000000000000000000000000000000000000000000000000000000000000000000000000000000000000000000000000000000000000000000000000000000000000000000000000000000000000000000000000000000000000000000000000000000000000000000#c7
 <   6> read packet: $OK#9a
 < 861> send packet: $G0000000000000000000000000000000000000000000000000000000000000000000000000000000000000000000000000000000000000000000000000000000000000000000000000000000000000000000000000000000000000000000000000000000000000000000000000000000000000000000000000000000000000000000000000000000000000000000000000000000000000000000000000000000000000000000000000000000000000000000000000000000000000000000000000000000000000000000000000000000000000000000000000000000000000000000000000000000000000000000000000000000000000000000000000000000000000000000000000000000000000000000000000000000000000000000000000000000000000000000000000000000000000000000000000000000000000000000000000000000000000000000000000000000000000000000000000000000000000000000000000000000000000000000000000000000000000000000000000000000000000000000000000000000000000000000000000000000000000000000000000000000000000000#c7
 <   6> read packet: $OK#9a
 < 861> send packet: $G0000000000000000000000000000000000000000000000000000000000000000000000000000000000000000000000000000000000000000000000000000000000000000000000000000000000000000000000000000000000000000000000000000000000000000000000000000000000000000000000000000000000000000000000000000000000000000000000000000000000000000000000000000000000000000000000000000000000000000000000000000000000000000000000000000000000000000000000000000000000000000000000000000000000000000000000000000000000000000000000000000000000000000000000000000000000000000000000000000000000000000000000000000000000000000000000000000000000000000000000000000000000000000000000000000000000000000000000000000000000000000000000000000000000000000000000000000000000000000000000000000000000000000000000000000000000000000000000000000000000000000000000000000000000000000000000000000000000000000000000000000000000000000#c7
 <   6> read packet: $OK#9a
 < 861> send packet: $G0000000000000000000000000000000000000000000000000000000000000000000000000000000000000000000000000000000000000000000000000000000000000000000000000000000000000000000000000000000000000000000000000000000000000000000000000000000000000000000000000000000000000000000000000000000000000000000000000000000000000000000000000000000000000000000000000000000000000000000000000000000000000000000000000000000000000000000000000000000000000000000000000000000000000000000000000000000000000000000000000000000000000000000000000000000000000000000000000000000000000000000000000000000000000000000000000000000000000000000000000000000000000000000000000000000000000000000000000000000000000000000000000000000000000000000000000000000000000000000000000000000000000000000000000000000000000000000000000000000000000000000000000000000000000000000000000000000000000000000000000000000000000000#c7
 <   6> read packet: $OK#9a
 < 861> send packet: $G0000000000000000000000000000000000000000000000000000000000000000000000000000000000000000000000000000000000000000000000000000000000000000000000000000000000000000000000000000000000000000000000000000000000000000000000000000000000000000000000000000000000000000000000000000000000000000000000000000000000000000000000000000000000000000000000000000000000000000000000000000000000000000000000000000000000000000000000000000000000000000000000000000000000000000000000000000000000000000000000000000000000000000000000000000000000000000000000000000000000000000000000000000000000000000000000000000000000000000000000000000000000000000000000000000000000000000000000000000000000000000000000000000000000000000000000000000000000000000000000000000000000000000000000000000000000000000000000000000000000000000000000000000000000000000000000000000000000000000000000000000000000000000#c7
 <   6> read packet: $OK#9a
 <   5> send packet: $k#6b
 <   4> read packet: $#00
 <   1> send packet: +
 history[1] tid=0x0307 <   1> send packet: +
 <  19> send packet: $QStartNoAckMode#b0
 <   1> read packet: +
 <   6> read packet: $OK#9a
 <   1> send packet: +
 <  45> send packet: $qSupported:xmlRegisters=i386,arm,mips,arc#74
 <  57> read packet: $qXfer:features:read+;PacketSize=3fff;QStartNoAckMode+#86
 <  26> send packet: $QThreadSuffixSupported#e4
 <   4> read packet: $#00
 <  27> send packet: $QListThreadsInStopReply#21
 <   4> read packet: $#00
 <  13> send packet: $qHostInfo#9b
 <  28> read packet: $ptrsize:8;endian:little;#30
 <  10> send packet: $vCont?#49
 <   4> read packet: $#00
 <  27> send packet: $qVAttachOrWaitSupported#38
 <   4> read packet: $#00
 <  23> send packet: $QEnableErrorStrings#8c
 <   6> read packet: $OK#9a
 <  16> send packet: $qProcessInfo#dc
 <   4> read packet: $#00
 <   6> send packet: $qC#b4
 <   7> read packet: $QC0#c4
 <  16> send packet: $qfThreadInfo#bb
 <   5> read packet: $l#6c
 <   5> send packet: $?#3f
 <   7> read packet: $S02#b5
 <  16> send packet: $qProcessInfo#dc
 <   4> read packet: $#00
 <  41> send packet: $qXfer:features:read:target.xml:0,3ffe#af
 <   4> read packet: $#00
 <  18> send packet: $qRegisterInfo0#72
 <   4> read packet: $#00
 <  16> send packet: $qfThreadInfo#bb
 <   5> read packet: $l#6c
 <   7> send packet: $Hg1#e0
 <   6> read packet: $OK#9a
 <   6> send packet: $p0#a0
 <  12> read packet: $00000000#80
 <  16> send packet: $qProcessInfo#dc
 <   4> read packet: $#00
 <  12> send packet: $qOffsets#4b
 <   4> read packet: $#00
 <  26> send packet: $qStructuredDataPlugins#02
 <   4> read packet: $#00
 <  13> send packet: $qSymbol::#5b
 <   6> read packet: $OK#9a
 <  16> send packet: $qfThreadInfo#bb
 <   5> read packet: $l#6c
 <  16> send packet: $qfThreadInfo#bb
 <   5> read packet: $l#6c
 <   6> send packet: $pf#d6
 <  12> read packet: $00000000#80
 <   6> send packet: $pd#d4
 <  12> read packet: $00000000#80
 <  15> send packet: $P0=00000000#3d
 <   6> read packet: $OK#9a
 <  15> send packet: $P1=00000000#3e
 <   6> read packet: $OK#9a
 <  15> send packet: $P2=00000000#3f
 <   6> read packet: $OK#9a
 <  15> send packet: $P3=00000000#40
 <   6> read packet: $OK#9a
 <  15> send packet: $P4=00000000#41
 <   6> read packet: $OK#9a
 <  15> send packet: $P5=00000000#42
 <   6> read packet: $OK#9a
 <  15> send packet: $P6=00000000#43
 <   6> read packet: $OK#9a
 <  15> send packet: $P7=00000000#44
 <   6> read packet: $OK#9a
 <  15> send packet: $P8=00000000#45
 <   6> read packet: $OK#9a
 <  15> send packet: $P9=00000000#46
 <   6> read packet: $OK#9a
 <  15> send packet: $Pa=00000000#6e
 <   6> read packet: $OK#9a
 <  15> send packet: $Pb=00000000#6f
 <   6> read packet: $OK#9a
 <  15> send packet: $Pc=00000000#70
 <   6> read packet: $OK#9a
 <  15> send packet: $Pd=00000000#71
 <   6> read packet: $OK#9a
 <  15> send packet: $Pe=00000000#72
 <   6> read packet: $OK#9a
 <  15> send packet: $Pf=00000000#73
 <   6> read packet: $OK#9a
 <  16> send packet: $P19=00000000#77
 <   6> read packet: $OK#9a
 <   5> send packet: $k#6b
 <   4> read packet: $#00
LLDB library dir: /Users/buildslave/jenkins/workspace/lldb-cmake/lldb-build/bin
LLDB import library dir: /Users/buildslave/jenkins/workspace/lldb-cmake/lldb-build/./lib
libstdcxx tests will not be run because: Don't know how to build with libstdcxx on macosx
Skipping following debug info categories: ['dwo']

Hide Details

-- Command Output (stderr): --

Hide Details

Session logs for test failures/errors/unexpected successes will go into directory '/Users/buildslave/jenkins/workspace/lldb-cmake/test/logs' Change dir to: /Users/buildslave/jenkins/workspace/lldb-cmake/llvm-project/lldb/test/API/functionalities/gdb_remote_client runCmd: settings clear -all output:

Hide Details

runCmd: settings set symbols.enable-external-lookup false output:

Hide Details

runCmd: settings set target.inherit-tcc true output:

Hide Details

runCmd: settings set target.auto-apply-fixits false output:

Hide Details

runCmd: settings set plugin.process.gdb-remote.packet-timeout 60 output:

Hide Details

runCmd: settings set symbols.clang-modules-cache-path "/Users/buildslave/jenkins/workspace/lldb-cmake/lldb-build/lldb-test-build.noindex/module-cache-lldb/lldb-api" output:

Hide Details

runCmd: settings set use-color false output:

Hide Details

runCmd: setting set target.prefer-dynamic-value no-dynamic-values output:

Hide Details

<bound method SBProcess.Kill of <lldb.SBProcess; proxy of <Swig Object of type 'lldb::SBProcess *' at 0x1055f4420> >>: success

Hide Details

PASS: LLDB (/Users/buildslave/jenkins/workspace/lldb-cmake/lldb-build/bin/clang-x86_64) :: test_attach_fail (TestGDBRemoteClient.TestGDBRemoteClient) runCmd: settings clear -all output:

Hide Details

runCmd: settings set symbols.enable-external-lookup false output:

Hide Details

runCmd: settings set target.inherit-tcc true output:

Hide Details

runCmd: settings set target.auto-apply-fixits false output:

Hide Details

runCmd: settings set plugin.process.gdb-remote.packet-timeout 60 output:

Hide Details

runCmd: settings set symbols.clang-modules-cache-path "/Users/buildslave/jenkins/workspace/lldb-cmake/lldb-build/lldb-test-build.noindex/module-cache-lldb/lldb-api" output:

Hide Details

runCmd: settings set use-color false output:

Hide Details

runCmd: setting set target.prefer-dynamic-value no-dynamic-values output:

Hide Details

FAIL: LLDB (/Users/buildslave/jenkins/workspace/lldb-cmake/lldb-build/bin/clang-x86_64) :: test_connect (TestGDBRemoteClient.TestGDBRemoteClient) <bound method SBProcess.Kill of <lldb.SBProcess; proxy of <Swig Object of type 'lldb::SBProcess *' at 0x105493bd0> >>: success

Hide Details

runCmd: settings clear -all output:

Hide Details

runCmd: settings set symbols.enable-external-lookup false output:

Hide Details

runCmd: settings set target.inherit-tcc true output:

Hide Details

runCmd: settings set target.auto-apply-fixits false output:

Hide Details

runCmd: settings set plugin.process.gdb-remote.packet-timeout 60 output:

Hide Details

runCmd: settings set symbols.clang-modules-cache-path "/Users/buildslave/jenkins/workspace/lldb-cmake/lldb-build/lldb-test-build.noindex/module-cache-lldb/lldb-api" output:

Hide Details

runCmd: settings set use-color false output:

Hide Details

runCmd: setting set target.prefer-dynamic-value no-dynamic-values output:

Hide Details

runCmd: log enable gdb-remote packets output:

Hide Details

<bound method SBProcess.Kill of <lldb.SBProcess; proxy of <Swig Object of type 'lldb::SBProcess *' at 0x1055f4420> >>: success

Hide Details

PASS: LLDB (/Users/buildslave/jenkins/workspace/lldb-cmake/lldb-build/bin/clang-x86_64) :: test_launch_fail (TestGDBRemoteClient.TestGDBRemoteClient) runCmd: settings clear -all output:

Hide Details

runCmd: settings set symbols.enable-external-lookup false output:

Hide Details

runCmd: settings set target.inherit-tcc true output:

Hide Details

runCmd: settings set target.auto-apply-fixits false output:

Hide Details

runCmd: settings set plugin.process.gdb-remote.packet-timeout 60 output:

Hide Details

runCmd: settings set symbols.clang-modules-cache-path "/Users/buildslave/jenkins/workspace/lldb-cmake/lldb-build/lldb-test-build.noindex/module-cache-lldb/lldb-api" output:

Hide Details

runCmd: settings set use-color false output:

Hide Details

runCmd: setting set target.prefer-dynamic-value no-dynamic-values output:

Hide Details

Adding tearDown hook: self.addTearDownHook(lambda: self.runCmd("settings set plugin.process.gdb-remote.use-g-packet-for-reading false"))

Hide Details

Hide Details

<bound method SBProcess.Kill of <lldb.SBProcess; proxy of <Swig Object of type 'lldb::SBProcess *' at 0x105493600> >>: success

Hide Details

Executing tearDown hook: self.addTearDownHook(lambda: self.runCmd("settings set plugin.process.gdb-remote.use-g-packet-for-reading false"))

Hide Details

Hide Details

runCmd: settings set plugin.process.gdb-remote.use-g-packet-for-reading false output:

Hide Details

PASS: LLDB (/Users/buildslave/jenkins/workspace/lldb-cmake/lldb-build/bin/clang-x86_64) :: test_read_registers_using_g_packets (TestGDBRemoteClient.TestGDBRemoteClient) runCmd: settings clear -all output:

Hide Details

runCmd: settings set symbols.enable-external-lookup false output:

Hide Details

runCmd: settings set target.inherit-tcc true output:

Hide Details

runCmd: settings set target.auto-apply-fixits false output:

Hide Details

runCmd: settings set plugin.process.gdb-remote.packet-timeout 60 output:

Hide Details

runCmd: settings set symbols.clang-modules-cache-path "/Users/buildslave/jenkins/workspace/lldb-cmake/lldb-build/lldb-test-build.noindex/module-cache-lldb/lldb-api" output:

Hide Details

runCmd: settings set use-color false output:

Hide Details

runCmd: setting set target.prefer-dynamic-value no-dynamic-values output:

Hide Details

<bound method SBProcess.Kill of <lldb.SBProcess; proxy of <Swig Object of type 'lldb::SBProcess *' at 0x1055f4420> >>: success

Hide Details

PASS: LLDB (/Users/buildslave/jenkins/workspace/lldb-cmake/lldb-build/bin/clang-x86_64) :: test_read_registers_using_p_packets (TestGDBRemoteClient.TestGDBRemoteClient) runCmd: settings clear -all output:

Hide Details

runCmd: settings set symbols.enable-external-lookup false output:

Hide Details

runCmd: settings set target.inherit-tcc true output:

Hide Details

runCmd: settings set target.auto-apply-fixits false output:

Hide Details

runCmd: settings set plugin.process.gdb-remote.packet-timeout 60 output:

Hide Details

runCmd: settings set symbols.clang-modules-cache-path "/Users/buildslave/jenkins/workspace/lldb-cmake/lldb-build/lldb-test-build.noindex/module-cache-lldb/lldb-api" output:

Hide Details

runCmd: settings set use-color false output:

Hide Details

runCmd: setting set target.prefer-dynamic-value no-dynamic-values output:

Hide Details

<bound method SBProcess.Kill of <lldb.SBProcess; proxy of <Swig Object of type 'lldb::SBProcess *' at 0x105493bd0> >>: success

Hide Details

PASS: LLDB (/Users/buildslave/jenkins/workspace/lldb-cmake/lldb-build/bin/clang-x86_64) :: test_write_registers_using_G_packets (TestGDBRemoteClient.TestGDBRemoteClient) runCmd: settings clear -all output:

Hide Details

runCmd: settings set symbols.enable-external-lookup false output:

Hide Details

runCmd: settings set target.inherit-tcc true output:

Hide Details

runCmd: settings set target.auto-apply-fixits false output:

Hide Details

runCmd: settings set plugin.process.gdb-remote.packet-timeout 60 output:

Hide Details

runCmd: settings set symbols.clang-modules-cache-path "/Users/buildslave/jenkins/workspace/lldb-cmake/lldb-build/lldb-test-build.noindex/module-cache-lldb/lldb-api" output:

Hide Details

runCmd: settings set use-color false output:

Hide Details

runCmd: setting set target.prefer-dynamic-value no-dynamic-values output:

Hide Details

<bound method SBProcess.Kill of <lldb.SBProcess; proxy of <Swig Object of type 'lldb::SBProcess *' at 0x1055f4420> >>: success

Hide Details

PASS: LLDB (/Users/buildslave/jenkins/workspace/lldb-cmake/lldb-build/bin/clang-x86_64) :: test_write_registers_using_P_packets (TestGDBRemoteClient.TestGDBRemoteClient) Restore dir to: /Users/buildslave/jenkins/workspace/lldb-cmake/lldb-build/tools/lldb/test ====================================================================== FAIL: test_connect (TestGDBRemoteClient.TestGDBRemoteClient) Test connecting to a remote gdb server ---------------------------------------------------------------------- Traceback (most recent call last): File "/Users/buildslave/jenkins/workspace/lldb-cmake/llvm-project/lldb/test/API/functionalities/gdb_remote_client/TestGDBRemoteClient.py", line 18, in test_connect process = self.connect(target) File "/Users/buildslave/jenkins/workspace/lldb-cmake/llvm-project/lldb/test/API/functionalities/gdb_remote_client/gdbclientutils.py", line 519, in connect self.assertTrue(error.Success(), error.description) AssertionError: False is not True : failed to get reply to handshake packet Config=x86_64-/Users/buildslave/jenkins/workspace/lldb-cmake/lldb-build/bin/clang ---------------------------------------------------------------------- Ran 7 tests in 106.383s

Hide Details

RESULT: FAILED (6 passes, 1 failures, 0 errors, 0 skipped, 0 expected failures, 0 unexpected successes)

Hide Details

--

Hide Details

******************** PASS: lldb-api :: functionalities/data-formatter/data-formatter-stl/libcxx/set/TestDataFormatterLibcxxSet.py (893 of 2122) PASS: lldb-unit :: Language/Highlighting/./HighlighterTests/HighlighterTest.DefaultHighlighterWithCursorOutOfBounds (894 of 2122) PASS: lldb-api :: commands/source/info/TestSourceInfo.py (895 of 2122) PASS: lldb-unit :: Utility/./UtilityTests/StringListTest.DefaultConstructor (896 of 2122) PASS: lldb-shell :: SymbolFile/dissassemble-entry-point.s (897 of 2122) PASS: lldb-shell :: SymbolFile/NativePDB/break-by-function.cpp (898 of 2122) UNSUPPORTED: lldb-api :: commands/watchpoints/multi_watchpoint_slots/TestWatchpointMultipleSlots.py (899 of 2122) PASS: lldb-unit :: Utility/./UtilityTests/RangeDataVector.FindEntryThatContains_Overlap (900 of 2122) PASS: lldb-api :: commands/watchpoints/watchpoint_count/TestWatchpointCount.py (901 of 2122) PASS: lldb-shell :: ObjectFile/PECOFF/sections-names.yaml (902 of 2122) PASS: lldb-unit :: Utility/./UtilityTests/StringListTest.ShiftCString (903 of 2122) PASS: lldb-api :: lang/objc/objc-optimized/TestObjcOptimized.py (904 of 2122) PASS: lldb-api :: macosx/save_crashlog/TestSaveCrashlog.py (905 of 2122) PASS: lldb-api :: functionalities/data-formatter/frameformat_smallstruct/TestFrameFormatSmallStruct.py (906 of 2122) PASS: lldb-unit :: ScriptInterpreter/Python/./ScriptInterpreterPythonTests/PythonDataObjectsTest.TestPythonListValueEquality (907 of 2122) PASS: lldb-api :: iohandler/unicode/TestUnicode.py (908 of 2122) PASS: lldb-api :: functionalities/gdb_remote_client/TestArmRegisterDefinition.py (909 of 2122) PASS: lldb-unit :: Utility/./UtilityTests/RangeTest.SetRangeBase (910 of 2122) PASS: lldb-shell :: SymbolFile/DWARF/find-qualified-variable.cpp (911 of 2122) PASS: lldb-unit :: Language/Highlighting/./HighlighterTests/HighlighterTest.HighlighterSelectionPath (912 of 2122) PASS: lldb-api :: functionalities/tsan/cpp_global_location/TestTsanCPPGlobalLocation.py (913 of 2122) PASS: lldb-unit :: Host/./HostTests/Host.WaitStatusFormat (914 of 2122) PASS: lldb-shell :: Minidump/Windows/find-module.test (915 of 2122) PASS: lldb-api :: functionalities/gdb_remote_client/TestNestedRegDefinitions.py (916 of 2122) PASS: lldb-unit :: Utility/./UtilityTests/OptionsWithRawTest.EmptySuffixSingleWhitespace (917 of 2122) PASS: lldb-shell :: Minidump/Windows/Sigsegv/sigsegv.test (918 of 2122) PASS: lldb-unit :: Utility/./UtilityTests/StringExtractorTest.GetHexU8_Underflow2 (919 of 2122) PASS: lldb-api :: commands/watchpoints/watchpoint_events/TestWatchpointEvents.py (920 of 2122) UNSUPPORTED: lldb-shell :: ScriptInterpreter/Lua/lua.test (921 of 2122) PASS: lldb-unit :: Expression/./ExpressionTests/DiagnosticManagerTest.AppendMessageNoDiag (922 of 2122) PASS: lldb-unit :: Utility/./UtilityTests/TimerTest.CategoryTimesStats (923 of 2122) PASS: lldb-api :: functionalities/postmortem/netbsd-core/TestNetBSDCore.py (924 of 2122) PASS: lldb-unit :: SymbolFile/DWARF/./SymbolFileDWARFTests/SymbolFileDWARFTests.TestAbbrevOrder1Start5 (925 of 2122) PASS: lldb-unit :: UnwindAssembly/x86/./UnwindAssemblyx86Tests/Testx86AssemblyInspectionEngine.TestPopR12 (926 of 2122) PASS: lldb-unit :: Utility/./UtilityTests/StringListTest.GetMaxStringLengthEmpty (927 of 2122) PASS: lldb-shell :: ObjectFile/PECOFF/basic-info-arm64.yaml (928 of 2122) PASS: lldb-api :: macosx/load-kext/TestLoadKext.py (929 of 2122) PASS: lldb-api :: commands/expression/unwind_expression/TestUnwindExpression.py (930 of 2122) PASS: lldb-unit :: UnwindAssembly/x86/./UnwindAssemblyx86Tests/Testx86AssemblyInspectionEngine.TestPopR15 (931 of 2122) UNSUPPORTED: lldb-shell :: Register/x86-64-zmm-write.test (932 of 2122) PASS: lldb-unit :: Target/./TargetTests/ModuleCacheTest.GetAndPutStrangeHostname (933 of 2122) PASS: lldb-api :: functionalities/breakpoint/cpp_exception/TestCPPExceptionBreakpoint.py (934 of 2122) PASS: lldb-unit :: Utility/./UtilityTests/UriParserTest.LongPath (935 of 2122) PASS: lldb-api :: functionalities/thread/concurrent_events/TestConcurrentCrashWithSignal.py (936 of 2122) PASS: lldb-unit :: Utility/./UtilityTests/ConstStringTest.UpdateMangledCounterpart (937 of 2122) PASS: lldb-api :: functionalities/thread/exit_during_break/TestExitDuringBreak.py (938 of 2122) PASS: lldb-api :: functionalities/data-formatter/data-formatter-objc/nsstring/TestDataFormatterNSString.py (939 of 2122) PASS: lldb-api :: functionalities/gdb_remote_client/TestNoGPacketSupported.py (940 of 2122) PASS: lldb-unit :: Utility/./UtilityTests/StreamTest.PutMaxHex64ByteOrderBig (941 of 2122) PASS: lldb-unit :: Symbol/./SymbolTests/TestClangASTImporter.MetadataPropagationAfterCopying (942 of 2122) PASS: lldb-api :: commands/expression/dollar-in-variable/TestDollarInVariable.py (943 of 2122) UNSUPPORTED: lldb-shell :: Register/x86-gp-read.test (944 of 2122) PASS: lldb-api :: commands/expression/test/TestExprs.py (945 of 2122) PASS: lldb-unit :: UnwindAssembly/x86/./UnwindAssemblyx86Tests/Testx86AssemblyInspectionEngine.TestAddRSP (946 of 2122) PASS: lldb-shell :: Reproducer/TestRelativePath.test (947 of 2122) PASS: lldb-api :: functionalities/type_lookup/TestTypeLookup.py (948 of 2122) UNSUPPORTED: lldb-api :: linux/thread/create_during_instruction_step/TestCreateDuringInstructionStep.py (949 of 2122) PASS: lldb-api :: functionalities/breakpoint/auto_continue/TestBreakpointAutoContinue.py (950 of 2122) PASS: lldb-unit :: Utility/./UtilityTests/StringListTest.PopBack (951 of 2122) PASS: lldb-api :: commands/expression/persistent_ptr_update/TestPersistentPtrUpdate.py (952 of 2122) PASS: lldb-api :: lang/cpp/unsigned_types/TestUnsignedTypes.py (953 of 2122) PASS: lldb-unit :: Utility/./UtilityTests/RangeTest.SizeTypes (954 of 2122) PASS: lldb-api :: lang/objc/forward-decl/TestForwardDecl.py (955 of 2122) PASS: lldb-unit :: Utility/./UtilityTests/EnvironmentTest.EnvpConstruction (956 of 2122) UNSUPPORTED: lldb-shell :: ScriptInterpreter/Lua/convenience_variables.test (957 of 2122) PASS: lldb-unit :: Utility/./UtilityTests/RangeTest.Slide (958 of 2122) PASS: lldb-api :: lang/c/struct_types/TestStructTypes.py (959 of 2122) PASS: lldb-api :: tools/lldb-vscode/breakpoint-events/TestVSCode_breakpointEvents.py (960 of 2122) PASS: lldb-api :: tools/lldb-vscode/coreFile/TestVSCode_coreFile.py (961 of 2122) PASS: lldb-api :: tools/lldb-server/TestGdbRemoteRegisterState.py (962 of 2122) PASS: lldb-api :: macosx/lc-note/kern-ver-str/TestKernVerStrLCNOTE.py (963 of 2122) PASS: lldb-unit :: ObjectFile/ELF/./ObjectFileELFTests/ObjectFileELFTest.SectionsResolveConsistently (964 of 2122) PASS: lldb-unit :: Utility/./UtilityTests/StringLexerTest.NextIf (965 of 2122) UNSUPPORTED: lldb-api :: commands/watchpoints/variable_out_of_scope/TestWatchedVarHitWhenInScope.py (966 of 2122) PASS: lldb-api :: lang/objc/objc-runtime-ivars/TestRuntimeIvars.py (967 of 2122) PASS: lldb-api :: commands/command/script_alias/TestCommandScriptAlias.py (968 of 2122) PASS: lldb-api :: functionalities/abbreviation/TestCommonShortSpellings.py (969 of 2122) PASS: lldb-unit :: UnwindAssembly/x86/./UnwindAssemblyx86Tests/Testx86AssemblyInspectionEngine.TestPushEAX (970 of 2122) PASS: lldb-unit :: Utility/./UtilityTests/ScalarTest.APIntConstructor (971 of 2122) PASS: lldb-api :: functionalities/breakpoint/breakpoint_language/TestBreakpointLanguage.py (972 of 2122) PASS: lldb-unit :: ScriptInterpreter/Python/./ScriptInterpreterPythonTests/PythonDataObjectsTest.TestCallable (973 of 2122) PASS: lldb-unit :: Target/./TargetTests/PathMappingListTest.RelativeTests (974 of 2122) PASS: lldb-shell :: SymbolFile/NativePDB/globals-fundamental.cpp (975 of 2122) PASS: lldb-unit :: Utility/./UtilityTests/OptionsWithRawTest.UnterminatedQuote (976 of 2122) PASS: lldb-unit :: Core/./LLDBCoreTests/SourceFileCache.FindSourceFileFound (977 of 2122) PASS: lldb-api :: python_api/disassemble-raw-data/TestDisassemble_VST1_64.py (978 of 2122) PASS: lldb-unit :: Utility/./UtilityTests/StringListTest.ShiftMove (979 of 2122) PASS: lldb-api :: commands/expression/entry-bp/TestExprEntryBP.py (980 of 2122) UNSUPPORTED: lldb-shell :: Register/x86-64-ymm16-write.test (981 of 2122) PASS: lldb-api :: macosx/order/TestOrderFile.py (982 of 2122) PASS: lldb-unit :: UnwindAssembly/x86/./UnwindAssemblyx86Tests/Testx86AssemblyInspectionEngine.TestStackRealign8BitDisp_i386 (983 of 2122) PASS: lldb-unit :: Utility/./UtilityTests/VMRange.CollectionContains (984 of 2122) PASS: lldb-api :: functionalities/data-formatter/data-formatter-stl/libcxx/variant/TestDataFormatterLibcxxVariant.py (985 of 2122) PASS: lldb-unit :: Utility/./UtilityTests/CompletionRequest.TryCompleteCurrentArgBad (986 of 2122) PASS: lldb-unit :: Utility/./UtilityTests/ArgsTest.TestAppendArg (987 of 2122) PASS: lldb-shell :: SymbolFile/Breakpad/line-table-mixed-path-styles.test (988 of 2122) PASS: lldb-unit :: SymbolFile/NativePDB/./SymbolFileNativePDBTests/PDBFPOProgramToDWARFExpressionTests.UnknownOp (989 of 2122) PASS: lldb-shell :: Reproducer/TestVersionCheck.test (990 of 2122) PASS: lldb-api :: tools/lldb-vscode/stackTrace/TestVSCode_stackTrace.py (991 of 2122) PASS: lldb-api :: functionalities/data-formatter/data-formatter-globals/TestDataFormatterGlobals.py (992 of 2122) PASS: lldb-unit :: Utility/./UtilityTests/UriParserTest.BracketedHostnameWithPortIPv6 (993 of 2122) PASS: lldb-unit :: Symbol/./SymbolTests/TestTypeSystemClang.TestGetBasicTypeFromName (994 of 2122) UNSUPPORTED: lldb-api :: functionalities/data-formatter/data-formatter-stl/libstdcpp/tuple/TestDataFormatterStdTuple.py (995 of 2122) PASS: lldb-unit :: Process/minidump/./LLDBMinidumpTests/MinidumpParserTest.GetFilteredModuleList (996 of 2122) PASS: lldb-unit :: Utility/./UtilityTests/StringExtractorTest.GetHexU8_Exact (997 of 2122) PASS: lldb-unit :: SymbolFile/NativePDB/./SymbolFileNativePDBTests/PDBFPOProgramToDWARFExpressionTests.InvalidOpUnary (998 of 2122) PASS: lldb-unit :: Symbol/./SymbolTests/TestClangASTImporter.RecordLayout (999 of 2122) PASS: lldb-api :: lang/objc/rdar-10967107/TestRdar10967107.py (1000 of 2122) PASS: lldb-unit :: Utility/./UtilityTests/UriParserTest.BracketedHostnamePort (1001 of 2122) PASS: lldb-unit :: Process/minidump/./LLDBMinidumpTests/MinidumpParserTest.GetMemory (1002 of 2122) PASS: lldb-shell :: Process/UnsupportedLanguage.test (1003 of 2122) PASS: lldb-unit :: Utility/./UtilityTests/AnsiTerminal.Unknown (1004 of 2122) PASS: lldb-unit :: Symbol/./SymbolTests/TestTypeSystemClang.TestDeletingImplicitCopyCstrDueToMoveCStr (1005 of 2122) PASS: lldb-api :: lang/objc/objc-ivar-stripped/TestObjCIvarStripped.py (1006 of 2122) PASS: lldb-unit :: Utility/./UtilityTests/XcodeSDKTest.ParseTest (1007 of 2122) PASS: lldb-unit :: Language/Highlighting/./HighlighterTests/HighlighterTest.FallbackHighlighter (1008 of 2122) PASS: lldb-shell :: SymbolFile/DWARF/dwarf5-atomic.s (1009 of 2122) PASS: lldb-shell :: Reproducer/Functionalities/TestDataFormatter.test (1010 of 2122) PASS: lldb-unit :: Utility/./UtilityTests/SerializationRountripTest.SerializeDeserializeCString (1011 of 2122) PASS: lldb-api :: functionalities/plugins/python_os_plugin/stepping_plugin_threads/TestOSPluginStepping.py (1012 of 2122) PASS: lldb-api :: lang/cpp/template/TestTemplateArgs.py (1013 of 2122) PASS: lldb-unit :: Utility/./UtilityTests/OptionsWithRawTest.ArgsButNoLeadingDash (1014 of 2122) PASS: lldb-unit :: Utility/./UtilityTests/RecordReplayTest.InstrumentedFooSameThis (1015 of 2122) PASS: lldb-api :: functionalities/data-formatter/boolreference/TestFormattersBoolRefPtr.py (1016 of 2122) PASS: lldb-shell :: ObjectFile/ELF/PT_LOAD-overlap.yaml (1017 of 2122) PASS: lldb-api :: functionalities/data-formatter/data-formatter-stl/libcxx/tuple/TestDataFormatterLibcxxTuple.py (1018 of 2122) PASS: lldb-api :: lang/cpp/class_types/TestClassTypes.py (1019 of 2122) PASS: lldb-unit :: Utility/./UtilityTests/StringLexerTest.GetUnlexed (1020 of 2122) PASS: lldb-api :: commands/expression/import-std-module/shared_ptr/TestSharedPtrFromStdModule.py (1021 of 2122) PASS: lldb-unit :: UnwindAssembly/x86/./UnwindAssemblyx86Tests/Testx86AssemblyInspectionEngine.TestStackRealignMSVC_i386 (1022 of 2122) PASS: lldb-api :: functionalities/gdb_remote_client/TestGDBRemoteLoad.py (1023 of 2122) PASS: lldb-api :: functionalities/ptr_refs/TestPtrRefs.py (1024 of 2122) PASS: lldb-api :: functionalities/data-formatter/data-formatter-caching/TestDataFormatterCaching.py (1025 of 2122) PASS: lldb-unit :: Utility/./UtilityTests/ScalarTest.GetValue (1026 of 2122) PASS: lldb-unit :: Utility/./UtilityTests/StreamTest.AddressPrefix (1027 of 2122) PASS: lldb-api :: commands/frame/diagnose/dereference-function-return/TestDiagnoseDereferenceFunctionReturn.py (1028 of 2122) PASS: lldb-unit :: Utility/./UtilityTests/StreamTest.AddressRange (1029 of 2122) PASS: lldb-unit :: Platform/./LLDBPlatformTests/PlatformDarwinTest.FindComponentInPath (1030 of 2122) PASS: lldb-api :: functionalities/ubsan/basic/TestUbsanBasic.py (1031 of 2122) PASS: lldb-api :: commands/breakpoint/command/list/TestBreakpointCommandList.py (1032 of 2122) PASS: lldb-unit :: Utility/./UtilityTests/GeneratorTest.GetOrCreate (1033 of 2122) PASS: lldb-unit :: Target/./TargetTests/ModuleCacheTest.GetAndPutUuidExists (1034 of 2122) PASS: lldb-shell :: SymbolFile/Breakpad/stack-cfi-parsing.test (1035 of 2122) PASS: lldb-api :: commands/expression/po_verbosity/TestPoVerbosity.py (1036 of 2122) PASS: lldb-unit :: ObjectFile/Breakpad/./ObjectFileBreakpadTests/Record.classify (1037 of 2122) PASS: lldb-api :: functionalities/data-formatter/data-formatter-objc/TestDataFormatterObjCExpr.py (1038 of 2122) PASS: lldb-unit :: Process/minidump/./LLDBMinidumpTests/MinidumpParserTest.GetMemoryRegionInfo (1039 of 2122) PASS: lldb-api :: functionalities/thread/concurrent_events/TestConcurrentSignalNWatchNBreak.py (1040 of 2122) PASS: lldb-api :: lang/cpp/chained-calls/TestCppChainedCalls.py (1041 of 2122) PASS: lldb-api :: functionalities/data-formatter/data-formatter-synth/TestDataFormatterSynth.py (1042 of 2122) PASS: lldb-unit :: Host/./HostTests/SocketTest.TCPGetAddress (1043 of 2122) UNSUPPORTED: lldb-shell :: SymbolFile/PDB/calling-conventions.test (1044 of 2122) PASS: lldb-unit :: Utility/./UtilityTests/UriParserTest.BadPort2 (1045 of 2122) PASS: lldb-api :: commands/expression/pr35310/TestExprsBug35310.py (1046 of 2122) PASS: lldb-api :: functionalities/gdb_remote_client/TestProcessConnect.py (1047 of 2122) PASS: lldb-api :: terminal/TestEditline.py (1048 of 2122) PASS: lldb-unit :: Utility/./UtilityTests/StringExtractorTest.GetNameColonValueContainsColon (1049 of 2122) PASS: lldb-api :: lang/c/complex/TestComplexC99.py (1050 of 2122) PASS: lldb-unit :: Utility/./UtilityTests/StringListTest.AppendStringStdString (1051 of 2122) PASS: lldb-api :: commands/gui/invalid-args/TestInvalidArgsGui.py (1052 of 2122) UNSUPPORTED: lldb-api :: functionalities/darwin_log/filter/regex/subsystem/TestDarwinLogFilterRegexSubsystem.py (1053 of 2122) PASS: lldb-api :: functionalities/type_completion/TestTypeCompletion.py (1054 of 2122) PASS: lldb-api :: lang/cpp/member-and-local-vars-with-same-name/TestMembersAndLocalsWithSameName.py (1055 of 2122) PASS: lldb-unit :: Symbol/./SymbolTests/TestTypeSystemClang.TestGetTypeClassNested (1056 of 2122) PASS: lldb-unit :: Utility/./UtilityTests/DataExtractorTest.GetMaxU64_unchecked (1057 of 2122) PASS: lldb-unit :: Utility/./UtilityTests/StringExtractorTest.GetHexBytesAvail_Partial (1058 of 2122) PASS: lldb-unit :: Expression/./ExpressionTests/CppModuleConfigurationTest.UnknownLibCppFile (1059 of 2122) PASS: lldb-unit :: Symbol/./SymbolTests/TestTypeSystemClang.TestOwningModule (1060 of 2122) UNSUPPORTED: lldb-api :: functionalities/data-formatter/data-formatter-stl/libstdcpp/iterator/TestDataFormatterStdIterator.py (1061 of 2122) PASS: lldb-shell :: Commands/command-regex-delete.test (1062 of 2122) PASS: lldb-api :: functionalities/data-formatter/data-formatter-stl/libcxx/optional/TestDataFormatterLibcxxOptional.py (1063 of 2122) PASS: lldb-unit :: ScriptInterpreter/Python/./ScriptInterpreterPythonTests/PythonDataObjectsTest.TestExceptions (1064 of 2122) PASS: lldb-api :: commands/session/save/TestSessionSave.py (1065 of 2122) PASS: lldb-api :: python_api/sbenvironment/TestSBEnvironment.py (1066 of 2122) PASS: lldb-unit :: Expression/./ExpressionTests/DiagnosticManagerTest.AppendMessageSubsequentDiags (1067 of 2122) PASS: lldb-unit :: Utility/./UtilityTests/SerializationRountripTest.SerializeDeserializeCStringArray (1068 of 2122) PASS: lldb-api :: python_api/sbplatform/TestSBPlatform.py (1069 of 2122) UNSUPPORTED: lldb-shell :: Register/x86-zmm-write.test (1070 of 2122) PASS: lldb-unit :: Symbol/./SymbolTests/TestClangASTImporter.ImportInvalidType (1071 of 2122) PASS: lldb-unit :: Utility/./UtilityTests/StreamTest.AddressPrefixAndSuffix (1072 of 2122) PASS: lldb-api :: commands/gui/viewlarge/TestGuiViewLarge.py (1073 of 2122) PASS: lldb-unit :: Utility/./UtilityTests/AnsiTerminal.KnownPrefix (1074 of 2122) PASS: lldb-api :: functionalities/load_using_paths/TestLoadUsingPaths.py (1075 of 2122) PASS: lldb-unit :: Utility/./UtilityTests/DataExtractorTest.GetCStrAtNullOffset (1076 of 2122) PASS: lldb-unit :: Signals/./SignalsTests/UnixSignalsTest.GetInfo (1077 of 2122) PASS: lldb-api :: commands/target/stop-hook/disable/TestTargetStopHookDisable.py (1078 of 2122) PASS: lldb-api :: functionalities/gdb_remote_client/TestqOffsets.py (1079 of 2122) PASS: lldb-api :: commands/expression/static-initializers/TestStaticInitializers.py (1080 of 2122) PASS: lldb-unit :: Utility/./UtilityTests/BinaryStreamTest.PutSLEB128EightBytes (1081 of 2122) PASS: lldb-unit :: Utility/./UtilityTests/ReproducerTest.SetCapture (1082 of 2122) PASS: lldb-unit :: Utility/./UtilityTests/RangeTest.DoesIntersect (1083 of 2122) PASS: lldb-unit :: Utility/./UtilityTests/ConstStringTest.CompareStringRef (1084 of 2122) PASS: lldb-unit :: Expression/./ExpressionTests/CppModuleConfigurationTest.AmbiguousLibCpp (1085 of 2122) PASS: lldb-api :: commands/frame/recognizer/TestFrameRecognizer.py (1086 of 2122) PASS: lldb-api :: functionalities/data-formatter/type_summary_list_script/TestTypeSummaryListScript.py (1087 of 2122) PASS: lldb-unit :: Symbol/./SymbolTests/LineEntryTest.GetSameLineContiguousAddressRangeNoInlines (1088 of 2122) UNSUPPORTED: lldb-api :: benchmarks/frame_variable/TestFrameVariableResponse.py (1089 of 2122) PASS: lldb-shell :: Minidump/memory-region-from-module.yaml (1090 of 2122) PASS: lldb-unit :: UnwindAssembly/ARM64/./Arm64InstEmulationTests/TestArm64InstEmulation.TestCFARegisterTrackedAcrossJumps (1091 of 2122) PASS: lldb-api :: lang/objc/objc-ivar-protocols/TestIvarProtocols.py (1092 of 2122) PASS: lldb-shell :: BuildScript/compiler-full-path.test (1093 of 2122) PASS: lldb-unit :: Utility/./UtilityTests/LogChannelEnabledTest.LogThread (1094 of 2122) PASS: lldb-unit :: Utility/./UtilityTests/RangeTest.Clear (1095 of 2122) PASS: lldb-unit :: Utility/./UtilityTests/StringExtractorTest.GetHexBytes (1096 of 2122) PASS: lldb-unit :: Process/minidump/./LLDBMinidumpTests/MinidumpParserTest.MinidumpDuplicateModuleMinAddress (1097 of 2122) PASS: lldb-api :: macosx/add-dsym/TestAddDsymMidExecutionCommand.py (1098 of 2122) PASS: lldb-api :: python_api/value/empty_class/TestValueAPIEmptyClass.py (1099 of 2122) PASS: lldb-api :: commands/apropos/with-process/TestAproposWithProcess.py (1100 of 2122) PASS: lldb-unit :: Utility/./UtilityTests/StreamTest.PutChar (1101 of 2122) PASS: lldb-unit :: Utility/./UtilityTests/RangeVector.CombineConsecutiveRanges (1102 of 2122) PASS: lldb-unit :: Utility/./UtilityTests/StringExtractorTest.GetHexU8_InvalidHex (1103 of 2122) PASS: lldb-api :: tools/lldb-server/TestGdbRemote_qThreadStopInfo.py (1104 of 2122) PASS: lldb-shell :: SymbolFile/Breakpad/unwind-via-stack-win-no-memory-info.yaml (1105 of 2122) PASS: lldb-api :: functionalities/memory/cache/TestMemoryCache.py (1106 of 2122) PASS: lldb-api :: lang/cpp/operators/TestCppOperators.py (1107 of 2122) UNSUPPORTED: lldb-shell :: Expr/TestIRMemoryMapWindows.test (1108 of 2122) PASS: lldb-shell :: Reproducer/TestProcessList.test (1109 of 2122) PASS: lldb-api :: python_api/process/read-mem-cstring/TestReadMemCString.py (1110 of 2122) PASS: lldb-api :: functionalities/plugins/command_plugin/TestPluginCommands.py (1111 of 2122) PASS: lldb-api :: terminal/TestSTTYBeforeAndAfter.py (1112 of 2122) PASS: lldb-unit :: Language/Highlighting/./HighlighterTests/HighlighterTest.ClangOperators (1113 of 2122) PASS: lldb-shell :: SymbolFile/Breakpad/line-table-edgecases.test (1114 of 2122) PASS: lldb-shell :: ObjectFile/wasm/unified-debug-sections.yaml (1115 of 2122) PASS: lldb-unit :: Symbol/./SymbolTests/TestTypeSystemClang.TestRecordHasFields (1116 of 2122) PASS: lldb-unit :: Utility/./UtilityTests/OptionsWithRawTest.EmptyArgsOnlySuffix (1117 of 2122) PASS: lldb-unit :: Symbol/./SymbolTests/TestTypeSystemClang.TestDisplayName (1118 of 2122) PASS: lldb-api :: lang/cpp/frame-var-anon-unions/TestFrameVariableAnonymousUnions.py (1119 of 2122) PASS: lldb-api :: lang/cpp/overloaded-functions/TestOverloadedFunctions.py (1120 of 2122) PASS: lldb-unit :: Utility/./UtilityTests/BinaryStreamTest.PutULEB128Zero (1121 of 2122) PASS: lldb-shell :: SymbolFile/NativePDB/function-types-classes.cpp (1122 of 2122) PASS: lldb-unit :: Host/./HostTests/HostInfoTest.GetHostname (1123 of 2122) UNSUPPORTED: lldb-shell :: Register/x86-ymm-read.test (1124 of 2122) PASS: lldb-api :: functionalities/inferior-crashing/TestInferiorCrashingStep.py (1125 of 2122) PASS: lldb-unit :: SymbolFile/DWARF/./SymbolFileDWARFTests/XcodeSDKModuleTests.TestModuleGetXcodeSDK (1126 of 2122) UNSUPPORTED: lldb-api :: lang/cpp/static_members/TestCPPStaticMembers.py (1127 of 2122) PASS: lldb-api :: functionalities/lazy-loading/TestLazyLoading.py (1128 of 2122) PASS: lldb-unit :: Host/./HostTests/FileSystemTest.GetPermissions (1129 of 2122) PASS: lldb-unit :: Utility/./UtilityTests/StreamTeeTest.Flush (1130 of 2122) PASS: lldb-unit :: DataFormatter/./LLDBFormatterTests/TypeMatcherTests.GetMatchStringExactName (1131 of 2122) PASS: lldb-api :: functionalities/tsan/multiple/TestTsanMultiple.py (1132 of 2122) PASS: lldb-api :: python_api/sblaunchinfo/TestSBLaunchInfo.py (1133 of 2122) PASS: lldb-api :: functionalities/thread/backtrace_all/TestBacktraceAll.py (1134 of 2122) PASS: lldb-shell :: Driver/TestFile.test (1135 of 2122) PASS: lldb-unit :: Language/Highlighting/./HighlighterTests/HighlighterTest.ClangTrailingBackslashWithWhitespace (1136 of 2122) PASS: lldb-api :: lang/objc/objc-foundation-dictionary-empty/TestNSDictionary0.py (1137 of 2122) PASS: lldb-shell :: ObjectFile/ELF/netbsd-exec-8.99.30-amd64.yaml (1138 of 2122) PASS: lldb-shell :: SymbolFile/DWARF/dir-separator-posix.s (1139 of 2122) PASS: lldb-api :: functionalities/multiword-commands/TestMultiWordCommands.py (1140 of 2122) PASS: lldb-shell :: SymbolFile/DWARF/debug-types-line-tables.s (1141 of 2122) PASS: lldb-unit :: Symbol/./SymbolTests/TestTypeSystemClang.TestGetTypeClassDeclType (1142 of 2122) PASS: lldb-shell :: Process/TestEnvironment.test (1143 of 2122) PASS: lldb-api :: functionalities/gdb_remote_client/TestTargetXMLArch.py (1144 of 2122) PASS: lldb-shell :: SymbolFile/NativePDB/disassembly.cpp (1145 of 2122) PASS: lldb-unit :: Utility/./UtilityTests/ProcessInstanceInfoList.Yaml (1146 of 2122) UNSUPPORTED: lldb-api :: lang/cpp/printf/TestPrintf.py (1147 of 2122) PASS: lldb-api :: lang/c/stepping/TestStepAndBreakpoints.py (1148 of 2122) PASS: lldb-unit :: Utility/./UtilityTests/AnsiTerminal.Incomplete (1149 of 2122) PASS: lldb-unit :: Utility/./UtilityTests/StringExtractorTest.GetU32BigEndian (1150 of 2122) PASS: lldb-api :: sample_test/TestSampleTest.py (1151 of 2122) PASS: lldb-api :: python_api/sbvalue_const_addrof/TestSBValueConstAddrOf.py (1152 of 2122) PASS: lldb-unit :: Target/./TargetTests/MemoryRegionInfoTest.Formatv (1153 of 2122) PASS: lldb-shell :: ObjectFile/ELF/netbsd-core-amd64.test (1154 of 2122) UNSUPPORTED: lldb-shell :: Register/x86-64-xmm16-write.test (1155 of 2122) PASS: lldb-shell :: Settings/TestFrameFormatMangling.test (1156 of 2122) PASS: lldb-unit :: Utility/./UtilityTests/LogChannelEnabledTest.log_options (1157 of 2122) PASS: lldb-shell :: Breakpoint/split-dwarf5-debug-stroffsets.test (1158 of 2122) PASS: lldb-shell :: ScriptInterpreter/Python/sb_address_exception.test (1159 of 2122) PASS: lldb-api :: commands/expression/expr-in-syscall/TestExpressionInSyscall.py (1160 of 2122) PASS: lldb-api :: commands/platform/basic/TestPlatformPython.py (1161 of 2122) PASS: lldb-unit :: Utility/./UtilityTests/StringListTest.ForRangeEmpty (1162 of 2122) PASS: lldb-unit :: UnwindAssembly/x86/./UnwindAssemblyx86Tests/Testx86AssemblyInspectionEngine.TestReturnDetect (1163 of 2122) PASS: lldb-unit :: UnwindAssembly/x86/./UnwindAssemblyx86Tests/Testx86AssemblyInspectionEngine.Test32BitOnlyInstruction (1164 of 2122) PASS: lldb-unit :: Utility/./UtilityTests/LogTest.LLDB_LOG_nullptr (1165 of 2122) UNSUPPORTED: lldb-shell :: ScriptInterpreter/Lua/watchpoint_callback.test (1166 of 2122) PASS: lldb-unit :: Host/./HostTests/MainLoopTest.Signal (1167 of 2122) PASS: lldb-unit :: Language/Highlighting/./HighlighterTests/HighlighterTest.ClangCursorPosBeforeOtherToken (1168 of 2122) PASS: lldb-api :: functionalities/thread/jump/TestThreadJump.py (1169 of 2122) PASS: lldb-api :: commands/expression/ignore-artificial-constructors/TestIgnoreArtificialConstructors.py (1170 of 2122) PASS: lldb-api :: commands/expression/xvalue/TestXValuePrinting.py (1171 of 2122) PASS: lldb-unit :: Target/./TargetTests/RemoteAwarePlatformTest.TestResolveExecutabelOnClientByPlatform (1172 of 2122) PASS: lldb-api :: functionalities/multidebugger_commands/TestMultipleDebuggersCommands.py (1173 of 2122) PASS: lldb-unit :: Host/./HostTests/FileSystemTest.EmptyTest (1174 of 2122) PASS: lldb-unit :: Utility/./UtilityTests/CompletionRequest.Constructor (1175 of 2122) PASS: lldb-api :: commands/watchpoints/watchpoint_commands/command/TestWatchpointCommandLLDB.py (1176 of 2122) PASS: lldb-unit :: UnwindAssembly/x86/./UnwindAssemblyx86Tests/Testx86AssemblyInspectionEngine.TestMovRSPtoRBP (1177 of 2122) UNSUPPORTED: lldb-shell :: SymbolFile/PDB/variables.test (1178 of 2122) PASS: lldb-api :: commands/expression/function_template_specialization_temp_args/TestFunctionTemplateSpecializationTempArgs.py (1179 of 2122) PASS: lldb-unit :: Utility/./UtilityTests/VMRange.ContainsAddr (1180 of 2122) PASS: lldb-api :: commands/target/stop-hook/enable/TestTargetStopHookEnable.py (1181 of 2122) PASS: lldb-api :: lang/cpp/alignas_base_class/TestAlignAsBaseClass.py (1182 of 2122) PASS: lldb-api :: functionalities/breakpoint/address_breakpoints/TestBadAddressBreakpoints.py (1183 of 2122) PASS: lldb-unit :: ScriptInterpreter/Python/./ScriptInterpreterPythonTests/PythonDataObjectsTest.TestPythonTupleToStructuredList (1184 of 2122) PASS: lldb-unit :: Host/./HostTests/NativeProcessProtocolTest.SetBreakpointFailWrite (1185 of 2122) PASS: lldb-api :: lang/objc/foundation/TestObjCMethodsString.py (1186 of 2122) PASS: lldb-shell :: ObjectFile/PECOFF/basic-info-arm.yaml (1187 of 2122) PASS: lldb-unit :: Utility/./UtilityTests/ArgsTest.GetArgumentArrayRef (1188 of 2122) PASS: lldb-api :: functionalities/data-formatter/user-format-vs-summary/TestUserFormatVsSummary.py (1189 of 2122) PASS: lldb-shell :: ObjectFile/PECOFF/invalid-export-table.yaml (1190 of 2122) PASS: lldb-api :: types/TestIntegerTypeExpr.py (1191 of 2122) PASS: lldb-unit :: Utility/./UtilityTests/StreamTest.Indent (1192 of 2122) PASS: lldb-api :: lang/cpp/bool/TestCPPBool.py (1193 of 2122) UNSUPPORTED: lldb-api :: functionalities/thread/multi_break/TestMultipleBreakpoints.py (1194 of 2122) PASS: lldb-api :: python_api/findvalue_duplist/TestSBFrameFindValue.py (1195 of 2122) PASS: lldb-unit :: Utility/./UtilityTests/StringListTest.JoinMultiCharSeparator (1196 of 2122) PASS: lldb-api :: tools/lldb-server/inferior-crash/TestGdbRemoteSegFault.py (1197 of 2122) PASS: lldb-unit :: Symbol/./SymbolTests/Type.CompilerContextPattern (1198 of 2122) PASS: lldb-unit :: Core/./LLDBCoreTests/MangledTest.ResultForBlockInvocation (1199 of 2122) UNSUPPORTED: lldb-shell :: SymbolFile/PDB/udt-layout.test (1200 of 2122) PASS: lldb-api :: python_api/exprpath_synthetic/TestExprPathSynthetic.py (1201 of 2122) PASS: lldb-unit :: Utility/./UtilityTests/ArchSpecTest.TestParseMachCPUDashSubtypeTripleSimple (1202 of 2122) PASS: lldb-unit :: UnwindAssembly/x86/./UnwindAssemblyx86Tests/Testx86AssemblyInspectionEngine.TestSpArithx86_64Augmented (1203 of 2122) PASS: lldb-unit :: Expression/./ExpressionTests/ClangExpressionDeclMapTest.TestUnknownIdentifierLookup (1204 of 2122) PASS: lldb-unit :: Utility/./UtilityTests/BroadcasterTest.BroadcastEvent (1205 of 2122) PASS: lldb-api :: commands/expression/multiline-navigation/TestMultilineNavigation.py (1206 of 2122) PASS: lldb-api :: functionalities/tail_call_frames/cross_object/TestCrossObjectTailCalls.py (1207 of 2122) PASS: lldb-api :: functionalities/data-formatter/data-formatter-stl/libcxx/vbool/TestDataFormatterLibcxxVBool.py (1208 of 2122) PASS: lldb-api :: lang/objc/self/TestObjCSelf.py (1209 of 2122) PASS: lldb-api :: functionalities/recursion/TestValueObjectRecursion.py (1210 of 2122) PASS: lldb-unit :: Utility/./UtilityTests/ArgsTest.EscapeLLDBCommandArgument (1211 of 2122) PASS: lldb-api :: commands/expression/import-std-module/list-dbg-info-content/TestDbgInfoContentListFromStdModule.py (1212 of 2122) PASS: lldb-unit :: Expression/./ExpressionTests/DWARFExpression.DW_OP_unknown (1213 of 2122) PASS: lldb-unit :: UnwindAssembly/x86/./UnwindAssemblyx86Tests/Testx86AssemblyInspectionEngine.Testi386IgnoredRegisters (1214 of 2122) PASS: lldb-api :: lang/cpp/this/TestCPPThis.py (1215 of 2122) PASS: lldb-api :: lang/cpp/dynamic-value/TestCppValueCast.py (1216 of 2122) PASS: lldb-unit :: SymbolFile/NativePDB/./SymbolFileNativePDBTests/PDBFPOProgramToDWARFExpressionTests.UnresolvedDependentCyclicRegisterAssignmentReference (1217 of 2122) PASS: lldb-unit :: Utility/./UtilityTests/StringListTest.Join (1218 of 2122) PASS: lldb-unit :: Process/minidump/./LLDBMinidumpTests/MinidumpParserTest.GetArchitecture (1219 of 2122) PASS: lldb-api :: functionalities/data-formatter/nssetsynth/TestNSSetSynthetic.py (1220 of 2122) PASS: lldb-unit :: Platform/./LLDBPlatformTests/PlatformDarwinTest.TestParseVersionBuildDir (1221 of 2122) PASS: lldb-shell :: Settings/TestDisassemblyFormat.test (1222 of 2122) PASS: lldb-api :: iohandler/resize/TestIOHandlerResizeNoEditline.py (1223 of 2122) PASS: lldb-api :: tools/lldb-server/commandline/TestStubSetSID.py (1224 of 2122) PASS: lldb-unit :: Utility/./UtilityTests/StreamTest.AddressRangeInvalidRange (1225 of 2122) PASS: lldb-api :: functionalities/data-formatter/data-formatter-objc/nsindexpath/TestDataFormatterNSIndexPath.py (1226 of 2122) PASS: lldb-api :: functionalities/gdb_remote_client/TestWasm.py (1227 of 2122) PASS: lldb-unit :: Language/Highlighting/./HighlighterTests/HighlighterTest.ClangPreserveNewLine (1228 of 2122) UNSUPPORTED: lldb-shell :: SymbolFile/PDB/function-level-linking.test (1229 of 2122) PASS: lldb-unit :: Process/minidump/./LLDBMinidumpTests/MinidumpParserTest.GetMiscInfo_no_stream (1230 of 2122) PASS: lldb-unit :: Utility/./UtilityTests/StreamTest.PutHex16ByteOrderLittle (1231 of 2122) PASS: lldb-unit :: Utility/./UtilityTests/StreamTest.PutBytesAsRawHex8ToMixedEndian (1232 of 2122) UNSUPPORTED: lldb-shell :: BuildScript/toolchain-clang-cl.test (1233 of 2122) PASS: lldb-api :: functionalities/breakpoint/address_breakpoints/TestAddressBreakpoints.py (1234 of 2122) PASS: lldb-unit :: Utility/./UtilityTests/UUIDTest.SetFromStringRef (1235 of 2122) PASS: lldb-shell :: SymbolFile/Breakpad/line-table-discontinuous-file-ids.test (1236 of 2122) PASS: lldb-unit :: Utility/./UtilityTests/RangeTest.Union (1237 of 2122) PASS: lldb-unit :: Interpreter/./InterpreterTests/CompletionTest.FileCompletionAbsolute (1238 of 2122) PASS: lldb-unit :: Utility/./UtilityTests/StringListTest.Assignment (1239 of 2122) PASS: lldb-shell :: ObjectFile/ELF/PT_LOAD-overlap-PT_TLS.yaml (1240 of 2122) UNSUPPORTED: lldb-api :: functionalities/breakpoint/hardware_breakpoints/write_memory_with_hw_breakpoint/TestWriteMemoryWithHWBreakpoint.py (1241 of 2122) PASS: lldb-unit :: UnwindAssembly/x86/./UnwindAssemblyx86Tests/Testx86AssemblyInspectionEngine.TestPopR14 (1242 of 2122) PASS: lldb-unit :: Utility/./UtilityTests/RegularExpression.CopyAssignment (1243 of 2122) PASS: lldb-api :: tools/lldb-server/TestGdbRemoteExpeditedRegisters.py (1244 of 2122) PASS: lldb-shell :: SymbolFile/DWARF/debug-types-dwarf5.s (1245 of 2122) PASS: lldb-unit :: Utility/./UtilityTests/FileSpecTest.OperatorBool (1246 of 2122) PASS: lldb-unit :: Utility/./UtilityTests/CompletionRequest.TestCompletionOwnership (1247 of 2122) PASS: lldb-unit :: Language/Highlighting/./HighlighterTests/HighlighterTest.ClangScalarLiterals (1248 of 2122) PASS: lldb-shell :: SymbolFile/NativePDB/function-types-calling-conv.cpp (1249 of 2122) PASS: lldb-unit :: Utility/./UtilityTests/UriParserTest.MinimalPort (1250 of 2122) UNSUPPORTED: lldb-shell :: ScriptInterpreter/Lua/independent_state.test (1251 of 2122) PASS: lldb-shell :: ObjectFile/ELF/minidebuginfo-corrupt-xz.yaml (1252 of 2122) PASS: lldb-unit :: Utility/./UtilityTests/StreamTeeTest.GetStreamAtIndexOutOfBounds (1253 of 2122) PASS: lldb-shell :: SymbolFile/DWARF/debug-types-signature-loop.s (1254 of 2122) PASS: lldb-api :: lang/cpp/unicode-literals/TestUnicodeLiterals.py (1255 of 2122) PASS: lldb-api :: tools/lldb-server/register-reading/TestGdbRemoteGPacket.py (1256 of 2122) PASS: lldb-api :: tools/lldb-vscode/breakpoint/TestVSCode_setFunctionBreakpoints.py (1257 of 2122) PASS: lldb-api :: commands/expression/radar_9531204/TestPrintfAfterUp.py (1258 of 2122) PASS: lldb-unit :: Utility/./UtilityTests/ArgsTest.ReplaceArgumentAtIndexLonger (1259 of 2122) PASS: lldb-api :: commands/platform/file/read/TestPlatformFileRead.py (1260 of 2122) PASS: lldb-unit :: Host/./HostTests/MainLoopTest.TerminatesImmediately (1261 of 2122) PASS: lldb-shell :: SymbolFile/DWARF/gnu-style-compression.cpp (1262 of 2122) PASS: lldb-unit :: Process/gdb-remote/./ProcessGdbRemoteTests/GDBRemoteCommunicationClientTest.GetModulesInfo_UUID20 (1263 of 2122) PASS: lldb-api :: python_api/name_lookup/TestNameLookup.py (1264 of 2122) PASS: lldb-api :: commands/expression/import-std-module/unique_ptr-dbg-info-content/TestUniquePtrDbgInfoContent.py (1265 of 2122) PASS: lldb-unit :: Target/./TargetTests/ModuleCacheTest.GetAndPut (1266 of 2122) PASS: lldb-api :: functionalities/data-formatter/data-formatter-objc/cmtime/TestDataFormatterCMTime.py (1267 of 2122) PASS: lldb-api :: lang/c/conflicting-symbol/TestConflictingSymbol.py (1268 of 2122) PASS: lldb-api :: python_api/lldbutil/TestSwigVersion.py (1269 of 2122) PASS: lldb-api :: tools/lldb-vscode/module/TestVSCode_module.py (1270 of 2122) PASS: lldb-unit :: Utility/./UtilityTests/StringListTest.SplitIntoLinesEmpty (1271 of 2122) PASS: lldb-api :: functionalities/data-formatter/data-formatter-advanced/TestDataFormatterAdv.py (1272 of 2122) PASS: lldb-unit :: UnwindAssembly/x86/./UnwindAssemblyx86Tests/Testx86AssemblyInspectionEngine.TestPushESI (1273 of 2122) PASS: lldb-unit :: Host/./HostTests/FileActionTest.Open (1274 of 2122) PASS: lldb-unit :: ObjectFile/MachO/./ObjectFileMachOTests/ObjectFileMachOTest.ModuleFromSharedCacheInfo (1275 of 2122) PASS: lldb-unit :: Utility/./UtilityTests/FileSpecTest.IsRelative (1276 of 2122) PASS: lldb-unit :: Utility/./UtilityTests/StringExtractorTest.GetHexBytesAvail_Underflow (1277 of 2122) PASS: lldb-unit :: Host/./HostTests/NativeProcessProtocolTest.ReadMemoryWithoutTrap (1278 of 2122) PASS: lldb-shell :: Breakpoint/debug_addrx.test (1279 of 2122) PASS: lldb-api :: commands/platform/file/close/TestPlatformFileClose.py (1280 of 2122) PASS: lldb-unit :: tools/lldb-server/tests/./LLDBServerTests/TestBase.LaunchModePreservesEnvironment (1281 of 2122) PASS: lldb-unit :: Utility/./UtilityTests/AnsiTerminal.WhiteSpace (1282 of 2122) PASS: lldb-api :: commands/frame/diagnose/local-variable/TestLocalVariable.py (1283 of 2122) PASS: lldb-api :: functionalities/breakpoint/step_over_breakpoint/TestStepOverBreakpoint.py (1284 of 2122) PASS: lldb-api :: lang/cpp/stl/TestStdCXXDisassembly.py (1285 of 2122) PASS: lldb-unit :: Utility/./UtilityTests/LogChannelTest.Enable (1286 of 2122) PASS: lldb-unit :: ObjectFile/Breakpad/./ObjectFileBreakpadTests/FuncRecord.parse (1287 of 2122) PASS: lldb-api :: commands/log/basic/TestLogging.py (1288 of 2122) PASS: lldb-unit :: Utility/./UtilityTests/RangeTest.ContainsEndInclusiveInvalid (1289 of 2122) PASS: lldb-unit :: Utility/./UtilityTests/StreamTest.AddressSize (1290 of 2122) PASS: lldb-unit :: Utility/./UtilityTests/UriParserTest.BracketedHostnameWithPortIPv4 (1291 of 2122) PASS: lldb-unit :: Utility/./UtilityTests/ArgsTest.TestTrailingBackslash (1292 of 2122) PASS: lldb-shell :: Recognizer/assert.test (1293 of 2122) PASS: lldb-shell :: Settings/TestModuleCacheSanity.test (1294 of 2122) PASS: lldb-shell :: Driver/TestNoUseColor.test (1295 of 2122) PASS: lldb-unit :: UnwindAssembly/x86/./UnwindAssemblyx86Tests/Testx86AssemblyInspectionEngine.Test32bitFramelessBigStackFrame (1296 of 2122) PASS: lldb-api :: macosx/function-starts/TestFunctionStarts.py (1297 of 2122) PASS: lldb-unit :: Editline/./EditlineTests/EditlineTestFixture.EditlineReceivesSingleLineText (1298 of 2122) PASS: lldb-unit :: Utility/./UtilityTests/FileSpecTest.PrependPathComponent (1299 of 2122) PASS: lldb-api :: functionalities/breakpoint/comp_dir_symlink/TestCompDirSymLink.py (1300 of 2122) PASS: lldb-unit :: Utility/./UtilityTests/DataExtractorTest.PeekData (1301 of 2122) PASS: lldb-shell :: ObjectFile/PECOFF/section-types.yaml (1302 of 2122) PASS: lldb-api :: commands/watchpoints/watchpoint_commands/command/TestWatchpointCommandPython.py (1303 of 2122) PASS: lldb-shell :: ObjectFile/ELF/section-permissions.yaml (1304 of 2122) PASS: lldb-unit :: Utility/./UtilityTests/StringExtractorTest.GetHexBytesAvail_OddPair2 (1305 of 2122) PASS: lldb-unit :: ScriptInterpreter/Python/./ScriptInterpreterPythonTests/PythonDataObjectsTest.TestPythonBoolean (1306 of 2122) PASS: lldb-unit :: Host/./HostTests/SocketTest.DecodeHostAndPort (1307 of 2122) PASS: lldb-unit :: Utility/./UtilityTests/StreamTest.ChangingByteOrder (1308 of 2122) PASS: lldb-unit :: Utility/./UtilityTests/UriParserTest.Minimal (1309 of 2122) PASS: lldb-api :: functionalities/process_crash_info/TestProcessCrashInfo.py (1310 of 2122) PASS: lldb-unit :: Utility/./UtilityTests/OptionsWithRawTest.SingleWhitespaceInput (1311 of 2122) PASS: lldb-unit :: Expression/./ExpressionTests/DiagnosticManagerTest.GetStringMultiline (1312 of 2122) UNSUPPORTED: lldb-api :: functionalities/breakpoint/breakpoint_in_delayslot/TestAvoidBreakpointInDelaySlot.py (1313 of 2122) PASS: lldb-api :: functionalities/var_path/TestVarPath.py (1314 of 2122) PASS: lldb-api :: lang/c/local_variables/TestLocalVariables.py (1315 of 2122) PASS: lldb-shell :: Settings/TestSettingsSet.test (1316 of 2122) PASS: lldb-api :: types/TestShortType.py (1317 of 2122) PASS: lldb-unit :: Core/./LLDBCoreTests/RichManglingContextTest.Basic (1318 of 2122) PASS: lldb-unit :: Symbol/./SymbolTests/TestTypeSystemClang.TestGetBasicTypeFromEnum (1319 of 2122) PASS: lldb-unit :: UnwindAssembly/x86/./UnwindAssemblyx86Tests/Testx86AssemblyInspectionEngine.TestPopEDI (1320 of 2122) PASS: lldb-unit :: Utility/./UtilityTests/StringListTest.GetMaxStringLengthIncreasingSize (1321 of 2122) PASS: lldb-api :: functionalities/non-overlapping-index-variable-i/TestIndexVariable.py (1322 of 2122) PASS: lldb-api :: commands/expression/weak_symbols/TestWeakSymbols.py (1323 of 2122) PASS: lldb-api :: functionalities/backticks/TestBackticksWithoutATarget.py (1324 of 2122) PASS: lldb-shell :: ObjectFile/ELF/many-sections.s (1325 of 2122) PASS: lldb-api :: lang/cpp/llvm-style/TestLLVMStyle.py (1326 of 2122) PASS: lldb-unit :: Process/gdb-remote/./ProcessGdbRemoteTests/GDBRemoteCommunicationServerTest.SendErrorResponse_StringError (1327 of 2122) XFAIL: lldb-shell :: Register/x86-mm-xmm-write.test (1328 of 2122) PASS: lldb-unit :: debugserver/./debugserverTests/JSON.Parse (1329 of 2122) PASS: lldb-api :: lang/objc/objc-super/TestObjCSuper.py (1330 of 2122) PASS: lldb-unit :: Utility/./UtilityTests/Flags.AllClear (1331 of 2122) PASS: lldb-shell :: Minidump/breakpad-symbols.test (1332 of 2122) PASS: lldb-api :: python_api/frame/TestFrames.py (1333 of 2122) PASS: lldb-unit :: UnwindAssembly/x86/./UnwindAssemblyx86Tests/Testx86AssemblyInspectionEngine.TestPopRBX (1334 of 2122) PASS: lldb-unit :: ObjectFile/ELF/./ObjectFileELFTests/ObjectFileELFTest.GetSymtab_NoSymEntryPointArmAddressClass (1335 of 2122) PASS: lldb-shell :: Reproducer/TestGDBRemoteRepro.test (1336 of 2122) PASS: lldb-unit :: Language/Highlighting/./HighlighterTests/HighlighterTest.ClangIdentifiers (1337 of 2122) UNSUPPORTED: lldb-api :: commands/register/register/intel_xtended_registers/mpx_bound_violation/TestBoundViolation.py (1338 of 2122) PASS: lldb-unit :: Interpreter/./InterpreterTests/CompletionTest.DirCompletionUsername (1339 of 2122) UNSUPPORTED: lldb-shell :: ObjectFile/ELF/minidebuginfo-no-lzma.yaml (1340 of 2122) PASS: lldb-api :: functionalities/thread/concurrent_events/TestConcurrentManyWatchpoints.py (1341 of 2122) PASS: lldb-unit :: Process/gdb-remote/./ProcessGdbRemoteTests/GDBRemoteCommunicationTest.ReadPacket_checksum (1342 of 2122) PASS: lldb-unit :: Host/./HostTests/FileSystemTest.EnumerateDirectory (1343 of 2122) PASS: lldb-shell :: Watchpoint/SetErrorCases.test (1344 of 2122) PASS: lldb-unit :: ScriptInterpreter/Python/./ScriptInterpreterPythonTests/PythonDataObjectsTest.TestPythonCallableInvoke (1345 of 2122) PASS: lldb-api :: functionalities/thread/state_after_expression/TestStateAfterExpression.py (1346 of 2122) PASS: lldb-unit :: Utility/./UtilityTests/ScalarTest.SetValueFromData (1347 of 2122) PASS: lldb-shell :: SymbolFile/DWARF/apple-index-is-used.cpp (1348 of 2122) PASS: lldb-unit :: Utility/./UtilityTests/ArgsTest.TestMultipleArgs (1349 of 2122) PASS: lldb-shell :: ObjectFile/ELF/section-types-edgecases.yaml (1350 of 2122) PASS: lldb-api :: python_api/value/TestValueAPI.py (1351 of 2122) UNSUPPORTED: lldb-api :: functionalities/data-formatter/data-formatter-stl/libstdcpp/vbool/TestDataFormatterStdVBool.py (1352 of 2122) PASS: lldb-unit :: ScriptInterpreter/Python/./ScriptInterpreterPythonTests/PythonDataObjectsTest.TestPythonByteArray (1353 of 2122) PASS: lldb-unit :: Host/./HostTests/File.GetWaitableHandleFileno (1354 of 2122) PASS: lldb-api :: functionalities/step-avoids-no-debug/TestStepNoDebug.py (1355 of 2122) PASS: lldb-api :: types/TestFloatTypes.py (1356 of 2122) PASS: lldb-unit :: Utility/./UtilityTests/UriParserTest.TypicalPortPathIPv4 (1357 of 2122) UNSUPPORTED: lldb-api :: tools/lldb-server/TestGdbRemoteModuleInfo.py (1358 of 2122) UNSUPPORTED: lldb-api :: functionalities/data-formatter/data-formatter-stl/libstdcpp/smart_ptr/TestDataFormatterStdSmartPtr.py (1359 of 2122) PASS: lldb-shell :: SymbolFile/DWARF/static_scope.s (1360 of 2122) PASS: lldb-api :: functionalities/breakpoint/objc/TestObjCBreakpoints.py (1361 of 2122) PASS: lldb-unit :: Host/./HostTests/SocketTest.UDPGetConnectURI (1362 of 2122) PASS: lldb-unit :: Utility/./UtilityTests/RangeDataVector.FindEntryIndexesThatContain (1363 of 2122) PASS: lldb-api :: functionalities/breakpoint/source_regexp/TestSourceRegexBreakpoints.py (1364 of 2122) PASS: lldb-api :: commands/expression/class_template_specialization_empty_pack/TestClassTemplateSpecializationParametersHandling.py (1365 of 2122) PASS: lldb-unit :: Utility/./UtilityTests/SubsystemRAIITest.SubsystemWithErrorSuccess (1366 of 2122) PASS: lldb-api :: functionalities/signal/raise/TestRaise.py (1367 of 2122) PASS: lldb-unit :: Host/./HostTests/NativeProcessProtocolTest.ReadCStringFromMemory_MaxSize (1368 of 2122) PASS: lldb-unit :: UnwindAssembly/x86/./UnwindAssemblyx86Tests/Testx86AssemblyInspectionEngine.TestAddESP (1369 of 2122) PASS: lldb-shell :: Breakpoint/ppc64-localentry.test (1370 of 2122) PASS: lldb-api :: functionalities/postmortem/minidump/TestMiniDump.py (1371 of 2122) PASS: lldb-unit :: Utility/./UtilityTests/StringListTest.GetSize (1372 of 2122) PASS: lldb-unit :: Utility/./UtilityTests/StringListTest.AppendListCStringArrayEmpty (1373 of 2122) PASS: lldb-unit :: Utility/./UtilityTests/FileSpecTest.FileAndDirectoryComponents (1374 of 2122) PASS: lldb-api :: lang/objc/direct-dispatch-step/TestObjCDirectDispatchStepping.py (1375 of 2122) PASS: lldb-api :: lang/c/enum_types/TestEnumTypes.py (1376 of 2122) PASS: lldb-api :: types/TestLongTypes.py (1377 of 2122) PASS: lldb-api :: commands/expression/two-files/TestObjCTypeQueryFromOtherCompileUnit.py (1378 of 2122) PASS: lldb-api :: lang/cpp/template-function/TestTemplateFunctions.py (1379 of 2122) PASS: lldb-api :: functionalities/data-formatter/array_typedef/TestArrayTypedef.py (1380 of 2122) PASS: lldb-unit :: DataFormatter/./LLDBFormatterTests/TypeMatcherTests.GetMatchStringRegex (1381 of 2122) PASS: lldb-api :: functionalities/data-formatter/data-formatter-objc/TestDataFormatterObjNSException.py (1382 of 2122) PASS: lldb-api :: functionalities/float-display/TestFloatDisplay.py (1383 of 2122) PASS: lldb-unit :: Symbol/./SymbolTests/LineEntryTest.GetSameLineContiguousAddressRangeNestedInline (1384 of 2122) PASS: lldb-unit :: Utility/./UtilityTests/StringListTest.InsertStringAtIndexEnd (1385 of 2122) PASS: lldb-shell :: Commands/command-regex-unalias.test (1386 of 2122) PASS: lldb-api :: lang/objc/modules/TestObjCModules.py (1387 of 2122) PASS: lldb-api :: functionalities/data-formatter/data-formatter-cpp/TestDataFormatterCpp.py (1388 of 2122) PASS: lldb-unit :: Utility/./UtilityTests/StreamTest.AddressEmptyPrefix (1389 of 2122) PASS: lldb-api :: commands/expression/completion-crash-incomplete-record/TestCompletionCrashIncompleteRecord.py (1390 of 2122) PASS: lldb-api :: lang/cpp/stl/TestSTL.py (1391 of 2122) PASS: lldb-unit :: Utility/./UtilityTests/RegularExpression.Match (1392 of 2122) PASS: lldb-unit :: Process/minidump/./LLDBMinidumpTests/MinidumpParserTest.GetMiscInfoWindows (1393 of 2122) PASS: lldb-unit :: Process/gdb-remote/./ProcessGdbRemoteTests/GDBRemoteCommunicationClientTest.SendGetTraceConfigPacket (1394 of 2122) UNSUPPORTED: lldb-api :: commands/register/register/intel_xtended_registers/mpx_offset_intersection/TestMPXOffsetIntersection.py (1395 of 2122) PASS: lldb-unit :: Host/./HostTests/MainLoopTest.DetectsEOF (1396 of 2122) PASS: lldb-unit :: Utility/./UtilityTests/CompletionRequest.TryCompleteCurrentArgMode (1397 of 2122) PASS: lldb-api :: python_api/value/linked_list/TestValueAPILinkedList.py (1398 of 2122) PASS: lldb-unit :: DataFormatter/./LLDBFormatterTests/TypeMatcherTests.CreatedBySameMatchString (1399 of 2122) PASS: lldb-unit :: Utility/./UtilityTests/StreamTest.PutBytesAsRawHex8ToLittleEndian (1400 of 2122) PASS: lldb-shell :: Unwind/eh-frame-dwarf-unwind.test (1401 of 2122) PASS: lldb-api :: functionalities/thread/concurrent_events/TestConcurrentTwoWatchpointsOneDelayBreakpoint.py (1402 of 2122) PASS: lldb-unit :: Utility/./UtilityTests/StringExtractorTest.InitEmpty (1403 of 2122) PASS: lldb-api :: functionalities/step_scripted/TestStepScripted.py (1404 of 2122) PASS: lldb-api :: lang/objc/foundation/TestObjectDescriptionAPI.py (1405 of 2122) PASS: lldb-unit :: Host/./HostTests/FileSystemTest.MakeAbsolute (1406 of 2122) PASS: lldb-unit :: Utility/./UtilityTests/StringListTest.CopyListEmpty (1407 of 2122) PASS: lldb-unit :: Utility/./UtilityTests/UUIDTest.RelationalOperators (1408 of 2122) PASS: lldb-api :: lang/c/function_types/TestFunctionTypes.py (1409 of 2122) PASS: lldb-unit :: Symbol/./SymbolTests/TestTypeSystemClang.TestUnifyAccessSpecifiers (1410 of 2122) PASS: lldb-api :: commands/expression/argument_passing_restrictions/TestArgumentPassingRestrictions.py (1411 of 2122) PASS: lldb-unit :: Utility/./UtilityTests/XcodeSDKTest.GetSDKTypeForTriple (1412 of 2122) PASS: lldb-api :: commands/expression/import-std-module/list/TestListFromStdModule.py (1413 of 2122) PASS: lldb-unit :: Process/gdb-remote/./ProcessGdbRemoteTests/GDBRemoteCommunicationServerTest.SendErrorResponse_Status (1414 of 2122) PASS: lldb-shell :: Settings/TestFrameFormatColor.test (1415 of 2122) PASS: lldb-api :: commands/disassemble/basic/TestFrameDisassemble.py (1416 of 2122) PASS: lldb-shell :: SymbolFile/Breakpad/unwind-via-stack-win.test (1417 of 2122) PASS: lldb-api :: functionalities/data-formatter/data-formatter-stl/libcxx/bitset/TestDataFormatterLibcxxBitset.py (1418 of 2122) PASS: lldb-api :: commands/frame/diagnose/inheritance/TestDiagnoseInheritance.py (1419 of 2122) PASS: lldb-api :: functionalities/postmortem/minidump-new/TestMiniDumpNew.py (1420 of 2122) PASS: lldb-unit :: ObjectFile/PECOFF/./ObjectFilePECOFFTests/PECallFrameInfoTest.Frame_reg_eh (1421 of 2122) PASS: lldb-unit :: Utility/./UtilityTests/VASprintfTest.BufferResize (1422 of 2122) PASS: lldb-unit :: Core/./LLDBCoreTests/RichManglingContextTest.IPDRealloc (1423 of 2122) PASS: lldb-api :: functionalities/process_group/TestChangeProcessGroup.py (1424 of 2122) PASS: lldb-unit :: Platform/Android/./AdbClientTests/AdbClientTest.CreateByDeviceId_ByEnvVar (1425 of 2122) PASS: lldb-unit :: Utility/./UtilityTests/StringLexerTest.NextIfList (1426 of 2122) UNSUPPORTED: lldb-api :: lang/cpp/function-template-parameter-pack/TestFunctionTemplateParameterPack.py (1427 of 2122) UNSUPPORTED: lldb-api :: lang/objc/objc-dynamic-value/TestObjCDynamicValue.py (1428 of 2122) PASS: lldb-api :: lang/cpp/char1632_t/TestChar1632T.py (1429 of 2122) PASS: lldb-unit :: Utility/./UtilityTests/StreamTest.AddressSuffix (1430 of 2122) PASS: lldb-unit :: Utility/./UtilityTests/ArchSpecTest.OperatorBool (1431 of 2122) PASS: lldb-unit :: Utility/./UtilityTests/StreamTest.PutStringAsRawHex8 (1432 of 2122) PASS: lldb-api :: api/listeners/TestListener.py (1433 of 2122) PASS: lldb-unit :: Process/gdb-remote/./ProcessGdbRemoteTests/GDBRemoteCommunicationClientTest.SyncThreadState (1434 of 2122) PASS: lldb-unit :: Utility/./UtilityTests/PassiveReplayTest.InstrumentedBarRef (1435 of 2122) PASS: lldb-unit :: Utility/./UtilityTests/ScalarTest.Equality (1436 of 2122) PASS: lldb-unit :: Utility/./UtilityTests/FileSpecTest.EqualDotsWindows (1437 of 2122) PASS: lldb-unit :: ScriptInterpreter/Python/./ScriptInterpreterPythonTests/PythonDataObjectsTest.TestBorrowedReferences (1438 of 2122) PASS: lldb-unit :: Host/./HostTests/ConnectionFileDescriptorTest.TCPGetURIv4 (1439 of 2122) PASS: lldb-unit :: UnwindAssembly/x86/./UnwindAssemblyx86Tests/Testx86AssemblyInspectionEngine.TestLEAVE (1440 of 2122) PASS: lldb-api :: lang/objc/modules-cache/TestClangModulesCache.py (1441 of 2122) PASS: lldb-api :: lang/mixed/TestMixedLanguages.py (1442 of 2122) PASS: lldb-api :: functionalities/thread/num_threads/TestNumThreads.py (1443 of 2122) PASS: lldb-shell :: Reproducer/Functionalities/TestImageList.test (1444 of 2122) PASS: lldb-unit :: DataFormatter/./LLDBFormatterTests/TypeMatcherTests.RegexMatchPart (1445 of 2122) PASS: lldb-shell :: Quit/TestQuitExitCodeHexA.test (1446 of 2122) PASS: lldb-unit :: Utility/./UtilityTests/RangeTest.SlideZero (1447 of 2122) PASS: lldb-api :: lang/c/global_variables/TestGlobalVariables.py (1448 of 2122) PASS: lldb-unit :: API/./APITests/SBCommandInterpreterTest.SingleWordCommand (1449 of 2122) PASS: lldb-shell :: SymbolFile/DWARF/parallel-indexing-stress.s (1450 of 2122) PASS: lldb-api :: commands/target/basic/TestTargetCommand.py (1451 of 2122) PASS: lldb-unit :: Expression/./ExpressionTests/DiagnosticManagerTest.AppendMessageAttachToLastDiag (1452 of 2122) PASS: lldb-unit :: Utility/./UtilityTests/SerializationRountripTest.SerializeDeserializePodPointers (1453 of 2122) PASS: lldb-unit :: Utility/./UtilityTests/StringLexerTest.Peek (1454 of 2122) PASS: lldb-api :: commands/expression/import-std-module/deque-dbg-info-content/TestDbgInfoContentDequeFromStdModule.py (1455 of 2122) PASS: lldb-unit :: Utility/./UtilityTests/StringListTest.SplitIntoLines (1456 of 2122) PASS: lldb-api :: functionalities/data-formatter/data-formatter-objc/TestDataFormatterObjCNSError.py (1457 of 2122) PASS: lldb-unit :: ObjectFile/Breakpad/./ObjectFileBreakpadTests/StackCFIRecord.parse (1458 of 2122) PASS: lldb-shell :: SymbolFile/DWARF/dwarf5_locations.s (1459 of 2122) PASS: lldb-unit :: UnwindAssembly/x86/./UnwindAssemblyx86Tests/Testx86AssemblyInspectionEngine.TestCALLNextInsn (1460 of 2122) PASS: lldb-unit :: Utility/./UtilityTests/ArgsTest.GetQuotedCommandString (1461 of 2122) PASS: lldb-unit :: Process/gdb-remote/./ProcessGdbRemoteTests/GDBRemoteCommunicationClientTest.SendGetDataPacket (1462 of 2122) PASS: lldb-unit :: Process/gdb-remote/./ProcessGdbRemoteTests/GDBRemoteClientBaseTest.SendContinueAndInterrupt (1463 of 2122) PASS: lldb-api :: commands/expression/import-std-module/vector-of-vectors/TestVectorOfVectorsFromStdModule.py (1464 of 2122) PASS: lldb-unit :: Utility/./UtilityTests/NameMatchesTest.StartsWith (1465 of 2122) PASS: lldb-shell :: Quit/TestQuitExitCodeImplicit0.test (1466 of 2122) PASS: lldb-api :: lang/cpp/symbols/TestSymbols.py (1467 of 2122) PASS: lldb-api :: commands/expression/calculator_mode/TestCalculatorMode.py (1468 of 2122) PASS: lldb-unit :: Utility/./UtilityTests/ScalarTest.TruncOrExtendTo (1469 of 2122) PASS: lldb-api :: lang/objc/foundation/TestObjCMethods.py (1470 of 2122) PASS: lldb-shell :: Driver/TestUseColor.test (1471 of 2122) PASS: lldb-unit :: SymbolFile/DWARF/./SymbolFileDWARFTests/SymbolFileDWARFTests.TestAbbrevValidAttrNullForm (1472 of 2122) UNSUPPORTED: lldb-api :: functionalities/thread/break_after_join/TestBreakAfterJoin.py (1473 of 2122) PASS: lldb-unit :: Utility/./UtilityTests/RangeTest.LessThanInvalid (1474 of 2122) PASS: lldb-unit :: Utility/./UtilityTests/StringListTest.SplitIntoLinesSingleTrailingCR (1475 of 2122) PASS: lldb-unit :: Utility/./UtilityTests/StreamTest.PutCharWhitespace (1476 of 2122) PASS: lldb-unit :: Symbol/./SymbolTests/TestClangASTImporter.CanImportInvalidType (1477 of 2122) PASS: lldb-api :: lang/objcxx/cxx-bridged-po/TestObjCXXBridgedPO.py (1478 of 2122) PASS: lldb-api :: functionalities/data-formatter/stringprinter/TestStringPrinter.py (1479 of 2122) PASS: lldb-api :: commands/expression/save_jit_objects/TestSaveJITObjects.py (1480 of 2122) PASS: lldb-unit :: Utility/./UtilityTests/OptionsWithRawTest.TerminatedQuote (1481 of 2122) PASS: lldb-shell :: SymbolFile/Breakpad/line-table.test (1482 of 2122) PASS: lldb-api :: functionalities/memory-region/TestMemoryRegion.py (1483 of 2122) PASS: lldb-unit :: Symbol/./SymbolTests/PostfixExpression.ParseOneExpression (1484 of 2122) PASS: lldb-shell :: SymbolFile/DWARF/DW_AT_declaration-with-children.s (1485 of 2122) PASS: lldb-unit :: Utility/./UtilityTests/ScalarTest.RightShiftOperator (1486 of 2122) PASS: lldb-unit :: Utility/./UtilityTests/UriParserTest.MinimalPortPath (1487 of 2122) PASS: lldb-api :: commands/expression/import-std-module/vector-bool/TestVectorBoolFromStdModule.py (1488 of 2122) UNSUPPORTED: lldb-api :: tools/intel-features/intel-pt/test/TestIntelPTSimpleBinary.py (1489 of 2122) UNSUPPORTED: lldb-api :: benchmarks/startup/TestStartupDelays.py (1490 of 2122) PASS: lldb-unit :: Symbol/./SymbolTests/TestTypeSystemClang.TestIsClangType (1491 of 2122) PASS: lldb-unit :: Utility/./UtilityTests/ConstStringTest.MangledCounterpart (1492 of 2122) PASS: lldb-unit :: tools/lldb-server/tests/./LLDBServerTests/StandardStartupTest.TestStopReplyContainsThreadPcs (1493 of 2122) PASS: lldb-shell :: Driver/TestConvenienceVariables.test (1494 of 2122) PASS: lldb-api :: commands/statistics/basic/TestStats.py (1495 of 2122) UNSUPPORTED: lldb-api :: tools/lldb-server/TestGdbRemote_vContThreads.py (1496 of 2122) PASS: lldb-api :: functionalities/stats_api/TestStatisticsAPI.py (1497 of 2122) PASS: lldb-unit :: Process/minidump/./LLDBMinidumpTests/MinidumpParserTest.MinidumpModuleOrder (1498 of 2122) PASS: lldb-unit :: Expression/./ExpressionTests/CppModuleConfigurationTest.UnrelatedLibrary (1499 of 2122) PASS: lldb-shell :: Minidump/Windows/broken-unwind.test (1500 of 2122) PASS: lldb-shell :: SymbolFile/DWARF/dir-separator-windows.s (1501 of 2122) PASS: lldb-unit :: Utility/./UtilityTests/StreamTest.PutHex64ByteOrderLittle (1502 of 2122) PASS: lldb-unit :: Language/Highlighting/./HighlighterTests/HighlighterTest.ClangBraces (1503 of 2122) UNSUPPORTED: lldb-shell :: Register/aarch64-gp-read.test (1504 of 2122) PASS: lldb-unit :: Utility/./UtilityTests/StreamTest.PutSLEB128 (1505 of 2122) PASS: lldb-unit :: ScriptInterpreter/Python/./ScriptInterpreterPythonTests/PythonDataObjectsTest.TestPythonTupleSize (1506 of 2122) PASS: lldb-shell :: SymbolFile/NativePDB/ast-methods.cpp (1507 of 2122) PASS: lldb-unit :: Expression/./ExpressionTests/CppModuleConfigurationTest.MissingUsrInclude (1508 of 2122) PASS: lldb-api :: lang/objc/objc-new-syntax/TestObjCNewSyntaxDictionary.py (1509 of 2122) PASS: lldb-unit :: SymbolFile/NativePDB/./SymbolFileNativePDBTests/PDBFPOProgramToDWARFExpressionTests.UnresolvedRegisterReference (1510 of 2122) PASS: lldb-unit :: Process/minidump/./LLDBMinidumpTests/MinidumpParserTest.GetMemoryRegionInfoFromMemory64List (1511 of 2122) PASS: lldb-unit :: Utility/./UtilityTests/StreamTest.ShiftOperatorChars (1512 of 2122) PASS: lldb-unit :: Symbol/./SymbolTests/TestTypeSystemClang.TestRemoveFastQualifiers (1513 of 2122) PASS: lldb-api :: commands/target/stop-hooks/TestStopHooks.py (1514 of 2122) PASS: lldb-unit :: UnwindAssembly/x86/./UnwindAssemblyx86Tests/Testx86AssemblyInspectionEngine.TestPopR13 (1515 of 2122) PASS: lldb-api :: functionalities/thread/concurrent_events/TestConcurrentDelaySignalWatch.py (1516 of 2122) PASS: lldb-api :: functionalities/tail_call_frames/disambiguate_tail_call_seq/TestDisambiguateTailCallSeq.py (1517 of 2122) PASS: lldb-api :: types/TestDoubleTypes.py (1518 of 2122) PASS: lldb-api :: lang/objc/foundation/TestFoundationDisassembly.py (1519 of 2122) PASS: lldb-api :: functionalities/conditional_break/TestConditionalBreak.py (1520 of 2122) PASS: lldb-api :: commands/frame/diagnose/array/TestArray.py (1521 of 2122) PASS: lldb-api :: lang/cpp/typeof/TestTypeOfDeclTypeExpr.py (1522 of 2122) PASS: lldb-unit :: Process/gdb-remote/./ProcessGdbRemoteTests/GDBRemoteClientBaseTest.SendContinueAndInterrupt2PacketBug (1523 of 2122) PASS: lldb-unit :: DataFormatter/./LLDBFormatterTests/StringPrinterTests.CxxUTF8 (1524 of 2122) PASS: lldb-api :: functionalities/data-formatter/ostypeformatting/TestFormattersOsType.py (1525 of 2122) PASS: lldb-api :: commands/expression/import-std-module/sysroot/TestStdModuleSysroot.py (1526 of 2122) PASS: lldb-api :: commands/watchpoints/watchpoint_commands/condition/TestWatchpointConditionCmd.py (1527 of 2122) PASS: lldb-api :: commands/process/attach/TestProcessAttach.py (1528 of 2122) PASS: lldb-unit :: Utility/./UtilityTests/RecordReplayTest.InstrumentedBarPtr (1529 of 2122) UNSUPPORTED: lldb-api :: functionalities/darwin_log/filter/exact_match/category/TestDarwinLogFilterMatchCategory.py (1530 of 2122) PASS: lldb-api :: functionalities/data-formatter/data-formatter-stl/libcxx/unique_ptr/TestDataFormatterLibcxxUniquePtr.py (1531 of 2122) PASS: lldb-api :: functionalities/breakpoint/breakpoint_hit_count/TestBreakpointHitCount.py (1532 of 2122) PASS: lldb-unit :: Utility/./UtilityTests/FileSpecTest.GuessPathStyle (1533 of 2122) PASS: lldb-api :: python_api/target/TestTargetAPI.py (1534 of 2122) PASS: lldb-api :: lang/cpp/operator-overload/TestOperatorOverload.py (1535 of 2122) PASS: lldb-unit :: Utility/./UtilityTests/SerializationRountripTest.SerializeDeserializePodReferences (1536 of 2122) PASS: lldb-unit :: Utility/./UtilityTests/StreamTest.PutRawBytesToBigEndian (1537 of 2122) PASS: lldb-unit :: Utility/./UtilityTests/DataExtractorTest.GetULEB128_bit63 (1538 of 2122) PASS: lldb-api :: lang/objc/modules-auto-import/TestModulesAutoImport.py (1539 of 2122) PASS: lldb-unit :: Utility/./UtilityTests/RangeTest.ClearWithStarAddress (1540 of 2122) UNSUPPORTED: lldb-api :: commands/register/register/intel_xtended_registers/TestMPXRegisters.py (1541 of 2122) PASS: lldb-unit :: Core/./LLDBCoreTests/UniqueCStringMap.NoDefaultConstructor (1542 of 2122) PASS: lldb-api :: tools/lldb-server/TestGdbRemoteKill.py (1543 of 2122) PASS: lldb-api :: commands/expression/import-std-module/conflicts/TestStdModuleWithConflicts.py (1544 of 2122) PASS: lldb-api :: lang/cpp/static_methods/TestCPPStaticMethods.py (1545 of 2122) PASS: lldb-api :: functionalities/breakpoint/breakpoint_command/TestBreakpointCommandsFromPython.py (1546 of 2122) PASS: lldb-unit :: Utility/./UtilityTests/StringListTest.JoinNonSpace (1547 of 2122) PASS: lldb-unit :: Symbol/./SymbolTests/TestClangASTImporter.DeportDeclTagDecl (1548 of 2122) PASS: lldb-api :: functionalities/tsan/thread_leak/TestTsanThreadLeak.py (1549 of 2122) PASS: lldb-api :: lang/cpp/exceptions/TestCPPExceptionBreakpoints.py (1550 of 2122) PASS: lldb-unit :: Process/minidump/./LLDBMinidumpTests/MinidumpParserTest.GetArchitectureWindows (1551 of 2122) PASS: lldb-unit :: Language/Highlighting/./HighlighterTests/HighlighterTest.ClangPPDirectives (1552 of 2122) PASS: lldb-shell :: ScriptInterpreter/Python/scripted_breakpoint.test (1553 of 2122) PASS: lldb-api :: commands/watchpoints/watchpoint_set_command/TestWatchLocationWithWatchSet.py (1554 of 2122) PASS: lldb-unit :: Expression/./ExpressionTests/DiagnosticManagerTest.GetStringBasic (1555 of 2122) PASS: lldb-api :: functionalities/paths/TestPaths.py (1556 of 2122) PASS: lldb-shell :: SymbolFile/NativePDB/global-classes.cpp (1557 of 2122) PASS: lldb-api :: commands/expression/call-function/TestCallStopAndContinue.py (1558 of 2122) PASS: lldb-unit :: Utility/./UtilityTests/StringExtractorTest.InitMisc (1559 of 2122) PASS: lldb-unit :: ObjectFile/PECOFF/./ObjectFilePECOFFTests/PECallFrameInfoTest.Chained_eh (1560 of 2122) PASS: lldb-api :: python_api/function_symbol/TestSymbolAPI.py (1561 of 2122) UNSUPPORTED: lldb-api :: lang/objc/rdar-12408181/TestRdar12408181.py (1562 of 2122) PASS: lldb-unit :: Utility/./UtilityTests/UriParserTest.SchemeHostSeparator2 (1563 of 2122) PASS: lldb-unit :: Utility/./UtilityTests/ArgsTest.Yaml (1564 of 2122) PASS: lldb-unit :: Expression/./ExpressionTests/DiagnosticManagerTest.GetStringMultipleDiags (1565 of 2122) PASS: lldb-unit :: Expression/./ExpressionTests/DiagnosticManagerTest.PutStringSeverities (1566 of 2122) PASS: lldb-api :: functionalities/breakpoint/breakpoint_locations/TestBreakpointLocations.py (1567 of 2122) PASS: lldb-unit :: Platform/Android/./AdbClientTests/AdbClientTest.CreateByDeviceId (1568 of 2122) PASS: lldb-unit :: Process/gdb-remote/./ProcessGdbRemoteTests/GDBRemoteCommunicationClientTest.SendSignalsToIgnore (1569 of 2122) PASS: lldb-api :: python_api/lldbutil/frame/TestFrameUtils.py (1570 of 2122) PASS: lldb-unit :: Utility/./UtilityTests/ArchSpecTest.YAML (1571 of 2122) PASS: lldb-api :: commands/expression/codegen-crash-typedefdecl-not-in_declcontext/TestCodegenCrashTypedefDeclNotInDeclContext.py (1572 of 2122) PASS: lldb-api :: lang/objc/objc_direct-methods/TestObjCDirectMethods.py (1573 of 2122) PASS: lldb-unit :: Utility/./UtilityTests/VMRange.Ordering (1574 of 2122) PASS: lldb-unit :: Utility/./UtilityTests/XcodeSDKTest.GetCanonicalNameAndConstruct (1575 of 2122) PASS: lldb-api :: commands/expression/namespace_local_var_same_name_cpp_and_c/TestNamespaceLocalVarSameNameCppAndC.py (1576 of 2122) UNSUPPORTED: lldb-api :: functionalities/data-formatter/data-formatter-stl/libstdcpp/unique_ptr/TestDataFormatterStdUniquePtr.py (1577 of 2122) PASS: lldb-api :: python_api/watchpoint/condition/TestWatchpointConditionAPI.py (1578 of 2122) PASS: lldb-api :: api/check_public_api_headers/TestPublicAPIHeaders.py (1579 of 2122) PASS: lldb-api :: lang/cpp/lambdas/TestLambdas.py (1580 of 2122) PASS: lldb-unit :: ScriptInterpreter/Python/./ScriptInterpreterPythonTests/PythonDataObjectsTest.TestPythonListManipulation (1581 of 2122) PASS: lldb-shell :: Reproducer/TestPythonImport.test (1582 of 2122) PASS: lldb-unit :: Utility/./UtilityTests/BinaryStreamTest.PutULEB128FiveBytes (1583 of 2122) PASS: lldb-unit :: Utility/./UtilityTests/StreamTest.PutHex64ByteOrderBig (1584 of 2122) PASS: lldb-api :: lang/cpp/global_variables/TestCPPGlobalVariables.py (1585 of 2122) PASS: lldb-api :: lang/c/blocks/TestBlocks.py (1586 of 2122) PASS: lldb-unit :: Utility/./UtilityTests/StringListTest.LongestCommonPrefixNoPrefix (1587 of 2122) PASS: lldb-api :: commands/expression/vector_of_enums/TestVectorOfEnums.py (1588 of 2122) PASS: lldb-unit :: Utility/./UtilityTests/SerializationRountripTest.SerializeDeserializeObjectPointer (1589 of 2122) PASS: lldb-api :: lang/objc/objc-dyn-sbtype/TestObjCDynamicSBType.py (1590 of 2122) PASS: lldb-api :: lang/objc/single-entry-dictionary/TestObjCSingleEntryDictionary.py (1591 of 2122) PASS: lldb-unit :: Utility/./UtilityTests/StreamTest.PutNHex8 (1592 of 2122) PASS: lldb-unit :: Utility/./UtilityTests/DataExtractorTest.GetDouble (1593 of 2122) PASS: lldb-shell :: ObjectFile/PECOFF/dep-modules.yaml (1594 of 2122) PASS: lldb-unit :: Utility/./UtilityTests/RangeDataVector.FindEntryIndexesThatContain_Overlap (1595 of 2122) PASS: lldb-api :: lang/objc/objc-property/TestObjCProperty.py (1596 of 2122) PASS: lldb-unit :: Utility/./UtilityTests/ArgsTest.ReplaceArgumentAtIndexOutOfRange (1597 of 2122) UNSUPPORTED: lldb-api :: functionalities/breakpoint/hardware_breakpoints/hardware_breakpoint_on_multiple_threads/TestHWBreakMultiThread.py (1598 of 2122) PASS: lldb-api :: lang/objc/objc-struct-return/TestObjCStructReturn.py (1599 of 2122) PASS: lldb-api :: driver/batch_mode/TestBatchMode.py (1600 of 2122) PASS: lldb-shell :: Breakpoint/single-file-split-dwarf.test (1601 of 2122) PASS: lldb-unit :: ScriptInterpreter/Python/./ScriptInterpreterPythonTests/PythonDataObjectsTest.TestGlobalNameResolutionWithDot (1602 of 2122) PASS: lldb-unit :: Utility/./UtilityTests/TimerTest.CategoryTimes (1603 of 2122) PASS: lldb-api :: lang/c/array_types/TestArrayTypes.py (1604 of 2122) PASS: lldb-api :: tools/lldb-server/TestGdbRemoteHostInfo.py (1605 of 2122) PASS: lldb-api :: python_api/sbstructureddata/TestStructuredDataAPI.py (1606 of 2122) PASS: lldb-unit :: Utility/./UtilityTests/NameMatchesTest.Contains (1607 of 2122) PASS: lldb-unit :: Utility/./UtilityTests/StringExtractorTest.GetHexU8_InvalidHex_NoEof (1608 of 2122) PASS: lldb-api :: tools/lldb-vscode/attach/TestVSCode_attach.py (1609 of 2122) PASS: lldb-api :: functionalities/tail_call_frames/disambiguate_call_site/TestDisambiguateCallSite.py (1610 of 2122) PASS: lldb-api :: functionalities/data-formatter/data-formatter-categories/TestDataFormatterCategories.py (1611 of 2122) PASS: lldb-unit :: Utility/./UtilityTests/StreamTest.ShiftOperatorPtr (1612 of 2122) PASS: lldb-unit :: Utility/./UtilityTests/StringLexerTest.Next (1613 of 2122) PASS: lldb-api :: functionalities/inferior-assert/TestInferiorAssert.py (1614 of 2122) PASS: lldb-api :: functionalities/object-file/TestImageListMultiArchitecture.py (1615 of 2122) PASS: lldb-shell :: SymbolFile/Breakpad/symtab-macho.test (1616 of 2122) PASS: lldb-api :: functionalities/data-formatter/setvaluefromcstring/TestSetValueFromCString.py (1617 of 2122) PASS: lldb-unit :: Utility/./UtilityTests/UUIDTest.Validity (1618 of 2122) PASS: lldb-unit :: Utility/./UtilityTests/RangeTest.ContainsAddr (1619 of 2122) PASS: lldb-api :: lang/cpp/inlines/TestInlines.py (1620 of 2122) PASS: lldb-shell :: ObjectFile/ELF/short-build-id.yaml (1621 of 2122) PASS: lldb-shell :: BuildScript/toolchain-clang.test (1622 of 2122) PASS: lldb-api :: types/TestFloatTypesExpr.py (1623 of 2122) PASS: lldb-unit :: Utility/./UtilityTests/StringListTest.GetMaxStringLengthDecreasingSize (1624 of 2122) PASS: lldb-api :: functionalities/breakpoint/breakpoint_command/TestRegexpBreakCommand.py (1625 of 2122) PASS: lldb-unit :: Process/gdb-remote/./ProcessGdbRemoteTests/GDBRemoteClientBaseTest.SendContinueDelegateStructuredDataReceipt (1626 of 2122) UNSUPPORTED: lldb-shell :: SymbolFile/PDB/variables-locations.test (1627 of 2122) PASS: lldb-unit :: Utility/./UtilityTests/Flags.GetBitSize (1628 of 2122) PASS: lldb-unit :: Host/./HostTests/ConnectionFileDescriptorTest.TCPGetURIv6 (1629 of 2122) PASS: lldb-api :: commands/expression/multiline-completion/TestMultilineCompletion.py (1630 of 2122) FAIL: lldb-api :: functionalities/gdb_remote_client/TestThreadSelectionBug.py (1631 of 2122) ******************** TEST 'lldb-api :: functionalities/gdb_remote_client/TestThreadSelectionBug.py' FAILED ******************** Script: -- /usr/local/Frameworks/Python.framework/Versions/3.7/bin/python3.7 /Users/buildslave/jenkins/workspace/lldb-cmake/llvm-project/lldb/test/API/dotest.py --arch x86_64 -s /Users/buildslave/jenkins/workspace/lldb-cmake/lldb-build/lldb-test-traces -S nm -u CXXFLAGS -u CFLAGS --codesign-identity - --server /Users/buildslave/jenkins/workspace/lldb-cmake/lldb-build/./bin/debugserver --arch x86_64 --build-dir /Users/buildslave/jenkins/workspace/lldb-cmake/lldb-build/lldb-test-build.noindex -s=/Users/buildslave/jenkins/workspace/lldb-cmake/test/logs -t --env TERM=vt100 --env LLVM_LIBS_DIR=/Users/buildslave/jenkins/workspace/lldb-cmake/lldb-build/./lib --build-dir /Users/buildslave/jenkins/workspace/lldb-cmake/lldb-build/lldb-test-build.noindex --lldb-module-cache-dir /Users/buildslave/jenkins/workspace/lldb-cmake/lldb-build/lldb-test-build.noindex/module-cache-lldb/lldb-api --clang-module-cache-dir /Users/buildslave/jenkins/workspace/lldb-cmake/lldb-build/lldb-test-build.noindex/module-cache-clang/lldb-api --executable /Users/buildslave/jenkins/workspace/lldb-cmake/lldb-build/./bin/lldb --compiler /Users/buildslave/jenkins/workspace/lldb-cmake/lldb-build/./bin/clang --dsymutil /Users/buildslave/jenkins/workspace/lldb-cmake/lldb-build/./bin/dsymutil --filecheck /Users/buildslave/jenkins/workspace/lldb-cmake/lldb-build/./bin/FileCheck --yaml2obj /Users/buildslave/jenkins/workspace/lldb-cmake/lldb-build/./bin/yaml2obj --lldb-libs-dir /Users/buildslave/jenkins/workspace/lldb-cmake/lldb-build/./lib /Users/buildslave/jenkins/workspace/lldb-cmake/llvm-project/lldb/test/API/functionalities/gdb_remote_client -p TestThreadSelectionBug.py -- Exit Code: 1

Hide Details

Command Output (stdout): -- lldb version 12.0.99 clang revision d53d952810e7afaad66a8c527fa073e8f68f6222 llvm revision d53d952810e7afaad66a8c527fa073e8f68f6222 LLDB library dir: /Users/buildslave/jenkins/workspace/lldb-cmake/lldb-build/bin LLDB import library dir: /Users/buildslave/jenkins/workspace/lldb-cmake/lldb-build/./lib libstdcxx tests will not be run because: Don't know how to build with libstdcxx on macosx Skipping following debug info categories: ['dwo']

Hide Details

-- Command Output (stderr): --

Hide Details

Session logs for test failures/errors/unexpected successes will go into directory '/Users/buildslave/jenkins/workspace/lldb-cmake/test/logs' Change dir to: /Users/buildslave/jenkins/workspace/lldb-cmake/llvm-project/lldb/test/API/functionalities/gdb_remote_client runCmd: settings clear -all output:

Hide Details

runCmd: settings set symbols.enable-external-lookup false output:

Hide Details

runCmd: settings set target.inherit-tcc true output:

Hide Details

runCmd: settings set target.auto-apply-fixits false output:

Hide Details

runCmd: settings set plugin.process.gdb-remote.packet-timeout 60 output:

Hide Details

runCmd: settings set symbols.clang-modules-cache-path "/Users/buildslave/jenkins/workspace/lldb-cmake/lldb-build/lldb-test-build.noindex/module-cache-lldb/lldb-api" output:

Hide Details

runCmd: settings set use-color false output:

Hide Details

runCmd: setting set target.prefer-dynamic-value no-dynamic-values output:

Hide Details

FAIL: LLDB (/Users/buildslave/jenkins/workspace/lldb-cmake/lldb-build/bin/clang-x86_64) :: test (TestThreadSelectionBug.TestThreadSelectionBug) <bound method SBProcess.Kill of <lldb.SBProcess; proxy of <Swig Object of type 'lldb::SBProcess *' at 0x10b2673f0> >>: success

Hide Details

Restore dir to: /Users/buildslave/jenkins/workspace/lldb-cmake/lldb-build/tools/lldb/test ====================================================================== FAIL: test (TestThreadSelectionBug.TestThreadSelectionBug) ---------------------------------------------------------------------- Traceback (most recent call last): File "/Users/buildslave/jenkins/workspace/lldb-cmake/llvm-project/lldb/test/API/functionalities/gdb_remote_client/TestThreadSelectionBug.py", line 16, in test process = self.connect(target) File "/Users/buildslave/jenkins/workspace/lldb-cmake/llvm-project/lldb/test/API/functionalities/gdb_remote_client/gdbclientutils.py", line 519, in connect self.assertTrue(error.Success(), error.description) AssertionError: False is not True : failed to get reply to handshake packet Config=x86_64-/Users/buildslave/jenkins/workspace/lldb-cmake/lldb-build/bin/clang ---------------------------------------------------------------------- Ran 1 test in 105.461s

Hide Details

RESULT: FAILED (0 passes, 1 failures, 0 errors, 0 skipped, 0 expected failures, 0 unexpected successes)

Hide Details

--

Hide Details

******************** PASS: lldb-api :: functionalities/tail_call_frames/disambiguate_paths_to_common_sink/TestDisambiguatePathsToCommonSink.py (1632 of 2122) PASS: lldb-api :: python_api/disassemble-raw-data/TestDisassembleRawData.py (1633 of 2122) PASS: lldb-shell :: ScriptInterpreter/Python/crashlog.test (1634 of 2122) PASS: lldb-api :: commands/expression/result_numbering/TestResultNumbering.py (1635 of 2122) PASS: lldb-unit :: UnwindAssembly/x86/./UnwindAssemblyx86Tests/Testx86AssemblyInspectionEngine.TestPopRBPWithREX (1636 of 2122) PASS: lldb-unit :: ObjectFile/ELF/./ObjectFileELFTests/ObjectFileELFTest.GetModuleSpecifications_EarlySectionHeaders (1637 of 2122) PASS: lldb-api :: lang/objc/objc-new-syntax/TestObjCNewSyntaxArray.py (1638 of 2122) PASS: lldb-shell :: SymbolFile/DWARF/find-basic-function.cpp (1639 of 2122) PASS: lldb-api :: functionalities/memory/find/TestMemoryFind.py (1640 of 2122) PASS: lldb-unit :: Utility/./UtilityTests/PassiveReplayTest.InstrumentedBar (1641 of 2122) PASS: lldb-api :: commands/command/nested_alias/TestNestedAlias.py (1642 of 2122) PASS: lldb-api :: functionalities/deleted-executable/TestDeletedExecutable.py (1643 of 2122) PASS: lldb-shell :: SymbolFile/Breakpad/unwind-via-raSearch.test (1644 of 2122) PASS: lldb-api :: commands/expression/regression-access-function-template-in-record/TestRegressionAccessFunctionTemplateInRecord.py (1645 of 2122) PASS: lldb-unit :: Utility/./UtilityTests/LogChannelTest.EnableOptions (1646 of 2122) PASS: lldb-unit :: Utility/./UtilityTests/Flags.IsClear (1647 of 2122) PASS: lldb-api :: commands/target/dump-symtab-demangle/TestDumpSymtabDemangle.py (1648 of 2122) PASS: lldb-api :: lang/objc/modules-hash-mismatch/TestClangModulesHashMismatch.py (1649 of 2122) PASS: lldb-api :: lang/objc/foundation/TestRuntimeTypes.py (1650 of 2122) PASS: lldb-api :: functionalities/inferior-changed/TestInferiorChanged.py (1651 of 2122) PASS: lldb-api :: functionalities/data-formatter/data-formatter-ptr-to-array/TestPtrToArrayFormatting.py (1652 of 2122) PASS: lldb-unit :: Host/./HostTests/NativeProcessProtocolTest.SetBreakpointFailVerify (1653 of 2122) PASS: lldb-api :: macosx/universal/TestUniversal.py (1654 of 2122) PASS: lldb-unit :: Utility/./UtilityTests/StringLexerTest.HasAtLeast (1655 of 2122) PASS: lldb-unit :: Utility/./UtilityTests/UriParserTest.BadPort (1656 of 2122) PASS: lldb-unit :: Utility/./UtilityTests/RangeTest.LessThan (1657 of 2122) PASS: lldb-unit :: Utility/./UtilityTests/StringExtractorTest.GetHexU8_Underflow2_NoEof (1658 of 2122) PASS: lldb-api :: lang/objc/objc-static-method/TestObjCStaticMethod.py (1659 of 2122) PASS: lldb-api :: lang/objc/objc-new-syntax/TestObjCNewSyntaxLiteral.py (1660 of 2122) PASS: lldb-api :: functionalities/signal/TestSendSignal.py (1661 of 2122) PASS: lldb-api :: functionalities/breakpoint/scripted_bkpt/TestScriptedResolver.py (1662 of 2122) PASS: lldb-unit :: Utility/./UtilityTests/ScalarTest.CastOperations (1663 of 2122) PASS: lldb-api :: functionalities/breakpoint/breakpoint_conditions/TestBreakpointConditions.py (1664 of 2122) PASS: lldb-unit :: Utility/./UtilityTests/Flags.AnySet (1665 of 2122) PASS: lldb-api :: lang/cpp/breakpoint_in_member_func_w_non_primitive_params/TestBreakpointInMemberFuncWNonPrimitiveParams.py (1666 of 2122) PASS: lldb-unit :: Expression/./ExpressionTests/ClangHostTest.ComputeClangResourceDirectory (1667 of 2122) PASS: lldb-unit :: Utility/./UtilityTests/RangeTest.Copy (1668 of 2122) PASS: lldb-api :: functionalities/thread/exit_during_expression/TestExitDuringExpression.py (1669 of 2122) PASS: lldb-unit :: Utility/./UtilityTests/StringExtractorTest.GetU64BigEndian (1670 of 2122) PASS: lldb-unit :: Utility/./UtilityTests/BinaryStreamTest.PutULEB128MaxValue (1671 of 2122) PASS: lldb-unit :: Utility/./UtilityTests/StatusTest.ErrorConversion (1672 of 2122) PASS: lldb-unit :: Symbol/./SymbolTests/TestClangASTImporter.DeportTypeTagDecl (1673 of 2122) PASS: lldb-api :: lang/objc/rdar-11355592/TestRdar11355592.py (1674 of 2122) PASS: lldb-api :: lang/objc/global_ptrs/TestGlobalObjects.py (1675 of 2122) PASS: lldb-unit :: Utility/./UtilityTests/StringListTest.AppendStringCString (1676 of 2122) UNSUPPORTED: lldb-api :: functionalities/tty/TestTerminal.py (1677 of 2122) PASS: lldb-api :: functionalities/data-formatter/pyobjsynthprovider/TestPyObjSynthProvider.py (1678 of 2122) PASS: lldb-api :: commands/register/register/register_command/TestRegisters.py (1679 of 2122) PASS: lldb-unit :: Utility/./UtilityTests/OptionsWithRawTest.WhitespaceSuffix (1680 of 2122) PASS: lldb-unit :: DataFormatter/./LLDBFormatterTests/TypeMatcherTests.ExactName (1681 of 2122) PASS: lldb-shell :: Minidump/disassemble-no-module.yaml (1682 of 2122) PASS: lldb-unit :: UnwindAssembly/x86/./UnwindAssemblyx86Tests/Testx86AssemblyInspectionEngine.TestPushR14 (1683 of 2122) PASS: lldb-unit :: Utility/./UtilityTests/DataExtractorTest.GetMaxU64 (1684 of 2122) PASS: lldb-api :: functionalities/data-formatter/data-formatter-skip-summary/TestDataFormatterSkipSummary.py (1685 of 2122) PASS: lldb-unit :: Utility/./UtilityTests/StringListTest.SetSize (1686 of 2122) PASS: lldb-shell :: SymbolFile/NativePDB/break-by-line.cpp (1687 of 2122) PASS: lldb-api :: commands/expression/import-std-module/deque-basic/TestDequeFromStdModule.py (1688 of 2122) PASS: lldb-unit :: Utility/./UtilityTests/DataExtractorTest.GetFloatUnaligned (1689 of 2122) PASS: lldb-unit :: Utility/./UtilityTests/DataExtractorTest.GetFloat (1690 of 2122) PASS: lldb-api :: lang/objc/modules-inline-functions/TestModulesInlineFunctions.py (1691 of 2122) PASS: lldb-unit :: Utility/./UtilityTests/RangeDataVector.FindEntryThatContains (1692 of 2122) PASS: lldb-shell :: SymbolFile/DWARF/dwp-separate-debug-file.cpp (1693 of 2122) PASS: lldb-unit :: ScriptInterpreter/Python/./ScriptInterpreterPythonTests/PythonDataObjectsTest.TestPythonStringToStr (1694 of 2122) PASS: lldb-unit :: Symbol/./SymbolTests/LineEntryTest.GetSameLineContiguousAddressRangeOneInline (1695 of 2122) PASS: lldb-unit :: Symbol/./SymbolTests/TestTypeSystemClang.TestFunctionTemplateInRecordConstruction (1696 of 2122) PASS: lldb-unit :: SymbolFile/NativePDB/./SymbolFileNativePDBTests/PDBFPOProgramToDWARFExpressionTests.InvalidAssignmentSingle (1697 of 2122) UNSUPPORTED: lldb-shell :: Register/x86-64-ymm16-read.test (1698 of 2122) PASS: lldb-unit :: Utility/./UtilityTests/ProcessInstanceInfo.DumpTable (1699 of 2122) PASS: lldb-api :: commands/target/modules/search-paths/insert/TestTargetModulesSearchpathsInsert.py (1700 of 2122) UNSUPPORTED: lldb-api :: tools/lldb-vscode/disconnect/TestVSCode_disconnect.py (1701 of 2122) PASS: lldb-unit :: Symbol/./SymbolTests/Type.GetTypeScopeAndBasename (1702 of 2122) PASS: lldb-unit :: Process/minidump/./LLDBMinidumpTests/MinidumpParserTest.GetExceptionStream (1703 of 2122) UNSUPPORTED: lldb-api :: functionalities/longjmp/TestLongjmp.py (1704 of 2122) PASS: lldb-api :: lang/objc/hidden-ivars/TestHiddenIvars.py (1705 of 2122) PASS: lldb-api :: lang/cpp/function-qualifiers/TestCppFunctionQualifiers.py (1706 of 2122) PASS: lldb-unit :: Process/minidump/./LLDBMinidumpTests/MinidumpParserTest.FindMemoryRange (1707 of 2122) PASS: lldb-api :: commands/expression/rdar44436068/Test128BitsInteger.py (1708 of 2122) PASS: lldb-unit :: Utility/./UtilityTests/StringListTest.GetMaxStringLengthEqualSize (1709 of 2122) PASS: lldb-unit :: Utility/./UtilityTests/GeneratorTest.Create (1710 of 2122) PASS: lldb-api :: functionalities/data-formatter/var-in-aggregate-misuse/TestVarInAggregateMisuse.py (1711 of 2122) PASS: lldb-unit :: Utility/./UtilityTests/TildeExpressionResolver.ResolveFullPath (1712 of 2122) PASS: lldb-api :: lang/cpp/gmodules-templates/TestGModules.py (1713 of 2122) PASS: lldb-shell :: Settings/TestSettingsWrite.test (1714 of 2122) UNSUPPORTED: lldb-shell :: SymbolFile/NativePDB/local-variables.cpp (1715 of 2122) PASS: lldb-api :: functionalities/breakpoint/breakpoint_set_restart/TestBreakpointSetRestart.py (1716 of 2122) PASS: lldb-unit :: Utility/./UtilityTests/NameMatchesTest.EndsWith (1717 of 2122) PASS: lldb-unit :: Utility/./UtilityTests/StringListTest.JoinSingle (1718 of 2122) PASS: lldb-unit :: Symbol/./SymbolTests/TestTypeSystemClang.TestGetEnumIntegerTypeBasicTypes (1719 of 2122) PASS: lldb-unit :: UnwindAssembly/ARM64/./Arm64InstEmulationTests/TestArm64InstEmulation.TestFramelessThreeEpilogueFunction (1720 of 2122) UNSUPPORTED: lldb-shell :: ScriptInterpreter/Lua/command_script_import.test (1721 of 2122) PASS: lldb-unit :: Process/gdb-remote/./ProcessGdbRemoteTests/GDBRemoteCommunicationClientTest.GetModulesInfoInvalidResponse (1722 of 2122) PASS: lldb-shell :: Commands/command-backtrace.test (1723 of 2122) PASS: lldb-api :: commands/frame/language/TestGuessLanguage.py (1724 of 2122) PASS: lldb-api :: functionalities/testid/TestTestId.py (1725 of 2122) PASS: lldb-api :: lang/cpp/char8_t/TestCxxChar8_t.py (1726 of 2122) PASS: lldb-api :: functionalities/data-formatter/nsdictionarysynth/TestNSDictionarySynthetic.py (1727 of 2122) PASS: lldb-unit :: Target/./TargetTests/MCBasedABI.MapRegisterName (1728 of 2122) PASS: lldb-unit :: Utility/./UtilityTests/RangeTest.ContainsEndInclusive (1729 of 2122) PASS: lldb-api :: functionalities/inferior-crashing/recursive-inferior/TestRecursiveInferior.py (1730 of 2122) PASS: lldb-api :: tools/lldb-server/TestLldbGdbServer.py (1731 of 2122) PASS: lldb-api :: python_api/symbol-context/two-files/TestSymbolContextTwoFiles.py (1732 of 2122) PASS: lldb-unit :: Utility/./UtilityTests/StringExtractorTest.GetHexBytes_FullString (1733 of 2122) PASS: lldb-api :: commands/expression/top-level/TestTopLevelExprs.py (1734 of 2122) PASS: lldb-unit :: Utility/./UtilityTests/StringExtractorTest.GetNameColonValueNoSemicolon (1735 of 2122) PASS: lldb-unit :: Symbol/./SymbolTests/TestTypeSystemClang.TestNotDeletingUserCopyCstrDueToMoveCStr (1736 of 2122) PASS: lldb-unit :: Utility/./UtilityTests/ProcessInfoTest.Constructor (1737 of 2122) PASS: lldb-api :: lang/cpp/class-template-parameter-pack/TestClassTemplateParameterPack.py (1738 of 2122) PASS: lldb-api :: python_api/class_members/TestSBTypeClassMembers.py (1739 of 2122) PASS: lldb-api :: commands/expression/invalid-args/TestInvalidArgsExpression.py (1740 of 2122) PASS: lldb-unit :: Utility/./UtilityTests/Flags.Test (1741 of 2122) PASS: lldb-unit :: Symbol/./SymbolTests/PostfixExpression.ToDWARF (1742 of 2122) PASS: lldb-shell :: SymbolFile/DWARF/dwarf5-partial-index.cpp (1743 of 2122) UNSUPPORTED: lldb-api :: arm/breakpoint-thumb-codesection/TestBreakpointThumbCodesection.py (1744 of 2122) PASS: lldb-unit :: Signals/./SignalsTests/UnixSignalsTest.VersionChange (1745 of 2122) PASS: lldb-unit :: Host/./HostTests/File.GetStreamFromDescriptor (1746 of 2122) PASS: lldb-unit :: Utility/./UtilityTests/ArgsTest.TestArgv (1747 of 2122) PASS: lldb-unit :: Utility/./UtilityTests/StreamTeeTest.SetStreamAtIndexOverwrite (1748 of 2122) PASS: lldb-unit :: Process/minidump/./LLDBMinidumpTests/MinidumpParserTest.GetThreadsAndGetThreadContext (1749 of 2122) PASS: lldb-unit :: Utility/./UtilityTests/BroadcasterTest.EventTypeHasListeners (1750 of 2122) PASS: lldb-unit :: Utility/./UtilityTests/OptionsWithRawTest.ArgsButNoDelimiter (1751 of 2122) PASS: lldb-shell :: ObjectFile/ELF/aarch64-relocations.yaml (1752 of 2122) PASS: lldb-api :: iohandler/completion/TestIOHandlerCompletion.py (1753 of 2122) PASS: lldb-api :: commands/add-dsym/uuid/TestAddDsymCommand.py (1754 of 2122) PASS: lldb-unit :: Utility/./UtilityTests/VMRange.Comparison (1755 of 2122) PASS: lldb-api :: source-manager/TestSourceManager.py (1756 of 2122) PASS: lldb-shell :: Driver/TestTarget.test (1757 of 2122) PASS: lldb-unit :: ScriptInterpreter/Python/./ScriptInterpreterPythonTests/PythonDataObjectsTest.TestPythonTupleInitializerList2 (1758 of 2122) UNSUPPORTED: lldb-api :: functionalities/darwin_log/source/info/TestDarwinLogSourceInfo.py (1759 of 2122) UNSUPPORTED: lldb-api :: benchmarks/expression/TestExpressionCmd.py (1760 of 2122) PASS: lldb-shell :: SymbolFile/DWARF/compilercontext.ll (1761 of 2122) PASS: lldb-shell :: ObjectFile/Breakpad/sections.test (1762 of 2122) PASS: lldb-api :: lang/objc/orderedset/TestOrderedSet.py (1763 of 2122) PASS: lldb-unit :: Utility/./UtilityTests/NameMatchesTest.RegularExpression (1764 of 2122) PASS: lldb-unit :: Utility/./UtilityTests/ScalarTest.Division (1765 of 2122) PASS: lldb-api :: functionalities/fat_archives/TestFatArchives.py (1766 of 2122) PASS: lldb-unit :: SymbolFile/DWARF/./SymbolFileDWARFTests/SymbolFileDWARFTests.TestAbbrevInvalidNULLTag (1767 of 2122) PASS: lldb-unit :: Expression/./ExpressionTests/DWARFExpression.DW_OP_convert (1768 of 2122) PASS: lldb-shell :: ObjectFile/ELF/avr-basic-info.yaml (1769 of 2122) PASS: lldb-unit :: Process/gdb-remote/./ProcessGdbRemoteTests/GDBRemoteCommunicationServerTest.SendErrorResponse_ErrorNumber (1770 of 2122) PASS: lldb-api :: types/TestCharType.py (1771 of 2122) PASS: lldb-unit :: Utility/./UtilityTests/XcodeSDKTest.FindXcodeContentsDirectoryInPath (1772 of 2122) PASS: lldb-api :: python_api/default-constructor/TestDefaultConstructorForAPIObjects.py (1773 of 2122) PASS: lldb-api :: python_api/type/TestTypeList.py (1774 of 2122) PASS: lldb-unit :: Symbol/./SymbolTests/TestClangASTImporter.CopyDeclTagDecl (1775 of 2122) PASS: lldb-unit :: Host/./HostTests/FileSystemTest.Readable (1776 of 2122) PASS: lldb-unit :: UnwindAssembly/ARM64/./Arm64InstEmulationTests/TestArm64InstEmulation.TestMediumDarwinFunction (1777 of 2122) PASS: lldb-unit :: Utility/./UtilityTests/SubsystemRAIITest.NormalSubsystem (1778 of 2122) PASS: lldb-api :: commands/expression/import-std-module/forward_list/TestForwardListFromStdModule.py (1779 of 2122) PASS: lldb-unit :: Utility/./UtilityTests/VASprintfTest.EncodingError (1780 of 2122) PASS: lldb-unit :: Utility/./UtilityTests/StreamTest.PutBytesAsRawHex8ToBigEndian (1781 of 2122) UNSUPPORTED: lldb-api :: benchmarks/libcxxlist/TestBenchmarkLibcxxList.py (1782 of 2122) PASS: lldb-unit :: Utility/./UtilityTests/ArgsTest.TestQuotedTrailingBackslash (1783 of 2122) UNSUPPORTED: lldb-shell :: Reproducer/TestLuaImport.test (1784 of 2122) PASS: lldb-unit :: Utility/./UtilityTests/CompletionRequest.ShiftArguments (1785 of 2122) PASS: lldb-unit :: Process/minidump/./LLDBMinidumpTests/RegisterContextMinidump.ConvertMinidumpContext_x86_32 (1786 of 2122) PASS: lldb-api :: lang/cpp/extern_c/TestExternCSymbols.py (1787 of 2122) PASS: lldb-unit :: UnwindAssembly/x86/./UnwindAssemblyx86Tests/Testx86AssemblyInspectionEngine.TestPushR15 (1788 of 2122) PASS: lldb-shell :: SymbolFile/DWARF/find-variable-file.cpp (1789 of 2122) PASS: lldb-api :: lang/cpp/rvalue-references/TestRvalueReferences.py (1790 of 2122) PASS: lldb-unit :: Process/gdb-remote/./ProcessGdbRemoteTests/GDBRemoteCommunicationClientTest.GetQOffsets (1791 of 2122) PASS: lldb-unit :: Utility/./UtilityTests/BinaryStreamTest.PutULEB128TwoBytes (1792 of 2122) PASS: lldb-unit :: Expression/./ExpressionTests/DWARFExpression.DW_OP_piece (1793 of 2122) PASS: lldb-unit :: Utility/./UtilityTests/StringListTest.LongestCommonPrefixDuplicateElement (1794 of 2122) PASS: lldb-api :: lang/objc/modules-compile-error/TestModulesCompileError.py (1795 of 2122) PASS: lldb-shell :: Commands/command-source.test (1796 of 2122) PASS: lldb-shell :: Commands/command-breakpoint-col.test (1797 of 2122) PASS: lldb-unit :: Utility/./UtilityTests/CompletionRequest.TryCompleteCurrentArgGood (1798 of 2122) PASS: lldb-api :: commands/expression/no-deadlock/TestExprDoesntBlock.py (1799 of 2122) PASS: lldb-api :: functionalities/thread/concurrent_events/TestConcurrentBreakpointDelayBreakpointOneSignal.py (1800 of 2122) PASS: lldb-unit :: Utility/./UtilityTests/StreamTeeTest.Assignment (1801 of 2122) PASS: lldb-api :: commands/settings/use_source_cache/TestUseSourceCache.py (1802 of 2122) PASS: lldb-unit :: Utility/./UtilityTests/OptionsWithRawTest.EmptySuffix (1803 of 2122) PASS: lldb-api :: commands/expression/radar_8638051/Test8638051.py (1804 of 2122) PASS: lldb-api :: lang/c/local_types/TestUseClosestType.py (1805 of 2122) PASS: lldb-unit :: Utility/./UtilityTests/ScalarTest.GetBytes (1806 of 2122) PASS: lldb-api :: types/TestLongTypesExpr.py (1807 of 2122) PASS: lldb-api :: lang/objc/modules-app-update/TestClangModulesAppUpdate.py (1808 of 2122) PASS: lldb-shell :: SymbolFile/DWARF/anon_class_w_and_wo_export_symbols.ll (1809 of 2122) UNSUPPORTED: lldb-api :: benchmarks/continue/TestBenchmarkContinue.py (1810 of 2122) PASS: lldb-unit :: Process/minidump/./LLDBMinidumpTests/MinidumpParserTest.InvalidMinidump (1811 of 2122) PASS: lldb-unit :: UnwindAssembly/x86/./UnwindAssemblyx86Tests/Testx86AssemblyInspectionEngine.TestPushR13 (1812 of 2122) PASS: lldb-api :: commands/command/script/import/rdar-12586188/TestRdar12586188.py (1813 of 2122) PASS: lldb-unit :: Utility/./UtilityTests/ScalarTest.ComparisonFloat (1814 of 2122) PASS: lldb-api :: lang/cpp/covariant-return-types/TestCovariantReturnTypes.py (1815 of 2122) PASS: lldb-unit :: Utility/./UtilityTests/DataExtractorTest.GetCStrAtEnd (1816 of 2122) PASS: lldb-shell :: SymbolFile/DWARF/debug_loc-aslr.s (1817 of 2122) PASS: lldb-api :: functionalities/data-formatter/data-formatter-objc/TestDataFormatterObjCCF.py (1818 of 2122) PASS: lldb-unit :: Utility/./UtilityTests/XcodeSDKTest.MergeTest (1819 of 2122) PASS: lldb-unit :: Utility/./UtilityTests/RangeTest.ContainsAddrInvalid (1820 of 2122) PASS: lldb-unit :: ScriptInterpreter/Python/./ScriptInterpreterPythonTests/PythonDataObjectsTest.TestPythonTupleInitializerList (1821 of 2122) PASS: lldb-shell :: SymbolFile/DWARF/dir-separator-no-comp-dir.s (1822 of 2122) PASS: lldb-shell :: Reproducer/TestCrash.test (1823 of 2122) PASS: lldb-unit :: UnwindAssembly/x86/./UnwindAssemblyx86Tests/Testx86AssemblyInspectionEngine.TestSubESP (1824 of 2122) PASS: lldb-unit :: Symbol/./SymbolTests/TestTypeSystemClang.TestGetTypeClassTypeOfExpr (1825 of 2122) PASS: lldb-api :: functionalities/breakpoint/breakpoint_ignore_count/TestBreakpointIgnoreCount.py (1826 of 2122) PASS: lldb-shell :: Breakpoint/split-dwarf-5-addrbase.test (1827 of 2122) PASS: lldb-unit :: Utility/./UtilityTests/RangeDataVector.CustomSort (1828 of 2122) PASS: lldb-unit :: Utility/./UtilityTests/OptionsWithRawTest.SingleWordSuffix (1829 of 2122) PASS: lldb-shell :: Reproducer/TestCaptureEnvOverride.test (1830 of 2122) PASS: lldb-api :: functionalities/thread/concurrent_events/TestConcurrentDelayedCrashWithBreakpointWatchpoint.py (1831 of 2122) PASS: lldb-api :: lang/cpp/type_lookup/TestCppTypeLookup.py (1832 of 2122) PASS: lldb-unit :: Host/./HostTests/MainLoopTest.ReadObject (1833 of 2122) PASS: lldb-unit :: Symbol/./SymbolTests/TestTypeSystemClang.TestGetEnumIntegerTypeUnexpectedType (1834 of 2122) PASS: lldb-api :: functionalities/gdb_remote_client/TestNoWatchpointSupportInfo.py (1835 of 2122) PASS: lldb-api :: api/log/TestAPILog.py (1836 of 2122) PASS: lldb-unit :: Utility/./UtilityTests/StreamTest.QuotedCString (1837 of 2122) PASS: lldb-api :: commands/frame/select/TestFrameSelect.py (1838 of 2122) PASS: lldb-api :: functionalities/thread/thread_specific_break/TestThreadSpecificBreakpoint.py (1839 of 2122) PASS: lldb-unit :: Utility/./UtilityTests/OptionsWithRawTest.QuotedSuffix (1840 of 2122) PASS: lldb-unit :: Symbol/./SymbolTests/DWARFCallFrameInfoTest.Basic_dwarf4 (1841 of 2122) PASS: lldb-unit :: Utility/./UtilityTests/StatusTest.ErrorConstructor (1842 of 2122) UNSUPPORTED: lldb-api :: functionalities/thread/thread_specific_break_plus_condition/TestThreadSpecificBpPlusCondition.py (1843 of 2122) PASS: lldb-api :: functionalities/data-formatter/type_summary_list_arg/TestTypeSummaryListArg.py (1844 of 2122) UNSUPPORTED: lldb-api :: benchmarks/stepping/TestSteppingSpeed.py (1845 of 2122) PASS: lldb-unit :: Language/Highlighting/./HighlighterTests/HighlighterTest.ClangEmptyInput (1846 of 2122) PASS: lldb-api :: functionalities/thread/concurrent_events/TestConcurrentBreakpointOneDelayBreakpointThreads.py (1847 of 2122) PASS: lldb-shell :: ObjectFile/ELF/duplicate-section.yaml (1848 of 2122) PASS: lldb-api :: tools/lldb-server/TestGdbRemoteExitCode.py (1849 of 2122) PASS: lldb-unit :: Process/gdb-remote/./ProcessGdbRemoteTests/GDBRemoteClientBaseTest.SendContinueAndAsyncPacket (1850 of 2122) PASS: lldb-api :: lang/cpp/breakpoint-commands/TestCPPBreakpointCommands.py (1851 of 2122) PASS: lldb-api :: functionalities/data-formatter/data-formatter-objc/TestDataFormatterObjCNSURL.py (1852 of 2122) PASS: lldb-unit :: Utility/./UtilityTests/BinaryStreamTest.PutULEB128SevenBytes (1853 of 2122) PASS: lldb-api :: functionalities/gdb_remote_client/TestRestartBug.py (1854 of 2122) PASS: lldb-api :: python_api/file_handle/TestFileHandle.py (1855 of 2122) PASS: lldb-api :: commands/watchpoints/hello_watchpoint/TestMyFirstWatchpoint.py (1856 of 2122) UNSUPPORTED: lldb-shell :: SymbolFile/DWARF/DW_TAG_GNU_call_site-DW_AT_low_pc.s (1857 of 2122) PASS: lldb-unit :: Utility/./UtilityTests/BinaryStreamTest.PutSLEB128One (1858 of 2122) PASS: lldb-unit :: Process/gdb-remote/./ProcessGdbRemoteTests/GDBRemoteClientBaseTest.SendContinueDelegateInterface (1859 of 2122) PASS: lldb-api :: sample_test/TestSampleInlineTest.py (1860 of 2122) PASS: lldb-unit :: Utility/./UtilityTests/StringListTest.AppendListCStringArray (1861 of 2122) UNSUPPORTED: lldb-api :: functionalities/data-formatter/data-formatter-stl/libstdcpp/vector/TestDataFormatterStdVector.py (1862 of 2122) PASS: lldb-api :: lang/cpp/unique-types/TestUniqueTypes.py (1863 of 2122) PASS: lldb-unit :: UnwindAssembly/x86/./UnwindAssemblyx86Tests/Testx86AssemblyInspectionEngine.TestPopRBP (1864 of 2122) PASS: lldb-unit :: Utility/./UtilityTests/StreamTeeTest.CopyConstructor (1865 of 2122) PASS: lldb-api :: lang/objc/foundation/TestObjCMethodsNSError.py (1866 of 2122) PASS: lldb-api :: commands/reproducer/invalid-args/TestInvalidArgsReproducer.py (1867 of 2122) PASS: lldb-unit :: Language/Highlighting/./HighlighterTests/HighlighterTest.DefaultHighlighter (1868 of 2122) UNSUPPORTED: lldb-api :: commands/expression/call-restarts/TestCallThatRestarts.py (1869 of 2122) PASS: lldb-unit :: Utility/./UtilityTests/FileSpecTest.Equal (1870 of 2122) PASS: lldb-unit :: Utility/./UtilityTests/SharedCluster.ClusterManager (1871 of 2122) PASS: lldb-api :: lang/c/vla/TestVLA.py (1872 of 2122) PASS: lldb-unit :: debugserver/./debugserverTests/RNBSocket.LoopBackListenIPv6 (1873 of 2122) PASS: lldb-api :: functionalities/data-formatter/builtin-formats/TestBuiltinFormats.py (1874 of 2122) PASS: lldb-api :: functionalities/dead-strip/TestDeadStrip.py (1875 of 2122) PASS: lldb-unit :: SymbolFile/DWARF/./SymbolFileDWARFTests/DWARFASTParserClangTests.EnsureAllDIEsInDeclContextHaveBeenParsedParsesOnlyMatchingEntries (1876 of 2122) PASS: lldb-unit :: Utility/./UtilityTests/TimeoutTest.Format (1877 of 2122) PASS: lldb-api :: functionalities/thread/concurrent_events/TestConcurrentDelaySignalBreak.py (1878 of 2122) PASS: lldb-unit :: Utility/./UtilityTests/FileSpecTest.AppendPathComponent (1879 of 2122) PASS: lldb-unit :: UnwindAssembly/x86/./UnwindAssemblyx86Tests/Testx86AssemblyInspectionEngine.TestPopESI (1880 of 2122) PASS: lldb-api :: python_api/formatters/TestFormattersSBAPI.py (1881 of 2122) PASS: lldb-unit :: debugserver/./debugserverTests/RNBSocket.LoopBackConnectIPv6 (1882 of 2122) PASS: lldb-unit :: Target/./TargetTests/PathMappingListTest.RemapRoot (1883 of 2122) PASS: lldb-unit :: ScriptInterpreter/Python/./ScriptInterpreterPythonTests/PythonDataObjectsTest.TestPythonIntegerToStr (1884 of 2122) PASS: lldb-unit :: Utility/./UtilityTests/StreamTest.SetIndentLevel (1885 of 2122) UNSUPPORTED: lldb-api :: macosx/macCatalystAppMacOSFramework/TestMacCatalystAppWithMacOSFramework.py (1886 of 2122) PASS: lldb-unit :: ScriptInterpreter/Python/./ScriptInterpreterPythonTests/PythonDataObjectsTest.TestExtractingUInt64ThroughStructuredData (1887 of 2122) PASS: lldb-api :: functionalities/gdb_remote_client/TestIOSSimulator.py (1888 of 2122) PASS: lldb-unit :: tools/lldb-server/tests/./LLDBServerTests/TestBase.DebugserverEnv (1889 of 2122) PASS: lldb-unit :: ObjectFile/Breakpad/./ObjectFileBreakpadTests/InfoRecord.parse (1890 of 2122) PASS: lldb-api :: lang/objc/foundation/TestObjCMethodsNSArray.py (1891 of 2122) PASS: lldb-unit :: Language/Highlighting/./HighlighterTests/HighlighterTest.Keywords (1892 of 2122) PASS: lldb-unit :: ScriptInterpreter/Python/./ScriptInterpreterPythonTests/PythonDataObjectsTest.TestScript (1893 of 2122) PASS: lldb-unit :: Utility/./UtilityTests/RangeTest.Constructor (1894 of 2122) PASS: lldb-api :: lang/c/const_variables/TestConstVariables.py (1895 of 2122) PASS: lldb-api :: lang/objcxx/objcxx-ivar-vector/TestIvarVector.py (1896 of 2122) PASS: lldb-unit :: UnwindAssembly/x86/./UnwindAssemblyx86Tests/Testx86AssemblyInspectionEngine.TestStackRealign32BitDisp_x86_64 (1897 of 2122) PASS: lldb-shell :: SymbolFile/DWARF/limit-debug-info.s (1898 of 2122) PASS: lldb-unit :: Core/./LLDBCoreTests/MangledTest.EmptyForInvalidName (1899 of 2122) PASS: lldb-api :: functionalities/thread/concurrent_events/TestConcurrentManyBreakpoints.py (1900 of 2122) PASS: lldb-unit :: Host/./HostTests/FileSystemTest.FileAndDirectoryComponents (1901 of 2122) PASS: lldb-unit :: Host/./HostTests/Host.GetEnvironment (1902 of 2122) PASS: lldb-shell :: ObjectFile/ELF/PT_TLS-overlap-PT_LOAD.yaml (1903 of 2122) PASS: lldb-unit :: Editline/./EditlineTests/EditlineTestFixture.EditlineReceivesMultiLineText (1904 of 2122) PASS: lldb-api :: commands/expression/inline-namespace/TestInlineNamespace.py (1905 of 2122) PASS: lldb-unit :: Symbol/./SymbolTests/TestClangASTImporter.CopyTypeTagDecl (1906 of 2122) PASS: lldb-api :: functionalities/thread/concurrent_events/TestConcurrentWatchpointWithDelayWatchpointThreads.py (1907 of 2122) PASS: lldb-unit :: Utility/./UtilityTests/Predicate.WaitForValueNotEqualTo (1908 of 2122) PASS: lldb-unit :: UnwindAssembly/x86/./UnwindAssemblyx86Tests/Testx86AssemblyInspectionEngine.TestSimplex86_64Augmented (1909 of 2122) PASS: lldb-api :: tools/lldb-vscode/variables/TestVSCode_variables.py (1910 of 2122) PASS: lldb-shell :: Host/TestCustomShell.test (1911 of 2122) PASS: lldb-unit :: ScriptInterpreter/Python/./ScriptInterpreterPythonTests/PythonDataObjectsTest.TestResetting (1912 of 2122) PASS: lldb-api :: functionalities/target-new-solib-notifications/TestModuleLoadedNotifys.py (1913 of 2122) UNSUPPORTED: lldb-api :: functionalities/signal/handle-segv/TestHandleSegv.py (1914 of 2122) PASS: lldb-api :: lang/cpp/multiple-inheritance/TestCppMultipleInheritance.py (1915 of 2122) PASS: lldb-unit :: Platform/./LLDBPlatformTests/PlatformAppleSimulatorTest.TestSimHasSimEnvionament (1916 of 2122) PASS: lldb-unit :: Utility/./UtilityTests/StreamTest.PutCStringWithStringRef (1917 of 2122) PASS: lldb-api :: functionalities/signal/handle-abrt/TestHandleAbort.py (1918 of 2122) PASS: lldb-unit :: ScriptInterpreter/Python/./ScriptInterpreterPythonTests/PythonDataObjectsTest.TestPythonStringToStructuredString (1919 of 2122) PASS: lldb-api :: functionalities/thread/concurrent_events/TestConcurrentSignalBreak.py (1920 of 2122) PASS: lldb-api :: functionalities/data-formatter/summary-string-onfail/Test-rdar-9974002.py (1921 of 2122) PASS: lldb-api :: functionalities/gdb_remote_client/TestRecognizeBreakpoint.py (1922 of 2122) PASS: lldb-api :: functionalities/thread/concurrent_events/TestConcurrentTwoBreakpointsOneSignal.py (1923 of 2122) UNSUPPORTED: lldb-shell :: SymbolFile/PDB/expressions.test (1924 of 2122) PASS: lldb-api :: lang/cpp/namespace_conflicts/TestNamespaceConflicts.py (1925 of 2122) PASS: lldb-unit :: Utility/./UtilityTests/ScalarTest.Getters (1926 of 2122) PASS: lldb-api :: lang/objcxx/class-name-clash/TestNameClash.py (1927 of 2122) PASS: lldb-shell :: Register/x86-64-ymm-read.test (1928 of 2122) PASS: lldb-api :: macosx/find-app-in-bundle/TestFindAppInBundle.py (1929 of 2122) PASS: lldb-api :: lang/c/unions/TestUnionMembers.py (1930 of 2122) PASS: lldb-unit :: Language/CPlusPlus/./LanguageCPlusPlusTests/CPlusPlusLanguage.MethodNameParsing (1931 of 2122) PASS: lldb-api :: functionalities/breakpoint/breakpoint_command/TestBreakpointCommand.py (1932 of 2122) PASS: lldb-unit :: Utility/./UtilityTests/UriParserTest.TypicalPortPathIPv6 (1933 of 2122) PASS: lldb-api :: commands/expression/anonymous-struct/TestCallUserAnonTypedef.py (1934 of 2122) PASS: lldb-unit :: Utility/./UtilityTests/SerializationRountripTest.SerializeDeserializeCStringArrayNullptr (1935 of 2122) PASS: lldb-unit :: Utility/./UtilityTests/ArgsTest.TestOverwriteArgs (1936 of 2122) PASS: lldb-shell :: Process/Optimization.test (1937 of 2122) UNSUPPORTED: lldb-shell :: SymbolFile/PDB/class-layout.test (1938 of 2122) PASS: lldb-api :: functionalities/thread/concurrent_events/TestConcurrentTwoBreakpointsOneWatchpoint.py (1939 of 2122) PASS: lldb-api :: lang/objc/conflicting-definition/TestConflictingDefinition.py (1940 of 2122) PASS: lldb-api :: functionalities/postmortem/wow64_minidump/TestWow64MiniDump.py (1941 of 2122) PASS: lldb-api :: commands/quit/TestQuit.py (1942 of 2122) PASS: lldb-unit :: SymbolFile/NativePDB/./SymbolFileNativePDBTests/PDBFPOProgramToDWARFExpressionTests.MissingTargetRegister (1943 of 2122) PASS: lldb-unit :: Utility/./UtilityTests/VMRange.Reset (1944 of 2122) PASS: lldb-unit :: Host/./HostTests/SocketTest.DomainListenConnectAccept (1945 of 2122) PASS: lldb-shell :: ObjectFile/ELF/build-id-case.yaml (1946 of 2122) PASS: lldb-shell :: SymbolFile/DWARF/debug_ranges_and_rnglists.test (1947 of 2122) PASS: lldb-unit :: Language/Highlighting/./HighlighterTests/HighlighterTest.ClangCommas (1948 of 2122) PASS: lldb-unit :: Symbol/./SymbolTests/DWARFCallFrameInfoTest.Basic_eh (1949 of 2122) PASS: lldb-unit :: UnwindAssembly/x86/./UnwindAssemblyx86Tests/Testx86AssemblyInspectionEngine.TestDisassemblyMidFunctionEpilogues (1950 of 2122) PASS: lldb-api :: commands/session/history/TestSessionHistory.py (1951 of 2122) PASS: lldb-unit :: Utility/./UtilityTests/Flags.AllSet (1952 of 2122) PASS: lldb-api :: functionalities/breakpoint/serialize/TestBreakpointSerialization.py (1953 of 2122) PASS: lldb-shell :: SymbolFile/DWARF/debug_aranges-empty-section.s (1954 of 2122) PASS: lldb-unit :: ScriptInterpreter/Python/./ScriptInterpreterPythonTests/PythonDataObjectsTest.TestPythonCallableCheck (1955 of 2122) PASS: lldb-api :: functionalities/gdb_remote_client/TestStopPCs.py (1956 of 2122) UNSUPPORTED: lldb-api :: python_api/event/TestEvents.py (1957 of 2122) PASS: lldb-unit :: Utility/./UtilityTests/StringExtractorTest.DecodeHexU8_Underflow2 (1958 of 2122) PASS: lldb-api :: macosx/profile_vrs_detach/TestDetachVrsProfile.py (1959 of 2122) PASS: lldb-api :: commands/process/attach/attach_denied/TestAttachDenied.py (1960 of 2122) PASS: lldb-unit :: Expression/./ExpressionTests/DiagnosticManagerTest.HasFixits (1961 of 2122) PASS: lldb-shell :: Minidump/no-process-id.yaml (1962 of 2122) PASS: lldb-shell :: Breakpoint/debug_rnglist_offset_pair.test (1963 of 2122) PASS: lldb-shell :: Reproducer/TestDSYM.test (1964 of 2122) PASS: lldb-unit :: Utility/./UtilityTests/StringExtractorTest.DecodeHexU8_InvalidHex (1965 of 2122) PASS: lldb-api :: commands/expression/persist_objc_pointeetype/TestPersistObjCPointeeType.py (1966 of 2122) PASS: lldb-unit :: ObjectFile/Breakpad/./ObjectFileBreakpadTests/StackWinRecord.parse (1967 of 2122) PASS: lldb-unit :: DataFormatter/./LLDBFormatterTests/StringPrinterTests.CxxASCII (1968 of 2122) PASS: lldb-unit :: Expression/./ExpressionTests/DiagnosticManagerTest.GetStringPreserveOrder (1969 of 2122) PASS: lldb-shell :: ObjectFile/ELF/base-address.yaml (1970 of 2122) PASS: lldb-api :: lang/c/offsetof/TestOffsetof.py (1971 of 2122) PASS: lldb-unit :: Utility/./UtilityTests/UserIDResolver.GetGroupName (1972 of 2122) PASS: lldb-unit :: Utility/./UtilityTests/OptionsWithRawTest.WhitespaceInput (1973 of 2122) PASS: lldb-unit :: Utility/./UtilityTests/DataExtractorTest.GetCStrEmpty (1974 of 2122) PASS: lldb-unit :: Utility/./UtilityTests/StructuredDataTest.ParseJSONFromFile (1975 of 2122) XFAIL: lldb-shell :: SymbolFile/DWARF/find-type-in-function.cpp (1976 of 2122) PASS: lldb-unit :: Utility/./UtilityTests/StringExtractorTest.GetHexU8_Underflow_NoEof (1977 of 2122) PASS: lldb-unit :: Language/Highlighting/./HighlighterTests/HighlighterTest.ClangCursorOutOfBounds (1978 of 2122) PASS: lldb-unit :: Host/./HostTests/SocketTest.UDPConnect (1979 of 2122) PASS: lldb-unit :: Utility/./UtilityTests/StringExtractorTest.GetHexBytesAvail_FullString (1980 of 2122) PASS: lldb-api :: commands/expression/import-std-module/unique_ptr/TestUniquePtrFromStdModule.py (1981 of 2122) UNSUPPORTED: lldb-shell :: SymbolFile/NativePDB/stack_unwinding01.cpp (1982 of 2122) PASS: lldb-unit :: ScriptInterpreter/Python/./ScriptInterpreterPythonTests/PythonDataObjectsTest.TestPythonFile (1983 of 2122) PASS: lldb-unit :: Process/minidump/./LLDBMinidumpTests/MinidumpParserTest.GetMemoryRegionInfoLinuxMaps (1984 of 2122) PASS: lldb-unit :: Symbol/./SymbolTests/TestTypeSystemClang.TestDisplayNameEmpty (1985 of 2122) PASS: lldb-api :: tools/lldb-server/TestGdbRemoteSingleStep.py (1986 of 2122) PASS: lldb-api :: functionalities/data-formatter/vector-types/TestVectorTypesFormatting.py (1987 of 2122) PASS: lldb-unit :: ScriptInterpreter/Python/./ScriptInterpreterPythonTests/PythonDataObjectsTest.TestPythonDictionaryToStructuredDictionary (1988 of 2122) PASS: lldb-unit :: Utility/./UtilityTests/FileSpecTest.GetPath (1989 of 2122) PASS: lldb-shell :: SymbolFile/DWARF/debug_line-relative_path.s (1990 of 2122) PASS: lldb-api :: commands/expression/import-std-module/basic/TestImportStdModule.py (1991 of 2122) PASS: lldb-unit :: SymbolFile/NativePDB/./SymbolFileNativePDBTests/PDBFPOProgramToDWARFExpressionTests.DependencyChain (1992 of 2122) PASS: lldb-api :: python_api/thread/TestThreadAPI.py (1993 of 2122) UNSUPPORTED: lldb-api :: tools/lldb-server/TestGdbRemoteAuxvSupport.py (1994 of 2122) PASS: lldb-unit :: Utility/./UtilityTests/PassiveReplayTest.InstrumentedFooInvalid (1995 of 2122) PASS: lldb-shell :: Heap/heap-cstr.test (1996 of 2122) XFAIL: lldb-shell :: Register/x86-64-ymm-write.test (1997 of 2122) PASS: lldb-api :: commands/watchpoints/watchpoint_commands/TestWatchpointCommands.py (1998 of 2122) PASS: lldb-api :: python_api/signals/TestSignalsAPI.py (1999 of 2122) PASS: lldb-api :: tools/lldb-server/TestGdbRemote_vCont.py (2000 of 2122) PASS: lldb-unit :: Utility/./UtilityTests/SerializationRountripTest.SerializeDeserializeObjectReference (2001 of 2122) PASS: lldb-shell :: Commands/CommandScriptImmediateOutput/CommandScriptImmediateOutputFile.test (2002 of 2122) PASS: lldb-shell :: SymbolFile/DWARF/debug-line-basic.s (2003 of 2122) PASS: lldb-unit :: Utility/./UtilityTests/VMRange.SetEndAddress (2004 of 2122) PASS: lldb-unit :: Utility/./UtilityTests/CompletionRequest.DuplicateFilteringWithComments (2005 of 2122) PASS: lldb-shell :: ObjectFile/MachO/lc_version_min.yaml (2006 of 2122) UNSUPPORTED: lldb-shell :: ScriptInterpreter/Lua/io.test (2007 of 2122) PASS: lldb-unit :: UnwindAssembly/ARM64/./Arm64InstEmulationTests/TestArm64InstEmulation.TestRegisterDoubleSpills (2008 of 2122) PASS: lldb-unit :: ScriptInterpreter/Python/./ScriptInterpreterPythonTests/PythonDataObjectsTest.TestRun (2009 of 2122) PASS: lldb-unit :: UnwindAssembly/x86/./UnwindAssemblyx86Tests/Testx86AssemblyInspectionEngine.TestPushExtended (2010 of 2122) PASS: lldb-api :: functionalities/data-formatter/data-formatter-stl/libcxx/vector/TestDataFormatterLibcxxVector.py (2011 of 2122) PASS: lldb-api :: functionalities/abbreviation/TestAbbreviations.py (2012 of 2122) UNSUPPORTED: lldb-shell :: ExecControl/StopHook/stop-hook-threads.test (2013 of 2122) PASS: lldb-api :: lang/cpp/typedef/TestCppTypedef.py (2014 of 2122) UNSUPPORTED: lldb-shell :: Register/x86-zmm-read.test (2015 of 2122) PASS: lldb-api :: lang/cpp/gmodules/TestWithModuleDebugging.py (2016 of 2122) PASS: lldb-shell :: SymbolFile/DWARF/dwarf5-index-is-used.cpp (2017 of 2122) PASS: lldb-shell :: ScriptInterpreter/None/none.test (2018 of 2122) PASS: lldb-api :: functionalities/breakpoint/inlined_breakpoints/TestInlinedBreakpoints.py (2019 of 2122) PASS: lldb-api :: tools/lldb-vscode/console/TestVSCode_console.py (2020 of 2122) PASS: lldb-api :: python_api/sbtype_typeclass/TestSBTypeTypeClass.py (2021 of 2122) PASS: lldb-unit :: Core/./LLDBCoreTests/ModuleSpecTest.InvalidInMemoryBufferValidFile (2022 of 2122) PASS: lldb-unit :: Utility/./UtilityTests/StreamTest.PutCharNull (2023 of 2122) PASS: lldb-shell :: Commands/command-target-modules-dump-sections.yaml (2024 of 2122) UNSUPPORTED: lldb-api :: arm/breakpoint-it/TestBreakpointIt.py (2025 of 2122) PASS: lldb-unit :: Utility/./UtilityTests/UriParserTest.Empty (2026 of 2122) PASS: lldb-shell :: Driver/TestRepl.test (2027 of 2122) PASS: lldb-api :: functionalities/dlopen_other_executable/TestDlopenOtherExecutable.py (2028 of 2122) PASS: lldb-unit :: Utility/./UtilityTests/StringLexerTest.PutBack (2029 of 2122) UNSUPPORTED: lldb-api :: functionalities/data-formatter/data-formatter-stl/libstdcpp/map/TestDataFormatterStdMap.py (2030 of 2122) PASS: lldb-shell :: Register/x86-64-read.test (2031 of 2122) PASS: lldb-api :: commands/expression/unicode-in-variable/TestUnicodeInVariable.py (2032 of 2122) PASS: lldb-unit :: Utility/./UtilityTests/ScalarTest.Scalar_512 (2033 of 2122) PASS: lldb-unit :: Host/./HostTests/SocketAddressTest.Set (2034 of 2122) PASS: lldb-unit :: Utility/./UtilityTests/AnsiTerminal.Empty (2035 of 2122) PASS: lldb-api :: lang/cpp/trivial_abi/TestTrivialABI.py (2036 of 2122) PASS: lldb-api :: python_api/function_symbol/TestDisasmAPI.py (2037 of 2122) UNSUPPORTED: lldb-shell :: Register/x86-ymm-write.test (2038 of 2122) UNSUPPORTED: lldb-shell :: Register/x86-64-xmm16-read.test (2039 of 2122) PASS: lldb-api :: commands/log/invalid-args/TestInvalidArgsLog.py (2040 of 2122) PASS: lldb-shell :: ObjectFile/wasm/basic.yaml (2041 of 2122) PASS: lldb-api :: functionalities/pre_run_dylibs/TestPreRunDylibs.py (2042 of 2122) PASS: lldb-unit :: Language/Highlighting/./HighlighterTests/HighlighterTest.ClangCursorPosAfterOtherToken (2043 of 2122) PASS: lldb-shell :: SymbolFile/DWARF/DW_AT_low_pc-addrx.s (2044 of 2122) PASS: lldb-unit :: Utility/./UtilityTests/PassiveReplayTest.InstrumentedFoo (2045 of 2122) PASS: lldb-shell :: SymbolFile/DWARF/array-sizes.s (2046 of 2122) PASS: lldb-api :: functionalities/thread/concurrent_events/TestConcurrentWatchpointDelayWatchpointOneBreakpoint.py (2047 of 2122) UNSUPPORTED: lldb-shell :: ScriptInterpreter/Lua/persistent_state.test (2048 of 2122) PASS: lldb-api :: functionalities/breakpoint/breakpoint_by_line_and_column/TestBreakpointByLineAndColumn.py (2049 of 2122) PASS: lldb-unit :: Host/./HostTests/FileSystemTest.Resolve (2050 of 2122) PASS: lldb-shell :: Quit/TestQuitExitCode-30.test (2051 of 2122) PASS: lldb-shell :: SymbolFile/Breakpad/line-table-missing-file.test (2052 of 2122) PASS: lldb-shell :: SymbolFile/DWARF/find-basic-namespace.cpp (2053 of 2122) PASS: lldb-api :: commands/expression/call-function/TestCallStdStringFunction.py (2054 of 2122) PASS: lldb-shell :: Commands/command-script-import.test (2055 of 2122) PASS: lldb-api :: lang/cpp/nsimport/TestCppNsImport.py (2056 of 2122) PASS: lldb-unit :: Utility/./UtilityTests/StringExtractorTest.GetHexU8_Extra_NoEof (2057 of 2122) PASS: lldb-unit :: Utility/./UtilityTests/ProcessInstanceInfoMatch.Name (2058 of 2122) PASS: lldb-api :: functionalities/thread/concurrent_events/TestConcurrentTwoBreakpointThreads.py (2059 of 2122) PASS: lldb-unit :: Symbol/./SymbolTests/TestTypeSystemClang.TestGetTypeClassTypeOf (2060 of 2122) PASS: lldb-api :: commands/frame/var/TestFrameVar.py (2061 of 2122) PASS: lldb-api :: lang/objcxx/hide-runtime-values/TestObjCXXHideRuntimeValues.py (2062 of 2122) UNSUPPORTED: lldb-api :: functionalities/darwin_log/filter/exact_match/activity-chain/TestDarwinLogFilterMatchActivityChain.py (2063 of 2122) PASS: lldb-api :: lang/cpp/namespace_definitions/TestNamespaceDefinitions.py (2064 of 2122) UNSUPPORTED: lldb-api :: commands/watchpoints/hello_watchlocation/TestWatchLocation.py (2065 of 2122) PASS: lldb-unit :: Language/Highlighting/./HighlighterTests/HighlighterTest.ClangSquareBrackets (2066 of 2122) PASS: lldb-api :: functionalities/gdb_remote_client/TestJLink6Armv7RegisterDefinition.py (2067 of 2122) PASS: lldb-unit :: Utility/./UtilityTests/XcodeSDKTest.SDKSupportsModules (2068 of 2122) PASS: lldb-unit :: Thread/./ThreadTests/ThreadTest.SetStopInfo (2069 of 2122) PASS: lldb-unit :: Language/Highlighting/./HighlighterTests/HighlighterTest.ClangUnterminatedString (2070 of 2122) PASS: lldb-unit :: Utility/./UtilityTests/ArgsTest.TestQuotedUnknownEscape (2071 of 2122) PASS: lldb-unit :: Host/./HostTests/MainLoopTest.UnmonitoredSignal (2072 of 2122) PASS: lldb-unit :: Utility/./UtilityTests/StatusTest.ErrorCodeConstructor (2073 of 2122) PASS: lldb-unit :: Utility/./UtilityTests/ScalarTest.ExtractBitfield (2074 of 2122) PASS: lldb-unit :: Utility/./UtilityTests/AnsiTerminal.AtStart (2075 of 2122) PASS: lldb-shell :: ObjectFile/ELF/PT_LOAD-overlap-PT_INTERP.yaml (2076 of 2122) PASS: lldb-unit :: Utility/./UtilityTests/StreamTest.ShiftOperatorStrings (2077 of 2122) PASS: lldb-unit :: SymbolFile/NativePDB/./SymbolFileNativePDBTests/PDBFPOProgramToDWARFExpressionTests.UnresolvedCyclicRegisterAssignmentReference (2078 of 2122) PASS: lldb-api :: commands/expression/char/TestExprsChar.py (2079 of 2122) PASS: lldb-api :: lang/cpp/class_static/TestStaticVariables.py (2080 of 2122) PASS: lldb-api :: lang/c/modules/TestCModules.py (2081 of 2122) PASS: lldb-api :: commands/process/launch-with-shellexpand/TestLaunchWithShellExpand.py (2082 of 2122) PASS: lldb-unit :: ScriptInterpreter/Python/./ScriptInterpreterPythonTests/PythonDataObjectsTest.TestPythonString (2083 of 2122) PASS: lldb-unit :: UnwindAssembly/x86/./UnwindAssemblyx86Tests/Testx86AssemblyInspectionEngine.TestPushEDX (2084 of 2122) PASS: lldb-unit :: Utility/./UtilityTests/CompletionRequest.FakeLastArg (2085 of 2122) PASS: lldb-unit :: UnwindAssembly/x86/./UnwindAssemblyx86Tests/Testx86AssemblyInspectionEngine.TestPushRBP (2086 of 2122) PASS: lldb-shell :: SymbolFile/DWARF/dwarf5-debug_line.s (2087 of 2122) PASS: lldb-shell :: SymbolFile/DWARF/debug-types-missing-signature.test (2088 of 2122) PASS: lldb-api :: functionalities/data-formatter/data-formatter-script/TestDataFormatterScript.py (2089 of 2122) PASS: lldb-api :: commands/watchpoints/watchpoint_disable/TestWatchpointDisable.py (2090 of 2122) PASS: lldb-api :: commands/thread/select/TestThreadSelect.py (2091 of 2122) PASS: lldb-unit :: Language/Highlighting/./HighlighterTests/HighlighterTest.ClangCursorPos (2092 of 2122) PASS: lldb-api :: iohandler/resize/TestIOHandlerResize.py (2093 of 2122) PASS: lldb-unit :: Expression/./ExpressionTests/CppModuleConfigurationTest.IgnoreLibStdCpp (2094 of 2122) PASS: lldb-unit :: Utility/./UtilityTests/StringListTest.InsertStringAtIndexStdString (2095 of 2122) UNSUPPORTED: lldb-api :: commands/expression/macros/TestMacros.py (2096 of 2122) PASS: lldb-unit :: Utility/./UtilityTests/LogChannelTest.List (2097 of 2122) PASS: lldb-api :: lang/cpp/diamond/TestDiamond.py (2098 of 2122) PASS: lldb-unit :: Utility/./UtilityTests/StringExtractorTest.GetNameColonValueNoColon (2099 of 2122) UNSUPPORTED: lldb-api :: commands/expression/completion-crash-invalid-iterator/TestInvalidIteratorCompletionCrash.py (2100 of 2122) PASS: lldb-unit :: debugserver/./debugserverTests/RNBSocket.LoopBackListenIPv4 (2101 of 2122) PASS: lldb-api :: commands/expression/import-std-module/no-std-module/TestMissingStdModule.py (2102 of 2122) PASS: lldb-shell :: Settings/TestLineMarkerColor.test (2103 of 2122) PASS: lldb-api :: api/multithreaded/TestMultithreaded.py (2104 of 2122) PASS: lldb-unit :: Utility/./UtilityTests/StringExtractorTest.GetHexBytesAvail (2105 of 2122) PASS: lldb-api :: functionalities/avoids-fd-leak/TestFdLeak.py (2106 of 2122) UNSUPPORTED: lldb-shell :: Register/x86-gp-write.test (2107 of 2122) UNSUPPORTED: lldb-api :: tools/lldb-server/libraries-svr4/TestGdbRemoteLibrariesSvr4Support.py (2108 of 2122) PASS: lldb-api :: functionalities/thread/step_until/TestStepUntil.py (2109 of 2122) PASS: lldb-api :: lang/c/shared_lib/TestSharedLib.py (2110 of 2122) PASS: lldb-api :: functionalities/data-formatter/hexcaps/TestDataFormatterHexCaps.py (2111 of 2122) PASS: lldb-api :: lang/cpp/signed_types/TestSignedTypes.py (2112 of 2122) PASS: lldb-api :: commands/frame/diagnose/bad-reference/TestBadReference.py (2113 of 2122) PASS: lldb-unit :: Utility/./UtilityTests/LogChannelEnabledTest.LLDB_LOG_ERROR (2114 of 2122) PASS: lldb-unit :: Utility/./UtilityTests/FileSpecTest.Match (2115 of 2122) PASS: lldb-unit :: Utility/./UtilityTests/RangeTest.EqualInvalid (2116 of 2122) PASS: lldb-api :: commands/command/source/TestCommandSource.py (2117 of 2122) PASS: lldb-unit :: Expression/./ExpressionTests/DiagnosticManagerTest.PutString (2118 of 2122) PASS: lldb-shell :: Settings/TestStopCommandSourceOnError.test (2119 of 2122) PASS: lldb-api :: functionalities/data-formatter/data-formatter-synthval/TestDataFormatterSynthVal.py (2120 of 2122) PASS: lldb-api :: lang/objc/objc-static-method-stripped/TestObjCStaticMethodStripped.py (2121 of 2122) PASS: lldb-api :: macosx/simulator/TestSimulatorPlatform.py (2122 of 2122) Slowest Tests: -------------------------------------------------------------------------- 355.08s: lldb-api :: macosx/simulator/TestSimulatorPlatform.py 106.98s: lldb-api :: functionalities/gdb_remote_client/TestGDBRemoteClient.py 106.05s: lldb-api :: functionalities/gdb_remote_client/TestThreadSelectionBug.py 102.88s: lldb-api :: tools/lldb-server/TestLldbGdbServer.py 83.42s: lldb-api :: tools/lldb-server/TestAppleSimulatorOSType.py 74.53s: lldb-api :: lang/objc/exceptions/TestObjCExceptions.py 70.12s: lldb-api :: lang/objc/objc-new-syntax/TestObjCNewSyntaxDictionary.py 70.03s: lldb-api :: lang/cpp/enum_types/TestCPP11EnumTypes.py 66.01s: lldb-api :: lang/cpp/namespace/TestNamespaceLookup.py 65.23s: lldb-api :: lang/objc/foundation/TestObjCMethods.py 62.61s: lldb-api :: lang/objc/foundation/TestFoundationDisassembly.py 61.47s: lldb-api :: lang/objc/hidden-ivars/TestHiddenIvars.py 52.05s: lldb-api :: lang/objc/objc-new-syntax/TestObjCNewSyntaxLiteral.py 48.76s: lldb-api :: api/multithreaded/TestMultithreaded.py 46.02s: lldb-api :: types/TestLongTypesExpr.py 45.94s: lldb-shell :: SymbolFile/NativePDB/global-classes.cpp 45.14s: lldb-shell :: SymbolFile/NativePDB/ast-methods.cpp 43.34s: lldb-shell :: ObjectFile/PECOFF/disassemble-thumb.yaml 42.74s: lldb-api :: lang/objc/objc_direct-methods/TestObjCDirectMethods.py 42.28s: lldb-shell :: SymbolFile/NativePDB/source-list.cpp

Hide Details

Tests Times: -------------------------------------------------------------------------- [ Range ] :: [ Percentage ] :: [ Count ] -------------------------------------------------------------------------- [340s,360s) :: [ ] :: [ 1/2122] [320s,340s) :: [ ] :: [ 0/2122] [300s,320s) :: [ ] :: [ 0/2122] [280s,300s) :: [ ] :: [ 0/2122] [260s,280s) :: [ ] :: [ 0/2122] [240s,260s) :: [ ] :: [ 0/2122] [220s,240s) :: [ ] :: [ 0/2122] [200s,220s) :: [ ] :: [ 0/2122] [180s,200s) :: [ ] :: [ 0/2122] [160s,180s) :: [ ] :: [ 0/2122] [140s,160s) :: [ ] :: [ 0/2122] [120s,140s) :: [ ] :: [ 0/2122] [100s,120s) :: [ ] :: [ 3/2122] [ 80s,100s) :: [ ] :: [ 1/2122] [ 60s, 80s) :: [ ] :: [ 7/2122] [ 40s, 60s) :: [ ] :: [ 12/2122] [ 20s, 40s) :: [ ] :: [ 51/2122] [ 0s, 20s) :: [************************************** ] :: [2047/2122] -------------------------------------------------------------------------- ******************** Failed Tests (2): lldb-api :: functionalities/gdb_remote_client/TestGDBRemoteClient.py lldb-api :: functionalities/gdb_remote_client/TestThreadSelectionBug.py

Hide Details

Hide Details

Testing Time: 2261.48s Unsupported : 150 Passed : 1964 Expectedly Failed: 6 Failed : 2 FAILED: tools/lldb/test/CMakeFiles/check-lldb-lit cd /Users/buildslave/jenkins/workspace/lldb-cmake/lldb-build/tools/lldb/test && /usr/local/Frameworks/Python.framework/Versions/3.7/bin/python3.7 /Users/buildslave/jenkins/workspace/lldb-cmake/lldb-build/./bin/llvm-lit -v --time-tests --shuffle --xunit-xml-output=/Users/buildslave/jenkins/workspace/lldb-cmake/test/results.xml -v -j 4 /Users/buildslave/jenkins/workspace/lldb-cmake/lldb-build/tools/lldb/test ninja: build stopped: subcommand failed. Command failed: Command '['/usr/bin/env', 'TERM=vt100', '/usr/local/bin/ninja', '-v', 'check-lldb']' returned non-zero exit status 1 Command: ['/usr/bin/env', 'TERM=vt100', '/usr/local/bin/ninja', '-v', 'check-lldb'] [Pipeline] } [Pipeline] // timeout [Pipeline] } [Pipeline] // stage [Pipeline] stage [Pipeline] { (Declarative: Post Actions) [Pipeline] scanForIssues [Clang (LLVM based)] Sleeping for 5 seconds due to JENKINS-32191... [Clang (LLVM based)] Parsing console log (workspace: '/Users/buildslave/jenkins/workspace/lldb-cmake') [Clang (LLVM based)] Successfully parsed console log [Clang (LLVM based)] -> found 19 issues (skipped 120 duplicates) [Clang (LLVM based)] Post processing issues on 'green-dragon-10' with source code encoding 'UTF-8' [Clang (LLVM based)] Creating SCM blamer to obtain author and commit information for affected files [Clang (LLVM based)] Creating SCM miner to obtain statistics for affected repository files [Clang (LLVM based)] Resolving file names for all issues in source directory '/Users/buildslave/jenkins/workspace/lldb-cmake' [Clang (LLVM based)] -> resolved paths in source directory (10 found, 0 not found) [Clang (LLVM based)] Resolving module names from module definitions (build.xml, pom.xml, or Manifest.mf files) [Clang (LLVM based)] -> resolved module names for 19 issues [Clang (LLVM based)] Resolving package names (or namespaces) by parsing the affected files [Clang (LLVM based)] -> resolved package names of 9 affected files [Clang (LLVM based)] No filter has been set, publishing all 18 issues [Clang (LLVM based)] Creating fingerprints for all affected code blocks to track issues over different builds [Clang (LLVM based)] -> created fingerprints for 18 issues (skipped 0 issues) [Clang (LLVM based)] Copying affected files to Jenkins' build folder '/Users/Shared/Jenkins/Home/jobs/lldb-cmake/builds/23350/files-with-issues' [Clang (LLVM based)] -> 7 copied, 2 not in workspace, 0 not-found, 0 with I/O error [Pipeline] junit Recording test results [Pipeline] } [Pipeline] // stage [Pipeline] } [Pipeline] // withEnv [Pipeline] } [Pipeline] // node [Pipeline] End of Pipeline ERROR: script returned exit code 1 Finished: FAILURE