FailedConsole Output

Skipping 9,129 KB.. Full Log
 var3;xxxx 6 x }xxxx 7 xxxxxxxxxxxxxxxxxxxxxxxxxxxxxxxxxxxxxxxxxxxxxxxxxxxxxxxxxxxxxxxxxxxxxxxxxxxxxxxxxxxxxxxxxxxxxxxxxxxxxxxxxxxxxxxxxxxxxxxxxxxxxxxxxxxxxxxxxxxxxxxxxxxxxxxxxxxxxxxxxxxxxxxxxxxxxxxxxxxxxxxxxxxxxxxxxxxxxxxxxxxxxxxxxxxxxxxxxxxxxxxxxxxxxxxxxxxxmqqqqqqqqqqqqqqqqqqqqqqqqqqqqqqqqqqqqqqqqqqqqqqqqqqqqqqqqqqqqqqqqqqqqqqqqqqqqqqqqqqqqqqqqqqqqqqqqqqqqqqqqqqqqqqqqqqqqqqqqqqqqqqqqqqqqqqqqqqqqqqqqqqqqqqqqqqqqqqqqqqqqqqqqqqqqqqqqqqqqqqqqqqqqqqqqqqqqqqqqqqqqqqqqqqqqqqqqqqqqqqqqqqqqqqqqqqqqqqqqqqqqqqqqqqqqqqqqqqqqqqqqqqqqqqqqqqqqqqqqqqqqqqqqqqqqqqqqqqqqqqqqqqqqqqqqqqqqqqqqqqqqqqqqqqqqqqqqqqqqqqqqqqqqqqqqqqqqqqqqqqqqqqqqqqqqqqqqqqqqqqqqqqqqqqqqqqqqqqjxxlqq<Variables>qqqqqqqqqqqqqqqqqqqqqqqqqqqqqqqqqqqqqqqqqqqqqqqqqqqqqqqqqqqqqqqqqqqqqqqqqqqqqqqqqqqqqqqqqqqqqqqqqqqqqqqqqqqqqqqqqqqqqqqqqqqqqqqqqqqqqqqqqqqqqqqqqqqqqqqqqqqqqqqqqqqqqqqqqqqqqqqqqqqqqqqqqqqqqqqqqqqqqqqqqqqqqqqqqqqqqqqqqqqqqqqqqqqqqqqqqqqqqqqqqqqqqqqqqqqqqqqqqqqqqqqqqqqqqqqqqqqqqqqqqqqqqqqqqqqqqqqqqqqqqqqqqqqqqqqqqqqqqqqqqqqqqqqqqqqqqqqqqqqqqqqqqqqqqqqqqqqqqqqqqqqqqqqqqqqqqqqqqqqqqqqqqkxxx (int) argc = 1xxxx `q(char **) argv = 0x00007ffeefbff8a8xxxx (int) var1 = 0xxxx (int) var2 = 0xxxx (int) var3 = 0xxxxxxxxxxxxxxxxxxxxxxxxxxxxxxxxxxxxxxxxxxxxxxxxxxxxxxxxxxxxxxxxxxxxxxxxxxxxxxxxxxxxxxxxxxxxxxxmqqqqqqqqqqqqqqqqqqqqqqqqqqqqqqqqqqqqqqqqqqqqqqqqqqqqqqqqqqqqqqqqqqqqqqqqqqqqqqqqqqqqqqqqqqqqqqqqqqqqqqqqqqqqqqqqqqqqqqqqqqqqqqqqqqqqqqqqqqqqqqqqqqqqqqqqqqqqqqqqqqqqqqqqqqqqqqqqqqqqqqqqqqqqqqqqqqqqqqqqqqqqqqqqqqqqqqqqqqqqqqqqqqqqqqqqqqqqqqqqqqqqqqqqqqqqqqqqqqqqqqqqqqqqqqqqqqqqqqqqqqqqqqqqqqqqqqqqqqqqqqqqqqqqqqqqqqqqqqqqqqqqqqqqqqqqqqqqqqqqqqqqqqqqqqqqqqqqqqqqqqqqqqqqqqqqqqqqqqqqqqqqqqqqqqqqqqqqqqjmqqqqqqqqqqqqqqqqqqqqqqqqqqqqqqqqqqqqqqqqqqqqqqqqqqqqqqqqqqqqqqqqqqqqqqqqqqqqqqqqqqqqqqqqqqqqqqqqqqjProcess: 90521    stopped               Thread: 0x1dfce9    Frame:   0  PC = 0x0000000100000f92

Hide Details

Hide Details

Hide Details

 int var1 = 1; // First break here  int var2 = 2; int var2 = 2;  int var3 = 3; 4  [?1l>(lldb) breakpoint list breakpoint list Current breakpoints: 2: file = '/Users/buildslave/jenkins/workspace/lldb-cmake/llvm-project/lldb/test/API/commands/gui/breakpoints/main.c', line = 3, exact_match = 0, locations = 1, resolved = 1, hit count = 0 2.1: where = a.out`main + 25 at main.c:3:7, address = 0x0000000100000f99, resolved, hit count = 0

Hide Details

3: file = '/Users/buildslave/jenkins/workspace/lldb-cmake/llvm-project/lldb/test/API/commands/gui/breakpoints/main.c', line = 4, exact_match = 0, locations = 1, resolved = 1, hit count = 0 3.1: where = a.out`main + 32 at main.c:4:7, address = 0x0000000100000fa0, resolved, hit count = 0

Hide Details

(lldb) gui gui (B)0[?7h[?1h=| LLDB (F1) | Target (F2) | Process (F3) | Thread (F4) | View (F5) | Help (F6) | lqq<Sources>qqqqqqqqqqqqqqqqqqqqqqqqqqqqqqqqqqqqqqqqqqqqqqqqqqqqqqqqqqqqqqqqqqqqqqqqqqqqqqqqqqqqqqqqqqqqqqqqqqqqqqqqqqqqqqqqqqqqqqqqqqqqqqqqqqqqqqqqqqqqqqqqqqqqqqqqqqqqqqqqqqqqqqqqqqqqqqqqqqqqqqqqqqqqqqqqqqqqqqqqqqqqqqqqqqqqqqqqqqqqqqqqqqqqqqqqqqqqqqqqqqqqqqqqqqqqqqqqqqqqqqqqqqqqqqqqqqqqqqqqqqqqqqqqqqqqqqqqqqqqqqqqqqqqqqqqqqqqqqqqqqqqqqqqqqqqqqqqqqqqqqqqqqqqqqqqqqqqqqqqqqqqqqqqqqqqqqqqqqqqqqqqqqqklqq<Threads>qqqqqqqqqqqqqqqqqqqqqqqqqqqqqqqqqqqqqqqqqqqqqqqqqqqqqqqqqqqqqqqqqqqqqqqqqqqqqqqqqqqqqqqkx a.out`main OBbOBb xx `qprocess 90521xx 1 x int main(int argc, char **argv) {xxxx 2 x` int var1 = 1; // First break here <<< Thread 1: one-shot breakpoint 1xxxx 3 x int var2 = 2;xxxx 4 x int var3 = 3;xxxx 5 x return var1 + var2 + var3;xxxx 6 x }xxxx 7 xxxxxxxxxxxxxxxxxxxxxxxxxxxxxxxxxxxxxxxxxxxxxxxxxxxxxxxxxxxxxxxxxxxxxxxxxxxxxxxxxxxxxxxxxxxxxxxxxxxxxxxxxxxxxxxxxxxxxxxxxxxxxxxxxxxxxxxxxxxxxxxxxxxxxxxxxxxxxxxxxxxxxxxxxxxxxxxxxxxxxxxxxxxxxxxxxxxxxxxxxxxxxxxxxxxxxxxxxxxxxxxxxxxxxxxxxxxxmqqqqqqqqqqqqqqqqqqqqqqqqqqqqqqqqqqqqqqqqqqqqqqqqqqqqqqqqqqqqqqqqqqqqqqqqqqqqqqqqqqqqqqqqqqqqqqqqqqqqqqqqqqqqqqqqqqqqqqqqqqqqqqqqqqqqqqqqqqqqqqqqqqqqqqqqqqqqqqqqqqqqqqqqqqqqqqqqqqqqqqqqqqqqqqqqqqqqqqqqqqqqqqqqqqqqqqqqqqqqqqqqqqqqqqqqqqqqqqqqqqqqqqqqqqqqqqqqqqqqqqqqqqqqqqqqqqqqqqqqqqqqqqqqqqqqqqqqqqqqqqqqqqqqqqqqqqqqqqqqqqqqqqqqqqqqqqqqqqqqqqqqqqqqqqqqqqqqqqqqqqqqqqqqqqqqqqqqqqqqqqqqqqqqqqqqqqqqqqjxxlqq<Variables>qqqqqqqqqqqqqqqqqqqqqqqqqqqqqqqqqqqqqqqqqqqqqqqqqqqqqqqqqqqqqqqqqqqqqqqqqqqqqqqqqqqqqqqqqqqqqqqqqqqqqqqqqqqqqqqqqqqqqqqqqqqqqqqqqqqqqqqqqqqqqqqqqqqqqqqqqqqqqqqqqqqqqqqqqqqqqqqqqqqqqqqqqqqqqqqqqqqqqqqqqqqqqqqqqqqqqqqqqqqqqqqqqqqqqqqqqqqqqqqqqqqqqqqqqqqqqqqqqqqqqqqqqqqqqqqqqqqqqqqqqqqqqqqqqqqqqqqqqqqqqqqqqqqqqqqqqqqqqqqqqqqqqqqqqqqqqqqqqqqqqqqqqqqqqqqqqqqqqqqqqqqqqqqqqqqqqqqqqqqqqqqqqkxxx (int) argc = 1xxxx `q(char **) argv = 0x00007ffeefbff8a8xxxx (int) var1 = 0xxxx (int) var2 = 0xxxx (int) var3 = 0xxxxxxxxxxxxxxxxxxxxxxxxxxxxxxxxxxxxxxxxxxxxxxxxxxxxxxxxxxxxxxxxxxxxxxxxxxxxxxxxxxxxxxxxxxxxxxxmqqqqqqqqqqqqqqqqqqqqqqqqqqqqqqqqqqqqqqqqqqqqqqqqqqqqqqqqqqqqqqqqqqqqqqqqqqqqqqqqqqqqqqqqqqqqqqqqqqqqqqqqqqqqqqqqqqqqqqqqqqqqqqqqqqqqqqqqqqqqqqqqqqqqqqqqqqqqqqqqqqqqqqqqqqqqqqqqqqqqqqqqqqqqqqqqqqqqqqqqqqqqqqqqqqqqqqqqqqqqqqqqqqqqqqqqqqqqqqqqqqqqqqqqqqqqqqqqqqqqqqqqqqqqqqqqqqqqqqqqqqqqqqqqqqqqqqqqqqqqqqqqqqqqqqqqqqqqqqqqqqqqqqqqqqqqqqqqqqqqqqqqqqqqqqqqqqqqqqqqqqqqqqqqqqqqqqqqqqqqqqqqqqqqqqqqqqqqqqjmqqqqqqqqqqqqqqqqqqqqqqqqqqqqqqqqqqqqqqqqqqqqqqqqqqqqqqqqqqqqqqqqqqqqqqqqqqqqqqqqqqqqqqqqqqqqqqqqqqjProcess: 90521 stopped Thread: 0x1dfce9 Frame: 0 PC = 0x0000000100000f92

Hide Details

Hide Details

Hide Details

 int var1 = 1; // First break here  int var2 = 2; 3  int var2 = 2;  int var3 = 3; 4  [?1l>(lldb) breakpoint list breakpoint list No breakpoints currently set. (lldb) gui gui (B)0[?7h[?1h=| LLDB (F1) | Target (F2) | Process (F3) | Thread (F4) | View (F5) | Help (F6) | lqq<Sources>qqqqqqqqqqqqqqqqqqqqqqqqqqqqqqqqqqqqqqqqqqqqqqqqqqqqqqqqqqqqqqqqqqqqqqqqqqqqqqqqqqqqqqqqqqqqqqqqqqqqqqqqqqqqqqqqqqqqqqqqqqqqqqqqqqqqqqqqqqqqqqqqqqqqqqqqqqqqqqqqqqqqqqqqqqqqqqqqqqqqqqqqqqqqqqqqqqqqqqqqqqqqqqqqqqqqqqqqqqqqqqqqqqqqqqqqqqqqqqqqqqqqqqqqqqqqqqqqqqqqqqqqqqqqqqqqqqqqqqqqqqqqqqqqqqqqqqqqqqqqqqqqqqqqqqqqqqqqqqqqqqqqqqqqqqqqqqqqqqqqqqqqqqqqqqqqqqqqqqqqqqqqqqqqqqqqqqqqqqqqqqqqqqqklqq<Threads>qqqqqqqqqqqqqqqqqqqqqqqqqqqqqqqqqqqqqqqqqqqqqqqqqqqqqqqqqqqqqqqqqqqqqqqqqqqqqqqqqqqqqqqkx a.out`main  xx `qprocess 90521xx 1 x int main(int argc, char **argv) {xxxx 2 x` int var1 = 1; // First break here <<< Thread 1: one-shot breakpoint 1xxxx 3 x int var2 = 2;xxxx 4 x int var3 = 3;xxxx 5 x return var1 + var2 + var3;xxxx 6 x }xxxx 7 xxxxxxxxxxxxxxxxxxxxxxxxxxxxxxxxxxxxxxxxxxxxxxxxxxxxxxxxxxxxxxxxxxxxxxxxxxxxxxxxxxxxxxxxxxxxxxxxxxxxxxxxxxxxxxxxxxxxxxxxxxxxxxxxxxxxxxxxxxxxxxxxxxxxxxxxxxxxxxxxxxxxxxxxxxxxxxxxxxxxxxxxxxxxxxxxxxxxxxxxxxxxxxxxxxxxxxxxxxxxxxxxxxxxxxxxxxxxmqqqqqqqqqqqqqqqqqqqqqqqqqqqqqqqqqqqqqqqqqqqqqqqqqqqqqqqqqqqqqqqqqqqqqqqqqqqqqqqqqqqqqqqqqqqqqqqqqqqqqqqqqqqqqqqqqqqqqqqqqqqqqqqqqqqqqqqqqqqqqqqqqqqqqqqqqqqqqqqqqqqqqqqqqqqqqqqqqqqqqqqqqqqqqqqqqqqqqqqqqqqqqqqqqqqqqqqqqqqqqqqqqqqqqqqqqqqqqqqqqqqqqqqqqqqqqqqqqqqqqqqqqqqqqqqqqqqqqqqqqqqqqqqqqqqqqqqqqqqqqqqqqqqqqqqqqqqqqqqqqqqqqqqqqqqqqqqqqqqqqqqqqqqqqqqqqqqqqqqqqqqqqqqqqqqqqqqqqqqqqqqqqqqqqqqqqqqqqqjxxlqq<Variables>qqqqqqqqqqqqqqqqqqqqqqqqqqqqqqqqqqqqqqqqqqqqqqqqqqqqqqqqqqqqqqqqqqqqqqqqqqqqqqqqqqqqqqqqqqqqqqqqqqqqqqqqqqqqqqqqqqqqqqqqqqqqqqqqqqqqqqqqqqqqqqqqqqqqqqqqqqqqqqqqqqqqqqqqqqqqqqqqqqqqqqqqqqqqqqqqqqqqqqqqqqqqqqqqqqqqqqqqqqqqqqqqqqqqqqqqqqqqqqqqqqqqqqqqqqqqqqqqqqqqqqqqqqqqqqqqqqqqqqqqqqqqqqqqqqqqqqqqqqqqqqqqqqqqqqqqqqqqqqqqqqqqqqqqqqqqqqqqqqqqqqqqqqqqqqqqqqqqqqqqqqqqqqqqqqqqqqqqqqqqqqqqqkxxx (int) argc = 1xxxx `q(char **) argv = 0x00007ffeefbff8a8xxxx (int) var1 = 0xxxx (int) var2 = 0xxxx (int) var3 = 0xxxxxxxxxxxxxxxxxxxxxxxxxxxxxxxxxxxxxxxxxxxxxxxxxxxxxxxxxxxxxxxxxxxxxxxxxxxxxxxxxxxxxxxxxxxxxxxmqqqqqqqqqqqqqqqqqqqqqqqqqqqqqqqqqqqqqqqqqqqqqqqqqqqqqqqqqqqqqqqqqqqqqqqqqqqqqqqqqqqqqqqqqqqqqqqqqqqqqqqqqqqqqqqqqqqqqqqqqqqqqqqqqqqqqqqqqqqqqqqqqqqqqqqqqqqqqqqqqqqqqqqqqqqqqqqqqqqqqqqqqqqqqqqqqqqqqqqqqqqqqqqqqqqqqqqqqqqqqqqqqqqqqqqqqqqqqqqqqqqqqqqqqqqqqqqqqqqqqqqqqqqqqqqqqqqqqqqqqqqqqqqqqqqqqqqqqqqqqqqqqqqqqqqqqqqqqqqqqqqqqqqqqqqqqqqqqqqqqqqqqqqqqqqqqqqqqqqqqqqqqqqqqqqqqqqqqqqqqqqqqqqqqqqqqqqqqqjmqqqqqqqqqqqqqqqqqqqqqqqqqqqqqqqqqqqqqqqqqqqqqqqqqqqqqqqqqqqqqqqqqqqqqqqqqqqqqqqqqqqqqqqqqqqqqqqqqqjProcess: 90521 stopped Thread: 0x1dfce9 Frame: 0 PC = 0x0000000100000f92 [?1l>(lldb) libstdcxx tests will not be run because: Don't know how to build with libstdcxx on macosx Skipping following debug info categories: ['dwo']

Hide Details

-- Command Output (stderr): --

Hide Details

Session logs for test failures/errors/unexpected successes will go into directory '/Users/buildslave/jenkins/workspace/lldb-cmake/test/logs' Change dir to: /Users/buildslave/jenkins/workspace/lldb-cmake/llvm-project/lldb/test/API/commands/gui/breakpoints runCmd: settings clear -all output:

Hide Details

runCmd: settings set symbols.enable-external-lookup false output:

Hide Details

runCmd: settings set target.inherit-tcc true output:

Hide Details

runCmd: settings set target.auto-apply-fixits false output:

Hide Details

runCmd: settings set plugin.process.gdb-remote.packet-timeout 60 output:

Hide Details

runCmd: settings set symbols.clang-modules-cache-path "/Users/buildslave/jenkins/workspace/lldb-cmake/lldb-build/lldb-test-build.noindex/module-cache-lldb/lldb-api" output:

Hide Details

runCmd: settings set use-color false output:

Hide Details

runCmd: setting set target.prefer-dynamic-value no-dynamic-values output:

Hide Details

FAIL: LLDB (/Users/buildslave/jenkins/workspace/lldb-cmake/lldb-build/bin/clang-x86_64) :: test_gui (TestGuiBreakpoints.TestGuiBasicDebugCommandTest) Restore dir to: /Users/buildslave/jenkins/workspace/lldb-cmake/lldb-build/tools/lldb/test ====================================================================== ERROR: test_gui (TestGuiBreakpoints.TestGuiBasicDebugCommandTest) ---------------------------------------------------------------------- Traceback (most recent call last): File "/Users/buildslave/jenkins/workspace/lldb-cmake/llvm-project/lldb/third_party/Python/module/pexpect-4.6/pexpect/pty_spawn.py", line 23, in _wrap_ptyprocess_err yield File "/Users/buildslave/jenkins/workspace/lldb-cmake/llvm-project/lldb/third_party/Python/module/pexpect-4.6/pexpect/pty_spawn.py", line 327, in close self.ptyproc.close(force=force) File "/Users/buildslave/jenkins/workspace/lldb-cmake/llvm-project/lldb/third_party/Python/module/ptyprocess-0.6.0/ptyprocess/ptyprocess.py", line 400, in close raise PtyProcessError('Could not terminate the child.') ptyprocess.util.PtyProcessError: Could not terminate the child.

Hide Details

During handling of the above exception, another exception occurred:

Hide Details

Traceback (most recent call last): File "/Users/buildslave/jenkins/workspace/lldb-cmake/llvm-project/lldb/packages/Python/lldbsuite/test/decorators.py", line 134, in wrapper return func(*args, **kwargs) File "/Users/buildslave/jenkins/workspace/lldb-cmake/llvm-project/lldb/test/API/commands/gui/breakpoints/TestGuiBreakpoints.py", line 74, in test_gui self.quit() File "/Users/buildslave/jenkins/workspace/lldb-cmake/llvm-project/lldb/packages/Python/lldbsuite/test/lldbpexpect.py", line 64, in quit self.child.close(force=not gracefully) File "/Users/buildslave/jenkins/workspace/lldb-cmake/llvm-project/lldb/third_party/Python/module/pexpect-4.6/pexpect/pty_spawn.py", line 327, in close self.ptyproc.close(force=force) File "/usr/local/Cellar/python/3.7.1/Frameworks/Python.framework/Versions/3.7/lib/python3.7/contextlib.py", line 130, in __exit__ self.gen.throw(type, value, traceback) File "/Users/buildslave/jenkins/workspace/lldb-cmake/llvm-project/lldb/third_party/Python/module/pexpect-4.6/pexpect/pty_spawn.py", line 25, in _wrap_ptyprocess_err raise ExceptionPexpect(*e.args) pexpect.exceptions.ExceptionPexpect: Could not terminate the child. Config=x86_64-/Users/buildslave/jenkins/workspace/lldb-cmake/lldb-build/bin/clang ---------------------------------------------------------------------- Ran 1 test in 15.486s

Hide Details

RESULT: FAILED (0 passes, 0 failures, 1 errors, 0 skipped, 0 expected failures, 0 unexpected successes)

Hide Details

--

Hide Details

******************** PASS: lldb-unit :: Utility/./UtilityTests/RangeTest.SizeTypes (1241 of 2153) PASS: lldb-unit :: Symbol/./SymbolTests/LineEntryTest.GetSameLineContiguousAddressRangeNestedInline (1242 of 2153) PASS: lldb-shell :: Process/TestAbortExitCode.test (1243 of 2153) PASS: lldb-api :: functionalities/data-formatter/data-formatter-script/TestDataFormatterScript.py (1244 of 2153) TIMEOUT: lldb-api :: macosx/simulator/TestSimulatorPlatform.py (1245 of 2153) ******************** TEST 'lldb-api :: macosx/simulator/TestSimulatorPlatform.py' FAILED ******************** Script: -- /usr/local/Frameworks/Python.framework/Versions/3.7/bin/python3.7 /Users/buildslave/jenkins/workspace/lldb-cmake/llvm-project/lldb/test/API/dotest.py -s /Users/buildslave/jenkins/workspace/lldb-cmake/lldb-build/lldb-test-traces -S nm -u CXXFLAGS -u CFLAGS --codesign-identity - --server /Users/buildslave/jenkins/workspace/lldb-cmake/lldb-build/./bin/debugserver --arch x86_64 --build-dir /Users/buildslave/jenkins/workspace/lldb-cmake/lldb-build/lldb-test-build.noindex -s=/Users/buildslave/jenkins/workspace/lldb-cmake/test/logs -t --env TERM=vt100 --env LLVM_LIBS_DIR=/Users/buildslave/jenkins/workspace/lldb-cmake/lldb-build/./lib --arch x86_64 --build-dir /Users/buildslave/jenkins/workspace/lldb-cmake/lldb-build/lldb-test-build.noindex --lldb-module-cache-dir /Users/buildslave/jenkins/workspace/lldb-cmake/lldb-build/lldb-test-build.noindex/module-cache-lldb/lldb-api --clang-module-cache-dir /Users/buildslave/jenkins/workspace/lldb-cmake/lldb-build/lldb-test-build.noindex/module-cache-clang/lldb-api --executable /Users/buildslave/jenkins/workspace/lldb-cmake/lldb-build/./bin/lldb --compiler /Users/buildslave/jenkins/workspace/lldb-cmake/lldb-build/./bin/clang --dsymutil /Users/buildslave/jenkins/workspace/lldb-cmake/lldb-build/./bin/dsymutil --filecheck /Users/buildslave/jenkins/workspace/lldb-cmake/lldb-build/./bin/FileCheck --yaml2obj /Users/buildslave/jenkins/workspace/lldb-cmake/lldb-build/./bin/yaml2obj --lldb-libs-dir /Users/buildslave/jenkins/workspace/lldb-cmake/lldb-build/./lib /Users/buildslave/jenkins/workspace/lldb-cmake/llvm-project/lldb/test/API/macosx/simulator -p TestSimulatorPlatform.py -- Exit Code: -9 Timeout: Reached timeout of 600 seconds

Hide Details

Command Output (stdout): -- lldb version 12.0.99 clang revision 20e9c36c013c4a9b13cf256ca5262afe3def78ad llvm revision 20e9c36c013c4a9b13cf256ca5262afe3def78ad

Hide Details

-- Command Output (stderr): --

Hide Details

Session logs for test failures/errors/unexpected successes will go into directory '/Users/buildslave/jenkins/workspace/lldb-cmake/test/logs' Change dir to: /Users/buildslave/jenkins/workspace/lldb-cmake/llvm-project/lldb/test/API/macosx/simulator runCmd: settings clear -all output:

Hide Details

runCmd: settings set symbols.enable-external-lookup false output:

Hide Details

runCmd: settings set target.inherit-tcc true output:

Hide Details

runCmd: settings set target.auto-apply-fixits false output:

Hide Details

runCmd: settings set plugin.process.gdb-remote.packet-timeout 60 output:

Hide Details

runCmd: settings set symbols.clang-modules-cache-path "/Users/buildslave/jenkins/workspace/lldb-cmake/lldb-build/lldb-test-build.noindex/module-cache-lldb/lldb-api" output:

Hide Details

runCmd: settings set use-color false output:

Hide Details

runCmd: setting set target.prefer-dynamic-value no-dynamic-values output:

Hide Details

runCmd: log enable gdb-remote packets -f /Users/buildslave/jenkins/workspace/lldb-cmake/lldb-build/lldb-test-build.noindex/macosx/simulator/TestSimulatorPlatform.test_ios/packets.log output:

Hide Details

Ran command: "log enable gdb-remote packets -f /Users/buildslave/jenkins/workspace/lldb-cmake/lldb-build/lldb-test-build.noindex/macosx/simulator/TestSimulatorPlatform.test_ios/packets.log"

Hide Details

Got output:

Hide Details

Hide Details

runCmd: image list -b -t output: [ 0] a.out x86_64-apple-ios13.5.0-simulator [ 1] dyld x86_64-apple-macosx10.15.0 [ 2] dyld_sim x86_64-apple-ios13.5.0-simulator [ 3] libc++.1.dylib x86_64-apple-ios13.5.0-simulator [ 4] libSystem.B.dylib x86_64-apple-ios13.5.0-simulator [ 5] libc++abi.dylib x86_64-apple-ios13.5.0-simulator [ 6] libcache.dylib x86_64-apple-ios13.5.0-simulator [ 7] libcommonCrypto.dylib x86_64-apple-ios13.5.0-simulator [ 8] libcompiler_rt.dylib x86_64-apple-ios13.5.0-simulator [ 9] libcopyfile.dylib x86_64-apple-ios13.5.0-simulator [ 10] libcorecrypto.dylib x86_64-apple-ios13.5.0-simulator [ 11] libdispatch.dylib x86_64-apple-ios13.5.0-simulator [ 12] libdyld.dylib x86_64-apple-ios13.5.0-simulator [ 13] liblaunch.dylib x86_64-apple-ios13.5.0-simulator [ 14] libmacho.dylib x86_64-apple-ios13.5.0-simulator [ 15] libremovefile.dylib x86_64-apple-ios13.5.0-simulator [ 16] libsystem_asl.dylib x86_64-apple-ios13.5.0-simulator [ 17] libsystem_blocks.dylib x86_64-apple-ios13.5.0-simulator [ 18] libsystem_c.dylib x86_64-apple-ios13.5.0-simulator [ 19] libsystem_configuration.dylib x86_64-apple-ios13.5.0-simulator [ 20] libsystem_containermanager.dylib x86_64-apple-ios13.5.0-simulator [ 21] libsystem_coreservices.dylib x86_64-apple-ios13.5.0-simulator [ 22] libsystem_darwin.dylib x86_64-apple-ios13.5.0-simulator [ 23] libsystem_dnssd.dylib x86_64-apple-ios13.5.0-simulator [ 24] libsystem_featureflags.dylib x86_64-apple-ios13.5.0-simulator [ 25] libsystem_info.dylib x86_64-apple-ios13.5.0-simulator [ 26] libsystem_m.dylib x86_64-apple-ios13.5.0-simulator [ 27] libsystem_malloc.dylib x86_64-apple-ios13.5.0-simulator [ 28] libsystem_notify.dylib x86_64-apple-ios13.5.0-simulator [ 29] libsystem_sandbox.dylib x86_64-apple-ios13.5.0-simulator [ 30] libsystem_sim_kernel.dylib x86_64-apple-ios13.5.0-simulator [ 31] libsystem_sim_platform.dylib x86_64-apple-ios13.5.0-simulator [ 32] libsystem_sim_pthread.dylib x86_64-apple-ios13.5.0-simulator [ 33] libsystem_trace.dylib x86_64-apple-ios13.5.0-simulator [ 34] libunwind.dylib x86_64-apple-ios13.5.0-simulator [ 35] libxpc.dylib x86_64-apple-ios13.5.0-simulator [ 36] libsystem_sim_pthread_host.dylib x86_64-apple-ios13.5.0-simulator [ 37] libsystem_sim_platform_host.dylib x86_64-apple-ios13.5.0-simulator [ 38] libsystem_sim_kernel_host.dylib x86_64-apple-ios13.5.0-simulator [ 39] libsystem_kernel.dylib x86_64-apple-macosx10.15.0-simulator(0x00007fff51b5a000) [ 40] libobjc.A.dylib x86_64-apple-ios13.5.0-simulator [ 41] libsystem_platform.dylib x86_64-apple-macosx10.15.0-simulator(0x00007fff51bfd000) [ 42] libsystem_pthread.dylib x86_64-apple-macosx10.15.0-simulator(0x00007fff51c06000)

Hide Details

Hide Details

Ran command: "image list -b -t"

Hide Details

Got output: [ 0] a.out x86_64-apple-ios13.5.0-simulator [ 1] dyld x86_64-apple-macosx10.15.0 [ 2] dyld_sim x86_64-apple-ios13.5.0-simulator [ 3] libc++.1.dylib x86_64-apple-ios13.5.0-simulator [ 4] libSystem.B.dylib x86_64-apple-ios13.5.0-simulator [ 5] libc++abi.dylib x86_64-apple-ios13.5.0-simulator [ 6] libcache.dylib x86_64-apple-ios13.5.0-simulator [ 7] libcommonCrypto.dylib x86_64-apple-ios13.5.0-simulator [ 8] libcompiler_rt.dylib x86_64-apple-ios13.5.0-simulator [ 9] libcopyfile.dylib x86_64-apple-ios13.5.0-simulator [ 10] libcorecrypto.dylib x86_64-apple-ios13.5.0-simulator [ 11] libdispatch.dylib x86_64-apple-ios13.5.0-simulator [ 12] libdyld.dylib x86_64-apple-ios13.5.0-simulator [ 13] liblaunch.dylib x86_64-apple-ios13.5.0-simulator [ 14] libmacho.dylib x86_64-apple-ios13.5.0-simulator [ 15] libremovefile.dylib x86_64-apple-ios13.5.0-simulator [ 16] libsystem_asl.dylib x86_64-apple-ios13.5.0-simulator [ 17] libsystem_blocks.dylib x86_64-apple-ios13.5.0-simulator [ 18] libsystem_c.dylib x86_64-apple-ios13.5.0-simulator [ 19] libsystem_configuration.dylib x86_64-apple-ios13.5.0-simulator [ 20] libsystem_containermanager.dylib x86_64-apple-ios13.5.0-simulator [ 21] libsystem_coreservices.dylib x86_64-apple-ios13.5.0-simulator [ 22] libsystem_darwin.dylib x86_64-apple-ios13.5.0-simulator [ 23] libsystem_dnssd.dylib x86_64-apple-ios13.5.0-simulator [ 24] libsystem_featureflags.dylib x86_64-apple-ios13.5.0-simulator [ 25] libsystem_info.dylib x86_64-apple-ios13.5.0-simulator [ 26] libsystem_m.dylib x86_64-apple-ios13.5.0-simulator [ 27] libsystem_malloc.dylib x86_64-apple-ios13.5.0-simulator [ 28] libsystem_notify.dylib x86_64-apple-ios13.5.0-simulator [ 29] libsystem_sandbox.dylib x86_64-apple-ios13.5.0-simulator [ 30] libsystem_sim_kernel.dylib x86_64-apple-ios13.5.0-simulator [ 31] libsystem_sim_platform.dylib x86_64-apple-ios13.5.0-simulator [ 32] libsystem_sim_pthread.dylib x86_64-apple-ios13.5.0-simulator [ 33] libsystem_trace.dylib x86_64-apple-ios13.5.0-simulator [ 34] libunwind.dylib x86_64-apple-ios13.5.0-simulator [ 35] libxpc.dylib x86_64-apple-ios13.5.0-simulator [ 36] libsystem_sim_pthread_host.dylib x86_64-apple-ios13.5.0-simulator [ 37] libsystem_sim_platform_host.dylib x86_64-apple-ios13.5.0-simulator [ 38] libsystem_sim_kernel_host.dylib x86_64-apple-ios13.5.0-simulator [ 39] libsystem_kernel.dylib x86_64-apple-macosx10.15.0-simulator(0x00007fff51b5a000) [ 40] libobjc.A.dylib x86_64-apple-ios13.5.0-simulator [ 41] libsystem_platform.dylib x86_64-apple-macosx10.15.0-simulator(0x00007fff51bfd000) [ 42] libsystem_pthread.dylib x86_64-apple-macosx10.15.0-simulator(0x00007fff51c06000)

Hide Details

Expecting regex pattern: "a\.out x86_64-apple-ios13.5.*-simulator" (was found, matched "a.out x86_64-apple-ios13.5.0-simulator")

Hide Details

<bound method SBProcess.Kill of <lldb.SBProcess; proxy of <Swig Object of type 'lldb::SBProcess *' at 0x10be55fc0> >>: success

Hide Details

PASS: LLDB (/Users/buildslave/jenkins/workspace/lldb-cmake/lldb-build/bin/clang-x86_64) :: test_ios (TestSimulatorPlatform.TestSimulatorPlatformLaunching) runCmd: settings clear -all output:

Hide Details

runCmd: settings set symbols.enable-external-lookup false output:

Hide Details

runCmd: settings set target.inherit-tcc true output:

Hide Details

runCmd: settings set target.auto-apply-fixits false output:

Hide Details

runCmd: settings set plugin.process.gdb-remote.packet-timeout 60 output:

Hide Details

runCmd: settings set symbols.clang-modules-cache-path "/Users/buildslave/jenkins/workspace/lldb-cmake/lldb-build/lldb-test-build.noindex/module-cache-lldb/lldb-api" output:

Hide Details

runCmd: settings set use-color false output:

Hide Details

runCmd: setting set target.prefer-dynamic-value no-dynamic-values output:

Hide Details

UNSUPPORTED: LLDB (/Users/buildslave/jenkins/workspace/lldb-cmake/lldb-build/bin/clang-x86_64) :: test_ios_backdeploy_apple_silicon (TestSimulatorPlatform.TestSimulatorPlatformLaunching) (skipping due to the following parameter(s): architecture) runCmd: settings clear -all output:

Hide Details

runCmd: settings set symbols.enable-external-lookup false output:

Hide Details

runCmd: settings set target.inherit-tcc true output:

Hide Details

runCmd: settings set target.auto-apply-fixits false output:

Hide Details

runCmd: settings set plugin.process.gdb-remote.packet-timeout 60 output:

Hide Details

runCmd: settings set symbols.clang-modules-cache-path "/Users/buildslave/jenkins/workspace/lldb-cmake/lldb-build/lldb-test-build.noindex/module-cache-lldb/lldb-api" output:

Hide Details

runCmd: settings set use-color false output:

Hide Details

runCmd: setting set target.prefer-dynamic-value no-dynamic-values output:

Hide Details

runCmd: log enable gdb-remote packets -f /Users/buildslave/jenkins/workspace/lldb-cmake/lldb-build/lldb-test-build.noindex/macosx/simulator/TestSimulatorPlatform.test_ios_backdeploy_x86/packets.log output:

Hide Details

Ran command: "log enable gdb-remote packets -f /Users/buildslave/jenkins/workspace/lldb-cmake/lldb-build/lldb-test-build.noindex/macosx/simulator/TestSimulatorPlatform.test_ios_backdeploy_x86/packets.log"

Hide Details

Got output:

Hide Details

Hide Details

runCmd: image list -b -t output: [ 0] a.out x86_64-apple-ios13.0.0-simulator [ 1] dyld x86_64-apple-macosx10.15.0 [ 2] dyld_sim x86_64-apple-ios13.5.0-simulator [ 3] libc++.1.dylib x86_64-apple-ios13.5.0-simulator [ 4] libSystem.B.dylib x86_64-apple-ios13.5.0-simulator [ 5] libc++abi.dylib x86_64-apple-ios13.5.0-simulator [ 6] libcache.dylib x86_64-apple-ios13.5.0-simulator [ 7] libcommonCrypto.dylib x86_64-apple-ios13.5.0-simulator [ 8] libcompiler_rt.dylib x86_64-apple-ios13.5.0-simulator [ 9] libcopyfile.dylib x86_64-apple-ios13.5.0-simulator [ 10] libcorecrypto.dylib x86_64-apple-ios13.5.0-simulator [ 11] libdispatch.dylib x86_64-apple-ios13.5.0-simulator [ 12] libdyld.dylib x86_64-apple-ios13.5.0-simulator [ 13] liblaunch.dylib x86_64-apple-ios13.5.0-simulator [ 14] libmacho.dylib x86_64-apple-ios13.5.0-simulator [ 15] libremovefile.dylib x86_64-apple-ios13.5.0-simulator [ 16] libsystem_asl.dylib x86_64-apple-ios13.5.0-simulator [ 17] libsystem_blocks.dylib x86_64-apple-ios13.5.0-simulator [ 18] libsystem_c.dylib x86_64-apple-ios13.5.0-simulator [ 19] libsystem_configuration.dylib x86_64-apple-ios13.5.0-simulator [ 20] libsystem_containermanager.dylib x86_64-apple-ios13.5.0-simulator [ 21] libsystem_coreservices.dylib x86_64-apple-ios13.5.0-simulator [ 22] libsystem_darwin.dylib x86_64-apple-ios13.5.0-simulator [ 23] libsystem_dnssd.dylib x86_64-apple-ios13.5.0-simulator [ 24] libsystem_featureflags.dylib x86_64-apple-ios13.5.0-simulator [ 25] libsystem_info.dylib x86_64-apple-ios13.5.0-simulator [ 26] libsystem_m.dylib x86_64-apple-ios13.5.0-simulator [ 27] libsystem_malloc.dylib x86_64-apple-ios13.5.0-simulator [ 28] libsystem_notify.dylib x86_64-apple-ios13.5.0-simulator [ 29] libsystem_sandbox.dylib x86_64-apple-ios13.5.0-simulator [ 30] libsystem_sim_kernel.dylib x86_64-apple-ios13.5.0-simulator [ 31] libsystem_sim_platform.dylib x86_64-apple-ios13.5.0-simulator [ 32] libsystem_sim_pthread.dylib x86_64-apple-ios13.5.0-simulator [ 33] libsystem_trace.dylib x86_64-apple-ios13.5.0-simulator [ 34] libunwind.dylib x86_64-apple-ios13.5.0-simulator [ 35] libxpc.dylib x86_64-apple-ios13.5.0-simulator [ 36] libsystem_sim_pthread_host.dylib x86_64-apple-ios13.5.0-simulator [ 37] libsystem_sim_platform_host.dylib x86_64-apple-ios13.5.0-simulator [ 38] libsystem_sim_kernel_host.dylib x86_64-apple-ios13.5.0-simulator [ 39] libsystem_kernel.dylib x86_64-apple-macosx10.15.0-simulator(0x00007fff51b5a000) [ 40] libobjc.A.dylib x86_64-apple-ios13.5.0-simulator [ 41] libsystem_platform.dylib x86_64-apple-macosx10.15.0-simulator(0x00007fff51bfd000) [ 42] libsystem_pthread.dylib x86_64-apple-macosx10.15.0-simulator(0x00007fff51c06000)

Hide Details

Hide Details

Ran command: "image list -b -t"

Hide Details

Got output: [ 0] a.out x86_64-apple-ios13.0.0-simulator [ 1] dyld x86_64-apple-macosx10.15.0 [ 2] dyld_sim x86_64-apple-ios13.5.0-simulator [ 3] libc++.1.dylib x86_64-apple-ios13.5.0-simulator [ 4] libSystem.B.dylib x86_64-apple-ios13.5.0-simulator [ 5] libc++abi.dylib x86_64-apple-ios13.5.0-simulator [ 6] libcache.dylib x86_64-apple-ios13.5.0-simulator [ 7] libcommonCrypto.dylib x86_64-apple-ios13.5.0-simulator [ 8] libcompiler_rt.dylib x86_64-apple-ios13.5.0-simulator [ 9] libcopyfile.dylib x86_64-apple-ios13.5.0-simulator [ 10] libcorecrypto.dylib x86_64-apple-ios13.5.0-simulator [ 11] libdispatch.dylib x86_64-apple-ios13.5.0-simulator [ 12] libdyld.dylib x86_64-apple-ios13.5.0-simulator [ 13] liblaunch.dylib x86_64-apple-ios13.5.0-simulator [ 14] libmacho.dylib x86_64-apple-ios13.5.0-simulator [ 15] libremovefile.dylib x86_64-apple-ios13.5.0-simulator [ 16] libsystem_asl.dylib x86_64-apple-ios13.5.0-simulator [ 17] libsystem_blocks.dylib x86_64-apple-ios13.5.0-simulator [ 18] libsystem_c.dylib x86_64-apple-ios13.5.0-simulator [ 19] libsystem_configuration.dylib x86_64-apple-ios13.5.0-simulator [ 20] libsystem_containermanager.dylib x86_64-apple-ios13.5.0-simulator [ 21] libsystem_coreservices.dylib x86_64-apple-ios13.5.0-simulator [ 22] libsystem_darwin.dylib x86_64-apple-ios13.5.0-simulator [ 23] libsystem_dnssd.dylib x86_64-apple-ios13.5.0-simulator [ 24] libsystem_featureflags.dylib x86_64-apple-ios13.5.0-simulator [ 25] libsystem_info.dylib x86_64-apple-ios13.5.0-simulator [ 26] libsystem_m.dylib x86_64-apple-ios13.5.0-simulator [ 27] libsystem_malloc.dylib x86_64-apple-ios13.5.0-simulator [ 28] libsystem_notify.dylib x86_64-apple-ios13.5.0-simulator [ 29] libsystem_sandbox.dylib x86_64-apple-ios13.5.0-simulator [ 30] libsystem_sim_kernel.dylib x86_64-apple-ios13.5.0-simulator [ 31] libsystem_sim_platform.dylib x86_64-apple-ios13.5.0-simulator [ 32] libsystem_sim_pthread.dylib x86_64-apple-ios13.5.0-simulator [ 33] libsystem_trace.dylib x86_64-apple-ios13.5.0-simulator [ 34] libunwind.dylib x86_64-apple-ios13.5.0-simulator [ 35] libxpc.dylib x86_64-apple-ios13.5.0-simulator [ 36] libsystem_sim_pthread_host.dylib x86_64-apple-ios13.5.0-simulator [ 37] libsystem_sim_platform_host.dylib x86_64-apple-ios13.5.0-simulator [ 38] libsystem_sim_kernel_host.dylib x86_64-apple-ios13.5.0-simulator [ 39] libsystem_kernel.dylib x86_64-apple-macosx10.15.0-simulator(0x00007fff51b5a000) [ 40] libobjc.A.dylib x86_64-apple-ios13.5.0-simulator [ 41] libsystem_platform.dylib x86_64-apple-macosx10.15.0-simulator(0x00007fff51bfd000) [ 42] libsystem_pthread.dylib x86_64-apple-macosx10.15.0-simulator(0x00007fff51c06000)

Hide Details

Expecting regex pattern: "a\.out x86_64-apple-ios13.0.*-simulator" (was found, matched "a.out x86_64-apple-ios13.0.0-simulator")

Hide Details

<bound method SBProcess.Kill of <lldb.SBProcess; proxy of <Swig Object of type 'lldb::SBProcess *' at 0x10b8d4270> >>: success

Hide Details

PASS: LLDB (/Users/buildslave/jenkins/workspace/lldb-cmake/lldb-build/bin/clang-x86_64) :: test_ios_backdeploy_x86 (TestSimulatorPlatform.TestSimulatorPlatformLaunching) runCmd: settings clear -all output:

Hide Details

runCmd: settings set symbols.enable-external-lookup false output:

Hide Details

runCmd: settings set target.inherit-tcc true output:

Hide Details

runCmd: settings set target.auto-apply-fixits false output:

Hide Details

runCmd: settings set plugin.process.gdb-remote.packet-timeout 60 output:

Hide Details

runCmd: settings set symbols.clang-modules-cache-path "/Users/buildslave/jenkins/workspace/lldb-cmake/lldb-build/lldb-test-build.noindex/module-cache-lldb/lldb-api" output:

Hide Details

runCmd: settings set use-color false output:

Hide Details

runCmd: setting set target.prefer-dynamic-value no-dynamic-values output:

Hide Details

runCmd: log enable gdb-remote packets -f /Users/buildslave/jenkins/workspace/lldb-cmake/lldb-build/lldb-test-build.noindex/macosx/simulator/TestSimulatorPlatform.test_lc_version_min_iphoneos/packets.log output:

Hide Details

Ran command: "log enable gdb-remote packets -f /Users/buildslave/jenkins/workspace/lldb-cmake/lldb-build/lldb-test-build.noindex/macosx/simulator/TestSimulatorPlatform.test_lc_version_min_iphoneos/packets.log"

Hide Details

Got output:

Hide Details

Hide Details

runCmd: image list -b -t output: [ 0] a.out x86_64-apple-ios11.0.0-simulator [ 1] dyld x86_64-apple-macosx10.15.0 [ 2] dyld_sim x86_64-apple-ios13.5.0-simulator [ 3] libc++.1.dylib x86_64-apple-ios13.5.0-simulator [ 4] libSystem.B.dylib x86_64-apple-ios13.5.0-simulator [ 5] libc++abi.dylib x86_64-apple-ios13.5.0-simulator [ 6] libcache.dylib x86_64-apple-ios13.5.0-simulator [ 7] libcommonCrypto.dylib x86_64-apple-ios13.5.0-simulator [ 8] libcompiler_rt.dylib x86_64-apple-ios13.5.0-simulator [ 9] libcopyfile.dylib x86_64-apple-ios13.5.0-simulator [ 10] libcorecrypto.dylib x86_64-apple-ios13.5.0-simulator [ 11] libdispatch.dylib x86_64-apple-ios13.5.0-simulator [ 12] libdyld.dylib x86_64-apple-ios13.5.0-simulator [ 13] liblaunch.dylib x86_64-apple-ios13.5.0-simulator [ 14] libmacho.dylib x86_64-apple-ios13.5.0-simulator [ 15] libremovefile.dylib x86_64-apple-ios13.5.0-simulator [ 16] libsystem_asl.dylib x86_64-apple-ios13.5.0-simulator [ 17] libsystem_blocks.dylib x86_64-apple-ios13.5.0-simulator [ 18] libsystem_c.dylib x86_64-apple-ios13.5.0-simulator [ 19] libsystem_configuration.dylib x86_64-apple-ios13.5.0-simulator [ 20] libsystem_containermanager.dylib x86_64-apple-ios13.5.0-simulator [ 21] libsystem_coreservices.dylib x86_64-apple-ios13.5.0-simulator [ 22] libsystem_darwin.dylib x86_64-apple-ios13.5.0-simulator [ 23] libsystem_dnssd.dylib x86_64-apple-ios13.5.0-simulator [ 24] libsystem_featureflags.dylib x86_64-apple-ios13.5.0-simulator [ 25] libsystem_info.dylib x86_64-apple-ios13.5.0-simulator [ 26] libsystem_m.dylib x86_64-apple-ios13.5.0-simulator [ 27] libsystem_malloc.dylib x86_64-apple-ios13.5.0-simulator [ 28] libsystem_notify.dylib x86_64-apple-ios13.5.0-simulator [ 29] libsystem_sandbox.dylib x86_64-apple-ios13.5.0-simulator [ 30] libsystem_sim_kernel.dylib x86_64-apple-ios13.5.0-simulator [ 31] libsystem_sim_platform.dylib x86_64-apple-ios13.5.0-simulator [ 32] libsystem_sim_pthread.dylib x86_64-apple-ios13.5.0-simulator [ 33] libsystem_trace.dylib x86_64-apple-ios13.5.0-simulator [ 34] libunwind.dylib x86_64-apple-ios13.5.0-simulator [ 35] libxpc.dylib x86_64-apple-ios13.5.0-simulator [ 36] libsystem_sim_pthread_host.dylib x86_64-apple-ios13.5.0-simulator [ 37] libsystem_sim_platform_host.dylib x86_64-apple-ios13.5.0-simulator [ 38] libsystem_sim_kernel_host.dylib x86_64-apple-ios13.5.0-simulator [ 39] libsystem_kernel.dylib x86_64-apple-macosx10.15.0-simulator(0x00007fff51b5a000) [ 40] libobjc.A.dylib x86_64-apple-ios13.5.0-simulator [ 41] libsystem_platform.dylib x86_64-apple-macosx10.15.0-simulator(0x00007fff51bfd000) [ 42] libsystem_pthread.dylib x86_64-apple-macosx10.15.0-simulator(0x00007fff51c06000)

Hide Details

Hide Details

Ran command: "image list -b -t"

Hide Details

Got output: [ 0] a.out x86_64-apple-ios11.0.0-simulator [ 1] dyld x86_64-apple-macosx10.15.0 [ 2] dyld_sim x86_64-apple-ios13.5.0-simulator [ 3] libc++.1.dylib x86_64-apple-ios13.5.0-simulator [ 4] libSystem.B.dylib x86_64-apple-ios13.5.0-simulator [ 5] libc++abi.dylib x86_64-apple-ios13.5.0-simulator [ 6] libcache.dylib x86_64-apple-ios13.5.0-simulator [ 7] libcommonCrypto.dylib x86_64-apple-ios13.5.0-simulator [ 8] libcompiler_rt.dylib x86_64-apple-ios13.5.0-simulator [ 9] libcopyfile.dylib x86_64-apple-ios13.5.0-simulator [ 10] libcorecrypto.dylib x86_64-apple-ios13.5.0-simulator [ 11] libdispatch.dylib x86_64-apple-ios13.5.0-simulator [ 12] libdyld.dylib x86_64-apple-ios13.5.0-simulator [ 13] liblaunch.dylib x86_64-apple-ios13.5.0-simulator [ 14] libmacho.dylib x86_64-apple-ios13.5.0-simulator [ 15] libremovefile.dylib x86_64-apple-ios13.5.0-simulator [ 16] libsystem_asl.dylib x86_64-apple-ios13.5.0-simulator [ 17] libsystem_blocks.dylib x86_64-apple-ios13.5.0-simulator [ 18] libsystem_c.dylib x86_64-apple-ios13.5.0-simulator [ 19] libsystem_configuration.dylib x86_64-apple-ios13.5.0-simulator [ 20] libsystem_containermanager.dylib x86_64-apple-ios13.5.0-simulator [ 21] libsystem_coreservices.dylib x86_64-apple-ios13.5.0-simulator [ 22] libsystem_darwin.dylib x86_64-apple-ios13.5.0-simulator [ 23] libsystem_dnssd.dylib x86_64-apple-ios13.5.0-simulator [ 24] libsystem_featureflags.dylib x86_64-apple-ios13.5.0-simulator [ 25] libsystem_info.dylib x86_64-apple-ios13.5.0-simulator [ 26] libsystem_m.dylib x86_64-apple-ios13.5.0-simulator [ 27] libsystem_malloc.dylib x86_64-apple-ios13.5.0-simulator [ 28] libsystem_notify.dylib x86_64-apple-ios13.5.0-simulator [ 29] libsystem_sandbox.dylib x86_64-apple-ios13.5.0-simulator [ 30] libsystem_sim_kernel.dylib x86_64-apple-ios13.5.0-simulator [ 31] libsystem_sim_platform.dylib x86_64-apple-ios13.5.0-simulator [ 32] libsystem_sim_pthread.dylib x86_64-apple-ios13.5.0-simulator [ 33] libsystem_trace.dylib x86_64-apple-ios13.5.0-simulator [ 34] libunwind.dylib x86_64-apple-ios13.5.0-simulator [ 35] libxpc.dylib x86_64-apple-ios13.5.0-simulator [ 36] libsystem_sim_pthread_host.dylib x86_64-apple-ios13.5.0-simulator [ 37] libsystem_sim_platform_host.dylib x86_64-apple-ios13.5.0-simulator [ 38] libsystem_sim_kernel_host.dylib x86_64-apple-ios13.5.0-simulator [ 39] libsystem_kernel.dylib x86_64-apple-macosx10.15.0-simulator(0x00007fff51b5a000) [ 40] libobjc.A.dylib x86_64-apple-ios13.5.0-simulator [ 41] libsystem_platform.dylib x86_64-apple-macosx10.15.0-simulator(0x00007fff51bfd000) [ 42] libsystem_pthread.dylib x86_64-apple-macosx10.15.0-simulator(0x00007fff51c06000)

Hide Details

Expecting regex pattern: "a\.out x86_64-apple-ios11.0.*-simulator" (was found, matched "a.out x86_64-apple-ios11.0.0-simulator")

Hide Details

<bound method SBProcess.Kill of <lldb.SBProcess; proxy of <Swig Object of type 'lldb::SBProcess *' at 0x104324c60> >>: success

Hide Details

PASS: LLDB (/Users/buildslave/jenkins/workspace/lldb-cmake/lldb-build/bin/clang-x86_64) :: test_lc_version_min_iphoneos (TestSimulatorPlatform.TestSimulatorPlatformLaunching) runCmd: settings clear -all output:

Hide Details

runCmd: settings set symbols.enable-external-lookup false output:

Hide Details

runCmd: settings set target.inherit-tcc true output:

Hide Details

runCmd: settings set target.auto-apply-fixits false output:

Hide Details

runCmd: settings set plugin.process.gdb-remote.packet-timeout 60 output:

Hide Details

runCmd: settings set symbols.clang-modules-cache-path "/Users/buildslave/jenkins/workspace/lldb-cmake/lldb-build/lldb-test-build.noindex/module-cache-lldb/lldb-api" output:

Hide Details

runCmd: settings set use-color false output:

Hide Details

runCmd: setting set target.prefer-dynamic-value no-dynamic-values output:

Hide Details

runCmd: log enable gdb-remote packets -f /Users/buildslave/jenkins/workspace/lldb-cmake/lldb-build/lldb-test-build.noindex/macosx/simulator/TestSimulatorPlatform.test_lc_version_min_macosx/packets.log output:

Hide Details

Ran command: "log enable gdb-remote packets -f /Users/buildslave/jenkins/workspace/lldb-cmake/lldb-build/lldb-test-build.noindex/macosx/simulator/TestSimulatorPlatform.test_lc_version_min_macosx/packets.log"

Hide Details

Got output:

Hide Details

Hide Details

runCmd: image list -b -t output: [ 0] a.out x86_64-apple-macosx10.9.0 [ 1] dyld x86_64-apple-macosx10.15.0 [ 2] libc++.1.dylib x86_64-apple-macosx10.15.0 [ 3] libSystem.B.dylib x86_64-apple-macosx10.15.0 [ 4] libc++abi.dylib x86_64-apple-macosx10.15.0 [ 5] libcache.dylib x86_64-apple-macosx10.15.0 [ 6] libcommonCrypto.dylib x86_64-apple-macosx10.15.0 [ 7] libcompiler_rt.dylib x86_64-apple-macosx10.15.0 [ 8] libcopyfile.dylib x86_64-apple-macosx10.15.0 [ 9] libcorecrypto.dylib x86_64-apple-macosx10.15.0 [ 10] libdispatch.dylib x86_64-apple-macosx10.15.0 [ 11] libdyld.dylib x86_64-apple-macosx10.15.0 [ 12] libkeymgr.dylib x86_64-apple-macosx10.15.0 [ 13] liblaunch.dylib x86_64-apple-macosx10.15.0 [ 14] libmacho.dylib x86_64-apple-macosx10.15.0 [ 15] libquarantine.dylib x86_64-apple-macosx10.15.0 [ 16] libremovefile.dylib x86_64-apple-macosx10.15.0 [ 17] libsystem_asl.dylib x86_64-apple-macosx10.15.0 [ 18] libsystem_blocks.dylib x86_64-apple-macosx10.15.0 [ 19] libsystem_c.dylib x86_64-apple-macosx10.15.0 [ 20] libsystem_configuration.dylib x86_64-apple-macosx10.15.0 [ 21] libsystem_coreservices.dylib x86_64-apple-macosx10.15.0 [ 22] libsystem_darwin.dylib x86_64-apple-macosx10.15.0 [ 23] libsystem_dnssd.dylib x86_64-apple-macosx10.15.0 [ 24] libsystem_featureflags.dylib x86_64-apple-macosx10.15.0 [ 25] libsystem_info.dylib x86_64-apple-macosx10.15.0 [ 26] libsystem_m.dylib x86_64-apple-macosx10.15.0 [ 27] libsystem_malloc.dylib x86_64-apple-macosx10.15.0 [ 28] libsystem_networkextension.dylib x86_64-apple-macosx10.15.0 [ 29] libsystem_notify.dylib x86_64-apple-macosx10.15.0 [ 30] libsystem_sandbox.dylib x86_64-apple-macosx10.15.0 [ 31] libsystem_secinit.dylib x86_64-apple-macosx10.15.0 [ 32] libsystem_kernel.dylib x86_64-apple-macosx10.15.0 [ 33] libsystem_platform.dylib x86_64-apple-macosx10.15.0 [ 34] libsystem_pthread.dylib x86_64-apple-macosx10.15.0 [ 35] libsystem_symptoms.dylib x86_64-apple-macosx10.15.0 [ 36] libsystem_trace.dylib x86_64-apple-macosx10.15.0 [ 37] libunwind.dylib x86_64-apple-macosx10.15.0 [ 38] libxpc.dylib x86_64-apple-macosx10.15.0 [ 39] libobjc.A.dylib x86_64-apple-macosx10.15.0

Hide Details

Hide Details

Ran command: "image list -b -t"

Hide Details

Got output: [ 0] a.out x86_64-apple-macosx10.9.0 [ 1] dyld x86_64-apple-macosx10.15.0 [ 2] libc++.1.dylib x86_64-apple-macosx10.15.0 [ 3] libSystem.B.dylib x86_64-apple-macosx10.15.0 [ 4] libc++abi.dylib x86_64-apple-macosx10.15.0 [ 5] libcache.dylib x86_64-apple-macosx10.15.0 [ 6] libcommonCrypto.dylib x86_64-apple-macosx10.15.0 [ 7] libcompiler_rt.dylib x86_64-apple-macosx10.15.0 [ 8] libcopyfile.dylib x86_64-apple-macosx10.15.0 [ 9] libcorecrypto.dylib x86_64-apple-macosx10.15.0 [ 10] libdispatch.dylib x86_64-apple-macosx10.15.0 [ 11] libdyld.dylib x86_64-apple-macosx10.15.0 [ 12] libkeymgr.dylib x86_64-apple-macosx10.15.0 [ 13] liblaunch.dylib x86_64-apple-macosx10.15.0 [ 14] libmacho.dylib x86_64-apple-macosx10.15.0 [ 15] libquarantine.dylib x86_64-apple-macosx10.15.0 [ 16] libremovefile.dylib x86_64-apple-macosx10.15.0 [ 17] libsystem_asl.dylib x86_64-apple-macosx10.15.0 [ 18] libsystem_blocks.dylib x86_64-apple-macosx10.15.0 [ 19] libsystem_c.dylib x86_64-apple-macosx10.15.0 [ 20] libsystem_configuration.dylib x86_64-apple-macosx10.15.0 [ 21] libsystem_coreservices.dylib x86_64-apple-macosx10.15.0 [ 22] libsystem_darwin.dylib x86_64-apple-macosx10.15.0 [ 23] libsystem_dnssd.dylib x86_64-apple-macosx10.15.0 [ 24] libsystem_featureflags.dylib x86_64-apple-macosx10.15.0 [ 25] libsystem_info.dylib x86_64-apple-macosx10.15.0 [ 26] libsystem_m.dylib x86_64-apple-macosx10.15.0 [ 27] libsystem_malloc.dylib x86_64-apple-macosx10.15.0 [ 28] libsystem_networkextension.dylib x86_64-apple-macosx10.15.0 [ 29] libsystem_notify.dylib x86_64-apple-macosx10.15.0 [ 30] libsystem_sandbox.dylib x86_64-apple-macosx10.15.0 [ 31] libsystem_secinit.dylib x86_64-apple-macosx10.15.0 [ 32] libsystem_kernel.dylib x86_64-apple-macosx10.15.0 [ 33] libsystem_platform.dylib x86_64-apple-macosx10.15.0 [ 34] libsystem_pthread.dylib x86_64-apple-macosx10.15.0 [ 35] libsystem_symptoms.dylib x86_64-apple-macosx10.15.0 [ 36] libsystem_trace.dylib x86_64-apple-macosx10.15.0 [ 37] libunwind.dylib x86_64-apple-macosx10.15.0 [ 38] libxpc.dylib x86_64-apple-macosx10.15.0 [ 39] libobjc.A.dylib x86_64-apple-macosx10.15.0

Hide Details

Expecting regex pattern: "a\.out x86_64-apple-macosx10.9.*" (was found, matched "a.out x86_64-apple-macosx10.9.0")

Hide Details

--

Hide Details

******************** PASS: lldb-unit :: Utility/./UtilityTests/StreamTest.AddressRange (1246 of 2153) UNSUPPORTED: lldb-shell :: Register/x86-64-xmm16-write.test (1247 of 2153) PASS: lldb-api :: functionalities/data-formatter/user-format-vs-summary/TestUserFormatVsSummary.py (1248 of 2153) UNSUPPORTED: lldb-shell :: ScriptInterpreter/Lua/bindings.test (1249 of 2153) UNSUPPORTED: lldb-shell :: SymbolFile/PDB/enums-layout.test (1250 of 2153) PASS: lldb-unit :: ScriptInterpreter/Python/./ScriptInterpreterPythonTests/PythonDataObjectsTest.TestPythonDictionaryToStructuredDictionary (1251 of 2153) PASS: lldb-unit :: Utility/./UtilityTests/ArgsTest.ReplaceArgumentAtIndexFarOutOfRange (1252 of 2153) PASS: lldb-unit :: Host/./HostTests/ProcessLaunchInfoTest.Constructor (1253 of 2153) PASS: lldb-api :: commands/expression/persistent_types/TestPersistentTypes.py (1254 of 2153) PASS: lldb-unit :: Utility/./UtilityTests/StringExtractorTest.GetHexU8_Underflow2 (1255 of 2153) UNSUPPORTED: lldb-shell :: SymbolFile/PDB/type-quals.test (1256 of 2153) PASS: lldb-api :: commands/expression/radar_9673664/TestExprHelpExamples.py (1257 of 2153) PASS: lldb-api :: commands/gui/viewlarge/TestGuiViewLarge.py (1258 of 2153) PASS: lldb-api :: lang/cpp/unsigned_types/TestUnsignedTypes.py (1259 of 2153) PASS: lldb-api :: lang/mixed/TestMixedLanguages.py (1260 of 2153) PASS: lldb-api :: tools/lldb-vscode/coreFile/TestVSCode_coreFile.py (1261 of 2153) PASS: lldb-api :: commands/process/attach/TestProcessAttach.py (1262 of 2153) UNSUPPORTED: lldb-api :: functionalities/thread/concurrent_events/TestConcurrentManySignals.py (1263 of 2153) PASS: lldb-unit :: Host/./HostTests/FileSystemTest.FileAndDirectoryComponents (1264 of 2153) PASS: lldb-api :: lang/c/tls_globals/TestTlsGlobals.py (1265 of 2153) PASS: lldb-api :: functionalities/thread/concurrent_events/TestConcurrentManyBreakpoints.py (1266 of 2153) UNSUPPORTED: lldb-shell :: Unwind/unwind-plan-dwarf-dump.test (1267 of 2153) PASS: lldb-api :: functionalities/data-formatter/data-formatter-cpp/TestDataFormatterCpp.py (1268 of 2153) PASS: lldb-api :: macosx/safe-to-func-call/TestSafeFuncCalls.py (1269 of 2153) PASS: lldb-api :: tools/lldb-server/TestGdbRemoteHostInfo.py (1270 of 2153) PASS: lldb-api :: commands/expression/import-std-module/pair/TestPairFromStdModule.py (1271 of 2153) UNSUPPORTED: lldb-api :: commands/trace/TestTraceLoad.py (1272 of 2153) PASS: lldb-api :: commands/expression/import-std-module/vector-bool/TestVectorBoolFromStdModule.py (1273 of 2153) PASS: lldb-shell :: Reproducer/Functionalities/TestStepping.test (1274 of 2153) PASS: lldb-unit :: Language/Highlighting/./HighlighterTests/HighlighterTest.ClangSquareBrackets (1275 of 2153) PASS: lldb-api :: macosx/find-dsym/bundle-with-dot-in-filename/TestBundleWithDotInFilename.py (1276 of 2153) PASS: lldb-unit :: Symbol/./SymbolTests/TestTypeSystemClang.TestUnifyAccessSpecifiers (1277 of 2153) PASS: lldb-shell :: ObjectFile/PECOFF/sections-names.yaml (1278 of 2153) PASS: lldb-api :: commands/frame/diagnose/complicated-expression/TestComplicatedExpression.py (1279 of 2153) PASS: lldb-unit :: Process/gdb-remote/./ProcessGdbRemoteTests/GDBRemoteCommunicationClientTest.SendGetTraceConfigPacket (1280 of 2153) PASS: lldb-shell :: Commands/command-disassemble.s (1281 of 2153) PASS: lldb-api :: lang/cpp/covariant-return-types/TestCovariantReturnTypes.py (1282 of 2153) PASS: lldb-unit :: Core/./LLDBCoreTests/MangledTest.ResultForValidName (1283 of 2153) PASS: lldb-unit :: SymbolFile/NativePDB/./SymbolFileNativePDBTests/PDBFPOProgramToDWARFExpressionTests.UnsupportedRASearch (1284 of 2153) PASS: lldb-api :: functionalities/type_lookup/TestTypeLookup.py (1285 of 2153) UNSUPPORTED: lldb-api :: functionalities/darwin_log/filter/exact_match/activity/TestDarwinLogFilterMatchActivity.py (1286 of 2153) PASS: lldb-unit :: SymbolFile/NativePDB/./SymbolFileNativePDBTests/PDBFPOProgramToDWARFExpressionTests.DependencyChain (1287 of 2153) PASS: lldb-unit :: Utility/./UtilityTests/StreamTeeTest.Constructor1Stream (1288 of 2153) PASS: lldb-api :: python_api/sbtype_typeclass/TestSBTypeTypeClass.py (1289 of 2153) PASS: lldb-unit :: Utility/./UtilityTests/DataExtractorTest.UncommonAddressSize (1290 of 2153) PASS: lldb-unit :: Utility/./UtilityTests/RangeDataVector.FindEntryThatContains (1291 of 2153) PASS: lldb-shell :: SymbolFile/DWARF/DW_OP_piece-struct.s (1292 of 2153) PASS: lldb-api :: functionalities/breakpoint/breakpoint_by_line_and_column/TestBreakpointByLineAndColumn.py (1293 of 2153) PASS: lldb-api :: lang/objc/real-definition/TestRealDefinition.py (1294 of 2153) UNSUPPORTED: lldb-shell :: SymbolFile/target-symbols-add-unwind.test (1295 of 2153) PASS: lldb-unit :: Utility/./UtilityTests/VMRange.ContainsRange (1296 of 2153) PASS: lldb-unit :: UnwindAssembly/x86/./UnwindAssemblyx86Tests/Testx86AssemblyInspectionEngine.TestPopRBP (1297 of 2153) PASS: lldb-unit :: Target/./TargetTests/MemoryRegionInfoTest.Formatv (1298 of 2153) PASS: lldb-unit :: Utility/./UtilityTests/UriParserTest.PortOverflow (1299 of 2153) PASS: lldb-unit :: SymbolFile/NativePDB/./SymbolFileNativePDBTests/PDBFPOProgramToDWARFExpressionTests.SingleAssignmentRegisterRef (1300 of 2153) PASS: lldb-api :: lang/cpp/signed_types/TestSignedTypes.py (1301 of 2153) UNSUPPORTED: lldb-shell :: SymbolFile/PDB/typedefs.test (1302 of 2153) PASS: lldb-api :: python_api/value/change_values/TestChangeValueAPI.py (1303 of 2153) PASS: lldb-api :: commands/expression/radar_9531204/TestPrintfAfterUp.py (1304 of 2153) PASS: lldb-unit :: Utility/./UtilityTests/UriParserTest.TypicalPortPathIPv6 (1305 of 2153) PASS: lldb-unit :: Utility/./UtilityTests/BinaryStreamTest.PutULEB128FiveBytes (1306 of 2153) PASS: lldb-unit :: Process/gdb-remote/./ProcessGdbRemoteTests/GDBRemoteCommunicationClientTest.GetModulesInfoInvalidResponse (1307 of 2153) UNSUPPORTED: lldb-api :: tools/lldb-server/TestGdbRemote_vContThreads.py (1308 of 2153) PASS: lldb-api :: functionalities/thread/concurrent_events/TestConcurrentTwoWatchpointsOneBreakpoint.py (1309 of 2153) PASS: lldb-shell :: ObjectFile/ELF/section-types-edgecases.yaml (1310 of 2153) PASS: lldb-unit :: Utility/./UtilityTests/OptionsWithRawTest.ArgsButNoDelimiter (1311 of 2153) UNSUPPORTED: lldb-shell :: ScriptInterpreter/Lua/command_script_import.test (1312 of 2153) PASS: lldb-unit :: Language/Highlighting/./HighlighterTests/HighlighterTest.ClangCursorPosAfterOtherToken (1313 of 2153) PASS: lldb-unit :: SymbolFile/DWARF/./SymbolFileDWARFTests/SymbolFileDWARFTests.TestAbbrevMissingTerminator (1314 of 2153) UNSUPPORTED: lldb-api :: functionalities/data-formatter/data-formatter-stl/libstdcpp/list/TestDataFormatterStdList.py (1315 of 2153) PASS: lldb-unit :: Host/./HostTests/MainLoopTest.TerminatesImmediately (1316 of 2153) PASS: lldb-api :: commands/expression/call-function/TestCallStdStringFunction.py (1317 of 2153) PASS: lldb-unit :: Utility/./UtilityTests/BinaryStreamTest.PutULEB128ThreeBytes (1318 of 2153) PASS: lldb-unit :: Utility/./UtilityTests/StringListTest.AppendListCStringArray (1319 of 2153) PASS: lldb-api :: lang/cpp/typedef/TestCppTypedef.py (1320 of 2153) UNSUPPORTED: lldb-api :: commands/expression/macros/TestMacros.py (1321 of 2153) UNSUPPORTED: lldb-api :: functionalities/data-formatter/data-formatter-stl/libstdcpp/string/TestDataFormatterStdString.py (1322 of 2153) PASS: lldb-api :: functionalities/conditional_break/TestConditionalBreak.py (1323 of 2153) PASS: lldb-unit :: DataFormatter/./LLDBFormatterTests/StringPrinterTests.SwiftUTF8 (1324 of 2153) PASS: lldb-api :: lang/objc/radar-9691614/TestObjCMethodReturningBOOL.py (1325 of 2153) UNSUPPORTED: lldb-api :: functionalities/data-formatter/data-formatter-stl/libstdcpp/unique_ptr/TestDataFormatterStdUniquePtr.py (1326 of 2153) PASS: lldb-unit :: Symbol/./SymbolTests/DWARFCallFrameInfoTest.Basic_dwarf3 (1327 of 2153) PASS: lldb-unit :: Utility/./UtilityTests/ConstStringTest.UpdateMangledCounterpart (1328 of 2153) PASS: lldb-unit :: Process/gdb-remote/./ProcessGdbRemoteTests/GDBRemoteCommunicationClientTest.TestPacketSpeedJSON (1329 of 2153) PASS: lldb-unit :: Language/Highlighting/./HighlighterTests/HighlighterTest.ClangTrailingBackslashWithWhitespace (1330 of 2153) PASS: lldb-shell :: Settings/TestFrameFormatNoColor.test (1331 of 2153) PASS: lldb-api :: commands/expression/import-std-module/vector-dbg-info-content/TestDbgInfoContentVectorFromStdModule.py (1332 of 2153) PASS: lldb-unit :: ScriptInterpreter/Python/./ScriptInterpreterPythonTests/PythonDataObjectsTest.TestPythonFile (1333 of 2153) PASS: lldb-shell :: SymbolFile/NativePDB/break-by-function.cpp (1334 of 2153) PASS: lldb-api :: python_api/sbvalue_persist/TestSBValuePersist.py (1335 of 2153) PASS: lldb-unit :: UnwindAssembly/x86/./UnwindAssemblyx86Tests/Testx86AssemblyInspectionEngine.TestCALLNextInsn (1336 of 2153) PASS: lldb-shell :: ObjectFile/ELF/compressed-sections.yaml (1337 of 2153) PASS: lldb-unit :: Utility/./UtilityTests/StringListTest.ForRange (1338 of 2153) PASS: lldb-unit :: Language/Highlighting/./HighlighterTests/HighlighterTest.HighlighterSelectionType (1339 of 2153) PASS: lldb-shell :: ObjectFile/ELF/section-permissions.yaml (1340 of 2153) PASS: lldb-unit :: Utility/./UtilityTests/StreamTeeTest.AppendStream (1341 of 2153) PASS: lldb-unit :: Utility/./UtilityTests/BinaryStreamTest.PutULEB128Zero (1342 of 2153) PASS: lldb-unit :: Utility/./UtilityTests/VASprintfTest.NoBufferResize (1343 of 2153) PASS: lldb-unit :: debugserver/./debugserverTests/RNBSocket.LoopBackListenIPv6 (1344 of 2153) PASS: lldb-unit :: Utility/./UtilityTests/StringListTest.SetSize (1345 of 2153) PASS: lldb-unit :: SymbolFile/NativePDB/./SymbolFileNativePDBTests/PDBFPOProgramToDWARFExpressionTests.InvalidAssignmentSingle (1346 of 2153) PASS: lldb-shell :: BuildScript/modes.test (1347 of 2153) PASS: lldb-unit :: UnwindAssembly/x86/./UnwindAssemblyx86Tests/Testx86AssemblyInspectionEngine.TestPushR12 (1348 of 2153) PASS: lldb-api :: commands/expression/no-deadlock/TestExprDoesntBlock.py (1349 of 2153) PASS: lldb-unit :: Process/minidump/./LLDBMinidumpTests/MinidumpParserTest.GetLinuxProcStatus_no_stream (1350 of 2153) PASS: lldb-api :: functionalities/breakpoint/breakpoint_command/TestRegexpBreakCommand.py (1351 of 2153) PASS: lldb-api :: functionalities/reproducers/attach/TestReproducerAttach.py (1352 of 2153) PASS: lldb-unit :: Utility/./UtilityTests/StreamTest.PutRawBytesToMixedEndian (1353 of 2153) PASS: lldb-api :: lang/objcxx/objcxx-ivar-vector/TestIvarVector.py (1354 of 2153) PASS: lldb-unit :: Utility/./UtilityTests/FileSpecTest.PrependPathComponent (1355 of 2153) PASS: lldb-api :: python_api/class_members/TestSBTypeClassMembers.py (1356 of 2153) PASS: lldb-api :: functionalities/breakpoint/cpp_exception/TestCPPExceptionBreakpoint.py (1357 of 2153) PASS: lldb-unit :: Utility/./UtilityTests/StreamTest.PutHex16ByteOrderLittle (1358 of 2153) PASS: lldb-api :: lang/cpp/operators/TestCppOperators.py (1359 of 2153) PASS: lldb-unit :: Utility/./UtilityTests/BinaryStreamTest.PutULEB128SixBytes (1360 of 2153) PASS: lldb-unit :: Utility/./UtilityTests/PassiveReplayTest.InstrumentedFooInvalid (1361 of 2153) PASS: lldb-api :: functionalities/data-formatter/nsarraysynth/TestNSArraySynthetic.py (1362 of 2153) PASS: lldb-unit :: Utility/./UtilityTests/BinaryStreamTest.PutULEB128EightBytes (1363 of 2153) PASS: lldb-api :: types/TestLongTypes.py (1364 of 2153) PASS: lldb-api :: lang/objc/orderedset/TestOrderedSet.py (1365 of 2153) UNSUPPORTED: lldb-shell :: ScriptInterpreter/Lua/watchpoint_callback.test (1366 of 2153) PASS: lldb-unit :: Editline/./EditlineTests/EditlineTestFixture.EditlineReceivesMultiLineText (1367 of 2153) PASS: lldb-shell :: SymbolFile/DWARF/compilercontext.ll (1368 of 2153) PASS: lldb-api :: functionalities/exec/TestExec.py (1369 of 2153) PASS: lldb-unit :: Language/CPlusPlus/./LanguageCPlusPlusTests/CPlusPlusLanguage.ExtractContextAndIdentifier (1370 of 2153) PASS: lldb-api :: commands/platform/basic/TestPlatformPython.py (1371 of 2153) PASS: lldb-unit :: Utility/./UtilityTests/StreamTest.PutSLEB128 (1372 of 2153) PASS: lldb-api :: functionalities/thread/crash_during_step/TestCrashDuringStep.py (1373 of 2153) PASS: lldb-unit :: Process/gdb-remote/./ProcessGdbRemoteTests/GDBRemoteClientBaseTest.SendContinueAndInterrupt (1374 of 2153) PASS: lldb-unit :: Utility/./UtilityTests/IndexToObjectTest.ObjectForIndex (1375 of 2153) PASS: lldb-api :: commands/expression/import-std-module/weak_ptr/TestWeakPtrFromStdModule.py (1376 of 2153) PASS: lldb-unit :: Utility/./UtilityTests/SerializationRountripTest.SerializeDeserializePodReferences (1377 of 2153) PASS: lldb-shell :: SymbolFile/DWARF/find-method.cpp (1378 of 2153) PASS: lldb-api :: commands/gui/invalid-args/TestInvalidArgsGui.py (1379 of 2153) PASS: lldb-api :: functionalities/data-formatter/data-formatter-objc/TestDataFormatterObjCKVO.py (1380 of 2153) PASS: lldb-api :: functionalities/gdb_remote_client/TestNestedRegDefinitions.py (1381 of 2153) PASS: lldb-unit :: Utility/./UtilityTests/RangeTest.SlideZero (1382 of 2153) PASS: lldb-unit :: ScriptInterpreter/Python/./ScriptInterpreterPythonTests/PythonDataObjectsTest.TestPythonIntegerToStructuredInteger (1383 of 2153) PASS: lldb-unit :: Language/Highlighting/./HighlighterTests/HighlighterTest.ClangPreserveNewLine (1384 of 2153) PASS: lldb-shell :: SymbolFile/DWARF/find-qualified-variable.cpp (1385 of 2153) PASS: lldb-unit :: ObjectFile/Breakpad/./ObjectFileBreakpadTests/PublicRecord.parse (1386 of 2153) PASS: lldb-unit :: Target/./TargetTests/ModuleCacheTest.GetAndPut (1387 of 2153) PASS: lldb-shell :: SymbolFile/Breakpad/stack-cfi-parsing.test (1388 of 2153) PASS: lldb-api :: functionalities/gdb_remote_client/TestWasm.py (1389 of 2153) PASS: lldb-api :: lang/c/shared_lib/TestSharedLib.py (1390 of 2153) PASS: lldb-shell :: Recognizer/assert.test (1391 of 2153) PASS: lldb-api :: functionalities/thread/thread_specific_break/TestThreadSpecificBreakpoint.py (1392 of 2153) PASS: lldb-api :: tools/lldb-server/TestGdbRemoteExitCode.py (1393 of 2153) PASS: lldb-unit :: Utility/./UtilityTests/BinaryStreamTest.PutSLEB128Zero (1394 of 2153) PASS: lldb-unit :: ScriptInterpreter/Python/./ScriptInterpreterPythonTests/PythonDataObjectsTest.TestExceptions (1395 of 2153) PASS: lldb-unit :: Process/minidump/./LLDBMinidumpTests/MinidumpParserTest.FindMemoryRangeWithFullMemoryMinidump (1396 of 2153) PASS: lldb-unit :: Language/Highlighting/./HighlighterTests/HighlighterTest.FallbackHighlighter (1397 of 2153) UNSUPPORTED: lldb-shell :: ScriptInterpreter/Lua/persistent_state.test (1398 of 2153) PASS: lldb-unit :: Utility/./UtilityTests/RangeDataVector.CustomSort (1399 of 2153) PASS: lldb-unit :: Utility/./UtilityTests/StreamTest.PutHex16ByteOrderBig (1400 of 2153) PASS: lldb-shell :: SymbolFile/DWARF/find-basic-namespace.cpp (1401 of 2153) PASS: lldb-unit :: Utility/./UtilityTests/StringListTest.Assignment (1402 of 2153) PASS: lldb-unit :: Language/Highlighting/./HighlighterTests/HighlighterTest.ClangIdentifiers (1403 of 2153) PASS: lldb-api :: functionalities/thread/concurrent_events/TestConcurrentWatchBreak.py (1404 of 2153) PASS: lldb-api :: functionalities/data-formatter/data-formatter-objc/TestDataFormatterObjCPlain.py (1405 of 2153) PASS: lldb-unit :: Language/Highlighting/./HighlighterTests/HighlighterTest.ClangCursorPosEndOfLine (1406 of 2153) PASS: lldb-api :: commands/platform/file/read/TestPlatformFileRead.py (1407 of 2153) PASS: lldb-api :: python_api/type/TestTypeList.py (1408 of 2153) PASS: lldb-unit :: Utility/./UtilityTests/UriParserTest.Minimal (1409 of 2153) PASS: lldb-shell :: Expr/TestIRMemoryMap.test (1410 of 2153) PASS: lldb-shell :: ObjectFile/PECOFF/sections.yaml (1411 of 2153) PASS: lldb-unit :: ScriptInterpreter/Python/./ScriptInterpreterPythonTests/PythonDataObjectsTest.TestPythonByteArray (1412 of 2153) PASS: lldb-unit :: Utility/./UtilityTests/StatusTest.Formatv (1413 of 2153) PASS: lldb-unit :: Symbol/./SymbolTests/DWARFCallFrameInfoTest.Basic_eh (1414 of 2153) PASS: lldb-api :: functionalities/gdb_remote_client/TestWriteMemory.py (1415 of 2153) PASS: lldb-shell :: SymbolFile/Breakpad/line-table-edgecases.test (1416 of 2153) PASS: lldb-shell :: SymbolFile/DWARF/dwp.s (1417 of 2153) PASS: lldb-unit :: UnwindAssembly/x86/./UnwindAssemblyx86Tests/Testx86AssemblyInspectionEngine.TestLEAVE (1418 of 2153) UNSUPPORTED: lldb-shell :: SymbolFile/NativePDB/typedefs.cpp (1419 of 2153) PASS: lldb-unit :: Thread/./ThreadTests/ThreadTest.GetPrivateStopInfo (1420 of 2153) PASS: lldb-api :: source-manager/TestSourceManager.py (1421 of 2153) PASS: lldb-api :: lang/objc/modules-auto-import/TestModulesAutoImport.py (1422 of 2153) PASS: lldb-unit :: tools/lldb-server/tests/./LLDBServerTests/TestBase.LaunchModePreservesEnvironment (1423 of 2153) PASS: lldb-api :: functionalities/multidebugger_commands/TestMultipleDebuggersCommands.py (1424 of 2153) PASS: lldb-unit :: ScriptInterpreter/Python/./ScriptInterpreterPythonTests/PythonDataObjectsTest.TestPythonStringToStr (1425 of 2153) PASS: lldb-unit :: Expression/./ExpressionTests/DiagnosticManagerTest.PutStringMultiple (1426 of 2153) PASS: lldb-shell :: SymbolFile/DWARF/DW_AT_low_pc-addrx.s (1427 of 2153) PASS: lldb-unit :: Process/gdb-remote/./ProcessGdbRemoteTests/GDBRemoteCommunicationClientTest.GetModulesInfo (1428 of 2153) PASS: lldb-unit :: ScriptInterpreter/Python/./ScriptInterpreterPythonTests/PythonDataObjectsTest.TestInstanceNameResolutionNoDot (1429 of 2153) PASS: lldb-api :: commands/expression/import-std-module/list/TestListFromStdModule.py (1430 of 2153) PASS: lldb-api :: lang/objc/global_ptrs/TestGlobalObjects.py (1431 of 2153) PASS: lldb-unit :: Utility/./UtilityTests/StringExtractorTest.GetU64BigEndian (1432 of 2153) PASS: lldb-unit :: Utility/./UtilityTests/BinaryStreamTest.PutSLEB128TwoBytes (1433 of 2153) PASS: lldb-unit :: Language/Highlighting/./HighlighterTests/HighlighterTest.ClangCursorPosInOtherToken (1434 of 2153) PASS: lldb-shell :: Breakpoint/single-file-split-dwarf.test (1435 of 2153) PASS: lldb-api :: functionalities/data-formatter/data-formatter-caching/TestDataFormatterCaching.py (1436 of 2153) PASS: lldb-unit :: ObjectFile/Breakpad/./ObjectFileBreakpadTests/FuncRecord.parse (1437 of 2153) PASS: lldb-api :: functionalities/thread/concurrent_events/TestConcurrentTwoBreakpointsOneSignal.py (1438 of 2153) PASS: lldb-unit :: debugserver/./debugserverTests/RNBSocket.LoopBackConnectIPv6 (1439 of 2153) PASS: lldb-api :: commands/watchpoints/watchpoint_commands/command/TestWatchpointCommandPython.py (1440 of 2153) PASS: lldb-api :: lang/cpp/namespace_conflicts/TestNamespaceConflicts.py (1441 of 2153) PASS: lldb-api :: functionalities/data-formatter/cstring-utf8-summary/TestCstringUnicode.py (1442 of 2153) PASS: lldb-unit :: Utility/./UtilityTests/TimeoutTest.Format (1443 of 2153) UNSUPPORTED: lldb-api :: functionalities/thread/break_after_join/TestBreakAfterJoin.py (1444 of 2153) PASS: lldb-unit :: Process/minidump/./LLDBMinidumpTests/MinidumpParserTest.MinidumpDuplicateModuleMinAddress (1445 of 2153) PASS: lldb-api :: functionalities/tail_call_frames/cross_object/TestCrossObjectTailCalls.py (1446 of 2153) PASS: lldb-unit :: Utility/./UtilityTests/ArgsTest.TestInsertArg (1447 of 2153) PASS: lldb-api :: commands/thread/select/TestThreadSelect.py (1448 of 2153) PASS: lldb-api :: commands/add-dsym/uuid/TestAddDsymCommand.py (1449 of 2153) PASS: lldb-api :: tools/lldb-server/TestGdbRemoteThreadsInStopReply.py (1450 of 2153) PASS: lldb-shell :: SymbolFile/DWARF/array-sizes.s (1451 of 2153) PASS: lldb-unit :: Utility/./UtilityTests/BinaryStreamTest.PutSLEB128EightBytes (1452 of 2153) PASS: lldb-api :: functionalities/breakpoint/scripted_bkpt/TestScriptedResolver.py (1453 of 2153) PASS: lldb-unit :: Platform/./LLDBPlatformTests/PlatformAppleSimulatorTest.TestHostPlatformToSim (1454 of 2153) PASS: lldb-unit :: ScriptInterpreter/Python/./ScriptInterpreterPythonTests/PythonDataObjectsTest.TestPythonListValueEquality (1455 of 2153) PASS: lldb-shell :: ObjectFile/ELF/minidebuginfo-corrupt-xz.yaml (1456 of 2153) UNSUPPORTED: lldb-shell :: SymbolFile/PDB/ast-restore.test (1457 of 2153) PASS: lldb-api :: functionalities/data-formatter/setvaluefromcstring/TestSetValueFromCString.py (1458 of 2153) PASS: lldb-unit :: Symbol/./SymbolTests/Type.GetTypeScopeAndBasename (1459 of 2153) PASS: lldb-api :: functionalities/data-formatter/data-formatter-objc/TestDataFormatterObjCNSURL.py (1460 of 2153) PASS: lldb-shell :: SymbolFile/DWARF/split-dwarf-multiple-cu.ll (1461 of 2153) PASS: lldb-api :: lang/c/record_decl_in_expr/TestRecordDeclInExpr.py (1462 of 2153) PASS: lldb-unit :: ScriptInterpreter/Python/./ScriptInterpreterPythonTests/PythonDataObjectsTest.TestPythonTupleValues (1463 of 2153) PASS: lldb-unit :: Utility/./UtilityTests/RangeTest.DefaultConstructor (1464 of 2153) PASS: lldb-unit :: Host/./HostTests/File.GetStreamFromDescriptor (1465 of 2153) PASS: lldb-unit :: ScriptInterpreter/Python/./ScriptInterpreterPythonTests/PythonDataObjectsTest.TestPythonStringToStructuredString (1466 of 2153) PASS: lldb-unit :: Utility/./UtilityTests/SerializationRountripTest.SerializeDeserializePod (1467 of 2153) PASS: lldb-unit :: Utility/./UtilityTests/NameMatchesTest.Contains (1468 of 2153) PASS: lldb-unit :: Host/./HostTests/MainLoopTest.DetectsEOF (1469 of 2153) PASS: lldb-unit :: Process/gdb-remote/./ProcessGdbRemoteTests/GDBRemoteClientBaseTest.SendPacketAndReceiveResponseWithOutputSupport (1470 of 2153) PASS: lldb-api :: functionalities/dlopen_other_executable/TestDlopenOtherExecutable.py (1471 of 2153) PASS: lldb-api :: functionalities/thread/concurrent_events/TestConcurrentDelaySignalBreak.py (1472 of 2153) PASS: lldb-unit :: UnwindAssembly/x86/./UnwindAssemblyx86Tests/Testx86AssemblyInspectionEngine.TestPushR13 (1473 of 2153) PASS: lldb-unit :: Process/minidump/./LLDBMinidumpTests/MinidumpParserTest.GetMemory (1474 of 2153) PASS: lldb-unit :: Interpreter/./InterpreterTests/CompletionTest.FileCompletionAbsolute (1475 of 2153) PASS: lldb-unit :: Utility/./UtilityTests/StreamTest.PutPtr (1476 of 2153) PASS: lldb-unit :: Expression/./ExpressionTests/DiagnosticManagerTest.GetStringBasic (1477 of 2153) PASS: lldb-api :: functionalities/source-map/TestTargetSourceMap.py (1478 of 2153) UNSUPPORTED: lldb-shell :: Register/x86-ymm-write.test (1479 of 2153) PASS: lldb-unit :: Host/./HostTests/SocketTest.TCPGetAddress (1480 of 2153) PASS: lldb-unit :: ScriptInterpreter/Python/./ScriptInterpreterPythonTests/PythonDataObjectsTest.TestPythonBoolean (1481 of 2153) PASS: lldb-unit :: Utility/./UtilityTests/ArgsTest.TestMultipleArgs (1482 of 2153) PASS: lldb-unit :: ObjectFile/ELF/./ObjectFileELFTests/ObjectFileELFTest.GetSymtab_NoSymEntryPointArmThumbAddressClass (1483 of 2153) PASS: lldb-unit :: Utility/./UtilityTests/StringLexerTest.AdvanceIf (1484 of 2153) PASS: lldb-api :: functionalities/breakpoint/address_breakpoints/TestAddressBreakpoints.py (1485 of 2153) PASS: lldb-unit :: UnwindAssembly/x86/./UnwindAssemblyx86Tests/Testx86AssemblyInspectionEngine.TestPushRBP (1486 of 2153) PASS: lldb-api :: functionalities/data-formatter/type_summary_list_script/TestTypeSummaryListScript.py (1487 of 2153) PASS: lldb-unit :: Expression/./ExpressionTests/ClangHostTest.MacOSX (1488 of 2153) PASS: lldb-shell :: Commands/CommandScriptImmediateOutput/CommandScriptImmediateOutputFile.test (1489 of 2153) PASS: lldb-api :: commands/expression/entry-bp/TestExprEntryBP.py (1490 of 2153) PASS: lldb-api :: lang/c/shared_lib_stripped_symbols/TestSharedLibStrippedSymbols.py (1491 of 2153) PASS: lldb-unit :: Language/CPlusPlus/./LanguageCPlusPlusTests/CPlusPlusLanguage.MethodNameParsing (1492 of 2153) PASS: lldb-unit :: Utility/./UtilityTests/RangeTest.DoesAdjoinOrIntersect (1493 of 2153) PASS: lldb-unit :: Process/minidump/./LLDBMinidumpTests/RegisterContextMinidump.CheckRegisterContextMinidump_ARM (1494 of 2153) PASS: lldb-api :: commands/command/delete/TestCommandDelete.py (1495 of 2153) PASS: lldb-unit :: Thread/./ThreadTests/ThreadTest.SetStopInfo (1496 of 2153) PASS: lldb-shell :: Minidump/dump-all.test (1497 of 2153) UNSUPPORTED: lldb-api :: arm/breakpoint-thumb-codesection/TestBreakpointThumbCodesection.py (1498 of 2153) PASS: lldb-unit :: Utility/./UtilityTests/UriParserTest.TypicalPortPathIPv4 (1499 of 2153) UNSUPPORTED: lldb-shell :: ObjectFile/ELF/minidebuginfo-set-and-hit-breakpoint.test (1500 of 2153) PASS: lldb-unit :: Utility/./UtilityTests/FileSpecTest.EqualSeparator (1501 of 2153) PASS: lldb-shell :: Reproducer/TestVerify.test (1502 of 2153) PASS: lldb-shell :: ObjectFile/ELF/section-addresses.yaml (1503 of 2153) PASS: lldb-shell :: BuildScript/script-args.test (1504 of 2153) PASS: lldb-unit :: Utility/./UtilityTests/StringListTest.GetMaxStringLengthMixed (1505 of 2153) PASS: lldb-shell :: SymbolFile/DWARF/debug_ranges_and_rnglists.test (1506 of 2153) PASS: lldb-shell :: Breakpoint/debug_rnglistx_rlex.test (1507 of 2153) PASS: lldb-shell :: SymbolFile/DWARF/clang-ast-from-dwarf-unamed-and-anon-structs.cpp (1508 of 2153) PASS: lldb-api :: macosx/lc-note/kern-ver-str/TestKernVerStrLCNOTE.py (1509 of 2153) PASS: lldb-unit :: Utility/./UtilityTests/StringListTest.RemoveBlankLines (1510 of 2153) PASS: lldb-api :: commands/gui/basicdebug/TestGuiBasicDebug.py (1511 of 2153) PASS: lldb-api :: functionalities/data-formatter/data-formatter-stl/libcxx/variant/TestDataFormatterLibcxxVariant.py (1512 of 2153) PASS: lldb-api :: functionalities/breakpoint/serialize/TestBreakpointSerialization.py (1513 of 2153) PASS: lldb-api :: commands/expression/regression-access-function-template-in-record/TestRegressionAccessFunctionTemplateInRecord.py (1514 of 2153) PASS: lldb-unit :: Utility/./UtilityTests/GeneratorTest.Get (1515 of 2153) PASS: lldb-unit :: Utility/./UtilityTests/ScalarTest.TruncOrExtendTo (1516 of 2153) PASS: lldb-unit :: Symbol/./SymbolTests/TestTypeSystemClang.TestRecordHasFields (1517 of 2153) PASS: lldb-api :: functionalities/pre_run_dylibs/TestPreRunDylibs.py (1518 of 2153) PASS: lldb-api :: commands/expression/context-object-objc/TestContextObjectObjc.py (1519 of 2153) PASS: lldb-api :: api/multiple-targets/TestMultipleTargets.py (1520 of 2153) PASS: lldb-unit :: Signals/./SignalsTests/UnixSignalsTest.VersionChange (1521 of 2153) PASS: lldb-api :: functionalities/optimized_code/TestNoASanExceptionAfterEvalOP_piece.py (1522 of 2153) PASS: lldb-unit :: Utility/./UtilityTests/DataExtractorTest.GetCStrUnterminated (1523 of 2153) PASS: lldb-api :: functionalities/data-formatter/data-formatter-stl/libcxx/iterator/TestDataFormatterLibccIterator.py (1524 of 2153) PASS: lldb-api :: lang/cpp/char1632_t/TestChar1632T.py (1525 of 2153) PASS: lldb-unit :: Utility/./UtilityTests/ArchSpecTest.TestParseMachCPUDashSubtypeTripleSimple (1526 of 2153) PASS: lldb-api :: tools/lldb-vscode/console/TestVSCode_console.py (1527 of 2153) PASS: lldb-unit :: Utility/./UtilityTests/DataExtractorTest.PeekData (1528 of 2153) PASS: lldb-unit :: Utility/./UtilityTests/RangeDataVector.FindEntryIndexesThatContain (1529 of 2153) UNSUPPORTED: lldb-shell :: ScriptInterpreter/Lua/breakpoint_callback.test (1530 of 2153) PASS: lldb-api :: lang/objc/objc-optimized/TestObjcOptimized.py (1531 of 2153) PASS: lldb-unit :: Utility/./UtilityTests/RangeTest.Clear (1532 of 2153) PASS: lldb-unit :: Utility/./UtilityTests/StreamTest.SetIndentLevel (1533 of 2153) PASS: lldb-unit :: ScriptInterpreter/Python/./ScriptInterpreterPythonTests/PythonDataObjectsTest.TestRun (1534 of 2153) PASS: lldb-api :: types/TestDoubleTypesExpr.py (1535 of 2153) PASS: lldb-api :: lang/c/step-target/TestStepTarget.py (1536 of 2153) PASS: lldb-unit :: Utility/./UtilityTests/ArchSpecTest.TestParseMachCPUDashSubtypeTripleExtra (1537 of 2153) PASS: lldb-shell :: ObjectFile/ELF/netbsd-core-amd64.test (1538 of 2153) PASS: lldb-unit :: Process/gdb-remote/./ProcessGdbRemoteTests/GDBRemoteClientBaseTest.SendContinueAndWait (1539 of 2153) PASS: lldb-unit :: Process/gdb-remote/./ProcessGdbRemoteTests/GDBRemoteClientBaseTest.SendContinueDelegateInterface (1540 of 2153) PASS: lldb-unit :: Utility/./UtilityTests/ArgsTest.TestTrailingBackslash (1541 of 2153) PASS: lldb-api :: functionalities/data-formatter/data-formatter-objc/TestDataFormatterObjCNSBundle.py (1542 of 2153) PASS: lldb-unit :: Language/Highlighting/./HighlighterTests/HighlighterTest.ClangComments (1543 of 2153) PASS: lldb-unit :: Utility/./UtilityTests/Flags.GetBitSize (1544 of 2153) PASS: lldb-shell :: SymbolFile/NativePDB/globals-fundamental.cpp (1545 of 2153) PASS: lldb-unit :: API/./APITests/SBCommandInterpreterTest.MultiWordCommand (1546 of 2153) PASS: lldb-unit :: Utility/./UtilityTests/StructuredDataTest.StringDump (1547 of 2153) PASS: lldb-unit :: Utility/./UtilityTests/VMRange.Ordering (1548 of 2153) UNSUPPORTED: lldb-api :: commands/watchpoints/multi_watchpoint_slots/TestWatchpointMultipleSlots.py (1549 of 2153) UNSUPPORTED: lldb-shell :: Register/aarch64-fp-read.test (1550 of 2153) PASS: lldb-shell :: Commands/command-regex-unalias.test (1551 of 2153) PASS: lldb-unit :: Utility/./UtilityTests/GeneratorTest.Create (1552 of 2153) PASS: lldb-unit :: Utility/./UtilityTests/StringListTest.JoinNonSpace (1553 of 2153) PASS: lldb-api :: commands/command/source/TestCommandSource.py (1554 of 2153) PASS: lldb-unit :: Utility/./UtilityTests/RegisterValueTest.GetSet8 (1555 of 2153) XFAIL: lldb-shell :: SymbolFile/DWARF/find-type-in-function.cpp (1556 of 2153) PASS: lldb-unit :: ScriptInterpreter/Python/./ScriptInterpreterPythonTests/PythonDataObjectsTest.TestResetting (1557 of 2153) PASS: lldb-api :: lang/objc/print-obj/TestPrintObj.py (1558 of 2153) PASS: lldb-unit :: Utility/./UtilityTests/LogTest.Unregister (1559 of 2153) PASS: lldb-unit :: UnwindAssembly/x86/./UnwindAssemblyx86Tests/Testx86AssemblyInspectionEngine.TestPopESI (1560 of 2153) PASS: lldb-unit :: Utility/./UtilityTests/StreamTest.AddressPrefixAndSuffix (1561 of 2153) PASS: lldb-api :: commands/target/basic/TestTargetCommand.py (1562 of 2153) PASS: lldb-api :: functionalities/backticks/TestBackticksWithoutATarget.py (1563 of 2153) PASS: lldb-unit :: Utility/./UtilityTests/XcodeSDKTest.GetSDKTypeForTriple (1564 of 2153) PASS: lldb-api :: lang/cpp/limit-debug-info/TestWithLimitDebugInfo.py (1565 of 2153) PASS: lldb-unit :: Core/./LLDBCoreTests/RichManglingContextTest.FromCxxMethodName (1566 of 2153) PASS: lldb-shell :: SymbolFile/DWARF/anon_class_w_and_wo_export_symbols.ll (1567 of 2153) PASS: lldb-shell :: SymbolFile/Breakpad/symtab-macho.test (1568 of 2153) PASS: lldb-api :: tools/lldb-server/inferior-crash/TestGdbRemoteAbort.py (1569 of 2153) PASS: lldb-unit :: Process/minidump/./LLDBMinidumpTests/MinidumpParserTest.GetPidWindows (1570 of 2153) PASS: lldb-api :: functionalities/data-formatter/refpointer-recursion/TestDataFormatterRefPtrRecursion.py (1571 of 2153) PASS: lldb-unit :: tools/lldb-server/tests/./LLDBServerTests/StandardStartupTest.TestStopReplyContainsThreadPcs (1572 of 2153) PASS: lldb-api :: functionalities/param_entry_vals/basic_entry_values/TestBasicEntryValues.py (1573 of 2153) PASS: lldb-api :: functionalities/gdb_remote_client/TestTargetXMLArch.py (1574 of 2153) PASS: lldb-unit :: Utility/./UtilityTests/XcodeSDKTest.MergeTest (1575 of 2153) PASS: lldb-unit :: Host/./HostTests/SocketTest.DomainListenConnectAccept (1576 of 2153) UNSUPPORTED: lldb-api :: functionalities/thread/create_during_step/TestCreateDuringStep.py (1577 of 2153) PASS: lldb-api :: lang/objc/modules/TestObjCModules.py (1578 of 2153) PASS: lldb-api :: macosx/add-dsym/TestAddDsymMidExecutionCommand.py (1579 of 2153) PASS: lldb-api :: lang/objc/forward-decl/TestForwardDecl.py (1580 of 2153) PASS: lldb-unit :: DataFormatter/./LLDBFormatterTests/StringPrinterTests.CxxUTF8 (1581 of 2153) PASS: lldb-api :: lang/objc/ivar-IMP/TestObjCiVarIMP.py (1582 of 2153) UNSUPPORTED: lldb-api :: functionalities/darwin_log/filter/regex/category/TestDarwinLogFilterRegexCategory.py (1583 of 2153) UNSUPPORTED: lldb-api :: functionalities/data-formatter/data-formatter-stl/libstdcpp/vbool/TestDataFormatterStdVBool.py (1584 of 2153) PASS: lldb-api :: functionalities/tail_call_frames/disambiguate_call_site/TestDisambiguateCallSite.py (1585 of 2153) PASS: lldb-api :: lang/cpp/trivial_abi/TestTrivialABI.py (1586 of 2153) PASS: lldb-unit :: DataFormatter/./LLDBFormatterTests/TypeMatcherTests.GetMatchStringExactName (1587 of 2153) PASS: lldb-api :: functionalities/avoids-fd-leak/TestFdLeak.py (1588 of 2153) PASS: lldb-unit :: Utility/./UtilityTests/RecordReplayTest.InstrumentedBarPtr (1589 of 2153) PASS: lldb-api :: commands/version/TestVersion.py (1590 of 2153) PASS: lldb-unit :: Process/gdb-remote/./ProcessGdbRemoteTests/GDBRemoteCommunicationClientTest.SendSignalsToIgnore (1591 of 2153) PASS: lldb-unit :: Process/gdb-remote/./ProcessGdbRemoteTests/GDBRemoteCommunicationClientTest.GetMemoryRegionInfoInvalidResponse (1592 of 2153) PASS: lldb-unit :: Utility/./UtilityTests/BinaryStreamTest.PutSLEB128ThreeBytes (1593 of 2153) PASS: lldb-api :: commands/expression/import-std-module/sysroot/TestStdModuleSysroot.py (1594 of 2153) PASS: lldb-api :: lang/cpp/typeof/TestTypeOfDeclTypeExpr.py (1595 of 2153) PASS: lldb-api :: commands/expression/persistent_types/TestNestedPersistentTypes.py (1596 of 2153) PASS: lldb-unit :: SymbolFile/NativePDB/./SymbolFileNativePDBTests/PDBFPOProgramToDWARFExpressionTests.UnresolvedDependentCyclicRegisterAssignmentReference (1597 of 2153) UNSUPPORTED: lldb-shell :: Register/arm-fp-read.test (1598 of 2153) PASS: lldb-unit :: UnwindAssembly/x86/./UnwindAssemblyx86Tests/Testx86AssemblyInspectionEngine.TestPushECX (1599 of 2153) PASS: lldb-api :: functionalities/data-formatter/data-formatter-objc/TestDataFormatterObjCNSDate.py (1600 of 2153) PASS: lldb-api :: commands/expression/call-throws/TestCallThatThrows.py (1601 of 2153) PASS: lldb-api :: functionalities/inferior-assert/TestInferiorAssert.py (1602 of 2153) PASS: lldb-unit :: Utility/./UtilityTests/ConstStringTest.NullAndEmptyStates (1603 of 2153) PASS: lldb-api :: lang/objcxx/hide-runtime-values/TestObjCXXHideRuntimeValues.py (1604 of 2153) PASS: lldb-api :: lang/cpp/template/TestTemplateArgs.py (1605 of 2153) UNSUPPORTED: lldb-api :: linux/thread/create_during_instruction_step/TestCreateDuringInstructionStep.py (1606 of 2153) PASS: lldb-shell :: ObjectFile/ELF/basic-info.yaml (1607 of 2153) PASS: lldb-api :: lang/objc/foundation/TestObjCMethodsString.py (1608 of 2153) PASS: lldb-api :: lang/objc/objc-builtin-types/TestObjCBuiltinTypes.py (1609 of 2153) PASS: lldb-unit :: Utility/./UtilityTests/AnsiTerminal.Twice (1610 of 2153) PASS: lldb-api :: commands/watchpoints/watchpoint_set_command/TestWatchLocationWithWatchSet.py (1611 of 2153) PASS: lldb-shell :: Minidump/fb-dump.test (1612 of 2153) PASS: lldb-unit :: Expression/./ExpressionTests/CppModuleConfigurationTest.Xcode (1613 of 2153) PASS: lldb-api :: functionalities/data-formatter/var-in-aggregate-misuse/TestVarInAggregateMisuse.py (1614 of 2153) PASS: lldb-unit :: Utility/./UtilityTests/RecordReplayTest.InstrumentedFoo (1615 of 2153) PASS: lldb-api :: lang/c/modules/TestCModules.py (1616 of 2153) PASS: lldb-unit :: ScriptInterpreter/Python/./ScriptInterpreterPythonTests/PythonDataObjectsTest.TestScript (1617 of 2153) PASS: lldb-api :: functionalities/lazy-loading/TestLazyLoading.py (1618 of 2153) PASS: lldb-shell :: Reproducer/Functionalities/TestDataFormatter.test (1619 of 2153) PASS: lldb-shell :: Minidump/Windows/find-module.test (1620 of 2153) PASS: lldb-unit :: Utility/./UtilityTests/StreamTest.PutHex64ByteOrderLittle (1621 of 2153) PASS: lldb-unit :: Host/./HostTests/FileSystemTest.Exists (1622 of 2153) PASS: lldb-unit :: Utility/./UtilityTests/OptionsWithRawTest.SingleWhitespaceInput (1623 of 2153) PASS: lldb-shell :: SymbolFile/NativePDB/global-classes.cpp (1624 of 2153) PASS: lldb-unit :: Utility/./UtilityTests/StructuredDataTest.ParseJSONFromFile (1625 of 2153) PASS: lldb-unit :: Symbol/./SymbolTests/TestTypeSystemClang.TestConvertAccessTypeToAccessSpecifier (1626 of 2153) PASS: lldb-unit :: Host/./HostTests/ConnectionFileDescriptorTest.TCPGetURIv6 (1627 of 2153) PASS: lldb-unit :: Utility/./UtilityTests/UserIDResolver.GetGroupName (1628 of 2153) PASS: lldb-api :: commands/expression/inline-namespace/TestInlineNamespace.py (1629 of 2153) PASS: lldb-api :: lang/c/global_variables/TestGlobalVariables.py (1630 of 2153) PASS: lldb-unit :: ObjectFile/Breakpad/./ObjectFileBreakpadTests/Record.classify (1631 of 2153) PASS: lldb-shell :: SymbolFile/DWARF/find-basic-variable.cpp (1632 of 2153) PASS: lldb-api :: commands/target/stop-hooks/TestStopHooks.py (1633 of 2153) PASS: lldb-unit :: Language/Highlighting/./HighlighterTests/HighlighterTest.ClangTrailingBackslashMissingNewLine (1634 of 2153) PASS: lldb-api :: commands/expression/function_template_specialization_temp_args/TestFunctionTemplateSpecializationTempArgs.py (1635 of 2153) PASS: lldb-api :: lang/cpp/inlines/TestInlines.py (1636 of 2153) PASS: lldb-unit :: Utility/./UtilityTests/SerializationRountripTest.SerializeDeserializeCString (1637 of 2153) PASS: lldb-unit :: Host/./HostTests/NativeProcessProtocolTest.ReadMemoryWithoutTrap (1638 of 2153) PASS: lldb-api :: functionalities/thread/concurrent_events/TestConcurrentDelayedCrashWithBreakpointSignal.py (1639 of 2153) PASS: lldb-api :: functionalities/data-formatter/data-formatter-ptr-to-array/TestPtrToArrayFormatting.py (1640 of 2153) PASS: lldb-unit :: Host/./HostTests/NativeProcessProtocolTest.ReadCStringFromMemory (1641 of 2153) PASS: lldb-api :: macosx/find-dsym/deep-bundle/TestDeepBundle.py (1642 of 2153) PASS: lldb-unit :: UnwindAssembly/x86/./UnwindAssemblyx86Tests/Testx86AssemblyInspectionEngine.TestPushExtended (1643 of 2153) PASS: lldb-api :: commands/expression/vector_of_enums/TestVectorOfEnums.py (1644 of 2153) PASS: lldb-shell :: SymbolFile/DWARF/find-variable-file.cpp (1645 of 2153) PASS: lldb-unit :: Utility/./UtilityTests/AnsiTerminal.WhiteSpace (1646 of 2153) PASS: lldb-unit :: Utility/./UtilityTests/StreamTest.PutCString (1647 of 2153) PASS: lldb-shell :: SymbolFile/DWARF/debug-types-line-tables.s (1648 of 2153) PASS: lldb-unit :: Utility/./UtilityTests/StringLexerTest.HasAtLeast (1649 of 2153) PASS: lldb-api :: commands/expression/unicode-in-variable/TestUnicodeInVariable.py (1650 of 2153) PASS: lldb-api :: functionalities/postmortem/netbsd-core/TestNetBSDCore.py (1651 of 2153) PASS: lldb-unit :: UnwindAssembly/x86/./UnwindAssemblyx86Tests/Testx86AssemblyInspectionEngine.Test32bitFramelessBigStackFrame (1652 of 2153) PASS: lldb-api :: functionalities/step-avoids-no-debug/TestStepNoDebug.py (1653 of 2153) PASS: lldb-api :: python_api/value/empty_class/TestValueAPIEmptyClass.py (1654 of 2153) UNSUPPORTED: lldb-api :: tools/lldb-server/platform-process-connect/TestPlatformProcessConnect.py (1655 of 2153) PASS: lldb-shell :: SymbolFile/DWARF/clang-ast-from-dwarf-objc-property.m (1656 of 2153) PASS: lldb-unit :: Utility/./UtilityTests/BinaryStreamTest.PutSLEB128FourBytes (1657 of 2153) PASS: lldb-api :: lang/objc/unicode-string/TestUnicodeString.py (1658 of 2153) PASS: lldb-unit :: Utility/./UtilityTests/SubsystemRAIITest.SubsystemWithErrorSuccess (1659 of 2153) PASS: lldb-api :: functionalities/thread/num_threads/TestNumThreads.py (1660 of 2153) PASS: lldb-unit :: Target/./TargetTests/PathMappingListTest.RelativeTests (1661 of 2153) UNSUPPORTED: lldb-api :: android/platform/TestDefaultCacheLineSize.py (1662 of 2153) PASS: lldb-api :: commands/register/register/register_command/TestRegisters.py (1663 of 2153) PASS: lldb-shell :: SymbolFile/DWARF/debug_rnglists-dwo.s (1664 of 2153) PASS: lldb-unit :: Utility/./UtilityTests/DataExtractorTest.GetDouble (1665 of 2153) PASS: lldb-api :: commands/expression/multiline-completion/TestMultilineCompletion.py (1666 of 2153) PASS: lldb-api :: commands/expression/namespace_local_var_same_name_cpp_and_c/TestNamespaceLocalVarSameNameCppAndC.py (1667 of 2153) PASS: lldb-unit :: Utility/./UtilityTests/BinaryStreamTest.PutSLEB128FiveBytes (1668 of 2153) PASS: lldb-api :: functionalities/thread/concurrent_events/TestConcurrentBreakpointsDelayedBreakpointOneWatchpoint.py (1669 of 2153) UNSUPPORTED: lldb-api :: tools/lldb-server/signal-filtering/TestGdbRemote_QPassSignals.py (1670 of 2153) UNSUPPORTED: lldb-api :: functionalities/darwin_log/source/info/TestDarwinLogSourceInfo.py (1671 of 2153) PASS: lldb-unit :: Process/minidump/./LLDBMinidumpTests/MinidumpParserTest.MinidumpDuplicateModuleMappedFirst (1672 of 2153) PASS: lldb-api :: lang/cpp/this_class_type_mixing/TestThisClassTypeMixing.py (1673 of 2153) PASS: lldb-shell :: Settings/TestDisableColor.test (1674 of 2153) PASS: lldb-unit :: Utility/./UtilityTests/StreamTest.PutULEB128 (1675 of 2153) PASS: lldb-shell :: SymbolFile/DWARF/DW_AT_loclists_base.s (1676 of 2153) PASS: lldb-shell :: ObjectFile/PECOFF/invalid-export-table.yaml (1677 of 2153) PASS: lldb-unit :: Process/./ProcessEventDataTests/ProcessEventDataTest.DoOnRemoval (1678 of 2153) PASS: lldb-api :: lang/c/complex/TestComplexC99.py (1679 of 2153) PASS: lldb-api :: lang/objc/foundation/TestObjectDescriptionAPI.py (1680 of 2153) PASS: lldb-api :: lang/objc/objc-class-method/TestObjCClassMethod.py (1681 of 2153) PASS: lldb-api :: commands/expression/context-object/TestContextObject.py (1682 of 2153) PASS: lldb-api :: functionalities/data-formatter/data-formatter-stl/libcxx/forward_list/TestDataFormatterLibcxxForwardList.py (1683 of 2153) PASS: lldb-shell :: Reproducer/TestFileRepro.test (1684 of 2153) PASS: lldb-api :: commands/expression/anonymous-struct/TestCallUserAnonTypedef.py (1685 of 2153) PASS: lldb-api :: commands/expression/import-std-module/forward_decl_from_module/TestForwardDeclFromStdModule.py (1686 of 2153) PASS: lldb-unit :: Utility/./UtilityTests/GeneratorTest.YamlMultiProvider (1687 of 2153) PASS: lldb-unit :: Utility/./UtilityTests/StringExtractorTest.GetNameColonValueNoColon (1688 of 2153) PASS: lldb-unit :: Utility/./UtilityTests/DataExtractorTest.GetCStrAtNullOffset (1689 of 2153) PASS: lldb-api :: commands/watchpoints/watchpoint_size/TestWatchpointSizes.py (1690 of 2153) PASS: lldb-shell :: Process/UnsupportedLanguage.test (1691 of 2153) UNSUPPORTED: lldb-shell :: Register/x86-64-zmm-read.test (1692 of 2153) PASS: lldb-shell :: SymbolFile/NativePDB/bitfields.cpp (1693 of 2153) PASS: lldb-shell :: SymbolFile/DWARF/find-inline-method.s (1694 of 2153) PASS: lldb-shell :: BuildScript/toolchain-clang.test (1695 of 2153) PASS: lldb-api :: commands/expression/import-std-module/forward_list/TestForwardListFromStdModule.py (1696 of 2153) PASS: lldb-shell :: Breakpoint/implicit_const_form_support.test (1697 of 2153) PASS: lldb-unit :: Expression/./ExpressionTests/CppModuleConfigurationTest.UnknownLibCppFile (1698 of 2153) PASS: lldb-api :: functionalities/data-formatter/data-formatter-enum-format/TestDataFormatterEnumFormat.py (1699 of 2153) PASS: lldb-api :: functionalities/data-formatter/array_typedef/TestArrayTypedef.py (1700 of 2153) PASS: lldb-unit :: Process/minidump/./LLDBMinidumpTests/MinidumpParserTest.MinidumpModuleOrder (1701 of 2153) PASS: lldb-api :: types/TestFloatTypes.py (1702 of 2153) PASS: lldb-shell :: ObjectFile/ELF/aarch64-relocations.yaml (1703 of 2153) PASS: lldb-api :: driver/batch_mode/TestBatchMode.py (1704 of 2153) PASS: lldb-api :: commands/settings/quoting/TestQuoting.py (1705 of 2153) PASS: lldb-unit :: Core/./LLDBCoreTests/ModuleSpecTest.TestCOFFFile (1706 of 2153) PASS: lldb-api :: functionalities/gdb_remote_client/TestArmRegisterDefinition.py (1707 of 2153) PASS: lldb-unit :: Utility/./UtilityTests/StreamTest.AddressRangeInvalidRange (1708 of 2153) PASS: lldb-unit :: Utility/./UtilityTests/ConstStringTest.format_provider (1709 of 2153) PASS: lldb-unit :: Utility/./UtilityTests/ScalarTest.CastOperations (1710 of 2153) UNSUPPORTED: lldb-shell :: SymbolFile/NativePDB/stack_unwinding01.cpp (1711 of 2153) PASS: lldb-unit :: Host/./HostTests/HostInfoTest.GetHostname (1712 of 2153) PASS: lldb-api :: lang/c/unicode/TestUnicodeSymbols.py (1713 of 2153) PASS: lldb-unit :: Process/minidump/./LLDBMinidumpTests/RegisterContextMinidump.ConvertMinidumpContext_x86_64 (1714 of 2153) PASS: lldb-api :: iohandler/resize/TestIOHandlerResize.py (1715 of 2153) PASS: lldb-api :: functionalities/data-formatter/summary-string-onfail/Test-rdar-9974002.py (1716 of 2153) PASS: lldb-api :: python_api/module_section/TestModuleAndSection.py (1717 of 2153) PASS: lldb-api :: functionalities/breakpoint/breakpoint_locations/TestBreakpointLocations.py (1718 of 2153) PASS: lldb-api :: functionalities/breakpoint/breakpoint_by_file_colon_line/TestBreakpointByFileColonLine.py (1719 of 2153) PASS: lldb-unit :: SymbolFile/DWARF/./SymbolFileDWARFTests/SymbolFileDWARFTests.TestAbbrevOrder1Start5 (1720 of 2153) PASS: lldb-unit :: Utility/./UtilityTests/RangeTest.EqualInvalid (1721 of 2153) UNSUPPORTED: lldb-shell :: Register/x86-gp-write.test (1722 of 2153) PASS: lldb-api :: lang/objc/hidden-ivars/TestHiddenIvars.py (1723 of 2153) PASS: lldb-api :: functionalities/breakpoint/auto_continue/TestBreakpointAutoContinue.py (1724 of 2153) PASS: lldb-unit :: Utility/./UtilityTests/StringLexerTest.PutBack (1725 of 2153) PASS: lldb-api :: python_api/interpreter/TestRunCommandInterpreterAPI.py (1726 of 2153) PASS: lldb-unit :: Utility/./UtilityTests/StringListTest.AppendList (1727 of 2153) PASS: lldb-unit :: Utility/./UtilityTests/StringListTest.LongestCommonPrefixSingleElement (1728 of 2153) PASS: lldb-api :: commands/command/script/import/TestImport.py (1729 of 2153) PASS: lldb-unit :: Utility/./UtilityTests/ArgsTest.TestSingleArgWithQuotedSpace (1730 of 2153) PASS: lldb-unit :: ObjectFile/ELF/./ObjectFileELFTests/ObjectFileELFTest.GetSymtab_NoSymEntryPointArmAddressClass (1731 of 2153) PASS: lldb-unit :: Utility/./UtilityTests/FileSpecTest.AppendPathComponent (1732 of 2153) PASS: lldb-api :: lang/c/anonymous/TestAnonymous.py (1733 of 2153) PASS: lldb-unit :: Symbol/./SymbolTests/TestTypeSystemClang.AddMethodToObjCObjectType (1734 of 2153) PASS: lldb-unit :: Symbol/./SymbolTests/TestClangASTImporter.DeportTypeTagDecl (1735 of 2153) PASS: lldb-api :: functionalities/thread/exit_during_step/TestExitDuringStep.py (1736 of 2153) PASS: lldb-api :: functionalities/data-formatter/data-formatter-objc/TestDataFormatterObjCCF.py (1737 of 2153) PASS: lldb-shell :: Driver/TestFile.test (1738 of 2153) PASS: lldb-shell :: ObjectFile/PECOFF/symbol.yaml (1739 of 2153) PASS: lldb-unit :: Symbol/./SymbolTests/TestClangASTImporter.MetadataPropagationAfterCopying (1740 of 2153) PASS: lldb-unit :: Utility/./UtilityTests/ConstStringTest.CompareStringRef (1741 of 2153) PASS: lldb-unit :: Utility/./UtilityTests/BinaryStreamTest.PutULEB128FourBytes (1742 of 2153) PASS: lldb-api :: functionalities/data-formatter/data-formatter-objc/nsstring/TestDataFormatterNSString.py (1743 of 2153) UNSUPPORTED: lldb-api :: tools/lldb-server/libraries-svr4/TestGdbRemoteLibrariesSvr4Support.py (1744 of 2153) PASS: lldb-unit :: Process/gdb-remote/./ProcessGdbRemoteTests/GDBRemoteCommunicationServerTest.SendErrorResponse_UnimplementedError (1745 of 2153) PASS: lldb-api :: functionalities/data-formatter/data-formatter-stl/libcxx/vector/TestDataFormatterLibcxxVector.py (1746 of 2153) PASS: lldb-unit :: Utility/./UtilityTests/StringExtractorTest.DecodeHexU8_Underflow2 (1747 of 2153) PASS: lldb-shell :: SymbolFile/DWARF/find-basic-type.cpp (1748 of 2153) UNSUPPORTED: lldb-shell :: ScriptInterpreter/Lua/nested_sessions.test (1749 of 2153) UNSUPPORTED: lldb-api :: commands/expression/completion-crash-invalid-iterator/TestInvalidIteratorCompletionCrash.py (1750 of 2153) PASS: lldb-unit :: UnwindAssembly/x86/./UnwindAssemblyx86Tests/Testx86AssemblyInspectionEngine.TestPush0 (1751 of 2153) PASS: lldb-api :: lang/c/strings/TestCStrings.py (1752 of 2153) PASS: lldb-api :: functionalities/signal/raise/TestRaise.py (1753 of 2153) PASS: lldb-api :: lang/c/function_types/TestFunctionTypes.py (1754 of 2153) PASS: lldb-unit :: Expression/./ExpressionTests/DiagnosticManagerTest.PutString (1755 of 2153) PASS: lldb-api :: functionalities/breakpoint/breakpoint_ignore_count/TestBreakpointIgnoreCount.py (1756 of 2153) PASS: lldb-api :: tools/lldb-vscode/stackTrace/TestVSCode_stackTrace.py (1757 of 2153) PASS: lldb-api :: commands/reproducer/invalid-args/TestInvalidArgsReproducer.py (1758 of 2153) PASS: lldb-api :: lang/c/struct_types/TestStructTypes.py (1759 of 2153) PASS: lldb-unit :: SymbolFile/NativePDB/./SymbolFileNativePDBTests/PDBFPOProgramToDWARFExpressionTests.UnresolvedRegisterReference (1760 of 2153) PASS: lldb-unit :: Utility/./UtilityTests/ScalarTest.Equality (1761 of 2153) UNSUPPORTED: lldb-shell :: Register/aarch64-gp-read.test (1762 of 2153) PASS: lldb-unit :: SymbolFile/DWARF/./SymbolFileDWARFTests/XcodeSDKModuleTests.TestModuleGetXcodeSDK (1763 of 2153) PASS: lldb-api :: functionalities/data-formatter/data-formatter-stl/libcxx/unique_ptr/TestDataFormatterLibcxxUniquePtr.py (1764 of 2153) PASS: lldb-shell :: Expr/TestMultilineExpr.test (1765 of 2153) PASS: lldb-unit :: UnwindAssembly/x86/./UnwindAssemblyx86Tests/Testx86AssemblyInspectionEngine.TestSimple64bitFrameFunction (1766 of 2153) PASS: lldb-api :: iohandler/completion/TestIOHandlerCompletion.py (1767 of 2153) PASS: lldb-api :: macosx/load-kext/TestLoadKext.py (1768 of 2153) PASS: lldb-unit :: ScriptInterpreter/Python/./ScriptInterpreterPythonTests/PythonDataObjectsTest.TestPythonBytes (1769 of 2153) PASS: lldb-unit :: Utility/./UtilityTests/StreamTeeTest.GetStreamAtIndexOutOfBoundsEmpty (1770 of 2153) PASS: lldb-unit :: Utility/./UtilityTests/StringExtractorTest.GetU64LittleEndian (1771 of 2153) PASS: lldb-shell :: SymbolFile/DWARF/apple-index-is-used.cpp (1772 of 2153) UNSUPPORTED: lldb-api :: linux/sepdebugsymlink/TestTargetSymbolsSepDebugSymlink.py (1773 of 2153) PASS: lldb-unit :: Symbol/./SymbolTests/TestTypeSystemClang.TestGetEnumIntegerTypeUnexpectedType (1774 of 2153) PASS: lldb-api :: commands/expression/po_verbosity/TestPoVerbosity.py (1775 of 2153) PASS: lldb-unit :: ScriptInterpreter/Python/./ScriptInterpreterPythonTests/PythonDataObjectsTest.TestObjectAttributes (1776 of 2153) PASS: lldb-api :: functionalities/breakpoint/address_breakpoints/TestBadAddressBreakpoints.py (1777 of 2153) PASS: lldb-api :: macosx/queues/TestQueues.py (1778 of 2153) PASS: lldb-api :: tools/lldb-vscode/breakpoint/TestVSCode_setExceptionBreakpoints.py (1779 of 2153) PASS: lldb-unit :: Utility/./UtilityTests/UserIDResolver.GetUserName (1780 of 2153) PASS: lldb-shell :: SymbolFile/DWARF/find-function-regex.cpp (1781 of 2153) UNSUPPORTED: lldb-api :: functionalities/thread/multi_break/TestMultipleBreakpoints.py (1782 of 2153) PASS: lldb-shell :: SymbolFile/DWARF/module-ownership.mm (1783 of 2153) PASS: lldb-shell :: ScriptInterpreter/Python/python.test (1784 of 2153) PASS: lldb-shell :: SymbolFile/NativePDB/globals-bss.cpp (1785 of 2153) PASS: lldb-shell :: Settings/TestStopCommandSourceOnError.test (1786 of 2153) PASS: lldb-unit :: Utility/./UtilityTests/StringExtractorTest.GetHexBytesAvail_OddPair (1787 of 2153) PASS: lldb-unit :: Expression/./ExpressionTests/DiagnosticManagerTest.GetStringMultipleDiags (1788 of 2153) UNSUPPORTED: lldb-shell :: SymbolFile/PDB/func-symbols.test (1789 of 2153) PASS: lldb-unit :: DataFormatter/./LLDBFormatterTests/FormatManagerTests.CompatibleLangs (1790 of 2153) PASS: lldb-api :: functionalities/data-formatter/data-formatter-stl/libcxx/unordered/TestDataFormatterUnordered.py (1791 of 2153) PASS: lldb-unit :: UnwindAssembly/x86/./UnwindAssemblyx86Tests/Testx86AssemblyInspectionEngine.Test32bitFramelessSmallStackFrame (1792 of 2153) PASS: lldb-shell :: SymbolFile/DWARF/childless-compile-unit.s (1793 of 2153) PASS: lldb-unit :: Process/gdb-remote/./ProcessGdbRemoteTests/GDBRemoteClientBaseTest.SendContinueAndAsyncSignal (1794 of 2153) PASS: lldb-unit :: ObjectFile/Breakpad/./ObjectFileBreakpadTests/LineRecord.parse (1795 of 2153) PASS: lldb-shell :: ObjectFile/Breakpad/sections-trailing-func.test (1796 of 2153) PASS: lldb-shell :: Quit/TestQuitExitCodeNonInt.test (1797 of 2153) PASS: lldb-unit :: UnwindAssembly/x86/./UnwindAssemblyx86Tests/Testx86AssemblyInspectionEngine.TestSimple32bitFrameFunction (1798 of 2153) PASS: lldb-unit :: Utility/./UtilityTests/UriParserTest.BracketedHostnamePort (1799 of 2153) PASS: lldb-unit :: Utility/./UtilityTests/StringListTest.LongestCommonPrefixEmpty (1800 of 2153) PASS: lldb-shell :: SymbolFile/DWARF/static_scope.s (1801 of 2153) PASS: lldb-unit :: Target/./TargetTests/StackFrameRecognizerTest.NullModuleRegex (1802 of 2153) PASS: lldb-api :: commands/process/launch-with-shellexpand/TestLaunchWithShellExpand.py (1803 of 2153) UNSUPPORTED: lldb-api :: tools/lldb-server/registers-target-xml-reading/TestGdbRemoteTargetXmlPacket.py (1804 of 2153) PASS: lldb-unit :: DataFormatter/./LLDBFormatterTests/StringPrinterTests.CxxASCII (1805 of 2153) PASS: lldb-unit :: Utility/./UtilityTests/ArgsTest.TestUnknownEscape (1806 of 2153) PASS: lldb-api :: functionalities/breakpoint/inlined_breakpoints/TestInlinedBreakpoints.py (1807 of 2153) PASS: lldb-api :: commands/expression/import_base_class_when_class_has_derived_member/TestImportBaseClassWhenClassHasDerivedMember.py (1808 of 2153) PASS: lldb-api :: functionalities/thread/step_until/TestStepUntil.py (1809 of 2153) PASS: lldb-unit :: ObjectFile/Breakpad/./ObjectFileBreakpadTests/ModuleRecord.parse (1810 of 2153) PASS: lldb-unit :: Utility/./UtilityTests/UriParserTest.BadPort (1811 of 2153) PASS: lldb-api :: assert_messages_test/TestAssertMessages.py (1812 of 2153) PASS: lldb-api :: lang/objc/foundation/TestFoundationDisassembly.py (1813 of 2153) PASS: lldb-unit :: Utility/./UtilityTests/TimerTest.CategoryTimesNested (1814 of 2153) UNSUPPORTED: lldb-shell :: SymbolFile/PDB/compilands.test (1815 of 2153) PASS: lldb-api :: commands/platform/process/list/TestProcessList.py (1816 of 2153) PASS: lldb-shell :: Register/x86-64-read.test (1817 of 2153) PASS: lldb-unit :: Core/./LLDBCoreTests/RichManglingContextTest.SwitchProvider (1818 of 2153) PASS: lldb-unit :: Language/Highlighting/./HighlighterTests/HighlighterTest.ClangTrailingBackslashBeforeNewline (1819 of 2153) UNSUPPORTED: lldb-shell :: Register/x86-zmm-read.test (1820 of 2153) PASS: lldb-shell :: SymbolFile/NativePDB/nested-types.cpp (1821 of 2153) PASS: lldb-api :: functionalities/thread/backtrace_all/TestBacktraceAll.py (1822 of 2153) PASS: lldb-unit :: UnwindAssembly/x86/./UnwindAssemblyx86Tests/Testx86AssemblyInspectionEngine.TestSubRSP (1823 of 2153) UNSUPPORTED: lldb-api :: lang/cpp/printf/TestPrintf.py (1824 of 2153) PASS: lldb-shell :: Unwind/trap_frame_sym_ctx.test (1825 of 2153) PASS: lldb-shell :: Driver/TestPositionalArgs.test (1826 of 2153) PASS: lldb-unit :: Host/./HostTests/SocketTest.TCPListen0GetPort (1827 of 2153) PASS: lldb-api :: lang/cpp/multiple-inheritance/TestCppMultipleInheritance.py (1828 of 2153) PASS: lldb-shell :: ObjectFile/Breakpad/uuid-matching-mac.test (1829 of 2153) PASS: lldb-unit :: Utility/./UtilityTests/FileSpecTest.EqualDotsWindows (1830 of 2153) PASS: lldb-api :: functionalities/data-formatter/frameformat_smallstruct/TestFrameFormatSmallStruct.py (1831 of 2153) PASS: lldb-unit :: SymbolFile/NativePDB/./SymbolFileNativePDBTests/PDBFPOProgramToDWARFExpressionTests.UnresolvedCyclicRegisterAssignmentReference (1832 of 2153) PASS: lldb-api :: functionalities/inferior-crashing/recursive-inferior/TestRecursiveInferior.py (1833 of 2153) UNSUPPORTED: lldb-api :: tools/intel-features/intel-pt/test/TestIntelPTSimpleBinary.py (1834 of 2153) PASS: lldb-unit :: Utility/./UtilityTests/BinaryStreamTest.PutSLEB128OneByte (1835 of 2153) PASS: lldb-shell :: ObjectFile/PECOFF/dep-modules.yaml (1836 of 2153) PASS: lldb-unit :: DataFormatter/./LLDBFormatterTests/TypeMatcherTests.RegexName (1837 of 2153) PASS: lldb-api :: commands/expression/calculator_mode/TestCalculatorMode.py (1838 of 2153) PASS: lldb-unit :: SymbolFile/NativePDB/./SymbolFileNativePDBTests/PDBFPOProgramToDWARFExpressionTests.UnknownOp (1839 of 2153) PASS: lldb-api :: functionalities/data-formatter/data-formatter-proper-plurals/TestFormattersOneIsSingular.py (1840 of 2153) PASS: lldb-api :: commands/expression/xvalue/TestXValuePrinting.py (1841 of 2153) PASS: lldb-api :: commands/expression/ir-interpreter/TestIRInterpreter.py (1842 of 2153) PASS: lldb-api :: lang/cpp/operator-overload/TestOperatorOverload.py (1843 of 2153) PASS: lldb-shell :: SymbolFile/DWARF/DW_AT_const_value-bitfields.s (1844 of 2153) PASS: lldb-unit :: Utility/./UtilityTests/Flags.AllClear (1845 of 2153) PASS: lldb-unit :: UnwindAssembly/x86/./UnwindAssemblyx86Tests/Testx86AssemblyInspectionEngine.TestAddESP (1846 of 2153) PASS: lldb-api :: tools/lldb-server/TestGdbRemoteKill.py (1847 of 2153) PASS: lldb-api :: macosx/save_crashlog/TestSaveCrashlog.py (1848 of 2153) PASS: lldb-api :: functionalities/tail_call_frames/disambiguate_paths_to_common_sink/TestDisambiguatePathsToCommonSink.py (1849 of 2153) PASS: lldb-api :: commands/expression/invalid-args/TestInvalidArgsExpression.py (1850 of 2153) PASS: lldb-unit :: Utility/./UtilityTests/ScalarTest.GetBytes (1851 of 2153) PASS: lldb-unit :: Process/minidump/./LLDBMinidumpTests/MinidumpParserTest.GetThreadContext_x86_64 (1852 of 2153) PASS: lldb-unit :: ScriptInterpreter/Python/./ScriptInterpreterPythonTests/PythonDataObjectsTest.TestPythonDictionaryValueEquality (1853 of 2153) PASS: lldb-unit :: Utility/./UtilityTests/EventTest.DumpEventDataBytes (1854 of 2153) PASS: lldb-unit :: ScriptInterpreter/Python/./ScriptInterpreterPythonTests/PythonDataObjectsTest.TestPythonCallableInvoke (1855 of 2153) PASS: lldb-unit :: Utility/./UtilityTests/SubsystemRAIITest.SubsystemWithErrorFailure (1856 of 2153) PASS: lldb-unit :: Host/./HostTests/MainLoopTest.ReadObject (1857 of 2153) PASS: lldb-unit :: Utility/./UtilityTests/ScalarTest.ComparisonFloat (1858 of 2153) PASS: lldb-api :: lang/c/conflicting-symbol/TestConflictingSymbol.py (1859 of 2153) PASS: lldb-api :: commands/expression/class_template_specialization_empty_pack/TestClassTemplateSpecializationParametersHandling.py (1860 of 2153) PASS: lldb-api :: commands/expression/import-std-module/conflicts/TestStdModuleWithConflicts.py (1861 of 2153) PASS: lldb-unit :: Utility/./UtilityTests/RangeDataVector.FindEntryThatContains_Overlap (1862 of 2153) UNSUPPORTED: lldb-api :: functionalities/thread/state/TestThreadStates.py (1863 of 2153) PASS: lldb-api :: commands/watchpoints/multiple_threads/TestWatchpointMultipleThreads.py (1864 of 2153) PASS: lldb-shell :: Unwind/thread-step-out-ret-addr-check.test (1865 of 2153) PASS: lldb-unit :: Expression/./ExpressionTests/DiagnosticManagerTest.HasFixits (1866 of 2153) PASS: lldb-api :: functionalities/data-formatter/data-formatter-disabling/TestDataFormatterDisabling.py (1867 of 2153) PASS: lldb-api :: lang/objc/foundation/TestSymbolTable.py (1868 of 2153) PASS: lldb-api :: lang/cpp/wchar_t/TestCxxWCharT.py (1869 of 2153) PASS: lldb-unit :: ScriptInterpreter/Python/./ScriptInterpreterPythonTests/PythonDataObjectsTest.TestPythonString (1870 of 2153) PASS: lldb-api :: commands/process/launch/TestProcessLaunch.py (1871 of 2153) PASS: lldb-unit :: Core/./LLDBCoreTests/ModuleSpecTest.TestELFFile (1872 of 2153) PASS: lldb-api :: lang/cpp/accelerator-table/TestCPPAccelerator.py (1873 of 2153) PASS: lldb-api :: functionalities/gdb_remote_client/TestGDBRemoteDiskFileCompletion.py (1874 of 2153) PASS: lldb-unit :: Utility/./UtilityTests/RangeTest.ContainsAddr (1875 of 2153) PASS: lldb-shell :: Reproducer/TestSynchronous.test (1876 of 2153) PASS: lldb-api :: functionalities/thread/concurrent_events/TestConcurrentSignalWatchBreak.py (1877 of 2153) PASS: lldb-api :: functionalities/type_completion/TestTypeCompletion.py (1878 of 2153) PASS: lldb-unit :: Host/./HostTests/SocketAddressTest.GetAddressInfo (1879 of 2153) PASS: lldb-api :: functionalities/thread/concurrent_events/TestConcurrentDelaySignalWatch.py (1880 of 2153) UNSUPPORTED: lldb-shell :: SymbolFile/PDB/variables.test (1881 of 2153) PASS: lldb-unit :: Process/minidump/./LLDBMinidumpTests/MinidumpParserTest.GetPidWow64 (1882 of 2153) PASS: lldb-api :: python_api/lldbutil/TestSwigVersion.py (1883 of 2153) PASS: lldb-api :: commands/target/dump-symtab-demangle/TestDumpSymtabDemangle.py (1884 of 2153) PASS: lldb-unit :: Expression/./ExpressionTests/ClangExpressionDeclMapTest.TestUnknownIdentifierLookup (1885 of 2153) PASS: lldb-unit :: Expression/./ExpressionTests/DiagnosticManagerTest.GetStringNoDiags (1886 of 2153) PASS: lldb-unit :: Utility/./UtilityTests/CompletionRequest.FakeLastArg (1887 of 2153) PASS: lldb-unit :: UnwindAssembly/x86/./UnwindAssemblyx86Tests/Testx86AssemblyInspectionEngine.TestStackRealign8BitDisp_i386 (1888 of 2153) PASS: lldb-shell :: Minidump/Windows/arm-fp-unwind.test (1889 of 2153) PASS: lldb-api :: lang/cpp/virtual-overload/TestVirtualOverload.py (1890 of 2153) PASS: lldb-unit :: Utility/./UtilityTests/StringListTest.JoinThree (1891 of 2153) PASS: lldb-unit :: Utility/./UtilityTests/Flags.Reset (1892 of 2153) PASS: lldb-api :: python_api/thread/TestThreadAPI.py (1893 of 2153) PASS: lldb-shell :: SymbolFile/NativePDB/ast-methods.cpp (1894 of 2153) PASS: lldb-api :: functionalities/ubsan/basic/TestUbsanBasic.py (1895 of 2153) PASS: lldb-api :: functionalities/gdb_remote_client/TestRecognizeBreakpoint.py (1896 of 2153) PASS: lldb-api :: commands/watchpoints/watchpoint_commands/condition/TestWatchpointConditionCmd.py (1897 of 2153) UNSUPPORTED: lldb-shell :: Unwind/eh-frame-augment-noop.test (1898 of 2153) PASS: lldb-api :: functionalities/data-formatter/type_summary_list_arg/TestTypeSummaryListArg.py (1899 of 2153) PASS: lldb-unit :: Host/./HostTests/FileSystemTest.EmptyTest (1900 of 2153) PASS: lldb-api :: lang/cpp/member-and-local-vars-with-same-name/TestMembersAndLocalsWithSameName.py (1901 of 2153) PASS: lldb-api :: functionalities/data-formatter/data-formatter-objc/nsindexpath/TestDataFormatterNSIndexPath.py (1902 of 2153) PASS: lldb-api :: commands/expression/import-std-module/deque-dbg-info-content/TestDbgInfoContentDequeFromStdModule.py (1903 of 2153) PASS: lldb-unit :: Host/./HostTests/SocketTest.UDPConnect (1904 of 2153) PASS: lldb-unit :: ScriptInterpreter/Python/./ScriptInterpreterPythonTests/PythonDataObjectsTest.TestModuleNameResolutionNoDot (1905 of 2153) UNSUPPORTED: lldb-api :: benchmarks/stepping/TestSteppingSpeed.py (1906 of 2153) PASS: lldb-unit :: Utility/./UtilityTests/FileSpecTest.Equal (1907 of 2153) PASS: lldb-unit :: Utility/./UtilityTests/Predicate.WaitForValueEqualTo (1908 of 2153) PASS: lldb-unit :: Utility/./UtilityTests/UriParserTest.Empty (1909 of 2153) PASS: lldb-unit :: ObjectFile/Breakpad/./ObjectFileBreakpadTests/FileRecord.parse (1910 of 2153) PASS: lldb-api :: lang/objc/single-entry-dictionary/TestObjCSingleEntryDictionary.py (1911 of 2153) PASS: lldb-shell :: ObjectFile/ELF/many-sections.s (1912 of 2153) PASS: lldb-api :: lang/objc/objc-foundation-dictionary-empty/TestNSDictionary0.py (1913 of 2153) PASS: lldb-unit :: Symbol/./SymbolTests/TestTypeSystemClang.TestGetTypeClassTypeOf (1914 of 2153) PASS: lldb-shell :: ObjectFile/Breakpad/sections.test (1915 of 2153) PASS: lldb-unit :: Utility/./UtilityTests/RangeTest.ContainsRangeStartingFromZero (1916 of 2153) UNSUPPORTED: lldb-api :: commands/register/register/intel_xtended_registers/TestMPXRegisters.py (1917 of 2153) PASS: lldb-unit :: Utility/./UtilityTests/StringExtractorTest.GetHexBytes_FullString (1918 of 2153) UNSUPPORTED: lldb-shell :: SymbolFile/DWARF/split-dwarf-expression-eval-bug.cpp (1919 of 2153) PASS: lldb-unit :: Process/minidump/./LLDBMinidumpTests/MinidumpParserTest.GetMemoryRegionInfoLinuxMaps (1920 of 2153) PASS: lldb-unit :: Language/Highlighting/./HighlighterTests/HighlighterTest.Keywords (1921 of 2153) PASS: lldb-unit :: Utility/./UtilityTests/ProcessInstanceInfoMatch.Name (1922 of 2153) PASS: lldb-unit :: Utility/./UtilityTests/PassiveReplayTest.InstrumentedFoo (1923 of 2153) PASS: lldb-unit :: Language/Highlighting/./HighlighterTests/HighlighterTest.ClangUnterminatedString (1924 of 2153) PASS: lldb-api :: commands/frame/var/TestFrameVar.py (1925 of 2153) PASS: lldb-shell :: ScriptInterpreter/None/import_module.test (1926 of 2153) PASS: lldb-unit :: SymbolFile/DWARF/./SymbolFileDWARFTests/SymbolFileDWARFTests.TestAbilitiesForDWARF (1927 of 2153) PASS: lldb-unit :: Host/./HostTests/SocketTest.DecodeHostAndPort (1928 of 2153) UNSUPPORTED: lldb-api :: tools/lldb-vscode/disconnect/TestVSCode_disconnect.py (1929 of 2153) PASS: lldb-unit :: Utility/./UtilityTests/ArgsTest.Yaml (1930 of 2153) PASS: lldb-unit :: debugserver/./debugserverTests/JSON.Parse (1931 of 2153) PASS: lldb-unit :: UnwindAssembly/x86/./UnwindAssemblyx86Tests/Testx86AssemblyInspectionEngine.TestPushESI (1932 of 2153) PASS: lldb-api :: functionalities/thread_plan/TestThreadPlanCommands.py (1933 of 2153) PASS: lldb-api :: python_api/function_symbol/TestDisasmAPI.py (1934 of 2153) PASS: lldb-api :: functionalities/ptr_refs/TestPtrRefs.py (1935 of 2153) PASS: lldb-unit :: Utility/./UtilityTests/StringLexerTest.NextIfList (1936 of 2153) PASS: lldb-api :: python_api/frame/inlines/TestInlinedFrame.py (1937 of 2153) PASS: lldb-unit :: Utility/./UtilityTests/DataExtractorTest.GetMaxU64 (1938 of 2153) PASS: lldb-unit :: Utility/./UtilityTests/StringExtractorTest.GetHexU8_Underflow (1939 of 2153) PASS: lldb-unit :: Expression/./ExpressionTests/CppModuleConfigurationTest.MissingUsrInclude (1940 of 2153) PASS: lldb-unit :: Editline/./EditlineTests/EditlineTestFixture.EditlineReceivesSingleLineText (1941 of 2153) PASS: lldb-unit :: Utility/./UtilityTests/StringExtractorTest.GetNameColonValueContainsColon (1942 of 2153) PASS: lldb-api :: python_api/watchpoint/TestSetWatchpoint.py (1943 of 2153) PASS: lldb-unit :: Process/minidump/./LLDBMinidumpTests/MinidumpParserTest.InvalidMinidump (1944 of 2153) PASS: lldb-shell :: SymbolFile/DWARF/DW_TAG_variable-DW_AT_const_value.s (1945 of 2153) PASS: lldb-api :: functionalities/inferior-crashing/recursive-inferior/TestRecursiveInferiorStep.py (1946 of 2153) PASS: lldb-unit :: Utility/./UtilityTests/StringListTest.Join (1947 of 2153) UNSUPPORTED: lldb-shell :: Breakpoint/case-insensitive.test (1948 of 2153) UNSUPPORTED: lldb-shell :: SymbolFile/PDB/vbases.test (1949 of 2153) PASS: lldb-unit :: Utility/./UtilityTests/OptionsWithRawTest.EmptySuffixSingleWhitespace (1950 of 2153) PASS: lldb-shell :: SymbolFile/dissassemble-entry-point.s (1951 of 2153) PASS: lldb-api :: functionalities/postmortem/elf-core/TestLinuxCore.py (1952 of 2153) PASS: lldb-api :: python_api/sbenvironment/TestSBEnvironment.py (1953 of 2153) PASS: lldb-unit :: Utility/./UtilityTests/DataExtractorTest.GetFloatUnaligned (1954 of 2153) PASS: lldb-api :: commands/expression/import-std-module/vector-of-vectors/TestVectorOfVectorsFromStdModule.py (1955 of 2153) PASS: lldb-unit :: UnwindAssembly/x86/./UnwindAssemblyx86Tests/Testx86AssemblyInspectionEngine.TestDisassemblyJunkBytes (1956 of 2153) PASS: lldb-api :: functionalities/data-formatter/data-formatter-stl/libcxx/initializerlist/TestInitializerList.py (1957 of 2153) PASS: lldb-unit :: UnwindAssembly/x86/./UnwindAssemblyx86Tests/Testx86AssemblyInspectionEngine.TestPopEBX (1958 of 2153) PASS: lldb-unit :: Language/Highlighting/./HighlighterTests/HighlighterTest.ClangEmptyInput (1959 of 2153) PASS: lldb-api :: functionalities/thread/concurrent_events/TestConcurrentSignalWatch.py (1960 of 2153) PASS: lldb-unit :: Utility/./UtilityTests/OptionsWithRawTest.EmptyInput (1961 of 2153) PASS: lldb-unit :: UnwindAssembly/x86/./UnwindAssemblyx86Tests/Testx86AssemblyInspectionEngine.TestMovRSPtoRBP (1962 of 2153) PASS: lldb-unit :: SymbolFile/NativePDB/./SymbolFileNativePDBTests/PDBFPOProgramToDWARFExpressionTests.UnresolvedRegisterAssignmentReference (1963 of 2153) PASS: lldb-api :: lang/cpp/const_this/TestConstThis.py (1964 of 2153) PASS: lldb-unit :: Utility/./UtilityTests/FileSpecTest.IsRelative (1965 of 2153) UNSUPPORTED: lldb-shell :: ScriptInterpreter/Lua/quit.test (1966 of 2153) UNSUPPORTED: lldb-api :: lang/cpp/static_members/TestCPPStaticMembers.py (1967 of 2153) PASS: lldb-api :: functionalities/thread/concurrent_events/TestConcurrentManyCrash.py (1968 of 2153) PASS: lldb-api :: commands/expression/issue_11588/Test11588.py (1969 of 2153) PASS: lldb-shell :: SymbolFile/DWARF/debug_aranges-empty-section.s (1970 of 2153) PASS: lldb-api :: functionalities/thread/concurrent_events/TestConcurrentSignalDelayWatch.py (1971 of 2153) PASS: lldb-unit :: UnwindAssembly/x86/./UnwindAssemblyx86Tests/Testx86AssemblyInspectionEngine.TestPushEBP (1972 of 2153) PASS: lldb-shell :: Quit/TestQuitExitCode0.test (1973 of 2153) PASS: lldb-unit :: Platform/./LLDBPlatformTests/PlatformDarwinTest.FindComponentInPath (1974 of 2153) PASS: lldb-unit :: Utility/./UtilityTests/ArgsTest.BareSingleQuote (1975 of 2153) PASS: lldb-api :: functionalities/gdb_remote_client/TestProcessConnect.py (1976 of 2153) PASS: lldb-unit :: Utility/./UtilityTests/ArchSpecTest.YAML (1977 of 2153) PASS: lldb-api :: functionalities/data-formatter/data-formatter-advanced/TestDataFormatterAdv.py (1978 of 2153) PASS: lldb-api :: lang/cpp/bool/TestCPPBool.py (1979 of 2153) PASS: lldb-api :: functionalities/plugins/command_plugin/TestPluginCommands.py (1980 of 2153) PASS: lldb-unit :: Symbol/./SymbolTests/TestTypeSystemClang.TestDisplayName (1981 of 2153) PASS: lldb-api :: python_api/watchpoint/condition/TestWatchpointConditionAPI.py (1982 of 2153) PASS: lldb-shell :: SymbolFile/DWARF/debug_ranges-missing-section.s (1983 of 2153) PASS: lldb-api :: commands/statistics/basic/TestStats.py (1984 of 2153) PASS: lldb-unit :: UnwindAssembly/x86/./UnwindAssemblyx86Tests/Testx86AssemblyInspectionEngine.Testi386IgnoredRegisters (1985 of 2153) UNSUPPORTED: lldb-api :: tools/lldb-vscode/completions/TestVSCode_completions.py (1986 of 2153) PASS: lldb-unit :: Utility/./UtilityTests/PassiveReplayTest.InstrumentedBar (1987 of 2153) PASS: lldb-api :: commands/disassemble/basic/TestFrameDisassemble.py (1988 of 2153) PASS: lldb-unit :: Utility/./UtilityTests/ConstStringTest.CompareConstString (1989 of 2153) PASS: lldb-unit :: UnwindAssembly/x86/./UnwindAssemblyx86Tests/Testx86AssemblyInspectionEngine.TestPushR14 (1990 of 2153) PASS: lldb-unit :: Symbol/./SymbolTests/PostfixExpression.ParseFPOProgram (1991 of 2153) PASS: lldb-api :: python_api/lldbutil/frame/TestFrameUtils.py (1992 of 2153) UNSUPPORTED: lldb-api :: functionalities/darwin_log/filter/exact_match/subsystem/TestDarwinLogFilterMatchSubsystem.py (1993 of 2153) PASS: lldb-unit :: Utility/./UtilityTests/ArgsTest.ReplaceArgumentAtIndexShort (1994 of 2153) PASS: lldb-api :: tools/lldb-server/register-reading/TestGdbRemoteGPacket.py (1995 of 2153) PASS: lldb-api :: python_api/watchpoint/watchlocation/TestTargetWatchAddress.py (1996 of 2153) PASS: lldb-unit :: Utility/./UtilityTests/StatusTest.ErrorConversion (1997 of 2153) PASS: lldb-unit :: Utility/./UtilityTests/StringListTest.DefaultConstructor (1998 of 2153) PASS: lldb-unit :: Utility/./UtilityTests/UriParserTest.BadPort2 (1999 of 2153) PASS: lldb-api :: functionalities/breakpoint/source_regexp/TestSourceRegexBreakpoints.py (2000 of 2153) PASS: lldb-unit :: Process/gdb-remote/./ProcessGdbRemoteTests/GDBRemoteCommunicationServerTest.SendErrorResponse_ErrorNumber (2001 of 2153) PASS: lldb-unit :: ScriptInterpreter/Python/./ScriptInterpreterPythonTests/PythonDataObjectsTest.TestPythonDictionaryManipulation (2002 of 2153) PASS: lldb-api :: lang/cpp/dynamic-value-same-basename/TestDynamicValueSameBase.py (2003 of 2153) PASS: lldb-api :: macosx/lc-note/firmware-corefile/TestFirmwareCorefiles.py (2004 of 2153) UNSUPPORTED: lldb-api :: benchmarks/startup/TestStartupDelays.py (2005 of 2153) PASS: lldb-unit :: Expression/./ExpressionTests/DWARFExpression.DW_OP_unknown (2006 of 2153) PASS: lldb-unit :: Host/./HostTests/File.GetWaitableHandleFileno (2007 of 2153) PASS: lldb-shell :: ObjectFile/wasm/basic.yaml (2008 of 2153) PASS: lldb-api :: functionalities/tail_call_frames/sbapi_support/TestTailCallFrameSBAPI.py (2009 of 2153) PASS: lldb-unit :: Core/./LLDBCoreTests/ModuleSpecTest.InvalidInMemoryBuffer (2010 of 2153) PASS: lldb-unit :: Utility/./UtilityTests/UriParserTest.BracketedHostnameWithColon (2011 of 2153) PASS: lldb-unit :: Utility/./UtilityTests/StringListTest.ForRangeEmpty (2012 of 2153) PASS: lldb-api :: functionalities/process_group/TestChangeProcessGroup.py (2013 of 2153) PASS: lldb-unit :: Utility/./UtilityTests/StreamTest.Indent (2014 of 2153) PASS: lldb-unit :: Language/Highlighting/./HighlighterTests/HighlighterTest.ClangBraces (2015 of 2153) PASS: lldb-api :: functionalities/data-formatter/language_category_updates/TestDataFormatterLanguageCategoryUpdates.py (2016 of 2153) PASS: lldb-unit :: Utility/./UtilityTests/UUIDTest.StringConverion (2017 of 2153) PASS: lldb-api :: functionalities/target-new-solib-notifications/TestModuleLoadedNotifys.py (2018 of 2153) PASS: lldb-api :: functionalities/gdb_remote_client/TestThreadSelectionBug.py (2019 of 2153) PASS: lldb-unit :: Utility/./UtilityTests/CompletionRequest.TryCompleteCurrentArgMode (2020 of 2153) PASS: lldb-shell :: ExecControl/StopHook/stop-hook.test (2021 of 2153) PASS: lldb-unit :: Symbol/./SymbolTests/TestClangASTImporter.ImportInvalidType (2022 of 2153) PASS: lldb-api :: commands/expression/timeout/TestCallWithTimeout.py (2023 of 2153) PASS: lldb-api :: lang/cpp/std-function-step-into-callable/TestStdFunctionStepIntoCallable.py (2024 of 2153) PASS: lldb-api :: lang/cpp/stl/TestStdCXXDisassembly.py (2025 of 2153) PASS: lldb-unit :: Utility/./UtilityTests/ProcessInfoTest.Constructor (2026 of 2153) PASS: lldb-unit :: Utility/./UtilityTests/StringExtractorTest.GetHexBytesAvail_Partial (2027 of 2153) PASS: lldb-unit :: Utility/./UtilityTests/RegularExpression.CopyAssignment (2028 of 2153) PASS: lldb-unit :: Utility/./UtilityTests/LogChannelEnabledTest.LogVerboseThread (2029 of 2153) PASS: lldb-api :: functionalities/abbreviation/TestCommonShortSpellings.py (2030 of 2153) PASS: lldb-shell :: SymbolFile/DWARF/dwarf5-debug_line.s (2031 of 2153) PASS: lldb-api :: macosx/find-app-in-bundle/TestFindAppInBundle.py (2032 of 2153) PASS: lldb-unit :: Expression/./ExpressionTests/DiagnosticManagerTest.AppendMessageAttachToLastDiag (2033 of 2153) PASS: lldb-unit :: SymbolFile/DWARF/./SymbolFileDWARFTests/SymbolFileDWARFTests.TestAbbrevOutOfOrder (2034 of 2153) PASS: lldb-api :: lang/objc/objc-ivar-offsets/TestObjCIvarOffsets.py (2035 of 2153) PASS: lldb-unit :: Utility/./UtilityTests/SerializationRountripTest.SerializeDeserializeCStringArrayNullptrElem (2036 of 2153) PASS: lldb-api :: functionalities/thread/concurrent_events/TestConcurrentCrashWithSignal.py (2037 of 2153) PASS: lldb-api :: lang/c/offsetof/TestOffsetof.py (2038 of 2153) PASS: lldb-shell :: Reproducer/TestHomeDir.test (2039 of 2153) PASS: lldb-api :: python_api/breakpoint/TestBreakpointAPI.py (2040 of 2153) PASS: lldb-shell :: Driver/TestRepl.test (2041 of 2153) PASS: lldb-api :: python_api/interpreter/TestCommandInterpreterAPI.py (2042 of 2153) PASS: lldb-shell :: Driver/LocalLLDBInit.test (2043 of 2153) PASS: lldb-api :: lang/cpp/nsimport/TestCppNsImport.py (2044 of 2153) PASS: lldb-unit :: ObjectFile/ELF/./ObjectFileELFTests/ObjectFileELFTest.SectionsResolveConsistently (2045 of 2153) PASS: lldb-api :: lang/objc/blocks/TestObjCIvarsInBlocks.py (2046 of 2153) PASS: lldb-unit :: Expression/./ExpressionTests/DiagnosticManagerTest.AddDiagnostic (2047 of 2153) PASS: lldb-unit :: Utility/./UtilityTests/StreamTest.AddressSize (2048 of 2153) PASS: lldb-api :: lang/objc/foundation/TestObjCMethods2.py (2049 of 2153) PASS: lldb-api :: commands/settings/TestSettings.py (2050 of 2153) PASS: lldb-api :: functionalities/breakpoint/breakpoint_hit_count/TestBreakpointHitCount.py (2051 of 2153) PASS: lldb-unit :: Utility/./UtilityTests/LogChannelTest.Disable (2052 of 2153) PASS: lldb-api :: functionalities/thread/concurrent_events/TestConcurrentCrashWithWatchpoint.py (2053 of 2153) PASS: lldb-unit :: Expression/./ExpressionTests/ClangExpressionDeclMapTest.TestPersistentDeclLookup (2054 of 2153) PASS: lldb-unit :: Utility/./UtilityTests/StringExtractorTest.GetHexBytesAvail_Underflow (2055 of 2153) PASS: lldb-api :: functionalities/data-formatter/ptr_ref_typedef/TestPtrRef2Typedef.py (2056 of 2153) PASS: lldb-api :: python_api/target/TestTargetAPI.py (2057 of 2153) PASS: lldb-unit :: SymbolFile/NativePDB/./SymbolFileNativePDBTests/PDBFPOProgramToDWARFExpressionTests.MultipleDependentAssignments (2058 of 2153) PASS: lldb-api :: lang/cpp/class_types/TestClassTypesDisassembly.py (2059 of 2153) PASS: lldb-unit :: Symbol/./SymbolTests/TestClangASTImporter.MetadataPropagationIndirectImport (2060 of 2153) PASS: lldb-shell :: Driver/TestNoUseColor.test (2061 of 2153) PASS: lldb-api :: functionalities/data-formatter/data-formatter-skip-summary/TestDataFormatterSkipSummary.py (2062 of 2153) PASS: lldb-unit :: Symbol/./SymbolTests/Type.CompilerContextPattern (2063 of 2153) PASS: lldb-api :: commands/expression/static-initializers/TestStaticInitializers.py (2064 of 2153) PASS: lldb-shell :: ObjectFile/ELF/PT_LOAD-empty.yaml (2065 of 2153) PASS: lldb-api :: lang/cpp/alignas_base_class/TestAlignAsBaseClass.py (2066 of 2153) PASS: lldb-unit :: Utility/./UtilityTests/ArgsTest.DoubleQuotedItem (2067 of 2153) PASS: lldb-api :: tools/lldb-vscode/module/TestVSCode_module.py (2068 of 2153) PASS: lldb-shell :: SymbolFile/DWARF/debug-types-dwo-cross-reference.cpp (2069 of 2153) PASS: lldb-unit :: ObjectFile/PECOFF/./ObjectFilePECOFFTests/PECallFrameInfoTest.Frame_reg_eh (2070 of 2153) PASS: lldb-unit :: SymbolFile/NativePDB/./SymbolFileNativePDBTests/PDBFPOProgramToDWARFExpressionTests.MissingTargetRegister (2071 of 2153) PASS: lldb-unit :: Utility/./UtilityTests/StringListTest.InsertStringAtIndexStart (2072 of 2153) PASS: lldb-api :: lang/c/find_struct_type/TestFindStructTypes.py (2073 of 2153) PASS: lldb-unit :: Utility/./UtilityTests/StreamTest.AddressEmptyPrefix (2074 of 2153) PASS: lldb-unit :: Utility/./UtilityTests/DataExtractorTest.GetCStrEmpty (2075 of 2153) PASS: lldb-unit :: Utility/./UtilityTests/StreamTest.PutHex32ByteOrderBig (2076 of 2153) PASS: lldb-api :: lang/cpp/unicode-literals/TestUnicodeLiterals.py (2077 of 2153) PASS: lldb-unit :: Utility/./UtilityTests/RangeTest.ContainsEndInclusiveInvalid (2078 of 2153) UNSUPPORTED: lldb-api :: tools/lldb-server/TestGdbRemoteModuleInfo.py (2079 of 2153) PASS: lldb-unit :: Utility/./UtilityTests/OptionsWithRawTest.TerminatedQuote (2080 of 2153) PASS: lldb-unit :: DataFormatter/./LLDBFormatterTests/TypeMatcherTests.ExactName (2081 of 2153) PASS: lldb-unit :: Utility/./UtilityTests/RecordReplayTest.InstrumentedBar (2082 of 2153) PASS: lldb-unit :: Utility/./UtilityTests/ScalarTest.Scalar_512 (2083 of 2153) PASS: lldb-unit :: Core/./LLDBCoreTests/MangledTest.NameIndexes_FindFunctionSymbols (2084 of 2153) PASS: lldb-unit :: Language/CPlusPlus/./LanguageCPlusPlusTests/CPlusPlusLanguage.FindAlternateFunctionManglings (2085 of 2153) PASS: lldb-api :: functionalities/gdb_remote_client/TestPlatformClient.py (2086 of 2153) PASS: lldb-shell :: Quit/TestQuitExitCodeHexA.test (2087 of 2153) PASS: lldb-unit :: ScriptInterpreter/Python/./ScriptInterpreterPythonTests/PythonDataObjectsTest.TestPythonListManipulation (2088 of 2153) PASS: lldb-unit :: Utility/./UtilityTests/StreamTeeTest.CopyConstructor (2089 of 2153) PASS: lldb-unit :: Utility/./UtilityTests/NameMatchesTest.StartsWith (2090 of 2153) PASS: lldb-shell :: Quit/TestQuitExitCode-30.test (2091 of 2153) PASS: lldb-api :: commands/expression/persist_objc_pointeetype/TestPersistObjCPointeeType.py (2092 of 2153) PASS: lldb-api :: tools/lldb-vscode/variables/TestVSCode_variables.py (2093 of 2153) PASS: lldb-api :: commands/session/save/TestSessionSave.py (2094 of 2153) UNSUPPORTED: lldb-shell :: SymbolFile/PDB/variables-locations.test (2095 of 2153) PASS: lldb-api :: commands/log/invalid-args/TestInvalidArgsLog.py (2096 of 2153) PASS: lldb-api :: functionalities/thread/concurrent_events/TestConcurrentNWatchNBreak.py (2097 of 2153) PASS: lldb-api :: commands/expression/cast_int_to_anonymous_enum/TestCastIntToAnonymousEnum.py (2098 of 2153) PASS: lldb-api :: tools/lldb-vscode/launch/TestVSCode_launch.py (2099 of 2153) PASS: lldb-shell :: ScriptInterpreter/Python/crashlog.test (2100 of 2153) PASS: lldb-api :: commands/watchpoints/watchpoint_commands/command/TestWatchpointCommandLLDB.py (2101 of 2153) PASS: lldb-api :: functionalities/thread/ignore_suspended/TestIgnoreSuspendedThread.py (2102 of 2153) PASS: lldb-api :: lang/objc/ptr_refs/TestPtrRefsObjC.py (2103 of 2153) PASS: lldb-shell :: Settings/TestFrameFormatColor.test (2104 of 2153) UNSUPPORTED: lldb-api :: functionalities/signal/handle-segv/TestHandleSegv.py (2105 of 2153) PASS: lldb-api :: lang/c/unions/TestUnionMembers.py (2106 of 2153) PASS: lldb-unit :: Utility/./UtilityTests/OptionsWithRawTest.SingleWordSuffix (2107 of 2153) PASS: lldb-api :: commands/watchpoints/watchpoint_events/TestWatchpointEvents.py (2108 of 2153) PASS: lldb-unit :: Utility/./UtilityTests/TimerTest.CategoryTimes (2109 of 2153) PASS: lldb-unit :: Utility/./UtilityTests/RangeTest.Equal (2110 of 2153) PASS: lldb-unit :: UnwindAssembly/PPC64/./PPC64InstEmulationTests/TestPPC64InstEmulation.TestMediumFunction (2111 of 2153) PASS: lldb-shell :: ObjectFile/wasm/unified-debug-sections.yaml (2112 of 2153) PASS: lldb-api :: commands/watchpoints/watchpoint_commands/TestWatchpointCommands.py (2113 of 2153) PASS: lldb-api :: python_api/file_handle/TestFileHandle.py (2114 of 2153) PASS: lldb-api :: lang/objc/conflicting-definition/TestConflictingDefinition.py (2115 of 2153) PASS: lldb-unit :: Utility/./UtilityTests/TimerTest.CategoryTimes2 (2116 of 2153) PASS: lldb-unit :: Utility/./UtilityTests/BinaryStreamTest.PutULEB128TwoBytes (2117 of 2153) PASS: lldb-unit :: debugserver/./debugserverTests/RNBSocket.AnyListen (2118 of 2153) PASS: lldb-unit :: UnwindAssembly/PPC64/./PPC64InstEmulationTests/TestPPC64InstEmulation.TestSimpleFunction (2119 of 2153) PASS: lldb-unit :: Utility/./UtilityTests/VMRange.Clear (2120 of 2153) PASS: lldb-unit :: Symbol/./SymbolTests/LineEntryTest.GetSameLineContiguousAddressRangeOneInline (2121 of 2153) PASS: lldb-api :: lang/objc/objc-ivar-stripped/TestObjCIvarStripped.py (2122 of 2153) UNSUPPORTED: lldb-shell :: ScriptInterpreter/Lua/convenience_variables.test (2123 of 2153) PASS: lldb-unit :: Expression/./ExpressionTests/DiagnosticManagerTest.GetStringPreserveOrder (2124 of 2153) PASS: lldb-shell :: Reproducer/TestRelativePath.test (2125 of 2153) PASS: lldb-api :: api/log/TestAPILog.py (2126 of 2153) PASS: lldb-unit :: Utility/./UtilityTests/RecordReplayTest.InstrumentedFooSameThis (2127 of 2153) PASS: lldb-unit :: SymbolFile/DWARF/./SymbolFileDWARFTests/SymbolFileDWARFTests.TestAbbrevNullAttrValidForm (2128 of 2153) PASS: lldb-api :: commands/disassemble/basic/TestDisassembleBreakpoint.py (2129 of 2153) PASS: lldb-unit :: Utility/./UtilityTests/StringListTest.AppendStringStdString (2130 of 2153) PASS: lldb-api :: macosx/dyld-trie-symbols/TestDyldTrieSymbols.py (2131 of 2153) PASS: lldb-unit :: Utility/./UtilityTests/OptionsWithRawTest.QuotedSuffix (2132 of 2153) PASS: lldb-api :: commands/command/nested_alias/TestNestedAlias.py (2133 of 2153) PASS: lldb-shell :: SymbolFile/NativePDB/disassembly.cpp (2134 of 2153) UNSUPPORTED: lldb-api :: commands/watchpoints/variable_out_of_scope/TestWatchedVarHitWhenInScope.py (2135 of 2153) PASS: lldb-api :: lang/objc/rdar-10967107/TestRdar10967107.py (2136 of 2153) PASS: lldb-unit :: Symbol/./SymbolTests/SymbolsTest.LocateExecutableSymbolFileForUnknownExecutableAndMissingSymbolFile (2137 of 2153) PASS: lldb-api :: commands/frame/recognizer/TestFrameRecognizer.py (2138 of 2153) PASS: lldb-shell :: SymbolFile/DWARF/DW_AT_declaration-with-children.s (2139 of 2153) UNSUPPORTED: lldb-api :: functionalities/darwin_log/filter/regex/activity-chain/TestDarwinLogFilterRegexActivityChain.py (2140 of 2153) PASS: lldb-api :: functionalities/data-formatter/synthupdate/TestSyntheticFilterRecompute.py (2141 of 2153) PASS: lldb-unit :: Host/./HostTests/FileSystemTest.MakeAbsolute (2142 of 2153) PASS: lldb-shell :: Reproducer/Modules/TestModuleCXX.test (2143 of 2153) PASS: lldb-unit :: Process/gdb-remote/./ProcessGdbRemoteTests/GDBRemoteClientBaseTest.SendContinueAndInterrupt2PacketBug (2144 of 2153) PASS: lldb-unit :: Utility/./UtilityTests/StringExtractorTest.GetHexBytesAvail_FullString (2145 of 2153) PASS: lldb-shell :: SymbolFile/Breakpad/unwind-via-stack-win-no-memory-info.yaml (2146 of 2153) PASS: lldb-api :: types/TestLongTypesExpr.py (2147 of 2153) PASS: lldb-api :: types/TestShortType.py (2148 of 2153) PASS: lldb-unit :: Utility/./UtilityTests/ProcessInstanceInfo.Yaml (2149 of 2153) PASS: lldb-api :: python_api/symbol-context/TestSymbolContext.py (2150 of 2153) PASS: lldb-shell :: SymbolFile/NativePDB/function-types-calling-conv.cpp (2151 of 2153) PASS: lldb-api :: lang/objc/objc-new-syntax/TestObjCNewSyntaxArray.py (2152 of 2153) PASS: lldb-api :: lang/objc/foundation/TestObjCMethods.py (2153 of 2153) Slowest Tests: -------------------------------------------------------------------------- 600.88s: lldb-api :: macosx/simulator/TestSimulatorPlatform.py 270.59s: lldb-api :: lang/objc/objc-new-syntax/TestObjCNewSyntaxLiteral.py 161.69s: lldb-api :: functionalities/postmortem/mach-core/TestMachCore.py 124.24s: lldb-api :: functionalities/data-formatter/user-format-vs-summary/TestUserFormatVsSummary.py 112.35s: lldb-api :: tools/lldb-server/TestLldbGdbServer.py 107.72s: lldb-api :: functionalities/gdb_remote_client/TestGDBRemoteClient.py 106.56s: lldb-api :: functionalities/gdb_remote_client/TestRestartBug.py 103.71s: lldb-api :: commands/expression/persistent_types/TestPersistentTypes.py 101.11s: lldb-api :: functionalities/gdb_remote_client/TestGDBRemoteLoad.py 99.54s: lldb-api :: commands/expression/radar_9673664/TestExprHelpExamples.py 82.64s: lldb-shell :: SymbolFile/NativePDB/locate-pdb.cpp 79.54s: lldb-api :: functionalities/data-formatter/data-formatter-script/TestDataFormatterScript.py 79.45s: lldb-api :: tools/lldb-vscode/breakpoint/TestVSCode_setFunctionBreakpoints.py 77.78s: lldb-api :: functionalities/data-formatter/compactvectors/TestCompactVectors.py 77.58s: lldb-api :: functionalities/data-formatter/data-formatter-objc/TestDataFormatterObjCNSError.py 75.62s: lldb-api :: lang/objc/exceptions/TestObjCExceptions.py 72.32s: lldb-api :: macosx/nslog/TestDarwinNSLogOutput.py 70.69s: lldb-api :: tools/lldb-server/TestAppleSimulatorOSType.py 67.15s: lldb-api :: commands/expression/namespace_local_var_same_name_obj_c/TestNamespaceLocalVarSameNameObjC.py 66.59s: lldb-api :: functionalities/inline-stepping/TestInlineStepping.py

Hide Details

Tests Times: -------------------------------------------------------------------------- [ Range ] :: [ Percentage ] :: [ Count ] -------------------------------------------------------------------------- [600s,650s) :: [ ] :: [ 1/2153] [550s,600s) :: [ ] :: [ 0/2153] [500s,550s) :: [ ] :: [ 0/2153] [450s,500s) :: [ ] :: [ 0/2153] [400s,450s) :: [ ] :: [ 0/2153] [350s,400s) :: [ ] :: [ 0/2153] [300s,350s) :: [ ] :: [ 0/2153] [250s,300s) :: [ ] :: [ 1/2153] [200s,250s) :: [ ] :: [ 0/2153] [150s,200s) :: [ ] :: [ 1/2153] [100s,150s) :: [ ] :: [ 7/2153] [ 50s,100s) :: [ ] :: [ 30/2153] [ 0s, 50s) :: [*************************************** ] :: [2113/2153] -------------------------------------------------------------------------- ******************** Timed Out Tests (1): lldb-api :: macosx/simulator/TestSimulatorPlatform.py

Hide Details

******************** Failed Tests (4): lldb-api :: functionalities/gdb_remote_client/TestGDBRemoteLoad.py lldb-api :: commands/target/stop-hooks/TestStopHookScripted.py lldb-api :: functionalities/gdb_remote_client/TestGDBRemoteClient.py lldb-api :: commands/gui/breakpoints/TestGuiBreakpoints.py

Hide Details

Hide Details

Testing Time: 2790.01s Unsupported : 153 Passed : 1989 Expectedly Failed: 6 Timed Out : 1 Failed : 4 FAILED: tools/lldb/test/CMakeFiles/check-lldb-lit cd /Users/buildslave/jenkins/workspace/lldb-cmake/lldb-build/tools/lldb/test && /usr/local/Frameworks/Python.framework/Versions/3.7/bin/python3.7 /Users/buildslave/jenkins/workspace/lldb-cmake/lldb-build/./bin/llvm-lit -v --time-tests --shuffle --xunit-xml-output=/Users/buildslave/jenkins/workspace/lldb-cmake/test/results.xml -v -j 4 /Users/buildslave/jenkins/workspace/lldb-cmake/lldb-build/tools/lldb/test ninja: build stopped: subcommand failed. Command failed: Command '['/usr/bin/env', 'TERM=vt100', '/usr/local/bin/ninja', '-v', 'check-lldb']' returned non-zero exit status 1 Command: ['/usr/bin/env', 'TERM=vt100', '/usr/local/bin/ninja', '-v', 'check-lldb'] [Pipeline] } [Pipeline] // timeout [Pipeline] } [Pipeline] // stage [Pipeline] stage [Pipeline] { (Declarative: Post Actions) [Pipeline] scanForIssues [Clang (LLVM based)] Sleeping for 5 seconds due to JENKINS-32191... [Clang (LLVM based)] Parsing console log (workspace: '/Users/buildslave/jenkins/workspace/lldb-cmake') [Clang (LLVM based)] Successfully parsed console log [Clang (LLVM based)] -> found 8 issues (skipped 12 duplicates) [Clang (LLVM based)] Post processing issues on 'green-dragon-10' with source code encoding 'UTF-8' [Clang (LLVM based)] Creating SCM blamer to obtain author and commit information for affected files [Clang (LLVM based)] Creating SCM miner to obtain statistics for affected repository files [Clang (LLVM based)] Resolving file names for all issues in source directory '/Users/buildslave/jenkins/workspace/lldb-cmake' [Clang (LLVM based)] -> resolved paths in source directory (6 found, 0 not found) [Clang (LLVM based)] Resolving module names from module definitions (build.xml, pom.xml, or Manifest.mf files) [Clang (LLVM based)] -> resolved module names for 8 issues [Clang (LLVM based)] Resolving package names (or namespaces) by parsing the affected files [Clang (LLVM based)] -> resolved package names of 6 affected files [Clang (LLVM based)] No filter has been set, publishing all 8 issues [Clang (LLVM based)] Creating fingerprints for all affected code blocks to track issues over different builds [Clang (LLVM based)] -> created fingerprints for 8 issues (skipped 0 issues) [Clang (LLVM based)] Copying affected files to Jenkins' build folder '/Users/Shared/Jenkins/Home/jobs/lldb-cmake/builds/23979/files-with-issues' [Clang (LLVM based)] -> 4 copied, 2 not in workspace, 0 not-found, 0 with I/O error [Pipeline] junit Recording test results [Pipeline] } [Pipeline] // stage [Pipeline] } [Pipeline] // withEnv [Pipeline] } [Pipeline] // node [Pipeline] End of Pipeline ERROR: script returned exit code 1 Finished: FAILURE