FailedConsole Output

Skipping 9,097 KB.. Full Log
657 of 2153)
PASS: lldb-api :: macosx/universal/TestUniversal.py (658 of 2153)
UNSUPPORTED: lldb-api :: linux/thread/create_during_instruction_step/TestCreateDuringInstructionStep.py (659 of 2153)
PASS: lldb-api :: python_api/sbstructureddata/TestStructuredDataAPI.py (660 of 2153)
PASS: lldb-unit :: DataFormatter/./LLDBFormatterTests/TypeMatcherTests.RegexMatchPart (661 of 2153)
PASS: lldb-unit :: SymbolFile/NativePDB/./SymbolFileNativePDBTests/PDBFPOProgramToDWARFExpressionTests.MissingTargetRegister (662 of 2153)
PASS: lldb-unit :: DataFormatter/./LLDBFormatterTests/TypeMatcherTests.RegexName (663 of 2153)
PASS: lldb-unit :: Process/minidump/./LLDBMinidumpTests/MinidumpParserTest.MinidumpModuleOrder (664 of 2153)
PASS: lldb-api :: lang/cpp/nested-class-other-compilation-unit/TestNestedClassWithParentInAnotherCU.py (665 of 2153)
PASS: lldb-unit :: Core/./LLDBCoreTests/ModuleSpecTest.InvalidInMemoryBuffer (666 of 2153)
PASS: lldb-api :: lang/cpp/unicode-literals/TestUnicodeLiterals.py (667 of 2153)
PASS: lldb-api :: functionalities/thread/concurrent_events/TestConcurrentSignalBreak.py (668 of 2153)
PASS: lldb-api :: functionalities/tail_call_frames/cross_dso/TestCrossDSOTailCalls.py (669 of 2153)
PASS: lldb-unit :: Utility/./UtilityTests/DataExtractorTest.GetFloatUnaligned (670 of 2153)
PASS: lldb-unit :: UnwindAssembly/x86/./UnwindAssemblyx86Tests/Testx86AssemblyInspectionEngine.TestPushR14 (671 of 2153)
PASS: lldb-api :: functionalities/plugins/python_os_plugin/stepping_plugin_threads/TestOSPluginStepping.py (672 of 2153)
PASS: lldb-api :: lang/objc/objc-static-method-stripped/TestObjCStaticMethodStripped.py (673 of 2153)
PASS: lldb-unit :: Process/gdb-remote/./ProcessGdbRemoteTests/GDBRemoteCommunicationServerTest.SendErrorResponse_ErrorNumber (674 of 2153)
PASS: lldb-unit :: Symbol/./SymbolTests/TestClangASTImporter.CopyDeclTagDecl (675 of 2153)
PASS: lldb-unit :: Signals/./SignalsTests/UnixSignalsTest.GetInfo (676 of 2153)
PASS: lldb-shell :: ObjectFile/ELF/PT_LOAD.yaml (677 of 2153)
PASS: lldb-unit :: ScriptInterpreter/Python/./ScriptInterpreterPythonTests/PythonDataObjectsTest.TestPythonBoolean (678 of 2153)
PASS: lldb-api :: lang/cpp/covariant-return-types/TestCovariantReturnTypes.py (679 of 2153)
PASS: lldb-unit :: Utility/./UtilityTests/RangeTest.ContainsRangeStartingFromZero (680 of 2153)
PASS: lldb-api :: lang/cpp/diamond/TestDiamond.py (681 of 2153)
PASS: lldb-api :: commands/expression/import-std-module/queue/TestQueueFromStdModule.py (682 of 2153)
PASS: lldb-api :: functionalities/breakpoint/breakpoint_command/TestBreakpointCommand.py (683 of 2153)
PASS: lldb-unit :: ObjectFile/Breakpad/./ObjectFileBreakpadTests/Record.classify (684 of 2153)
UNSUPPORTED: lldb-api :: functionalities/thread/state/TestThreadStates.py (685 of 2153)
PASS: lldb-api :: functionalities/inferior-crashing/TestInferiorCrashingStep.py (686 of 2153)
PASS: lldb-unit :: Process/gdb-remote/./ProcessGdbRemoteTests/GDBRemoteCommunicationServerTest.SendErrorResponse_UnimplementedError (687 of 2153)
PASS: lldb-unit :: Utility/./UtilityTests/ScalarTest.TruncOrExtendTo (688 of 2153)
PASS: lldb-unit :: Utility/./UtilityTests/StreamTeeTest.Constructor1Stream (689 of 2153)
PASS: lldb-shell :: SymbolFile/DWARF/limit-debug-info.s (690 of 2153)
UNSUPPORTED: lldb-shell :: Register/x86-ymm-write.test (691 of 2153)
PASS: lldb-shell :: SymbolFile/DWARF/debug_loc_and_loclists.s (692 of 2153)
PASS: lldb-shell :: SymbolFile/DWARF/debug-types-dwarf5.s (693 of 2153)
PASS: lldb-unit :: Expression/./ExpressionTests/CppModuleConfigurationTest.Linux (694 of 2153)
PASS: lldb-unit :: Utility/./UtilityTests/RecordReplayTest.InstrumentedBarRef (695 of 2153)
PASS: lldb-unit :: Utility/./UtilityTests/FileSpecTest.PrependPathComponent (696 of 2153)
PASS: lldb-unit :: Process/minidump/./LLDBMinidumpTests/MinidumpParserTest.GetPidWindows (697 of 2153)
PASS: lldb-api :: commands/expression/import-std-module/unique_ptr/TestUniquePtrFromStdModule.py (698 of 2153)
PASS: lldb-unit :: Host/./HostTests/FileSystemTest.EnumerateDirectory (699 of 2153)
PASS: lldb-api :: functionalities/thread/concurrent_events/TestConcurrentWatchBreakDelay.py (700 of 2153)
PASS: lldb-unit :: ObjectFile/Breakpad/./ObjectFileBreakpadTests/ModuleRecord.parse (701 of 2153)
PASS: lldb-unit :: Process/gdb-remote/./ProcessGdbRemoteTests/GDBRemoteCommunicationClientTest.SyncThreadState (702 of 2153)
PASS: lldb-api :: functionalities/memory/cache/TestMemoryCache.py (703 of 2153)
PASS: lldb-unit :: Expression/./ExpressionTests/DiagnosticManagerTest.AppendMessageSubsequentDiags (704 of 2153)
PASS: lldb-api :: commands/watchpoints/hello_watchpoint/TestMyFirstWatchpoint.py (705 of 2153)
PASS: lldb-unit :: Expression/./ExpressionTests/CppModuleConfigurationTest.AmbiguousCLib (706 of 2153)
PASS: lldb-unit :: Utility/./UtilityTests/Flags.AllSet (707 of 2153)
PASS: lldb-unit :: Language/Highlighting/./HighlighterTests/HighlighterTest.ClangCursorPosAfterOtherToken (708 of 2153)
UNSUPPORTED: lldb-shell :: Watchpoint/netbsd-nouserdbregs.test (709 of 2153)
PASS: lldb-unit :: Utility/./UtilityTests/UriParserTest.BracketedHostname (710 of 2153)
PASS: lldb-unit :: ObjectFile/PECOFF/./ObjectFilePECOFFTests/PECallFrameInfoTest.Chained_eh (711 of 2153)
PASS: lldb-api :: python_api/hello_world/TestHelloWorld.py (712 of 2153)
PASS: lldb-api :: functionalities/tsan/cpp_global_location/TestTsanCPPGlobalLocation.py (713 of 2153)
PASS: lldb-api :: python_api/sbplatform/TestSBPlatform.py (714 of 2153)
PASS: lldb-shell :: SymbolFile/Breakpad/line-table-missing-file.test (715 of 2153)
PASS: lldb-unit :: UnwindAssembly/x86/./UnwindAssemblyx86Tests/Testx86AssemblyInspectionEngine.Test64bitFramelessBigStackFrame (716 of 2153)
PASS: lldb-api :: lang/objc/objc-struct-argument/TestObjCStructArgument.py (717 of 2153)
PASS: lldb-unit :: Utility/./UtilityTests/StreamTest.ShiftOperatorChars (718 of 2153)
UNSUPPORTED: lldb-api :: functionalities/longjmp/TestLongjmp.py (719 of 2153)
PASS: lldb-unit :: Utility/./UtilityTests/StringExtractorTest.GetHexBytes_OddPair (720 of 2153)
PASS: lldb-api :: commands/expression/entry-bp/TestExprEntryBP.py (721 of 2153)
PASS: lldb-unit :: Instruction/./EmulatorTests/TestAArch64Emulator.TestOverflow (722 of 2153)
PASS: lldb-unit :: Utility/./UtilityTests/StringListTest.AppendStringCString (723 of 2153)
PASS: lldb-shell :: Commands/command-regex-delete.test (724 of 2153)
PASS: lldb-unit :: Utility/./UtilityTests/PassiveReplayTest.InstrumentedBarPtr (725 of 2153)
UNSUPPORTED: lldb-api :: tools/intel-features/intel-pt/test/TestIntelPTSimpleBinary.py (726 of 2153)
PASS: lldb-unit :: Utility/./UtilityTests/StatusTest.Formatv (727 of 2153)
PASS: lldb-shell :: Reproducer/TestProcessList.test (728 of 2153)
PASS: lldb-unit :: Utility/./UtilityTests/ListenerTest.GetEventImmediate (729 of 2153)
PASS: lldb-unit :: Language/Highlighting/./HighlighterTests/HighlighterTest.ClangCursorPos (730 of 2153)
PASS: lldb-api :: commands/frame/diagnose/virtual-method-call/TestDiagnoseDereferenceVirtualMethodCall.py (731 of 2153)
PASS: lldb-shell :: ObjectFile/ELF/minidebuginfo-corrupt-xz.yaml (732 of 2153)
PASS: lldb-shell :: Breakpoint/debug_rnglistx_rlex.test (733 of 2153)
PASS: lldb-api :: commands/expression/import-std-module/forward_list/TestForwardListFromStdModule.py (734 of 2153)
PASS: lldb-unit :: ScriptInterpreter/Python/./ScriptInterpreterPythonTests/PythonDataObjectsTest.TestPythonCallableCheck (735 of 2153)
PASS: lldb-api :: functionalities/thread/concurrent_events/TestConcurrentCrashWithSignal.py (736 of 2153)
PASS: lldb-api :: functionalities/data-formatter/var-in-aggregate-misuse/TestVarInAggregateMisuse.py (737 of 2153)
PASS: lldb-unit :: Utility/./UtilityTests/CompletionRequest.FakeLastArg (738 of 2153)
PASS: lldb-unit :: Utility/./UtilityTests/ConstStringTest.NullAndEmptyStates (739 of 2153)
PASS: lldb-unit :: Utility/./UtilityTests/StringExtractorTest.GetHexU8_Extra_NoEof (740 of 2153)
PASS: lldb-api :: lang/cpp/const_this/TestConstThis.py (741 of 2153)
PASS: lldb-unit :: Symbol/./SymbolTests/TestClangASTImporter.CanImportInvalidType (742 of 2153)
PASS: lldb-api :: functionalities/breakpoint/move_nearest/TestMoveNearest.py (743 of 2153)
PASS: lldb-shell :: ObjectFile/MachO/lc_build_version_notools.yaml (744 of 2153)
PASS: lldb-api :: macosx/add-dsym/TestAddDsymMidExecutionCommand.py (745 of 2153)
PASS: lldb-unit :: SymbolFile/DWARF/./SymbolFileDWARFTests/SymbolFileDWARFTests.TestAbbrevInvalidNULLTag (746 of 2153)
PASS: lldb-shell :: SymbolFile/DWARF/dir-separator-no-comp-dir.s (747 of 2153)
PASS: lldb-unit :: Utility/./UtilityTests/RegularExpression.Match (748 of 2153)
PASS: lldb-unit :: Process/./ProcessEventDataTests/ProcessEventDataTest.ShouldStop (749 of 2153)
UNSUPPORTED: lldb-api :: benchmarks/stepping/TestSteppingSpeed.py (750 of 2153)
UNSUPPORTED: lldb-shell :: SymbolFile/PDB/func-symbols.test (751 of 2153)
PASS: lldb-shell :: ObjectFile/ELF/netbsd-exec-8.99.30-amd64.yaml (752 of 2153)
PASS: lldb-api :: lang/c/conflicting-symbol/TestConflictingSymbol.py (753 of 2153)
PASS: lldb-shell :: Reproducer/TestDriverOptions.test (754 of 2153)
PASS: lldb-unit :: Platform/Android/./AdbClientTests/AdbClientTest.CreateByDeviceId (755 of 2153)
PASS: lldb-api :: python_api/process/TestProcessAPI.py (756 of 2153)
PASS: lldb-unit :: Expression/./ExpressionTests/DiagnosticManagerTest.PutStringMultiple (757 of 2153)
UNSUPPORTED: lldb-api :: macosx/macCatalystAppMacOSFramework/TestMacCatalystAppWithMacOSFramework.py (758 of 2153)
PASS: lldb-api :: commands/expression/import-std-module/stack/TestStackFromStdModule.py (759 of 2153)
PASS: lldb-api :: commands/expression/import-std-module/vector-bool/TestVectorBoolFromStdModule.py (760 of 2153)
PASS: lldb-unit :: SymbolFile/DWARF/./SymbolFileDWARFTests/SymbolFileDWARFTests.ParseAranges (761 of 2153)
PASS: lldb-shell :: Driver/TestTarget.test (762 of 2153)
PASS: lldb-unit :: Utility/./UtilityTests/BinaryStreamTest.PutSLEB128FiveBytes (763 of 2153)
PASS: lldb-unit :: Utility/./UtilityTests/RangeDataVector.FindEntryIndexesThatContain_Overlap (764 of 2153)
PASS: lldb-unit :: ScriptInterpreter/Python/./ScriptInterpreterPythonTests/PythonDataObjectsTest.TestPythonIntegerToStructuredInteger (765 of 2153)
PASS: lldb-api :: python_api/watchpoint/watchlocation/TestSetWatchlocation.py (766 of 2153)
PASS: lldb-unit :: Target/./TargetTests/ModuleCacheTest.GetAndPut (767 of 2153)
PASS: lldb-api :: commands/expression/call-function/TestCallUserDefinedFunction.py (768 of 2153)
PASS: lldb-api :: functionalities/data-formatter/data-formatter-stl/libcxx/string/TestDataFormatterLibcxxString.py (769 of 2153)
PASS: lldb-unit :: Host/./HostTests/FileSystemTest.EmptyTest (770 of 2153)
PASS: lldb-shell :: ObjectFile/ELF/PT_LOAD-overlap-PT_INTERP.yaml (771 of 2153)
PASS: lldb-api :: python_api/disassemble-raw-data/TestDisassembleRawData.py (772 of 2153)
PASS: lldb-unit :: Process/minidump/./LLDBMinidumpTests/MinidumpParserTest.GetThreadContext_x86_32_wow64 (773 of 2153)
PASS: lldb-unit :: Symbol/./SymbolTests/TestTypeSystemClang.TestRecordHasFields (774 of 2153)
PASS: lldb-shell :: SymbolFile/symbol-binding.test (775 of 2153)
UNSUPPORTED: lldb-api :: functionalities/data-formatter/data-formatter-stl/libstdcpp/vector/TestDataFormatterStdVector.py (776 of 2153)
PASS: lldb-shell :: SymbolFile/DWARF/apple-index-is-used.cpp (777 of 2153)
PASS: lldb-unit :: Language/Highlighting/./HighlighterTests/HighlighterTest.ClangCursorPosBeforeOtherToken (778 of 2153)
PASS: lldb-shell :: Minidump/Windows/arm-fp-unwind.test (779 of 2153)
PASS: lldb-shell :: SymbolFile/DWARF/debug_line-relative_path.s (780 of 2153)
PASS: lldb-unit :: Utility/./UtilityTests/ReproducerTest.SetReplay (781 of 2153)
UNSUPPORTED: lldb-api :: benchmarks/libcxxmap/TestBenchmarkLibcxxMap.py (782 of 2153)
PASS: lldb-unit :: Utility/./UtilityTests/StreamTest.AddressSize (783 of 2153)
UNSUPPORTED: lldb-shell :: Register/arm-fp-read.test (784 of 2153)
PASS: lldb-shell :: SymbolFile/Breakpad/line-table.test (785 of 2153)
PASS: lldb-shell :: ObjectFile/ELF/PT_LOAD-overlap-PT_TLS.yaml (786 of 2153)
PASS: lldb-shell :: SymbolFile/DWARF/debug_loclists-dwo.s (787 of 2153)
PASS: lldb-unit :: Utility/./UtilityTests/AnsiTerminal.Empty (788 of 2153)
PASS: lldb-api :: python_api/sbvalue_persist/TestSBValuePersist.py (789 of 2153)
PASS: lldb-unit :: API/./APITests/SBCommandInterpreterTest.SingleWordCommand (790 of 2153)
PASS: lldb-api :: commands/settings/quoting/TestQuoting.py (791 of 2153)
PASS: lldb-api :: lang/cpp/dynamic-value/TestCppValueCast.py (792 of 2153)
PASS: lldb-unit :: Symbol/./SymbolTests/TestTypeSystemClang.TestIsClangType (793 of 2153)
PASS: lldb-shell :: ObjectFile/ELF/PT_TLS-overlap-PT_LOAD.yaml (794 of 2153)
PASS: lldb-api :: functionalities/data-formatter/data-formatter-objc/TestDataFormatterObjCPlain.py (795 of 2153)
PASS: lldb-api :: functionalities/data-formatter/data-formatter-objc/cmtime/TestDataFormatterCMTime.py (796 of 2153)
PASS: lldb-api :: functionalities/thread/ignore_suspended/TestIgnoreSuspendedThread.py (797 of 2153)
PASS: lldb-api :: functionalities/signal/raise/TestRaise.py (798 of 2153)
PASS: lldb-api :: python_api/module_section/TestModuleAndSection.py (799 of 2153)
PASS: lldb-api :: commands/expression/import-std-module/forward_list-dbg-info-content/TestDbgInfoContentForwardListFromStdModule.py (800 of 2153)
PASS: lldb-unit :: Utility/./UtilityTests/FileSpecTest.GuessPathStyle (801 of 2153)
PASS: lldb-api :: commands/expression/call-throws/TestCallThatThrows.py (802 of 2153)
PASS: lldb-unit :: Utility/./UtilityTests/UriParserTest.PortOverflow (803 of 2153)
PASS: lldb-unit :: Language/Highlighting/./HighlighterTests/HighlighterTest.Colons (804 of 2153)
PASS: lldb-api :: types/TestRecursiveTypes.py (805 of 2153)
PASS: lldb-api :: commands/expression/import-std-module/empty-module/TestEmptyStdModule.py (806 of 2153)
PASS: lldb-unit :: Utility/./UtilityTests/SerializationRountripTest.SerializeDeserializeCStringNull (807 of 2153)
PASS: lldb-unit :: Core/./LLDBCoreTests/RichManglingContextTest.SwitchProvider (808 of 2153)
PASS: lldb-api :: functionalities/history/TestHistoryRecall.py (809 of 2153)
PASS: lldb-unit :: Expression/./ExpressionTests/DiagnosticManagerTest.GetStringMultipleDiags (810 of 2153)
PASS: lldb-api :: functionalities/data-formatter/data-formatter-proper-plurals/TestFormattersOneIsSingular.py (811 of 2153)
UNSUPPORTED: lldb-shell :: SymbolFile/PDB/function-nested-block.test (812 of 2153)
PASS: lldb-shell :: BuildScript/modes.test (813 of 2153)
PASS: lldb-unit :: Utility/./UtilityTests/RangeTest.SizeTypes (814 of 2153)
PASS: lldb-api :: functionalities/data-formatter/format-propagation/TestFormatPropagation.py (815 of 2153)
PASS: lldb-unit :: Utility/./UtilityTests/VMRange.Ordering (816 of 2153)
PASS: lldb-unit :: Utility/./UtilityTests/AnsiTerminal.Twice (817 of 2153)
PASS: lldb-api :: macosx/profile_vrs_detach/TestDetachVrsProfile.py (818 of 2153)
PASS: lldb-unit :: Utility/./UtilityTests/StatusTest.ErrorCodeConstructor (819 of 2153)
PASS: lldb-api :: python_api/lldbutil/process/TestPrintStackTraces.py (820 of 2153)
UNSUPPORTED: lldb-shell :: ObjectFile/ELF/minidebuginfo-set-and-hit-breakpoint.test (821 of 2153)
PASS: lldb-unit :: Utility/./UtilityTests/StringExtractorTest.GetHexBytesAvail_Partial (822 of 2153)
PASS: lldb-unit :: ObjectFile/Breakpad/./ObjectFileBreakpadTests/LineRecord.parse (823 of 2153)
PASS: lldb-unit :: Host/./HostTests/Host.WaitStatusFormat (824 of 2153)
PASS: lldb-api :: commands/platform/basic/TestPlatformPython.py (825 of 2153)
UNSUPPORTED: lldb-api :: tools/lldb-server/thread-name/TestGdbRemoteThreadName.py (826 of 2153)
PASS: lldb-unit :: Process/gdb-remote/./ProcessGdbRemoteTests/GDBRemoteCommunicationClientTest.WriteRegister (827 of 2153)
PASS: lldb-shell :: ObjectFile/Breakpad/breakpad-identification.test (828 of 2153)
PASS: lldb-api :: commands/source/info/TestSourceInfo.py (829 of 2153)
PASS: lldb-api :: functionalities/postmortem/minidump/TestMiniDump.py (830 of 2153)
PASS: lldb-api :: functionalities/pointer_num_children/TestPointerNumChildren.py (831 of 2153)
PASS: lldb-shell :: SymbolFile/DWARF/deterministic-build.cpp (832 of 2153)
PASS: lldb-api :: commands/command/script/import/TestImport.py (833 of 2153)
PASS: lldb-shell :: Minidump/disassemble-no-module.yaml (834 of 2153)
PASS: lldb-shell :: ObjectFile/ELF/gnu-debuglink.yaml (835 of 2153)
PASS: lldb-api :: lang/objc/modules-hash-mismatch/TestClangModulesHashMismatch.py (836 of 2153)
PASS: lldb-unit :: Utility/./UtilityTests/StringExtractorTest.InitEmpty (837 of 2153)
PASS: lldb-unit :: Platform/./LLDBPlatformTests/PlatformDarwinTest.FindComponentInPath (838 of 2153)
PASS: lldb-unit :: Utility/./UtilityTests/StringListTest.InsertStringAtIndexOutOfBounds (839 of 2153)
PASS: lldb-unit :: Process/minidump/./LLDBMinidumpTests/MinidumpParserTest.FindMemoryRange (840 of 2153)
PASS: lldb-api :: lang/cpp/global_operators/TestCppGlobalOperators.py (841 of 2153)
PASS: lldb-api :: python_api/value/change_values/TestChangeValueAPI.py (842 of 2153)
PASS: lldb-unit :: UnwindAssembly/PPC64/./PPC64InstEmulationTests/TestPPC64InstEmulation.TestSimpleFunction (843 of 2153)
PASS: lldb-api :: tools/lldb-server/TestLldbGdbServer.py (844 of 2153)
PASS: lldb-api :: functionalities/thread/concurrent_events/TestConcurrentTwoBreakpointsOneSignal.py (845 of 2153)
PASS: lldb-unit :: Host/./HostTests/FileSystemTest.GetByteSize (846 of 2153)
PASS: lldb-unit :: Utility/./UtilityTests/StringExtractorTest.GetHexU8_Exact_NoEof (847 of 2153)
PASS: lldb-unit :: Utility/./UtilityTests/TimeoutTest.Construction (848 of 2153)
PASS: lldb-api :: functionalities/thread/concurrent_events/TestConcurrentSignalWatch.py (849 of 2153)
PASS: lldb-api :: functionalities/data-formatter/typedef_array/TestTypedefArray.py (850 of 2153)
PASS: lldb-unit :: Utility/./UtilityTests/StreamTest.PutHex32ByteOrderLittle (851 of 2153)
PASS: lldb-shell :: ObjectFile/Breakpad/uuid-matching-mac.test (852 of 2153)
PASS: lldb-unit :: Utility/./UtilityTests/GeneratorTest.GetOrCreate (853 of 2153)
PASS: lldb-api :: functionalities/tail_call_frames/ambiguous_tail_call_seq2/TestAmbiguousTailCallSeq2.py (854 of 2153)
PASS: lldb-api :: lang/cpp/type_lookup/TestCppTypeLookup.py (855 of 2153)
PASS: lldb-unit :: Symbol/./SymbolTests/TestClangASTImporter.DeportTypeTagDecl (856 of 2153)
PASS: lldb-shell :: SymbolFile/DWARF/dwarf5-partial-index.cpp (857 of 2153)
PASS: lldb-unit :: Process/minidump/./LLDBMinidumpTests/MinidumpParserTest.MinidumpDuplicateModuleMinAddress (858 of 2153)
PASS: lldb-unit :: Utility/./UtilityTests/StringExtractorTest.DecodeHexU8_Extra (859 of 2153)
PASS: lldb-api :: functionalities/data-formatter/compactvectors/TestCompactVectors.py (860 of 2153)
PASS: lldb-unit :: Core/./LLDBCoreTests/MangledTest.NameIndexes_FindFunctionSymbols (861 of 2153)
PASS: lldb-unit :: Host/./HostTests/FileSystemTest.Resolve (862 of 2153)
PASS: lldb-unit :: Utility/./UtilityTests/BinaryStreamTest.PutULEB128FourBytes (863 of 2153)
PASS: lldb-unit :: Utility/./UtilityTests/UriParserTest.BracketedHostnameWithColon (864 of 2153)
PASS: lldb-unit :: Utility/./UtilityTests/StringListTest.DefaultConstructor (865 of 2153)
UNSUPPORTED: lldb-api :: python_api/event/TestEvents.py (866 of 2153)
PASS: lldb-api :: commands/expression/import-std-module/vector/TestVectorFromStdModule.py (867 of 2153)
PASS: lldb-api :: functionalities/thread/concurrent_events/TestConcurrentSignalDelayBreak.py (868 of 2153)
PASS: lldb-unit :: Expression/./ExpressionTests/DiagnosticManagerTest.GetStringMultiline (869 of 2153)
PASS: lldb-api :: commands/command/script_alias/TestCommandScriptAlias.py (870 of 2153)
PASS: lldb-api :: commands/expression/import-std-module/pair/TestPairFromStdModule.py (871 of 2153)
PASS: lldb-api :: commands/expression/invalid-args/TestInvalidArgsExpression.py (872 of 2153)
PASS: lldb-unit :: API/./APITests/SBCommandInterpreterTest.MultiWordCommand (873 of 2153)
PASS: lldb-unit :: Utility/./UtilityTests/UUIDTest.RelationalOperators (874 of 2153)
UNSUPPORTED: lldb-shell :: Register/x86-64-ymm16-write.test (875 of 2153)
PASS: lldb-api :: functionalities/data-formatter/data-formatter-stl/libcxx/list/TestDataFormatterLibcxxList.py (876 of 2153)
PASS: lldb-api :: lang/cpp/typeof/TestTypeOfDeclTypeExpr.py (877 of 2153)
PASS: lldb-shell :: SymbolFile/DWARF/DW_AT_const_value-bitfields.s (878 of 2153)
PASS: lldb-unit :: Utility/./UtilityTests/FileSpecTest.EqualSeparator (879 of 2153)
PASS: lldb-unit :: Process/gdb-remote/./ProcessGdbRemoteTests/GDBRemoteCommunicationClientTest.SendGetTraceConfigPacket (880 of 2153)
PASS: lldb-unit :: Platform/./LLDBPlatformTests/PlatformDarwinTest.TestParseVersionBuildDir (881 of 2153)
PASS: lldb-api :: commands/expression/issue_11588/Test11588.py (882 of 2153)
PASS: lldb-api :: commands/platform/file/close/TestPlatformFileClose.py (883 of 2153)
PASS: lldb-shell :: Breakpoint/jitbp_elf.test (884 of 2153)
PASS: lldb-unit :: Utility/./UtilityTests/BinaryStreamTest.PutULEB128MaxValue (885 of 2153)
PASS: lldb-shell :: SymbolFile/DWARF/dwo-type-in-main-file.s (886 of 2153)
UNSUPPORTED: lldb-api :: tools/lldb-vscode/disconnect/TestVSCode_disconnect.py (887 of 2153)
PASS: lldb-api :: commands/watchpoints/step_over_watchpoint/TestStepOverWatchpoint.py (888 of 2153)
PASS: lldb-unit :: Utility/./UtilityTests/AnsiTerminal.AtStart (889 of 2153)
PASS: lldb-api :: iohandler/completion/TestIOHandlerCompletion.py (890 of 2153)
PASS: lldb-unit :: Utility/./UtilityTests/BinaryStreamTest.PutULEB128EightBytes (891 of 2153)
PASS: lldb-shell :: Minidump/Windows/broken-unwind.test (892 of 2153)
PASS: lldb-unit :: Utility/./UtilityTests/OptionsWithRawTest.EmptyArgsOnlySuffix (893 of 2153)
PASS: lldb-unit :: Utility/./UtilityTests/FileSpecTest.IsRelative (894 of 2153)
PASS: lldb-api :: lang/objc/objc-super/TestObjCSuper.py (895 of 2153)
PASS: lldb-unit :: Process/gdb-remote/./ProcessGdbRemoteTests/GDBRemoteClientBaseTest.SendContinueAndLateInterrupt (896 of 2153)
PASS: lldb-shell :: ObjectFile/ELF/section-types-edgecases.yaml (897 of 2153)
PASS: lldb-unit :: Utility/./UtilityTests/ScalarTest.Scalar_512 (898 of 2153)
PASS: lldb-shell :: SymbolFile/DWARF/dir-separator-windows.s (899 of 2153)
PASS: lldb-shell :: SymbolFile/DWARF/static_scope.s (900 of 2153)
UNSUPPORTED: lldb-api :: functionalities/darwin_log/filter/exact_match/message/TestDarwinLogFilterMatchMessage.py (901 of 2153)
PASS: lldb-shell :: SymbolFile/DWARF/array-sizes.s (902 of 2153)
PASS: lldb-unit :: UnwindAssembly/x86/./UnwindAssemblyx86Tests/Testx86AssemblyInspectionEngine.TestPushRBPWithREX (903 of 2153)
PASS: lldb-unit :: UnwindAssembly/x86/./UnwindAssemblyx86Tests/Testx86AssemblyInspectionEngine.TestPushEBP (904 of 2153)
PASS: lldb-api :: lang/c/local_variables/TestLocalVariables.py (905 of 2153)
PASS: lldb-api :: functionalities/gdb_remote_client/TestProcessConnect.py (906 of 2153)
PASS: lldb-api :: tools/lldb-server/TestGdbRemote_vCont.py (907 of 2153)
PASS: lldb-unit :: Utility/./UtilityTests/RegularExpression.Invalid (908 of 2153)
PASS: lldb-api :: lang/objc/blocks/TestObjCIvarsInBlocks.py (909 of 2153)
PASS: lldb-unit :: Utility/./UtilityTests/StringListTest.SplitIntoLinesEmpty (910 of 2153)
PASS: lldb-api :: functionalities/data-formatter/user-format-vs-summary/TestUserFormatVsSummary.py (911 of 2153)
PASS: lldb-unit :: Utility/./UtilityTests/RangeTest.DoesAdjoinOrIntersect (912 of 2153)
UNSUPPORTED: lldb-shell :: Unwind/unwind-plan-dwarf-dump.test (913 of 2153)
PASS: lldb-unit :: ObjectFile/ELF/./ObjectFileELFTests/ObjectFileELFTest.GetSymtab_NoSymEntryPointArmThumbAddressClass (914 of 2153)
PASS: lldb-unit :: Language/Highlighting/./HighlighterTests/HighlighterTest.ClangPPDirectives (915 of 2153)
PASS: lldb-api :: functionalities/thread/concurrent_events/TestConcurrentManyCrash.py (916 of 2153)
PASS: lldb-api :: commands/target/stop-hook/disable/TestTargetStopHookDisable.py (917 of 2153)
PASS: lldb-unit :: Utility/./UtilityTests/StringExtractorTest.GetNameColonValueContainsColon (918 of 2153)
PASS: lldb-unit :: Process/gdb-remote/./ProcessGdbRemoteTests/GDBRemoteClientBaseTest.SendPacketAndReceiveResponseWithOutputSupport (919 of 2153)
PASS: lldb-shell :: Quit/TestQuitExitCode0.test (920 of 2153)
PASS: lldb-unit :: Utility/./UtilityTests/StringListTest.SetSize (921 of 2153)
UNSUPPORTED: lldb-shell :: Unwind/eh-frame-augment-noop.test (922 of 2153)
PASS: lldb-api :: python_api/value/linked_list/TestValueAPILinkedList.py (923 of 2153)
PASS: lldb-api :: functionalities/gdb_remote_client/TestTargetXMLArch.py (924 of 2153)
PASS: lldb-api :: commands/frame/select/TestFrameSelect.py (925 of 2153)
PASS: lldb-api :: functionalities/ptr_refs/TestPtrRefs.py (926 of 2153)
PASS: lldb-shell :: SymbolFile/DWARF/debug-names-compressed.cpp (927 of 2153)
PASS: lldb-unit :: Process/minidump/./LLDBMinidumpTests/MinidumpParserTest.GetPidWow64 (928 of 2153)
UNSUPPORTED: lldb-api :: linux/mix-dwo-and-regular-objects/TestMixedDwarfBinary.py (929 of 2153)
PASS: lldb-api :: commands/expression/radar_9673664/TestExprHelpExamples.py (930 of 2153)
UNSUPPORTED: lldb-api :: commands/register/register/intel_xtended_registers/TestMPXRegisters.py (931 of 2153)
UNSUPPORTED: lldb-shell :: ScriptInterpreter/Lua/quit.test (932 of 2153)
PASS: lldb-unit :: Utility/./UtilityTests/StreamTest.AddressNoSuffix (933 of 2153)
PASS: lldb-unit :: Utility/./UtilityTests/UserIDResolver.GetGroupName (934 of 2153)
PASS: lldb-unit :: Utility/./UtilityTests/ProcessInstanceInfo.Yaml (935 of 2153)
PASS: lldb-api :: python_api/sbtype_typeclass/TestSBTypeTypeClass.py (936 of 2153)
PASS: lldb-api :: functionalities/thread/concurrent_events/TestConcurrentSignalDelayWatch.py (937 of 2153)
PASS: lldb-unit :: Target/./TargetTests/MemoryRegionInfoTest.Formatv (938 of 2153)
PASS: lldb-unit :: Utility/./UtilityTests/StreamTest.PutChar (939 of 2153)
PASS: lldb-unit :: Utility/./UtilityTests/FileSpecTest.Equal (940 of 2153)
PASS: lldb-unit :: Host/./HostTests/SocketAddressTest.GetAddressInfo (941 of 2153)
PASS: lldb-unit :: Utility/./UtilityTests/ArchSpecTest.TripleComponentsWereSpecified (942 of 2153)
PASS: lldb-unit :: Editline/./EditlineTests/EditlineTestFixture.EditlineReceivesMultiLineText (943 of 2153)
PASS: lldb-shell :: ObjectFile/PECOFF/sections-names.yaml (944 of 2153)
PASS: lldb-api :: functionalities/data-formatter/refpointer-recursion/TestDataFormatterRefPtrRecursion.py (945 of 2153)
PASS: lldb-unit :: Symbol/./SymbolTests/TestTypeSystemClang.TestGetEnumIntegerTypeUnexpectedType (946 of 2153)
PASS: lldb-api :: functionalities/breakpoint/breakpoint_by_file_colon_line/TestBreakpointByFileColonLine.py (947 of 2153)
PASS: lldb-unit :: Utility/./UtilityTests/FileSpecTest.OperatorBool (948 of 2153)
UNSUPPORTED: lldb-api :: functionalities/darwin_log/source/debug/TestDarwinLogSourceDebug.py (949 of 2153)
PASS: lldb-unit :: Language/Highlighting/./HighlighterTests/HighlighterTest.ClangScalarLiterals (950 of 2153)
PASS: lldb-unit :: Interpreter/./InterpreterTests/OptionValueFileColonLine.setFromString (951 of 2153)
PASS: lldb-unit :: Expression/./ExpressionTests/DiagnosticManagerTest.FixedExpression (952 of 2153)
PASS: lldb-unit :: Utility/./UtilityTests/StringListTest.GetMaxStringLengthMixed (953 of 2153)
PASS: lldb-unit :: Language/CPlusPlus/./LanguageCPlusPlusTests/CPlusPlusLanguage.FindAlternateFunctionManglings (954 of 2153)
PASS: lldb-api :: functionalities/unwind/sigtramp/TestSigtrampUnwind.py (955 of 2153)
PASS: lldb-unit :: Symbol/./SymbolTests/TestTypeSystemClang.AddMethodToObjCObjectType (956 of 2153)
PASS: lldb-api :: commands/expression/formatters/TestFormatters.py (957 of 2153)
PASS: lldb-shell :: SymbolFile/DWARF/find-basic-type.cpp (958 of 2153)
PASS: lldb-api :: macosx/thread_suspend/TestInternalThreadSuspension.py (959 of 2153)
PASS: lldb-unit :: Symbol/./SymbolTests/TestTypeSystemClang.TestDisplayNameEmpty (960 of 2153)
PASS: lldb-unit :: Process/gdb-remote/./ProcessGdbRemoteTests/GDBRemoteCommunicationServerTest.SendErrorResponse_StringError (961 of 2153)
PASS: lldb-api :: lang/objc/foundation/TestObjCMethodsNSArray.py (962 of 2153)
PASS: lldb-unit :: Utility/./UtilityTests/AnsiTerminal.AtEnd (963 of 2153)
PASS: lldb-api :: commands/process/attach/attach_denied/TestAttachDenied.py (964 of 2153)
UNSUPPORTED: lldb-api :: android/platform/TestDefaultCacheLineSize.py (965 of 2153)
UNSUPPORTED: lldb-api :: functionalities/breakpoint/breakpoint_in_delayslot/TestAvoidBreakpointInDelaySlot.py (966 of 2153)
PASS: lldb-shell :: SymbolFile/DWARF/compilercontext.ll (967 of 2153)
UNSUPPORTED: lldb-api :: commands/expression/completion-crash-invalid-iterator/TestInvalidIteratorCompletionCrash.py (968 of 2153)
PASS: lldb-unit :: Utility/./UtilityTests/XcodeSDKTest.SDKSupportsModules (969 of 2153)
PASS: lldb-shell :: SymbolFile/Breakpad/unwind-via-stack-cfi.test (970 of 2153)
PASS: lldb-unit :: Utility/./UtilityTests/StringListTest.ForRangeEmpty (971 of 2153)
PASS: lldb-unit :: Utility/./UtilityTests/RangeTest.DefaultConstructor (972 of 2153)
PASS: lldb-api :: commands/expression/import_builtin_fileid/TestImportBuiltinFileID.py (973 of 2153)
PASS: lldb-api :: functionalities/data-formatter/stringprinter/TestStringPrinter.py (974 of 2153)
UNSUPPORTED: lldb-shell :: Register/x86-ymm-read.test (975 of 2153)
PASS: lldb-api :: commands/expression/rdar44436068/Test128BitsInteger.py (976 of 2153)
PASS: lldb-shell :: Minidump/Windows/find-module.test (977 of 2153)
PASS: lldb-unit :: Host/./HostTests/FileSystemTest.MakeAbsolute (978 of 2153)
PASS: lldb-api :: functionalities/gdb_remote_client/TestJLink6Armv7RegisterDefinition.py (979 of 2153)
PASS: lldb-api :: commands/expression/call-function/TestCallBuiltinFunction.py (980 of 2153)
UNSUPPORTED: lldb-api :: functionalities/data-formatter/data-formatter-stl/libstdcpp/list/TestDataFormatterStdList.py (981 of 2153)
PASS: lldb-unit :: Utility/./UtilityTests/StreamTest.PutNHex8 (982 of 2153)
PASS: lldb-shell :: Settings/TestFrameFormatColor.test (983 of 2153)
PASS: lldb-shell :: SymbolFile/DWARF/DW_AT_declaration-with-children.s (984 of 2153)
UNSUPPORTED: lldb-shell :: SymbolFile/DWARF/DW_TAG_GNU_call_site-DW_AT_low_pc.s (985 of 2153)
PASS: lldb-unit :: Utility/./UtilityTests/OptionsWithRawTest.EmptySuffix (986 of 2153)
PASS: lldb-api :: lang/cpp/gmodules-templates/TestGModules.py (987 of 2153)
PASS: lldb-unit :: Utility/./UtilityTests/StreamTest.PutHex16ByteOrderLittle (988 of 2153)
PASS: lldb-unit :: Expression/./ExpressionTests/DWARFExpression.DW_OP_pick (989 of 2153)
PASS: lldb-api :: functionalities/breakpoint/breakpoint_command/TestBreakpointCommandsFromPython.py (990 of 2153)
UNSUPPORTED: lldb-api :: functionalities/darwin_log/filter/exact_match/activity-chain/TestDarwinLogFilterMatchActivityChain.py (991 of 2153)
PASS: lldb-api :: commands/watchpoints/watchpoint_count/TestWatchpointCount.py (992 of 2153)
PASS: lldb-unit :: Process/gdb-remote/./ProcessGdbRemoteTests/GDBRemoteCommunicationClientTest.SendGetMetaDataPacket (993 of 2153)
PASS: lldb-unit :: Signals/./SignalsTests/UnixSignalsTest.GetFilteredSignals (994 of 2153)
PASS: lldb-unit :: Utility/./UtilityTests/GeneratorTest.Create (995 of 2153)
PASS: lldb-unit :: Expression/./ExpressionTests/CppModuleConfigurationTest.MissingUsrInclude (996 of 2153)
PASS: lldb-api :: commands/session/history/TestSessionHistory.py (997 of 2153)
UNSUPPORTED: lldb-api :: functionalities/unwind/standard/TestStandardUnwind.py (998 of 2153)
PASS: lldb-unit :: Utility/./UtilityTests/AnsiTerminal.Unknown (999 of 2153)
PASS: lldb-api :: commands/watchpoints/watchpoint_set_command/TestWatchLocationWithWatchSet.py (1000 of 2153)
PASS: lldb-unit :: SymbolFile/DWARF/./SymbolFileDWARFTests/XcodeSDKModuleTests.TestModuleGetXcodeSDK (1001 of 2153)
PASS: lldb-shell :: SymbolFile/DWARF/DW_AT_low_pc-addrx.s (1002 of 2153)
PASS: lldb-api :: python_api/sblaunchinfo/TestSBLaunchInfo.py (1003 of 2153)
PASS: lldb-unit :: Utility/./UtilityTests/StreamTeeTest.GetStreamAtIndexOutOfBounds (1004 of 2153)
PASS: lldb-shell :: Reproducer/TestVersionCheck.test (1005 of 2153)
PASS: lldb-unit :: Utility/./UtilityTests/StringListTest.SplitIntoLinesSingleTrailingCR (1006 of 2153)
PASS: lldb-shell :: SymbolFile/DWARF/find-method.cpp (1007 of 2153)
PASS: lldb-api :: functionalities/data-formatter/data-formatter-globals/TestDataFormatterGlobals.py (1008 of 2153)
PASS: lldb-api :: functionalities/thread/concurrent_events/TestConcurrentTwoWatchpointThreads.py (1009 of 2153)
PASS: lldb-unit :: ScriptInterpreter/Python/./ScriptInterpreterPythonTests/PythonDataObjectsTest.TestPythonListManipulation (1010 of 2153)
PASS: lldb-unit :: Host/./HostTests/SocketTest.DecodeHostAndPort (1011 of 2153)
PASS: lldb-unit :: Utility/./UtilityTests/StreamTeeTest.SetStreamAtIndexOverwrite (1012 of 2153)
PASS: lldb-unit :: Symbol/./SymbolTests/TestClangASTImporter.MetadataPropagationIndirectImport (1013 of 2153)
PASS: lldb-shell :: SymbolFile/DWARF/find-basic-namespace.cpp (1014 of 2153)
PASS: lldb-unit :: UnwindAssembly/x86/./UnwindAssemblyx86Tests/Testx86AssemblyInspectionEngine.TestPushImm (1015 of 2153)
PASS: lldb-shell :: ObjectFile/MachO/subsections.yaml (1016 of 2153)
PASS: lldb-api :: lang/cpp/static_methods/TestCPPStaticMethods.py (1017 of 2153)
PASS: lldb-unit :: tools/lldb-server/tests/./LLDBServerTests/StandardStartupTest.TestStopReplyContainsThreadPcs (1018 of 2153)
PASS: lldb-shell :: SymbolFile/DWARF/DW_OP_piece-smaller-than-struct.s (1019 of 2153)
PASS: lldb-unit :: UnwindAssembly/x86/./UnwindAssemblyx86Tests/Testx86AssemblyInspectionEngine.TestPushEAX (1020 of 2153)
PASS: lldb-api :: functionalities/fat_archives/TestFatArchives.py (1021 of 2153)
PASS: lldb-unit :: Utility/./UtilityTests/SerializationRountripTest.SerializeDeserializeObjectReference (1022 of 2153)
PASS: lldb-unit :: Utility/./UtilityTests/BinaryStreamTest.PutULEB128NineBytes (1023 of 2153)
PASS: lldb-api :: lang/objc/objc-new-syntax/TestObjCNewSyntaxArray.py (1024 of 2153)
PASS: lldb-api :: lang/cpp/breakpoint_in_member_func_w_non_primitive_params/TestBreakpointInMemberFuncWNonPrimitiveParams.py (1025 of 2153)
PASS: lldb-unit :: Utility/./UtilityTests/FileSpecTest.AppendPathComponent (1026 of 2153)
PASS: lldb-unit :: Process/minidump/./LLDBMinidumpTests/RegisterContextMinidump.CheckRegisterContextMinidump_ARM (1027 of 2153)
PASS: lldb-unit :: Process/gdb-remote/./ProcessGdbRemoteTests/GDBRemoteCommunicationClientTest.GetModulesInfo (1028 of 2153)
UNSUPPORTED: lldb-shell :: SymbolFile/PDB/function-level-linking.test (1029 of 2153)
PASS: lldb-api :: functionalities/data-formatter/boolreference/TestFormattersBoolRefPtr.py (1030 of 2153)
PASS: lldb-api :: functionalities/inline-stepping/TestInlineStepping.py (1031 of 2153)
PASS: lldb-api :: lang/c/inlines/TestRedefinitionsInInlines.py (1032 of 2153)
PASS: lldb-api :: macosx/find-dsym/bundle-with-dot-in-filename/TestBundleWithDotInFilename.py (1033 of 2153)
PASS: lldb-unit :: Utility/./UtilityTests/UriParserTest.MinimalPortPath (1034 of 2153)
PASS: lldb-unit :: Expression/./ExpressionTests/DWARFExpression.DW_OP_convert (1035 of 2153)
PASS: lldb-unit :: Expression/./ExpressionTests/CppModuleConfigurationTest.LibCppV2 (1036 of 2153)
PASS: lldb-unit :: Utility/./UtilityTests/UriParserTest.SchemeHostSeparator3 (1037 of 2153)
PASS: lldb-unit :: ObjectFile/PECOFF/./ObjectFilePECOFFTests/PECallFrameInfoTest.Basic_eh (1038 of 2153)
PASS: lldb-api :: commands/expression/context-object/TestContextObject.py (1039 of 2153)
PASS: lldb-unit :: Utility/./UtilityTests/RangeTest.Union (1040 of 2153)
PASS: lldb-unit :: Symbol/./SymbolTests/TestTypeSystemClang.TestFunctionTemplateConstruction (1041 of 2153)
PASS: lldb-unit :: Host/./HostTests/FileSystemTest.FileAndDirectoryComponents (1042 of 2153)
PASS: lldb-shell :: SymbolFile/DWARF/DW_AT_location-DW_AT_const_value.s (1043 of 2153)
PASS: lldb-api :: commands/target/stop-hook/delete/TestTargetStopHookDelete.py (1044 of 2153)
PASS: lldb-shell :: SymbolFile/DWARF/inline-function-address.ll (1045 of 2153)
PASS: lldb-shell :: SymbolFile/DWARF/clang-ast-from-dwarf-objc-property.m (1046 of 2153)
PASS: lldb-shell :: Driver/TestUseColor.test (1047 of 2153)
PASS: lldb-api :: functionalities/tail_call_frames/inlining_and_tail_calls/TestInliningAndTailCalls.py (1048 of 2153)
PASS: lldb-unit :: Utility/./UtilityTests/LogChannelEnabledTest.LogVerboseThread (1049 of 2153)
PASS: lldb-api :: functionalities/lazy-loading/TestLazyLoading.py (1050 of 2153)
PASS: lldb-shell :: SymbolFile/DWARF/debug_loc-aslr.s (1051 of 2153)
PASS: lldb-unit :: Process/minidump/./LLDBMinidumpTests/MinidumpParserTest.GetLinuxProcStatus (1052 of 2153)
PASS: lldb-unit :: ScriptInterpreter/Python/./ScriptInterpreterPythonTests/PythonDataObjectsTest.TestPythonTupleInitializerList (1053 of 2153)
PASS: lldb-api :: commands/expression/unwind_expression/TestUnwindExpression.py (1054 of 2153)
PASS: lldb-unit :: Expression/./ExpressionTests/DiagnosticManagerTest.AppendMessageNoDiag (1055 of 2153)
PASS: lldb-unit :: Process/gdb-remote/./ProcessGdbRemoteTests/GDBRemoteCommunicationClientTest.GetModulesInfoInvalidResponse (1056 of 2153)
PASS: lldb-unit :: Utility/./UtilityTests/BinaryStreamTest.PutULEB128One (1057 of 2153)
PASS: lldb-unit :: Utility/./UtilityTests/RangeTest.ClearWithStarAddress (1058 of 2153)
PASS: lldb-api :: lang/objc/bitfield_ivars/TestBitfieldIvars.py (1059 of 2153)
PASS: lldb-unit :: Utility/./UtilityTests/ProcessInstanceInfoMatch.Name (1060 of 2153)
PASS: lldb-api :: lang/objc/objc-new-syntax/TestObjCNewSyntaxDictionary.py (1061 of 2153)
UNSUPPORTED: lldb-shell :: Register/aarch64-gp-read.test (1062 of 2153)
PASS: lldb-unit :: ScriptInterpreter/Python/./ScriptInterpreterPythonTests/PythonDataObjectsTest.TestInstanceNameResolutionNoDot (1063 of 2153)
PASS: lldb-shell :: Settings/TestSettingsSet.test (1064 of 2153)
PASS: lldb-shell :: SymbolFile/DWARF/find-variable-dwo.cpp (1065 of 2153)
PASS: lldb-shell :: SymbolFile/DWARF/DW_AT_loclists_base.s (1066 of 2153)
UNSUPPORTED: lldb-shell :: SymbolFile/DWARF/split-dwarf-expression-eval-bug.cpp (1067 of 2153)
UNSUPPORTED: lldb-api :: lang/c/typedef/Testtypedef.py (1068 of 2153)
PASS: lldb-api :: lang/objc/modules-update/TestClangModulesUpdate.py (1069 of 2153)
PASS: lldb-unit :: Utility/./UtilityTests/StringLexerTest.Next (1070 of 2153)
PASS: lldb-api :: functionalities/thread/concurrent_events/TestConcurrentWatchpointWithDelayWatchpointThreads.py (1071 of 2153)
PASS: lldb-api :: functionalities/data-formatter/array_typedef/TestArrayTypedef.py (1072 of 2153)
PASS: lldb-api :: macosx/safe-to-func-call/TestSafeFuncCalls.py (1073 of 2153)
PASS: lldb-unit :: Process/minidump/./LLDBMinidumpTests/MinidumpParserTest.MinidumpDuplicateModuleSeparateCode (1074 of 2153)
PASS: lldb-api :: functionalities/memory-region/TestMemoryRegion.py (1075 of 2153)
UNSUPPORTED: lldb-shell :: ScriptInterpreter/Lua/watchpoint_callback.test (1076 of 2153)
PASS: lldb-unit :: UnwindAssembly/ARM64/./Arm64InstEmulationTests/TestArm64InstEmulation.TestSimpleDarwinFunction (1077 of 2153)
PASS: lldb-api :: functionalities/thread/concurrent_events/TestConcurrentDelaySignalBreak.py (1078 of 2153)
PASS: lldb-api :: lang/objc/ptr_refs/TestPtrRefsObjC.py (1079 of 2153)
PASS: lldb-shell :: SymbolFile/DWARF/DW_AT_const_value.s (1080 of 2153)
PASS: lldb-api :: python_api/file_handle/TestFileHandle.py (1081 of 2153)
PASS: lldb-api :: commands/watchpoints/watchpoint_commands/condition/TestWatchpointConditionCmd.py (1082 of 2153)
PASS: lldb-unit :: DataFormatter/./LLDBFormatterTests/TypeMatcherTests.ExactName (1083 of 2153)
PASS: lldb-unit :: Process/gdb-remote/./ProcessGdbRemoteTests/GDBRemoteCommunicationClientTest.SendStopTracePacket (1084 of 2153)
PASS: lldb-unit :: UnwindAssembly/x86/./UnwindAssemblyx86Tests/Testx86AssemblyInspectionEngine.TestPopRBPWithREX (1085 of 2153)
PASS: lldb-unit :: Utility/./UtilityTests/BinaryStreamTest.PutULEB128TwoBytes (1086 of 2153)
PASS: lldb-api :: commands/expression/vector_of_enums/TestVectorOfEnums.py (1087 of 2153)
PASS: lldb-shell :: SymbolFile/DWARF/debug-types-address-ranges.s (1088 of 2153)
PASS: lldb-api :: commands/platform/basic/TestPlatformCommand.py (1089 of 2153)
PASS: lldb-api :: functionalities/data-formatter/data-formatter-stl/libcxx/multiset/TestDataFormatterLibcxxMultiSet.py (1090 of 2153)
PASS: lldb-unit :: UnwindAssembly/x86/./UnwindAssemblyx86Tests/Testx86AssemblyInspectionEngine.Testi386IgnoredRegisters (1091 of 2153)
PASS: lldb-shell :: Minidump/memory-region-from-module.yaml (1092 of 2153)
PASS: lldb-shell :: Driver/LocalLLDBInit.test (1093 of 2153)
PASS: lldb-unit :: Utility/./UtilityTests/StatusTest.ErrorConstructor (1094 of 2153)
PASS: lldb-unit :: Expression/./ExpressionTests/DiagnosticManagerTest.AppendMessageAttachToLastDiag (1095 of 2153)
PASS: lldb-api :: commands/disassemble/basic/TestFrameDisassemble.py (1096 of 2153)
PASS: lldb-unit :: Utility/./UtilityTests/StreamTest.PutPtr (1097 of 2153)
PASS: lldb-api :: functionalities/dlopen_other_executable/TestDlopenOtherExecutable.py (1098 of 2153)
PASS: lldb-unit :: ScriptInterpreter/Python/./ScriptInterpreterPythonTests/PythonDataObjectsTest.TestPythonDictionaryManipulation (1099 of 2153)
PASS: lldb-api :: functionalities/breakpoint/comp_dir_symlink/TestCompDirSymLink.py (1100 of 2153)
PASS: lldb-unit :: Target/./TargetTests/StackFrameRecognizerTest.NullModuleRegex (1101 of 2153)
PASS: lldb-api :: functionalities/thread/concurrent_events/TestConcurrentTwoBreakpointsOneDelaySignal.py (1102 of 2153)
PASS: lldb-shell :: SymbolFile/Breakpad/stack-cfi-arm.yaml (1103 of 2153)
PASS: lldb-unit :: Utility/./UtilityTests/StringExtractorTest.GetU32BigEndian (1104 of 2153)
PASS: lldb-api :: python_api/interpreter/TestCommandInterpreterAPI.py (1105 of 2153)
PASS: lldb-unit :: Utility/./UtilityTests/VMRange.Clear (1106 of 2153)
PASS: lldb-api :: python_api/lldbutil/TestSwigVersion.py (1107 of 2153)
PASS: lldb-api :: functionalities/thread/concurrent_events/TestConcurrentTwoWatchpointsOneDelayBreakpoint.py (1108 of 2153)
PASS: lldb-unit :: Utility/./UtilityTests/Flags.AnySet (1109 of 2153)
PASS: lldb-unit :: Utility/./UtilityTests/StringListTest.GetMaxStringLengthIncreasingSize (1110 of 2153)
PASS: lldb-unit :: Host/./HostTests/HostInfoTest.GetXcodeSDK (1111 of 2153)
PASS: lldb-unit :: Host/./HostTests/NativeProcessProtocolTest.ReadCStringFromMemory (1112 of 2153)
PASS: lldb-api :: functionalities/data-formatter/data-formatter-stl/libcxx/function/TestLibCxxFunction.py (1113 of 2153)
PASS: lldb-unit :: Utility/./UtilityTests/FileSpecTest.Match (1114 of 2153)
PASS: lldb-unit :: Symbol/./SymbolTests/TestTypeSystemClang.TestFunctionTemplateInRecordConstruction (1115 of 2153)
PASS: lldb-api :: commands/disassemble/basic/TestDisassembleBreakpoint.py (1116 of 2153)
PASS: lldb-api :: macosx/thread-names/TestInterruptThreadNames.py (1117 of 2153)
UNSUPPORTED: lldb-shell :: SymbolFile/PDB/variables-locations.test (1118 of 2153)
PASS: lldb-unit :: ScriptInterpreter/Python/./ScriptInterpreterPythonTests/PythonDataObjectsTest.TestPythonBytes (1119 of 2153)
PASS: lldb-unit :: Utility/./UtilityTests/AnsiTerminal.Basic (1120 of 2153)
PASS: lldb-api :: lang/c/vla/TestVLA.py (1121 of 2153)
PASS: lldb-unit :: Core/./LLDBCoreTests/RichManglingContextTest.FromCxxMethodName (1122 of 2153)
UNSUPPORTED: lldb-api :: functionalities/darwin_log/filter/exact_match/subsystem/TestDarwinLogFilterMatchSubsystem.py (1123 of 2153)
PASS: lldb-unit :: UnwindAssembly/x86/./UnwindAssemblyx86Tests/Testx86AssemblyInspectionEngine.TestSpillRegToStackViaMOVi386 (1124 of 2153)
PASS: lldb-unit :: Utility/./UtilityTests/CompletionRequest.TestCompletionOwnership (1125 of 2153)
PASS: lldb-unit :: Core/./LLDBCoreTests/ModuleSpecTest.TestELFFile (1126 of 2153)
PASS: lldb-shell :: ObjectFile/ELF/aarch64-relocations.yaml (1127 of 2153)
PASS: lldb-unit :: Language/CLanguages/./LanguageCLanguagesTests/CLanguages.LookupCLanguagesByLanguageType (1128 of 2153)
PASS: lldb-api :: commands/reproducer/invalid-args/TestInvalidArgsReproducer.py (1129 of 2153)
PASS: lldb-unit :: Utility/./UtilityTests/BinaryStreamTest.PutULEB128Zero (1130 of 2153)
PASS: lldb-api :: lang/cpp/namespace/TestNamespace.py (1131 of 2153)
PASS: lldb-unit :: Utility/./UtilityTests/DataExtractorTest.GetCStrAtEnd (1132 of 2153)
PASS: lldb-api :: commands/expression/dont_allow_jit/TestAllowJIT.py (1133 of 2153)
PASS: lldb-unit :: Utility/./UtilityTests/BroadcasterTest.EventTypeHasListeners (1134 of 2153)
PASS: lldb-unit :: Process/gdb-remote/./ProcessGdbRemoteTests/GDBRemoteCommunicationClientTest.GetQOffsets (1135 of 2153)
PASS: lldb-unit :: Language/Highlighting/./HighlighterTests/HighlighterTest.DefaultHighlighterWithCursor (1136 of 2153)
PASS: lldb-unit :: Host/./HostTests/SocketTest.TCPListen0GetPort (1137 of 2153)
PASS: lldb-api :: functionalities/gdb_remote_client/TestGDBRemoteDiskFileCompletion.py (1138 of 2153)
PASS: lldb-unit :: Utility/./UtilityTests/FileSpecTest.FileAndDirectoryComponents (1139 of 2153)
PASS: lldb-api :: commands/frame/diagnose/inheritance/TestDiagnoseInheritance.py (1140 of 2153)
PASS: lldb-shell :: ObjectFile/ELF/short-build-id.yaml (1141 of 2153)
PASS: lldb-unit :: Utility/./UtilityTests/BinaryStreamTest.PutSLEB128Zero (1142 of 2153)
UNSUPPORTED: lldb-shell :: Reproducer/TestLuaImport.test (1143 of 2153)
PASS: lldb-unit :: Utility/./UtilityTests/UriParserTest.TypicalPortPathIPv6 (1144 of 2153)
PASS: lldb-unit :: Host/./HostTests/NativeProcessProtocolTest.ReadCStringFromMemory_CrossPageBoundary (1145 of 2153)
PASS: lldb-unit :: Utility/./UtilityTests/StringLexerTest.GetUnlexed (1146 of 2153)
PASS: lldb-unit :: Utility/./UtilityTests/FileSpecTest.FormatFileSpec (1147 of 2153)
UNSUPPORTED: lldb-api :: lang/cpp/printf/TestPrintf.py (1148 of 2153)
PASS: lldb-unit :: Symbol/./SymbolTests/SymbolsTest.TerminateLocateExecutableSymbolFileForUnknownExecutableAndUnknownSymbolFile (1149 of 2153)
PASS: lldb-shell :: Commands/command-backtrace.test (1150 of 2153)
PASS: lldb-unit :: Language/Highlighting/./HighlighterTests/HighlighterTest.ClangCommas (1151 of 2153)
PASS: lldb-api :: functionalities/thread/concurrent_events/TestConcurrentManyBreakpoints.py (1152 of 2153)
PASS: lldb-unit :: Process/minidump/./LLDBMinidumpTests/MinidumpParserTest.GetExceptionStream (1153 of 2153)
PASS: lldb-unit :: UnwindAssembly/x86/./UnwindAssemblyx86Tests/Testx86AssemblyInspectionEngine.TestMovRSPtoRBP (1154 of 2153)
PASS: lldb-unit :: Process/minidump/./LLDBMinidumpTests/MinidumpParserTest.GetArchitectureWindows (1155 of 2153)
PASS: lldb-unit :: ScriptInterpreter/Python/./ScriptInterpreterPythonTests/PythonDataObjectsTest.TestPythonInteger (1156 of 2153)
PASS: lldb-shell :: Reproducer/TestDump.test (1157 of 2153)
PASS: lldb-api :: functionalities/tail_call_frames/disambiguate_paths_to_common_sink/TestDisambiguatePathsToCommonSink.py (1158 of 2153)
UNSUPPORTED: lldb-shell :: SymbolFile/PDB/type-quals.test (1159 of 2153)
PASS: lldb-unit :: UnwindAssembly/x86/./UnwindAssemblyx86Tests/Testx86AssemblyInspectionEngine.TestPopRBP (1160 of 2153)
PASS: lldb-shell :: SymbolFile/Breakpad/stack-cfi-parsing.test (1161 of 2153)
PASS: lldb-unit :: Utility/./UtilityTests/StringExtractorTest.GetNameColonValueSuccess (1162 of 2153)
PASS: lldb-api :: python_api/watchpoint/watchlocation/TestTargetWatchAddress.py (1163 of 2153)
PASS: lldb-shell :: ObjectFile/wasm/basic.yaml (1164 of 2153)
PASS: lldb-unit :: Utility/./UtilityTests/StreamTest.AddressRangeEmptyRange (1165 of 2153)
PASS: lldb-unit :: Language/Highlighting/./HighlighterTests/HighlighterTest.ClangOperators (1166 of 2153)
PASS: lldb-api :: commands/target/modules/search-paths/insert/TestTargetModulesSearchpathsInsert.py (1167 of 2153)
PASS: lldb-api :: lang/c/step_over_no_deadlock/TestStepOverDoesntBlock.py (1168 of 2153)
PASS: lldb-unit :: Platform/./LLDBPlatformTests/PlatformAppleSimulatorTest.TestSimHasSimEnvionament (1169 of 2153)
UNSUPPORTED: lldb-api :: functionalities/tty/TestTerminal.py (1170 of 2153)
PASS: lldb-api :: commands/expression/import-std-module/shared_ptr/TestSharedPtrFromStdModule.py (1171 of 2153)
PASS: lldb-unit :: Symbol/./SymbolTests/DWARFCallFrameInfoTest.Basic_dwarf3 (1172 of 2153)
UNSUPPORTED: lldb-api :: functionalities/darwin_log/filter/regex/activity/TestDarwinLogFilterRegexActivity.py (1173 of 2153)
PASS: lldb-api :: commands/expression/test/TestExprs.py (1174 of 2153)
PASS: lldb-api :: functionalities/tail_call_frames/unambiguous_sequence/TestUnambiguousTailCalls.py (1175 of 2153)
PASS: lldb-unit :: Utility/./UtilityTests/LogChannelEnabledTest.LLDB_LOG_ERROR (1176 of 2153)
PASS: lldb-shell :: Driver/TestProcessAttach.test (1177 of 2153)
PASS: lldb-unit :: Utility/./UtilityTests/BinaryStreamTest.PutSLEB128MaxValue (1178 of 2153)
PASS: lldb-api :: functionalities/thread/concurrent_events/TestConcurrentWatchBreak.py (1179 of 2153)
PASS: lldb-api :: python_api/findvalue_duplist/TestSBFrameFindValue.py (1180 of 2153)
PASS: lldb-unit :: Utility/./UtilityTests/ScalarTest.ComparisonFloat (1181 of 2153)
PASS: lldb-api :: functionalities/gdb_remote_client/TestIOSSimulator.py (1182 of 2153)
PASS: lldb-api :: commands/frame/diagnose/bad-reference/TestBadReference.py (1183 of 2153)
PASS: lldb-api :: commands/expression/persistent_types/TestPersistentTypes.py (1184 of 2153)
UNSUPPORTED: lldb-api :: functionalities/thread/create_during_step/TestCreateDuringStep.py (1185 of 2153)
PASS: lldb-unit :: UnwindAssembly/ARM64/./Arm64InstEmulationTests/TestArm64InstEmulation.TestRegisterDoubleSpills (1186 of 2153)
PASS: lldb-api :: lang/c/stepping/TestThreadStepping.py (1187 of 2153)
PASS: lldb-unit :: Utility/./UtilityTests/ConstStringTest.CompareConstString (1188 of 2153)
PASS: lldb-api :: commands/expression/ir-interpreter-phi-nodes/TestIRInterpreterPHINodes.py (1189 of 2153)
PASS: lldb-api :: lang/objcxx/hide-runtime-values/TestObjCXXHideRuntimeValues.py (1190 of 2153)
PASS: lldb-unit :: Language/Highlighting/./HighlighterTests/HighlighterTest.ClangBraces (1191 of 2153)
PASS: lldb-shell :: Heap/heap-cstr.test (1192 of 2153)
PASS: lldb-api :: functionalities/thread/concurrent_events/TestConcurrentSignalNWatchNBreak.py (1193 of 2153)
PASS: lldb-shell :: ObjectFile/PECOFF/section-types.yaml (1194 of 2153)
PASS: lldb-api :: driver/batch_mode/TestBatchMode.py (1195 of 2153)
PASS: lldb-api :: commands/expression/codegen-crash-import-def-arraytype-element/TestImportDefinitionArrayType.py (1196 of 2153)
PASS: lldb-unit :: Host/./HostTests/SocketTest.UDPGetConnectURI (1197 of 2153)
PASS: lldb-api :: lang/objc/real-definition/TestRealDefinition.py (1198 of 2153)
PASS: lldb-unit :: Utility/./UtilityTests/StringExtractorTest.DecodeHexU8_InvalidHex2 (1199 of 2153)
PASS: lldb-api :: functionalities/thread/exit_during_step/TestExitDuringStep.py (1200 of 2153)
PASS: lldb-api :: functionalities/signal/TestSendSignal.py (1201 of 2153)
PASS: lldb-unit :: Utility/./UtilityTests/ReproducerTest.SetCapture (1202 of 2153)
PASS: lldb-unit :: Utility/./UtilityTests/StringExtractorTest.GetHexBytesAvail_FullString (1203 of 2153)
PASS: lldb-shell :: SymbolFile/DWARF/DW_AT_data_bit_offset-DW_OP_stack_value.s (1204 of 2153)
PASS: lldb-unit :: UnwindAssembly/x86/./UnwindAssemblyx86Tests/Testx86AssemblyInspectionEngine.TestSimple32bitFrameFunction (1205 of 2153)
UNSUPPORTED: lldb-shell :: Process/Windows/exception_access_violation.cpp (1206 of 2153)
PASS: lldb-api :: functionalities/data-formatter/builtin-formats/TestBuiltinFormats.py (1207 of 2153)
PASS: lldb-api :: commands/target/select/TestTargetSelect.py (1208 of 2153)
PASS: lldb-unit :: Language/Highlighting/./HighlighterTests/HighlighterTest.Keywords (1209 of 2153)
PASS: lldb-unit :: Utility/./UtilityTests/SharedCluster.ClusterManager (1210 of 2153)
PASS: lldb-unit :: Utility/./UtilityTests/ArgsTest.AppendArguments (1211 of 2153)
PASS: lldb-unit :: Utility/./UtilityTests/FileSpecTest.EqualDotsWindows (1212 of 2153)
PASS: lldb-unit :: ScriptInterpreter/Python/./ScriptInterpreterPythonTests/PythonDataObjectsTest.TestPythonCallableInvoke (1213 of 2153)
PASS: lldb-api :: lang/cpp/stl/TestSTL.py (1214 of 2153)
PASS: lldb-unit :: Language/CPlusPlus/./LanguageCPlusPlusTests/CPlusPlusLanguage.MethodNameParsing (1215 of 2153)
PASS: lldb-unit :: ScriptInterpreter/Python/./ScriptInterpreterPythonTests/PythonDataObjectsTest.TestRun (1216 of 2153)
PASS: lldb-unit :: Utility/./UtilityTests/StringExtractorTest.GetHexBytes_Partial (1217 of 2153)
PASS: lldb-api :: functionalities/testid/TestTestId.py (1218 of 2153)
PASS: lldb-shell :: Settings/TestSettingsWrite.test (1219 of 2153)
PASS: lldb-api :: lang/cpp/overloaded-functions/TestOverloadedFunctions.py (1220 of 2153)
PASS: lldb-api :: functionalities/data-formatter/data-formatter-skip-summary/TestDataFormatterSkipSummary.py (1221 of 2153)
PASS: lldb-api :: functionalities/thread/concurrent_events/TestConcurrentTwoBreakpointsOneWatchpoint.py (1222 of 2153)
PASS: lldb-unit :: ScriptInterpreter/Python/./ScriptInterpreterPythonTests/PythonDataObjectsTest.TestResetting (1223 of 2153)
PASS: lldb-unit :: Host/./HostTests/SocketTest.UDPConnect (1224 of 2153)
PASS: lldb-api :: commands/expression/no-deadlock/TestExprDoesntBlock.py (1225 of 2153)
PASS: lldb-shell :: Reproducer/Functionalities/TestImageList.test (1226 of 2153)
PASS: lldb-shell :: Settings/TestDisassemblyFormat.test (1227 of 2153)
PASS: lldb-unit :: Utility/./UtilityTests/ScalarTest.Promotion (1228 of 2153)
PASS: lldb-api :: functionalities/inferior-changed/TestInferiorChanged.py (1229 of 2153)
PASS: lldb-unit :: Utility/./UtilityTests/DataExtractorTest.GetMaxU64 (1230 of 2153)
PASS: lldb-shell :: SymbolFile/DWARF/find-method-local-struct.cpp (1231 of 2153)
PASS: lldb-unit :: Utility/./UtilityTests/ArgsTest.TestAppendArg (1232 of 2153)
PASS: lldb-shell :: Quit/TestQuitExitCodeHexA.test (1233 of 2153)
PASS: lldb-api :: lang/cpp/bool/TestCPPBool.py (1234 of 2153)
PASS: lldb-api :: commands/expression/inline-namespace/TestInlineNamespace.py (1235 of 2153)
PASS: lldb-shell :: Quit/TestQuitExitCode-30.test (1236 of 2153)
PASS: lldb-shell :: Breakpoint/debug_rnglist_offset_pair.test (1237 of 2153)
PASS: lldb-unit :: UnwindAssembly/x86/./UnwindAssemblyx86Tests/Testx86AssemblyInspectionEngine.TestPushECX (1238 of 2153)
PASS: lldb-unit :: Utility/./UtilityTests/TimerTest.CategoryTimes (1239 of 2153)
PASS: lldb-api :: tools/lldb-server/TestGdbRemoteSingleStep.py (1240 of 2153)
PASS: lldb-unit :: Utility/./UtilityTests/ConstStringTest.MangledCounterpart (1241 of 2153)
PASS: lldb-unit :: Symbol/./SymbolTests/TestTypeSystemClang.TemplateArguments (1242 of 2153)
PASS: lldb-api :: api/command-return-object/TestSBCommandReturnObject.py (1243 of 2153)
PASS: lldb-unit :: Utility/./UtilityTests/FileSpecTest.CopyByAppendingPathComponent (1244 of 2153)
PASS: lldb-unit :: Utility/./UtilityTests/VMRange.IsValid (1245 of 2153)
PASS: lldb-unit :: Utility/./UtilityTests/ScalarTest.Equality (1246 of 2153)
PASS: lldb-shell :: Reproducer/TestDSYM.test (1247 of 2153)
PASS: lldb-api :: macosx/queues/TestQueues.py (1248 of 2153)
PASS: lldb-shell :: SymbolFile/NativePDB/function-types-calling-conv.cpp (1249 of 2153)
PASS: lldb-unit :: Utility/./UtilityTests/SerializationRountripTest.SerializeDeserializePodReferences (1250 of 2153)
PASS: lldb-api :: functionalities/load_unload/TestLoadUnload.py (1251 of 2153)
UNSUPPORTED: lldb-api :: functionalities/thread/thread_specific_break_plus_condition/TestThreadSpecificBpPlusCondition.py (1252 of 2153)
PASS: lldb-unit :: Utility/./UtilityTests/RangeDataVector.FindEntryThatContains (1253 of 2153)
PASS: lldb-unit :: Core/./LLDBCoreTests/UniqueCStringMap.NoDefaultConstructor (1254 of 2153)
PASS: lldb-api :: lang/objc/forward-decl/TestForwardDecl.py (1255 of 2153)
PASS: lldb-api :: lang/cpp/accelerator-table/TestCPPAccelerator.py (1256 of 2153)
PASS: lldb-shell :: SymbolFile/DWARF/dwarf5-index-is-used.cpp (1257 of 2153)
PASS: lldb-unit :: Host/./HostTests/NativeProcessProtocolTest.SetBreakpointFailVerify (1258 of 2153)
PASS: lldb-shell :: ObjectFile/ELF/PT_LOAD-empty.yaml (1259 of 2153)
PASS: lldb-unit :: Expression/./ExpressionTests/DiagnosticManagerTest.PutStringSeverities (1260 of 2153)
PASS: lldb-unit :: Host/./HostTests/ConnectionFileDescriptorTest.TCPGetURIv6 (1261 of 2153)
XFAIL: lldb-shell :: Register/x86-mm-xmm-write.test (1262 of 2153)
PASS: lldb-api :: lang/cpp/breakpoint-commands/TestCPPBreakpointCommands.py (1263 of 2153)
PASS: lldb-unit :: UnwindAssembly/x86/./UnwindAssemblyx86Tests/Testx86AssemblyInspectionEngine.TestPopESI (1264 of 2153)
PASS: lldb-unit :: Utility/./UtilityTests/StreamTeeTest.SetStreamAtIndexOutOfBounds (1265 of 2153)
PASS: lldb-api :: lang/cpp/class_types/TestClassTypes.py (1266 of 2153)
PASS: lldb-api :: commands/expression/persistent_ptr_update/TestPersistentPtrUpdate.py (1267 of 2153)
PASS: lldb-api :: lang/cpp/signed_types/TestSignedTypes.py (1268 of 2153)
PASS: lldb-api :: functionalities/step_scripted/TestStepScripted.py (1269 of 2153)
UNSUPPORTED: lldb-api :: commands/trace/TestTraceSchema.py (1270 of 2153)
PASS: lldb-api :: functionalities/breakpoint/breakpoint_language/TestBreakpointLanguage.py (1271 of 2153)
PASS: lldb-unit :: Target/./TargetTests/RemoteAwarePlatformTest.TestResolveExecutabelOnClientByPlatform (1272 of 2153)
PASS: lldb-api :: functionalities/breakpoint/breakpoint_ids/TestBreakpointIDs.py (1273 of 2153)
PASS: lldb-api :: lang/objcxx/class-name-clash/TestNameClash.py (1274 of 2153)
PASS: lldb-api :: functionalities/thread/create_after_attach/TestCreateAfterAttach.py (1275 of 2153)
PASS: lldb-unit :: Language/Highlighting/./HighlighterTests/HighlighterTest.DefaultHighlighter (1276 of 2153)
PASS: lldb-unit :: Utility/./UtilityTests/StreamTest.AddressPrefix (1277 of 2153)
PASS: lldb-unit :: Utility/./UtilityTests/RangeTest.NotEqualInvalid (1278 of 2153)
PASS: lldb-api :: lang/objc/objc-ivar-offsets/TestObjCIvarOffsets.py (1279 of 2153)
PASS: lldb-unit :: Process/./ProcessEventDataTests/ProcessEventDataTest.DoOnRemoval (1280 of 2153)
PASS: lldb-api :: python_api/process/read-mem-cstring/TestReadMemCString.py (1281 of 2153)
PASS: lldb-unit :: Utility/./UtilityTests/ArgsTest.GetArgumentArrayRef (1282 of 2153)
PASS: lldb-unit :: Utility/./UtilityTests/AnsiTerminal.Incomplete (1283 of 2153)
PASS: lldb-shell :: Commands/CommandScriptImmediateOutput/CommandScriptImmediateOutputConsole.test (1284 of 2153)
PASS: lldb-api :: functionalities/thread/concurrent_events/TestConcurrentDelaySignalWatch.py (1285 of 2153)
PASS: lldb-api :: commands/expression/xvalue/TestXValuePrinting.py (1286 of 2153)
PASS: lldb-unit :: Symbol/./SymbolTests/TestClangASTImporter.MetadataPropagationAfterCopying (1287 of 2153)
PASS: lldb-unit :: ObjectFile/Breakpad/./ObjectFileBreakpadTests/InfoRecord.parse (1288 of 2153)
PASS: lldb-unit :: Utility/./UtilityTests/SerializationRountripTest.SerializeDeserializeCString (1289 of 2153)
PASS: lldb-shell :: SymbolFile/Breakpad/symtab.test (1290 of 2153)
UNSUPPORTED: lldb-api :: functionalities/breakpoint/hardware_breakpoints/write_memory_with_hw_breakpoint/TestWriteMemoryWithHWBreakpoint.py (1291 of 2153)
PASS: lldb-api :: functionalities/breakpoint/breakpoint_hit_count/TestBreakpointHitCount.py (1292 of 2153)
PASS: lldb-unit :: Utility/./UtilityTests/BinaryStreamTest.PutULEB128ThreeBytes (1293 of 2153)
PASS: lldb-unit :: Process/gdb-remote/./ProcessGdbRemoteTests/GDBRemoteClientBaseTest.SendContinueAndInterrupt2PacketBug (1294 of 2153)
PASS: lldb-api :: commands/command/script/TestCommandScript.py (1295 of 2153)
FAIL: lldb-api :: commands/target/stop-hooks/TestStopHookScripted.py (1296 of 2153)
******************** TEST 'lldb-api :: commands/target/stop-hooks/TestStopHookScripted.py' FAILED ********************
Script:
--
/usr/local/Frameworks/Python.framework/Versions/3.7/bin/python3.7 /Users/buildslave/jenkins/workspace/lldb-cmake/llvm-project/lldb/test/API/dotest.py -s /Users/buildslave/jenkins/workspace/lldb-cmake/lldb-build/lldb-test-traces -S nm -u CXXFLAGS -u CFLAGS --codesign-identity - --server /Users/buildslave/jenkins/workspace/lldb-cmake/lldb-build/./bin/debugserver --arch x86_64 --build-dir /Users/buildslave/jenkins/workspace/lldb-cmake/lldb-build/lldb-test-build.noindex -s=/Users/buildslave/jenkins/workspace/lldb-cmake/test/logs -t --env TERM=vt100 --env LLVM_LIBS_DIR=/Users/buildslave/jenkins/workspace/lldb-cmake/lldb-build/./lib --arch x86_64 --build-dir /Users/buildslave/jenkins/workspace/lldb-cmake/lldb-build/lldb-test-build.noindex --lldb-module-cache-dir /Users/buildslave/jenkins/workspace/lldb-cmake/lldb-build/lldb-test-build.noindex/module-cache-lldb/lldb-api --clang-module-cache-dir /Users/buildslave/jenkins/workspace/lldb-cmake/lldb-build/lldb-test-build.noindex/module-cache-clang/lldb-api --executable /Users/buildslave/jenkins/workspace/lldb-cmake/lldb-build/./bin/lldb --compiler /Users/buildslave/jenkins/workspace/lldb-cmake/lldb-build/./bin/clang --dsymutil /Users/buildslave/jenkins/workspace/lldb-cmake/lldb-build/./bin/dsymutil --filecheck /Users/buildslave/jenkins/workspace/lldb-cmake/lldb-build/./bin/FileCheck --yaml2obj /Users/buildslave/jenkins/workspace/lldb-cmake/lldb-build/./bin/yaml2obj --lldb-libs-dir /Users/buildslave/jenkins/workspace/lldb-cmake/lldb-build/./lib /Users/buildslave/jenkins/workspace/lldb-cmake/llvm-project/lldb/test/API/commands/target/stop-hooks -p TestStopHookScripted.py
--
Exit Code: 1

Hide Details

Command Output (stdout): -- lldb version 12.0.99 clang revision c8f6c0f961eed1301b33b8af53d075542f7723c8 llvm revision c8f6c0f961eed1301b33b8af53d075542f7723c8 libstdcxx tests will not be run because: Don't know how to build with libstdcxx on macosx Skipping following debug info categories: ['dwo'] Running command: target stop-hook add -P stop_hook.stop_handler -k increment -v 5 -k return_false -v 1 -n step_out_of_me I have stopped 1 times.

Hide Details

-- Command Output (stderr): --

Hide Details

Session logs for test failures/errors/unexpected successes will go into directory '/Users/buildslave/jenkins/workspace/lldb-cmake/test/logs' Change dir to: /Users/buildslave/jenkins/workspace/lldb-cmake/llvm-project/lldb/test/API/commands/target/stop-hooks runCmd: settings clear -all output:

Hide Details

runCmd: settings set symbols.enable-external-lookup false output:

Hide Details

runCmd: settings set target.inherit-tcc true output:

Hide Details

runCmd: settings set target.auto-apply-fixits false output:

Hide Details

runCmd: settings set plugin.process.gdb-remote.packet-timeout 60 output:

Hide Details

runCmd: settings set symbols.clang-modules-cache-path "/Users/buildslave/jenkins/workspace/lldb-cmake/lldb-build/lldb-test-build.noindex/module-cache-lldb/lldb-api" output:

Hide Details

runCmd: settings set use-color false output:

Hide Details

runCmd: setting set target.prefer-dynamic-value no-dynamic-values output:

Hide Details

FAIL: LLDB (/Users/buildslave/jenkins/workspace/lldb-cmake/lldb-build/bin/clang-x86_64) :: test_stop_hooks_scripted_return_false (TestStopHookScripted.TestStopHooks) <bound method SBProcess.Kill of <lldb.SBProcess; proxy of <Swig Object of type 'lldb::SBProcess *' at 0x1122104e0> >>: success

Hide Details

Restore dir to: /Users/buildslave/jenkins/workspace/lldb-cmake/lldb-build/tools/lldb/test ====================================================================== FAIL: test_stop_hooks_scripted_return_false (TestStopHookScripted.TestStopHooks) Test that the returning False from a stop hook works ---------------------------------------------------------------------- Traceback (most recent call last): File "/Users/buildslave/jenkins/workspace/lldb-cmake/llvm-project/lldb/test/API/commands/target/stop-hooks/TestStopHookScripted.py", line 54, in test_stop_hooks_scripted_return_false self.do_test_auto_continue(True) File "/Users/buildslave/jenkins/workspace/lldb-cmake/llvm-project/lldb/test/API/commands/target/stop-hooks/TestStopHookScripted.py", line 91, in do_test_auto_continue self.assertEqual("main", func_name, "Didn't stop at the expected function.") AssertionError: 'main' != 'step_out_of_me' - main+ step_out_of_me : Didn't stop at the expected function. Config=x86_64-/Users/buildslave/jenkins/workspace/lldb-cmake/lldb-build/bin/clang ---------------------------------------------------------------------- Ran 1 test in 1.398s

Hide Details

RESULT: FAILED (0 passes, 1 failures, 0 errors, 0 skipped, 0 expected failures, 0 unexpected successes)

Hide Details

--

Hide Details

******************** PASS: lldb-unit :: UnwindAssembly/x86/./UnwindAssemblyx86Tests/Testx86AssemblyInspectionEngine.TestSimplex86_64Augmented (1297 of 2153) PASS: lldb-shell :: Host/TestCustomShell.test (1298 of 2153) PASS: lldb-shell :: SymbolFile/DWARF/dwarf5_locations.s (1299 of 2153) PASS: lldb-unit :: SymbolFile/DWARF/./SymbolFileDWARFTests/SymbolFileDWARFTests.TestAbilitiesForDWARF (1300 of 2153) PASS: lldb-unit :: Expression/./ExpressionTests/CppModuleConfigurationTest.MissingLibCpp (1301 of 2153) PASS: lldb-unit :: Utility/./UtilityTests/FileSpecTest.RemoveLastPathComponent (1302 of 2153) PASS: lldb-unit :: Utility/./UtilityTests/ArgsTest.ReplaceArgumentAtIndexEqual (1303 of 2153) PASS: lldb-api :: commands/expression/import-std-module/vector-of-vectors/TestVectorOfVectorsFromStdModule.py (1304 of 2153) PASS: lldb-unit :: Process/minidump/./LLDBMinidumpTests/MinidumpParserTest.GetMemoryRegionInfoFromMemoryList (1305 of 2153) PASS: lldb-unit :: Interpreter/./InterpreterTests/OptionArgParserTest.toBoolean (1306 of 2153) PASS: lldb-api :: commands/expression/test/TestExprs2.py (1307 of 2153) PASS: lldb-shell :: Driver/TestConvenienceVariables.test (1308 of 2153) PASS: lldb-unit :: ScriptInterpreter/Python/./ScriptInterpreterPythonTests/PythonDataObjectsTest.TestPythonStringToStructuredString (1309 of 2153) PASS: lldb-api :: functionalities/breakpoint/breakpoint_command/TestRegexpBreakCommand.py (1310 of 2153) PASS: lldb-api :: lang/objc/foundation/TestRuntimeTypes.py (1311 of 2153) PASS: lldb-unit :: Utility/./UtilityTests/Flags.AnyClear (1312 of 2153) PASS: lldb-api :: python_api/sbvalue_const_addrof/TestSBValueConstAddrOf.py (1313 of 2153) PASS: lldb-api :: commands/command/invalid-args/TestInvalidArgsCommand.py (1314 of 2153) PASS: lldb-unit :: SymbolFile/DWARF/./SymbolFileDWARFTests/SymbolFileDWARFTests.TestAbbrevOutOfOrder (1315 of 2153) PASS: lldb-unit :: Symbol/./SymbolTests/TestTypeSystemClang.TestGetBasicTypeFromEnum (1316 of 2153) PASS: lldb-api :: lang/objc/objc-runtime-ivars/TestRuntimeIvars.py (1317 of 2153) PASS: lldb-unit :: Utility/./UtilityTests/StreamTeeTest.CopyConstructor (1318 of 2153) PASS: lldb-unit :: SymbolFile/DWARF/./SymbolFileDWARFTests/SymbolFileDWARFTests.ParseArangesNonzeroSegmentSize (1319 of 2153) PASS: lldb-api :: functionalities/wrong_commands/TestWrongCommands.py (1320 of 2153) PASS: lldb-unit :: ScriptInterpreter/Python/./ScriptInterpreterPythonTests/PythonDataObjectsTest.TestPythonDictionaryToStructuredDictionary (1321 of 2153) PASS: lldb-unit :: Process/gdb-remote/./ProcessGdbRemoteTests/GDBRemoteCommunicationClientTest.ReadRegister (1322 of 2153) UNSUPPORTED: lldb-shell :: SymbolFile/PDB/calling-conventions.test (1323 of 2153) PASS: lldb-api :: lang/cpp/class_static/TestStaticVariables.py (1324 of 2153) PASS: lldb-api :: functionalities/thread/concurrent_events/TestConcurrentNWatchNBreak.py (1325 of 2153) PASS: lldb-shell :: ObjectFile/ELF/duplicate-section.yaml (1326 of 2153) UNSUPPORTED: lldb-shell :: SymbolFile/PDB/variables.test (1327 of 2153) PASS: lldb-api :: lang/cpp/template-specialization-type/TestTemplateSpecializationType.py (1328 of 2153) PASS: lldb-shell :: Watchpoint/SetErrorCases.test (1329 of 2153) PASS: lldb-unit :: ScriptInterpreter/Python/./ScriptInterpreterPythonTests/PythonDataObjectsTest.TestPythonStringToStr (1330 of 2153) PASS: lldb-api :: python_api/frame/get-variables/TestGetVariables.py (1331 of 2153) PASS: lldb-unit :: Utility/./UtilityTests/StringListTest.JoinThree (1332 of 2153) PASS: lldb-api :: functionalities/data-formatter/data-formatter-categories/TestDataFormatterCategories.py (1333 of 2153) PASS: lldb-shell :: Driver/TestPositionalArgs.test (1334 of 2153) PASS: lldb-unit :: SymbolFile/DWARF/./SymbolFileDWARFTests/SymbolFileDWARFTests.TestAbbrevOrder1Start5 (1335 of 2153) PASS: lldb-shell :: SymbolFile/DWARF/find-basic-function.cpp (1336 of 2153) PASS: lldb-api :: commands/expression/rdar42038760/TestScalarURem.py (1337 of 2153) PASS: lldb-shell :: Quit/TestQuitExitCodeImplicit0.test (1338 of 2153) PASS: lldb-api :: python_api/class_members/TestSBTypeClassMembers.py (1339 of 2153) PASS: lldb-unit :: ScriptInterpreter/Python/./ScriptInterpreterPythonTests/PythonDataObjectsTest.TestPythonString (1340 of 2153) PASS: lldb-unit :: Utility/./UtilityTests/UriParserTest.MinimalPort (1341 of 2153) PASS: lldb-shell :: ObjectFile/Breakpad/discontiguous-sections.test (1342 of 2153) PASS: lldb-unit :: Utility/./UtilityTests/CompletionRequest.DuplicateFilteringWithComments (1343 of 2153) UNSUPPORTED: lldb-api :: commands/register/register/intel_xtended_registers/mpx_bound_violation/TestBoundViolation.py (1344 of 2153) PASS: lldb-unit :: Utility/./UtilityTests/DataExtractorTest.GetBitfield (1345 of 2153) PASS: lldb-unit :: Utility/./UtilityTests/UriParserTest.BracketedHostnamePort (1346 of 2153) PASS: lldb-unit :: Utility/./UtilityTests/StreamTest.PutCString (1347 of 2153) PASS: lldb-api :: lang/cpp/namespace_conflicts/TestNamespaceConflicts.py (1348 of 2153) PASS: lldb-unit :: ScriptInterpreter/Python/./ScriptInterpreterPythonTests/PythonDataObjectsTest.TestExtractingUInt64ThroughStructuredData (1349 of 2153) PASS: lldb-unit :: Utility/./UtilityTests/PassiveReplayTest.InstrumentedFoo (1350 of 2153) PASS: lldb-api :: tools/lldb-server/inferior-crash/TestGdbRemoteSegFault.py (1351 of 2153) PASS: lldb-unit :: SymbolFile/NativePDB/./SymbolFileNativePDBTests/PDBFPOProgramToDWARFExpressionTests.UnknownOp (1352 of 2153) PASS: lldb-api :: lang/cpp/exceptions/TestCPPExceptionBreakpoints.py (1353 of 2153) UNSUPPORTED: lldb-api :: commands/trace/TestTraceLoad.py (1354 of 2153) UNSUPPORTED: lldb-shell :: ScriptInterpreter/Lua/convenience_variables.test (1355 of 2153) PASS: lldb-api :: functionalities/rerun/TestRerun.py (1356 of 2153) PASS: lldb-api :: commands/expression/import-std-module/basic/TestImportStdModule.py (1357 of 2153) PASS: lldb-api :: functionalities/avoids-fd-leak/TestFdLeak.py (1358 of 2153) PASS: lldb-unit :: ObjectFile/MachO/./ObjectFileMachOTests/ObjectFileMachOTest.ModuleFromSharedCacheInfo (1359 of 2153) PASS: lldb-unit :: Utility/./UtilityTests/StreamTest.AddressRange (1360 of 2153) PASS: lldb-unit :: UnwindAssembly/x86/./UnwindAssemblyx86Tests/Testx86AssemblyInspectionEngine.TestAddRSP (1361 of 2153) PASS: lldb-unit :: Utility/./UtilityTests/StreamTest.ChangingByteOrder (1362 of 2153) PASS: lldb-shell :: Commands/command-disassemble-process.yaml (1363 of 2153) PASS: lldb-unit :: Utility/./UtilityTests/XcodeSDKTest.MergeTest (1364 of 2153) PASS: lldb-shell :: ScriptInterpreter/Python/crashlog.test (1365 of 2153) PASS: lldb-api :: commands/version/TestVersion.py (1366 of 2153) UNSUPPORTED: lldb-api :: tools/lldb-server/registers-target-xml-reading/TestGdbRemoteTargetXmlPacket.py (1367 of 2153) PASS: lldb-api :: lang/cpp/llvm-style/TestLLVMStyle.py (1368 of 2153) UNSUPPORTED: lldb-api :: tools/lldb-server/platform-process-connect/TestPlatformProcessConnect.py (1369 of 2153) PASS: lldb-api :: commands/expression/import-std-module/deque-basic/TestDequeFromStdModule.py (1370 of 2153) PASS: lldb-unit :: Utility/./UtilityTests/StringExtractorTest.GetHexU8_Extra (1371 of 2153) PASS: lldb-api :: functionalities/data-formatter/data-formatter-objc/TestDataFormatterObjCNSError.py (1372 of 2153) PASS: lldb-unit :: Utility/./UtilityTests/OptionsWithRawTest.WhitespaceInput (1373 of 2153) PASS: lldb-api :: macosx/lc-note/kern-ver-str/TestKernVerStrLCNOTE.py (1374 of 2153) PASS: lldb-unit :: SymbolFile/NativePDB/./SymbolFileNativePDBTests/PDBFPOProgramToDWARFExpressionTests.MultipleIndependentAssignments (1375 of 2153) PASS: lldb-api :: commands/target/dump-symtab-demangle/TestDumpSymtabDemangle.py (1376 of 2153) PASS: lldb-api :: python_api/debugger/TestDebuggerAPI.py (1377 of 2153) PASS: lldb-api :: commands/expression/fixits/TestFixIts.py (1378 of 2153) PASS: lldb-unit :: DataFormatter/./LLDBFormatterTests/TypeMatcherTests.GetMatchStringExactName (1379 of 2153) PASS: lldb-shell :: SymbolFile/DWARF/dwp.s (1380 of 2153) PASS: lldb-api :: functionalities/data-formatter/data-formatter-stl/libcxx/unique_ptr/TestDataFormatterLibcxxUniquePtr.py (1381 of 2153) PASS: lldb-unit :: ObjectFile/ELF/./ObjectFileELFTests/ObjectFileELFTest.GetSymtab_NoSymEntryPointArmAddressClass (1382 of 2153) PASS: lldb-unit :: Utility/./UtilityTests/StringListTest.JoinEmpty (1383 of 2153) PASS: lldb-unit :: Utility/./UtilityTests/ScalarTest.ExtractBitfield (1384 of 2153) PASS: lldb-shell :: SymbolFile/dissassemble-entry-point.s (1385 of 2153) UNSUPPORTED: lldb-api :: linux/add-symbols/TestTargetSymbolsAddCommand.py (1386 of 2153) PASS: lldb-api :: commands/platform/process/list/TestProcessList.py (1387 of 2153) PASS: lldb-api :: python_api/section/TestSectionAPI.py (1388 of 2153) PASS: lldb-api :: functionalities/tsan/thread_leak/TestTsanThreadLeak.py (1389 of 2153) PASS: lldb-api :: functionalities/target_var/TestTargetVar.py (1390 of 2153) PASS: lldb-shell :: Breakpoint/dummy-target.test (1391 of 2153) UNSUPPORTED: lldb-api :: functionalities/data-formatter/data-formatter-stl/libstdcpp/smart_ptr/TestDataFormatterStdSmartPtr.py (1392 of 2153) PASS: lldb-api :: functionalities/data-formatter/varscript_formatting/TestDataFormatterVarScriptFormatting.py (1393 of 2153) PASS: lldb-shell :: ObjectFile/ELF/avr-basic-info.yaml (1394 of 2153) PASS: lldb-shell :: SymbolFile/DWARF/split-dwarf-inlining.cpp (1395 of 2153) PASS: lldb-api :: commands/expression/two-files/TestObjCTypeQueryFromOtherCompileUnit.py (1396 of 2153) PASS: lldb-api :: functionalities/type_completion/TestTypeCompletion.py (1397 of 2153) UNSUPPORTED: lldb-api :: lang/cpp/static_members/TestCPPStaticMembers.py (1398 of 2153) PASS: lldb-api :: commands/expression/timeout/TestCallWithTimeout.py (1399 of 2153) XFAIL: lldb-shell :: Register/x86-mm-xmm-read.test (1400 of 2153) PASS: lldb-unit :: Utility/./UtilityTests/StringExtractorTest.GetHexU8_Underflow2 (1401 of 2153) PASS: lldb-unit :: Utility/./UtilityTests/LogChannelEnabledTest.log_options (1402 of 2153) PASS: lldb-api :: functionalities/mtc/simple/TestMTCSimple.py (1403 of 2153) PASS: lldb-unit :: Target/./TargetTests/ExecutionContextTest.GetByteOrderProcess (1404 of 2153) PASS: lldb-api :: functionalities/show_location/TestShowLocationDwarf5.py (1405 of 2153) PASS: lldb-api :: commands/expression/function_template_specialization_temp_args/TestFunctionTemplateSpecializationTempArgs.py (1406 of 2153) PASS: lldb-unit :: UnwindAssembly/x86/./UnwindAssemblyx86Tests/Testx86AssemblyInspectionEngine.TestPushRBP (1407 of 2153) PASS: lldb-unit :: Utility/./UtilityTests/StringExtractorTest.GetHexBytesAvail (1408 of 2153) PASS: lldb-unit :: Utility/./UtilityTests/RangeVector.CombineConsecutiveRanges (1409 of 2153) PASS: lldb-unit :: debugserver/./debugserverTests/JSON.Parse (1410 of 2153) PASS: lldb-shell :: ObjectFile/PECOFF/basic-info.yaml (1411 of 2153) PASS: lldb-shell :: SymbolFile/NativePDB/source-list.cpp (1412 of 2153) PASS: lldb-unit :: Process/gdb-remote/./ProcessGdbRemoteTests/GDBRemoteClientBaseTest.SendContinueAndWait (1413 of 2153) PASS: lldb-shell :: SymbolFile/Breakpad/line-table-mixed-path-styles.test (1414 of 2153) PASS: lldb-api :: lang/cpp/symbols/TestSymbols.py (1415 of 2153) PASS: lldb-shell :: Quit/TestQuitExitCode30.test (1416 of 2153) PASS: lldb-api :: commands/apropos/with-process/TestAproposWithProcess.py (1417 of 2153) PASS: lldb-shell :: Minidump/dump-all.test (1418 of 2153) PASS: lldb-unit :: ObjectFile/PECOFF/./ObjectFilePECOFFTests/PECallFrameInfoTest.Frame_reg_eh (1419 of 2153) PASS: lldb-shell :: SymbolFile/DWARF/gnu-style-compression.cpp (1420 of 2153) PASS: lldb-unit :: Utility/./UtilityTests/ArgsTest.DoubleQuotedItem (1421 of 2153) PASS: lldb-unit :: Utility/./UtilityTests/StreamTest.PutBytesAsRawHex8ToLittleEndian (1422 of 2153) PASS: lldb-unit :: Utility/./UtilityTests/StreamTest.PutHex64ByteOrderBig (1423 of 2153) PASS: lldb-unit :: Process/gdb-remote/./ProcessGdbRemoteTests/GDBRemoteCommunicationClientTest.SendGetDataPacket (1424 of 2153) PASS: lldb-api :: python_api/sbenvironment/TestSBEnvironment.py (1425 of 2153) PASS: lldb-unit :: debugserver/./debugserverTests/RNBSocket.LoopBackListenIPv4 (1426 of 2153) PASS: lldb-unit :: Disassembler/./DisassemblerTests/TestArm64Disassembly.TestArmv81Instruction (1427 of 2153) PASS: lldb-unit :: Utility/./UtilityTests/RangeTest.EqualInvalid (1428 of 2153) PASS: lldb-unit :: Utility/./UtilityTests/StringListTest.JoinNonSpace (1429 of 2153) PASS: lldb-shell :: SymbolFile/DWARF/anon_class_w_and_wo_export_symbols.ll (1430 of 2153) PASS: lldb-unit :: Utility/./UtilityTests/UUIDTest.StringConverion (1431 of 2153) PASS: lldb-unit :: Utility/./UtilityTests/StringListTest.JoinMultiCharSeparator (1432 of 2153) PASS: lldb-unit :: Utility/./UtilityTests/Predicate.WaitForValueNotEqualTo (1433 of 2153) PASS: lldb-api :: lang/objc/foundation/TestObjCMethodsString.py (1434 of 2153) PASS: lldb-unit :: Core/./LLDBCoreTests/StreamCallbackTest.Callback (1435 of 2153) PASS: lldb-unit :: Utility/./UtilityTests/ArgsTest.ReplaceArgumentAtIndexOutOfRange (1436 of 2153) PASS: lldb-unit :: Utility/./UtilityTests/StringListTest.InsertStringAtIndexStart (1437 of 2153) PASS: lldb-unit :: Utility/./UtilityTests/StringExtractorTest.DecodeHexU8_InvalidHex (1438 of 2153) PASS: lldb-api :: lang/objc/objc-new-syntax/TestObjCNewSyntaxLiteral.py (1439 of 2153) PASS: lldb-unit :: Symbol/./SymbolTests/TestClangASTImporter.CompleteFwdDeclWithOtherOrigin (1440 of 2153) PASS: lldb-unit :: Utility/./UtilityTests/StreamTeeTest.Constructor2Streams (1441 of 2153) PASS: lldb-shell :: Commands/command-stop-hook-output.test (1442 of 2153) PASS: lldb-unit :: Utility/./UtilityTests/UriParserTest.SchemeHostSeparator (1443 of 2153) PASS: lldb-unit :: Utility/./UtilityTests/RegularExpression.Valid (1444 of 2153) PASS: lldb-api :: commands/log/basic/TestLogging.py (1445 of 2153) PASS: lldb-unit :: Utility/./UtilityTests/RangeDataVector.CustomSort (1446 of 2153) PASS: lldb-unit :: Utility/./UtilityTests/StringListTest.Join (1447 of 2153) PASS: lldb-unit :: Utility/./UtilityTests/PassiveReplayTest.InstrumentedBar (1448 of 2153) PASS: lldb-unit :: debugserver/./debugserverTests/RNBSocket.AnyListen (1449 of 2153) PASS: lldb-shell :: ExecControl/StopHook/stop-hook.test (1450 of 2153) UNSUPPORTED: lldb-shell :: SymbolFile/DWARF/debug-types-expressions.test (1451 of 2153) PASS: lldb-unit :: Utility/./UtilityTests/OptionsWithRawTest.ArgsButNoLeadingDash (1452 of 2153) PASS: lldb-shell :: Register/x86-64-gp-read.test (1453 of 2153) PASS: lldb-unit :: Host/./HostTests/NativeProcessProtocolTest.SetBreakpoint (1454 of 2153) PASS: lldb-api :: tools/lldb-server/TestGdbRemoteHostInfo.py (1455 of 2153) PASS: lldb-unit :: Utility/./UtilityTests/StringExtractorTest.GetHexU8_InvalidHex (1456 of 2153) PASS: lldb-unit :: Utility/./UtilityTests/StringListTest.SplitIntoLines (1457 of 2153) PASS: lldb-api :: python_api/thread/TestThreadAPI.py (1458 of 2153) PASS: lldb-api :: functionalities/tail_call_frames/thread_step_out_or_return/TestSteppingOutWithArtificialFrames.py (1459 of 2153) PASS: lldb-unit :: Utility/./UtilityTests/OptionsWithRawTest.WhitespaceSuffix (1460 of 2153) PASS: lldb-unit :: Process/gdb-remote/./ProcessGdbRemoteTests/GDBRemoteClientBaseTest.SendContinueAndAsyncSignal (1461 of 2153) PASS: lldb-shell :: BuildScript/script-args.test (1462 of 2153) PASS: lldb-unit :: Utility/./UtilityTests/RangeTest.SlideZero (1463 of 2153) PASS: lldb-unit :: Host/./HostTests/FileSystemTest.Exists (1464 of 2153) PASS: lldb-unit :: Utility/./UtilityTests/VASprintfTest.EncodingError (1465 of 2153) PASS: lldb-unit :: Utility/./UtilityTests/StreamTest.Indent (1466 of 2153) PASS: lldb-unit :: Host/./HostTests/SocketTest.DomainGetConnectURI (1467 of 2153) PASS: lldb-unit :: Process/gdb-remote/./ProcessGdbRemoteTests/GDBRemoteCommunicationServerTest.SendErrorResponse_ErrorList (1468 of 2153) PASS: lldb-api :: functionalities/data-formatter/data-formatter-stl/libcxx/map/TestDataFormatterLibccMap.py (1469 of 2153) PASS: lldb-api :: functionalities/backticks/TestBackticksWithoutATarget.py (1470 of 2153) PASS: lldb-unit :: Process/minidump/./LLDBMinidumpTests/MinidumpParserTest.FindMemoryRangeWithFullMemoryMinidump (1471 of 2153) PASS: lldb-api :: commands/expression/ignore-artificial-constructors/TestIgnoreArtificialConstructors.py (1472 of 2153) PASS: lldb-unit :: Utility/./UtilityTests/BinaryStreamTest.PutSLEB128ThreeBytes (1473 of 2153) PASS: lldb-api :: commands/expression/namespace_local_var_same_name_obj_c/TestNamespaceLocalVarSameNameObjC.py (1474 of 2153) PASS: lldb-api :: commands/quit/TestQuit.py (1475 of 2153) PASS: lldb-api :: lang/objc/exceptions/TestObjCExceptions.py (1476 of 2153) PASS: lldb-unit :: Utility/./UtilityTests/DataExtractorTest.GetMaxS64 (1477 of 2153) PASS: lldb-api :: macosx/indirect_symbol/TestIndirectSymbols.py (1478 of 2153) UNSUPPORTED: lldb-api :: benchmarks/expression/TestExpressionCmd.py (1479 of 2153) PASS: lldb-api :: lang/objc/objc-stepping/TestObjCStepping.py (1480 of 2153) PASS: lldb-unit :: SymbolFile/NativePDB/./SymbolFileNativePDBTests/PDBFPOProgramToDWARFExpressionTests.SingleAssignmentRegisterRef (1481 of 2153) PASS: lldb-api :: functionalities/data-formatter/data-formatter-stl/libcxx/queue/TestDataFormatterLibcxxQueue.py (1482 of 2153) PASS: lldb-shell :: ScriptInterpreter/None/none.test (1483 of 2153) PASS: lldb-unit :: Utility/./UtilityTests/UriParserTest.MinimalPath (1484 of 2153) PASS: lldb-unit :: Utility/./UtilityTests/GeneratorTest.YamlMultiProvider (1485 of 2153) PASS: lldb-unit :: Utility/./UtilityTests/DataExtractorTest.GetULEB128_bit63 (1486 of 2153) PASS: lldb-unit :: Utility/./UtilityTests/TildeExpressionResolver.ResolveFullPath (1487 of 2153) PASS: lldb-api :: lang/objc/variadic_methods/TestVariadicMethods.py (1488 of 2153) PASS: lldb-unit :: Process/minidump/./LLDBMinidumpTests/MinidumpParserTest.GetThreadContext_x86_64 (1489 of 2153) PASS: lldb-api :: lang/cpp/alignas_base_class/TestAlignAsBaseClass.py (1490 of 2153) PASS: lldb-api :: functionalities/data-formatter/data-formatter-objc/TestDataFormatterObjCNSContainer.py (1491 of 2153) PASS: lldb-api :: functionalities/thread/exit_during_expression/TestExitDuringExpression.py (1492 of 2153) PASS: lldb-unit :: ObjectFile/Breakpad/./ObjectFileBreakpadTests/StackWinRecord.parse (1493 of 2153) PASS: lldb-unit :: Expression/./ExpressionTests/ClangExpressionDeclMapTest.TestPersistentDeclLookup (1494 of 2153) PASS: lldb-unit :: SymbolFile/NativePDB/./SymbolFileNativePDBTests/PDBFPOProgramToDWARFExpressionTests.UnresolvedRegisterAssignmentReference (1495 of 2153) PASS: lldb-unit :: Utility/./UtilityTests/StreamTest.PutBytesAsRawHex8ToMixedEndian (1496 of 2153) PASS: lldb-api :: tools/lldb-server/TestGdbRemoteProcessInfo.py (1497 of 2153) PASS: lldb-shell :: Reproducer/TestMultipleTargets.test (1498 of 2153) PASS: lldb-api :: functionalities/gdb_remote_client/TestWriteMemory.py (1499 of 2153) PASS: lldb-api :: lang/objc/objc++/TestObjCXX.py (1500 of 2153) PASS: lldb-unit :: Utility/./UtilityTests/NameMatchesTest.StartsWith (1501 of 2153) PASS: lldb-unit :: UnwindAssembly/x86/./UnwindAssemblyx86Tests/Testx86AssemblyInspectionEngine.TestPopEBX (1502 of 2153) PASS: lldb-unit :: Expression/./ExpressionTests/ClangHostTest.MacOSX (1503 of 2153) PASS: lldb-shell :: SymbolFile/Breakpad/unwind-via-stack-win.test (1504 of 2153) PASS: lldb-unit :: Language/Highlighting/./HighlighterTests/HighlighterTest.ClangCursorPosInOtherToken (1505 of 2153) PASS: lldb-api :: lang/cpp/subst_template_type_param/TestSubstTemplateTypeParam.py (1506 of 2153) PASS: lldb-api :: functionalities/gdb_remote_client/TestNoWatchpointSupportInfo.py (1507 of 2153) PASS: lldb-api :: commands/frame/var-scope/TestFrameVariableScope.py (1508 of 2153) PASS: lldb-unit :: Utility/./UtilityTests/RecordReplayTest.InstrumentedBarPtr (1509 of 2153) PASS: lldb-api :: commands/watchpoints/watchpoint_commands/command/TestWatchpointCommandPython.py (1510 of 2153) PASS: lldb-unit :: ScriptInterpreter/Python/./ScriptInterpreterPythonTests/PythonDataObjectsTest.TestPythonListValueEquality (1511 of 2153) PASS: lldb-api :: functionalities/thread/concurrent_events/TestConcurrentSignalWatchBreak.py (1512 of 2153) PASS: lldb-unit :: UnwindAssembly/ARM64/./Arm64InstEmulationTests/TestArm64InstEmulation.TestCFARegisterTrackedAcrossJumps (1513 of 2153) PASS: lldb-unit :: Utility/./UtilityTests/ArgsTest.BareSingleQuote (1514 of 2153) PASS: lldb-api :: lang/c/complex/TestComplexC99.py (1515 of 2153) PASS: lldb-shell :: Minidump/fb-dump.test (1516 of 2153) UNSUPPORTED: lldb-api :: benchmarks/libcxxlist/TestBenchmarkLibcxxList.py (1517 of 2153) PASS: lldb-api :: lang/c/shared_lib/TestSharedLib.py (1518 of 2153) PASS: lldb-unit :: Utility/./UtilityTests/CompletionRequest.ShiftArguments (1519 of 2153) PASS: lldb-api :: lang/objc/modules-app-update/TestClangModulesAppUpdate.py (1520 of 2153) PASS: lldb-unit :: UnwindAssembly/x86/./UnwindAssemblyx86Tests/Testx86AssemblyInspectionEngine.TestDisassemblyJunkBytes (1521 of 2153) PASS: lldb-api :: lang/cpp/trivial_abi/TestTrivialABI.py (1522 of 2153) PASS: lldb-api :: functionalities/data-formatter/dump_dynamic/TestDumpDynamic.py (1523 of 2153) PASS: lldb-unit :: Symbol/./SymbolTests/TestTypeSystemClang.TestGetTypeClassTypeOf (1524 of 2153) PASS: lldb-unit :: Utility/./UtilityTests/BinaryStreamTest.PutSLEB128FourBytes (1525 of 2153) UNSUPPORTED: lldb-shell :: Register/x86-64-ymm16-read.test (1526 of 2153) PASS: lldb-unit :: Utility/./UtilityTests/StructuredDataTest.ParseJSONFromFile (1527 of 2153) PASS: lldb-unit :: Utility/./UtilityTests/StringListTest.JoinSingle (1528 of 2153) PASS: lldb-shell :: Reproducer/TestPythonImport.test (1529 of 2153) UNSUPPORTED: lldb-shell :: SymbolFile/PDB/pointers.test (1530 of 2153) PASS: lldb-api :: macosx/load-kext/TestLoadKext.py (1531 of 2153) PASS: lldb-shell :: Unwind/eh-frame-dwarf-unwind.test (1532 of 2153) PASS: lldb-api :: lang/c/step-target/TestStepTarget.py (1533 of 2153) PASS: lldb-shell :: Quit/TestQuitExitCodeHex0.test (1534 of 2153) PASS: lldb-api :: python_api/frame/inlines/TestInlinedFrame.py (1535 of 2153) PASS: lldb-api :: macosx/duplicate-archive-members/TestDuplicateMembers.py (1536 of 2153) PASS: lldb-api :: functionalities/gdb_remote_client/TestWasm.py (1537 of 2153) UNSUPPORTED: lldb-api :: tools/lldb-server/TestGdbRemoteModuleInfo.py (1538 of 2153) PASS: lldb-api :: lang/c/stepping/TestStepAndBreakpoints.py (1539 of 2153) PASS: lldb-api :: api/check_public_api_headers/TestPublicAPIHeaders.py (1540 of 2153) PASS: lldb-api :: lang/c/unions/TestUnionMembers.py (1541 of 2153) PASS: lldb-unit :: Utility/./UtilityTests/StructuredDataTest.StringDump (1542 of 2153) PASS: lldb-api :: functionalities/source-map/TestTargetSourceMap.py (1543 of 2153) PASS: lldb-unit :: Host/./HostTests/MainLoopTest.UnmonitoredSignal (1544 of 2153) PASS: lldb-unit :: UnwindAssembly/x86/./UnwindAssemblyx86Tests/Testx86AssemblyInspectionEngine.TestPushEDX (1545 of 2153) PASS: lldb-api :: functionalities/plugins/command_plugin/TestPluginCommands.py (1546 of 2153) PASS: lldb-shell :: SymbolFile/NativePDB/ast-methods.cpp (1547 of 2153) PASS: lldb-unit :: Language/CPlusPlus/./LanguageCPlusPlusTests/CPlusPlusLanguage.ExtractContextAndIdentifier (1548 of 2153) PASS: lldb-unit :: ScriptInterpreter/Python/./ScriptInterpreterPythonTests/PythonDataObjectsTest.TestPythonTupleInitializerList2 (1549 of 2153) PASS: lldb-api :: functionalities/breakpoint/scripted_bkpt/TestScriptedResolver.py (1550 of 2153) UNSUPPORTED: lldb-shell :: SymbolFile/PDB/ast-restore.test (1551 of 2153) PASS: lldb-api :: commands/command/nested_alias/TestNestedAlias.py (1552 of 2153) UNSUPPORTED: lldb-api :: functionalities/darwin_log/filter/regex/activity-chain/TestDarwinLogFilterRegexActivityChain.py (1553 of 2153) PASS: lldb-shell :: Expr/TestIRMemoryMap.test (1554 of 2153) PASS: lldb-unit :: Language/Highlighting/./HighlighterTests/HighlighterTest.ClangUnterminatedString (1555 of 2153) UNSUPPORTED: lldb-api :: benchmarks/startup/TestStartupDelays.py (1556 of 2153) PASS: lldb-api :: python_api/process/io/TestProcessIO.py (1557 of 2153) PASS: lldb-api :: functionalities/gdb_remote_client/TestStopPCs.py (1558 of 2153) PASS: lldb-api :: functionalities/thread/jump/TestThreadJump.py (1559 of 2153) PASS: lldb-shell :: Reproducer/Functionalities/TestExpressionEvaluation.test (1560 of 2153) UNSUPPORTED: lldb-api :: functionalities/thread/break_after_join/TestBreakAfterJoin.py (1561 of 2153) PASS: lldb-unit :: Core/./LLDBCoreTests/MangledTest.EmptyForInvalidName (1562 of 2153) PASS: lldb-unit :: Process/gdb-remote/./ProcessGdbRemoteTests/GDBRemoteClientBaseTest.SendContinueDelegateStructuredDataReceipt (1563 of 2153) PASS: lldb-unit :: Utility/./UtilityTests/OptionsWithRawTest.SingleWhitespaceInput (1564 of 2153) PASS: lldb-api :: lang/objc/objc-optimized/TestObjcOptimized.py (1565 of 2153) PASS: lldb-api :: lang/cpp/multiple-inheritance/TestCppMultipleInheritance.py (1566 of 2153) PASS: lldb-unit :: Symbol/./SymbolTests/Type.CompilerContextPattern (1567 of 2153) PASS: lldb-unit :: Utility/./UtilityTests/SerializationRountripTest.SerializeDeserializeCStringArrayNullptr (1568 of 2153) PASS: lldb-unit :: Utility/./UtilityTests/StreamTest.PutStringAsRawHex8 (1569 of 2153) PASS: lldb-unit :: Utility/./UtilityTests/StringExtractorTest.GetHexU8_Underflow2_NoEof (1570 of 2153) PASS: lldb-api :: functionalities/data-formatter/type_summary_list_script/TestTypeSummaryListScript.py (1571 of 2153) PASS: lldb-unit :: Utility/./UtilityTests/StreamTest.PutCharNull (1572 of 2153) PASS: lldb-unit :: ScriptInterpreter/Python/./ScriptInterpreterPythonTests/PythonDataObjectsTest.TestScript (1573 of 2153) PASS: lldb-api :: functionalities/data-formatter/poarray/TestPrintObjectArray.py (1574 of 2153) PASS: lldb-api :: tools/lldb-server/TestGdbRemoteRegisterState.py (1575 of 2153) PASS: lldb-shell :: SymbolFile/DWARF/DW_TAG_basic_type_DW_ATE_UTF_nonC.ll (1576 of 2153) PASS: lldb-unit :: Utility/./UtilityTests/StringLexerTest.NextIf (1577 of 2153) PASS: lldb-unit :: Symbol/./SymbolTests/TestClangASTImporter.CopyTypeTagDecl (1578 of 2153) PASS: lldb-unit :: ScriptInterpreter/Python/./ScriptInterpreterPythonTests/PythonDataObjectsTest.TestPythonTupleSize (1579 of 2153) PASS: lldb-unit :: Host/./HostTests/HostInfoTest.GetAugmentedArchSpec (1580 of 2153) PASS: lldb-unit :: Symbol/./SymbolTests/SymbolsTest.LocateExecutableSymbolFileForUnknownExecutableAndMissingSymbolFile (1581 of 2153) PASS: lldb-api :: lang/c/enum_types/TestEnumTypes.py (1582 of 2153) PASS: lldb-unit :: Utility/./UtilityTests/OptionsWithRawTest.MultiWordSuffix (1583 of 2153) PASS: lldb-api :: functionalities/asan/TestReportData.py (1584 of 2153) PASS: lldb-shell :: SymbolFile/NativePDB/global-classes.cpp (1585 of 2153) PASS: lldb-api :: lang/objc/objc-builtin-types/TestObjCBuiltinTypes.py (1586 of 2153) PASS: lldb-api :: commands/target/create-no-such-arch/TestNoSuchArch.py (1587 of 2153) PASS: lldb-unit :: Process/gdb-remote/./ProcessGdbRemoteTests/GDBRemoteCommunicationServerTest.SendErrorResponse_Status (1588 of 2153) PASS: lldb-unit :: Utility/./UtilityTests/StringExtractorTest.GetHexBytes_FullString (1589 of 2153) PASS: lldb-shell :: Driver/TestHelp.test (1590 of 2153) PASS: lldb-api :: commands/command/script/import/rdar-12586188/TestRdar12586188.py (1591 of 2153) PASS: lldb-shell :: SymbolFile/DWARF/dwarf5-atomic.s (1592 of 2153) PASS: lldb-unit :: Utility/./UtilityTests/StringListTest.LongestCommonPrefixDuplicateElement (1593 of 2153) PASS: lldb-unit :: Symbol/./SymbolTests/TestTypeSystemClang.TestGetEnumIntegerTypeInvalid (1594 of 2153) PASS: lldb-shell :: ObjectFile/PECOFF/disassemble-thumb.yaml (1595 of 2153) PASS: lldb-unit :: Utility/./UtilityTests/StringListTest.LongestCommonPrefixNoPrefix (1596 of 2153) PASS: lldb-api :: lang/cpp/virtual-overload/TestVirtualOverload.py (1597 of 2153) PASS: lldb-unit :: Utility/./UtilityTests/XcodeSDKTest.GetCanonicalNameAndConstruct (1598 of 2153) PASS: lldb-api :: macosx/function-starts/TestFunctionStarts.py (1599 of 2153) PASS: lldb-api :: commands/expression/result_numbering/TestResultNumbering.py (1600 of 2153) PASS: lldb-api :: functionalities/data-formatter/type_summary_list_arg/TestTypeSummaryListArg.py (1601 of 2153) PASS: lldb-unit :: Symbol/./SymbolTests/TestTypeSystemClang.TestDisplayName (1602 of 2153) PASS: lldb-unit :: Process/minidump/./LLDBMinidumpTests/RegisterContextMinidump.ConvertMinidumpContext_x86_32 (1603 of 2153) PASS: lldb-unit :: DataFormatter/./LLDBFormatterTests/TypeMatcherTests.GetMatchStringRegex (1604 of 2153) PASS: lldb-api :: commands/expression/pr35310/TestExprsBug35310.py (1605 of 2153) PASS: lldb-api :: functionalities/thread/concurrent_events/TestConcurrentTwoWatchpointsOneBreakpoint.py (1606 of 2153) PASS: lldb-unit :: Utility/./UtilityTests/ScalarTest.SetValueFromCString (1607 of 2153) PASS: lldb-unit :: Utility/./UtilityTests/StringListTest.ShiftCString (1608 of 2153) PASS: lldb-api :: functionalities/data-formatter/cstring-utf8-summary/TestCstringUnicode.py (1609 of 2153) XFAIL: lldb-shell :: Unwind/prefer-debug-over-eh-frame.test (1610 of 2153) PASS: lldb-shell :: ObjectFile/ELF/basic-info.yaml (1611 of 2153) PASS: lldb-shell :: BuildScript/compiler-full-path.test (1612 of 2153) PASS: lldb-api :: python_api/lldbutil/frame/TestFrameUtils.py (1613 of 2153) PASS: lldb-unit :: Utility/./UtilityTests/TimerTest.CategoryTimesStats (1614 of 2153) UNSUPPORTED: lldb-shell :: SymbolFile/NativePDB/typedefs.cpp (1615 of 2153) PASS: lldb-api :: functionalities/data-formatter/data-formatter-stl/libcxx/forward_list/TestDataFormatterLibcxxForwardList.py (1616 of 2153) PASS: lldb-api :: functionalities/breakpoint/source_regexp/TestSourceRegexBreakpoints.py (1617 of 2153) UNSUPPORTED: lldb-api :: lang/objc/rdar-12408181/TestRdar12408181.py (1618 of 2153) PASS: lldb-unit :: SymbolFile/DWARF/./SymbolFileDWARFTests/SymbolFileDWARFTests.TestAbbrevValidAttrNullForm (1619 of 2153) PASS: lldb-api :: functionalities/data-formatter/setvaluefromcstring/TestSetValueFromCString.py (1620 of 2153) PASS: lldb-api :: functionalities/data-formatter/data-formatter-stl/libcxx/bitset/TestDataFormatterLibcxxBitset.py (1621 of 2153) PASS: lldb-unit :: Utility/./UtilityTests/StringListTest.AppendStringMove (1622 of 2153) PASS: lldb-unit :: Utility/./UtilityTests/VMRange.SetEndAddress (1623 of 2153) PASS: lldb-shell :: SymbolFile/DWARF/DW_TAG_variable-DW_AT_const_value.s (1624 of 2153) PASS: lldb-api :: commands/expression/radar_9531204/TestPrintfAfterUp.py (1625 of 2153) PASS: lldb-unit :: Utility/./UtilityTests/ScalarTest.Getters (1626 of 2153) PASS: lldb-shell :: ObjectFile/Breakpad/sections.test (1627 of 2153) PASS: lldb-api :: commands/expression/po_verbosity/TestPoVerbosity.py (1628 of 2153) PASS: lldb-unit :: Utility/./UtilityTests/StringListTest.LongestCommonPrefix (1629 of 2153) PASS: lldb-api :: lang/cpp/function-qualifiers/TestCppFunctionQualifiers.py (1630 of 2153) PASS: lldb-unit :: Process/gdb-remote/./ProcessGdbRemoteTests/GDBRemoteCommunicationClientTest.TestPacketSpeedJSON (1631 of 2153) PASS: lldb-api :: api/listeners/TestListener.py (1632 of 2153) PASS: lldb-unit :: Expression/./ExpressionTests/CppModuleConfigurationTest.LinuxLocalLibCpp (1633 of 2153) PASS: lldb-api :: functionalities/thread/concurrent_events/TestConcurrentBreakpointsDelayedBreakpointOneWatchpoint.py (1634 of 2153) UNSUPPORTED: lldb-shell :: Register/x86-gp-read.test (1635 of 2153) PASS: lldb-unit :: Expression/./ExpressionTests/DiagnosticManagerTest.GetStringBasic (1636 of 2153) PASS: lldb-unit :: Utility/./UtilityTests/IndexToObjectTest.ObjectForIndex (1637 of 2153) PASS: lldb-shell :: Reproducer/TestRelativePath.test (1638 of 2153) PASS: lldb-api :: functionalities/thread/crash_during_step/TestCrashDuringStep.py (1639 of 2153) PASS: lldb-api :: python_api/name_lookup/TestNameLookup.py (1640 of 2153) UNSUPPORTED: lldb-shell :: SymbolFile/PDB/udt-layout.test (1641 of 2153) PASS: lldb-unit :: Utility/./UtilityTests/Flags.Clear (1642 of 2153) PASS: lldb-shell :: Settings/TestLineMarkerColor.test (1643 of 2153) PASS: lldb-api :: functionalities/float-display/TestFloatDisplay.py (1644 of 2153) PASS: lldb-api :: commands/expression/import-std-module/shared_ptr-dbg-info-content/TestSharedPtrDbgInfoContentFromStdModule.py (1645 of 2153) PASS: lldb-shell :: ObjectFile/ELF/PT_LOAD-overlap-section.yaml (1646 of 2153) PASS: lldb-unit :: Utility/./UtilityTests/CompletionRequest.TryCompleteCurrentArgGood (1647 of 2153) PASS: lldb-unit :: Utility/./UtilityTests/StringExtractorTest.DecodeHexU8_Underflow (1648 of 2153) PASS: lldb-unit :: ObjectFile/ELF/./ObjectFileELFTests/ObjectFileELFTest.SectionsResolveConsistently (1649 of 2153) PASS: lldb-api :: commands/expression/codegen-crash-typedefdecl-not-in_declcontext/TestCodegenCrashTypedefDeclNotInDeclContext.py (1650 of 2153) PASS: lldb-unit :: Utility/./UtilityTests/RangeTest.Constructor (1651 of 2153) PASS: lldb-unit :: Utility/./UtilityTests/StringListTest.GetMaxStringLengthEqualSize (1652 of 2153) PASS: lldb-unit :: Utility/./UtilityTests/OptionsWithRawTest.QuotedSuffix (1653 of 2153) PASS: lldb-api :: python_api/target/TestTargetAPI.py (1654 of 2153) PASS: lldb-api :: functionalities/data-formatter/data-formatter-objc/TestDataFormatterObjCNSDate.py (1655 of 2153) PASS: lldb-unit :: ScriptInterpreter/Python/./ScriptInterpreterPythonTests/PythonDataObjectsTest.TestBorrowedReferences (1656 of 2153) UNSUPPORTED: lldb-api :: functionalities/darwin_log/source/info/TestDarwinLogSourceInfo.py (1657 of 2153) UNSUPPORTED: lldb-api :: benchmarks/continue/TestBenchmarkContinue.py (1658 of 2153) UNSUPPORTED: lldb-shell :: ScriptInterpreter/Lua/io.test (1659 of 2153) PASS: lldb-unit :: Process/minidump/./LLDBMinidumpTests/MinidumpParserTest.InvalidMinidump (1660 of 2153) PASS: lldb-api :: commands/process/launch/TestProcessLaunch.py (1661 of 2153) PASS: lldb-api :: lang/c/offsetof/TestOffsetof.py (1662 of 2153) UNSUPPORTED: lldb-shell :: Register/x86-64-xmm16-read.test (1663 of 2153) PASS: lldb-unit :: Host/./HostTests/MainLoopTest.ReadObject (1664 of 2153) PASS: lldb-api :: commands/expression/calculator_mode/TestCalculatorMode.py (1665 of 2153) PASS: lldb-unit :: Symbol/./SymbolTests/TestTypeSystemClang.TestRemoveFastQualifiers (1666 of 2153) PASS: lldb-unit :: Utility/./UtilityTests/RangeTest.ContainsEndInclusiveInvalid (1667 of 2153) UNSUPPORTED: lldb-api :: benchmarks/expression/TestRepeatedExprs.py (1668 of 2153) PASS: lldb-api :: iohandler/resize/TestIOHandlerResizeNoEditline.py (1669 of 2153) PASS: lldb-api :: lang/objc/ivar-IMP/TestObjCiVarIMP.py (1670 of 2153) PASS: lldb-unit :: Expression/./ExpressionTests/CppModuleConfigurationTest.Xcode (1671 of 2153) PASS: lldb-api :: commands/expression/argument_passing_restrictions/TestArgumentPassingRestrictions.py (1672 of 2153) PASS: lldb-api :: functionalities/thread/concurrent_events/TestConcurrentBreakpointDelayBreakpointOneSignal.py (1673 of 2153) PASS: lldb-api :: functionalities/tsan/thread_numbers/TestTsanThreadNumbers.py (1674 of 2153) PASS: lldb-unit :: ScriptInterpreter/Python/./ScriptInterpreterPythonTests/PythonDataObjectsTest.TestExceptions (1675 of 2153) PASS: lldb-api :: macosx/lc-note/firmware-corefile/TestFirmwareCorefiles.py (1676 of 2153) PASS: lldb-api :: commands/expression/persist_objc_pointeetype/TestPersistObjCPointeeType.py (1677 of 2153) PASS: lldb-api :: lang/cpp/this_class_type_mixing/TestThisClassTypeMixing.py (1678 of 2153) PASS: lldb-api :: lang/cpp/lambdas/TestLambdas.py (1679 of 2153) PASS: lldb-api :: functionalities/data-formatter/nssetsynth/TestNSSetSynthetic.py (1680 of 2153) PASS: lldb-api :: lang/objc/objc-class-method/TestObjCClassMethod.py (1681 of 2153) PASS: lldb-shell :: ObjectFile/ELF/build-id-case.yaml (1682 of 2153) PASS: lldb-api :: commands/expression/dollar-in-variable/TestDollarInVariable.py (1683 of 2153) UNSUPPORTED: lldb-shell :: ObjectFile/ELF/minidebuginfo-no-lzma.yaml (1684 of 2153) PASS: lldb-api :: lang/objc/foundation/TestObjCMethods2.py (1685 of 2153) PASS: lldb-api :: macosx/dyld-trie-symbols/TestDyldTrieSymbols.py (1686 of 2153) PASS: lldb-api :: lang/cpp/member-and-local-vars-with-same-name/TestMembersAndLocalsWithSameName.py (1687 of 2153) PASS: lldb-api :: functionalities/thread/concurrent_events/TestConcurrentTwoWatchpointsOneSignal.py (1688 of 2153) PASS: lldb-shell :: BuildScript/toolchain-clang.test (1689 of 2153) PASS: lldb-api :: commands/expression/completion/TestExprCompletion.py (1690 of 2153) PASS: lldb-unit :: Language/CPlusPlus/./LanguageCPlusPlusTests/CPlusPlusLanguage.CPlusPlusNameParser (1691 of 2153) PASS: lldb-api :: functionalities/pre_run_dylibs/TestPreRunDylibs.py (1692 of 2153) PASS: lldb-api :: functionalities/data-formatter/pyobjsynthprovider/TestPyObjSynthProvider.py (1693 of 2153) PASS: lldb-api :: commands/expression/import-std-module/vector-dbg-info-content/TestDbgInfoContentVectorFromStdModule.py (1694 of 2153) PASS: lldb-shell :: SymbolFile/DWARF/dwarf5-debug_line.s (1695 of 2153) PASS: lldb-shell :: ObjectFile/PECOFF/basic-info-arm64.yaml (1696 of 2153) PASS: lldb-api :: commands/expression/persistent_types/TestNestedPersistentTypes.py (1697 of 2153) PASS: lldb-api :: lang/objc/orderedset/TestOrderedSet.py (1698 of 2153) PASS: lldb-api :: functionalities/exec/TestExec.py (1699 of 2153) PASS: lldb-api :: tools/lldb-server/TestGdbRemoteKill.py (1700 of 2153) PASS: lldb-shell :: Driver/TestError.test (1701 of 2153) PASS: lldb-api :: lang/c/modules/TestCModules.py (1702 of 2153) PASS: lldb-unit :: ScriptInterpreter/Python/./ScriptInterpreterPythonTests/PythonDataObjectsTest.TestOwnedReferences (1703 of 2153) PASS: lldb-shell :: ObjectFile/ELF/section-overlap.yaml (1704 of 2153) PASS: lldb-unit :: ObjectFile/Breakpad/./ObjectFileBreakpadTests/PublicRecord.parse (1705 of 2153) PASS: lldb-unit :: Host/./HostTests/SocketTest.TCPGetAddress (1706 of 2153) PASS: lldb-shell :: SymbolFile/NativePDB/disassembly.cpp (1707 of 2153) PASS: lldb-api :: functionalities/data-formatter/data-formatter-stl/libstdcpp/unique_ptr/invalid/TestDataFormatterInvalidStdUniquePtr.py (1708 of 2153) PASS: lldb-api :: functionalities/unwind/noreturn/TestNoreturnUnwind.py (1709 of 2153) PASS: lldb-api :: tools/lldb-vscode/module/TestVSCode_module.py (1710 of 2153) PASS: lldb-unit :: Utility/./UtilityTests/StreamTeeTest.Flush (1711 of 2153) PASS: lldb-unit :: Language/Highlighting/./HighlighterTests/HighlighterTest.ClangEmptyInput (1712 of 2153) PASS: lldb-api :: macosx/find-dsym/deep-bundle/TestDeepBundle.py (1713 of 2153) PASS: lldb-api :: functionalities/data-formatter/data-formatter-stl/libcxx/vbool/TestDataFormatterLibcxxVBool.py (1714 of 2153) PASS: lldb-shell :: Settings/TestFrameFormatMangling.test (1715 of 2153) PASS: lldb-shell :: Process/Optimization.test (1716 of 2153) PASS: lldb-unit :: Process/minidump/./LLDBMinidumpTests/RegisterContextMinidump.ConvertMinidumpContext_x86_64 (1717 of 2153) PASS: lldb-shell :: SymbolFile/DWARF/dwp-debug-types.s (1718 of 2153) PASS: lldb-api :: functionalities/data-formatter/data-formatter-python-synth/TestDataFormatterPythonSynth.py (1719 of 2153) PASS: lldb-api :: lang/cpp/char1632_t/TestChar1632T.py (1720 of 2153) PASS: lldb-unit :: Process/gdb-remote/./ProcessGdbRemoteTests/GDBRemoteClientBaseTest.SendContinueAndInterrupt (1721 of 2153) PASS: lldb-unit :: Symbol/./SymbolTests/TestClangASTImporter.DeportDeclTagDecl (1722 of 2153) PASS: lldb-shell :: ObjectFile/ELF/section-addresses.yaml (1723 of 2153) PASS: lldb-api :: commands/expression/call-function/TestCallStdStringFunction.py (1724 of 2153) PASS: lldb-shell :: SymbolFile/DWARF/dwp-separate-debug-file.cpp (1725 of 2153) PASS: lldb-unit :: DataFormatter/./LLDBFormatterTests/StringPrinterTests.CxxUTF8 (1726 of 2153) PASS: lldb-unit :: Utility/./UtilityTests/ArgsTest.TestSingleArgWithQuotedSpace (1727 of 2153) PASS: lldb-api :: functionalities/breakpoint/breakpoint_ignore_count/TestBreakpointIgnoreCount.py (1728 of 2153) PASS: lldb-api :: functionalities/breakpoint/breakpoint_locations/TestBreakpointLocations.py (1729 of 2153) PASS: lldb-unit :: Utility/./UtilityTests/RangeDataVector.FindEntryThatContains_Overlap (1730 of 2153) PASS: lldb-unit :: Process/minidump/./LLDBMinidumpTests/MinidumpParserTest.GetMiscInfo_no_stream (1731 of 2153) PASS: lldb-api :: lang/cpp/template-function/TestTemplateFunctions.py (1732 of 2153) PASS: lldb-unit :: Language/Highlighting/./HighlighterTests/HighlighterTest.ClangStringLiterals (1733 of 2153) PASS: lldb-api :: functionalities/data-formatter/data-formatter-stl/libcxx/optional/TestDataFormatterLibcxxOptional.py (1734 of 2153) PASS: lldb-api :: macosx/order/TestOrderFile.py (1735 of 2153) PASS: lldb-unit :: Process/minidump/./LLDBMinidumpTests/MinidumpParserTest.MinidumpDuplicateModuleMappedSecond (1736 of 2153) PASS: lldb-unit :: Utility/./UtilityTests/ConstStringTest.format_provider (1737 of 2153) UNSUPPORTED: lldb-api :: functionalities/darwin_log/format/TestDarwinLogMessageFormat.py (1738 of 2153) PASS: lldb-unit :: Utility/./UtilityTests/RangeTest.Slide (1739 of 2153) PASS: lldb-unit :: Expression/./ExpressionTests/DiagnosticManagerTest.HasFixits (1740 of 2153) PASS: lldb-shell :: SymbolFile/DWARF/debug-types-basic.test (1741 of 2153) PASS: lldb-shell :: Breakpoint/debug_rnglist_rlestartend.test (1742 of 2153) PASS: lldb-unit :: Utility/./UtilityTests/StringExtractorTest.GetU64LittleEndian (1743 of 2153) PASS: lldb-unit :: Utility/./UtilityTests/DataExtractorTest.GetDouble (1744 of 2153) PASS: lldb-api :: tools/lldb-server/TestGdbRemoteExitCode.py (1745 of 2153) PASS: lldb-api :: tools/lldb-vscode/variables/TestVSCode_variables.py (1746 of 2153) PASS: lldb-api :: functionalities/abbreviation/TestAbbreviations.py (1747 of 2153) PASS: lldb-shell :: Breakpoint/implicit_const_form_support.test (1748 of 2153) PASS: lldb-unit :: SymbolFile/DWARF/./SymbolFileDWARFTests/SymbolFileDWARFTests.TestAbbrevMissingTerminator (1749 of 2153) PASS: lldb-shell :: Unwind/thread-step-out-ret-addr-check.test (1750 of 2153) PASS: lldb-api :: functionalities/tail_call_frames/thread_step_out_message/TestArtificialFrameStepOutMessage.py (1751 of 2153) UNSUPPORTED: lldb-shell :: SymbolFile/NativePDB/ast-functions-msvc.cpp (1752 of 2153) PASS: lldb-unit :: Host/./HostTests/FileSystemTest.Readable (1753 of 2153) PASS: lldb-api :: functionalities/postmortem/mach-core/TestMachCore.py (1754 of 2153) UNSUPPORTED: lldb-shell :: ScriptInterpreter/Lua/lua.test (1755 of 2153) PASS: lldb-api :: functionalities/postmortem/elf-core/thread_crash/TestLinuxCoreThreads.py (1756 of 2153) PASS: lldb-api :: commands/expression/import-std-module/list-dbg-info-content/TestDbgInfoContentListFromStdModule.py (1757 of 2153) PASS: lldb-shell :: SymbolFile/DWARF/debug_rnglists-dwo.s (1758 of 2153) PASS: lldb-unit :: Utility/./UtilityTests/StringListTest.CopyListEmpty (1759 of 2153) PASS: lldb-shell :: ObjectFile/ELF/compressed-sections.yaml (1760 of 2153) UNSUPPORTED: lldb-shell :: Breakpoint/case-insensitive.test (1761 of 2153) PASS: lldb-shell :: Settings/TestStopCommandSourceOnError.test (1762 of 2153) PASS: lldb-api :: commands/settings/use_source_cache/TestUseSourceCache.py (1763 of 2153) PASS: lldb-api :: functionalities/breakpoint/dummy_target_breakpoints/TestBreakpointsWithNoTargets.py (1764 of 2153) PASS: lldb-api :: lang/cpp/scope/TestCppScope.py (1765 of 2153) PASS: lldb-unit :: Utility/./UtilityTests/OptionsWithRawTest.TerminatedQuote (1766 of 2153) PASS: lldb-api :: types/TestCharTypeExpr.py (1767 of 2153) PASS: lldb-api :: python_api/formatters/TestFormattersSBAPI.py (1768 of 2153) PASS: lldb-unit :: Symbol/./SymbolTests/LineEntryTest.GetSameLineContiguousAddressRangeNoInlines (1769 of 2153) PASS: lldb-shell :: Minidump/Windows/Sigsegv/sigsegv.test (1770 of 2153) UNSUPPORTED: lldb-shell :: ScriptInterpreter/Lua/command_script_import.test (1771 of 2153) PASS: lldb-api :: macosx/find-app-in-bundle/TestFindAppInBundle.py (1772 of 2153) PASS: lldb-shell :: SymbolFile/NativePDB/locate-pdb.cpp (1773 of 2153) PASS: lldb-api :: functionalities/data-formatter/data-formatter-objc/TestDataFormatterObjCKVO.py (1774 of 2153) PASS: lldb-shell :: SymbolFile/DWARF/debug_aranges-empty-section.s (1775 of 2153) PASS: lldb-unit :: Utility/./UtilityTests/StringListTest.ShiftStdString (1776 of 2153) PASS: lldb-shell :: SymbolFile/Breakpad/line-table-discontinuous-file-ids.test (1777 of 2153) PASS: lldb-unit :: Utility/./UtilityTests/StringListTest.GetSize (1778 of 2153) PASS: lldb-shell :: Minidump/memory-region.yaml (1779 of 2153) PASS: lldb-api :: functionalities/breakpoint/consecutive_breakpoints/TestConsecutiveBreakpoints.py (1780 of 2153) PASS: lldb-api :: lang/cpp/virtual-functions/TestCppVirtualFunctions.py (1781 of 2153) PASS: lldb-unit :: Symbol/./SymbolTests/PostfixExpression.ParseOneExpression (1782 of 2153) PASS: lldb-api :: commands/expression/import-std-module/weak_ptr/TestWeakPtrFromStdModule.py (1783 of 2153) PASS: lldb-unit :: UnwindAssembly/x86/./UnwindAssemblyx86Tests/Testx86AssemblyInspectionEngine.TestStackRealignMSVC_i386 (1784 of 2153) PASS: lldb-unit :: UnwindAssembly/x86/./UnwindAssemblyx86Tests/Testx86AssemblyInspectionEngine.TestDisassemblyMidFunctionEpilogues (1785 of 2153) PASS: lldb-api :: types/TestFloatTypesExpr.py (1786 of 2153) PASS: lldb-api :: commands/expression/import-std-module/unique_ptr-dbg-info-content/TestUniquePtrDbgInfoContent.py (1787 of 2153) PASS: lldb-api :: functionalities/data-formatter/data-formatter-named-summaries/TestDataFormatterNamedSummaries.py (1788 of 2153) PASS: lldb-api :: commands/command/source/TestCommandSource.py (1789 of 2153) PASS: lldb-shell :: Quit/TestQuitExitCodeNonInt.test (1790 of 2153) PASS: lldb-api :: commands/target/stop-hooks/TestStopHooks.py (1791 of 2153) PASS: lldb-unit :: Utility/./UtilityTests/CompletionRequest.DuplicateFiltering (1792 of 2153) PASS: lldb-unit :: Utility/./UtilityTests/StreamTest.PutHex16ByteOrderBig (1793 of 2153) PASS: lldb-unit :: Language/Highlighting/./HighlighterTests/HighlighterTest.ClangSquareBrackets (1794 of 2153) PASS: lldb-unit :: Core/./LLDBCoreTests/ModuleSpecTest.TestMachOFile (1795 of 2153) PASS: lldb-api :: functionalities/postmortem/minidump-new/TestMiniDumpUUID.py (1796 of 2153) XFAIL: lldb-shell :: SymbolFile/DWARF/find-type-in-function.cpp (1797 of 2153) PASS: lldb-unit :: Host/./HostTests/FileActionTest.Open (1798 of 2153) PASS: lldb-api :: tools/lldb-vscode/breakpoint/TestVSCode_setBreakpoints.py (1799 of 2153) PASS: lldb-shell :: ObjectFile/wasm/embedded-debug-sections.yaml (1800 of 2153) PASS: lldb-api :: functionalities/breakpoint/step_over_breakpoint/TestStepOverBreakpoint.py (1801 of 2153) PASS: lldb-unit :: DataFormatter/./LLDBFormatterTests/TypeMatcherTests.CreatedBySameMatchString (1802 of 2153) PASS: lldb-api :: lang/cpp/wchar_t/TestCxxWCharT.py (1803 of 2153) PASS: lldb-shell :: ObjectFile/ELF/base-address.yaml (1804 of 2153) PASS: lldb-api :: commands/expression/ir-interpreter/TestIRInterpreter.py (1805 of 2153) PASS: lldb-unit :: UnwindAssembly/x86/./UnwindAssemblyx86Tests/Testx86AssemblyInspectionEngine.TestPopR13 (1806 of 2153) PASS: lldb-api :: commands/gui/breakpoints/TestGuiBreakpoints.py (1807 of 2153) UNSUPPORTED: lldb-shell :: Unwind/eh-frame-small-fde.test (1808 of 2153) PASS: lldb-unit :: Utility/./UtilityTests/RangeTest.ContainsRange (1809 of 2153) PASS: lldb-api :: functionalities/unwind/noreturn/module-end/TestNoReturnModuleEnd.py (1810 of 2153) PASS: lldb-shell :: Driver/TestSingleQuote.test (1811 of 2153) PASS: lldb-shell :: ObjectFile/ELF/section-permissions.yaml (1812 of 2153) PASS: lldb-unit :: Process/gdb-remote/./ProcessGdbRemoteTests/GDBRemoteCommunicationClientTest.SendStartTracePacket (1813 of 2153) PASS: lldb-api :: functionalities/gdb_remote_client/TestArmRegisterDefinition.py (1814 of 2153) PASS: lldb-api :: lang/cpp/char8_t/TestCxxChar8_t.py (1815 of 2153) PASS: lldb-api :: commands/watchpoints/multiple_hits/TestMultipleHits.py (1816 of 2153) UNSUPPORTED: lldb-api :: functionalities/darwin_log/filter/regex/message/TestDarwinLogFilterRegexMessage.py (1817 of 2153) PASS: lldb-api :: lang/c/anonymous/TestAnonymous.py (1818 of 2153) PASS: lldb-api :: functionalities/type_lookup/TestTypeLookup.py (1819 of 2153) PASS: lldb-api :: tools/lldb-server/commandline/TestStubReverseConnect.py (1820 of 2153) PASS: lldb-unit :: Utility/./UtilityTests/UriParserTest.Empty (1821 of 2153) PASS: lldb-unit :: Host/./HostTests/FileSystemTest.OpenErrno (1822 of 2153) PASS: lldb-shell :: Expr/TestMultilineExpr.test (1823 of 2153) PASS: lldb-api :: functionalities/tail_call_frames/ambiguous_tail_call_seq1/TestAmbiguousTailCallSeq1.py (1824 of 2153) PASS: lldb-unit :: UnwindAssembly/ARM64/./Arm64InstEmulationTests/TestArm64InstEmulation.TestRegisterSavedTwice (1825 of 2153) PASS: lldb-unit :: SymbolFile/NativePDB/./SymbolFileNativePDBTests/PDBFPOProgramToDWARFExpressionTests.InvalidAssignmentMultiple (1826 of 2153) PASS: lldb-api :: tools/lldb-vscode/attach/TestVSCode_attach.py (1827 of 2153) PASS: lldb-api :: commands/target/stop-hook/enable/TestTargetStopHookEnable.py (1828 of 2153) PASS: lldb-unit :: Utility/./UtilityTests/ConstStringTest.FromMidOfBufferStringRef (1829 of 2153) PASS: lldb-api :: commands/expression/import-std-module/weak_ptr-dbg-info-content/TestDbgInfoContentWeakPtrFromStdModule.py (1830 of 2153) UNSUPPORTED: lldb-api :: arm/breakpoint-it/TestBreakpointIt.py (1831 of 2153) PASS: lldb-unit :: Utility/./UtilityTests/StringListTest.GetMaxStringLengthEmpty (1832 of 2153) PASS: lldb-unit :: Utility/./UtilityTests/LogTest.Register (1833 of 2153) PASS: lldb-unit :: Language/Highlighting/./HighlighterTests/HighlighterTest.ClangCursorOutOfBounds (1834 of 2153) UNSUPPORTED: lldb-api :: functionalities/darwin_log/filter/exact_match/activity/TestDarwinLogFilterMatchActivity.py (1835 of 2153) PASS: lldb-unit :: Interpreter/./InterpreterTests/OptionArgParserTest.toChar (1836 of 2153) PASS: lldb-unit :: Expression/./ExpressionTests/ClangExpressionDeclMapTest.TestUnknownIdentifierLookup (1837 of 2153) PASS: lldb-shell :: Commands/command-target-modules-dump-sections.yaml (1838 of 2153) PASS: lldb-api :: functionalities/thread/state_after_expression/TestStateAfterExpression.py (1839 of 2153) PASS: lldb-unit :: Interpreter/./InterpreterTests/CompletionTest.FileCompletionAbsolute (1840 of 2153) PASS: lldb-api :: lang/cpp/extern_c/TestExternCSymbols.py (1841 of 2153) UNSUPPORTED: lldb-shell :: ExecControl/StopHook/stop-hook-threads.test (1842 of 2153) PASS: lldb-unit :: UnwindAssembly/x86/./UnwindAssemblyx86Tests/Testx86AssemblyInspectionEngine.TestPopEBP (1843 of 2153) PASS: lldb-unit :: Utility/./UtilityTests/RangeTest.ContainsAddrInvalid (1844 of 2153) PASS: lldb-shell :: ObjectFile/PECOFF/sections.yaml (1845 of 2153) PASS: lldb-api :: commands/apropos/basic/TestApropos.py (1846 of 2153) PASS: lldb-api :: functionalities/inferior-crashing/recursive-inferior/TestRecursiveInferiorStep.py (1847 of 2153) PASS: lldb-api :: lang/cpp/global_variables/TestCPPGlobalVariables.py (1848 of 2153) PASS: lldb-api :: lang/objc/single-entry-dictionary/TestObjCSingleEntryDictionary.py (1849 of 2153) PASS: lldb-api :: functionalities/target_var/no_vars/TestTargetVarNoVars.py (1850 of 2153) PASS: lldb-api :: iohandler/autosuggestion/TestAutosuggestion.py (1851 of 2153) PASS: lldb-unit :: Utility/./UtilityTests/StringListTest.InsertStringAtIndexStdString (1852 of 2153) PASS: lldb-unit :: Interpreter/./InterpreterTests/CompletionTest.DirCompletionAbsolute (1853 of 2153) PASS: lldb-unit :: Utility/./UtilityTests/StringListTest.AppendStringStdString (1854 of 2153) PASS: lldb-unit :: Host/./HostTests/SocketTest.DomainListenConnectAccept (1855 of 2153) PASS: lldb-unit :: Utility/./UtilityTests/CompletionRequest.TryCompleteCurrentArgBad (1856 of 2153) PASS: lldb-api :: functionalities/plugins/python_os_plugin/TestPythonOSPlugin.py (1857 of 2153) PASS: lldb-api :: python_api/get-value-32bit-int/TestGetValue32BitInt.py (1858 of 2153) PASS: lldb-api :: python_api/sbdata/TestSBData.py (1859 of 2153) UNSUPPORTED: lldb-api :: tools/lldb-vscode/completions/TestVSCode_completions.py (1860 of 2153) UNSUPPORTED: lldb-shell :: BuildScript/toolchain-msvc.test (1861 of 2153) PASS: lldb-unit :: Utility/./UtilityTests/StreamTest.AddressPrefixAndSuffix (1862 of 2153) PASS: lldb-unit :: Process/minidump/./LLDBMinidumpTests/MinidumpParserTest.GetMemoryRegionInfo (1863 of 2153) PASS: lldb-api :: python_api/default-constructor/TestDefaultConstructorForAPIObjects.py (1864 of 2153) PASS: lldb-unit :: Utility/./UtilityTests/StringListTest.ForRange (1865 of 2153) PASS: lldb-shell :: Breakpoint/single-file-split-dwarf.test (1866 of 2153) PASS: lldb-api :: functionalities/postmortem/minidump-new/TestMiniDumpNew.py (1867 of 2153) PASS: lldb-api :: functionalities/gdb_remote_client/TestNoGPacketSupported.py (1868 of 2153) PASS: lldb-unit :: Utility/./UtilityTests/ProcessInstanceInfo.DumpTable_invalidUID (1869 of 2153) PASS: lldb-unit :: Process/minidump/./LLDBMinidumpTests/MinidumpParserTest.GetLinuxProcStatus_no_stream (1870 of 2153) PASS: lldb-unit :: Utility/./UtilityTests/ScalarTest.APIntConstructor (1871 of 2153) UNSUPPORTED: lldb-shell :: SymbolFile/PDB/compilands.test (1872 of 2153) PASS: lldb-api :: commands/gui/invalid-args/TestInvalidArgsGui.py (1873 of 2153) PASS: lldb-shell :: ScriptInterpreter/Python/scripted_breakpoint.test (1874 of 2153) PASS: lldb-shell :: Commands/command-regex-unalias.test (1875 of 2153) PASS: lldb-api :: lang/c/unicode/TestUnicodeSymbols.py (1876 of 2153) PASS: lldb-api :: functionalities/data-formatter/data-formatter-cpp/TestDataFormatterCpp.py (1877 of 2153) PASS: lldb-api :: functionalities/stats_api/TestStatisticsAPI.py (1878 of 2153) PASS: lldb-unit :: Utility/./UtilityTests/Predicate.WaitForValueEqualTo (1879 of 2153) PASS: lldb-unit :: ScriptInterpreter/Python/./ScriptInterpreterPythonTests/PythonDataObjectsTest.TestPythonDictionaryValueEquality (1880 of 2153) PASS: lldb-api :: functionalities/ubsan/basic/TestUbsanBasic.py (1881 of 2153) UNSUPPORTED: lldb-api :: functionalities/darwin_log/filter/regex/subsystem/TestDarwinLogFilterRegexSubsystem.py (1882 of 2153) PASS: lldb-unit :: Utility/./UtilityTests/ScalarTest.LongLongAssigmentOperator (1883 of 2153) PASS: lldb-api :: python_api/function_symbol/TestSymbolAPI.py (1884 of 2153) PASS: lldb-unit :: Symbol/./SymbolTests/LineEntryTest.GetSameLineContiguousAddressRangeOneInline (1885 of 2153) PASS: lldb-unit :: Utility/./UtilityTests/EventTest.DumpEventDataBytes (1886 of 2153) PASS: lldb-unit :: Utility/./UtilityTests/StringExtractorTest.GetHexBytes_Underflow (1887 of 2153) PASS: lldb-unit :: Utility/./UtilityTests/ArgsTest.ReplaceArgumentAtIndexLonger (1888 of 2153) PASS: lldb-api :: lang/cpp/template/TestTemplateArgs.py (1889 of 2153) PASS: lldb-api :: lang/cpp/stl/TestStdCXXDisassembly.py (1890 of 2153) PASS: lldb-api :: lang/objcxx/cxx-bridged-po/TestObjCXXBridgedPO.py (1891 of 2153) PASS: lldb-unit :: Utility/./UtilityTests/VMRange.ContainsRange (1892 of 2153) PASS: lldb-shell :: Driver/TestRepl.test (1893 of 2153) PASS: lldb-shell :: SymbolFile/NativePDB/tag-types.cpp (1894 of 2153) PASS: lldb-unit :: Utility/./UtilityTests/ArchSpecTest.TestSetTriple (1895 of 2153) PASS: lldb-unit :: SymbolFile/DWARF/./SymbolFileDWARFTests/SymbolFileDWARFTests.TestAbbrevOrder1Start1 (1896 of 2153) PASS: lldb-api :: commands/frame/var/TestFrameVar.py (1897 of 2153) PASS: lldb-unit :: Utility/./UtilityTests/FileSpecTest.Yaml (1898 of 2153) PASS: lldb-api :: tools/lldb-server/TestAppleSimulatorOSType.py (1899 of 2153) PASS: lldb-unit :: Utility/./UtilityTests/FileSpecTest.EqualDotsPosix (1900 of 2153) PASS: lldb-api :: functionalities/breakpoint/breakpoint_by_line_and_column/TestBreakpointByLineAndColumn.py (1901 of 2153) PASS: lldb-unit :: SymbolFile/NativePDB/./SymbolFileNativePDBTests/PDBFPOProgramToDWARFExpressionTests.UnresolvedCyclicRegisterAssignmentReference (1902 of 2153) PASS: lldb-unit :: Utility/./UtilityTests/RangeTest.Equal (1903 of 2153) UNSUPPORTED: lldb-api :: functionalities/thread/concurrent_events/TestConcurrentManySignals.py (1904 of 2153) PASS: lldb-api :: lang/objc/foundation/TestFoundationDisassembly.py (1905 of 2153) PASS: lldb-unit :: Expression/./ExpressionTests/CppModuleConfigurationTest.UnknownLibCppFile (1906 of 2153) PASS: lldb-api :: lang/c/register_variables/TestRegisterVariables.py (1907 of 2153) PASS: lldb-unit :: ScriptInterpreter/Python/./ScriptInterpreterPythonTests/PythonDataObjectsTest.TestPythonByteArray (1908 of 2153) PASS: lldb-unit :: UnwindAssembly/x86/./UnwindAssemblyx86Tests/Testx86AssemblyInspectionEngine.TestSubRSP (1909 of 2153) UNSUPPORTED: lldb-api :: tools/lldb-server/TestGdbRemoteCompletion.py (1910 of 2153) PASS: lldb-unit :: Language/Highlighting/./HighlighterTests/HighlighterTest.ClangComments (1911 of 2153) PASS: lldb-unit :: Core/./LLDBCoreTests/ModuleSpecTest.TestCOFFFile (1912 of 2153) PASS: lldb-shell :: ScriptInterpreter/None/import_module.test (1913 of 2153) PASS: lldb-api :: types/TestDoubleTypes.py (1914 of 2153) PASS: lldb-shell :: SymbolFile/NativePDB/nested-types.cpp (1915 of 2153) PASS: lldb-unit :: Utility/./UtilityTests/ScalarTest.SetValueFromData (1916 of 2153) PASS: lldb-api :: tools/lldb-vscode/launch/TestVSCode_launch.py (1917 of 2153) PASS: lldb-unit :: Utility/./UtilityTests/StreamTest.AddressRangeInvalidRange (1918 of 2153) UNSUPPORTED: lldb-api :: functionalities/thread/multi_break/TestMultipleBreakpoints.py (1919 of 2153) PASS: lldb-api :: functionalities/data-formatter/data-formatter-objc/TestDataFormatterObjCCF.py (1920 of 2153) PASS: lldb-api :: lang/objc/foundation/TestSymbolTable.py (1921 of 2153) PASS: lldb-unit :: Utility/./UtilityTests/StringExtractorTest.GetU64BigEndian (1922 of 2153) PASS: lldb-unit :: UnwindAssembly/x86/./UnwindAssemblyx86Tests/Testx86AssemblyInspectionEngine.TestPopEDI (1923 of 2153) PASS: lldb-unit :: Utility/./UtilityTests/StringExtractorTest.DecodeHexU8_Underflow2 (1924 of 2153) PASS: lldb-shell :: Reproducer/TestDiscard.test (1925 of 2153) PASS: lldb-api :: lang/cpp/class-template-parameter-pack/TestClassTemplateParameterPack.py (1926 of 2153) PASS: lldb-unit :: Utility/./UtilityTests/StreamTeeTest.AppendStream (1927 of 2153) PASS: lldb-api :: functionalities/data-formatter/data-formatter-caching/TestDataFormatterCaching.py (1928 of 2153) PASS: lldb-unit :: Utility/./UtilityTests/SerializationRountripTest.SerializeDeserializePodPointers (1929 of 2153) PASS: lldb-api :: lang/objc/foundation/TestObjCMethodsNSError.py (1930 of 2153) PASS: lldb-api :: lang/cpp/namespace/TestNamespaceLookup.py (1931 of 2153) PASS: lldb-shell :: ObjectFile/ELF/minidebuginfo-find-symbols.yaml (1932 of 2153) PASS: lldb-shell :: Commands/command-breakpoint-col.test (1933 of 2153) PASS: lldb-shell :: SymbolFile/DWARF/module-ownership.mm (1934 of 2153) PASS: lldb-unit :: ScriptInterpreter/Python/./ScriptInterpreterPythonTests/PythonDataObjectsTest.TestPythonTupleValues (1935 of 2153) PASS: lldb-api :: macosx/nslog/TestDarwinNSLogOutput.py (1936 of 2153) PASS: lldb-shell :: SymbolFile/NativePDB/bitfields.cpp (1937 of 2153) PASS: lldb-api :: functionalities/thread/step_out/TestThreadStepOut.py (1938 of 2153) PASS: lldb-api :: lang/c/set_values/TestSetValues.py (1939 of 2153) PASS: lldb-unit :: Host/./HostTests/NativeProcessProtocolTest.ReadCStringFromMemory_MaxSize (1940 of 2153) PASS: lldb-unit :: ObjectFile/Breakpad/./ObjectFileBreakpadTests/FileRecord.parse (1941 of 2153) PASS: lldb-unit :: Utility/./UtilityTests/LogChannelTest.Enable (1942 of 2153) PASS: lldb-unit :: Utility/./UtilityTests/RangeTest.ContainsEndInclusive (1943 of 2153) PASS: lldb-unit :: Utility/./UtilityTests/SerializationRountripTest.SerializeDeserializeCStringArray (1944 of 2153) PASS: lldb-unit :: Utility/./UtilityTests/StringListTest.AppendListCStringArray (1945 of 2153) PASS: lldb-unit :: Utility/./UtilityTests/StreamTest.AddressSuffix (1946 of 2153) PASS: lldb-unit :: ScriptInterpreter/Python/./ScriptInterpreterPythonTests/PythonDataObjectsTest.TestDictionaryResolutionWithDot (1947 of 2153) PASS: lldb-api :: terminal/TestEditline.py (1948 of 2153) PASS: lldb-unit :: Language/Highlighting/./HighlighterTests/HighlighterTest.ClangTrailingBackslashWithWhitespace (1949 of 2153) PASS: lldb-unit :: Utility/./UtilityTests/BinaryStreamTest.PutSLEB128One (1950 of 2153) PASS: lldb-api :: lang/cpp/bitfields/TestCppBitfields.py (1951 of 2153) PASS: lldb-shell :: ObjectFile/ELF/netbsd-core-amd64.test (1952 of 2153) PASS: lldb-unit :: Utility/./UtilityTests/RecordReplayTest.InstrumentedFoo (1953 of 2153) PASS: lldb-api :: functionalities/limit-debug-info/TestLimitDebugInfo.py (1954 of 2153) PASS: lldb-unit :: Utility/./UtilityTests/DataExtractorTest.UncommonAddressSize (1955 of 2153) PASS: lldb-unit :: Host/./HostTests/HostInfoTest.GetHostname (1956 of 2153) PASS: lldb-unit :: debugserver/./debugserverTests/RNBSocket.LoopBackConnectIPv6 (1957 of 2153) PASS: lldb-api :: commands/frame/diagnose/complicated-expression/TestComplicatedExpression.py (1958 of 2153) PASS: lldb-unit :: UnwindAssembly/x86/./UnwindAssemblyx86Tests/Testx86AssemblyInspectionEngine.TestPopR14 (1959 of 2153) PASS: lldb-shell :: ObjectFile/Breakpad/sections-trailing-func.test (1960 of 2153) PASS: lldb-unit :: Utility/./UtilityTests/ArchSpecTest.TestParseMachCPUDashSubtypeTripleSimple (1961 of 2153) PASS: lldb-unit :: Utility/./UtilityTests/StringExtractorTest.GetNameColonValueNoColon (1962 of 2153) PASS: lldb-unit :: Utility/./UtilityTests/LogTest.Unregister (1963 of 2153) PASS: lldb-unit :: Utility/./UtilityTests/ProcessInstanceInfo.DumpTable (1964 of 2153) PASS: lldb-unit :: Process/minidump/./LLDBMinidumpTests/MinidumpParserTest.GetPid (1965 of 2153) PASS: lldb-api :: sanity/TestSettingSkipping.py (1966 of 2153) PASS: lldb-shell :: Commands/command-disassemble.s (1967 of 2153) PASS: lldb-unit :: Symbol/./SymbolTests/TestTypeSystemClang.TestDeletingImplicitCopyCstrDueToMoveCStr (1968 of 2153) PASS: lldb-unit :: Expression/./ExpressionTests/CppModuleConfigurationTest.UnrelatedLibrary (1969 of 2153) PASS: lldb-unit :: Utility/./UtilityTests/LogChannelTest.List (1970 of 2153) UNSUPPORTED: lldb-shell :: Register/aarch64-fp-read.test (1971 of 2153) PASS: lldb-unit :: SymbolFile/NativePDB/./SymbolFileNativePDBTests/PDBFPOProgramToDWARFExpressionTests.UnresolvedDependentCyclicRegisterAssignmentReference (1972 of 2153) PASS: lldb-unit :: Utility/./UtilityTests/VASprintfTest.BufferResize (1973 of 2153) PASS: lldb-unit :: Utility/./UtilityTests/DataExtractorTest.GetCStr (1974 of 2153) PASS: lldb-api :: tools/lldb-vscode/breakpoint/TestVSCode_setExceptionBreakpoints.py (1975 of 2153) PASS: lldb-unit :: Utility/./UtilityTests/ArgsTest.TestArgv (1976 of 2153) PASS: lldb-unit :: Utility/./UtilityTests/ArgsTest.TestUnknownEscape (1977 of 2153) PASS: lldb-api :: commands/expression/options/TestExprOptions.py (1978 of 2153) PASS: lldb-unit :: Utility/./UtilityTests/StringListTest.PopBack (1979 of 2153) PASS: lldb-unit :: UnwindAssembly/x86/./UnwindAssemblyx86Tests/Testx86AssemblyInspectionEngine.TestStackRealign8BitDisp_i386 (1980 of 2153) PASS: lldb-shell :: ObjectFile/MachO/lc_build_version.yaml (1981 of 2153) PASS: lldb-unit :: Utility/./UtilityTests/LogChannelEnabledTest.LogGetLogThread (1982 of 2153) PASS: lldb-unit :: Utility/./UtilityTests/ArgsTest.TestOverwriteArgs (1983 of 2153) PASS: lldb-api :: lang/c/global_variables/TestGlobalVariables.py (1984 of 2153) PASS: lldb-api :: functionalities/data-formatter/data-formatter-stl/libcxx/multimap/TestDataFormatterLibccMultiMap.py (1985 of 2153) PASS: lldb-unit :: Symbol/./SymbolTests/TestTypeSystemClang.TestOwningModule (1986 of 2153) PASS: lldb-api :: types/TestCharType.py (1987 of 2153) PASS: lldb-unit :: Symbol/./SymbolTests/TestTypeSystemClang.TestGetBasicTypeFromName (1988 of 2153) PASS: lldb-unit :: Utility/./UtilityTests/DataExtractorTest.GetMaxU64_unchecked (1989 of 2153) PASS: lldb-unit :: Utility/./UtilityTests/OptionsWithRawTest.UnterminatedQuote (1990 of 2153) PASS: lldb-unit :: Process/gdb-remote/./ProcessGdbRemoteTests/GDBRemoteCommunicationClientTest.GetModulesInfo_UUID20 (1991 of 2153) PASS: lldb-shell :: ObjectFile/PECOFF/export-dllfunc.yaml (1992 of 2153) UNSUPPORTED: lldb-api :: tools/lldb-server/TestGdbRemote_vContThreads.py (1993 of 2153) UNSUPPORTED: lldb-api :: functionalities/signal/handle-segv/TestHandleSegv.py (1994 of 2153) PASS: lldb-unit :: Utility/./UtilityTests/BinaryStreamTest.PutSLEB128SevenBytes (1995 of 2153) PASS: lldb-api :: functionalities/gdb_remote_client/TestqOffsets.py (1996 of 2153) PASS: lldb-api :: python_api/breakpoint/TestBreakpointAPI.py (1997 of 2153) PASS: lldb-unit :: Utility/./UtilityTests/StringListTest.LongestCommonPrefixSingleElement (1998 of 2153) PASS: lldb-unit :: Utility/./UtilityTests/PassiveReplayTest.InstrumentedBarRef (1999 of 2153) PASS: lldb-unit :: Language/Highlighting/./HighlighterTests/HighlighterTest.ClangCursorPosEndOfLine (2000 of 2153) PASS: lldb-unit :: Utility/./UtilityTests/UserIDResolver.GetUserName (2001 of 2153) PASS: lldb-api :: lang/objc/print-obj/TestPrintObj.py (2002 of 2153) PASS: lldb-unit :: Utility/./UtilityTests/RangeTest.ContainsAddr (2003 of 2153) PASS: lldb-shell :: Breakpoint/case-sensitive.test (2004 of 2153) PASS: lldb-api :: functionalities/data-formatter/data-formatter-stl/libcxx/variant/TestDataFormatterLibcxxVariant.py (2005 of 2153) UNSUPPORTED: lldb-shell :: Register/x86-64-zmm-write.test (2006 of 2153) PASS: lldb-unit :: ScriptInterpreter/Python/./ScriptInterpreterPythonTests/PythonDataObjectsTest.TestPythonTupleToStructuredList (2007 of 2153) PASS: lldb-unit :: ScriptInterpreter/Python/./ScriptInterpreterPythonTests/PythonDataObjectsTest.TestCallable (2008 of 2153) PASS: lldb-shell :: Reproducer/Functionalities/TestDataFormatter.test (2009 of 2153) UNSUPPORTED: lldb-shell :: Register/arm-gp-read.test (2010 of 2153) PASS: lldb-unit :: Utility/./UtilityTests/StringListTest.GetMaxStringLengthDecreasingSize (2011 of 2153) PASS: lldb-api :: lang/cpp/dynamic-value-same-basename/TestDynamicValueSameBase.py (2012 of 2153) PASS: lldb-api :: functionalities/data-formatter/synthupdate/TestSyntheticFilterRecompute.py (2013 of 2153) PASS: lldb-api :: tools/lldb-server/register-reading/TestGdbRemoteGPacket.py (2014 of 2153) PASS: lldb-shell :: SymbolFile/DWARF/debug_ranges.s (2015 of 2153) PASS: lldb-api :: functionalities/signal/handle-abrt/TestHandleAbort.py (2016 of 2153) PASS: lldb-unit :: ObjectFile/Breakpad/./ObjectFileBreakpadTests/StackCFIRecord.parse (2017 of 2153) PASS: lldb-unit :: Utility/./UtilityTests/StringLexerTest.Peek (2018 of 2153) PASS: lldb-api :: functionalities/data-formatter/data-formatter-stl/libcxx/tuple/TestDataFormatterLibcxxTuple.py (2019 of 2153) PASS: lldb-unit :: SymbolFile/NativePDB/./SymbolFileNativePDBTests/PDBFPOProgramToDWARFExpressionTests.MultipleDependentAssignments (2020 of 2153) PASS: lldb-unit :: Process/minidump/./LLDBMinidumpTests/MinidumpParserTest.GetArchitecture (2021 of 2153) PASS: lldb-api :: macosx/macCatalyst/TestMacCatalyst.py (2022 of 2153) PASS: lldb-unit :: Utility/./UtilityTests/ArgsTest.TestMultipleArgs (2023 of 2153) PASS: lldb-api :: functionalities/thread/backtrace_all/TestBacktraceAll.py (2024 of 2153) PASS: lldb-unit :: Utility/./UtilityTests/StreamTest.PutCStringWithStringRef (2025 of 2153) PASS: lldb-shell :: Commands/command-thread-select.test (2026 of 2153) PASS: lldb-api :: functionalities/data-formatter/data-formatter-synth/TestDataFormatterSynth.py (2027 of 2153) PASS: lldb-unit :: Symbol/./SymbolTests/TestTypeSystemClang.TestGetTypeClassTypeOfExpr (2028 of 2153) PASS: lldb-api :: functionalities/data-formatter/data-formatter-script/TestDataFormatterScript.py (2029 of 2153) PASS: lldb-unit :: Utility/./UtilityTests/StringListTest.Assignment (2030 of 2153) PASS: lldb-unit :: SymbolFile/NativePDB/./SymbolFileNativePDBTests/PDBFPOProgramToDWARFExpressionTests.UnsupportedRASearch (2031 of 2153) PASS: lldb-unit :: Symbol/./SymbolTests/DWARFCallFrameInfoTest.Basic_eh (2032 of 2153) PASS: lldb-api :: python_api/value_var_update/TestValueVarUpdate.py (2033 of 2153) PASS: lldb-api :: commands/frame/diagnose/local-variable/TestLocalVariable.py (2034 of 2153) PASS: lldb-unit :: UnwindAssembly/ARM64/./Arm64InstEmulationTests/TestArm64InstEmulation.TestMediumDarwinFunction (2035 of 2153) PASS: lldb-api :: commands/expression/context-object-objc/TestContextObjectObjc.py (2036 of 2153) PASS: lldb-api :: functionalities/archives/TestBSDArchives.py (2037 of 2153) PASS: lldb-shell :: Minidump/no-process-id.yaml (2038 of 2153) PASS: lldb-unit :: UnwindAssembly/x86/./UnwindAssemblyx86Tests/Testx86AssemblyInspectionEngine.TestPush0 (2039 of 2153) PASS: lldb-api :: lang/cpp/operator-overload/TestOperatorOverload.py (2040 of 2153) PASS: lldb-api :: lang/cpp/constructors/TestCppConstructors.py (2041 of 2153) PASS: lldb-shell :: Minidump/breakpad-symbols.test (2042 of 2153) PASS: lldb-unit :: Utility/./UtilityTests/ArgsTest.TestQuotedUnknownEscape (2043 of 2153) PASS: lldb-unit :: Utility/./UtilityTests/RangeTest.DoesIntersect (2044 of 2153) PASS: lldb-shell :: ObjectFile/MachO/symtab.yaml (2045 of 2153) PASS: lldb-api :: python_api/type/TestTypeList.py (2046 of 2153) PASS: lldb-unit :: Utility/./UtilityTests/BinaryStreamTest.PutULEB128FiveBytes (2047 of 2153) PASS: lldb-unit :: Host/./HostTests/SocketTest.TCPListen0ConnectAccept (2048 of 2153) UNSUPPORTED: lldb-shell :: ScriptInterpreter/Lua/breakpoint_callback.test (2049 of 2153) PASS: lldb-api :: lang/cpp/modules-import/TestCXXModulesImport.py (2050 of 2153) PASS: lldb-shell :: SymbolFile/DWARF/find-basic-variable.cpp (2051 of 2153) PASS: lldb-unit :: ObjectFile/Breakpad/./ObjectFileBreakpadTests/FuncRecord.parse (2052 of 2153) PASS: lldb-api :: functionalities/data-formatter/data-formatter-stl/libcxx/list/loop/TestDataFormatterLibcxxListLoop.py (2053 of 2153) PASS: lldb-unit :: Utility/./UtilityTests/TimerTest.CategoryTimesNested (2054 of 2153) PASS: lldb-unit :: Editline/./EditlineTests/EditlineTestFixture.EditlineReceivesSingleLineText (2055 of 2153) PASS: lldb-unit :: Utility/./UtilityTests/RangeTest.Clear (2056 of 2153) PASS: lldb-unit :: Utility/./UtilityTests/StringListTest.InsertStringAtIndexMove (2057 of 2153) PASS: lldb-shell :: Process/UnsupportedLanguage.test (2058 of 2153) PASS: lldb-shell :: Reproducer/TestDebugSymbols.test (2059 of 2153) PASS: lldb-shell :: SymbolFile/DWARF/dir-separator-posix.s (2060 of 2153) PASS: lldb-shell :: SymbolFile/DWARF/debug_rnglists.s (2061 of 2153) PASS: lldb-unit :: Utility/./UtilityTests/ScalarTest.RightShiftOperator (2062 of 2153) PASS: lldb-unit :: Utility/./UtilityTests/CompletionRequest.TryCompleteCurrentArgMode (2063 of 2153) UNSUPPORTED: lldb-shell :: Register/x86-64-xmm16-write.test (2064 of 2153) PASS: lldb-api :: functionalities/thread/thread_exit/TestThreadExit.py (2065 of 2153) PASS: lldb-api :: lang/c/complex_int/TestComplexInt.py (2066 of 2153) PASS: lldb-unit :: Utility/./UtilityTests/StringExtractorTest.DecodeHexU8_Exact (2067 of 2153) PASS: lldb-shell :: Reproducer/Modules/TestModuleCXX.test (2068 of 2153) PASS: lldb-api :: lang/objc/self/TestObjCSelf.py (2069 of 2153) PASS: lldb-api :: commands/expression/regression-access-function-template-in-record/TestRegressionAccessFunctionTemplateInRecord.py (2070 of 2153) PASS: lldb-api :: functionalities/thread/concurrent_events/TestConcurrentWatchpointDelayWatchpointOneBreakpoint.py (2071 of 2153) PASS: lldb-api :: functionalities/reproducers/attach/TestReproducerAttach.py (2072 of 2153) PASS: lldb-api :: commands/expression/anonymous-struct/TestCallUserAnonTypedef.py (2073 of 2153) PASS: lldb-api :: lang/objc/direct-dispatch-step/TestObjCDirectDispatchStepping.py (2074 of 2153) PASS: lldb-api :: python_api/exprpath_synthetic/TestExprPathSynthetic.py (2075 of 2153) PASS: lldb-api :: terminal/TestSTTYBeforeAndAfter.py (2076 of 2153) PASS: lldb-api :: functionalities/breakpoint/breakpoint_callback_command_source/TestBreakpointCallbackCommandSource.py (2077 of 2153) PASS: lldb-unit :: Utility/./UtilityTests/TimerTest.CategoryTimes2 (2078 of 2153) PASS: lldb-unit :: Expression/./ExpressionTests/ClangHostTest.ComputeClangResourceDirectory (2079 of 2153) PASS: lldb-unit :: Utility/./UtilityTests/StringListTest.CopyListSingle (2080 of 2153) PASS: lldb-api :: lang/cpp/dynamic-value/TestDynamicValue.py (2081 of 2153) PASS: lldb-api :: functionalities/tail_call_frames/disambiguate_tail_call_seq/TestDisambiguateTailCallSeq.py (2082 of 2153) PASS: lldb-api :: functionalities/data-formatter/data-formatter-stl/libcxx/set/TestDataFormatterLibcxxSet.py (2083 of 2153) PASS: lldb-shell :: Driver/TestNoUseColor.test (2084 of 2153) PASS: lldb-shell :: ObjectFile/ELF/section-types.yaml (2085 of 2153) PASS: lldb-unit :: Utility/./UtilityTests/ArchSpecTest.MergeFromMachOUnknown (2086 of 2153) PASS: lldb-unit :: UnwindAssembly/x86/./UnwindAssemblyx86Tests/Testx86AssemblyInspectionEngine.TestPushR15 (2087 of 2153) PASS: lldb-unit :: Thread/./ThreadTests/ThreadTest.SetStopInfo (2088 of 2153) PASS: lldb-api :: functionalities/gdb_remote_client/TestRecognizeBreakpoint.py (2089 of 2153) PASS: lldb-api :: python_api/watchpoint/condition/TestWatchpointConditionAPI.py (2090 of 2153) PASS: lldb-unit :: Utility/./UtilityTests/LogChannelEnabledTest.LogThread (2091 of 2153) PASS: lldb-api :: commands/expression/scoped_enums/TestScopedEnumType.py (2092 of 2153) PASS: lldb-unit :: Utility/./UtilityTests/UriParserTest.BracketedHostnameWithPortIPv4 (2093 of 2153) PASS: lldb-api :: python_api/signals/TestSignalsAPI.py (2094 of 2153) PASS: lldb-unit :: Process/minidump/./LLDBMinidumpTests/MinidumpParserTest.GetMemory (2095 of 2153) PASS: lldb-api :: lang/cpp/std-function-step-into-callable/TestStdFunctionStepIntoCallable.py (2096 of 2153) PASS: lldb-api :: lang/cpp/frame-var-anon-unions/TestFrameVariableAnonymousUnions.py (2097 of 2153) PASS: lldb-api :: lang/objc/modules-compile-error/TestModulesCompileError.py (2098 of 2153) PASS: lldb-api :: functionalities/asan/TestMemoryHistory.py (2099 of 2153) PASS: lldb-api :: functionalities/data-formatter/hexcaps/TestDataFormatterHexCaps.py (2100 of 2153) PASS: lldb-unit :: Utility/./UtilityTests/DataExtractorTest.GetCStrEmpty (2101 of 2153) PASS: lldb-unit :: Utility/./UtilityTests/DataExtractorTest.GetCStrAtNullOffset (2102 of 2153) PASS: lldb-api :: python_api/lldbutil/iter/TestRegistersIterator.py (2103 of 2153) PASS: lldb-unit :: Host/./HostTests/SocketTest.TCPGetConnectURI (2104 of 2153) PASS: lldb-api :: functionalities/breakpoint/breakpoint_names/TestBreakpointNames.py (2105 of 2153) PASS: lldb-unit :: Disassembler/./DisassemblerTests/TestArmv7Disassembly.TestCortexFPDisass (2106 of 2153) PASS: lldb-unit :: Core/./LLDBCoreTests/RichManglingContextTest.Basic (2107 of 2153) PASS: lldb-unit :: ScriptInterpreter/Python/./ScriptInterpreterPythonTests/PythonDataObjectsTest.TestGlobalNameResolutionNoDot (2108 of 2153) PASS: lldb-unit :: Utility/./UtilityTests/StringLexerTest.NextIfList (2109 of 2153) PASS: lldb-unit :: Utility/./UtilityTests/UriParserTest.BadPort2 (2110 of 2153) PASS: lldb-unit :: Utility/./UtilityTests/ProcessInfoTest.Constructor (2111 of 2153) PASS: lldb-shell :: Recognizer/assert.test (2112 of 2153) PASS: lldb-unit :: Utility/./UtilityTests/ScalarTest.GetBytes (2113 of 2153) UNSUPPORTED: lldb-api :: commands/watchpoints/variable_out_of_scope/TestWatchedVarHitWhenInScope.py (2114 of 2153) PASS: lldb-api :: lang/c/tls_globals/TestTlsGlobals.py (2115 of 2153) PASS: lldb-api :: functionalities/gdb_remote_client/TestPlatformClient.py (2116 of 2153) PASS: lldb-unit :: Utility/./UtilityTests/DataExtractorTest.GetSLEB128_bit63 (2117 of 2153) UNSUPPORTED: lldb-api :: lang/cpp/function-template-parameter-pack/TestFunctionTemplateParameterPack.py (2118 of 2153) PASS: lldb-unit :: Utility/./UtilityTests/StreamTest.PutRawBytesToMixedEndian (2119 of 2153) PASS: lldb-api :: lang/cpp/auto/TestCPPAuto.py (2120 of 2153) PASS: lldb-unit :: Symbol/./SymbolTests/TestClangASTImporter.ImportInvalidType (2121 of 2153) PASS: lldb-api :: types/TestLongTypesExpr.py (2122 of 2153) PASS: lldb-shell :: Unwind/trap_frame_sym_ctx.test (2123 of 2153) PASS: lldb-unit :: Utility/./UtilityTests/BinaryStreamTest.PutULEB128OneByte (2124 of 2153) PASS: lldb-unit :: Utility/./UtilityTests/RangeTest.SetRangeBase (2125 of 2153) PASS: lldb-unit :: Utility/./UtilityTests/RecordReplayTest.InstrumentedFooSameThis (2126 of 2153) PASS: lldb-unit :: UnwindAssembly/x86/./UnwindAssemblyx86Tests/Testx86AssemblyInspectionEngine.TestPopRBX (2127 of 2153) PASS: lldb-api :: api/multithreaded/TestMultithreaded.py (2128 of 2153) PASS: lldb-unit :: Utility/./UtilityTests/Flags.IsClear (2129 of 2153) PASS: lldb-shell :: Settings/TestDisableColor.test (2130 of 2153) PASS: lldb-unit :: Utility/./UtilityTests/StringListTest.Clear (2131 of 2153) PASS: lldb-api :: functionalities/ubsan/user-expression/TestUbsanUserExpression.py (2132 of 2153) PASS: lldb-api :: lang/cpp/thread_local/TestThreadLocal.py (2133 of 2153) PASS: lldb-unit :: Target/./TargetTests/PathMappingListTest.RelativeTests (2134 of 2153) PASS: lldb-unit :: Utility/./UtilityTests/UriParserTest.BadPort (2135 of 2153) PASS: lldb-unit :: ScriptInterpreter/Python/./ScriptInterpreterPythonTests/PythonDataObjectsTest.TestTypeNameResolutionNoDot (2136 of 2153) UNSUPPORTED: lldb-shell :: ScriptInterpreter/Lua/bindings.test (2137 of 2153) PASS: lldb-api :: python_api/watchpoint/TestWatchpointIter.py (2138 of 2153) PASS: lldb-api :: functionalities/tsan/multiple/TestTsanMultiple.py (2139 of 2153) PASS: lldb-unit :: Expression/./ExpressionTests/CppModuleConfigurationTest.IgnoreLibStdCpp (2140 of 2153) PASS: lldb-api :: functionalities/completion/TestCompletion.py (2141 of 2153) PASS: lldb-unit :: UnwindAssembly/x86/./UnwindAssemblyx86Tests/Testx86AssemblyInspectionEngine.TestSimplei386ugmented (2142 of 2153) PASS: lldb-api :: functionalities/data-formatter/data-formatter-objc/TestDataFormatterObjCExpr.py (2143 of 2153) PASS: lldb-shell :: SymbolFile/NativePDB/ast-types.cpp (2144 of 2153) PASS: lldb-api :: functionalities/data-formatter/data-formatter-disabling/TestDataFormatterDisabling.py (2145 of 2153) PASS: lldb-unit :: Utility/./UtilityTests/StreamTest.PutRawBytesToBigEndian (2146 of 2153) PASS: lldb-api :: functionalities/postmortem/elf-core/TestLinuxCore.py (2147 of 2153) PASS: lldb-api :: lang/objc/foundation/TestObjCMethods.py (2148 of 2153) PASS: lldb-api :: lang/cpp/class_types/TestClassTypesDisassembly.py (2149 of 2153) PASS: lldb-unit :: Utility/./UtilityTests/StreamTest.ShiftOperatorPtr (2150 of 2153) PASS: lldb-api :: lang/objc/objc-ivar-protocols/TestIvarProtocols.py (2151 of 2153) PASS: lldb-api :: functionalities/gdb_remote_client/TestGDBRemoteClient.py (2152 of 2153) PASS: lldb-api :: types/TestDoubleTypesExpr.py (2153 of 2153) Slowest Tests: -------------------------------------------------------------------------- 194.43s: lldb-api :: macosx/simulator/TestSimulatorPlatform.py 102.92s: lldb-api :: tools/lldb-server/TestLldbGdbServer.py 92.56s: lldb-api :: functionalities/gdb_remote_client/TestRestartBug.py 86.18s: lldb-api :: lang/objc/hidden-ivars/TestHiddenIvars.py 62.32s: lldb-api :: lang/objc/foundation/TestObjCMethods.py 54.86s: lldb-api :: types/TestIntegerTypeExpr.py 53.87s: lldb-api :: lang/objc/exceptions/TestObjCExceptions.py 53.21s: lldb-shell :: SymbolFile/NativePDB/break-by-line.cpp 52.37s: lldb-api :: lang/objc/foundation/TestFoundationDisassembly.py 47.34s: lldb-api :: api/multithreaded/TestMultithreaded.py 45.10s: lldb-api :: types/TestLongTypesExpr.py 45.07s: lldb-api :: lang/cpp/namespace/TestNamespaceLookup.py 44.48s: lldb-api :: types/TestIntegerType.py 41.30s: lldb-api :: lang/objc/rdar-11355592/TestRdar11355592.py 39.32s: lldb-api :: functionalities/completion/TestCompletion.py 39.02s: lldb-api :: lang/objc/objc-new-syntax/TestObjCNewSyntaxLiteral.py 36.67s: lldb-api :: types/TestCharTypeExpr.py 34.95s: lldb-api :: python_api/target/TestTargetAPI.py 33.10s: lldb-api :: lang/objc/real-definition/TestRealDefinition.py 32.53s: lldb-api :: lang/objc/objc-property/TestObjCProperty.py

Hide Details

Tests Times: -------------------------------------------------------------------------- [ Range ] :: [ Percentage ] :: [ Count ] -------------------------------------------------------------------------- [190s,200s) :: [ ] :: [ 1/2153] [180s,190s) :: [ ] :: [ 0/2153] [170s,180s) :: [ ] :: [ 0/2153] [160s,170s) :: [ ] :: [ 0/2153] [150s,160s) :: [ ] :: [ 0/2153] [140s,150s) :: [ ] :: [ 0/2153] [130s,140s) :: [ ] :: [ 0/2153] [120s,130s) :: [ ] :: [ 0/2153] [110s,120s) :: [ ] :: [ 0/2153] [100s,110s) :: [ ] :: [ 1/2153] [ 90s,100s) :: [ ] :: [ 1/2153] [ 80s, 90s) :: [ ] :: [ 1/2153] [ 70s, 80s) :: [ ] :: [ 0/2153] [ 60s, 70s) :: [ ] :: [ 1/2153] [ 50s, 60s) :: [ ] :: [ 4/2153] [ 40s, 50s) :: [ ] :: [ 7/2153] [ 30s, 40s) :: [ ] :: [ 10/2153] [ 20s, 30s) :: [ ] :: [ 20/2153] [ 10s, 20s) :: [** ] :: [ 135/2153] [ 0s, 10s) :: [************************************ ] :: [1972/2153] -------------------------------------------------------------------------- ******************** Failed Tests (1): lldb-api :: commands/target/stop-hooks/TestStopHookScripted.py

Hide Details

Hide Details

Testing Time: 1617.69s Unsupported : 153 Passed : 1993 Expectedly Failed: 6 Failed : 1 FAILED: tools/lldb/test/CMakeFiles/check-lldb-lit cd /Users/buildslave/jenkins/workspace/lldb-cmake/lldb-build/tools/lldb/test && /usr/local/Frameworks/Python.framework/Versions/3.7/bin/python3.7 /Users/buildslave/jenkins/workspace/lldb-cmake/lldb-build/./bin/llvm-lit -v --time-tests --shuffle --xunit-xml-output=/Users/buildslave/jenkins/workspace/lldb-cmake/test/results.xml -v -j 4 /Users/buildslave/jenkins/workspace/lldb-cmake/lldb-build/tools/lldb/test ninja: build stopped: subcommand failed. Command failed: Command '['/usr/bin/env', 'TERM=vt100', '/usr/local/bin/ninja', '-v', 'check-lldb']' returned non-zero exit status 1 Command: ['/usr/bin/env', 'TERM=vt100', '/usr/local/bin/ninja', '-v', 'check-lldb'] [Pipeline] } [Pipeline] // timeout [Pipeline] } [Pipeline] // stage [Pipeline] stage [Pipeline] { (Declarative: Post Actions) [Pipeline] scanForIssues [Clang (LLVM based)] Sleeping for 5 seconds due to JENKINS-32191... [Clang (LLVM based)] Parsing console log (workspace: '/Users/buildslave/jenkins/workspace/lldb-cmake') [Clang (LLVM based)] Successfully parsed console log [Clang (LLVM based)] -> found 8 issues (skipped 12 duplicates) [Clang (LLVM based)] Post processing issues on 'green-dragon-10' with source code encoding 'UTF-8' [Clang (LLVM based)] Creating SCM blamer to obtain author and commit information for affected files [Clang (LLVM based)] Creating SCM miner to obtain statistics for affected repository files [Clang (LLVM based)] Resolving file names for all issues in source directory '/Users/buildslave/jenkins/workspace/lldb-cmake' [Clang (LLVM based)] -> resolved paths in source directory (6 found, 0 not found) [Clang (LLVM based)] Resolving module names from module definitions (build.xml, pom.xml, or Manifest.mf files) [Clang (LLVM based)] -> resolved module names for 8 issues [Clang (LLVM based)] Resolving package names (or namespaces) by parsing the affected files [Clang (LLVM based)] -> resolved package names of 6 affected files [Clang (LLVM based)] No filter has been set, publishing all 8 issues [Clang (LLVM based)] Creating fingerprints for all affected code blocks to track issues over different builds [Clang (LLVM based)] -> created fingerprints for 8 issues (skipped 0 issues) [Clang (LLVM based)] Copying affected files to Jenkins' build folder '/Users/Shared/Jenkins/Home/jobs/lldb-cmake/builds/23980/files-with-issues' [Clang (LLVM based)] -> 4 copied, 2 not in workspace, 0 not-found, 0 with I/O error [Pipeline] junit Recording test results [Pipeline] } [Pipeline] // stage [Pipeline] } [Pipeline] // withEnv [Pipeline] } [Pipeline] // node [Pipeline] End of Pipeline ERROR: script returned exit code 1 Finished: FAILURE