FailedConsole Output

Skipping 9,145 KB.. Full Log
vityChain.py (1257 of 2153)
PASS: lldb-unit :: Utility/./UtilityTests/StreamTest.PutRawBytesToLittleEndian (1258 of 2153)
PASS: lldb-shell :: SymbolFile/NativePDB/disassembly.cpp (1259 of 2153)
PASS: lldb-unit :: DataFormatter/./LLDBFormatterTests/StringPrinterTests.SwiftUTF8 (1260 of 2153)
UNSUPPORTED: lldb-shell :: Expr/TestIRMemoryMapWindows.test (1261 of 2153)
PASS: lldb-api :: functionalities/avoids-fd-leak/TestFdLeak.py (1262 of 2153)
PASS: lldb-api :: functionalities/thread/concurrent_events/TestConcurrentTwoBreakpointThreads.py (1263 of 2153)
PASS: lldb-unit :: Symbol/./SymbolTests/TestTypeSystemClang.TestGetBasicTypeFromEnum (1264 of 2153)
PASS: lldb-shell :: Commands/command-disassemble-process.yaml (1265 of 2153)
PASS: lldb-unit :: Language/Highlighting/./HighlighterTests/HighlighterTest.DefaultHighlighterWithCursorOutOfBounds (1266 of 2153)
PASS: lldb-unit :: Utility/./UtilityTests/StreamTest.PutCStringWithStringRef (1267 of 2153)
PASS: lldb-api :: commands/frame/diagnose/inheritance/TestDiagnoseInheritance.py (1268 of 2153)
PASS: lldb-api :: commands/expression/import-std-module/weak_ptr-dbg-info-content/TestDbgInfoContentWeakPtrFromStdModule.py (1269 of 2153)
PASS: lldb-unit :: Host/./HostTests/MainLoopTest.TerminatesImmediately (1270 of 2153)
PASS: lldb-unit :: Utility/./UtilityTests/RecordReplayTest.InstrumentedBar (1271 of 2153)
PASS: lldb-shell :: SymbolFile/Breakpad/symtab.test (1272 of 2153)
PASS: lldb-unit :: Core/./LLDBCoreTests/MangledTest.ResultForValidName (1273 of 2153)
PASS: lldb-api :: commands/expression/inline-namespace/TestInlineNamespace.py (1274 of 2153)
PASS: lldb-unit :: Utility/./UtilityTests/StringExtractorTest.GetHexBytesAvail_FullString (1275 of 2153)
PASS: lldb-unit :: Utility/./UtilityTests/ArgsTest.Yaml (1276 of 2153)
PASS: lldb-shell :: Driver/TestRepl.test (1277 of 2153)
PASS: lldb-unit :: Process/minidump/./LLDBMinidumpTests/MinidumpParserTest.GetMiscInfo_no_stream (1278 of 2153)
PASS: lldb-unit :: ObjectFile/Breakpad/./ObjectFileBreakpadTests/LineRecord.parse (1279 of 2153)
PASS: lldb-api :: functionalities/breakpoint/address_breakpoints/TestBadAddressBreakpoints.py (1280 of 2153)
PASS: lldb-shell :: SymbolFile/DWARF/dwp.s (1281 of 2153)
PASS: lldb-unit :: Host/./HostTests/FileSystemTest.GetByteSize (1282 of 2153)
PASS: lldb-api :: lang/c/const_variables/TestConstVariables.py (1283 of 2153)
PASS: lldb-shell :: SymbolFile/DWARF/DW_TAG_variable-invalid_location.s (1284 of 2153)
PASS: lldb-api :: functionalities/dead-strip/TestDeadStrip.py (1285 of 2153)
PASS: lldb-api :: commands/expression/pr35310/TestExprsBug35310.py (1286 of 2153)
PASS: lldb-shell :: SymbolFile/DWARF/debug_loclists-dwo.s (1287 of 2153)
PASS: lldb-unit :: UnwindAssembly/x86/./UnwindAssemblyx86Tests/Testx86AssemblyInspectionEngine.TestDisassemblyMidFunctionEpilogues (1288 of 2153)
PASS: lldb-api :: types/TestShortType.py (1289 of 2153)
PASS: lldb-unit :: Host/./HostTests/SocketTest.TCPListen0GetPort (1290 of 2153)
PASS: lldb-api :: commands/breakpoint/command/list/TestBreakpointCommandList.py (1291 of 2153)
PASS: lldb-api :: functionalities/data-formatter/data-formatter-stl/libcxx/string/TestDataFormatterLibcxxString.py (1292 of 2153)
PASS: lldb-api :: functionalities/breakpoint/global_constructor/TestBreakpointInGlobalConstructor.py (1293 of 2153)
PASS: lldb-shell :: Minidump/Windows/arm-fp-unwind.test (1294 of 2153)
PASS: lldb-unit :: ScriptInterpreter/Python/./ScriptInterpreterPythonTests/PythonDataObjectsTest.TestModuleNameResolutionNoDot (1295 of 2153)
UNSUPPORTED: lldb-shell :: SymbolFile/PDB/type-quals.test (1296 of 2153)
PASS: lldb-unit :: Utility/./UtilityTests/ScalarTest.Promotion (1297 of 2153)
PASS: lldb-unit :: Utility/./UtilityTests/StringListTest.LongestCommonPrefixNoPrefix (1298 of 2153)
PASS: lldb-api :: functionalities/breakpoint/cpp/TestCPPBreakpointLocations.py (1299 of 2153)
PASS: lldb-api :: lang/cpp/elaborated-types/TestElaboratedTypes.py (1300 of 2153)
PASS: lldb-unit :: SymbolFile/DWARF/./SymbolFileDWARFTests/SymbolFileDWARFTests.ParseAranges (1301 of 2153)
PASS: lldb-shell :: Settings/TestSettingsWrite.test (1302 of 2153)
PASS: lldb-api :: sanity/TestModuleCacheSanity.py (1303 of 2153)
PASS: lldb-unit :: Utility/./UtilityTests/UriParserTest.BadPort (1304 of 2153)
UNSUPPORTED: lldb-shell :: SymbolFile/PDB/variables.test (1305 of 2153)
XFAIL: lldb-shell :: Register/x86-mm-xmm-write.test (1306 of 2153)
PASS: lldb-unit :: Process/minidump/./LLDBMinidumpTests/MinidumpParserTest.GetMiscInfoWindows (1307 of 2153)
PASS: lldb-api :: functionalities/thread/concurrent_events/TestConcurrentSignalBreak.py (1308 of 2153)
PASS: lldb-shell :: SymbolFile/DWARF/debug-types-dwarf5.s (1309 of 2153)
PASS: lldb-api :: lang/c/anonymous/TestAnonymous.py (1310 of 2153)
PASS: lldb-unit :: DataFormatter/./LLDBFormatterTests/StringPrinterTests.CxxASCII (1311 of 2153)
PASS: lldb-unit :: Core/./LLDBCoreTests/ModuleSpecTest.TestELFFile (1312 of 2153)
PASS: lldb-api :: functionalities/postmortem/elf-core/gcore/TestGCore.py (1313 of 2153)
PASS: lldb-unit :: Utility/./UtilityTests/Flags.Test (1314 of 2153)
PASS: lldb-api :: commands/command/delete/TestCommandDelete.py (1315 of 2153)
PASS: lldb-unit :: Symbol/./SymbolTests/TestTypeSystemClang.TestDisplayNameEmpty (1316 of 2153)
UNSUPPORTED: lldb-api :: python_api/event/TestEvents.py (1317 of 2153)
UNSUPPORTED: lldb-shell :: ScriptInterpreter/Lua/lua-python.test (1318 of 2153)
PASS: lldb-api :: functionalities/postmortem/mach-core/TestMachCore.py (1319 of 2153)
PASS: lldb-unit :: debugserver/./debugserverTests/RNBSocket.LoopBackListenIPv4 (1320 of 2153)
PASS: lldb-shell :: Commands/command-target-modules-dump-sections.yaml (1321 of 2153)
PASS: lldb-api :: commands/expression/two-files/TestObjCTypeQueryFromOtherCompileUnit.py (1322 of 2153)
PASS: lldb-unit :: Process/gdb-remote/./ProcessGdbRemoteTests/GDBRemoteCommunicationServerTest.SendErrorResponse_ErrorList (1323 of 2153)
PASS: lldb-unit :: Utility/./UtilityTests/Flags.IsClear (1324 of 2153)
PASS: lldb-api :: functionalities/ubsan/basic/TestUbsanBasic.py (1325 of 2153)
PASS: lldb-shell :: SymbolFile/DWARF/limit-debug-info.s (1326 of 2153)
PASS: lldb-api :: macosx/indirect_symbol/TestIndirectSymbols.py (1327 of 2153)
PASS: lldb-unit :: Expression/./ExpressionTests/CppModuleConfigurationTest.LibCppV2 (1328 of 2153)
PASS: lldb-shell :: Breakpoint/debug_rnglist_rlestartend.test (1329 of 2153)
PASS: lldb-api :: functionalities/breakpoint/objc/TestObjCBreakpoints.py (1330 of 2153)
PASS: lldb-unit :: Utility/./UtilityTests/FileSpecTest.EqualDotsPosix (1331 of 2153)
PASS: lldb-api :: iohandler/completion/TestIOHandlerCompletion.py (1332 of 2153)
PASS: lldb-api :: python_api/watchpoint/watchlocation/TestTargetWatchAddress.py (1333 of 2153)
PASS: lldb-api :: functionalities/data-formatter/data-formatter-stl/libcxx/variant/TestDataFormatterLibcxxVariant.py (1334 of 2153)
PASS: lldb-unit :: Signals/./SignalsTests/UnixSignalsTest.GetInfo (1335 of 2153)
PASS: lldb-shell :: SymbolFile/DWARF/DW_AT_declaration-with-children.s (1336 of 2153)
PASS: lldb-unit :: Utility/./UtilityTests/ArgsTest.ReplaceArgumentAtIndexShort (1337 of 2153)
UNSUPPORTED: lldb-api :: commands/watchpoints/multi_watchpoint_slots/TestWatchpointMultipleSlots.py (1338 of 2153)
PASS: lldb-unit :: SymbolFile/NativePDB/./SymbolFileNativePDBTests/PDBFPOProgramToDWARFExpressionTests.UnresolvedDependentCyclicRegisterAssignmentReference (1339 of 2153)
PASS: lldb-unit :: Process/gdb-remote/./ProcessGdbRemoteTests/GDBRemoteClientBaseTest.SendContinueDelegateStructuredDataReceipt (1340 of 2153)
UNSUPPORTED: lldb-api :: commands/target/auto-install-main-executable/TestAutoInstallMainExecutable.py (1341 of 2153)
PASS: lldb-unit :: DataFormatter/./LLDBFormatterTests/TypeMatcherTests.GetMatchStringExactName (1342 of 2153)
UNSUPPORTED: lldb-shell :: ScriptInterpreter/Lua/command_script_import.test (1343 of 2153)
PASS: lldb-shell :: Reproducer/TestDiscard.test (1344 of 2153)
PASS: lldb-api :: lang/cpp/limit-debug-info/TestWithLimitDebugInfo.py (1345 of 2153)
PASS: lldb-unit :: Expression/./ExpressionTests/DiagnosticManagerTest.PutStringSeverities (1346 of 2153)
PASS: lldb-api :: functionalities/unwind/noreturn/module-end/TestNoReturnModuleEnd.py (1347 of 2153)
PASS: lldb-unit :: Utility/./UtilityTests/FileSpecTest.Yaml (1348 of 2153)
PASS: lldb-api :: commands/expression/import-std-module/shared_ptr-dbg-info-content/TestSharedPtrDbgInfoContentFromStdModule.py (1349 of 2153)
PASS: lldb-unit :: Language/Highlighting/./HighlighterTests/HighlighterTest.Colons (1350 of 2153)
PASS: lldb-unit :: Utility/./UtilityTests/ConstStringTest.MangledCounterpart (1351 of 2153)
PASS: lldb-unit :: Symbol/./SymbolTests/LineEntryTest.GetSameLineContiguousAddressRangeNestedInline (1352 of 2153)
PASS: lldb-shell :: Commands/command-regex-delete.test (1353 of 2153)
PASS: lldb-unit :: Host/./HostTests/FileSystemTest.Readable (1354 of 2153)
PASS: lldb-api :: commands/process/launch/TestProcessLaunch.py (1355 of 2153)
PASS: lldb-api :: commands/expression/multiline-completion/TestMultilineCompletion.py (1356 of 2153)
PASS: lldb-unit :: Host/./HostTests/SocketTest.UDPGetConnectURI (1357 of 2153)
PASS: lldb-api :: lang/objc/foundation/TestSymbolTable.py (1358 of 2153)
PASS: lldb-api :: tools/lldb-vscode/breakpoint/TestVSCode_setFunctionBreakpoints.py (1359 of 2153)
PASS: lldb-unit :: Symbol/./SymbolTests/SymbolsTest.TerminateLocateExecutableSymbolFileForUnknownExecutableAndUnknownSymbolFile (1360 of 2153)
PASS: lldb-api :: functionalities/dynamic_value_child_count/TestDynamicValueChildCount.py (1361 of 2153)
PASS: lldb-api :: functionalities/lazy-loading/TestLazyLoading.py (1362 of 2153)
PASS: lldb-unit :: Utility/./UtilityTests/NameMatchesTest.RegularExpression (1363 of 2153)
PASS: lldb-unit :: Language/CPlusPlus/./LanguageCPlusPlusTests/CPlusPlusLanguage.ExtractContextAndIdentifier (1364 of 2153)
PASS: lldb-unit :: Utility/./UtilityTests/BinaryStreamTest.PutSLEB128One (1365 of 2153)
PASS: lldb-api :: functionalities/plugins/command_plugin/TestPluginCommands.py (1366 of 2153)
PASS: lldb-shell :: Quit/TestQuitExitCode0.test (1367 of 2153)
PASS: lldb-shell :: Quit/TestQuitExitCodeTooManyArgs.test (1368 of 2153)
PASS: lldb-unit :: Utility/./UtilityTests/DataExtractorTest.GetMaxS64 (1369 of 2153)
UNSUPPORTED: lldb-shell :: Register/x86-64-zmm-write.test (1370 of 2153)
PASS: lldb-unit :: Language/Highlighting/./HighlighterTests/HighlighterTest.ClangTrailingBackslashBeforeNewline (1371 of 2153)
PASS: lldb-unit :: Utility/./UtilityTests/StreamTeeTest.SetStreamAtIndexOverwrite (1372 of 2153)
PASS: lldb-api :: python_api/symbol-context/two-files/TestSymbolContextTwoFiles.py (1373 of 2153)
PASS: lldb-unit :: Utility/./UtilityTests/BinaryStreamTest.PutULEB128SevenBytes (1374 of 2153)
PASS: lldb-unit :: Interpreter/./InterpreterTests/OptionArgParserTest.toChar (1375 of 2153)
UNSUPPORTED: lldb-api :: functionalities/darwin_log/filter/regex/subsystem/TestDarwinLogFilterRegexSubsystem.py (1376 of 2153)
PASS: lldb-shell :: ObjectFile/ELF/PT_LOAD-overlap.yaml (1377 of 2153)
PASS: lldb-api :: python_api/frame/inlines/TestInlinedFrame.py (1378 of 2153)
PASS: lldb-shell :: SymbolFile/DWARF/debug_ranges-missing-section.s (1379 of 2153)
PASS: lldb-api :: lang/cpp/dynamic-value-same-basename/TestDynamicValueSameBase.py (1380 of 2153)
PASS: lldb-api :: lang/cpp/breakpoint_in_member_func_w_non_primitive_params/TestBreakpointInMemberFuncWNonPrimitiveParams.py (1381 of 2153)
PASS: lldb-api :: functionalities/thread/concurrent_events/TestConcurrentBreakpointsDelayedBreakpointOneWatchpoint.py (1382 of 2153)
PASS: lldb-api :: commands/expression/import-std-module/conflicts/TestStdModuleWithConflicts.py (1383 of 2153)
UNSUPPORTED: lldb-shell :: Register/aarch64-fp-read.test (1384 of 2153)
PASS: lldb-api :: lang/objc/objc-struct-argument/TestObjCStructArgument.py (1385 of 2153)
PASS: lldb-api :: python_api/disassemble-raw-data/TestDisassemble_VST1_64.py (1386 of 2153)
PASS: lldb-api :: lang/c/record_decl_in_expr/TestRecordDeclInExpr.py (1387 of 2153)
PASS: lldb-unit :: Utility/./UtilityTests/XcodeSDKTest.FindXcodeContentsDirectoryInPath (1388 of 2153)
UNSUPPORTED: lldb-api :: functionalities/data-formatter/data-formatter-stl/libstdcpp/list/TestDataFormatterStdList.py (1389 of 2153)
PASS: lldb-api :: lang/c/step_over_no_deadlock/TestStepOverDoesntBlock.py (1390 of 2153)
PASS: lldb-unit :: Utility/./UtilityTests/RangeTest.LessThanInvalid (1391 of 2153)
PASS: lldb-shell :: SymbolFile/NativePDB/globals-fundamental.cpp (1392 of 2153)
PASS: lldb-api :: lang/objc/objc-static-method/TestObjCStaticMethod.py (1393 of 2153)
PASS: lldb-unit :: Utility/./UtilityTests/StreamTest.ShiftOperatorStrings (1394 of 2153)
UNSUPPORTED: lldb-api :: lang/cpp/static_members/TestCPPStaticMembers.py (1395 of 2153)
PASS: lldb-api :: lang/cpp/operator-overload/TestOperatorOverload.py (1396 of 2153)
PASS: lldb-shell :: SymbolFile/NativePDB/break-by-line.cpp (1397 of 2153)
PASS: lldb-unit :: ScriptInterpreter/Python/./ScriptInterpreterPythonTests/PythonDataObjectsTest.TestPythonFile (1398 of 2153)
PASS: lldb-unit :: Utility/./UtilityTests/AnsiTerminal.KnownPrefix (1399 of 2153)
PASS: lldb-api :: tools/lldb-vscode/stackTrace/TestVSCode_stackTrace.py (1400 of 2153)
PASS: lldb-api :: python_api/lldbutil/TestSwigVersion.py (1401 of 2153)
PASS: lldb-api :: lang/cpp/dynamic-value/TestDynamicValue.py (1402 of 2153)
PASS: lldb-unit :: Utility/./UtilityTests/RangeTest.ContainsRangeStartingFromZero (1403 of 2153)
PASS: lldb-unit :: Utility/./UtilityTests/RecordReplayTest.InstrumentedBarRef (1404 of 2153)
PASS: lldb-api :: functionalities/data-formatter/data-formatter-stl/libcxx/multimap/TestDataFormatterLibccMultiMap.py (1405 of 2153)
PASS: lldb-api :: lang/objc/modules-cache/TestClangModulesCache.py (1406 of 2153)
PASS: lldb-api :: commands/expression/char/TestExprsChar.py (1407 of 2153)
PASS: lldb-api :: functionalities/data-formatter/data-formatter-caching/TestDataFormatterCaching.py (1408 of 2153)
PASS: lldb-unit :: Utility/./UtilityTests/StringListTest.CopyList (1409 of 2153)
PASS: lldb-unit :: DataFormatter/./LLDBFormatterTests/TypeMatcherTests.RegexName (1410 of 2153)
PASS: lldb-api :: commands/expression/call-throws/TestCallThatThrows.py (1411 of 2153)
PASS: lldb-unit :: Process/gdb-remote/./ProcessGdbRemoteTests/GDBRemoteClientBaseTest.SendContinueAndInterrupt2PacketBug (1412 of 2153)
PASS: lldb-unit :: Host/./HostTests/HostInfoTest.GetHostname (1413 of 2153)
PASS: lldb-unit :: Utility/./UtilityTests/AnsiTerminal.Unknown (1414 of 2153)
PASS: lldb-api :: commands/expression/import-std-module/empty-module/TestEmptyStdModule.py (1415 of 2153)
PASS: lldb-api :: macosx/DBGSourcePathRemapping/TestDSYMSourcePathRemapping.py (1416 of 2153)
PASS: lldb-api :: functionalities/ubsan/user-expression/TestUbsanUserExpression.py (1417 of 2153)
PASS: lldb-unit :: ScriptInterpreter/Python/./ScriptInterpreterPythonTests/PythonDataObjectsTest.TestPythonIntegerToStr (1418 of 2153)
PASS: lldb-unit :: ScriptInterpreter/Python/./ScriptInterpreterPythonTests/PythonDataObjectsTest.TestPythonStringToStr (1419 of 2153)
PASS: lldb-api :: macosx/universal/TestUniversal.py (1420 of 2153)
PASS: lldb-unit :: Utility/./UtilityTests/FileSpecTest.Match (1421 of 2153)
PASS: lldb-unit :: Utility/./UtilityTests/OptionsWithRawTest.MultiWordSuffix (1422 of 2153)
PASS: lldb-unit :: Utility/./UtilityTests/VMRange.IsValid (1423 of 2153)
PASS: lldb-shell :: Reproducer/Modules/TestModuleCXX.test (1424 of 2153)
PASS: lldb-api :: tools/lldb-server/TestAppleSimulatorOSType.py (1425 of 2153)
PASS: lldb-unit :: Utility/./UtilityTests/StringExtractorTest.DecodeHexU8_InvalidHex (1426 of 2153)
PASS: lldb-api :: macosx/save_crashlog/TestSaveCrashlog.py (1427 of 2153)
PASS: lldb-api :: python_api/default-constructor/TestDefaultConstructorForAPIObjects.py (1428 of 2153)
PASS: lldb-unit :: UnwindAssembly/x86/./UnwindAssemblyx86Tests/Testx86AssemblyInspectionEngine.Test32bitFramelessBigStackFrame (1429 of 2153)
PASS: lldb-unit :: Utility/./UtilityTests/UriParserTest.BracketedHostnamePort (1430 of 2153)
PASS: lldb-unit :: Utility/./UtilityTests/CompletionRequest.ShiftArguments (1431 of 2153)
PASS: lldb-api :: functionalities/conditional_break/TestConditionalBreak.py (1432 of 2153)
PASS: lldb-api :: tools/lldb-server/inferior-crash/TestGdbRemoteSegFault.py (1433 of 2153)
PASS: lldb-unit :: Utility/./UtilityTests/DataExtractorTest.GetCStrEmpty (1434 of 2153)
PASS: lldb-unit :: Utility/./UtilityTests/ArgsTest.TestTrailingBackslash (1435 of 2153)
PASS: lldb-shell :: Breakpoint/jitbp_elf.test (1436 of 2153)
PASS: lldb-api :: functionalities/data-formatter/array_typedef/TestArrayTypedef.py (1437 of 2153)
PASS: lldb-unit :: Utility/./UtilityTests/StreamTest.PutPtr (1438 of 2153)
PASS: lldb-api :: iohandler/resize/TestIOHandlerResizeNoEditline.py (1439 of 2153)
PASS: lldb-unit :: Symbol/./SymbolTests/Type.CompilerContextPattern (1440 of 2153)
PASS: lldb-shell :: ScriptInterpreter/Python/python.test (1441 of 2153)
PASS: lldb-shell :: Unwind/eh-frame-dwarf-unwind.test (1442 of 2153)
UNSUPPORTED: lldb-api :: functionalities/darwin_log/source/debug/TestDarwinLogSourceDebug.py (1443 of 2153)
PASS: lldb-shell :: SymbolFile/dissassemble-entry-point.s (1444 of 2153)
PASS: lldb-unit :: Utility/./UtilityTests/CompletionRequest.TestCompletionOwnership (1445 of 2153)
PASS: lldb-api :: functionalities/breakpoint/comp_dir_symlink/TestCompDirSymLink.py (1446 of 2153)
PASS: lldb-api :: lang/c/vla/TestVLA.py (1447 of 2153)
PASS: lldb-unit :: Process/gdb-remote/./ProcessGdbRemoteTests/GDBRemoteCommunicationClientTest.GetModulesInfoInvalidResponse (1448 of 2153)
PASS: lldb-api :: functionalities/thread/concurrent_events/TestConcurrentTwoWatchpointThreads.py (1449 of 2153)
PASS: lldb-api :: functionalities/optimized_code/TestNoASanExceptionAfterEvalOP_piece.py (1450 of 2153)
PASS: lldb-unit :: Utility/./UtilityTests/StreamTest.Indent (1451 of 2153)
PASS: lldb-api :: commands/frame/var-scope/TestFrameVariableScope.py (1452 of 2153)
PASS: lldb-unit :: Utility/./UtilityTests/StringExtractorTest.GetNameColonValueNoColon (1453 of 2153)
PASS: lldb-unit :: Language/Highlighting/./HighlighterTests/HighlighterTest.HighlighterSelectionPath (1454 of 2153)
PASS: lldb-shell :: Watchpoint/SetErrorCases.test (1455 of 2153)
PASS: lldb-unit :: Expression/./ExpressionTests/ClangHostTest.ComputeClangResourceDirectory (1456 of 2153)
PASS: lldb-unit :: Process/gdb-remote/./ProcessGdbRemoteTests/GDBRemoteCommunicationClientTest.GetModulesInfo (1457 of 2153)
PASS: lldb-unit :: Utility/./UtilityTests/DataExtractorTest.GetMaxU64 (1458 of 2153)
PASS: lldb-shell :: ScriptInterpreter/None/import_module.test (1459 of 2153)
PASS: lldb-unit :: Process/gdb-remote/./ProcessGdbRemoteTests/GDBRemoteCommunicationClientTest.SaveRestoreRegistersNoSuffix (1460 of 2153)
PASS: lldb-unit :: Utility/./UtilityTests/StringExtractorTest.GetU32BigEndian (1461 of 2153)
PASS: lldb-shell :: ObjectFile/ELF/gnu-debuglink.yaml (1462 of 2153)
PASS: lldb-api :: functionalities/data-formatter/data-formatter-objc/TestDataFormatterObjCNSError.py (1463 of 2153)
PASS: lldb-unit :: Process/gdb-remote/./ProcessGdbRemoteTests/GDBRemoteCommunicationServerTest.SendErrorResponse_Status (1464 of 2153)
UNSUPPORTED: lldb-api :: tools/lldb-vscode/completions/TestVSCode_completions.py (1465 of 2153)
PASS: lldb-unit :: Utility/./UtilityTests/ScalarTest.Division (1466 of 2153)
PASS: lldb-unit :: Signals/./SignalsTests/UnixSignalsTest.GetFilteredSignals (1467 of 2153)
UNSUPPORTED: lldb-api :: arm/breakpoint-thumb-codesection/TestBreakpointThumbCodesection.py (1468 of 2153)
PASS: lldb-unit :: Process/minidump/./LLDBMinidumpTests/MinidumpParserTest.GetMemory (1469 of 2153)
PASS: lldb-shell :: SymbolFile/Breakpad/line-table-edgecases.test (1470 of 2153)
PASS: lldb-shell :: SymbolFile/DWARF/debug-types-missing-signature.test (1471 of 2153)
PASS: lldb-unit :: UnwindAssembly/x86/./UnwindAssemblyx86Tests/Testx86AssemblyInspectionEngine.TestSubESP (1472 of 2153)
PASS: lldb-unit :: SymbolFile/NativePDB/./SymbolFileNativePDBTests/PDBFPOProgramToDWARFExpressionTests.InvalidAssignmentSingle (1473 of 2153)
PASS: lldb-api :: commands/expression/import-std-module/forward_list-dbg-info-content/TestDbgInfoContentForwardListFromStdModule.py (1474 of 2153)
PASS: lldb-unit :: Utility/./UtilityTests/StreamTest.PutHex16ByteOrderLittle (1475 of 2153)
UNSUPPORTED: lldb-api :: commands/watchpoints/hello_watchlocation/TestWatchLocation.py (1476 of 2153)
PASS: lldb-unit :: Expression/./ExpressionTests/CppModuleConfigurationTest.MissingLibCpp (1477 of 2153)
PASS: lldb-unit :: Host/./HostTests/MainLoopTest.Signal (1478 of 2153)
PASS: lldb-shell :: Register/x86-64-read.test (1479 of 2153)
PASS: lldb-unit :: Utility/./UtilityTests/BinaryStreamTest.PutULEB128OneByte (1480 of 2153)
PASS: lldb-api :: functionalities/data-formatter/data-formatter-stl/libcxx/unique_ptr/TestDataFormatterLibcxxUniquePtr.py (1481 of 2153)
PASS: lldb-unit :: Utility/./UtilityTests/RecordReplayTest.InstrumentedBarPtr (1482 of 2153)
PASS: lldb-unit :: Utility/./UtilityTests/StringExtractorTest.GetNameColonValueContainsColon (1483 of 2153)
PASS: lldb-api :: functionalities/thread/concurrent_events/TestConcurrentTwoWatchpointsOneSignal.py (1484 of 2153)
PASS: lldb-unit :: Utility/./UtilityTests/BinaryStreamTest.PutULEB128One (1485 of 2153)
PASS: lldb-api :: lang/c/set_values/TestSetValues.py (1486 of 2153)
UNSUPPORTED: lldb-api :: benchmarks/libcxxmap/TestBenchmarkLibcxxMap.py (1487 of 2153)
PASS: lldb-api :: lang/cpp/auto/TestCPPAuto.py (1488 of 2153)
PASS: lldb-api :: functionalities/memory/cache/TestMemoryCache.py (1489 of 2153)
PASS: lldb-api :: functionalities/breakpoint/breakpoint_hit_count/TestBreakpointHitCount.py (1490 of 2153)
PASS: lldb-unit :: Utility/./UtilityTests/DataExtractorTest.GetFloatUnaligned (1491 of 2153)
PASS: lldb-unit :: UnwindAssembly/x86/./UnwindAssemblyx86Tests/Testx86AssemblyInspectionEngine.TestSimplex86_64Augmented (1492 of 2153)
PASS: lldb-unit :: Utility/./UtilityTests/RegularExpression.Invalid (1493 of 2153)
PASS: lldb-api :: functionalities/thread/step_until/TestStepUntil.py (1494 of 2153)
PASS: lldb-shell :: SymbolFile/Breakpad/stack-cfi-arm.yaml (1495 of 2153)
PASS: lldb-unit :: UnwindAssembly/x86/./UnwindAssemblyx86Tests/Testx86AssemblyInspectionEngine.TestPushR15 (1496 of 2153)
PASS: lldb-api :: python_api/watchpoint/watchlocation/TestSetWatchlocation.py (1497 of 2153)
PASS: lldb-unit :: UnwindAssembly/x86/./UnwindAssemblyx86Tests/Testx86AssemblyInspectionEngine.TestReturnDetect (1498 of 2153)
PASS: lldb-unit :: SymbolFile/DWARF/./SymbolFileDWARFTests/SymbolFileDWARFTests.TestAbbrevNullAttrValidForm (1499 of 2153)
PASS: lldb-unit :: Utility/./UtilityTests/StringListTest.LongestCommonPrefixSingleElement (1500 of 2153)
PASS: lldb-unit :: Utility/./UtilityTests/UriParserTest.SchemeHostSeparator3 (1501 of 2153)
PASS: lldb-api :: functionalities/breakpoint/breakpoint_names/TestBreakpointNames.py (1502 of 2153)
UNSUPPORTED: lldb-shell :: Unwind/unwind-plan-dwarf-dump.test (1503 of 2153)
PASS: lldb-api :: functionalities/gdb_remote_client/TestRegDefinitionInParts.py (1504 of 2153)
PASS: lldb-api :: macosx/nslog/TestDarwinNSLogOutput.py (1505 of 2153)
PASS: lldb-unit :: Process/minidump/./LLDBMinidumpTests/MinidumpParserTest.MinidumpModuleOrder (1506 of 2153)
PASS: lldb-unit :: Expression/./ExpressionTests/DWARFExpression.DW_OP_stack_value (1507 of 2153)
PASS: lldb-unit :: Expression/./ExpressionTests/DiagnosticManagerTest.AppendMessageAttachToLastDiag (1508 of 2153)
PASS: lldb-api :: functionalities/tail_call_frames/disambiguate_paths_to_common_sink/TestDisambiguatePathsToCommonSink.py (1509 of 2153)
PASS: lldb-unit :: Utility/./UtilityTests/StringExtractorTest.GetU64LittleEndian (1510 of 2153)
PASS: lldb-unit :: Utility/./UtilityTests/SerializationRountripTest.SerializeDeserializePodReferences (1511 of 2153)
UNSUPPORTED: lldb-api :: functionalities/data-formatter/data-formatter-stl/libstdcpp/vbool/TestDataFormatterStdVBool.py (1512 of 2153)
PASS: lldb-unit :: Utility/./UtilityTests/DataExtractorTest.PeekData (1513 of 2153)
PASS: lldb-unit :: Utility/./UtilityTests/PassiveReplayTest.InstrumentedBarPtr (1514 of 2153)
PASS: lldb-api :: functionalities/data-formatter/boolreference/TestFormattersBoolRefPtr.py (1515 of 2153)
PASS: lldb-unit :: ScriptInterpreter/Python/./ScriptInterpreterPythonTests/PythonDataObjectsTest.TestPythonDictionaryValueEquality (1516 of 2153)
PASS: lldb-shell :: ObjectFile/PECOFF/symbol.yaml (1517 of 2153)
PASS: lldb-api :: functionalities/gdb_remote_client/TestNestedRegDefinitions.py (1518 of 2153)
PASS: lldb-unit :: Utility/./UtilityTests/SubsystemRAIITest.SubsystemWithErrorSuccess (1519 of 2153)
PASS: lldb-shell :: SymbolFile/DWARF/debug_loc_and_loclists.s (1520 of 2153)
PASS: lldb-api :: functionalities/breakpoint/source_regexp/TestSourceRegexBreakpoints.py (1521 of 2153)
PASS: lldb-api :: functionalities/gdb_remote_client/TestRestartBug.py (1522 of 2153)
PASS: lldb-api :: functionalities/thread/concurrent_events/TestConcurrentWatchBreakDelay.py (1523 of 2153)
PASS: lldb-shell :: Reproducer/TestFileRepro.test (1524 of 2153)
PASS: lldb-api :: functionalities/step_scripted/TestStepScripted.py (1525 of 2153)
PASS: lldb-api :: functionalities/gdb_remote_client/TestPlatformClient.py (1526 of 2153)
PASS: lldb-api :: commands/expression/import-std-module/stack/TestStackFromStdModule.py (1527 of 2153)
PASS: lldb-unit :: UnwindAssembly/x86/./UnwindAssemblyx86Tests/Testx86AssemblyInspectionEngine.TestSimple64bitFrameFunction (1528 of 2153)
PASS: lldb-shell :: SymbolFile/DWARF/DW_AT_loclists_base.s (1529 of 2153)
PASS: lldb-api :: api/check_public_api_headers/TestPublicAPIHeaders.py (1530 of 2153)
PASS: lldb-unit :: Utility/./UtilityTests/StringListTest.AppendListCStringArray (1531 of 2153)
PASS: lldb-api :: functionalities/load_unload/TestLoadUnload.py (1532 of 2153)
PASS: lldb-api :: lang/objc/real-definition/TestRealDefinition.py (1533 of 2153)
PASS: lldb-api :: lang/cpp/class_types/TestClassTypesDisassembly.py (1534 of 2153)
PASS: lldb-shell :: SymbolFile/NativePDB/function-types-builtins.cpp (1535 of 2153)
PASS: lldb-api :: functionalities/history/TestHistoryRecall.py (1536 of 2153)
PASS: lldb-api :: tools/lldb-server/commandline/TestStubReverseConnect.py (1537 of 2153)
PASS: lldb-unit :: Core/./LLDBCoreTests/MangledTest.ResultForBlockInvocation (1538 of 2153)
PASS: lldb-api :: functionalities/load_using_paths/TestLoadUsingPaths.py (1539 of 2153)
PASS: lldb-api :: lang/c/step-target/TestStepTarget.py (1540 of 2153)
PASS: lldb-api :: iohandler/unicode/TestUnicode.py (1541 of 2153)
PASS: lldb-unit :: Process/minidump/./LLDBMinidumpTests/MinidumpParserTest.GetPidWindows (1542 of 2153)
PASS: lldb-unit :: Utility/./UtilityTests/ArchSpecTest.MergeFromMachOUnknown (1543 of 2153)
PASS: lldb-api :: commands/expression/persistent_types/TestNestedPersistentTypes.py (1544 of 2153)
PASS: lldb-api :: macosx/duplicate-archive-members/TestDuplicateMembers.py (1545 of 2153)
PASS: lldb-unit :: Host/./HostTests/SocketTest.TCPListen0ConnectAccept (1546 of 2153)
PASS: lldb-api :: lang/objc/foundation/TestObjCMethodsNSArray.py (1547 of 2153)
PASS: lldb-unit :: Target/./TargetTests/ExecutionContextTest.GetByteOrderTarget (1548 of 2153)
PASS: lldb-api :: commands/watchpoints/watchpoint_set_command/TestWatchLocationWithWatchSet.py (1549 of 2153)
PASS: lldb-unit :: ObjectFile/Breakpad/./ObjectFileBreakpadTests/PublicRecord.parse (1550 of 2153)
PASS: lldb-shell :: SymbolFile/Breakpad/unwind-via-raSearch.test (1551 of 2153)
PASS: lldb-shell :: Settings/TestStopCommandSourceOnError.test (1552 of 2153)
PASS: lldb-unit :: Utility/./UtilityTests/ProcessInfoTest.Constructor (1553 of 2153)
PASS: lldb-shell :: ObjectFile/wasm/unified-debug-sections.yaml (1554 of 2153)
PASS: lldb-unit :: UnwindAssembly/x86/./UnwindAssemblyx86Tests/Testx86AssemblyInspectionEngine.TestSubRSP (1555 of 2153)
PASS: lldb-unit :: Host/./HostTests/SocketTest.TCPGetAddress (1556 of 2153)
PASS: lldb-api :: macosx/profile_vrs_detach/TestDetachVrsProfile.py (1557 of 2153)
UNSUPPORTED: lldb-api :: functionalities/darwin_log/filter/exact_match/activity/TestDarwinLogFilterMatchActivity.py (1558 of 2153)
PASS: lldb-unit :: UnwindAssembly/x86/./UnwindAssemblyx86Tests/Testx86AssemblyInspectionEngine.TestAddRSP (1559 of 2153)
PASS: lldb-unit :: Process/gdb-remote/./ProcessGdbRemoteTests/GDBRemoteClientBaseTest.SendContinueAndLateInterrupt (1560 of 2153)
PASS: lldb-api :: macosx/add-dsym/TestAddDsymMidExecutionCommand.py (1561 of 2153)
PASS: lldb-unit :: Utility/./UtilityTests/BroadcasterTest.BroadcastEvent (1562 of 2153)
PASS: lldb-shell :: Reproducer/TestDSYM.test (1563 of 2153)
PASS: lldb-unit :: Language/Highlighting/./HighlighterTests/HighlighterTest.ClangTrailingBackslashWithWhitespace (1564 of 2153)
PASS: lldb-unit :: ScriptInterpreter/Python/./ScriptInterpreterPythonTests/PythonDataObjectsTest.TestPythonListToStructuredList (1565 of 2153)
PASS: lldb-api :: functionalities/data-formatter/pyobjsynthprovider/TestPyObjSynthProvider.py (1566 of 2153)
PASS: lldb-api :: functionalities/set-data/TestSetData.py (1567 of 2153)
PASS: lldb-unit :: Core/./LLDBCoreTests/ModuleSpecTest.TestMachOFile (1568 of 2153)
PASS: lldb-unit :: Process/gdb-remote/./ProcessGdbRemoteTests/GDBRemoteClientBaseTest.SendContinueAndAsyncSignal (1569 of 2153)
PASS: lldb-unit :: Process/minidump/./LLDBMinidumpTests/MinidumpParserTest.GetMemoryRegionInfoLinuxMaps (1570 of 2153)
PASS: lldb-unit :: UnwindAssembly/x86/./UnwindAssemblyx86Tests/Testx86AssemblyInspectionEngine.TestPushImm (1571 of 2153)
PASS: lldb-unit :: Utility/./UtilityTests/DataExtractorTest.GetCStrAtEnd (1572 of 2153)
PASS: lldb-unit :: Utility/./UtilityTests/NameMatchesTest.Contains (1573 of 2153)
PASS: lldb-unit :: Symbol/./SymbolTests/TestClangASTImporter.DeportDeclTagDecl (1574 of 2153)
PASS: lldb-shell :: SymbolFile/DWARF/DW_OP_piece-smaller-than-struct.s (1575 of 2153)
PASS: lldb-unit :: ScriptInterpreter/Python/./ScriptInterpreterPythonTests/PythonDataObjectsTest.TestObjectAttributes (1576 of 2153)
PASS: lldb-shell :: ObjectFile/ELF/base-address.yaml (1577 of 2153)
PASS: lldb-unit :: Utility/./UtilityTests/BinaryStreamTest.PutULEB128MaxValue (1578 of 2153)
PASS: lldb-unit :: Utility/./UtilityTests/UriParserTest.SchemeHostSeparator (1579 of 2153)
PASS: lldb-unit :: UnwindAssembly/x86/./UnwindAssemblyx86Tests/Testx86AssemblyInspectionEngine.Test64bitFramelessSmallStackFrame (1580 of 2153)
PASS: lldb-api :: lang/cpp/global_variables/TestCPPGlobalVariables.py (1581 of 2153)
PASS: lldb-unit :: Utility/./UtilityTests/StringExtractorTest.GetHexU8_Extra (1582 of 2153)
PASS: lldb-api :: lang/objc/foundation/TestObjectDescriptionAPI.py (1583 of 2153)
PASS: lldb-unit :: Thread/./ThreadTests/ThreadTest.SetStopInfo (1584 of 2153)
PASS: lldb-unit :: Process/gdb-remote/./ProcessGdbRemoteTests/GDBRemoteCommunicationClientTest.SendGetMetaDataPacket (1585 of 2153)
PASS: lldb-unit :: Process/minidump/./LLDBMinidumpTests/MinidumpParserTest.MinidumpDuplicateModuleMappedFirst (1586 of 2153)
PASS: lldb-unit :: Utility/./UtilityTests/ArchSpecTest.YAML (1587 of 2153)
PASS: lldb-unit :: Language/Highlighting/./HighlighterTests/HighlighterTest.ClangPPDirectives (1588 of 2153)
PASS: lldb-unit :: tools/lldb-server/tests/./LLDBServerTests/StandardStartupTest.TestStopReplyContainsThreadPcs (1589 of 2153)
PASS: lldb-api :: lang/c/function_types/TestFunctionTypes.py (1590 of 2153)
UNSUPPORTED: lldb-api :: benchmarks/expression/TestExpressionCmd.py (1591 of 2153)
PASS: lldb-api :: commands/expression/function_template_specialization_temp_args/TestFunctionTemplateSpecializationTempArgs.py (1592 of 2153)
PASS: lldb-unit :: ScriptInterpreter/Python/./ScriptInterpreterPythonTests/PythonDataObjectsTest.TestRun (1593 of 2153)
PASS: lldb-shell :: ObjectFile/ELF/build-id-case.yaml (1594 of 2153)
PASS: lldb-unit :: Utility/./UtilityTests/StringLexerTest.HasAtLeast (1595 of 2153)
PASS: lldb-shell :: SymbolFile/DWARF/find-basic-type.cpp (1596 of 2153)
PASS: lldb-api :: functionalities/tsan/basic/TestTsanBasic.py (1597 of 2153)
PASS: lldb-unit :: Process/gdb-remote/./ProcessGdbRemoteTests/GDBRemoteClientBaseTest.SendContinueDelegateInterface (1598 of 2153)
PASS: lldb-api :: functionalities/breakpoint/inlined_breakpoints/TestInlinedBreakpoints.py (1599 of 2153)
PASS: lldb-unit :: UnwindAssembly/x86/./UnwindAssemblyx86Tests/Testx86AssemblyInspectionEngine.TestPushEDI (1600 of 2153)
PASS: lldb-unit :: Utility/./UtilityTests/RangeVector.CombineConsecutiveRanges (1601 of 2153)
PASS: lldb-api :: functionalities/target_var/TestTargetVar.py (1602 of 2153)
PASS: lldb-unit :: Target/./TargetTests/PathMappingListTest.RemapRoot (1603 of 2153)
PASS: lldb-api :: functionalities/wrong_commands/TestWrongCommands.py (1604 of 2153)
PASS: lldb-unit :: Utility/./UtilityTests/StringExtractorTest.GetU64BigEndian (1605 of 2153)
PASS: lldb-unit :: SymbolFile/NativePDB/./SymbolFileNativePDBTests/PDBFPOProgramToDWARFExpressionTests.InvalidOpUnary (1606 of 2153)
PASS: lldb-unit :: Utility/./UtilityTests/UriParserTest.PortOverflow (1607 of 2153)
PASS: lldb-shell :: SymbolFile/DWARF/dir-separator-windows.s (1608 of 2153)
PASS: lldb-unit :: Utility/./UtilityTests/ArchSpecTest.Compatibility (1609 of 2153)
PASS: lldb-api :: lang/c/shared_lib/TestSharedLib.py (1610 of 2153)
PASS: lldb-unit :: Utility/./UtilityTests/StringListTest.GetSize (1611 of 2153)
PASS: lldb-shell :: Breakpoint/debug_addrx.test (1612 of 2153)
PASS: lldb-unit :: UnwindAssembly/x86/./UnwindAssemblyx86Tests/Testx86AssemblyInspectionEngine.TestPushEBP (1613 of 2153)
PASS: lldb-shell :: SymbolFile/DWARF/find-basic-variable.cpp (1614 of 2153)
PASS: lldb-unit :: Utility/./UtilityTests/XcodeSDKTest.GetSDKTypeForTriple (1615 of 2153)
PASS: lldb-unit :: Host/./HostTests/FileActionTest.Open (1616 of 2153)
PASS: lldb-api :: functionalities/thread/concurrent_events/TestConcurrentTwoBreakpointsOneDelaySignal.py (1617 of 2153)
PASS: lldb-unit :: ScriptInterpreter/Python/./ScriptInterpreterPythonTests/PythonDataObjectsTest.TestOwnedReferences (1618 of 2153)
PASS: lldb-unit :: Process/minidump/./LLDBMinidumpTests/MinidumpParserTest.GetLinuxProcStatus (1619 of 2153)
XFAIL: lldb-shell :: Unwind/prefer-debug-over-eh-frame.test (1620 of 2153)
PASS: lldb-unit :: Symbol/./SymbolTests/TestTypeSystemClang.TestDisplayName (1621 of 2153)
PASS: lldb-unit :: Utility/./UtilityTests/VMRange.ContainsAddr (1622 of 2153)
PASS: lldb-api :: types/TestFloatTypes.py (1623 of 2153)
PASS: lldb-unit :: Language/Highlighting/./HighlighterTests/HighlighterTest.ClangStringLiterals (1624 of 2153)
PASS: lldb-api :: functionalities/data-formatter/data-formatter-disabling/TestDataFormatterDisabling.py (1625 of 2153)
PASS: lldb-api :: commands/expression/rdar44436068/Test128BitsInteger.py (1626 of 2153)
PASS: lldb-unit :: ScriptInterpreter/Python/./ScriptInterpreterPythonTests/PythonDataObjectsTest.TestInstanceNameResolutionNoDot (1627 of 2153)
PASS: lldb-shell :: ObjectFile/PECOFF/invalid-export-table.yaml (1628 of 2153)
PASS: lldb-unit :: Utility/./UtilityTests/StreamTeeTest.Constructor2Streams (1629 of 2153)
PASS: lldb-unit :: Process/minidump/./LLDBMinidumpTests/MinidumpParserTest.GetThreadContext_x86_64 (1630 of 2153)
PASS: lldb-api :: functionalities/fat_archives/TestFatArchives.py (1631 of 2153)
PASS: lldb-shell :: ScriptInterpreter/Python/eof.test (1632 of 2153)
PASS: lldb-unit :: Symbol/./SymbolTests/TestClangASTImporter.DeportTypeTagDecl (1633 of 2153)
PASS: lldb-unit :: UnwindAssembly/x86/./UnwindAssemblyx86Tests/Testx86AssemblyInspectionEngine.TestDisassemblyJunkBytes (1634 of 2153)
PASS: lldb-unit :: Utility/./UtilityTests/StreamTest.PutHex64ByteOrderLittle (1635 of 2153)
PASS: lldb-unit :: Utility/./UtilityTests/StreamTest.PutChar (1636 of 2153)
PASS: lldb-unit :: Utility/./UtilityTests/LogChannelEnabledTest.LogThread (1637 of 2153)
PASS: lldb-api :: python_api/watchpoint/TestSetWatchpoint.py (1638 of 2153)
PASS: lldb-api :: commands/watchpoints/watchpoint_commands/command/TestWatchpointCommandLLDB.py (1639 of 2153)
PASS: lldb-api :: lang/objc/variadic_methods/TestVariadicMethods.py (1640 of 2153)
PASS: lldb-shell :: Settings/TestLineMarkerColor.test (1641 of 2153)
PASS: lldb-api :: lang/cpp/function-qualifiers/TestCppFunctionQualifiers.py (1642 of 2153)
PASS: lldb-unit :: SymbolFile/DWARF/./SymbolFileDWARFTests/SymbolFileDWARFTests.ParseArangesNonzeroSegmentSize (1643 of 2153)
PASS: lldb-api :: functionalities/breakpoint/breakpoint_command/TestRegexpBreakCommand.py (1644 of 2153)
PASS: lldb-api :: commands/frame/diagnose/array/TestArray.py (1645 of 2153)
PASS: lldb-shell :: ObjectFile/MachO/subsections.yaml (1646 of 2153)
UNSUPPORTED: lldb-shell :: Register/x86-64-xmm16-read.test (1647 of 2153)
PASS: lldb-unit :: Host/./HostTests/NativeProcessProtocolTest.SetBreakpoint (1648 of 2153)
PASS: lldb-api :: lang/cpp/this/TestCPPThis.py (1649 of 2153)
PASS: lldb-api :: lang/cpp/char1632_t/TestChar1632T.py (1650 of 2153)
PASS: lldb-unit :: UnwindAssembly/x86/./UnwindAssemblyx86Tests/Testx86AssemblyInspectionEngine.TestCALLNextInsn (1651 of 2153)
PASS: lldb-unit :: Utility/./UtilityTests/ArgsTest.TestInsertArg (1652 of 2153)
PASS: lldb-shell :: Quit/TestQuitExitCode-30.test (1653 of 2153)
PASS: lldb-api :: python_api/value/empty_class/TestValueAPIEmptyClass.py (1654 of 2153)
PASS: lldb-unit :: Utility/./UtilityTests/RangeDataVector.FindEntryIndexesThatContain_Overlap (1655 of 2153)
PASS: lldb-api :: functionalities/gdb_remote_client/TestqOffsets.py (1656 of 2153)
PASS: lldb-api :: commands/expression/expr-in-syscall/TestExpressionInSyscall.py (1657 of 2153)
PASS: lldb-shell :: SymbolFile/DWARF/module-ownership.mm (1658 of 2153)
PASS: lldb-api :: functionalities/data-formatter/var-in-aggregate-misuse/TestVarInAggregateMisuse.py (1659 of 2153)
PASS: lldb-unit :: Utility/./UtilityTests/StringLexerTest.AdvanceIf (1660 of 2153)
PASS: lldb-unit :: Target/./TargetTests/ExecutionContextTest.GetByteOrder (1661 of 2153)
PASS: lldb-api :: functionalities/var_path/TestVarPath.py (1662 of 2153)
PASS: lldb-shell :: SymbolFile/DWARF/compilercontext.ll (1663 of 2153)
PASS: lldb-api :: commands/expression/import-std-module/sysroot/TestStdModuleSysroot.py (1664 of 2153)
PASS: lldb-unit :: Process/gdb-remote/./ProcessGdbRemoteTests/GDBRemoteCommunicationClientTest.GetMemoryRegionInfo (1665 of 2153)
PASS: lldb-api :: functionalities/inferior-crashing/recursive-inferior/TestRecursiveInferior.py (1666 of 2153)
PASS: lldb-unit :: Utility/./UtilityTests/ArgsTest.StringListConstructor (1667 of 2153)
PASS: lldb-api :: functionalities/thread/concurrent_events/TestConcurrentBreakpointDelayBreakpointOneSignal.py (1668 of 2153)
PASS: lldb-unit :: SymbolFile/NativePDB/./SymbolFileNativePDBTests/PDBFPOProgramToDWARFExpressionTests.UnknownOp (1669 of 2153)
PASS: lldb-unit :: Utility/./UtilityTests/StringExtractorTest.GetHexBytes (1670 of 2153)
PASS: lldb-unit :: Host/./HostTests/FileSystemTest.Exists (1671 of 2153)
PASS: lldb-shell :: Reproducer/TestWorkingDir.test (1672 of 2153)
PASS: lldb-unit :: UnwindAssembly/x86/./UnwindAssemblyx86Tests/Testx86AssemblyInspectionEngine.TestPopRBP (1673 of 2153)
UNSUPPORTED: lldb-api :: commands/expression/completion-crash-invalid-iterator/TestInvalidIteratorCompletionCrash.py (1674 of 2153)
PASS: lldb-unit :: Utility/./UtilityTests/StreamTeeTest.Assignment (1675 of 2153)
PASS: lldb-unit :: Utility/./UtilityTests/StringListTest.Clear (1676 of 2153)
PASS: lldb-unit :: ScriptInterpreter/Python/./ScriptInterpreterPythonTests/PythonDataObjectsTest.TestTypeNameResolutionNoDot (1677 of 2153)
PASS: lldb-unit :: UnwindAssembly/x86/./UnwindAssemblyx86Tests/Testx86AssemblyInspectionEngine.TestPushEDX (1678 of 2153)
PASS: lldb-unit :: Utility/./UtilityTests/VASprintfTest.BufferResize (1679 of 2153)
PASS: lldb-unit :: Utility/./UtilityTests/StreamTest.AddressPrefix (1680 of 2153)
PASS: lldb-unit :: Utility/./UtilityTests/BinaryStreamTest.PutSLEB128MaxValue (1681 of 2153)
PASS: lldb-unit :: Utility/./UtilityTests/Flags.AllClear (1682 of 2153)
UNSUPPORTED: lldb-api :: tools/lldb-server/platform-process-connect/TestPlatformProcessConnect.py (1683 of 2153)
PASS: lldb-api :: commands/expression/call-function/TestCallStopAndContinue.py (1684 of 2153)
PASS: lldb-api :: commands/gui/basic/TestGuiBasic.py (1685 of 2153)
PASS: lldb-unit :: ObjectFile/Breakpad/./ObjectFileBreakpadTests/InfoRecord.parse (1686 of 2153)
PASS: lldb-unit :: Utility/./UtilityTests/StringListTest.PopBack (1687 of 2153)
PASS: lldb-shell :: Breakpoint/debug_rnglist_basic.test (1688 of 2153)
PASS: lldb-api :: functionalities/data-formatter/ptr_ref_typedef/TestPtrRef2Typedef.py (1689 of 2153)
UNSUPPORTED: lldb-api :: functionalities/data-formatter/data-formatter-stl/libstdcpp/string/TestDataFormatterStdString.py (1690 of 2153)
PASS: lldb-shell :: SymbolFile/DWARF/debug_line-tombstone.s (1691 of 2153)
PASS: lldb-api :: functionalities/postmortem/wow64_minidump/TestWow64MiniDump.py (1692 of 2153)
PASS: lldb-api :: functionalities/data-formatter/data-formatter-objc/TestDataFormatterObjCNSData.py (1693 of 2153)
UNSUPPORTED: lldb-shell :: Register/x86-gp-write.test (1694 of 2153)
PASS: lldb-shell :: Minidump/memory-region-from-module.yaml (1695 of 2153)
PASS: lldb-unit :: Utility/./UtilityTests/OptionsWithRawTest.EmptySuffix (1696 of 2153)
PASS: lldb-unit :: Symbol/./SymbolTests/TestTypeSystemClang.TestNotDeletingUserCopyCstrDueToMoveCStr (1697 of 2153)
UNSUPPORTED: lldb-api :: functionalities/thread/create_during_step/TestCreateDuringStep.py (1698 of 2153)
PASS: lldb-api :: functionalities/inline-stepping/TestInlineStepping.py (1699 of 2153)
PASS: lldb-shell :: SymbolFile/Breakpad/symtab-macho.test (1700 of 2153)
PASS: lldb-shell :: SymbolFile/Breakpad/unwind-via-stack-win.test (1701 of 2153)
PASS: lldb-api :: functionalities/data-formatter/data-formatter-smart-array/TestDataFormatterSmartArray.py (1702 of 2153)
PASS: lldb-unit :: Symbol/./SymbolTests/TestTypeSystemClang.TestOwningModule (1703 of 2153)
PASS: lldb-unit :: Utility/./UtilityTests/LogChannelEnabledTest.LogGetLogThread (1704 of 2153)
PASS: lldb-unit :: Utility/./UtilityTests/ArgsTest.EscapeLLDBCommandArgument (1705 of 2153)
PASS: lldb-unit :: Utility/./UtilityTests/ScalarTest.ExtractBitfield (1706 of 2153)
PASS: lldb-api :: functionalities/thread/jump/TestThreadJump.py (1707 of 2153)
PASS: lldb-unit :: Utility/./UtilityTests/Flags.Reset (1708 of 2153)
PASS: lldb-unit :: Utility/./UtilityTests/EnvironmentTest.EnvpConversion (1709 of 2153)
PASS: lldb-api :: functionalities/tsan/global_location/TestTsanGlobalLocation.py (1710 of 2153)
PASS: lldb-shell :: SymbolFile/DWARF/DW_TAG_basic_type_DW_ATE_UTF_nonC.ll (1711 of 2153)
PASS: lldb-unit :: SymbolFile/NativePDB/./SymbolFileNativePDBTests/PDBFPOProgramToDWARFExpressionTests.MissingTargetRegister (1712 of 2153)
PASS: lldb-unit :: UnwindAssembly/x86/./UnwindAssemblyx86Tests/Testx86AssemblyInspectionEngine.TestPopESI (1713 of 2153)
UNSUPPORTED: lldb-shell :: ScriptInterpreter/Lua/quit.test (1714 of 2153)
PASS: lldb-api :: sanity/TestSettingSkipping.py (1715 of 2153)
PASS: lldb-shell :: SymbolFile/DWARF/DW_AT_const_value-bitfields.s (1716 of 2153)
PASS: lldb-unit :: ObjectFile/Breakpad/./ObjectFileBreakpadTests/StackCFIRecord.parse (1717 of 2153)
UNSUPPORTED: lldb-shell :: ScriptInterpreter/Lua/lua.test (1718 of 2153)
PASS: lldb-api :: functionalities/data-formatter/summary-string-onfail/Test-rdar-9974002.py (1719 of 2153)
PASS: lldb-api :: lang/cpp/global_operators/TestCppGlobalOperators.py (1720 of 2153)
PASS: lldb-shell :: Unwind/trap_frame_sym_ctx.test (1721 of 2153)
PASS: lldb-shell :: ObjectFile/ELF/PT_LOAD.yaml (1722 of 2153)
PASS: lldb-api :: lang/objc/objc++/TestObjCXX.py (1723 of 2153)
PASS: lldb-shell :: SymbolFile/NativePDB/ast-functions.cpp (1724 of 2153)
PASS: lldb-api :: commands/expression/cast_int_to_anonymous_enum/TestCastIntToAnonymousEnum.py (1725 of 2153)
PASS: lldb-api :: functionalities/gdb_remote_client/TestThreadSelectionBug.py (1726 of 2153)
PASS: lldb-unit :: Utility/./UtilityTests/UriParserTest.MinimalPort (1727 of 2153)
PASS: lldb-shell :: Commands/command-regex-unalias.test (1728 of 2153)
PASS: lldb-api :: lang/cpp/overloaded-functions/TestOverloadedFunctions.py (1729 of 2153)
PASS: lldb-unit :: Utility/./UtilityTests/StreamTest.PutRawBytesToMixedEndian (1730 of 2153)
PASS: lldb-unit :: Host/./HostTests/SocketTest.UDPConnect (1731 of 2153)
PASS: lldb-unit :: Utility/./UtilityTests/NameMatchesTest.Equals (1732 of 2153)
PASS: lldb-unit :: Process/minidump/./LLDBMinidumpTests/MinidumpParserTest.MinidumpDuplicateModuleSeparateCode (1733 of 2153)
PASS: lldb-unit :: Utility/./UtilityTests/FileSpecTest.FileAndDirectoryComponents (1734 of 2153)
PASS: lldb-unit :: Process/minidump/./LLDBMinidumpTests/RegisterContextMinidump.ConvertMinidumpContext_x86_64 (1735 of 2153)
PASS: lldb-unit :: Utility/./UtilityTests/Predicate.WaitForValueEqualTo (1736 of 2153)
PASS: lldb-unit :: SymbolFile/DWARF/./SymbolFileDWARFTests/SymbolFileDWARFTests.TestAbbrevValidAttrNullForm (1737 of 2153)
PASS: lldb-unit :: SymbolFile/NativePDB/./SymbolFileNativePDBTests/PDBFPOProgramToDWARFExpressionTests.UnresolvedRegisterReference (1738 of 2153)
PASS: lldb-api :: lang/objc/blocks/TestObjCIvarsInBlocks.py (1739 of 2153)
PASS: lldb-unit :: Utility/./UtilityTests/ArgsTest.ReplaceArgumentAtIndexFarOutOfRange (1740 of 2153)
PASS: lldb-api :: functionalities/breakpoint/breakpoint_command/TestBreakpointCommandsFromPython.py (1741 of 2153)
PASS: lldb-unit :: SymbolFile/NativePDB/./SymbolFileNativePDBTests/PDBFPOProgramToDWARFExpressionTests.MultipleDependentAssignments (1742 of 2153)
UNSUPPORTED: lldb-api :: tools/lldb-server/signal-filtering/TestGdbRemote_QPassSignals.py (1743 of 2153)
PASS: lldb-shell :: Driver/TestCore.test (1744 of 2153)
PASS: lldb-unit :: Disassembler/./DisassemblerTests/TestArmv7Disassembly.TestCortexFPDisass (1745 of 2153)
PASS: lldb-api :: functionalities/thread/concurrent_events/TestConcurrentWatchBreak.py (1746 of 2153)
PASS: lldb-unit :: Utility/./UtilityTests/RangeTest.DoesIntersect (1747 of 2153)
PASS: lldb-unit :: Language/Highlighting/./HighlighterTests/HighlighterTest.ClangUnterminatedString (1748 of 2153)
PASS: lldb-api :: commands/log/basic/TestLogging.py (1749 of 2153)
PASS: lldb-api :: lang/cpp/enum_types/TestCPP11EnumTypes.py (1750 of 2153)
PASS: lldb-unit :: Utility/./UtilityTests/BinaryStreamTest.PutSLEB128ThreeBytes (1751 of 2153)
PASS: lldb-unit :: Utility/./UtilityTests/Flags.GetBitSize (1752 of 2153)
PASS: lldb-api :: lang/objc/objc-super/TestObjCSuper.py (1753 of 2153)
UNSUPPORTED: lldb-api :: benchmarks/continue/TestBenchmarkContinue.py (1754 of 2153)
PASS: lldb-unit :: SymbolFile/NativePDB/./SymbolFileNativePDBTests/PDBFPOProgramToDWARFExpressionTests.InvalidAssignmentMultiple (1755 of 2153)
PASS: lldb-shell :: SymbolFile/DWARF/dir-separator-no-comp-dir.s (1756 of 2153)
PASS: lldb-unit :: Utility/./UtilityTests/ArgsTest.ReplaceArgumentAtIndexLonger (1757 of 2153)
PASS: lldb-unit :: Utility/./UtilityTests/Flags.Clear (1758 of 2153)
PASS: lldb-unit :: Utility/./UtilityTests/CompletionRequest.TryCompleteCurrentArgGood (1759 of 2153)
PASS: lldb-api :: functionalities/data-formatter/typedef_array/TestTypedefArray.py (1760 of 2153)
PASS: lldb-unit :: debugserver/./debugserverTests/RNBSocket.AnyListen (1761 of 2153)
PASS: lldb-unit :: Process/minidump/./LLDBMinidumpTests/MinidumpParserTest.InvalidMinidump (1762 of 2153)
PASS: lldb-unit :: Utility/./UtilityTests/StringListTest.LongestCommonPrefix (1763 of 2153)
PASS: lldb-api :: python_api/sbdata/TestSBData.py (1764 of 2153)
PASS: lldb-unit :: Language/Highlighting/./HighlighterTests/HighlighterTest.ClangPreserveNewLine (1765 of 2153)
PASS: lldb-api :: functionalities/thread/concurrent_events/TestConcurrentCrashWithSignal.py (1766 of 2153)
PASS: lldb-unit :: Utility/./UtilityTests/StreamTest.AddressSuffix (1767 of 2153)
PASS: lldb-unit :: Symbol/./SymbolTests/Type.GetTypeScopeAndBasename (1768 of 2153)
PASS: lldb-unit :: Utility/./UtilityTests/BinaryStreamTest.PutULEB128ThreeBytes (1769 of 2153)
PASS: lldb-unit :: Utility/./UtilityTests/FileSpecTest.OperatorBool (1770 of 2153)
PASS: lldb-api :: commands/expression/fixits/TestFixIts.py (1771 of 2153)
PASS: lldb-unit :: Utility/./UtilityTests/RegisterValueTest.GetSet8 (1772 of 2153)
PASS: lldb-unit :: Utility/./UtilityTests/ArgsTest.TestOverwriteArgs (1773 of 2153)
PASS: lldb-shell :: SymbolFile/NativePDB/break-by-function.cpp (1774 of 2153)
PASS: lldb-api :: commands/expression/class_template_specialization_empty_pack/TestClassTemplateSpecializationParametersHandling.py (1775 of 2153)
PASS: lldb-shell :: SymbolFile/DWARF/debug-line-basic.s (1776 of 2153)
PASS: lldb-api :: lang/objc/foundation/TestObjCMethods2.py (1777 of 2153)
PASS: lldb-shell :: ObjectFile/ELF/minidebuginfo-corrupt-xz.yaml (1778 of 2153)
PASS: lldb-unit :: Host/./HostTests/NativeProcessProtocolTest.ReadCStringFromMemory_MaxSize (1779 of 2153)
UNSUPPORTED: lldb-shell :: SymbolFile/PDB/function-level-linking.test (1780 of 2153)
PASS: lldb-api :: python_api/module_section/TestModuleAndSection.py (1781 of 2153)
PASS: lldb-api :: commands/expression/ir-interpreter-phi-nodes/TestIRInterpreterPHINodes.py (1782 of 2153)
PASS: lldb-unit :: Language/Highlighting/./HighlighterTests/HighlighterTest.ClangCursorPos (1783 of 2153)
PASS: lldb-api :: macosx/order/TestOrderFile.py (1784 of 2153)
PASS: lldb-api :: python_api/thread/TestThreadAPI.py (1785 of 2153)
PASS: lldb-unit :: UnwindAssembly/ARM64/./Arm64InstEmulationTests/TestArm64InstEmulation.TestRegisterDoubleSpills (1786 of 2153)
PASS: lldb-unit :: Language/Highlighting/./HighlighterTests/HighlighterTest.DefaultHighlighterWithCursor (1787 of 2153)
PASS: lldb-api :: functionalities/breakpoint/breakpoint_language/TestBreakpointLanguage.py (1788 of 2153)
PASS: lldb-api :: functionalities/process_group/TestChangeProcessGroup.py (1789 of 2153)
PASS: lldb-unit :: Process/gdb-remote/./ProcessGdbRemoteTests/GDBRemoteCommunicationClientTest.WriteRegisterNoSuffix (1790 of 2153)
XFAIL: lldb-shell :: Register/x86-64-ymm-write.test (1791 of 2153)
PASS: lldb-api :: arm/emulation/TestEmulations.py (1792 of 2153)
PASS: lldb-api :: commands/expression/call-function/TestCallUserDefinedFunction.py (1793 of 2153)
PASS: lldb-unit :: Utility/./UtilityTests/ArgsTest.TestSingleQuotedArgWithSpace (1794 of 2153)
PASS: lldb-api :: commands/expression/completion/TestExprCompletion.py (1795 of 2153)
PASS: lldb-unit :: Utility/./UtilityTests/StringExtractorTest.GetNameColonValueSuccess (1796 of 2153)
PASS: lldb-api :: commands/expression/radar_8638051/Test8638051.py (1797 of 2153)
PASS: lldb-unit :: Utility/./UtilityTests/ConstStringTest.UpdateMangledCounterpart (1798 of 2153)
UNSUPPORTED: lldb-api :: functionalities/darwin_log/filter/regex/category/TestDarwinLogFilterRegexCategory.py (1799 of 2153)
PASS: lldb-api :: functionalities/abbreviation/TestAbbreviations.py (1800 of 2153)
PASS: lldb-shell :: Reproducer/TestDriverOptions.test (1801 of 2153)
PASS: lldb-api :: lang/objc/modules-compile-error/TestModulesCompileError.py (1802 of 2153)
PASS: lldb-unit :: Utility/./UtilityTests/ScalarTest.SetValueFromData (1803 of 2153)
PASS: lldb-api :: lang/c/shared_lib_stripped_symbols/TestSharedLibStrippedSymbols.py (1804 of 2153)
PASS: lldb-api :: commands/expression/import-std-module/deque-basic/TestDequeFromStdModule.py (1805 of 2153)
PASS: lldb-api :: commands/expression/calculator_mode/TestCalculatorMode.py (1806 of 2153)
PASS: lldb-unit :: Language/Highlighting/./HighlighterTests/HighlighterTest.ClangCursorPosInOtherToken (1807 of 2153)
PASS: lldb-unit :: UnwindAssembly/x86/./UnwindAssemblyx86Tests/Testx86AssemblyInspectionEngine.TestStackRealign32BitDisp_x86_64 (1808 of 2153)
PASS: lldb-unit :: Utility/./UtilityTests/RangeTest.NotEqualInvalid (1809 of 2153)
PASS: lldb-shell :: ObjectFile/PECOFF/sections-names.yaml (1810 of 2153)
PASS: lldb-unit :: Expression/./ExpressionTests/ClangHostTest.MacOSX (1811 of 2153)
UNSUPPORTED: lldb-shell :: SymbolFile/NativePDB/typedefs.cpp (1812 of 2153)
PASS: lldb-api :: commands/frame/language/TestGuessLanguage.py (1813 of 2153)
PASS: lldb-unit :: Utility/./UtilityTests/OptionsWithRawTest.SingleWhitespaceInput (1814 of 2153)
UNSUPPORTED: lldb-shell :: SymbolFile/target-symbols-add-unwind.test (1815 of 2153)
PASS: lldb-unit :: Host/./HostTests/HostInfoTest.GetAugmentedArchSpec (1816 of 2153)
UNSUPPORTED: lldb-shell :: Reproducer/TestLuaImport.test (1817 of 2153)
PASS: lldb-api :: commands/expression/vector_of_enums/TestVectorOfEnums.py (1818 of 2153)
PASS: lldb-api :: lang/cpp/exceptions/TestCPPExceptionBreakpoints.py (1819 of 2153)
PASS: lldb-api :: commands/expression/namespace_local_var_same_name_obj_c/TestNamespaceLocalVarSameNameObjC.py (1820 of 2153)
PASS: lldb-unit :: UnwindAssembly/x86/./UnwindAssemblyx86Tests/Testx86AssemblyInspectionEngine.TestSpillRegToStackViaMOVi386 (1821 of 2153)
PASS: lldb-shell :: ObjectFile/wasm/stripped-debug-sections.yaml (1822 of 2153)
PASS: lldb-api :: commands/frame/diagnose/virtual-method-call/TestDiagnoseDereferenceVirtualMethodCall.py (1823 of 2153)
PASS: lldb-shell :: SymbolFile/DWARF/debug_ranges_and_rnglists.test (1824 of 2153)
UNSUPPORTED: lldb-shell :: Register/x86-zmm-read.test (1825 of 2153)
PASS: lldb-shell :: SymbolFile/Breakpad/stack-cfi-parsing.test (1826 of 2153)
PASS: lldb-unit :: Symbol/./SymbolTests/TestClangASTImporter.MetadataPropagationIndirectImport (1827 of 2153)
PASS: lldb-shell :: ObjectFile/wasm/basic.yaml (1828 of 2153)
PASS: lldb-api :: python_api/formatters/TestFormattersSBAPI.py (1829 of 2153)
UNSUPPORTED: lldb-api :: tools/lldb-server/registers-target-xml-reading/TestGdbRemoteTargetXmlPacket.py (1830 of 2153)
PASS: lldb-unit :: Utility/./UtilityTests/NameMatchesTest.Ignore (1831 of 2153)
PASS: lldb-unit :: SymbolFile/DWARF/./SymbolFileDWARFTests/SymbolFileDWARFTests.TestAbbrevOutOfOrder (1832 of 2153)
PASS: lldb-unit :: Symbol/./SymbolTests/TestClangASTImporter.MetadataPropagationAfterCopying (1833 of 2153)
PASS: lldb-unit :: Utility/./UtilityTests/StringListTest.JoinEmpty (1834 of 2153)
PASS: lldb-api :: tools/lldb-server/TestGdbRemoteAttach.py (1835 of 2153)
PASS: lldb-unit :: Interpreter/./InterpreterTests/CompletionTest.DirCompletionUsername (1836 of 2153)
PASS: lldb-unit :: Utility/./UtilityTests/BinaryStreamTest.PutSLEB128TwoBytes (1837 of 2153)
PASS: lldb-shell :: Driver/TestTarget.test (1838 of 2153)
PASS: lldb-shell :: ObjectFile/ELF/avr-basic-info.yaml (1839 of 2153)
PASS: lldb-unit :: Utility/./UtilityTests/DataExtractorTest.GetMaxU64_unchecked (1840 of 2153)
PASS: lldb-api :: functionalities/breakpoint/serialize/TestBreakpointSerialization.py (1841 of 2153)
UNSUPPORTED: lldb-api :: functionalities/darwin_log/filter/regex/message/TestDarwinLogFilterRegexMessage.py (1842 of 2153)
PASS: lldb-unit :: Utility/./UtilityTests/StateTest.Formatv (1843 of 2153)
PASS: lldb-api :: functionalities/gdb_remote_client/TestWasm.py (1844 of 2153)
PASS: lldb-shell :: Minidump/disassemble-no-module.yaml (1845 of 2153)
PASS: lldb-api :: commands/watchpoints/watchpoint_commands/command/TestWatchpointCommandPython.py (1846 of 2153)
PASS: lldb-api :: lang/objc/objc-class-method/TestObjCClassMethod.py (1847 of 2153)
PASS: lldb-unit :: Symbol/./SymbolTests/TestClangASTImporter.CopyTypeTagDecl (1848 of 2153)
PASS: lldb-shell :: SymbolFile/DWARF/dwarf5-debug_line.s (1849 of 2153)
PASS: lldb-api :: functionalities/data-formatter/data-formatter-objc/TestDataFormatterObjCNSURL.py (1850 of 2153)
PASS: lldb-unit :: UnwindAssembly/x86/./UnwindAssemblyx86Tests/Testx86AssemblyInspectionEngine.TestPushEBX (1851 of 2153)
PASS: lldb-shell :: ObjectFile/Breakpad/breakpad-identification.test (1852 of 2153)
PASS: lldb-shell :: ObjectFile/ELF/compressed-sections.yaml (1853 of 2153)
PASS: lldb-unit :: Utility/./UtilityTests/BinaryStreamTest.PutULEB128TwoBytes (1854 of 2153)
PASS: lldb-api :: commands/expression/codegen-crash-typedefdecl-not-in_declcontext/TestCodegenCrashTypedefDeclNotInDeclContext.py (1855 of 2153)
PASS: lldb-shell :: Reproducer/TestCrash.test (1856 of 2153)
PASS: lldb-api :: tools/lldb-vscode/step/TestVSCode_step.py (1857 of 2153)
UNSUPPORTED: lldb-shell :: ScriptInterpreter/Lua/bindings.test (1858 of 2153)
UNSUPPORTED: lldb-shell :: Register/aarch64-gp-read.test (1859 of 2153)
PASS: lldb-shell :: SymbolFile/Breakpad/line-table-discontinuous-file-ids.test (1860 of 2153)
PASS: lldb-shell :: Quit/TestQuitExitCodeNonInt.test (1861 of 2153)
UNSUPPORTED: lldb-api :: functionalities/darwin_log/filter/regex/activity-chain/TestDarwinLogFilterRegexActivityChain.py (1862 of 2153)
PASS: lldb-unit :: Core/./LLDBCoreTests/RichManglingContextTest.IPDRealloc (1863 of 2153)
UNSUPPORTED: lldb-api :: functionalities/data-formatter/data-formatter-stl/libstdcpp/tuple/TestDataFormatterStdTuple.py (1864 of 2153)
PASS: lldb-shell :: Driver/TestPositionalArgs.test (1865 of 2153)
PASS: lldb-api :: lang/cpp/diamond/TestDiamond.py (1866 of 2153)
UNSUPPORTED: lldb-shell :: ScriptInterpreter/Lua/convenience_variables.test (1867 of 2153)
PASS: lldb-unit :: Utility/./UtilityTests/StringListTest.SetSize (1868 of 2153)
PASS: lldb-unit :: Utility/./UtilityTests/ArchSpecTest.MergeFrom (1869 of 2153)
PASS: lldb-shell :: ObjectFile/ELF/section-types-edgecases.yaml (1870 of 2153)
PASS: lldb-api :: lang/cpp/char8_t/TestCxxChar8_t.py (1871 of 2153)
PASS: lldb-unit :: Expression/./ExpressionTests/CppModuleConfigurationTest.MissingUsrInclude (1872 of 2153)
PASS: lldb-unit :: Utility/./UtilityTests/FileSpecTest.RemoveLastPathComponent (1873 of 2153)
PASS: lldb-api :: commands/watchpoints/watchpoint_events/TestWatchpointEvents.py (1874 of 2153)
PASS: lldb-api :: commands/command/script/import/TestImport.py (1875 of 2153)
PASS: lldb-api :: python_api/lldbutil/process/TestPrintStackTraces.py (1876 of 2153)
PASS: lldb-api :: functionalities/thread/concurrent_events/TestConcurrentDelayedCrashWithBreakpointSignal.py (1877 of 2153)
PASS: lldb-api :: lang/cpp/class-template-parameter-pack/TestClassTemplateParameterPack.py (1878 of 2153)
PASS: lldb-unit :: Expression/./ExpressionTests/DiagnosticManagerTest.GetStringNoDiags (1879 of 2153)
PASS: lldb-shell :: BuildScript/toolchain-clang.test (1880 of 2153)
PASS: lldb-unit :: Utility/./UtilityTests/RangeTest.DoesAdjoinOrIntersect (1881 of 2153)
PASS: lldb-unit :: ScriptInterpreter/Python/./ScriptInterpreterPythonTests/PythonDataObjectsTest.TestPythonDictionaryManipulation (1882 of 2153)
UNSUPPORTED: lldb-shell :: SymbolFile/PDB/class-layout.test (1883 of 2153)
PASS: lldb-unit :: Utility/./UtilityTests/UserIDResolver.GetUserName (1884 of 2153)
UNSUPPORTED: lldb-api :: lang/cpp/function-template-parameter-pack/TestFunctionTemplateParameterPack.py (1885 of 2153)
PASS: lldb-shell :: SymbolFile/Breakpad/line-table-mixed-path-styles.test (1886 of 2153)
PASS: lldb-api :: python_api/disassemble-raw-data/TestDisassembleRawData.py (1887 of 2153)
PASS: lldb-api :: commands/target/basic/TestTargetCommand.py (1888 of 2153)
PASS: lldb-unit :: Utility/./UtilityTests/ScalarTest.Scalar_512 (1889 of 2153)
PASS: lldb-unit :: Utility/./UtilityTests/GeneratorTest.Create (1890 of 2153)
PASS: lldb-unit :: Symbol/./SymbolTests/TestClangASTImporter.CopyDeclTagDecl (1891 of 2153)
PASS: lldb-api :: tools/lldb-server/TestLldbGdbServer.py (1892 of 2153)
PASS: lldb-api :: lang/cpp/template/TestTemplateArgs.py (1893 of 2153)
PASS: lldb-api :: functionalities/exec/TestExec.py (1894 of 2153)
UNSUPPORTED: lldb-api :: commands/register/register/aarch64_sve_registers/rw_access_static_config/TestSVERegisters.py (1895 of 2153)
PASS: lldb-api :: functionalities/thread/concurrent_events/TestConcurrentSignalWatch.py (1896 of 2153)
PASS: lldb-shell :: SymbolFile/DWARF/dir-separator-posix.s (1897 of 2153)
PASS: lldb-unit :: Utility/./UtilityTests/NameMatchesTest.StartsWith (1898 of 2153)
PASS: lldb-shell :: SymbolFile/DWARF/inline-function-address.ll (1899 of 2153)
UNSUPPORTED: lldb-shell :: SymbolFile/PDB/pointers.test (1900 of 2153)
PASS: lldb-unit :: Utility/./UtilityTests/DeserializerTest.HasData (1901 of 2153)
PASS: lldb-unit :: UnwindAssembly/x86/./UnwindAssemblyx86Tests/Testx86AssemblyInspectionEngine.TestSpillRegToStackViaMOVx86_64 (1902 of 2153)
PASS: lldb-api :: lang/cpp/gmodules-templates/TestGModules.py (1903 of 2153)
PASS: lldb-api :: functionalities/thread/concurrent_events/TestConcurrentTwoBreakpointsOneWatchpoint.py (1904 of 2153)
PASS: lldb-shell :: ObjectFile/ELF/section-permissions.yaml (1905 of 2153)
PASS: lldb-unit :: Utility/./UtilityTests/ArgsTest.TestUnknownEscape (1906 of 2153)
PASS: lldb-api :: functionalities/breakpoint/scripted_bkpt/TestScriptedResolver.py (1907 of 2153)
PASS: lldb-api :: functionalities/data-formatter/data-formatter-objc/TestDataFormatterObjCNSBundle.py (1908 of 2153)
UNSUPPORTED: lldb-api :: linux/mix-dwo-and-regular-objects/TestMixedDwarfBinary.py (1909 of 2153)
PASS: lldb-unit :: Utility/./UtilityTests/StreamTest.PutULEB128 (1910 of 2153)
PASS: lldb-unit :: Host/./HostTests/SocketTest.DecodeHostAndPort (1911 of 2153)
PASS: lldb-api :: python_api/sbplatform/TestSBPlatform.py (1912 of 2153)
UNSUPPORTED: lldb-shell :: ObjectFile/ELF/minidebuginfo-set-and-hit-breakpoint.test (1913 of 2153)
PASS: lldb-unit :: Utility/./UtilityTests/ArgsTest.GetArgumentArrayRef (1914 of 2153)
PASS: lldb-api :: commands/platform/process/list/TestProcessList.py (1915 of 2153)
PASS: lldb-api :: lang/cpp/template-specialization-type/TestTemplateSpecializationType.py (1916 of 2153)
PASS: lldb-unit :: UnwindAssembly/x86/./UnwindAssemblyx86Tests/Testx86AssemblyInspectionEngine.TestSimple32bitFrameFunction (1917 of 2153)
PASS: lldb-unit :: Utility/./UtilityTests/RangeTest.DefaultConstructor (1918 of 2153)
PASS: lldb-unit :: UnwindAssembly/x86/./UnwindAssemblyx86Tests/Testx86AssemblyInspectionEngine.Test32bitFramelessSmallStackFrame (1919 of 2153)
PASS: lldb-unit :: Host/./HostTests/SocketAddressTest.GetAddressInfo (1920 of 2153)
PASS: lldb-api :: functionalities/target_var/no_vars/TestTargetVarNoVars.py (1921 of 2153)
UNSUPPORTED: lldb-api :: macosx/macCatalystAppMacOSFramework/TestMacCatalystAppWithMacOSFramework.py (1922 of 2153)
PASS: lldb-api :: types/TestCharTypeExpr.py (1923 of 2153)
PASS: lldb-unit :: Expression/./ExpressionTests/DWARFExpression.DW_OP_pick (1924 of 2153)
PASS: lldb-api :: commands/expression/persistent_variables/TestPersistentVariables.py (1925 of 2153)
PASS: lldb-unit :: Utility/./UtilityTests/StreamTest.PutMaxHex64ByteOrderLittle (1926 of 2153)
PASS: lldb-api :: commands/expression/weak_symbols/TestWeakSymbols.py (1927 of 2153)
PASS: lldb-shell :: ObjectFile/ELF/PT_LOAD-overlap-PT_INTERP.yaml (1928 of 2153)
PASS: lldb-unit :: DataFormatter/./LLDBFormatterTests/TypeMatcherTests.CreatedBySameMatchStringExactNamePrefixes (1929 of 2153)
PASS: lldb-api :: tools/lldb-server/TestGdbRemoteRegisterState.py (1930 of 2153)
PASS: lldb-unit :: Utility/./UtilityTests/UriParserTest.LongPath (1931 of 2153)
PASS: lldb-unit :: Utility/./UtilityTests/ScalarTest.CastOperations (1932 of 2153)
PASS: lldb-unit :: Expression/./ExpressionTests/DiagnosticManagerTest.AppendMessageSubsequentDiags (1933 of 2153)
PASS: lldb-api :: types/TestLongTypes.py (1934 of 2153)
PASS: lldb-unit :: Utility/./UtilityTests/StringExtractorTest.DecodeHexU8_Underflow2 (1935 of 2153)
PASS: lldb-api :: functionalities/data-formatter/data-formatter-stl/libcxx/iterator/TestDataFormatterLibccIterator.py (1936 of 2153)
PASS: lldb-unit :: Utility/./UtilityTests/StringExtractorTest.GetHexBytesAvail_Underflow (1937 of 2153)
PASS: lldb-unit :: UnwindAssembly/x86/./UnwindAssemblyx86Tests/Testx86AssemblyInspectionEngine.Test32BitOnlyInstruction (1938 of 2153)
PASS: lldb-unit :: Utility/./UtilityTests/ConstStringTest.NullAndEmptyStates (1939 of 2153)
PASS: lldb-unit :: ScriptInterpreter/Python/./ScriptInterpreterPythonTests/PythonDataObjectsTest.TestPythonBoolean (1940 of 2153)
PASS: lldb-api :: lang/objc/objc-struct-return/TestObjCStructReturn.py (1941 of 2153)
PASS: lldb-unit :: ObjectFile/Breakpad/./ObjectFileBreakpadTests/ModuleRecord.parse (1942 of 2153)
PASS: lldb-unit :: Target/./TargetTests/StackFrameRecognizerTest.NullModuleRegex (1943 of 2153)
PASS: lldb-unit :: SymbolFile/DWARF/./SymbolFileDWARFTests/XcodeSDKModuleTests.TestModuleGetXcodeSDK (1944 of 2153)
PASS: lldb-unit :: Host/./HostTests/FileSystemTest.EmptyTest (1945 of 2153)
PASS: lldb-shell :: ObjectFile/ELF/netbsd-exec-8.99.30-amd64.yaml (1946 of 2153)
PASS: lldb-unit :: Symbol/./SymbolTests/TestTypeSystemClang.TestGetTypeClassNested (1947 of 2153)
PASS: lldb-api :: tools/lldb-server/TestGdbRemoteThreadsInStopReply.py (1948 of 2153)
UNSUPPORTED: lldb-api :: tools/lldb-server/TestGdbRemoteModuleInfo.py (1949 of 2153)
PASS: lldb-unit :: Utility/./UtilityTests/StringListTest.JoinNonSpace (1950 of 2153)
PASS: lldb-api :: lang/objc/modules-update/TestClangModulesUpdate.py (1951 of 2153)
PASS: lldb-unit :: Utility/./UtilityTests/StreamTest.PutNHex8 (1952 of 2153)
UNSUPPORTED: lldb-shell :: ScriptInterpreter/Lua/nested_sessions.test (1953 of 2153)
PASS: lldb-unit :: Utility/./UtilityTests/StringExtractorTest.GetHexBytesAvail_OddPair2 (1954 of 2153)
PASS: lldb-api :: functionalities/data-formatter/language_category_updates/TestDataFormatterLanguageCategoryUpdates.py (1955 of 2153)
PASS: lldb-shell :: SymbolFile/NativePDB/ast-types.cpp (1956 of 2153)
PASS: lldb-unit :: Process/gdb-remote/./ProcessGdbRemoteTests/GDBRemoteClientBaseTest.SendPacketAndReceiveResponseWithOutputSupport (1957 of 2153)
PASS: lldb-api :: lang/objcxx/hide-runtime-values/TestObjCXXHideRuntimeValues.py (1958 of 2153)
PASS: lldb-unit :: SymbolFile/DWARF/./SymbolFileDWARFTests/SymbolFileDWARFTests.TestAbilitiesForDWARF (1959 of 2153)
PASS: lldb-unit :: Utility/./UtilityTests/StringListTest.ShiftMove (1960 of 2153)
PASS: lldb-api :: python_api/signals/TestSignalsAPI.py (1961 of 2153)
UNSUPPORTED: lldb-api :: tools/lldb-vscode/disconnect/TestVSCode_disconnect.py (1962 of 2153)
PASS: lldb-unit :: Utility/./UtilityTests/StreamTest.PutBytesAsRawHex8ToLittleEndian (1963 of 2153)
PASS: lldb-api :: lang/cpp/this_class_type_mixing/TestThisClassTypeMixing.py (1964 of 2153)
PASS: lldb-api :: commands/log/invalid-args/TestInvalidArgsLog.py (1965 of 2153)
PASS: lldb-api :: python_api/objc_type/TestObjCType.py (1966 of 2153)
PASS: lldb-shell :: Breakpoint/case-sensitive.test (1967 of 2153)
PASS: lldb-api :: commands/target/create-no-such-arch/TestNoSuchArch.py (1968 of 2153)
PASS: lldb-shell :: ObjectFile/PECOFF/uuid.yaml (1969 of 2153)
PASS: lldb-unit :: Process/gdb-remote/./ProcessGdbRemoteTests/GDBRemoteCommunicationClientTest.GetMemoryRegionInfoInvalidResponse (1970 of 2153)
PASS: lldb-unit :: Utility/./UtilityTests/BinaryStreamTest.PutULEB128EightBytes (1971 of 2153)
PASS: lldb-unit :: Utility/./UtilityTests/UriParserTest.BracketedHostname (1972 of 2153)
PASS: lldb-api :: commands/reproducer/invalid-args/TestInvalidArgsReproducer.py (1973 of 2153)
PASS: lldb-api :: commands/expression/import-std-module/vector-dbg-info-content/TestDbgInfoContentVectorFromStdModule.py (1974 of 2153)
PASS: lldb-unit :: Host/./HostTests/SocketTest.DomainGetConnectURI (1975 of 2153)
PASS: lldb-api :: lang/cpp/accelerator-table/TestCPPAccelerator.py (1976 of 2153)
PASS: lldb-unit :: ScriptInterpreter/Python/./ScriptInterpreterPythonTests/PythonDataObjectsTest.TestScript (1977 of 2153)
PASS: lldb-api :: lang/objc/objc-stepping/TestObjCStepping.py (1978 of 2153)
UNSUPPORTED: lldb-api :: functionalities/thread/concurrent_events/TestConcurrentManySignals.py (1979 of 2153)
PASS: lldb-api :: functionalities/breakpoint/consecutive_breakpoints/TestConsecutiveBreakpoints.py (1980 of 2153)
PASS: lldb-unit :: Instruction/./EmulatorTests/TestAArch64Emulator.TestOverflow (1981 of 2153)
PASS: lldb-api :: functionalities/float-display/TestFloatDisplay.py (1982 of 2153)
PASS: lldb-unit :: UnwindAssembly/x86/./UnwindAssemblyx86Tests/Testx86AssemblyInspectionEngine.TestPopRBPWithREX (1983 of 2153)
UNSUPPORTED: lldb-shell :: SymbolFile/NativePDB/local-variables.cpp (1984 of 2153)
PASS: lldb-unit :: UnwindAssembly/PPC64/./PPC64InstEmulationTests/TestPPC64InstEmulation.TestMediumFunction (1985 of 2153)
PASS: lldb-api :: lang/cpp/virtual-overload/TestVirtualOverload.py (1986 of 2153)
PASS: lldb-unit :: Language/Highlighting/./HighlighterTests/HighlighterTest.DefaultHighlighter (1987 of 2153)
PASS: lldb-unit :: SymbolFile/DWARF/./SymbolFileDWARFTests/DWARFASTParserClangTests.EnsureAllDIEsInDeclContextHaveBeenParsedParsesOnlyMatchingEntries (1988 of 2153)
PASS: lldb-api :: commands/expression/ignore-artificial-constructors/TestIgnoreArtificialConstructors.py (1989 of 2153)
PASS: lldb-api :: functionalities/thread/concurrent_events/TestConcurrentCrashWithWatchpointBreakpointSignal.py (1990 of 2153)
PASS: lldb-shell :: ObjectFile/ELF/section-overlap.yaml (1991 of 2153)
PASS: lldb-api :: commands/frame/var/TestFrameVar.py (1992 of 2153)
PASS: lldb-unit :: Utility/./UtilityTests/AnsiTerminal.Empty (1993 of 2153)
PASS: lldb-unit :: Utility/./UtilityTests/StreamTeeTest.SetStreamAtIndexOutOfBounds (1994 of 2153)
PASS: lldb-api :: functionalities/data-formatter/ostypeformatting/TestFormattersOsType.py (1995 of 2153)
PASS: lldb-unit :: Utility/./UtilityTests/AnsiTerminal.WhiteSpace (1996 of 2153)
PASS: lldb-shell :: SymbolFile/DWARF/dwp-debug-types.s (1997 of 2153)
UNSUPPORTED: lldb-api :: functionalities/unwind/standard/TestStandardUnwind.py (1998 of 2153)
PASS: lldb-api :: commands/frame/diagnose/dereference-argument/TestDiagnoseDereferenceArgument.py (1999 of 2153)
PASS: lldb-unit :: Core/./LLDBCoreTests/ModuleSpecTest.InvalidInMemoryBuffer (2000 of 2153)
PASS: lldb-unit :: Target/./TargetTests/PathMappingListTest.AbsoluteTests (2001 of 2153)
PASS: lldb-unit :: Utility/./UtilityTests/RangeTest.ContainsEndInclusive (2002 of 2153)
PASS: lldb-api :: functionalities/inferior-crashing/recursive-inferior/TestRecursiveInferiorStep.py (2003 of 2153)
PASS: lldb-shell :: Driver/TestNoUseColor.test (2004 of 2153)
PASS: lldb-api :: functionalities/multiword-commands/TestMultiWordCommands.py (2005 of 2153)
PASS: lldb-unit :: Utility/./UtilityTests/XcodeSDKTest.ParseTest (2006 of 2153)
PASS: lldb-unit :: Utility/./UtilityTests/StringExtractorTest.GetHexU8_Underflow (2007 of 2153)
PASS: lldb-shell :: SymbolFile/Breakpad/unwind-via-stack-cfi.test (2008 of 2153)
PASS: lldb-shell :: ObjectFile/PECOFF/basic-info-arm.yaml (2009 of 2153)
PASS: lldb-api :: functionalities/data-formatter/data-formatter-objc/TestDataFormatterObjCPlain.py (2010 of 2153)
PASS: lldb-unit :: UnwindAssembly/x86/./UnwindAssemblyx86Tests/Testx86AssemblyInspectionEngine.TestPopEDI (2011 of 2153)
PASS: lldb-api :: commands/expression/completion-crash-incomplete-record/TestCompletionCrashIncompleteRecord.py (2012 of 2153)
PASS: lldb-unit :: Utility/./UtilityTests/LogChannelTest.Enable (2013 of 2153)
PASS: lldb-shell :: SymbolFile/Breakpad/line-table.test (2014 of 2153)
UNSUPPORTED: lldb-api :: benchmarks/frame_variable/TestFrameVariableResponse.py (2015 of 2153)
PASS: lldb-api :: lang/cpp/inlines/TestInlines.py (2016 of 2153)
PASS: lldb-api :: functionalities/breakpoint/move_nearest/TestMoveNearest.py (2017 of 2153)
PASS: lldb-shell :: Minidump/dump-all.test (2018 of 2153)
PASS: lldb-api :: commands/help/TestHelp.py (2019 of 2153)
PASS: lldb-shell :: SymbolFile/DWARF/debug_line-relative_path.s (2020 of 2153)
PASS: lldb-unit :: Utility/./UtilityTests/PassiveReplayTest.InstrumentedFoo (2021 of 2153)
PASS: lldb-api :: functionalities/data-formatter/data-formatter-stl/libcxx/tuple/TestDataFormatterLibcxxTuple.py (2022 of 2153)
PASS: lldb-api :: terminal/TestEditline.py (2023 of 2153)
PASS: lldb-api :: lang/objc/objc-new-syntax/TestObjCNewSyntaxLiteral.py (2024 of 2153)
PASS: lldb-api :: tools/lldb-server/TestGdbRemoteProcessInfo.py (2025 of 2153)
PASS: lldb-unit :: Signals/./SignalsTests/UnixSignalsTest.VersionChange (2026 of 2153)
PASS: lldb-api :: functionalities/data-formatter/data-formatter-objc/TestDataFormatterObjCCF.py (2027 of 2153)
PASS: lldb-api :: functionalities/breakpoint/hardware_breakpoints/require_hw_breakpoints/TestRequireHWBreakpoints.py (2028 of 2153)
PASS: lldb-unit :: ScriptInterpreter/Python/./ScriptInterpreterPythonTests/PythonDataObjectsTest.TestPythonInteger (2029 of 2153)
PASS: lldb-unit :: Utility/./UtilityTests/RangeTest.Union (2030 of 2153)
PASS: lldb-api :: commands/expression/unicode-in-variable/TestUnicodeInVariable.py (2031 of 2153)
PASS: lldb-api :: functionalities/data-formatter/data-formatter-stl/libcxx/multiset/TestDataFormatterLibcxxMultiSet.py (2032 of 2153)
PASS: lldb-unit :: Core/./LLDBCoreTests/ModuleSpecTest.InvalidInMemoryBufferValidFile (2033 of 2153)
PASS: lldb-api :: python_api/target/TestTargetAPI.py (2034 of 2153)
PASS: lldb-api :: lang/objc/objc_direct-methods/TestObjCDirectMethods.py (2035 of 2153)
PASS: lldb-unit :: Utility/./UtilityTests/ScalarTest.GetValue (2036 of 2153)
PASS: lldb-unit :: ScriptInterpreter/Python/./ScriptInterpreterPythonTests/PythonDataObjectsTest.TestPythonTupleInitializerList (2037 of 2153)
PASS: lldb-api :: functionalities/deleted-executable/TestDeletedExecutable.py (2038 of 2153)
PASS: lldb-unit :: Utility/./UtilityTests/OptionsWithRawTest.EmptySuffixSingleWhitespace (2039 of 2153)
PASS: lldb-unit :: Host/./HostTests/FileSystemTest.MakeAbsolute (2040 of 2153)
PASS: lldb-unit :: Language/CPlusPlus/./LanguageCPlusPlusTests/CPlusPlusLanguage.FindAlternateFunctionManglings (2041 of 2153)
PASS: lldb-unit :: API/./APITests/SBCommandInterpreterTest.MultiWordCommand (2042 of 2153)
PASS: lldb-api :: functionalities/asan/TestMemoryHistory.py (2043 of 2153)
PASS: lldb-api :: commands/expression/persist_objc_pointeetype/TestPersistObjCPointeeType.py (2044 of 2153)
PASS: lldb-api :: lang/cpp/namespace/TestNamespace.py (2045 of 2153)
PASS: lldb-unit :: Utility/./UtilityTests/StringListTest.InsertStringAtIndexMove (2046 of 2153)
PASS: lldb-api :: functionalities/data-formatter/varscript_formatting/TestDataFormatterVarScriptFormatting.py (2047 of 2153)
PASS: lldb-unit :: Utility/./UtilityTests/Flags.AnyClear (2048 of 2153)
PASS: lldb-api :: commands/expression/unwind_expression/TestUnwindExpression.py (2049 of 2153)
PASS: lldb-unit :: Utility/./UtilityTests/BinaryStreamTest.PutSLEB128FourBytes (2050 of 2153)
PASS: lldb-unit :: ObjectFile/Breakpad/./ObjectFileBreakpadTests/FuncRecord.parse (2051 of 2153)
UNSUPPORTED: lldb-api :: tools/lldb-server/TestGdbRemote_vContThreads.py (2052 of 2153)
PASS: lldb-shell :: SymbolFile/DWARF/debug-types-dwo-cross-reference.cpp (2053 of 2153)
PASS: lldb-unit :: Utility/./UtilityTests/ScalarTest.LongLongAssigmentOperator (2054 of 2153)
PASS: lldb-api :: functionalities/data-formatter/data-formatter-skip-summary/TestDataFormatterSkipSummary.py (2055 of 2153)
PASS: lldb-unit :: Utility/./UtilityTests/StreamTest.PutCString (2056 of 2153)
PASS: lldb-unit :: Expression/./ExpressionTests/CppModuleConfigurationTest.AmbiguousLibCpp (2057 of 2153)
PASS: lldb-api :: lang/objc/orderedset/TestOrderedSet.py (2058 of 2153)
PASS: lldb-api :: lang/objc/objc-ivar-protocols/TestIvarProtocols.py (2059 of 2153)
PASS: lldb-api :: functionalities/breakpoint/address_breakpoints/TestAddressBreakpoints.py (2060 of 2153)
PASS: lldb-unit :: Utility/./UtilityTests/StreamTest.PutHex8 (2061 of 2153)
PASS: lldb-shell :: Commands/command-source.test (2062 of 2153)
PASS: lldb-unit :: Utility/./UtilityTests/ArgsTest.AppendArguments (2063 of 2153)
PASS: lldb-api :: functionalities/thread/concurrent_events/TestConcurrentSignalWatchBreak.py (2064 of 2153)
UNSUPPORTED: lldb-shell :: SymbolFile/PDB/typedefs.test (2065 of 2153)
PASS: lldb-api :: commands/process/signal/TestProcessSignal.py (2066 of 2153)
PASS: lldb-unit :: Target/./TargetTests/ModuleCacheTest.GetAndPut (2067 of 2153)
PASS: lldb-shell :: ScriptInterpreter/Python/sb_address_exception.test (2068 of 2153)
PASS: lldb-shell :: Unwind/thread-step-out-ret-addr-check.test (2069 of 2153)
PASS: lldb-unit :: Utility/./UtilityTests/RangeTest.ContainsAddrInvalid (2070 of 2153)
PASS: lldb-api :: functionalities/pre_run_dylibs/TestPreRunDylibs.py (2071 of 2153)
PASS: lldb-api :: commands/expression/import-std-module/pair/TestPairFromStdModule.py (2072 of 2153)
PASS: lldb-api :: lang/c/modules/TestCModules.py (2073 of 2153)
PASS: lldb-unit :: Process/gdb-remote/./ProcessGdbRemoteTests/GDBRemoteCommunicationClientTest.SendSignalsToIgnore (2074 of 2153)
PASS: lldb-api :: commands/expression/import-std-module/vector-of-vectors/TestVectorOfVectorsFromStdModule.py (2075 of 2153)
PASS: lldb-api :: macosx/macCatalyst/TestMacCatalyst.py (2076 of 2153)
PASS: lldb-api :: functionalities/param_entry_vals/basic_entry_values/TestBasicEntryValues.py (2077 of 2153)
PASS: lldb-unit :: Utility/./UtilityTests/VMRange.SetEndAddress (2078 of 2153)
PASS: lldb-unit :: Utility/./UtilityTests/StreamTest.PutHex32ByteOrderLittle (2079 of 2153)
PASS: lldb-api :: functionalities/tsan/multiple/TestTsanMultiple.py (2080 of 2153)
PASS: lldb-unit :: Utility/./UtilityTests/UriParserTest.SchemeHostSeparator4 (2081 of 2153)
PASS: lldb-api :: functionalities/gdb_remote_client/TestWriteMemory.py (2082 of 2153)
XFAIL: lldb-shell :: SymbolFile/DWARF/find-type-in-function.cpp (2083 of 2153)
PASS: lldb-unit :: Expression/./ExpressionTests/DiagnosticManagerTest.GetStringBasic (2084 of 2153)
PASS: lldb-api :: functionalities/thread/concurrent_events/TestConcurrentDelaySignalBreak.py (2085 of 2153)
PASS: lldb-api :: functionalities/thread/concurrent_events/TestConcurrentTwoWatchpointsOneDelayBreakpoint.py (2086 of 2153)
PASS: lldb-unit :: Symbol/./SymbolTests/TestTypeSystemClang.TestGetTypeClassDeclType (2087 of 2153)
PASS: lldb-shell :: ObjectFile/Breakpad/sections.test (2088 of 2153)
PASS: lldb-unit :: Utility/./UtilityTests/SerializationRountripTest.SerializeDeserializePodPointers (2089 of 2153)
PASS: lldb-unit :: Utility/./UtilityTests/StringListTest.ForRangeEmpty (2090 of 2153)
PASS: lldb-unit :: Utility/./UtilityTests/SharedCluster.ClusterManager (2091 of 2153)
PASS: lldb-api :: lang/cpp/llvm-style/TestLLVMStyle.py (2092 of 2153)
PASS: lldb-api :: functionalities/thread/backtrace_limit/TestBacktraceLimit.py (2093 of 2153)
PASS: lldb-shell :: Process/TestEnvironment.test (2094 of 2153)
PASS: lldb-unit :: Utility/./UtilityTests/StreamTest.AddressSize (2095 of 2153)
PASS: lldb-api :: lang/objc/objc-static-method-stripped/TestObjCStaticMethodStripped.py (2096 of 2153)
PASS: lldb-api :: functionalities/data-formatter/data-formatter-stl/libcxx/atomic/TestLibCxxAtomic.py (2097 of 2153)
PASS: lldb-unit :: Utility/./UtilityTests/DataExtractorTest.GetFloat (2098 of 2153)
UNSUPPORTED: lldb-shell :: Unwind/eh-frame-augment-noop.test (2099 of 2153)
PASS: lldb-unit :: Utility/./UtilityTests/ConstStringTest.CompareStringRef (2100 of 2153)
UNSUPPORTED: lldb-api :: functionalities/data-formatter/data-formatter-stl/libstdcpp/unique_ptr/TestDataFormatterStdUniquePtr.py (2101 of 2153)
UNSUPPORTED: lldb-shell :: ScriptInterpreter/Lua/io.test (2102 of 2153)
PASS: lldb-api :: lang/objcxx/cxx-bridged-po/TestObjCXXBridgedPO.py (2103 of 2153)
PASS: lldb-api :: commands/expression/call-function/TestCallBuiltinFunction.py (2104 of 2153)
UNSUPPORTED: lldb-api :: functionalities/thread/multi_break/TestMultipleBreakpoints.py (2105 of 2153)
PASS: lldb-unit :: Utility/./UtilityTests/StreamTeeTest.Write (2106 of 2153)
PASS: lldb-unit :: Utility/./UtilityTests/StreamTest.PutHex16ByteOrderBig (2107 of 2153)
PASS: lldb-unit :: Utility/./UtilityTests/StringLexerTest.NextIfList (2108 of 2153)
PASS: lldb-shell :: SymbolFile/DWARF/find-method-local-struct.cpp (2109 of 2153)
PASS: lldb-unit :: Utility/./UtilityTests/OptionsWithRawTest.LeadingSpaceArgs (2110 of 2153)
PASS: lldb-unit :: Utility/./UtilityTests/ListenerTest.GetEventWait (2111 of 2153)
PASS: lldb-shell :: SymbolFile/DWARF/DW_AT_const_value.s (2112 of 2153)
PASS: lldb-shell :: SymbolFile/DWARF/win-i386-line-table.s (2113 of 2153)
PASS: lldb-unit :: Process/gdb-remote/./ProcessGdbRemoteTests/GDBRemoteCommunicationTest.ReadPacket_checksum (2114 of 2153)
PASS: lldb-unit :: Utility/./UtilityTests/FileSpecTest.EqualDotsWindows (2115 of 2153)
UNSUPPORTED: lldb-api :: tools/intel-features/intel-pt/test/TestIntelPTSimpleBinary.py (2116 of 2153)
PASS: lldb-unit :: Utility/./UtilityTests/StringListTest.ShiftStdString (2117 of 2153)
UNSUPPORTED: lldb-shell :: Register/arm-gp-read.test (2118 of 2153)
PASS: lldb-unit :: Expression/./ExpressionTests/DiagnosticManagerTest.GetStringMultipleDiags (2119 of 2153)
PASS: lldb-shell :: Commands/command-backtrace.test (2120 of 2153)
PASS: lldb-unit :: Symbol/./SymbolTests/TestTypeSystemClang.TestUnifyAccessSpecifiers (2121 of 2153)
PASS: lldb-api :: functionalities/thread/concurrent_events/TestConcurrentNWatchNBreak.py (2122 of 2153)
PASS: lldb-unit :: Utility/./UtilityTests/StringListTest.SplitIntoLinesSingleTrailingCR (2123 of 2153)
PASS: lldb-unit :: Expression/./ExpressionTests/CppModuleConfigurationTest.LinuxLocalLibCpp (2124 of 2153)
PASS: lldb-api :: lang/cpp/namespace_conflicts/TestNamespaceConflicts.py (2125 of 2153)
PASS: lldb-api :: functionalities/tsan/thread_numbers/TestTsanThreadNumbers.py (2126 of 2153)
PASS: lldb-unit :: Utility/./UtilityTests/GeneratorTest.Get (2127 of 2153)
PASS: lldb-shell :: ObjectFile/ELF/PT_LOAD-overlap-PT_TLS.yaml (2128 of 2153)
UNSUPPORTED: lldb-api :: commands/register/register/intel_xtended_registers/TestMPXRegisters.py (2129 of 2153)
PASS: lldb-api :: types/TestIntegerType.py (2130 of 2153)
PASS: lldb-api :: functionalities/gdb_remote_client/TestGDBRemoteDiskFileCompletion.py (2131 of 2153)
PASS: lldb-unit :: Utility/./UtilityTests/UUIDTest.Validity (2132 of 2153)
FAIL: lldb-api :: functionalities/gdb_remote_client/TestGDBRemoteClient.py (2133 of 2153)
******************** TEST 'lldb-api :: functionalities/gdb_remote_client/TestGDBRemoteClient.py' FAILED ********************
Script:
--
/usr/local/Frameworks/Python.framework/Versions/3.7/bin/python3.7 /Users/buildslave/jenkins/workspace/lldb-cmake/llvm-project/lldb/test/API/dotest.py -s /Users/buildslave/jenkins/workspace/lldb-cmake/lldb-build/lldb-test-traces -S nm -u CXXFLAGS -u CFLAGS --codesign-identity - --server /Users/buildslave/jenkins/workspace/lldb-cmake/lldb-build/./bin/debugserver --arch x86_64 --build-dir /Users/buildslave/jenkins/workspace/lldb-cmake/lldb-build/lldb-test-build.noindex -s=/Users/buildslave/jenkins/workspace/lldb-cmake/test/logs -t --env TERM=vt100 --env LLVM_LIBS_DIR=/Users/buildslave/jenkins/workspace/lldb-cmake/lldb-build/./lib --arch x86_64 --build-dir /Users/buildslave/jenkins/workspace/lldb-cmake/lldb-build/lldb-test-build.noindex --lldb-module-cache-dir /Users/buildslave/jenkins/workspace/lldb-cmake/lldb-build/lldb-test-build.noindex/module-cache-lldb/lldb-api --clang-module-cache-dir /Users/buildslave/jenkins/workspace/lldb-cmake/lldb-build/lldb-test-build.noindex/module-cache-clang/lldb-api --executable /Users/buildslave/jenkins/workspace/lldb-cmake/lldb-build/./bin/lldb --compiler /Users/buildslave/jenkins/workspace/lldb-cmake/lldb-build/./bin/clang --dsymutil /Users/buildslave/jenkins/workspace/lldb-cmake/lldb-build/./bin/dsymutil --filecheck /Users/buildslave/jenkins/workspace/lldb-cmake/lldb-build/./bin/FileCheck --yaml2obj /Users/buildslave/jenkins/workspace/lldb-cmake/lldb-build/./bin/yaml2obj --lldb-libs-dir /Users/buildslave/jenkins/workspace/lldb-cmake/lldb-build/./lib /Users/buildslave/jenkins/workspace/lldb-cmake/llvm-project/lldb/test/API/functionalities/gdb_remote_client -p TestGDBRemoteClient.py
--
Exit Code: 1

Hide Details

Command Output (stdout): -- lldb version 12.0.99 clang revision 816b0a9c9f46cbfce253f49dad7cbf93867307ac llvm revision 816b0a9c9f46cbfce253f49dad7cbf93867307ac < 1> send packet: + history[1] tid=0x0307 < 1> send packet: + < 19> send packet: $QStartNoAckMode#b0 < 1> read packet: + < 6> read packet: $OK#9a < 1> send packet: + < 45> send packet: $qSupported:xmlRegisters=i386,arm,mips,arc#74 < 57> read packet: $qXfer:features:read+;PacketSize=3fff;QStartNoAckMode+#86 < 26> send packet: $QThreadSuffixSupported#e4 < 4> read packet: $#00 < 27> send packet: $QListThreadsInStopReply#21 < 4> read packet: $#00 < 13> send packet: $qHostInfo#9b < 28> read packet: $ptrsize:8;endian:little;#30 < 10> send packet: $vCont?#49 < 4> read packet: $#00 < 27> send packet: $qVAttachOrWaitSupported#38 < 4> read packet: $#00 < 23> send packet: $QEnableErrorStrings#8c < 6> read packet: $OK#9a < 16> send packet: $qProcessInfo#dc < 4> read packet: $#00 < 6> send packet: $qC#b4 < 7> read packet: $E42#ab < 16> send packet: $qfThreadInfo#bb < 6> read packet: $OK#9a < 38> send packet: $QSetSTDIN:2f6465762f74747973303030#84 < 4> read packet: $#00 < 39> send packet: $QSetSTDOUT:2f6465762f74747973303030#e5 < 4> read packet: $#00 < 39> send packet: $QSetSTDERR:2f6465762f74747973303030#d6 < 4> read packet: $#00 < 21> send packet: $QSetDisableASLR:0#cd < 4> read packet: $#00 < 23> send packet: $QSetDetachOnError:0#f7 < 4> read packet: $#00 < 19> send packet: $QLaunchArch:arm#a4 < 4> read packet: $#00 < 94> send packet: $QEnvironment:LLDB_SESSION_DIRNAME=/Users/buildslave/jenkins/workspace/lldb-cmake/test/logs#e5 < 4> read packet: $#00 < 319> send packet: $A308,0,2f55736572732f6275696c64736c6176652f6a656e6b696e732f776f726b73706163652f6c6c64622d636d616b652f6c6c64622d6275696c642f6c6c64622d746573742d6275696c642e6e6f696e6465782f66756e6374696f6e616c69746965732f6764625f72656d6f74655f636c69656e742f5465737447444252656d6f7465436c69656e742e746573745f6c61756e63685f6661696c2f61#e4 < 7> read packet: $E47#b0 < 1> send packet: + history[1] tid=0x0307 < 1> send packet: + < 19> send packet: $QStartNoAckMode#b0 < 1> read packet: + < 6> read packet: $OK#9a < 1> send packet: + < 45> send packet: $qSupported:xmlRegisters=i386,arm,mips,arc#74 < 57> read packet: $qXfer:features:read+;PacketSize=3fff;QStartNoAckMode+#86 < 26> send packet: $QThreadSuffixSupported#e4 < 4> read packet: $#00 < 27> send packet: $QListThreadsInStopReply#21 < 4> read packet: $#00 < 13> send packet: $qHostInfo#9b < 28> read packet: $ptrsize:8;endian:little;#30 < 10> send packet: $vCont?#49 < 4> read packet: $#00 < 27> send packet: $qVAttachOrWaitSupported#38 < 4> read packet: $#00 < 23> send packet: $QEnableErrorStrings#8c < 6> read packet: $OK#9a < 16> send packet: $qProcessInfo#dc < 4> read packet: $#00 < 6> send packet: $qC#b4 < 7> read packet: $QC0#c4 < 16> send packet: $qfThreadInfo#bb < 5> read packet: $l#6c < 5> send packet: $?#3f < 7> read packet: $S02#b5 < 16> send packet: $qProcessInfo#dc < 4> read packet: $#00 < 41> send packet: $qXfer:features:read:target.xml:0,3ffe#af < 4> read packet: $#00 < 18> send packet: $qRegisterInfo0#72 < 4> read packet: $#00 < 16> send packet: $qfThreadInfo#bb < 5> read packet: $l#6c < 7> send packet: $Hg1#e0 < 6> read packet: $OK#9a < 6> send packet: $p0#a0 < 12> read packet: $00000000#80 < 16> send packet: $qProcessInfo#dc < 4> read packet: $#00 < 12> send packet: $qOffsets#4b < 4> read packet: $#00 < 26> send packet: $qStructuredDataPlugins#02 < 4> read packet: $#00 < 13> send packet: $qSymbol::#5b < 6> read packet: $OK#9a < 16> send packet: $qfThreadInfo#bb < 5> read packet: $l#6c < 16> send packet: $qfThreadInfo#bb < 5> read packet: $l#6c < 5> send packet: $g#67 < 860> read packet: $0000000000000000000000000000000000000000000000000000000000000000000000000000000000000000000000000000000000000000000000000000000000000000000000000000000000000000000000000000000000000000000000000000000000000000000000000000000000000000000000000000000000000000000000000000000000000000000000000000000000000000000000000000000000000000000000000000000000000000000000000000000000000000000000000000000000000000000000000000000000000000000000000000000000000000000000000000000000000000000000000000000000000000000000000000000000000000000000000000000000000000000000000000000000000000000000000000000000000000000000000000000000000000000000000000000000000000000000000000000000000000000000000000000000000000000000000000000000000000000000000000000000000000000000000000000000000000000000000000000000000000000000000000000000000000000000000000000000000000000000000000000000000000#80 < 5> send packet: $k#6b < 4> read packet: $#00 < 1> send packet: + history[1] tid=0x0307 < 1> send packet: + < 19> send packet: $QStartNoAckMode#b0 < 1> read packet: + < 6> read packet: $OK#9a < 1> send packet: + < 45> send packet: $qSupported:xmlRegisters=i386,arm,mips,arc#74 < 57> read packet: $qXfer:features:read+;PacketSize=3fff;QStartNoAckMode+#86 < 26> send packet: $QThreadSuffixSupported#e4 < 4> read packet: $#00 < 27> send packet: $QListThreadsInStopReply#21 < 4> read packet: $#00 < 13> send packet: $qHostInfo#9b < 28> read packet: $ptrsize:8;endian:little;#30 < 10> send packet: $vCont?#49 < 4> read packet: $#00 < 27> send packet: $qVAttachOrWaitSupported#38 < 4> read packet: $#00 < 23> send packet: $QEnableErrorStrings#8c < 6> read packet: $OK#9a < 16> send packet: $qProcessInfo#dc < 4> read packet: $#00 < 6> send packet: $qC#b4 < 7> read packet: $QC0#c4 < 16> send packet: $qfThreadInfo#bb < 5> read packet: $l#6c < 5> send packet: $?#3f < 7> read packet: $S02#b5 < 16> send packet: $qProcessInfo#dc < 4> read packet: $#00 < 41> send packet: $qXfer:features:read:target.xml:0,3ffe#af < 4> read packet: $#00 < 18> send packet: $qRegisterInfo0#72 < 4> read packet: $#00 < 16> send packet: $qfThreadInfo#bb < 5> read packet: $l#6c < 7> send packet: $Hg1#e0 < 6> read packet: $OK#9a < 6> send packet: $p0#a0 < 12> read packet: $00000000#80 < 16> send packet: $qProcessInfo#dc < 4> read packet: $#00 < 12> send packet: $qOffsets#4b < 4> read packet: $#00 < 26> send packet: $qStructuredDataPlugins#02 < 4> read packet: $#00 < 13> send packet: $qSymbol::#5b < 6> read packet: $OK#9a < 16> send packet: $qfThreadInfo#bb < 5> read packet: $l#6c < 16> send packet: $qfThreadInfo#bb < 5> read packet: $l#6c < 6> send packet: $pf#d6 < 12> read packet: $00000000#80 < 6> send packet: $pd#d4 < 12> read packet: $00000000#80 < 6> send packet: $p0#a0 < 12> read packet: $00000000#80 < 6> send packet: $p1#a1 < 12> read packet: $00000000#80 < 6> send packet: $p2#a2 < 12> read packet: $00000000#80 < 6> send packet: $p3#a3 < 12> read packet: $00000000#80 < 6> send packet: $p4#a4 < 12> read packet: $00000000#80 < 6> send packet: $p5#a5 < 12> read packet: $00000000#80 < 6> send packet: $p6#a6 < 12> read packet: $00000000#80 < 6> send packet: $p7#a7 < 12> read packet: $00000000#80 < 6> send packet: $p8#a8 < 12> read packet: $00000000#80 < 6> send packet: $p9#a9 < 12> read packet: $00000000#80 < 6> send packet: $pa#d1 < 12> read packet: $00000000#80 < 6> send packet: $pb#d2 < 12> read packet: $00000000#80 < 6> send packet: $pc#d3 < 12> read packet: $00000000#80 < 6> send packet: $pe#d5 < 12> read packet: $00000000#80 < 7> send packet: $p19#da < 12> read packet: $00000000#80 < 5> send packet: $k#6b < 4> read packet: $#00 < 1> send packet: + history[1] tid=0x0307 < 1> send packet: + < 19> send packet: $QStartNoAckMode#b0 < 1> read packet: + < 6> read packet: $OK#9a < 1> send packet: + < 45> send packet: $qSupported:xmlRegisters=i386,arm,mips,arc#74 < 57> read packet: $qXfer:features:read+;PacketSize=3fff;QStartNoAckMode+#86 < 26> send packet: $QThreadSuffixSupported#e4 < 4> read packet: $#00 < 27> send packet: $QListThreadsInStopReply#21 < 4> read packet: $#00 < 13> send packet: $qHostInfo#9b < 28> read packet: $ptrsize:8;endian:little;#30 < 10> send packet: $vCont?#49 < 4> read packet: $#00 < 27> send packet: $qVAttachOrWaitSupported#38 < 4> read packet: $#00 < 23> send packet: $QEnableErrorStrings#8c < 6> read packet: $OK#9a < 16> send packet: $qProcessInfo#dc < 4> read packet: $#00 < 6> send packet: $qC#b4 < 7> read packet: $QC0#c4 < 16> send packet: $qfThreadInfo#bb < 5> read packet: $l#6c < 5> send packet: $?#3f < 7> read packet: $S02#b5 < 16> send packet: $qProcessInfo#dc < 4> read packet: $#00 < 41> send packet: $qXfer:features:read:target.xml:0,3ffe#af < 4> read packet: $#00 < 18> send packet: $qRegisterInfo0#72 < 4> read packet: $#00 < 16> send packet: $qfThreadInfo#bb < 5> read packet: $l#6c < 7> send packet: $Hg1#e0 < 6> read packet: $OK#9a < 6> send packet: $p0#a0 < 4> read packet: $#00 < 16> send packet: $qProcessInfo#dc < 4> read packet: $#00 < 12> send packet: $qOffsets#4b < 4> read packet: $#00 < 26> send packet: $qStructuredDataPlugins#02 < 4> read packet: $#00 < 13> send packet: $qSymbol::#5b < 6> read packet: $OK#9a < 16> send packet: $qfThreadInfo#bb < 5> read packet: $l#6c < 16> send packet: $qfThreadInfo#bb < 5> read packet: $l#6c < 5> send packet: $g#67 < 860> read packet: $0000000000000000000000000000000000000000000000000000000000000000000000000000000000000000000000000000000000000000000000000000000000000000000000000000000000000000000000000000000000000000000000000000000000000000000000000000000000000000000000000000000000000000000000000000000000000000000000000000000000000000000000000000000000000000000000000000000000000000000000000000000000000000000000000000000000000000000000000000000000000000000000000000000000000000000000000000000000000000000000000000000000000000000000000000000000000000000000000000000000000000000000000000000000000000000000000000000000000000000000000000000000000000000000000000000000000000000000000000000000000000000000000000000000000000000000000000000000000000000000000000000000000000000000000000000000000000000000000000000000000000000000000000000000000000000000000000000000000000000000000000000000000000#80 < 861> send packet: $G0000000000000000000000000000000000000000000000000000000000000000000000000000000000000000000000000000000000000000000000000000000000000000000000000000000000000000000000000000000000000000000000000000000000000000000000000000000000000000000000000000000000000000000000000000000000000000000000000000000000000000000000000000000000000000000000000000000000000000000000000000000000000000000000000000000000000000000000000000000000000000000000000000000000000000000000000000000000000000000000000000000000000000000000000000000000000000000000000000000000000000000000000000000000000000000000000000000000000000000000000000000000000000000000000000000000000000000000000000000000000000000000000000000000000000000000000000000000000000000000000000000000000000000000000000000000000000000000000000000000000000000000000000000000000000000000000000000000000000000000000000000000000000#c7 < 6> read packet: $OK#9a < 861> send packet: $G0000000000000000000000000000000000000000000000000000000000000000000000000000000000000000000000000000000000000000000000000000000000000000000000000000000000000000000000000000000000000000000000000000000000000000000000000000000000000000000000000000000000000000000000000000000000000000000000000000000000000000000000000000000000000000000000000000000000000000000000000000000000000000000000000000000000000000000000000000000000000000000000000000000000000000000000000000000000000000000000000000000000000000000000000000000000000000000000000000000000000000000000000000000000000000000000000000000000000000000000000000000000000000000000000000000000000000000000000000000000000000000000000000000000000000000000000000000000000000000000000000000000000000000000000000000000000000000000000000000000000000000000000000000000000000000000000000000000000000000000000000000000000000#c7 < 6> read packet: $OK#9a < 861> send packet: $G0000000000000000000000000000000000000000000000000000000000000000000000000000000000000000000000000000000000000000000000000000000000000000000000000000000000000000000000000000000000000000000000000000000000000000000000000000000000000000000000000000000000000000000000000000000000000000000000000000000000000000000000000000000000000000000000000000000000000000000000000000000000000000000000000000000000000000000000000000000000000000000000000000000000000000000000000000000000000000000000000000000000000000000000000000000000000000000000000000000000000000000000000000000000000000000000000000000000000000000000000000000000000000000000000000000000000000000000000000000000000000000000000000000000000000000000000000000000000000000000000000000000000000000000000000000000000000000000000000000000000000000000000000000000000000000000000000000000000000000000000000000000000000#c7 < 6> read packet: $OK#9a < 861> send packet: $G0000000000000000000000000000000000000000000000000000000000000000000000000000000000000000000000000000000000000000000000000000000000000000000000000000000000000000000000000000000000000000000000000000000000000000000000000000000000000000000000000000000000000000000000000000000000000000000000000000000000000000000000000000000000000000000000000000000000000000000000000000000000000000000000000000000000000000000000000000000000000000000000000000000000000000000000000000000000000000000000000000000000000000000000000000000000000000000000000000000000000000000000000000000000000000000000000000000000000000000000000000000000000000000000000000000000000000000000000000000000000000000000000000000000000000000000000000000000000000000000000000000000000000000000000000000000000000000000000000000000000000000000000000000000000000000000000000000000000000000000000000000000000000#c7 < 6> read packet: $OK#9a < 861> send packet: $G0000000000000000000000000000000000000000000000000000000000000000000000000000000000000000000000000000000000000000000000000000000000000000000000000000000000000000000000000000000000000000000000000000000000000000000000000000000000000000000000000000000000000000000000000000000000000000000000000000000000000000000000000000000000000000000000000000000000000000000000000000000000000000000000000000000000000000000000000000000000000000000000000000000000000000000000000000000000000000000000000000000000000000000000000000000000000000000000000000000000000000000000000000000000000000000000000000000000000000000000000000000000000000000000000000000000000000000000000000000000000000000000000000000000000000000000000000000000000000000000000000000000000000000000000000000000000000000000000000000000000000000000000000000000000000000000000000000000000000000000000000000000000000#c7 < 6> read packet: $OK#9a < 861> send packet: $G0000000000000000000000000000000000000000000000000000000000000000000000000000000000000000000000000000000000000000000000000000000000000000000000000000000000000000000000000000000000000000000000000000000000000000000000000000000000000000000000000000000000000000000000000000000000000000000000000000000000000000000000000000000000000000000000000000000000000000000000000000000000000000000000000000000000000000000000000000000000000000000000000000000000000000000000000000000000000000000000000000000000000000000000000000000000000000000000000000000000000000000000000000000000000000000000000000000000000000000000000000000000000000000000000000000000000000000000000000000000000000000000000000000000000000000000000000000000000000000000000000000000000000000000000000000000000000000000000000000000000000000000000000000000000000000000000000000000000000000000000000000000000000#c7 < 6> read packet: $OK#9a < 861> send packet: $G0000000000000000000000000000000000000000000000000000000000000000000000000000000000000000000000000000000000000000000000000000000000000000000000000000000000000000000000000000000000000000000000000000000000000000000000000000000000000000000000000000000000000000000000000000000000000000000000000000000000000000000000000000000000000000000000000000000000000000000000000000000000000000000000000000000000000000000000000000000000000000000000000000000000000000000000000000000000000000000000000000000000000000000000000000000000000000000000000000000000000000000000000000000000000000000000000000000000000000000000000000000000000000000000000000000000000000000000000000000000000000000000000000000000000000000000000000000000000000000000000000000000000000000000000000000000000000000000000000000000000000000000000000000000000000000000000000000000000000000000000000000000000000#c7 < 6> read packet: $OK#9a < 861> send packet: $G0000000000000000000000000000000000000000000000000000000000000000000000000000000000000000000000000000000000000000000000000000000000000000000000000000000000000000000000000000000000000000000000000000000000000000000000000000000000000000000000000000000000000000000000000000000000000000000000000000000000000000000000000000000000000000000000000000000000000000000000000000000000000000000000000000000000000000000000000000000000000000000000000000000000000000000000000000000000000000000000000000000000000000000000000000000000000000000000000000000000000000000000000000000000000000000000000000000000000000000000000000000000000000000000000000000000000000000000000000000000000000000000000000000000000000000000000000000000000000000000000000000000000000000000000000000000000000000000000000000000000000000000000000000000000000000000000000000000000000000000000000000000000000#c7 < 6> read packet: $OK#9a < 861> send packet: $G0000000000000000000000000000000000000000000000000000000000000000000000000000000000000000000000000000000000000000000000000000000000000000000000000000000000000000000000000000000000000000000000000000000000000000000000000000000000000000000000000000000000000000000000000000000000000000000000000000000000000000000000000000000000000000000000000000000000000000000000000000000000000000000000000000000000000000000000000000000000000000000000000000000000000000000000000000000000000000000000000000000000000000000000000000000000000000000000000000000000000000000000000000000000000000000000000000000000000000000000000000000000000000000000000000000000000000000000000000000000000000000000000000000000000000000000000000000000000000000000000000000000000000000000000000000000000000000000000000000000000000000000000000000000000000000000000000000000000000000000000000000000000000#c7 < 6> read packet: $OK#9a < 861> send packet: $G0000000000000000000000000000000000000000000000000000000000000000000000000000000000000000000000000000000000000000000000000000000000000000000000000000000000000000000000000000000000000000000000000000000000000000000000000000000000000000000000000000000000000000000000000000000000000000000000000000000000000000000000000000000000000000000000000000000000000000000000000000000000000000000000000000000000000000000000000000000000000000000000000000000000000000000000000000000000000000000000000000000000000000000000000000000000000000000000000000000000000000000000000000000000000000000000000000000000000000000000000000000000000000000000000000000000000000000000000000000000000000000000000000000000000000000000000000000000000000000000000000000000000000000000000000000000000000000000000000000000000000000000000000000000000000000000000000000000000000000000000000000000000000#c7 < 6> read packet: $OK#9a < 861> send packet: $G0000000000000000000000000000000000000000000000000000000000000000000000000000000000000000000000000000000000000000000000000000000000000000000000000000000000000000000000000000000000000000000000000000000000000000000000000000000000000000000000000000000000000000000000000000000000000000000000000000000000000000000000000000000000000000000000000000000000000000000000000000000000000000000000000000000000000000000000000000000000000000000000000000000000000000000000000000000000000000000000000000000000000000000000000000000000000000000000000000000000000000000000000000000000000000000000000000000000000000000000000000000000000000000000000000000000000000000000000000000000000000000000000000000000000000000000000000000000000000000000000000000000000000000000000000000000000000000000000000000000000000000000000000000000000000000000000000000000000000000000000000000000000000#c7 < 6> read packet: $OK#9a < 861> send packet: $G0000000000000000000000000000000000000000000000000000000000000000000000000000000000000000000000000000000000000000000000000000000000000000000000000000000000000000000000000000000000000000000000000000000000000000000000000000000000000000000000000000000000000000000000000000000000000000000000000000000000000000000000000000000000000000000000000000000000000000000000000000000000000000000000000000000000000000000000000000000000000000000000000000000000000000000000000000000000000000000000000000000000000000000000000000000000000000000000000000000000000000000000000000000000000000000000000000000000000000000000000000000000000000000000000000000000000000000000000000000000000000000000000000000000000000000000000000000000000000000000000000000000000000000000000000000000000000000000000000000000000000000000000000000000000000000000000000000000000000000000000000000000000000#c7 < 6> read packet: $OK#9a < 861> send packet: $G0000000000000000000000000000000000000000000000000000000000000000000000000000000000000000000000000000000000000000000000000000000000000000000000000000000000000000000000000000000000000000000000000000000000000000000000000000000000000000000000000000000000000000000000000000000000000000000000000000000000000000000000000000000000000000000000000000000000000000000000000000000000000000000000000000000000000000000000000000000000000000000000000000000000000000000000000000000000000000000000000000000000000000000000000000000000000000000000000000000000000000000000000000000000000000000000000000000000000000000000000000000000000000000000000000000000000000000000000000000000000000000000000000000000000000000000000000000000000000000000000000000000000000000000000000000000000000000000000000000000000000000000000000000000000000000000000000000000000000000000000000000000000000#c7 < 6> read packet: $OK#9a < 861> send packet: $G0000000000000000000000000000000000000000000000000000000000000000000000000000000000000000000000000000000000000000000000000000000000000000000000000000000000000000000000000000000000000000000000000000000000000000000000000000000000000000000000000000000000000000000000000000000000000000000000000000000000000000000000000000000000000000000000000000000000000000000000000000000000000000000000000000000000000000000000000000000000000000000000000000000000000000000000000000000000000000000000000000000000000000000000000000000000000000000000000000000000000000000000000000000000000000000000000000000000000000000000000000000000000000000000000000000000000000000000000000000000000000000000000000000000000000000000000000000000000000000000000000000000000000000000000000000000000000000000000000000000000000000000000000000000000000000000000000000000000000000000000000000000000000#c7 < 6> read packet: $OK#9a < 861> send packet: $G0000000000000000000000000000000000000000000000000000000000000000000000000000000000000000000000000000000000000000000000000000000000000000000000000000000000000000000000000000000000000000000000000000000000000000000000000000000000000000000000000000000000000000000000000000000000000000000000000000000000000000000000000000000000000000000000000000000000000000000000000000000000000000000000000000000000000000000000000000000000000000000000000000000000000000000000000000000000000000000000000000000000000000000000000000000000000000000000000000000000000000000000000000000000000000000000000000000000000000000000000000000000000000000000000000000000000000000000000000000000000000000000000000000000000000000000000000000000000000000000000000000000000000000000000000000000000000000000000000000000000000000000000000000000000000000000000000000000000000000000000000000000000000#c7 < 6> read packet: $OK#9a < 861> send packet: $G0000000000000000000000000000000000000000000000000000000000000000000000000000000000000000000000000000000000000000000000000000000000000000000000000000000000000000000000000000000000000000000000000000000000000000000000000000000000000000000000000000000000000000000000000000000000000000000000000000000000000000000000000000000000000000000000000000000000000000000000000000000000000000000000000000000000000000000000000000000000000000000000000000000000000000000000000000000000000000000000000000000000000000000000000000000000000000000000000000000000000000000000000000000000000000000000000000000000000000000000000000000000000000000000000000000000000000000000000000000000000000000000000000000000000000000000000000000000000000000000000000000000000000000000000000000000000000000000000000000000000000000000000000000000000000000000000000000000000000000000000000000000000000#c7 < 6> read packet: $OK#9a < 861> send packet: $G0000000000000000000000000000000000000000000000000000000000000000000000000000000000000000000000000000000000000000000000000000000000000000000000000000000000000000000000000000000000000000000000000000000000000000000000000000000000000000000000000000000000000000000000000000000000000000000000000000000000000000000000000000000000000000000000000000000000000000000000000000000000000000000000000000000000000000000000000000000000000000000000000000000000000000000000000000000000000000000000000000000000000000000000000000000000000000000000000000000000000000000000000000000000000000000000000000000000000000000000000000000000000000000000000000000000000000000000000000000000000000000000000000000000000000000000000000000000000000000000000000000000000000000000000000000000000000000000000000000000000000000000000000000000000000000000000000000000000000000000000000000000000000#c7 < 6> read packet: $OK#9a < 5> send packet: $k#6b < 4> read packet: $#00 < 1> send packet: + history[1] tid=0x0307 < 1> send packet: + < 19> send packet: $QStartNoAckMode#b0 < 1> read packet: + < 6> read packet: $OK#9a < 1> send packet: + < 45> send packet: $qSupported:xmlRegisters=i386,arm,mips,arc#74 < 57> read packet: $qXfer:features:read+;PacketSize=3fff;QStartNoAckMode+#86 < 26> send packet: $QThreadSuffixSupported#e4 < 4> read packet: $#00 < 27> send packet: $QListThreadsInStopReply#21 < 4> read packet: $#00 < 13> send packet: $qHostInfo#9b < 28> read packet: $ptrsize:8;endian:little;#30 < 10> send packet: $vCont?#49 < 4> read packet: $#00 < 27> send packet: $qVAttachOrWaitSupported#38 < 4> read packet: $#00 < 23> send packet: $QEnableErrorStrings#8c < 6> read packet: $OK#9a < 16> send packet: $qProcessInfo#dc < 4> read packet: $#00 < 6> send packet: $qC#b4 < 7> read packet: $QC0#c4 < 16> send packet: $qfThreadInfo#bb < 5> read packet: $l#6c < 5> send packet: $?#3f < 7> read packet: $S02#b5 < 16> send packet: $qProcessInfo#dc < 4> read packet: $#00 < 41> send packet: $qXfer:features:read:target.xml:0,3ffe#af < 4> read packet: $#00 < 18> send packet: $qRegisterInfo0#72 < 4> read packet: $#00 < 16> send packet: $qfThreadInfo#bb < 5> read packet: $l#6c < 7> send packet: $Hg1#e0 < 6> read packet: $OK#9a < 6> send packet: $p0#a0 < 12> read packet: $00000000#80 < 16> send packet: $qProcessInfo#dc < 4> read packet: $#00 < 12> send packet: $qOffsets#4b < 4> read packet: $#00 < 26> send packet: $qStructuredDataPlugins#02 < 4> read packet: $#00 < 13> send packet: $qSymbol::#5b < 6> read packet: $OK#9a < 16> send packet: $qfThreadInfo#bb < 5> read packet: $l#6c < 16> send packet: $qfThreadInfo#bb < 5> read packet: $l#6c < 6> send packet: $pf#d6 < 12> read packet: $00000000#80 < 6> send packet: $pd#d4 < 12> read packet: $00000000#80 < 15> send packet: $P0=00000000#3d < 6> read packet: $OK#9a < 15> send packet: $P1=00000000#3e < 6> read packet: $OK#9a < 15> send packet: $P2=00000000#3f < 6> read packet: $OK#9a < 15> send packet: $P3=00000000#40 < 6> read packet: $OK#9a < 15> send packet: $P4=00000000#41 < 6> read packet: $OK#9a < 15> send packet: $P5=00000000#42 < 6> read packet: $OK#9a < 15> send packet: $P6=00000000#43 < 6> read packet: $OK#9a < 15> send packet: $P7=00000000#44 < 6> read packet: $OK#9a < 15> send packet: $P8=00000000#45 < 6> read packet: $OK#9a < 15> send packet: $P9=00000000#46 < 6> read packet: $OK#9a < 15> send packet: $Pa=00000000#6e < 6> read packet: $OK#9a < 15> send packet: $Pb=00000000#6f < 6> read packet: $OK#9a < 15> send packet: $Pc=00000000#70 < 6> read packet: $OK#9a < 15> send packet: $Pd=00000000#71 < 6> read packet: $OK#9a < 15> send packet: $Pe=00000000#72 < 6> read packet: $OK#9a < 15> send packet: $Pf=00000000#73 < 6> read packet: $OK#9a < 16> send packet: $P19=00000000#77 < 6> read packet: $OK#9a < 5> send packet: $k#6b < 4> read packet: $#00 libstdcxx tests will not be run because: Don't know how to build with libstdcxx on macosx Skipping following debug info categories: ['dwo']

Hide Details

-- Command Output (stderr): --

Hide Details

Session logs for test failures/errors/unexpected successes will go into directory '/Users/buildslave/jenkins/workspace/lldb-cmake/test/logs' Change dir to: /Users/buildslave/jenkins/workspace/lldb-cmake/llvm-project/lldb/test/API/functionalities/gdb_remote_client runCmd: settings clear -all output:

Hide Details

runCmd: settings set symbols.enable-external-lookup false output:

Hide Details

runCmd: settings set target.inherit-tcc true output:

Hide Details

runCmd: settings set target.auto-apply-fixits false output:

Hide Details

runCmd: settings set plugin.process.gdb-remote.packet-timeout 60 output:

Hide Details

runCmd: settings set symbols.clang-modules-cache-path "/Users/buildslave/jenkins/workspace/lldb-cmake/lldb-build/lldb-test-build.noindex/module-cache-lldb/lldb-api" output:

Hide Details

runCmd: settings set use-color false output:

Hide Details

runCmd: setting set target.prefer-dynamic-value no-dynamic-values output:

Hide Details

<bound method SBProcess.Kill of <lldb.SBProcess; proxy of <Swig Object of type 'lldb::SBProcess *' at 0x10d3d95d0> >>: success

Hide Details

PASS: LLDB (/Users/buildslave/jenkins/workspace/lldb-cmake/lldb-build/bin/clang-x86_64) :: test_attach_fail (TestGDBRemoteClient.TestGDBRemoteClient) runCmd: settings clear -all output:

Hide Details

runCmd: settings set symbols.enable-external-lookup false output:

Hide Details

runCmd: settings set target.inherit-tcc true output:

Hide Details

runCmd: settings set target.auto-apply-fixits false output:

Hide Details

runCmd: settings set plugin.process.gdb-remote.packet-timeout 60 output:

Hide Details

runCmd: settings set symbols.clang-modules-cache-path "/Users/buildslave/jenkins/workspace/lldb-cmake/lldb-build/lldb-test-build.noindex/module-cache-lldb/lldb-api" output:

Hide Details

runCmd: settings set use-color false output:

Hide Details

runCmd: setting set target.prefer-dynamic-value no-dynamic-values output:

Hide Details

FAIL: LLDB (/Users/buildslave/jenkins/workspace/lldb-cmake/lldb-build/bin/clang-x86_64) :: test_connect (TestGDBRemoteClient.TestGDBRemoteClient) <bound method SBProcess.Kill of <lldb.SBProcess; proxy of <Swig Object of type 'lldb::SBProcess *' at 0x10d27cc30> >>: success

Hide Details

runCmd: settings clear -all output:

Hide Details

runCmd: settings set symbols.enable-external-lookup false output:

Hide Details

runCmd: settings set target.inherit-tcc true output:

Hide Details

runCmd: settings set target.auto-apply-fixits false output:

Hide Details

runCmd: settings set plugin.process.gdb-remote.packet-timeout 60 output:

Hide Details

runCmd: settings set symbols.clang-modules-cache-path "/Users/buildslave/jenkins/workspace/lldb-cmake/lldb-build/lldb-test-build.noindex/module-cache-lldb/lldb-api" output:

Hide Details

runCmd: settings set use-color false output:

Hide Details

runCmd: setting set target.prefer-dynamic-value no-dynamic-values output:

Hide Details

runCmd: log enable gdb-remote packets output:

Hide Details

<bound method SBProcess.Kill of <lldb.SBProcess; proxy of <Swig Object of type 'lldb::SBProcess *' at 0x10d3d9630> >>: success

Hide Details

PASS: LLDB (/Users/buildslave/jenkins/workspace/lldb-cmake/lldb-build/bin/clang-x86_64) :: test_launch_fail (TestGDBRemoteClient.TestGDBRemoteClient) runCmd: settings clear -all output:

Hide Details

runCmd: settings set symbols.enable-external-lookup false output:

Hide Details

runCmd: settings set target.inherit-tcc true output:

Hide Details

runCmd: settings set target.auto-apply-fixits false output:

Hide Details

runCmd: settings set plugin.process.gdb-remote.packet-timeout 60 output:

Hide Details

runCmd: settings set symbols.clang-modules-cache-path "/Users/buildslave/jenkins/workspace/lldb-cmake/lldb-build/lldb-test-build.noindex/module-cache-lldb/lldb-api" output:

Hide Details

runCmd: settings set use-color false output:

Hide Details

runCmd: setting set target.prefer-dynamic-value no-dynamic-values output:

Hide Details

Adding tearDown hook: self.addTearDownHook(lambda: self.runCmd("settings set plugin.process.gdb-remote.use-g-packet-for-reading false"))

Hide Details

Hide Details

<bound method SBProcess.Kill of <lldb.SBProcess; proxy of <Swig Object of type 'lldb::SBProcess *' at 0x10d27c660> >>: success

Hide Details

Executing tearDown hook: self.addTearDownHook(lambda: self.runCmd("settings set plugin.process.gdb-remote.use-g-packet-for-reading false"))

Hide Details

Hide Details

runCmd: settings set plugin.process.gdb-remote.use-g-packet-for-reading false output:

Hide Details

PASS: LLDB (/Users/buildslave/jenkins/workspace/lldb-cmake/lldb-build/bin/clang-x86_64) :: test_read_registers_using_g_packets (TestGDBRemoteClient.TestGDBRemoteClient) runCmd: settings clear -all output:

Hide Details

runCmd: settings set symbols.enable-external-lookup false output:

Hide Details

runCmd: settings set target.inherit-tcc true output:

Hide Details

runCmd: settings set target.auto-apply-fixits false output:

Hide Details

runCmd: settings set plugin.process.gdb-remote.packet-timeout 60 output:

Hide Details

runCmd: settings set symbols.clang-modules-cache-path "/Users/buildslave/jenkins/workspace/lldb-cmake/lldb-build/lldb-test-build.noindex/module-cache-lldb/lldb-api" output:

Hide Details

runCmd: settings set use-color false output:

Hide Details

runCmd: setting set target.prefer-dynamic-value no-dynamic-values output:

Hide Details

<bound method SBProcess.Kill of <lldb.SBProcess; proxy of <Swig Object of type 'lldb::SBProcess *' at 0x10d3d9630> >>: success

Hide Details

PASS: LLDB (/Users/buildslave/jenkins/workspace/lldb-cmake/lldb-build/bin/clang-x86_64) :: test_read_registers_using_p_packets (TestGDBRemoteClient.TestGDBRemoteClient) runCmd: settings clear -all output:

Hide Details

runCmd: settings set symbols.enable-external-lookup false output:

Hide Details

runCmd: settings set target.inherit-tcc true output:

Hide Details

runCmd: settings set target.auto-apply-fixits false output:

Hide Details

runCmd: settings set plugin.process.gdb-remote.packet-timeout 60 output:

Hide Details

runCmd: settings set symbols.clang-modules-cache-path "/Users/buildslave/jenkins/workspace/lldb-cmake/lldb-build/lldb-test-build.noindex/module-cache-lldb/lldb-api" output:

Hide Details

runCmd: settings set use-color false output:

Hide Details

runCmd: setting set target.prefer-dynamic-value no-dynamic-values output:

Hide Details

<bound method SBProcess.Kill of <lldb.SBProcess; proxy of <Swig Object of type 'lldb::SBProcess *' at 0x10d27cc30> >>: success

Hide Details

PASS: LLDB (/Users/buildslave/jenkins/workspace/lldb-cmake/lldb-build/bin/clang-x86_64) :: test_write_registers_using_G_packets (TestGDBRemoteClient.TestGDBRemoteClient) runCmd: settings clear -all output:

Hide Details

runCmd: settings set symbols.enable-external-lookup false output:

Hide Details

runCmd: settings set target.inherit-tcc true output:

Hide Details

runCmd: settings set target.auto-apply-fixits false output:

Hide Details

runCmd: settings set plugin.process.gdb-remote.packet-timeout 60 output:

Hide Details

runCmd: settings set symbols.clang-modules-cache-path "/Users/buildslave/jenkins/workspace/lldb-cmake/lldb-build/lldb-test-build.noindex/module-cache-lldb/lldb-api" output:

Hide Details

runCmd: settings set use-color false output:

Hide Details

runCmd: setting set target.prefer-dynamic-value no-dynamic-values output:

Hide Details

<bound method SBProcess.Kill of <lldb.SBProcess; proxy of <Swig Object of type 'lldb::SBProcess *' at 0x10d3d9630> >>: success

Hide Details

PASS: LLDB (/Users/buildslave/jenkins/workspace/lldb-cmake/lldb-build/bin/clang-x86_64) :: test_write_registers_using_P_packets (TestGDBRemoteClient.TestGDBRemoteClient) Restore dir to: /Users/buildslave/jenkins/workspace/lldb-cmake/lldb-build/tools/lldb/test ====================================================================== FAIL: test_connect (TestGDBRemoteClient.TestGDBRemoteClient) Test connecting to a remote gdb server ---------------------------------------------------------------------- Traceback (most recent call last): File "/Users/buildslave/jenkins/workspace/lldb-cmake/llvm-project/lldb/test/API/functionalities/gdb_remote_client/TestGDBRemoteClient.py", line 18, in test_connect process = self.connect(target) File "/Users/buildslave/jenkins/workspace/lldb-cmake/llvm-project/lldb/test/API/functionalities/gdb_remote_client/gdbclientutils.py", line 524, in connect self.assertTrue(error.Success(), error.description) AssertionError: False is not True : failed to get reply to handshake packet Config=x86_64-/Users/buildslave/jenkins/workspace/lldb-cmake/lldb-build/bin/clang ---------------------------------------------------------------------- Ran 7 tests in 114.377s

Hide Details

RESULT: FAILED (6 passes, 1 failures, 0 errors, 0 skipped, 0 expected failures, 0 unexpected successes)

Hide Details

--

Hide Details

******************** PASS: lldb-api :: functionalities/data-formatter/compactvectors/TestCompactVectors.py (2134 of 2153) PASS: lldb-unit :: Utility/./UtilityTests/SerializationRountripTest.SerializeDeserializeCStringArrayNullptr (2135 of 2153) PASS: lldb-api :: assert_messages_test/TestAssertMessages.py (2136 of 2153) PASS: lldb-api :: commands/settings/use_source_cache/TestUseSourceCache.py (2137 of 2153) PASS: lldb-unit :: Utility/./UtilityTests/VMRange.Clear (2138 of 2153) PASS: lldb-api :: python_api/lldbutil/frame/TestFrameUtils.py (2139 of 2153) PASS: lldb-unit :: Utility/./UtilityTests/ArgsTest.TestSingleArgWithQuotedSpace (2140 of 2153) PASS: lldb-unit :: Utility/./UtilityTests/FileSpecTest.CopyByAppendingPathComponent (2141 of 2153) TIMEOUT: lldb-api :: macosx/simulator/TestSimulatorPlatform.py (2142 of 2153) ******************** TEST 'lldb-api :: macosx/simulator/TestSimulatorPlatform.py' FAILED ******************** Script: -- /usr/local/Frameworks/Python.framework/Versions/3.7/bin/python3.7 /Users/buildslave/jenkins/workspace/lldb-cmake/llvm-project/lldb/test/API/dotest.py -s /Users/buildslave/jenkins/workspace/lldb-cmake/lldb-build/lldb-test-traces -S nm -u CXXFLAGS -u CFLAGS --codesign-identity - --server /Users/buildslave/jenkins/workspace/lldb-cmake/lldb-build/./bin/debugserver --arch x86_64 --build-dir /Users/buildslave/jenkins/workspace/lldb-cmake/lldb-build/lldb-test-build.noindex -s=/Users/buildslave/jenkins/workspace/lldb-cmake/test/logs -t --env TERM=vt100 --env LLVM_LIBS_DIR=/Users/buildslave/jenkins/workspace/lldb-cmake/lldb-build/./lib --arch x86_64 --build-dir /Users/buildslave/jenkins/workspace/lldb-cmake/lldb-build/lldb-test-build.noindex --lldb-module-cache-dir /Users/buildslave/jenkins/workspace/lldb-cmake/lldb-build/lldb-test-build.noindex/module-cache-lldb/lldb-api --clang-module-cache-dir /Users/buildslave/jenkins/workspace/lldb-cmake/lldb-build/lldb-test-build.noindex/module-cache-clang/lldb-api --executable /Users/buildslave/jenkins/workspace/lldb-cmake/lldb-build/./bin/lldb --compiler /Users/buildslave/jenkins/workspace/lldb-cmake/lldb-build/./bin/clang --dsymutil /Users/buildslave/jenkins/workspace/lldb-cmake/lldb-build/./bin/dsymutil --filecheck /Users/buildslave/jenkins/workspace/lldb-cmake/lldb-build/./bin/FileCheck --yaml2obj /Users/buildslave/jenkins/workspace/lldb-cmake/lldb-build/./bin/yaml2obj --lldb-libs-dir /Users/buildslave/jenkins/workspace/lldb-cmake/lldb-build/./lib /Users/buildslave/jenkins/workspace/lldb-cmake/llvm-project/lldb/test/API/macosx/simulator -p TestSimulatorPlatform.py -- Exit Code: -9 Timeout: Reached timeout of 600 seconds

Hide Details

Command Output (stdout): -- lldb version 12.0.99 clang revision 816b0a9c9f46cbfce253f49dad7cbf93867307ac llvm revision 816b0a9c9f46cbfce253f49dad7cbf93867307ac

Hide Details

-- Command Output (stderr): --

Hide Details

Session logs for test failures/errors/unexpected successes will go into directory '/Users/buildslave/jenkins/workspace/lldb-cmake/test/logs' Change dir to: /Users/buildslave/jenkins/workspace/lldb-cmake/llvm-project/lldb/test/API/macosx/simulator runCmd: settings clear -all output:

Hide Details

runCmd: settings set symbols.enable-external-lookup false output:

Hide Details

runCmd: settings set target.inherit-tcc true output:

Hide Details

runCmd: settings set target.auto-apply-fixits false output:

Hide Details

runCmd: settings set plugin.process.gdb-remote.packet-timeout 60 output:

Hide Details

runCmd: settings set symbols.clang-modules-cache-path "/Users/buildslave/jenkins/workspace/lldb-cmake/lldb-build/lldb-test-build.noindex/module-cache-lldb/lldb-api" output:

Hide Details

runCmd: settings set use-color false output:

Hide Details

runCmd: setting set target.prefer-dynamic-value no-dynamic-values output:

Hide Details

runCmd: log enable gdb-remote packets -f /Users/buildslave/jenkins/workspace/lldb-cmake/lldb-build/lldb-test-build.noindex/macosx/simulator/TestSimulatorPlatform.test_ios/packets.log output:

Hide Details

Ran command: "log enable gdb-remote packets -f /Users/buildslave/jenkins/workspace/lldb-cmake/lldb-build/lldb-test-build.noindex/macosx/simulator/TestSimulatorPlatform.test_ios/packets.log"

Hide Details

Got output:

Hide Details

Hide Details

runCmd: image list -b -t output: [ 0] a.out x86_64-apple-ios13.5.0-simulator [ 1] dyld x86_64-apple-macosx10.15.0 [ 2] dyld_sim x86_64-apple-ios13.5.0-simulator [ 3] libc++.1.dylib x86_64-apple-ios13.5.0-simulator [ 4] libSystem.B.dylib x86_64-apple-ios13.5.0-simulator [ 5] libc++abi.dylib x86_64-apple-ios13.5.0-simulator [ 6] libcache.dylib x86_64-apple-ios13.5.0-simulator [ 7] libcommonCrypto.dylib x86_64-apple-ios13.5.0-simulator [ 8] libcompiler_rt.dylib x86_64-apple-ios13.5.0-simulator [ 9] libcopyfile.dylib x86_64-apple-ios13.5.0-simulator [ 10] libcorecrypto.dylib x86_64-apple-ios13.5.0-simulator [ 11] libdispatch.dylib x86_64-apple-ios13.5.0-simulator [ 12] libdyld.dylib x86_64-apple-ios13.5.0-simulator [ 13] liblaunch.dylib x86_64-apple-ios13.5.0-simulator [ 14] libmacho.dylib x86_64-apple-ios13.5.0-simulator [ 15] libremovefile.dylib x86_64-apple-ios13.5.0-simulator [ 16] libsystem_asl.dylib x86_64-apple-ios13.5.0-simulator [ 17] libsystem_blocks.dylib x86_64-apple-ios13.5.0-simulator [ 18] libsystem_c.dylib x86_64-apple-ios13.5.0-simulator [ 19] libsystem_configuration.dylib x86_64-apple-ios13.5.0-simulator [ 20] libsystem_containermanager.dylib x86_64-apple-ios13.5.0-simulator [ 21] libsystem_coreservices.dylib x86_64-apple-ios13.5.0-simulator [ 22] libsystem_darwin.dylib x86_64-apple-ios13.5.0-simulator [ 23] libsystem_dnssd.dylib x86_64-apple-ios13.5.0-simulator [ 24] libsystem_featureflags.dylib x86_64-apple-ios13.5.0-simulator [ 25] libsystem_info.dylib x86_64-apple-ios13.5.0-simulator [ 26] libsystem_m.dylib x86_64-apple-ios13.5.0-simulator [ 27] libsystem_malloc.dylib x86_64-apple-ios13.5.0-simulator [ 28] libsystem_notify.dylib x86_64-apple-ios13.5.0-simulator [ 29] libsystem_sandbox.dylib x86_64-apple-ios13.5.0-simulator [ 30] libsystem_sim_kernel.dylib x86_64-apple-ios13.5.0-simulator [ 31] libsystem_sim_platform.dylib x86_64-apple-ios13.5.0-simulator [ 32] libsystem_sim_pthread.dylib x86_64-apple-ios13.5.0-simulator [ 33] libsystem_trace.dylib x86_64-apple-ios13.5.0-simulator [ 34] libunwind.dylib x86_64-apple-ios13.5.0-simulator [ 35] libxpc.dylib x86_64-apple-ios13.5.0-simulator [ 36] libsystem_sim_pthread_host.dylib x86_64-apple-ios13.5.0-simulator [ 37] libsystem_sim_platform_host.dylib x86_64-apple-ios13.5.0-simulator [ 38] libsystem_sim_kernel_host.dylib x86_64-apple-ios13.5.0-simulator [ 39] libsystem_kernel.dylib x86_64-apple-macosx10.15.0-simulator(0x00007fff51b5a000) [ 40] libobjc.A.dylib x86_64-apple-ios13.5.0-simulator [ 41] libsystem_platform.dylib x86_64-apple-macosx10.15.0-simulator(0x00007fff51bfd000) [ 42] libsystem_pthread.dylib x86_64-apple-macosx10.15.0-simulator(0x00007fff51c06000)

Hide Details

Hide Details

Ran command: "image list -b -t"

Hide Details

Got output: [ 0] a.out x86_64-apple-ios13.5.0-simulator [ 1] dyld x86_64-apple-macosx10.15.0 [ 2] dyld_sim x86_64-apple-ios13.5.0-simulator [ 3] libc++.1.dylib x86_64-apple-ios13.5.0-simulator [ 4] libSystem.B.dylib x86_64-apple-ios13.5.0-simulator [ 5] libc++abi.dylib x86_64-apple-ios13.5.0-simulator [ 6] libcache.dylib x86_64-apple-ios13.5.0-simulator [ 7] libcommonCrypto.dylib x86_64-apple-ios13.5.0-simulator [ 8] libcompiler_rt.dylib x86_64-apple-ios13.5.0-simulator [ 9] libcopyfile.dylib x86_64-apple-ios13.5.0-simulator [ 10] libcorecrypto.dylib x86_64-apple-ios13.5.0-simulator [ 11] libdispatch.dylib x86_64-apple-ios13.5.0-simulator [ 12] libdyld.dylib x86_64-apple-ios13.5.0-simulator [ 13] liblaunch.dylib x86_64-apple-ios13.5.0-simulator [ 14] libmacho.dylib x86_64-apple-ios13.5.0-simulator [ 15] libremovefile.dylib x86_64-apple-ios13.5.0-simulator [ 16] libsystem_asl.dylib x86_64-apple-ios13.5.0-simulator [ 17] libsystem_blocks.dylib x86_64-apple-ios13.5.0-simulator [ 18] libsystem_c.dylib x86_64-apple-ios13.5.0-simulator [ 19] libsystem_configuration.dylib x86_64-apple-ios13.5.0-simulator [ 20] libsystem_containermanager.dylib x86_64-apple-ios13.5.0-simulator [ 21] libsystem_coreservices.dylib x86_64-apple-ios13.5.0-simulator [ 22] libsystem_darwin.dylib x86_64-apple-ios13.5.0-simulator [ 23] libsystem_dnssd.dylib x86_64-apple-ios13.5.0-simulator [ 24] libsystem_featureflags.dylib x86_64-apple-ios13.5.0-simulator [ 25] libsystem_info.dylib x86_64-apple-ios13.5.0-simulator [ 26] libsystem_m.dylib x86_64-apple-ios13.5.0-simulator [ 27] libsystem_malloc.dylib x86_64-apple-ios13.5.0-simulator [ 28] libsystem_notify.dylib x86_64-apple-ios13.5.0-simulator [ 29] libsystem_sandbox.dylib x86_64-apple-ios13.5.0-simulator [ 30] libsystem_sim_kernel.dylib x86_64-apple-ios13.5.0-simulator [ 31] libsystem_sim_platform.dylib x86_64-apple-ios13.5.0-simulator [ 32] libsystem_sim_pthread.dylib x86_64-apple-ios13.5.0-simulator [ 33] libsystem_trace.dylib x86_64-apple-ios13.5.0-simulator [ 34] libunwind.dylib x86_64-apple-ios13.5.0-simulator [ 35] libxpc.dylib x86_64-apple-ios13.5.0-simulator [ 36] libsystem_sim_pthread_host.dylib x86_64-apple-ios13.5.0-simulator [ 37] libsystem_sim_platform_host.dylib x86_64-apple-ios13.5.0-simulator [ 38] libsystem_sim_kernel_host.dylib x86_64-apple-ios13.5.0-simulator [ 39] libsystem_kernel.dylib x86_64-apple-macosx10.15.0-simulator(0x00007fff51b5a000) [ 40] libobjc.A.dylib x86_64-apple-ios13.5.0-simulator [ 41] libsystem_platform.dylib x86_64-apple-macosx10.15.0-simulator(0x00007fff51bfd000) [ 42] libsystem_pthread.dylib x86_64-apple-macosx10.15.0-simulator(0x00007fff51c06000)

Hide Details

Expecting regex pattern: "a\.out x86_64-apple-ios13.5.*-simulator" (was found, matched "a.out x86_64-apple-ios13.5.0-simulator")

Hide Details

<bound method SBProcess.Kill of <lldb.SBProcess; proxy of <Swig Object of type 'lldb::SBProcess *' at 0x112682fc0> >>: success

Hide Details

PASS: LLDB (/Users/buildslave/jenkins/workspace/lldb-cmake/lldb-build/bin/clang-x86_64) :: test_ios (TestSimulatorPlatform.TestSimulatorPlatformLaunching) runCmd: settings clear -all output:

Hide Details

runCmd: settings set symbols.enable-external-lookup false output:

Hide Details

runCmd: settings set target.inherit-tcc true output:

Hide Details

runCmd: settings set target.auto-apply-fixits false output:

Hide Details

runCmd: settings set plugin.process.gdb-remote.packet-timeout 60 output:

Hide Details

runCmd: settings set symbols.clang-modules-cache-path "/Users/buildslave/jenkins/workspace/lldb-cmake/lldb-build/lldb-test-build.noindex/module-cache-lldb/lldb-api" output:

Hide Details

runCmd: settings set use-color false output:

Hide Details

runCmd: setting set target.prefer-dynamic-value no-dynamic-values output:

Hide Details

UNSUPPORTED: LLDB (/Users/buildslave/jenkins/workspace/lldb-cmake/lldb-build/bin/clang-x86_64) :: test_ios_backdeploy_apple_silicon (TestSimulatorPlatform.TestSimulatorPlatformLaunching) (skipping due to the following parameter(s): architecture) runCmd: settings clear -all output:

Hide Details

runCmd: settings set symbols.enable-external-lookup false output:

Hide Details

runCmd: settings set target.inherit-tcc true output:

Hide Details

runCmd: settings set target.auto-apply-fixits false output:

Hide Details

runCmd: settings set plugin.process.gdb-remote.packet-timeout 60 output:

Hide Details

runCmd: settings set symbols.clang-modules-cache-path "/Users/buildslave/jenkins/workspace/lldb-cmake/lldb-build/lldb-test-build.noindex/module-cache-lldb/lldb-api" output:

Hide Details

runCmd: settings set use-color false output:

Hide Details

runCmd: setting set target.prefer-dynamic-value no-dynamic-values output:

Hide Details

runCmd: log enable gdb-remote packets -f /Users/buildslave/jenkins/workspace/lldb-cmake/lldb-build/lldb-test-build.noindex/macosx/simulator/TestSimulatorPlatform.test_ios_backdeploy_x86/packets.log output:

Hide Details

Ran command: "log enable gdb-remote packets -f /Users/buildslave/jenkins/workspace/lldb-cmake/lldb-build/lldb-test-build.noindex/macosx/simulator/TestSimulatorPlatform.test_ios_backdeploy_x86/packets.log"

Hide Details

Got output:

Hide Details

Hide Details

runCmd: image list -b -t output: [ 0] a.out x86_64-apple-ios13.0.0-simulator [ 1] dyld x86_64-apple-macosx10.15.0 [ 2] dyld_sim x86_64-apple-ios13.5.0-simulator [ 3] libc++.1.dylib x86_64-apple-ios13.5.0-simulator [ 4] libSystem.B.dylib x86_64-apple-ios13.5.0-simulator [ 5] libc++abi.dylib x86_64-apple-ios13.5.0-simulator [ 6] libcache.dylib x86_64-apple-ios13.5.0-simulator [ 7] libcommonCrypto.dylib x86_64-apple-ios13.5.0-simulator [ 8] libcompiler_rt.dylib x86_64-apple-ios13.5.0-simulator [ 9] libcopyfile.dylib x86_64-apple-ios13.5.0-simulator [ 10] libcorecrypto.dylib x86_64-apple-ios13.5.0-simulator [ 11] libdispatch.dylib x86_64-apple-ios13.5.0-simulator [ 12] libdyld.dylib x86_64-apple-ios13.5.0-simulator [ 13] liblaunch.dylib x86_64-apple-ios13.5.0-simulator [ 14] libmacho.dylib x86_64-apple-ios13.5.0-simulator [ 15] libremovefile.dylib x86_64-apple-ios13.5.0-simulator [ 16] libsystem_asl.dylib x86_64-apple-ios13.5.0-simulator [ 17] libsystem_blocks.dylib x86_64-apple-ios13.5.0-simulator [ 18] libsystem_c.dylib x86_64-apple-ios13.5.0-simulator [ 19] libsystem_configuration.dylib x86_64-apple-ios13.5.0-simulator [ 20] libsystem_containermanager.dylib x86_64-apple-ios13.5.0-simulator [ 21] libsystem_coreservices.dylib x86_64-apple-ios13.5.0-simulator [ 22] libsystem_darwin.dylib x86_64-apple-ios13.5.0-simulator [ 23] libsystem_dnssd.dylib x86_64-apple-ios13.5.0-simulator [ 24] libsystem_featureflags.dylib x86_64-apple-ios13.5.0-simulator [ 25] libsystem_info.dylib x86_64-apple-ios13.5.0-simulator [ 26] libsystem_m.dylib x86_64-apple-ios13.5.0-simulator [ 27] libsystem_malloc.dylib x86_64-apple-ios13.5.0-simulator [ 28] libsystem_notify.dylib x86_64-apple-ios13.5.0-simulator [ 29] libsystem_sandbox.dylib x86_64-apple-ios13.5.0-simulator [ 30] libsystem_sim_kernel.dylib x86_64-apple-ios13.5.0-simulator [ 31] libsystem_sim_platform.dylib x86_64-apple-ios13.5.0-simulator [ 32] libsystem_sim_pthread.dylib x86_64-apple-ios13.5.0-simulator [ 33] libsystem_trace.dylib x86_64-apple-ios13.5.0-simulator [ 34] libunwind.dylib x86_64-apple-ios13.5.0-simulator [ 35] libxpc.dylib x86_64-apple-ios13.5.0-simulator [ 36] libsystem_sim_pthread_host.dylib x86_64-apple-ios13.5.0-simulator [ 37] libsystem_sim_platform_host.dylib x86_64-apple-ios13.5.0-simulator [ 38] libsystem_sim_kernel_host.dylib x86_64-apple-ios13.5.0-simulator [ 39] libsystem_kernel.dylib x86_64-apple-macosx10.15.0-simulator(0x00007fff51b5a000) [ 40] libobjc.A.dylib x86_64-apple-ios13.5.0-simulator [ 41] libsystem_platform.dylib x86_64-apple-macosx10.15.0-simulator(0x00007fff51bfd000) [ 42] libsystem_pthread.dylib x86_64-apple-macosx10.15.0-simulator(0x00007fff51c06000)

Hide Details

Hide Details

Ran command: "image list -b -t"

Hide Details

Got output: [ 0] a.out x86_64-apple-ios13.0.0-simulator [ 1] dyld x86_64-apple-macosx10.15.0 [ 2] dyld_sim x86_64-apple-ios13.5.0-simulator [ 3] libc++.1.dylib x86_64-apple-ios13.5.0-simulator [ 4] libSystem.B.dylib x86_64-apple-ios13.5.0-simulator [ 5] libc++abi.dylib x86_64-apple-ios13.5.0-simulator [ 6] libcache.dylib x86_64-apple-ios13.5.0-simulator [ 7] libcommonCrypto.dylib x86_64-apple-ios13.5.0-simulator [ 8] libcompiler_rt.dylib x86_64-apple-ios13.5.0-simulator [ 9] libcopyfile.dylib x86_64-apple-ios13.5.0-simulator [ 10] libcorecrypto.dylib x86_64-apple-ios13.5.0-simulator [ 11] libdispatch.dylib x86_64-apple-ios13.5.0-simulator [ 12] libdyld.dylib x86_64-apple-ios13.5.0-simulator [ 13] liblaunch.dylib x86_64-apple-ios13.5.0-simulator [ 14] libmacho.dylib x86_64-apple-ios13.5.0-simulator [ 15] libremovefile.dylib x86_64-apple-ios13.5.0-simulator [ 16] libsystem_asl.dylib x86_64-apple-ios13.5.0-simulator [ 17] libsystem_blocks.dylib x86_64-apple-ios13.5.0-simulator [ 18] libsystem_c.dylib x86_64-apple-ios13.5.0-simulator [ 19] libsystem_configuration.dylib x86_64-apple-ios13.5.0-simulator [ 20] libsystem_containermanager.dylib x86_64-apple-ios13.5.0-simulator [ 21] libsystem_coreservices.dylib x86_64-apple-ios13.5.0-simulator [ 22] libsystem_darwin.dylib x86_64-apple-ios13.5.0-simulator [ 23] libsystem_dnssd.dylib x86_64-apple-ios13.5.0-simulator [ 24] libsystem_featureflags.dylib x86_64-apple-ios13.5.0-simulator [ 25] libsystem_info.dylib x86_64-apple-ios13.5.0-simulator [ 26] libsystem_m.dylib x86_64-apple-ios13.5.0-simulator [ 27] libsystem_malloc.dylib x86_64-apple-ios13.5.0-simulator [ 28] libsystem_notify.dylib x86_64-apple-ios13.5.0-simulator [ 29] libsystem_sandbox.dylib x86_64-apple-ios13.5.0-simulator [ 30] libsystem_sim_kernel.dylib x86_64-apple-ios13.5.0-simulator [ 31] libsystem_sim_platform.dylib x86_64-apple-ios13.5.0-simulator [ 32] libsystem_sim_pthread.dylib x86_64-apple-ios13.5.0-simulator [ 33] libsystem_trace.dylib x86_64-apple-ios13.5.0-simulator [ 34] libunwind.dylib x86_64-apple-ios13.5.0-simulator [ 35] libxpc.dylib x86_64-apple-ios13.5.0-simulator [ 36] libsystem_sim_pthread_host.dylib x86_64-apple-ios13.5.0-simulator [ 37] libsystem_sim_platform_host.dylib x86_64-apple-ios13.5.0-simulator [ 38] libsystem_sim_kernel_host.dylib x86_64-apple-ios13.5.0-simulator [ 39] libsystem_kernel.dylib x86_64-apple-macosx10.15.0-simulator(0x00007fff51b5a000) [ 40] libobjc.A.dylib x86_64-apple-ios13.5.0-simulator [ 41] libsystem_platform.dylib x86_64-apple-macosx10.15.0-simulator(0x00007fff51bfd000) [ 42] libsystem_pthread.dylib x86_64-apple-macosx10.15.0-simulator(0x00007fff51c06000)

Hide Details

Expecting regex pattern: "a\.out x86_64-apple-ios13.0.*-simulator" (was found, matched "a.out x86_64-apple-ios13.0.0-simulator")

Hide Details

<bound method SBProcess.Kill of <lldb.SBProcess; proxy of <Swig Object of type 'lldb::SBProcess *' at 0x111100270> >>: success

Hide Details

PASS: LLDB (/Users/buildslave/jenkins/workspace/lldb-cmake/lldb-build/bin/clang-x86_64) :: test_ios_backdeploy_x86 (TestSimulatorPlatform.TestSimulatorPlatformLaunching) runCmd: settings clear -all output:

Hide Details

runCmd: settings set symbols.enable-external-lookup false output:

Hide Details

runCmd: settings set target.inherit-tcc true output:

Hide Details

runCmd: settings set target.auto-apply-fixits false output:

Hide Details

runCmd: settings set plugin.process.gdb-remote.packet-timeout 60 output:

Hide Details

runCmd: settings set symbols.clang-modules-cache-path "/Users/buildslave/jenkins/workspace/lldb-cmake/lldb-build/lldb-test-build.noindex/module-cache-lldb/lldb-api" output:

Hide Details

runCmd: settings set use-color false output:

Hide Details

runCmd: setting set target.prefer-dynamic-value no-dynamic-values output:

Hide Details

runCmd: log enable gdb-remote packets -f /Users/buildslave/jenkins/workspace/lldb-cmake/lldb-build/lldb-test-build.noindex/macosx/simulator/TestSimulatorPlatform.test_lc_version_min_iphoneos/packets.log output:

Hide Details

Ran command: "log enable gdb-remote packets -f /Users/buildslave/jenkins/workspace/lldb-cmake/lldb-build/lldb-test-build.noindex/macosx/simulator/TestSimulatorPlatform.test_lc_version_min_iphoneos/packets.log"

Hide Details

Got output:

Hide Details

Hide Details

runCmd: image list -b -t output: [ 0] a.out x86_64-apple-ios11.0.0-simulator [ 1] dyld x86_64-apple-macosx10.15.0 [ 2] dyld_sim x86_64-apple-ios13.5.0-simulator [ 3] libc++.1.dylib x86_64-apple-ios13.5.0-simulator [ 4] libSystem.B.dylib x86_64-apple-ios13.5.0-simulator [ 5] libc++abi.dylib x86_64-apple-ios13.5.0-simulator [ 6] libcache.dylib x86_64-apple-ios13.5.0-simulator [ 7] libcommonCrypto.dylib x86_64-apple-ios13.5.0-simulator [ 8] libcompiler_rt.dylib x86_64-apple-ios13.5.0-simulator [ 9] libcopyfile.dylib x86_64-apple-ios13.5.0-simulator [ 10] libcorecrypto.dylib x86_64-apple-ios13.5.0-simulator [ 11] libdispatch.dylib x86_64-apple-ios13.5.0-simulator [ 12] libdyld.dylib x86_64-apple-ios13.5.0-simulator [ 13] liblaunch.dylib x86_64-apple-ios13.5.0-simulator [ 14] libmacho.dylib x86_64-apple-ios13.5.0-simulator [ 15] libremovefile.dylib x86_64-apple-ios13.5.0-simulator [ 16] libsystem_asl.dylib x86_64-apple-ios13.5.0-simulator [ 17] libsystem_blocks.dylib x86_64-apple-ios13.5.0-simulator [ 18] libsystem_c.dylib x86_64-apple-ios13.5.0-simulator [ 19] libsystem_configuration.dylib x86_64-apple-ios13.5.0-simulator [ 20] libsystem_containermanager.dylib x86_64-apple-ios13.5.0-simulator [ 21] libsystem_coreservices.dylib x86_64-apple-ios13.5.0-simulator [ 22] libsystem_darwin.dylib x86_64-apple-ios13.5.0-simulator [ 23] libsystem_dnssd.dylib x86_64-apple-ios13.5.0-simulator [ 24] libsystem_featureflags.dylib x86_64-apple-ios13.5.0-simulator [ 25] libsystem_info.dylib x86_64-apple-ios13.5.0-simulator [ 26] libsystem_m.dylib x86_64-apple-ios13.5.0-simulator [ 27] libsystem_malloc.dylib x86_64-apple-ios13.5.0-simulator [ 28] libsystem_notify.dylib x86_64-apple-ios13.5.0-simulator [ 29] libsystem_sandbox.dylib x86_64-apple-ios13.5.0-simulator [ 30] libsystem_sim_kernel.dylib x86_64-apple-ios13.5.0-simulator [ 31] libsystem_sim_platform.dylib x86_64-apple-ios13.5.0-simulator [ 32] libsystem_sim_pthread.dylib x86_64-apple-ios13.5.0-simulator [ 33] libsystem_trace.dylib x86_64-apple-ios13.5.0-simulator [ 34] libunwind.dylib x86_64-apple-ios13.5.0-simulator [ 35] libxpc.dylib x86_64-apple-ios13.5.0-simulator [ 36] libsystem_sim_pthread_host.dylib x86_64-apple-ios13.5.0-simulator [ 37] libsystem_sim_platform_host.dylib x86_64-apple-ios13.5.0-simulator [ 38] libsystem_sim_kernel_host.dylib x86_64-apple-ios13.5.0-simulator [ 39] libsystem_kernel.dylib x86_64-apple-macosx10.15.0-simulator(0x00007fff51b5a000) [ 40] libobjc.A.dylib x86_64-apple-ios13.5.0-simulator [ 41] libsystem_platform.dylib x86_64-apple-macosx10.15.0-simulator(0x00007fff51bfd000) [ 42] libsystem_pthread.dylib x86_64-apple-macosx10.15.0-simulator(0x00007fff51c06000)

Hide Details

Hide Details

--

Hide Details

******************** PASS: lldb-api :: functionalities/breakpoint/dummy_target_breakpoints/TestBreakpointsWithNoTargets.py (2143 of 2153) PASS: lldb-api :: commands/expression/import-std-module/weak_ptr/TestWeakPtrFromStdModule.py (2144 of 2153) PASS: lldb-api :: lang/mixed/TestMixedLanguages.py (2145 of 2153) PASS: lldb-api :: python_api/file_handle/TestFileHandle.py (2146 of 2153) PASS: lldb-unit :: ScriptInterpreter/Python/./ScriptInterpreterPythonTests/PythonDataObjectsTest.TestPythonListValueEquality (2147 of 2153) PASS: lldb-api :: commands/expression/import_builtin_fileid/TestImportBuiltinFileID.py (2148 of 2153) PASS: lldb-unit :: Utility/./UtilityTests/ArgsTest.TestAppendArg (2149 of 2153) PASS: lldb-api :: lang/objc/direct-dispatch-step/TestObjCDirectDispatchStepping.py (2150 of 2153) PASS: lldb-api :: functionalities/data-formatter/data-formatter-python-synth/TestDataFormatterPythonSynth.py (2151 of 2153) PASS: lldb-api :: commands/expression/import-std-module/deque-dbg-info-content/TestDbgInfoContentDequeFromStdModule.py (2152 of 2153) PASS: lldb-api :: lang/cpp/namespace/TestNamespaceLookup.py (2153 of 2153) Slowest Tests: -------------------------------------------------------------------------- 600.39s: lldb-api :: macosx/simulator/TestSimulatorPlatform.py 190.08s: lldb-api :: functionalities/data-formatter/compactvectors/TestCompactVectors.py 165.92s: lldb-api :: commands/expression/import_builtin_fileid/TestImportBuiltinFileID.py 164.15s: lldb-api :: types/TestIntegerType.py 153.50s: lldb-api :: functionalities/gdb_remote_client/TestGDBRemoteClient.py 104.18s: lldb-api :: commands/register/register/intel_xtended_registers/TestMPXRegisters.py 101.88s: lldb-api :: tools/lldb-server/TestLldbGdbServer.py 81.41s: lldb-api :: assert_messages_test/TestAssertMessages.py 75.52s: lldb-api :: functionalities/tsan/multiple/TestTsanMultiple.py 70.15s: lldb-api :: lang/objc/foundation/TestObjCMethods.py 65.01s: lldb-api :: functionalities/tsan/thread_numbers/TestTsanThreadNumbers.py 58.94s: lldb-api :: lang/objc/hidden-ivars/TestHiddenIvars.py 57.06s: lldb-api :: lang/objc/orderedset/TestOrderedSet.py 54.68s: lldb-shell :: ObjectFile/ELF/PT_LOAD-overlap-PT_TLS.yaml 52.46s: lldb-api :: lang/objc/exceptions/TestObjCExceptions.py 51.41s: lldb-api :: commands/expression/persist_objc_pointeetype/TestPersistObjCPointeeType.py 51.16s: lldb-api :: lang/cpp/namespace/TestNamespaceLookup.py 51.02s: lldb-api :: lang/objc/objc-ivar-protocols/TestIvarProtocols.py 50.96s: lldb-api :: types/TestLongTypesExpr.py 49.11s: lldb-api :: lang/objc/foundation/TestFoundationDisassembly.py

Hide Details

Tests Times: -------------------------------------------------------------------------- [ Range ] :: [ Percentage ] :: [ Count ] -------------------------------------------------------------------------- [600s,650s) :: [ ] :: [ 1/2153] [550s,600s) :: [ ] :: [ 0/2153] [500s,550s) :: [ ] :: [ 0/2153] [450s,500s) :: [ ] :: [ 0/2153] [400s,450s) :: [ ] :: [ 0/2153] [350s,400s) :: [ ] :: [ 0/2153] [300s,350s) :: [ ] :: [ 0/2153] [250s,300s) :: [ ] :: [ 0/2153] [200s,250s) :: [ ] :: [ 1/2153] [150s,200s) :: [ ] :: [ 3/2153] [100s,150s) :: [ ] :: [ 2/2153] [ 50s,100s) :: [ ] :: [ 16/2153] [ 0s, 50s) :: [*************************************** ] :: [2130/2153] -------------------------------------------------------------------------- ******************** Timed Out Tests (1): lldb-api :: macosx/simulator/TestSimulatorPlatform.py

Hide Details

******************** Failed Tests (2): lldb-api :: commands/target/stop-hooks/TestStopHookScripted.py lldb-api :: functionalities/gdb_remote_client/TestGDBRemoteClient.py

Hide Details

Hide Details

Testing Time: 1995.96s Unsupported : 153 Passed : 1991 Expectedly Failed: 6 Timed Out : 1 Failed : 2 FAILED: tools/lldb/test/CMakeFiles/check-lldb-lit cd /Users/buildslave/jenkins/workspace/lldb-cmake/lldb-build/tools/lldb/test && /usr/local/Frameworks/Python.framework/Versions/3.7/bin/python3.7 /Users/buildslave/jenkins/workspace/lldb-cmake/lldb-build/./bin/llvm-lit -v --time-tests --shuffle --xunit-xml-output=/Users/buildslave/jenkins/workspace/lldb-cmake/test/results.xml -v -j 4 /Users/buildslave/jenkins/workspace/lldb-cmake/lldb-build/tools/lldb/test ninja: build stopped: subcommand failed. Command failed: Command '['/usr/bin/env', 'TERM=vt100', '/usr/local/bin/ninja', '-v', 'check-lldb']' returned non-zero exit status 1 Command: ['/usr/bin/env', 'TERM=vt100', '/usr/local/bin/ninja', '-v', 'check-lldb'] [Pipeline] } [Pipeline] // timeout [Pipeline] } [Pipeline] // stage [Pipeline] stage [Pipeline] { (Declarative: Post Actions) [Pipeline] scanForIssues [Clang (LLVM based)] Sleeping for 5 seconds due to JENKINS-32191... [Clang (LLVM based)] Parsing console log (workspace: '/Users/buildslave/jenkins/workspace/lldb-cmake') [Clang (LLVM based)] Successfully parsed console log [Clang (LLVM based)] -> found 8 issues (skipped 12 duplicates) [Clang (LLVM based)] Post processing issues on 'green-dragon-10' with source code encoding 'UTF-8' [Clang (LLVM based)] Creating SCM blamer to obtain author and commit information for affected files [Clang (LLVM based)] Creating SCM miner to obtain statistics for affected repository files [Clang (LLVM based)] Resolving file names for all issues in source directory '/Users/buildslave/jenkins/workspace/lldb-cmake' [Clang (LLVM based)] -> resolved paths in source directory (6 found, 0 not found) [Clang (LLVM based)] Resolving module names from module definitions (build.xml, pom.xml, or Manifest.mf files) [Clang (LLVM based)] -> resolved module names for 8 issues [Clang (LLVM based)] Resolving package names (or namespaces) by parsing the affected files [Clang (LLVM based)] -> resolved package names of 6 affected files [Clang (LLVM based)] No filter has been set, publishing all 8 issues [Clang (LLVM based)] Creating fingerprints for all affected code blocks to track issues over different builds [Clang (LLVM based)] -> created fingerprints for 8 issues (skipped 0 issues) [Clang (LLVM based)] Copying affected files to Jenkins' build folder '/Users/Shared/Jenkins/Home/jobs/lldb-cmake/builds/23986/files-with-issues' [Clang (LLVM based)] -> 4 copied, 2 not in workspace, 0 not-found, 0 with I/O error [Pipeline] junit Recording test results [Pipeline] } [Pipeline] // stage [Pipeline] } [Pipeline] // withEnv [Pipeline] } [Pipeline] // node [Pipeline] End of Pipeline ERROR: script returned exit code 1 Finished: FAILURE