FailedConsole Output

Skipping 8,192 KB.. Full Log
 :: Expression/./ExpressionTests/DWARFExpression.DW_OP_stack_value (665 of 2153)
PASS: lldb-api :: tools/lldb-server/TestGdbRemoteSingleStep.py (666 of 2153)
PASS: lldb-unit :: Host/./HostTests/FileActionTest.Open (667 of 2153)
PASS: lldb-unit :: Utility/./UtilityTests/DataExtractorTest.GetDouble (668 of 2153)
PASS: lldb-unit :: Utility/./UtilityTests/BinaryStreamTest.PutSLEB128SixBytes (669 of 2153)
PASS: lldb-unit :: Utility/./UtilityTests/ArchSpecTest.MergeFromMachOUnknown (670 of 2153)
PASS: lldb-shell :: Breakpoint/debug_rnglist_rlestartend.test (671 of 2153)
PASS: lldb-unit :: Utility/./UtilityTests/UriParserTest.MinimalPortPath (672 of 2153)
PASS: lldb-unit :: Utility/./UtilityTests/BinaryStreamTest.PutSLEB128One (673 of 2153)
PASS: lldb-api :: functionalities/thread/ignore_suspended/TestIgnoreSuspendedThread.py (674 of 2153)
PASS: lldb-shell :: Reproducer/TestSynchronous.test (675 of 2153)
PASS: lldb-unit :: Utility/./UtilityTests/StringExtractorTest.DecodeHexU8_Extra (676 of 2153)
PASS: lldb-unit :: Utility/./UtilityTests/ArgsTest.TestSingleArg (677 of 2153)
PASS: lldb-unit :: Expression/./ExpressionTests/ClangExpressionDeclMapTest.TestUnknownIdentifierLookup (678 of 2153)
PASS: lldb-unit :: Utility/./UtilityTests/StringListTest.InsertStringAtIndexOutOfBounds (679 of 2153)
PASS: lldb-unit :: Process/minidump/./LLDBMinidumpTests/MinidumpParserTest.MinidumpDuplicateModuleMappedSecond (680 of 2153)
PASS: lldb-api :: commands/command/script_alias/TestCommandScriptAlias.py (681 of 2153)
PASS: lldb-api :: commands/watchpoints/watchpoint_commands/TestWatchpointCommands.py (682 of 2153)
PASS: lldb-api :: lang/c/global_variables/TestGlobalVariables.py (683 of 2153)
PASS: lldb-unit :: Utility/./UtilityTests/TimeoutTest.Format (684 of 2153)
PASS: lldb-unit :: Host/./HostTests/FileSystemTest.FileAndDirectoryComponents (685 of 2153)
PASS: lldb-shell :: ObjectFile/Breakpad/sections-trailing-func.test (686 of 2153)
PASS: lldb-unit :: Utility/./UtilityTests/ProcessInstanceInfo.Yaml (687 of 2153)
UNSUPPORTED: lldb-api :: functionalities/data-formatter/data-formatter-stl/libstdcpp/unique_ptr/TestDataFormatterStdUniquePtr.py (688 of 2153)
PASS: lldb-api :: lang/cpp/inlines/TestInlines.py (689 of 2153)
UNSUPPORTED: lldb-shell :: Register/x86-64-xmm16-write.test (690 of 2153)
UNSUPPORTED: lldb-api :: functionalities/breakpoint/hardware_breakpoints/hardware_breakpoint_on_multiple_threads/TestHWBreakMultiThread.py (691 of 2153)
PASS: lldb-api :: commands/apropos/basic/TestApropos.py (692 of 2153)
PASS: lldb-api :: commands/expression/expr-in-syscall/TestExpressionInSyscall.py (693 of 2153)
PASS: lldb-api :: functionalities/thread/concurrent_events/TestConcurrentDelaySignalBreak.py (694 of 2153)
PASS: lldb-unit :: Utility/./UtilityTests/NameMatchesTest.Ignore (695 of 2153)
PASS: lldb-unit :: Language/Highlighting/./HighlighterTests/HighlighterTest.ClangCursorPosBeforeOtherToken (696 of 2153)
PASS: lldb-unit :: Interpreter/./InterpreterTests/CompletionTest.DirCompletionUsername (697 of 2153)
PASS: lldb-unit :: Host/./HostTests/File.GetWaitableHandleFileno (698 of 2153)
PASS: lldb-shell :: SymbolFile/DWARF/debug-types-signature-loop.s (699 of 2153)
PASS: lldb-api :: commands/expression/radar_8638051/Test8638051.py (700 of 2153)
PASS: lldb-unit :: Utility/./UtilityTests/ScalarTest.SetValueFromCString (701 of 2153)
PASS: lldb-unit :: Utility/./UtilityTests/StringExtractorTest.GetHexU8_Underflow2_NoEof (702 of 2153)
PASS: lldb-api :: commands/expression/import-std-module/shared_ptr-dbg-info-content/TestSharedPtrDbgInfoContentFromStdModule.py (703 of 2153)
PASS: lldb-api :: python_api/findvalue_duplist/TestSBFrameFindValue.py (704 of 2153)
PASS: lldb-api :: lang/objc/orderedset/TestOrderedSet.py (705 of 2153)
PASS: lldb-api :: functionalities/plugins/python_os_plugin/TestPythonOSPlugin.py (706 of 2153)
PASS: lldb-unit :: DataFormatter/./LLDBFormatterTests/StringPrinterTests.SwiftUTF8 (707 of 2153)
PASS: lldb-unit :: Utility/./UtilityTests/StringListTest.AppendStringStdString (708 of 2153)
PASS: lldb-api :: lang/c/strings/TestCStrings.py (709 of 2153)
PASS: lldb-unit :: Symbol/./SymbolTests/TestTypeSystemClang.TestIsClangType (710 of 2153)
PASS: lldb-unit :: ScriptInterpreter/Python/./ScriptInterpreterPythonTests/PythonDataObjectsTest.TestCallable (711 of 2153)
PASS: lldb-unit :: Utility/./UtilityTests/OptionsWithRawTest.SingleWordSuffix (712 of 2153)
PASS: lldb-api :: lang/cpp/this/TestCPPThis.py (713 of 2153)
PASS: lldb-unit :: Utility/./UtilityTests/UserIDResolver.GetGroupName (714 of 2153)
PASS: lldb-unit :: SymbolFile/NativePDB/./SymbolFileNativePDBTests/PDBFPOProgramToDWARFExpressionTests.DependencyChain (715 of 2153)
PASS: lldb-api :: commands/help/TestHelp.py (716 of 2153)
PASS: lldb-unit :: ScriptInterpreter/Python/./ScriptInterpreterPythonTests/PythonDataObjectsTest.TestPythonCallableCheck (717 of 2153)
UNSUPPORTED: lldb-api :: tools/lldb-server/signal-filtering/TestGdbRemote_QPassSignals.py (718 of 2153)
PASS: lldb-shell :: SymbolFile/DWARF/dwp-debug-types.s (719 of 2153)
PASS: lldb-api :: tools/lldb-vscode/console/TestVSCode_console.py (720 of 2153)
UNSUPPORTED: lldb-api :: benchmarks/expression/TestExpressionCmd.py (721 of 2153)
PASS: lldb-api :: lang/objc/hidden-ivars/TestHiddenIvars.py (722 of 2153)
PASS: lldb-api :: functionalities/gdb_remote_client/TestQemuAArch64TargetXml.py (723 of 2153)
PASS: lldb-unit :: Utility/./UtilityTests/RangeTest.ContainsRange (724 of 2153)
PASS: lldb-shell :: Quit/TestQuitExitCode-30.test (725 of 2153)
PASS: lldb-unit :: Signals/./SignalsTests/UnixSignalsTest.GetInfo (726 of 2153)
PASS: lldb-api :: commands/expression/import-std-module/sysroot/TestStdModuleSysroot.py (727 of 2153)
PASS: lldb-api :: types/TestDoubleTypesExpr.py (728 of 2153)
PASS: lldb-shell :: Reproducer/TestGDBRemoteRepro.test (729 of 2153)
PASS: lldb-api :: python_api/target/TestTargetAPI.py (730 of 2153)
PASS: lldb-api :: python_api/watchpoint/TestWatchpointIter.py (731 of 2153)
PASS: lldb-api :: python_api/frame/inlines/TestInlinedFrame.py (732 of 2153)
PASS: lldb-shell :: Reproducer/Functionalities/TestDataFormatter.test (733 of 2153)
PASS: lldb-unit :: Process/minidump/./LLDBMinidumpTests/MinidumpParserTest.GetExceptionStream (734 of 2153)
UNSUPPORTED: lldb-api :: functionalities/darwin_log/source/debug/TestDarwinLogSourceDebug.py (735 of 2153)
PASS: lldb-shell :: ObjectFile/PECOFF/basic-info-arm64.yaml (736 of 2153)
PASS: lldb-unit :: Utility/./UtilityTests/ScalarTest.ExtractBitfield (737 of 2153)
PASS: lldb-shell :: Reproducer/TestDiscard.test (738 of 2153)
UNSUPPORTED: lldb-shell :: SymbolFile/PDB/variables.test (739 of 2153)
PASS: lldb-unit :: SymbolFile/DWARF/./SymbolFileDWARFTests/DWARFASTParserClangTests.EnsureAllDIEsInDeclContextHaveBeenParsedParsesOnlyMatchingEntries (740 of 2153)
UNSUPPORTED: lldb-api :: benchmarks/startup/TestStartupDelays.py (741 of 2153)
PASS: lldb-api :: lang/c/record_decl_in_expr/TestRecordDeclInExpr.py (742 of 2153)
PASS: lldb-api :: commands/expression/call-function/TestCallBuiltinFunction.py (743 of 2153)
UNSUPPORTED: lldb-shell :: Register/arm-gp-read.test (744 of 2153)
PASS: lldb-unit :: Process/gdb-remote/./ProcessGdbRemoteTests/GDBRemoteCommunicationClientTest.WriteRegisterNoSuffix (745 of 2153)
PASS: lldb-unit :: UnwindAssembly/x86/./UnwindAssemblyx86Tests/Testx86AssemblyInspectionEngine.TestPushExtended (746 of 2153)
PASS: lldb-shell :: Breakpoint/case-sensitive.test (747 of 2153)
PASS: lldb-unit :: Utility/./UtilityTests/VMRange.Ordering (748 of 2153)
PASS: lldb-api :: lang/cpp/namespace_conflicts/TestNamespaceConflicts.py (749 of 2153)
PASS: lldb-shell :: Settings/TestStopCommandSourceOnError.test (750 of 2153)
PASS: lldb-unit :: Utility/./UtilityTests/StreamTest.PutRawBytesToLittleEndian (751 of 2153)
PASS: lldb-unit :: Utility/./UtilityTests/StreamTest.AddressRangeInvalidRange (752 of 2153)
PASS: lldb-unit :: Utility/./UtilityTests/StreamTest.PutSLEB128 (753 of 2153)
UNSUPPORTED: lldb-api :: benchmarks/expression/TestRepeatedExprs.py (754 of 2153)
PASS: lldb-api :: macosx/thread-names/TestInterruptThreadNames.py (755 of 2153)
PASS: lldb-unit :: UnwindAssembly/ARM64/./Arm64InstEmulationTests/TestArm64InstEmulation.TestFramelessThreeEpilogueFunction (756 of 2153)
PASS: lldb-unit :: Symbol/./SymbolTests/PostfixExpression.ToDWARF (757 of 2153)
PASS: lldb-unit :: Utility/./UtilityTests/VMRange.Comparison (758 of 2153)
PASS: lldb-unit :: Utility/./UtilityTests/ScalarTest.GetValue (759 of 2153)
PASS: lldb-unit :: Expression/./ExpressionTests/ClangExpressionDeclMapTest.TestPersistentDeclLookup (760 of 2153)
PASS: lldb-unit :: Utility/./UtilityTests/StreamTest.PutRawBytesToMixedEndian (761 of 2153)
PASS: lldb-api :: lang/cpp/bitfields/TestCppBitfields.py (762 of 2153)
PASS: lldb-shell :: Commands/command-disassemble.s (763 of 2153)
UNSUPPORTED: lldb-shell :: SymbolFile/PDB/variables-locations.test (764 of 2153)
PASS: lldb-unit :: Process/gdb-remote/./ProcessGdbRemoteTests/GDBRemoteCommunicationClientTest.SendGetDataPacket (765 of 2153)
PASS: lldb-unit :: Host/./HostTests/FileSystemTest.Exists (766 of 2153)
PASS: lldb-shell :: SymbolFile/DWARF/debug-types-basic.test (767 of 2153)
UNSUPPORTED: lldb-shell :: SymbolFile/PDB/func-symbols.test (768 of 2153)
PASS: lldb-unit :: Utility/./UtilityTests/RangeTest.Copy (769 of 2153)
PASS: lldb-unit :: Utility/./UtilityTests/VASprintfTest.BufferResize (770 of 2153)
PASS: lldb-api :: lang/cpp/nsimport/TestCppNsImport.py (771 of 2153)
PASS: lldb-unit :: Expression/./ExpressionTests/DiagnosticManagerTest.PutStringSeverities (772 of 2153)
PASS: lldb-unit :: Process/minidump/./LLDBMinidumpTests/MinidumpParserTest.GetMemoryRegionInfo (773 of 2153)
PASS: lldb-unit :: Utility/./UtilityTests/BroadcasterTest.BroadcastEvent (774 of 2153)
PASS: lldb-api :: functionalities/breakpoint/breakpoint_by_line_and_column/TestBreakpointByLineAndColumn.py (775 of 2153)
PASS: lldb-api :: commands/settings/TestSettings.py (776 of 2153)
UNSUPPORTED: lldb-api :: lang/cpp/function-template-parameter-pack/TestFunctionTemplateParameterPack.py (777 of 2153)
PASS: lldb-api :: commands/expression/test/TestExprs2.py (778 of 2153)
PASS: lldb-unit :: Process/minidump/./LLDBMinidumpTests/MinidumpParserTest.GetMemoryRegionInfoLinuxMaps (779 of 2153)
PASS: lldb-unit :: Expression/./ExpressionTests/CppModuleConfigurationTest.AmbiguousLibCpp (780 of 2153)
PASS: lldb-api :: functionalities/thread/concurrent_events/TestConcurrentTwoBreakpointThreads.py (781 of 2153)
PASS: lldb-unit :: Process/gdb-remote/./ProcessGdbRemoteTests/GDBRemoteCommunicationServerTest.SendErrorResponse_UnimplementedError (782 of 2153)
PASS: lldb-api :: lang/cpp/template-function/TestTemplateFunctions.py (783 of 2153)
PASS: lldb-unit :: Process/minidump/./LLDBMinidumpTests/MinidumpParserTest.MinidumpDuplicateModuleSeparateCode (784 of 2153)
PASS: lldb-unit :: Utility/./UtilityTests/StreamTest.AddressPrefixAndSuffix (785 of 2153)
PASS: lldb-unit :: ScriptInterpreter/Python/./ScriptInterpreterPythonTests/PythonDataObjectsTest.TestExtractingUInt64ThroughStructuredData (786 of 2153)
PASS: lldb-unit :: Utility/./UtilityTests/ArgsTest.TestAppendArg (787 of 2153)
PASS: lldb-api :: commands/source/info/TestSourceInfo.py (788 of 2153)
PASS: lldb-api :: functionalities/stats_api/TestStatisticsAPI.py (789 of 2153)
PASS: lldb-unit :: Target/./TargetTests/MemoryRegionInfoTest.Formatv (790 of 2153)
UNSUPPORTED: lldb-api :: commands/register/register/intel_xtended_registers/mpx_offset_intersection/TestMPXOffsetIntersection.py (791 of 2153)
PASS: lldb-api :: functionalities/value_md5_crash/TestValueMD5Crash.py (792 of 2153)
PASS: lldb-api :: commands/expression/dont_allow_jit/TestAllowJIT.py (793 of 2153)
PASS: lldb-api :: functionalities/data-formatter/frameformat_smallstruct/TestFrameFormatSmallStruct.py (794 of 2153)
PASS: lldb-api :: functionalities/data-formatter/type_summary_list_arg/TestTypeSummaryListArg.py (795 of 2153)
PASS: lldb-unit :: Expression/./ExpressionTests/CppModuleConfigurationTest.UnknownLibCppFile (796 of 2153)
PASS: lldb-unit :: Process/gdb-remote/./ProcessGdbRemoteTests/GDBRemoteClientBaseTest.SendContinueAndLateInterrupt (797 of 2153)
PASS: lldb-api :: lang/c/complex/TestComplexC99.py (798 of 2153)
PASS: lldb-unit :: Target/./TargetTests/PathMappingListTest.RelativeTests (799 of 2153)
PASS: lldb-unit :: Symbol/./SymbolTests/LineEntryTest.GetSameLineContiguousAddressRangeNoInlines (800 of 2153)
PASS: lldb-unit :: Utility/./UtilityTests/FileSpecTest.GetPath (801 of 2153)
PASS: lldb-shell :: SymbolFile/DWARF/find-basic-namespace.cpp (802 of 2153)
PASS: lldb-api :: commands/expression/weak_symbols/TestWeakSymbols.py (803 of 2153)
PASS: lldb-unit :: Utility/./UtilityTests/ScalarTest.Comparison (804 of 2153)
PASS: lldb-unit :: Utility/./UtilityTests/CompletionRequest.TryCompleteCurrentArgGood (805 of 2153)
PASS: lldb-unit :: Symbol/./SymbolTests/TestClangASTImporter.DeportTypeTagDecl (806 of 2153)
PASS: lldb-api :: functionalities/gdb_remote_client/TestqOffsets.py (807 of 2153)
PASS: lldb-api :: lang/cpp/lambdas/TestLambdas.py (808 of 2153)
PASS: lldb-api :: commands/expression/import-std-module/list-dbg-info-content/TestDbgInfoContentListFromStdModule.py (809 of 2153)
PASS: lldb-api :: commands/expression/test/TestExprs.py (810 of 2153)
PASS: lldb-api :: functionalities/data-formatter/data-formatter-stl/libcxx/vector/TestDataFormatterLibcxxVector.py (811 of 2153)
PASS: lldb-unit :: Core/./LLDBCoreTests/SourceFileCache.FindSourceFileFound (812 of 2153)
PASS: lldb-unit :: ScriptInterpreter/Python/./ScriptInterpreterPythonTests/PythonDataObjectsTest.TestPythonTupleToStructuredList (813 of 2153)
PASS: lldb-unit :: Utility/./UtilityTests/TimerTest.CategoryTimes (814 of 2153)
PASS: lldb-shell :: SymbolFile/Breakpad/unwind-via-stack-win.test (815 of 2153)
PASS: lldb-api :: functionalities/data-formatter/language_category_updates/TestDataFormatterLanguageCategoryUpdates.py (816 of 2153)
UNSUPPORTED: lldb-api :: lang/cpp/printf/TestPrintf.py (817 of 2153)
PASS: lldb-unit :: Utility/./UtilityTests/VMRange.CollectionContains (818 of 2153)
PASS: lldb-api :: functionalities/source-map/TestTargetSourceMap.py (819 of 2153)
PASS: lldb-unit :: SymbolFile/DWARF/./SymbolFileDWARFTests/SymbolFileDWARFTests.TestAbbrevOutOfOrder (820 of 2153)
UNSUPPORTED: lldb-api :: functionalities/data-formatter/data-formatter-stl/libstdcpp/list/TestDataFormatterStdList.py (821 of 2153)
PASS: lldb-unit :: Utility/./UtilityTests/TimerTest.CategoryTimesStats (822 of 2153)
PASS: lldb-unit :: Host/./HostTests/SocketTest.TCPGetAddress (823 of 2153)
PASS: lldb-shell :: SymbolFile/DWARF/apple-index-is-used.cpp (824 of 2153)
PASS: lldb-api :: functionalities/data-formatter/data-formatter-advanced/TestDataFormatterAdv.py (825 of 2153)
PASS: lldb-unit :: Utility/./UtilityTests/StringListTest.GetMaxStringLengthIncreasingSize (826 of 2153)
PASS: lldb-api :: terminal/TestEditline.py (827 of 2153)
PASS: lldb-unit :: Utility/./UtilityTests/FileSpecTest.Yaml (828 of 2153)
PASS: lldb-shell :: Reproducer/TestDump.test (829 of 2153)
PASS: lldb-unit :: Utility/./UtilityTests/StringExtractorTest.GetU32LittleEndian (830 of 2153)
PASS: lldb-unit :: Expression/./ExpressionTests/CppModuleConfigurationTest.LinuxLocalLibCpp (831 of 2153)
PASS: lldb-api :: functionalities/data-formatter/data-formatter-named-summaries/TestDataFormatterNamedSummaries.py (832 of 2153)
PASS: lldb-api :: functionalities/process_crash_info/TestProcessCrashInfo.py (833 of 2153)
PASS: lldb-unit :: UnwindAssembly/x86/./UnwindAssemblyx86Tests/Testx86AssemblyInspectionEngine.TestDisassemblyMidFunctionEpilogues (834 of 2153)
PASS: lldb-api :: commands/expression/rdar42038760/TestScalarURem.py (835 of 2153)
PASS: lldb-unit :: Utility/./UtilityTests/LogChannelEnabledTest.LLDB_LOG_ERROR (836 of 2153)
PASS: lldb-api :: lang/objc/objc-new-syntax/TestObjCNewSyntaxDictionary.py (837 of 2153)
PASS: lldb-api :: functionalities/memory/cache/TestMemoryCache.py (838 of 2153)
PASS: lldb-shell :: SymbolFile/DWARF/debug_rnglists-dwo.s (839 of 2153)
PASS: lldb-shell :: SymbolFile/DWARF/DW_TAG_basic_type_DW_ATE_UTF_nonC.ll (840 of 2153)
PASS: lldb-shell :: Settings/TestFrameFormatColor.test (841 of 2153)
PASS: lldb-api :: commands/expression/invalid-args/TestInvalidArgsExpression.py (842 of 2153)
PASS: lldb-unit :: Utility/./UtilityTests/TildeExpressionResolver.ResolveFullPath (843 of 2153)
PASS: lldb-unit :: Breakpoint/./LLDBBreakpointTests/BreakpointIDTest.StringIsBreakpointName (844 of 2153)
PASS: lldb-api :: macosx/nslog/TestDarwinNSLogOutput.py (845 of 2153)
PASS: lldb-unit :: Utility/./UtilityTests/StringListTest.AppendList (846 of 2153)
PASS: lldb-shell :: SymbolFile/Breakpad/line-table-missing-file.test (847 of 2153)
PASS: lldb-api :: functionalities/data-formatter/data-formatter-stl/libcxx/iterator/TestDataFormatterLibccIterator.py (848 of 2153)
PASS: lldb-unit :: Utility/./UtilityTests/StringExtractorTest.GetHexU8_Exact_NoEof (849 of 2153)
PASS: lldb-unit :: ScriptInterpreter/Python/./ScriptInterpreterPythonTests/PythonDataObjectsTest.TestBorrowedReferences (850 of 2153)
UNSUPPORTED: lldb-shell :: SymbolFile/NativePDB/typedefs.cpp (851 of 2153)
PASS: lldb-unit :: Target/./TargetTests/ExecutionContextTest.GetByteOrder (852 of 2153)
PASS: lldb-unit :: Process/minidump/./LLDBMinidumpTests/MinidumpParserTest.FindMemoryRangeWithFullMemoryMinidump (853 of 2153)
PASS: lldb-unit :: Process/gdb-remote/./ProcessGdbRemoteTests/GDBRemoteCommunicationServerTest.SendErrorResponse_ErrorNumber (854 of 2153)
PASS: lldb-unit :: Utility/./UtilityTests/BinaryStreamTest.PutULEB128Zero (855 of 2153)
PASS: lldb-unit :: Host/./HostTests/NativeProcessProtocolTest.ReadMemoryWithoutTrap (856 of 2153)
PASS: lldb-shell :: SymbolFile/DWARF/childless-compile-unit.s (857 of 2153)
PASS: lldb-unit :: Core/./LLDBCoreTests/MangledTest.NameIndexes_FindFunctionSymbols (858 of 2153)
PASS: lldb-api :: lang/cpp/signed_types/TestSignedTypes.py (859 of 2153)
PASS: lldb-unit :: Utility/./UtilityTests/RangeTest.ContainsEndInclusiveInvalid (860 of 2153)
PASS: lldb-api :: commands/process/attach-resume/TestAttachResume.py (861 of 2153)
PASS: lldb-unit :: SymbolFile/NativePDB/./SymbolFileNativePDBTests/PDBFPOProgramToDWARFExpressionTests.InvalidAssignmentSingle (862 of 2153)
PASS: lldb-shell :: SymbolFile/DWARF/find-variable-dwo.cpp (863 of 2153)
UNSUPPORTED: lldb-api :: functionalities/thread/concurrent_events/TestConcurrentManySignals.py (864 of 2153)
PASS: lldb-unit :: Utility/./UtilityTests/ArgsTest.StringListConstructor (865 of 2153)
PASS: lldb-api :: tools/lldb-vscode/variables/TestVSCode_variables.py (866 of 2153)
PASS: lldb-shell :: SymbolFile/Breakpad/line-table-discontinuous-file-ids.test (867 of 2153)
PASS: lldb-api :: lang/cpp/rvalue-references/TestRvalueReferences.py (868 of 2153)
PASS: lldb-shell :: Reproducer/TestCrash.test (869 of 2153)
PASS: lldb-api :: lang/c/inlines/TestRedefinitionsInInlines.py (870 of 2153)
PASS: lldb-api :: commands/frame/diagnose/dereference-this/TestDiagnoseDereferenceThis.py (871 of 2153)
PASS: lldb-shell :: SymbolFile/DWARF/debug-types-address-ranges.s (872 of 2153)
PASS: lldb-unit :: Utility/./UtilityTests/OptionsWithRawTest.MultiWordSuffix (873 of 2153)
PASS: lldb-shell :: Driver/TestCommands.test (874 of 2153)
PASS: lldb-unit :: Symbol/./SymbolTests/TestTypeSystemClang.TemplateArguments (875 of 2153)
UNSUPPORTED: lldb-api :: commands/trace/TestTraceLoad.py (876 of 2153)
UNSUPPORTED: lldb-api :: linux/sepdebugsymlink/TestTargetSymbolsSepDebugSymlink.py (877 of 2153)
PASS: lldb-api :: functionalities/thread/concurrent_events/TestConcurrentWatchBreakDelay.py (878 of 2153)
PASS: lldb-unit :: Language/Highlighting/./HighlighterTests/HighlighterTest.ClangCommas (879 of 2153)
PASS: lldb-api :: functionalities/breakpoint/address_breakpoints/TestAddressBreakpoints.py (880 of 2153)
PASS: lldb-unit :: Platform/Android/./AdbClientTests/AdbClientTest.CreateByDeviceId (881 of 2153)
PASS: lldb-api :: functionalities/data-formatter/data-formatter-objc/TestDataFormatterObjCKVO.py (882 of 2153)
UNSUPPORTED: lldb-api :: linux/add-symbols/TestTargetSymbolsAddCommand.py (883 of 2153)
PASS: lldb-unit :: Utility/./UtilityTests/ArgsTest.EscapeLLDBCommandArgument (884 of 2153)
PASS: lldb-api :: functionalities/data-formatter/data-formatter-stl/libcxx/multiset/TestDataFormatterLibcxxMultiSet.py (885 of 2153)
PASS: lldb-unit :: Utility/./UtilityTests/ArgsTest.GetArgumentArrayRef (886 of 2153)
PASS: lldb-api :: functionalities/target_var/TestTargetVar.py (887 of 2153)
PASS: lldb-unit :: tools/lldb-server/tests/./LLDBServerTests/TestBase.LaunchModePreservesEnvironment (888 of 2153)
PASS: lldb-unit :: ObjectFile/ELF/./ObjectFileELFTests/ObjectFileELFTest.GetModuleSpecifications_EarlySectionHeaders (889 of 2153)
UNSUPPORTED: lldb-api :: functionalities/data-formatter/data-formatter-stl/libstdcpp/tuple/TestDataFormatterStdTuple.py (890 of 2153)
PASS: lldb-api :: functionalities/thread/exit_during_step/TestExitDuringStep.py (891 of 2153)
PASS: lldb-unit :: Utility/./UtilityTests/EnvironmentTest.EnvpConversion (892 of 2153)
PASS: lldb-unit :: Utility/./UtilityTests/StructuredDataTest.ParseJSONFromFile (893 of 2153)
PASS: lldb-api :: commands/expression/persistent_types/TestNestedPersistentTypes.py (894 of 2153)
PASS: lldb-unit :: Language/Highlighting/./HighlighterTests/HighlighterTest.DefaultHighlighterWithCursorOutOfBounds (895 of 2153)
PASS: lldb-unit :: Utility/./UtilityTests/StringListTest.CopyListSingle (896 of 2153)
PASS: lldb-api :: functionalities/thread/concurrent_events/TestConcurrentTwoBreakpointsOneDelaySignal.py (897 of 2153)
PASS: lldb-shell :: SymbolFile/DWARF/anon_class_w_and_wo_export_symbols.ll (898 of 2153)
PASS: lldb-unit :: Utility/./UtilityTests/ArchSpecTest.TripleComponentsWereSpecified (899 of 2153)
PASS: lldb-api :: python_api/lldbutil/iter/TestLLDBIterator.py (900 of 2153)
PASS: lldb-unit :: Process/minidump/./LLDBMinidumpTests/MinidumpParserTest.GetLinuxProcStatus_no_stream (901 of 2153)
PASS: lldb-unit :: Utility/./UtilityTests/BinaryStreamTest.PutULEB128SevenBytes (902 of 2153)
PASS: lldb-api :: commands/expression/deleting-implicit-copy-constructor/TestDeletingImplicitCopyConstructor.py (903 of 2153)
PASS: lldb-api :: functionalities/signal/handle-abrt/TestHandleAbort.py (904 of 2153)
PASS: lldb-api :: commands/platform/basic/TestPlatformPython.py (905 of 2153)
PASS: lldb-unit :: Utility/./UtilityTests/DataExtractorTest.UncommonAddressSize (906 of 2153)
PASS: lldb-api :: functionalities/breakpoint/dummy_target_breakpoints/TestBreakpointsWithNoTargets.py (907 of 2153)
PASS: lldb-api :: functionalities/completion/TestCompletion.py (908 of 2153)
PASS: lldb-api :: commands/watchpoints/hello_watchpoint/TestMyFirstWatchpoint.py (909 of 2153)
PASS: lldb-shell :: ObjectFile/PECOFF/sections.yaml (910 of 2153)
PASS: lldb-unit :: Language/Highlighting/./HighlighterTests/HighlighterTest.DefaultHighlighter (911 of 2153)
PASS: lldb-unit :: UnwindAssembly/x86/./UnwindAssemblyx86Tests/Testx86AssemblyInspectionEngine.TestSpillRegToStackViaMOVi386 (912 of 2153)
PASS: lldb-unit :: Process/minidump/./LLDBMinidumpTests/RegisterContextMinidump.ConvertMinidumpContext_x86_64 (913 of 2153)
PASS: lldb-unit :: ScriptInterpreter/Python/./ScriptInterpreterPythonTests/PythonDataObjectsTest.TestPythonString (914 of 2153)
PASS: lldb-shell :: ObjectFile/ELF/gnu-debuglink.yaml (915 of 2153)
PASS: lldb-shell :: SymbolFile/DWARF/debug_ranges-missing-section.s (916 of 2153)
PASS: lldb-unit :: Utility/./UtilityTests/StringExtractorTest.DecodeHexU8_Underflow2 (917 of 2153)
UNSUPPORTED: lldb-api :: functionalities/longjmp/TestLongjmp.py (918 of 2153)
PASS: lldb-api :: commands/expression/import-std-module/stack/TestStackFromStdModule.py (919 of 2153)
PASS: lldb-unit :: Utility/./UtilityTests/ListenerTest.GetEventWait (920 of 2153)
PASS: lldb-unit :: Utility/./UtilityTests/StreamTest.PutBytesAsRawHex8ToLittleEndian (921 of 2153)
PASS: lldb-unit :: debugserver/./debugserverTests/RNBSocket.LoopBackConnectIPv6 (922 of 2153)
PASS: lldb-api :: lang/cpp/virtual-overload/TestVirtualOverload.py (923 of 2153)
PASS: lldb-api :: python_api/sblaunchinfo/TestSBLaunchInfo.py (924 of 2153)
PASS: lldb-unit :: ScriptInterpreter/Python/./ScriptInterpreterPythonTests/PythonDataObjectsTest.TestPythonCallableInvoke (925 of 2153)
PASS: lldb-api :: functionalities/data-formatter/data-formatter-stl/libstdcpp/unique_ptr/invalid/TestDataFormatterInvalidStdUniquePtr.py (926 of 2153)
UNSUPPORTED: lldb-api :: benchmarks/turnaround/TestCompileRunToBreakpointTurnaround.py (927 of 2153)
PASS: lldb-unit :: Utility/./UtilityTests/DataExtractorTest.GetCStr (928 of 2153)
PASS: lldb-unit :: Utility/./UtilityTests/RangeDataVector.FindEntryIndexesThatContain (929 of 2153)
PASS: lldb-unit :: Utility/./UtilityTests/ProcessInfoTest.Constructor (930 of 2153)
PASS: lldb-unit :: Utility/./UtilityTests/StringExtractorTest.GetHexBytes (931 of 2153)
PASS: lldb-api :: commands/expression/vector_of_enums/TestVectorOfEnums.py (932 of 2153)
PASS: lldb-api :: functionalities/data-formatter/data-formatter-disabling/TestDataFormatterDisabling.py (933 of 2153)
PASS: lldb-api :: functionalities/history/TestHistoryRecall.py (934 of 2153)
PASS: lldb-unit :: Utility/./UtilityTests/AnsiTerminal.KnownPrefix (935 of 2153)
PASS: lldb-api :: python_api/value/TestValueAPI.py (936 of 2153)
PASS: lldb-shell :: SymbolFile/NativePDB/tag-types.cpp (937 of 2153)
PASS: lldb-shell :: Minidump/breakpad-symbols.test (938 of 2153)
PASS: lldb-api :: lang/c/tls_globals/TestTlsGlobals.py (939 of 2153)
PASS: lldb-unit :: UnwindAssembly/x86/./UnwindAssemblyx86Tests/Testx86AssemblyInspectionEngine.TestCALLNextInsn (940 of 2153)
PASS: lldb-api :: functionalities/load_unload/TestLoadUnload.py (941 of 2153)
PASS: lldb-unit :: Process/gdb-remote/./ProcessGdbRemoteTests/GDBRemoteCommunicationClientTest.WriteRegister (942 of 2153)
PASS: lldb-unit :: Utility/./UtilityTests/UUIDTest.RelationalOperators (943 of 2153)
PASS: lldb-unit :: Utility/./UtilityTests/XcodeSDKTest.SDKSupportsModules (944 of 2153)
PASS: lldb-api :: lang/objc/objc-struct-argument/TestObjCStructArgument.py (945 of 2153)
PASS: lldb-unit :: UnwindAssembly/x86/./UnwindAssemblyx86Tests/Testx86AssemblyInspectionEngine.TestStackRealign32BitDisp_x86_64 (946 of 2153)
PASS: lldb-api :: commands/gui/breakpoints/TestGuiBreakpoints.py (947 of 2153)
PASS: lldb-unit :: Utility/./UtilityTests/ArgsTest.BareSingleQuote (948 of 2153)
PASS: lldb-unit :: SymbolFile/NativePDB/./SymbolFileNativePDBTests/PDBFPOProgramToDWARFExpressionTests.MultipleIndependentAssignments (949 of 2153)
PASS: lldb-shell :: Driver/TestPositionalArgs.test (950 of 2153)
PASS: lldb-unit :: Utility/./UtilityTests/StringListTest.DefaultConstructor (951 of 2153)
PASS: lldb-shell :: ObjectFile/PECOFF/symbol.yaml (952 of 2153)
UNSUPPORTED: lldb-shell :: Register/x86-64-zmm-write.test (953 of 2153)
PASS: lldb-unit :: Symbol/./SymbolTests/TestTypeSystemClang.TestFunctionTemplateConstruction (954 of 2153)
PASS: lldb-api :: commands/expression/call-function/TestCallStdStringFunction.py (955 of 2153)
PASS: lldb-unit :: Expression/./ExpressionTests/DWARFExpression.DW_OP_pick (956 of 2153)
PASS: lldb-api :: commands/frame/diagnose/complicated-expression/TestComplicatedExpression.py (957 of 2153)
PASS: lldb-unit :: Utility/./UtilityTests/RangeTest.SetRangeBase (958 of 2153)
PASS: lldb-unit :: Process/minidump/./LLDBMinidumpTests/MinidumpParserTest.GetMiscInfoWindows (959 of 2153)
PASS: lldb-api :: functionalities/data-formatter/data-formatter-stl/libcxx/forward_list/TestDataFormatterLibcxxForwardList.py (960 of 2153)
PASS: lldb-unit :: Utility/./UtilityTests/RangeTest.ContainsAddr (961 of 2153)
PASS: lldb-unit :: Utility/./UtilityTests/Flags.Test (962 of 2153)
PASS: lldb-unit :: UnwindAssembly/ARM64/./Arm64InstEmulationTests/TestArm64InstEmulation.TestSimpleDarwinFunction (963 of 2153)
PASS: lldb-unit :: Process/minidump/./LLDBMinidumpTests/MinidumpParserTest.GetThreadsAndGetThreadContext (964 of 2153)
PASS: lldb-shell :: Recognizer/assert.test (965 of 2153)
PASS: lldb-unit :: Utility/./UtilityTests/StringListTest.CopyListEmpty (966 of 2153)
PASS: lldb-api :: functionalities/gdb_remote_client/TestThreadSelectionBug.py (967 of 2153)
PASS: lldb-unit :: Expression/./ExpressionTests/DiagnosticManagerTest.AddDiagnostic (968 of 2153)
PASS: lldb-api :: python_api/lldbutil/TestSwigVersion.py (969 of 2153)
PASS: lldb-unit :: Utility/./UtilityTests/NameMatchesTest.StartsWith (970 of 2153)
PASS: lldb-api :: python_api/sbtype_typeclass/TestSBTypeTypeClass.py (971 of 2153)
PASS: lldb-shell :: SymbolFile/DWARF/dir-separator-posix.s (972 of 2153)
PASS: lldb-unit :: Utility/./UtilityTests/StringListTest.CopyList (973 of 2153)
PASS: lldb-unit :: Utility/./UtilityTests/LogTest.Unregister (974 of 2153)
PASS: lldb-api :: functionalities/breakpoint/breakpoint_by_file_colon_line/TestBreakpointByFileColonLine.py (975 of 2153)
PASS: lldb-api :: macosx/thread_suspend/TestInternalThreadSuspension.py (976 of 2153)
PASS: lldb-unit :: Utility/./UtilityTests/StringLexerTest.HasAtLeast (977 of 2153)
PASS: lldb-unit :: Expression/./ExpressionTests/CppModuleConfigurationTest.MissingLibCpp (978 of 2153)
PASS: lldb-unit :: Expression/./ExpressionTests/DiagnosticManagerTest.PutStringMultiple (979 of 2153)
PASS: lldb-api :: lang/c/array_types/TestArrayTypes.py (980 of 2153)
PASS: lldb-api :: lang/objc/variadic_methods/TestVariadicMethods.py (981 of 2153)
PASS: lldb-unit :: Symbol/./SymbolTests/TestClangASTImporter.ImportInvalidType (982 of 2153)
PASS: lldb-unit :: Utility/./UtilityTests/Flags.AnyClear (983 of 2153)
XFAIL: lldb-shell :: Register/x86-mm-xmm-read.test (984 of 2153)
XFAIL: lldb-shell :: Register/x86-64-write.test (985 of 2153)
PASS: lldb-shell :: Unwind/thread-step-out-ret-addr-check.test (986 of 2153)
PASS: lldb-unit :: UnwindAssembly/ARM64/./Arm64InstEmulationTests/TestArm64InstEmulation.TestMediumDarwinFunction (987 of 2153)
PASS: lldb-unit :: Utility/./UtilityTests/Predicate.WaitForValueNotEqualTo (988 of 2153)
PASS: lldb-shell :: Driver/TestConvenienceVariables.test (989 of 2153)
PASS: lldb-api :: python_api/get-value-32bit-int/TestGetValue32BitInt.py (990 of 2153)
PASS: lldb-shell :: SymbolFile/DWARF/clang-ast-from-dwarf-objc-property.m (991 of 2153)
PASS: lldb-api :: commands/settings/use_source_cache/TestUseSourceCache.py (992 of 2153)
PASS: lldb-shell :: Commands/command-regex-delete.test (993 of 2153)
PASS: lldb-shell :: Reproducer/TestReuseDirectory.test (994 of 2153)
UNSUPPORTED: lldb-api :: commands/register/register/intel_xtended_registers/mpx_bound_violation/TestBoundViolation.py (995 of 2153)
PASS: lldb-api :: lang/cpp/namespace_definitions/TestNamespaceDefinitions.py (996 of 2153)
PASS: lldb-api :: functionalities/data-formatter/boolreference/TestFormattersBoolRefPtr.py (997 of 2153)
PASS: lldb-shell :: SymbolFile/NativePDB/break-by-function.cpp (998 of 2153)
PASS: lldb-unit :: Language/Highlighting/./HighlighterTests/HighlighterTest.ClangTrailingBackslashMissingNewLine (999 of 2153)
PASS: lldb-unit :: Process/gdb-remote/./ProcessGdbRemoteTests/GDBRemoteCommunicationClientTest.SendGetMetaDataPacket (1000 of 2153)
PASS: lldb-api :: types/TestCharType.py (1001 of 2153)
PASS: lldb-unit :: Host/./HostTests/SocketTest.DomainGetConnectURI (1002 of 2153)
PASS: lldb-unit :: Host/./HostTests/Host.WaitStatusFormat (1003 of 2153)
PASS: lldb-unit :: Utility/./UtilityTests/StringExtractorTest.GetHexBytes_Partial (1004 of 2153)
UNSUPPORTED: lldb-shell :: SymbolFile/NativePDB/local-variables.cpp (1005 of 2153)
PASS: lldb-unit :: Utility/./UtilityTests/ConstStringTest.NullAndEmptyStates (1006 of 2153)
PASS: lldb-api :: terminal/TestSTTYBeforeAndAfter.py (1007 of 2153)
PASS: lldb-unit :: Process/minidump/./LLDBMinidumpTests/MinidumpParserTest.GetThreadContext_x86_32 (1008 of 2153)
PASS: lldb-unit :: Utility/./UtilityTests/ConstStringTest.CompareStringRef (1009 of 2153)
PASS: lldb-api :: lang/objc/global_ptrs/TestGlobalObjects.py (1010 of 2153)
PASS: lldb-shell :: ObjectFile/wasm/unified-debug-sections.yaml (1011 of 2153)
PASS: lldb-unit :: Expression/./ExpressionTests/DiagnosticManagerTest.HasFixits (1012 of 2153)
PASS: lldb-unit :: ScriptInterpreter/Python/./ScriptInterpreterPythonTests/PythonDataObjectsTest.TestRun (1013 of 2153)
PASS: lldb-unit :: SymbolFile/DWARF/./SymbolFileDWARFTests/SymbolFileDWARFTests.TestAbbrevNullAttrValidForm (1014 of 2153)
PASS: lldb-unit :: Utility/./UtilityTests/StringListTest.ShiftCString (1015 of 2153)
PASS: lldb-unit :: Core/./LLDBCoreTests/ModuleSpecTest.TestCOFFFile (1016 of 2153)
PASS: lldb-api :: api/multithreaded/TestMultithreaded.py (1017 of 2153)
PASS: lldb-unit :: Host/./HostTests/MainLoopTest.TerminatesImmediately (1018 of 2153)
PASS: lldb-unit :: Utility/./UtilityTests/StringListTest.JoinThree (1019 of 2153)
PASS: lldb-api :: commands/expression/cast_int_to_anonymous_enum/TestCastIntToAnonymousEnum.py (1020 of 2153)
PASS: lldb-unit :: Utility/./UtilityTests/StringListTest.AppendListCStringArray (1021 of 2153)
PASS: lldb-unit :: SymbolFile/NativePDB/./SymbolFileNativePDBTests/PDBFPOProgramToDWARFExpressionTests.UnsupportedRASearch (1022 of 2153)
PASS: lldb-unit :: Utility/./UtilityTests/RangeTest.DefaultConstructor (1023 of 2153)
PASS: lldb-api :: lang/cpp/template-specialization-type/TestTemplateSpecializationType.py (1024 of 2153)
PASS: lldb-api :: commands/expression/import-std-module/vector-dbg-info-content/TestDbgInfoContentVectorFromStdModule.py (1025 of 2153)
PASS: lldb-api :: tools/lldb-server/TestGdbRemoteExpeditedRegisters.py (1026 of 2153)
PASS: lldb-unit :: Utility/./UtilityTests/StreamTeeTest.Assignment (1027 of 2153)
PASS: lldb-api :: commands/target/dump-symtab-demangle/TestDumpSymtabDemangle.py (1028 of 2153)
PASS: lldb-shell :: BuildScript/compiler-full-path.test (1029 of 2153)
PASS: lldb-unit :: Utility/./UtilityTests/OptionsWithRawTest.EmptyArgsOnlySuffix (1030 of 2153)
PASS: lldb-api :: types/TestCharTypeExpr.py (1031 of 2153)
PASS: lldb-api :: tools/lldb-vscode/breakpoint/TestVSCode_setFunctionBreakpoints.py (1032 of 2153)
PASS: lldb-shell :: Driver/TestNoUseColor.test (1033 of 2153)
PASS: lldb-shell :: SymbolFile/DWARF/inline-function-address-shared.test (1034 of 2153)
PASS: lldb-api :: lang/cpp/bool/TestCPPBool.py (1035 of 2153)
PASS: lldb-shell :: SymbolFile/DWARF/clang-ast-from-dwarf-unamed-and-anon-structs.cpp (1036 of 2153)
PASS: lldb-api :: lang/cpp/member-and-local-vars-with-same-name/TestMembersAndLocalsWithSameName.py (1037 of 2153)
PASS: lldb-shell :: SymbolFile/DWARF/debug_loc-aslr.s (1038 of 2153)
PASS: lldb-unit :: UnwindAssembly/x86/./UnwindAssemblyx86Tests/Testx86AssemblyInspectionEngine.TestPush0 (1039 of 2153)
PASS: lldb-shell :: ObjectFile/ELF/minidebuginfo-find-symbols.yaml (1040 of 2153)
PASS: lldb-api :: functionalities/thread/thread_specific_break/TestThreadSpecificBreakpoint.py (1041 of 2153)
PASS: lldb-api :: functionalities/backticks/TestBackticksWithoutATarget.py (1042 of 2153)
PASS: lldb-api :: functionalities/data-formatter/data-formatter-objc/TestDataFormatterObjCNSContainer.py (1043 of 2153)
PASS: lldb-api :: functionalities/thread/concurrent_events/TestConcurrentDelayedCrashWithBreakpointSignal.py (1044 of 2153)
PASS: lldb-shell :: Commands/command-breakpoint-col.test (1045 of 2153)
PASS: lldb-unit :: Utility/./UtilityTests/SerializationRountripTest.SerializeDeserializePod (1046 of 2153)
PASS: lldb-unit :: Utility/./UtilityTests/ConstStringTest.UpdateMangledCounterpart (1047 of 2153)
PASS: lldb-unit :: Expression/./ExpressionTests/DWARFExpression.DW_OP_convert (1048 of 2153)
PASS: lldb-api :: python_api/value/linked_list/TestValueAPILinkedList.py (1049 of 2153)
PASS: lldb-api :: tools/lldb-server/TestGdbRemoteHostInfo.py (1050 of 2153)
PASS: lldb-unit :: Utility/./UtilityTests/StringListTest.JoinNonSpace (1051 of 2153)
PASS: lldb-api :: functionalities/deleted-executable/TestDeletedExecutable.py (1052 of 2153)
PASS: lldb-shell :: SymbolFile/DWARF/DW_AT_low_pc-addrx.s (1053 of 2153)
PASS: lldb-api :: types/TestShortType.py (1054 of 2153)
PASS: lldb-unit :: UnwindAssembly/x86/./UnwindAssemblyx86Tests/Testx86AssemblyInspectionEngine.TestPopR12 (1055 of 2153)
PASS: lldb-unit :: Utility/./UtilityTests/RangeTest.SizeTypes (1056 of 2153)
PASS: lldb-api :: functionalities/thread/step_out/TestThreadStepOut.py (1057 of 2153)
PASS: lldb-unit :: UnwindAssembly/x86/./UnwindAssemblyx86Tests/Testx86AssemblyInspectionEngine.TestPushECX (1058 of 2153)
PASS: lldb-api :: functionalities/data-formatter/refpointer-recursion/TestDataFormatterRefPtrRecursion.py (1059 of 2153)
PASS: lldb-unit :: Language/Highlighting/./HighlighterTests/HighlighterTest.ClangBraces (1060 of 2153)
PASS: lldb-shell :: Driver/TestCore.test (1061 of 2153)
PASS: lldb-shell :: ObjectFile/ELF/short-build-id.yaml (1062 of 2153)
PASS: lldb-unit :: Process/gdb-remote/./ProcessGdbRemoteTests/GDBRemoteCommunicationClientTest.GetModulesInfo (1063 of 2153)
PASS: lldb-api :: lang/objc/objc-super/TestObjCSuper.py (1064 of 2153)
PASS: lldb-unit :: Utility/./UtilityTests/StreamTest.AddressNoSuffix (1065 of 2153)
PASS: lldb-unit :: UnwindAssembly/x86/./UnwindAssemblyx86Tests/Testx86AssemblyInspectionEngine.Test64bitFramelessSmallStackFrame (1066 of 2153)
PASS: lldb-api :: functionalities/data-formatter/array_typedef/TestArrayTypedef.py (1067 of 2153)
PASS: lldb-shell :: Quit/TestQuitExitCodeImplicit0.test (1068 of 2153)
PASS: lldb-api :: iohandler/autosuggestion/TestAutosuggestion.py (1069 of 2153)
PASS: lldb-shell :: Driver/TestUseColor.test (1070 of 2153)
PASS: lldb-api :: functionalities/breakpoint/breakpoint_hit_count/TestBreakpointHitCount.py (1071 of 2153)
PASS: lldb-api :: functionalities/gdb_remote_client/TestGDBRemoteDiskFileCompletion.py (1072 of 2153)
PASS: lldb-unit :: Utility/./UtilityTests/OptionsWithRawTest.WhitespaceSuffix (1073 of 2153)
PASS: lldb-api :: lang/cpp/llvm-style/TestLLVMStyle.py (1074 of 2153)
PASS: lldb-unit :: Utility/./UtilityTests/ConstStringTest.CompareConstString (1075 of 2153)
PASS: lldb-api :: lang/c/shared_lib_stripped_symbols/TestSharedLibStrippedSymbols.py (1076 of 2153)
PASS: lldb-unit :: Process/minidump/./LLDBMinidumpTests/RegisterContextMinidump.ConvertMinidumpContext_x86_32 (1077 of 2153)
PASS: lldb-api :: functionalities/thread/crash_during_step/TestCrashDuringStep.py (1078 of 2153)
PASS: lldb-unit :: Utility/./UtilityTests/RangeTest.DoesAdjoinOrIntersect (1079 of 2153)
PASS: lldb-unit :: Utility/./UtilityTests/UriParserTest.BracketedHostnamePort (1080 of 2153)
PASS: lldb-unit :: Expression/./ExpressionTests/DiagnosticManagerTest.GetStringSeverityLabels (1081 of 2153)
PASS: lldb-shell :: BuildScript/toolchain-clang.test (1082 of 2153)
UNSUPPORTED: lldb-shell :: ExecControl/StopHook/stop-hook-threads.test (1083 of 2153)
PASS: lldb-api :: lang/objc/modules-app-update/TestClangModulesAppUpdate.py (1084 of 2153)
PASS: lldb-unit :: Target/./TargetTests/StackFrameRecognizerTest.NullModuleRegex (1085 of 2153)
PASS: lldb-unit :: Utility/./UtilityTests/DataExtractorTest.GetCStrUnterminated (1086 of 2153)
PASS: lldb-unit :: Symbol/./SymbolTests/LineEntryTest.GetSameLineContiguousAddressRangeNestedInline (1087 of 2153)
PASS: lldb-unit :: API/./APITests/SBCommandInterpreterTest.MultiWordCommand (1088 of 2153)
PASS: lldb-unit :: Utility/./UtilityTests/StreamTeeTest.SetStreamAtIndexOverwrite (1089 of 2153)
PASS: lldb-unit :: Expression/./ExpressionTests/DWARFExpression.DW_OP_piece (1090 of 2153)
PASS: lldb-api :: commands/expression/entry-bp/TestExprEntryBP.py (1091 of 2153)
PASS: lldb-unit :: Core/./LLDBCoreTests/SourceFileCache.FindSourceFileNotFound (1092 of 2153)
PASS: lldb-unit :: Symbol/./SymbolTests/TestTypeSystemClang.TestGetBasicTypeFromEnum (1093 of 2153)
PASS: lldb-api :: python_api/sbdata/TestSBData.py (1094 of 2153)
PASS: lldb-shell :: ObjectFile/ELF/build-id-case.yaml (1095 of 2153)
PASS: lldb-shell :: SymbolFile/DWARF/dir-separator-windows.s (1096 of 2153)
PASS: lldb-api :: lang/objc/real-definition/TestRealDefinition.py (1097 of 2153)
PASS: lldb-unit :: Process/minidump/./LLDBMinidumpTests/MinidumpParserTest.FindMemoryRange (1098 of 2153)
PASS: lldb-shell :: Unwind/trap_frame_sym_ctx.test (1099 of 2153)
PASS: lldb-api :: functionalities/inline-stepping/TestInlineStepping.py (1100 of 2153)
PASS: lldb-api :: functionalities/return-value/TestReturnValue.py (1101 of 2153)
PASS: lldb-api :: commands/add-dsym/uuid/TestAddDsymCommand.py (1102 of 2153)
PASS: lldb-api :: lang/objc/modules/TestObjCModules.py (1103 of 2153)
PASS: lldb-unit :: Utility/./UtilityTests/VMRange.Clear (1104 of 2153)
PASS: lldb-unit :: Utility/./UtilityTests/StreamTest.SetIndentLevel (1105 of 2153)
PASS: lldb-api :: lang/cpp/char1632_t/TestChar1632T.py (1106 of 2153)
PASS: lldb-api :: functionalities/pre_run_dylibs/TestPreRunDylibs.py (1107 of 2153)
PASS: lldb-unit :: Utility/./UtilityTests/DataExtractorTest.GetMaxU64_unchecked (1108 of 2153)
UNSUPPORTED: lldb-shell :: Register/x86-zmm-read.test (1109 of 2153)
PASS: lldb-api :: functionalities/pointer_num_children/TestPointerNumChildren.py (1110 of 2153)
PASS: lldb-unit :: Utility/./UtilityTests/RangeTest.ContainsEndInclusive (1111 of 2153)
PASS: lldb-unit :: Process/gdb-remote/./ProcessGdbRemoteTests/GDBRemoteCommunicationClientTest.SyncThreadState (1112 of 2153)
PASS: lldb-unit :: Utility/./UtilityTests/ArgsTest.TestOverwriteArgs (1113 of 2153)
PASS: lldb-unit :: Utility/./UtilityTests/StringExtractorTest.GetHexBytesAvail_OddPair2 (1114 of 2153)
PASS: lldb-shell :: Commands/command-disassemble-process.yaml (1115 of 2153)
PASS: lldb-unit :: Interpreter/./InterpreterTests/OptionValueFileColonLine.setFromString (1116 of 2153)
PASS: lldb-api :: lang/objcxx/cxx-bridged-po/TestObjCXXBridgedPO.py (1117 of 2153)
PASS: lldb-unit :: UnwindAssembly/x86/./UnwindAssemblyx86Tests/Testx86AssemblyInspectionEngine.Test32BitOnlyInstruction (1118 of 2153)
PASS: lldb-shell :: ObjectFile/PECOFF/uuid.yaml (1119 of 2153)
PASS: lldb-api :: commands/process/launch-with-shellexpand/TestLaunchWithShellExpand.py (1120 of 2153)
PASS: lldb-unit :: Utility/./UtilityTests/StreamTest.PutNHex8 (1121 of 2153)
PASS: lldb-api :: functionalities/float-display/TestFloatDisplay.py (1122 of 2153)
PASS: lldb-api :: functionalities/thread/concurrent_events/TestConcurrentDelayedCrashWithBreakpointWatchpoint.py (1123 of 2153)
PASS: lldb-shell :: SymbolFile/DWARF/DW_AT_loclists_base.s (1124 of 2153)
PASS: lldb-api :: functionalities/inferior-crashing/TestInferiorCrashing.py (1125 of 2153)
PASS: lldb-api :: commands/gui/viewlarge/TestGuiViewLarge.py (1126 of 2153)
PASS: lldb-shell :: SymbolFile/Breakpad/stack-cfi-parsing.test (1127 of 2153)
PASS: lldb-api :: functionalities/postmortem/elf-core/TestLinuxCore.py (1128 of 2153)
PASS: lldb-api :: lang/mixed/TestMixedLanguages.py (1129 of 2153)
PASS: lldb-unit :: DataFormatter/./LLDBFormatterTests/TypeMatcherTests.GetMatchStringExactName (1130 of 2153)
PASS: lldb-unit :: Utility/./UtilityTests/RangeTest.NotEqual (1131 of 2153)
PASS: lldb-unit :: Language/CPlusPlus/./LanguageCPlusPlusTests/CPlusPlusLanguage.FindAlternateFunctionManglings (1132 of 2153)
PASS: lldb-unit :: Utility/./UtilityTests/IndexToObjectTest.ObjectForIndex (1133 of 2153)
PASS: lldb-api :: lang/cpp/extern_c/TestExternCSymbols.py (1134 of 2153)
PASS: lldb-shell :: ObjectFile/ELF/base-address.yaml (1135 of 2153)
PASS: lldb-unit :: Utility/./UtilityTests/RecordReplayTest.InstrumentedFooSameThis (1136 of 2153)
PASS: lldb-shell :: ObjectFile/Breakpad/discontiguous-sections.test (1137 of 2153)
UNSUPPORTED: lldb-shell :: BuildScript/toolchain-msvc.test (1138 of 2153)
PASS: lldb-api :: commands/command/script/TestCommandScript.py (1139 of 2153)
PASS: lldb-unit :: UnwindAssembly/x86/./UnwindAssemblyx86Tests/Testx86AssemblyInspectionEngine.TestPopR15 (1140 of 2153)
PASS: lldb-unit :: Host/./HostTests/NativeProcessProtocolTest.ReadCStringFromMemory (1141 of 2153)
PASS: lldb-unit :: Interpreter/./InterpreterTests/CompletionTest.DirCompletionAbsolute (1142 of 2153)
PASS: lldb-unit :: UnwindAssembly/x86/./UnwindAssemblyx86Tests/Testx86AssemblyInspectionEngine.TestSpArithx86_64Augmented (1143 of 2153)
PASS: lldb-unit :: Utility/./UtilityTests/CompletionRequest.Constructor (1144 of 2153)
PASS: lldb-unit :: Utility/./UtilityTests/StringListTest.AppendStringCString (1145 of 2153)
PASS: lldb-api :: types/TestShortTypeExpr.py (1146 of 2153)
PASS: lldb-api :: python_api/objc_type/TestObjCType.py (1147 of 2153)
PASS: lldb-api :: functionalities/data-formatter/data-formatter-objc/nsstring/TestDataFormatterNSString.py (1148 of 2153)
PASS: lldb-shell :: ObjectFile/ELF/aarch64-relocations.yaml (1149 of 2153)
PASS: lldb-api :: commands/platform/process/list/TestProcessList.py (1150 of 2153)
PASS: lldb-unit :: Utility/./UtilityTests/ArgsTest.TestTrailingBackslash (1151 of 2153)
PASS: lldb-api :: functionalities/gdb_remote_client/TestTargetXMLArch.py (1152 of 2153)
PASS: lldb-api :: commands/expression/import-std-module/vector/TestVectorFromStdModule.py (1153 of 2153)
PASS: lldb-api :: functionalities/gdb_remote_client/TestRecognizeBreakpoint.py (1154 of 2153)
PASS: lldb-api :: tools/lldb-server/TestAppleSimulatorOSType.py (1155 of 2153)
PASS: lldb-shell :: SymbolFile/Breakpad/unwind-via-stack-cfi.test (1156 of 2153)
PASS: lldb-unit :: Utility/./UtilityTests/StringExtractorTest.GetHexU8_Extra (1157 of 2153)
PASS: lldb-shell :: ObjectFile/ELF/PT_LOAD.yaml (1158 of 2153)
PASS: lldb-api :: lang/objc/foundation/TestObjCMethods2.py (1159 of 2153)
PASS: lldb-unit :: Process/gdb-remote/./ProcessGdbRemoteTests/GDBRemoteClientBaseTest.SendContinueDelegateStructuredDataReceipt (1160 of 2153)
PASS: lldb-unit :: Target/./TargetTests/ModuleCacheTest.GetAndPutStrangeHostname (1161 of 2153)
PASS: lldb-unit :: Utility/./UtilityTests/StringExtractorTest.GetHexU8_InvalidHex_NoEof (1162 of 2153)
PASS: lldb-api :: functionalities/data-formatter/data-formatter-objc/nsindexpath/TestDataFormatterNSIndexPath.py (1163 of 2153)
PASS: lldb-shell :: SymbolFile/DWARF/dwarf5-partial-index.cpp (1164 of 2153)
PASS: lldb-unit :: UnwindAssembly/x86/./UnwindAssemblyx86Tests/Testx86AssemblyInspectionEngine.TestPushEDX (1165 of 2153)
PASS: lldb-unit :: Utility/./UtilityTests/TimeoutTest.Construction (1166 of 2153)
PASS: lldb-unit :: Utility/./UtilityTests/LogChannelEnabledTest.LogVerboseThread (1167 of 2153)
PASS: lldb-unit :: Utility/./UtilityTests/StringExtractorTest.GetHexU8_Underflow_NoEof (1168 of 2153)
PASS: lldb-api :: functionalities/thread/jump/TestThreadJump.py (1169 of 2153)
PASS: lldb-unit :: Core/./LLDBCoreTests/ModuleSpecTest.TestELFFile (1170 of 2153)
PASS: lldb-api :: tools/lldb-server/TestGdbRemoteThreadsInStopReply.py (1171 of 2153)
PASS: lldb-unit :: Symbol/./SymbolTests/TestTypeSystemClang.AddMethodToObjCObjectType (1172 of 2153)
PASS: lldb-unit :: Process/minidump/./LLDBMinidumpTests/MinidumpParserTest.GetArchitectureWindows (1173 of 2153)
PASS: lldb-api :: api/multiple-debuggers/TestMultipleDebuggers.py (1174 of 2153)
PASS: lldb-api :: macosx/universal/TestUniversal.py (1175 of 2153)
PASS: lldb-api :: functionalities/data-formatter/data-formatter-stl/libcxx/initializerlist/TestInitializerList.py (1176 of 2153)
PASS: lldb-unit :: Utility/./UtilityTests/ScalarTest.Getters (1177 of 2153)
PASS: lldb-unit :: Utility/./UtilityTests/XcodeSDKTest.FindXcodeContentsDirectoryInPath (1178 of 2153)
PASS: lldb-unit :: Utility/./UtilityTests/SubsystemRAIITest.SubsystemWithErrorSuccess (1179 of 2153)
PASS: lldb-unit :: Utility/./UtilityTests/UUIDTest.Validity (1180 of 2153)
PASS: lldb-unit :: Utility/./UtilityTests/StreamTest.AddressRangeSize (1181 of 2153)
PASS: lldb-unit :: Process/gdb-remote/./ProcessGdbRemoteTests/GDBRemoteCommunicationClientTest.GetQOffsets (1182 of 2153)
PASS: lldb-api :: commands/frame/diagnose/bad-reference/TestBadReference.py (1183 of 2153)
PASS: lldb-unit :: Process/gdb-remote/./ProcessGdbRemoteTests/GDBRemoteCommunicationClientTest.SendStopTracePacket (1184 of 2153)
PASS: lldb-api :: functionalities/data-formatter/data-formatter-synth/TestDataFormatterSynth.py (1185 of 2153)
PASS: lldb-api :: commands/expression/context-object-objc/TestContextObjectObjc.py (1186 of 2153)
PASS: lldb-api :: functionalities/thread/state_after_expression/TestStateAfterExpression.py (1187 of 2153)
XFAIL: lldb-shell :: Register/x86-64-ymm-write.test (1188 of 2153)
PASS: lldb-api :: functionalities/reproducers/attach/TestReproducerAttach.py (1189 of 2153)
PASS: lldb-api :: functionalities/data-formatter/data-formatter-smart-array/TestDataFormatterSmartArray.py (1190 of 2153)
UNSUPPORTED: lldb-api :: functionalities/unwind/standard/TestStandardUnwind.py (1191 of 2153)
UNSUPPORTED: lldb-api :: python_api/event/TestEvents.py (1192 of 2153)
PASS: lldb-unit :: Utility/./UtilityTests/StateTest.Formatv (1193 of 2153)
PASS: lldb-unit :: Utility/./UtilityTests/OptionsWithRawTest.SingleWhitespaceInput (1194 of 2153)
PASS: lldb-api :: functionalities/thread/concurrent_events/TestConcurrentSignalBreak.py (1195 of 2153)
PASS: lldb-unit :: Utility/./UtilityTests/BinaryStreamTest.PutULEB128FiveBytes (1196 of 2153)
PASS: lldb-api :: macosx/indirect_symbol/TestIndirectSymbols.py (1197 of 2153)
PASS: lldb-api :: functionalities/data-formatter/data-formatter-objc/TestDataFormatterObjNSException.py (1198 of 2153)
PASS: lldb-api :: lang/objc/foundation/TestRuntimeTypes.py (1199 of 2153)
PASS: lldb-unit :: Utility/./UtilityTests/BinaryStreamTest.PutULEB128FourBytes (1200 of 2153)
PASS: lldb-unit :: ScriptInterpreter/Python/./ScriptInterpreterPythonTests/PythonDataObjectsTest.TestPythonTupleValues (1201 of 2153)
PASS: lldb-unit :: Utility/./UtilityTests/StreamTest.PutCharWhitespace (1202 of 2153)
PASS: lldb-unit :: Utility/./UtilityTests/SubsystemRAIITest.NormalSubsystem (1203 of 2153)
PASS: lldb-unit :: Utility/./UtilityTests/StreamTest.PutHex64ByteOrderBig (1204 of 2153)
UNSUPPORTED: lldb-api :: commands/watchpoints/hello_watchlocation/TestWatchLocation.py (1205 of 2153)
PASS: lldb-unit :: ObjectFile/Breakpad/./ObjectFileBreakpadTests/PublicRecord.parse (1206 of 2153)
PASS: lldb-shell :: Register/x86-64-ymm-read.test (1207 of 2153)
PASS: lldb-api :: commands/frame/diagnose/array/TestArray.py (1208 of 2153)
PASS: lldb-unit :: ObjectFile/Breakpad/./ObjectFileBreakpadTests/FileRecord.parse (1209 of 2153)
PASS: lldb-api :: functionalities/fat_archives/TestFatArchives.py (1210 of 2153)
PASS: lldb-shell :: Minidump/memory-region.yaml (1211 of 2153)
PASS: lldb-unit :: Utility/./UtilityTests/FileSpecTest.RemoveLastPathComponent (1212 of 2153)
PASS: lldb-unit :: ObjectFile/PECOFF/./ObjectFilePECOFFTests/PECallFrameInfoTest.Basic_eh (1213 of 2153)
PASS: lldb-api :: commands/expression/import-std-module/deque-dbg-info-content/TestDbgInfoContentDequeFromStdModule.py (1214 of 2153)
PASS: lldb-unit :: Language/Highlighting/./HighlighterTests/HighlighterTest.ClangCursorOutOfBounds (1215 of 2153)
PASS: lldb-unit :: Process/minidump/./LLDBMinidumpTests/MinidumpParserTest.InvalidMinidump (1216 of 2153)
PASS: lldb-api :: python_api/breakpoint/TestBreakpointAPI.py (1217 of 2153)
PASS: lldb-unit :: Utility/./UtilityTests/GeneratorTest.GetOrCreate (1218 of 2153)
PASS: lldb-unit :: Language/Highlighting/./HighlighterTests/HighlighterTest.ClangTrailingBackslashBeforeNewline (1219 of 2153)
PASS: lldb-unit :: Process/gdb-remote/./ProcessGdbRemoteTests/GDBRemoteCommunicationClientTest.ReadRegister (1220 of 2153)
PASS: lldb-api :: lang/cpp/operators/TestCppOperators.py (1221 of 2153)
PASS: lldb-api :: functionalities/recursion/TestValueObjectRecursion.py (1222 of 2153)
PASS: lldb-api :: commands/expression/po_verbosity/TestPoVerbosity.py (1223 of 2153)
PASS: lldb-api :: commands/expression/anonymous-struct/TestCallUserAnonTypedef.py (1224 of 2153)
PASS: lldb-api :: functionalities/thread/exit_during_break/TestExitDuringBreak.py (1225 of 2153)
PASS: lldb-unit :: Utility/./UtilityTests/StreamTest.PutULEB128 (1226 of 2153)
PASS: lldb-api :: lang/objc/objc-new-syntax/TestObjCNewSyntaxLiteral.py (1227 of 2153)
PASS: lldb-unit :: Host/./HostTests/FileSystemTest.GetByteSize (1228 of 2153)
PASS: lldb-api :: functionalities/postmortem/wow64_minidump/TestWow64MiniDump.py (1229 of 2153)
PASS: lldb-shell :: SymbolFile/DWARF/find-qualified-variable.cpp (1230 of 2153)
PASS: lldb-unit :: Utility/./UtilityTests/RangeTest.ContainsAddrInvalid (1231 of 2153)
PASS: lldb-api :: macosx/version_zero/TestGetVersionZeroVersion.py (1232 of 2153)
PASS: lldb-api :: lang/cpp/class_types/TestClassTypesDisassembly.py (1233 of 2153)
PASS: lldb-shell :: Quit/TestQuitExitCodeTooManyArgs.test (1234 of 2153)
PASS: lldb-api :: lang/cpp/static_methods/TestCPPStaticMethods.py (1235 of 2153)
PASS: lldb-unit :: Utility/./UtilityTests/Flags.AllClear (1236 of 2153)
PASS: lldb-api :: functionalities/thread/backtrace_all/TestBacktraceAll.py (1237 of 2153)
PASS: lldb-api :: commands/expression/static-initializers/TestStaticInitializers.py (1238 of 2153)
PASS: lldb-api :: python_api/lldbutil/frame/TestFrameUtils.py (1239 of 2153)
PASS: lldb-unit :: Host/./HostTests/NativeProcessProtocolTest.ReadCStringFromMemory_MaxSize (1240 of 2153)
PASS: lldb-shell :: Driver/TestSingleQuote.test (1241 of 2153)
PASS: lldb-api :: lang/c/register_variables/TestRegisterVariables.py (1242 of 2153)
XFAIL: lldb-shell :: Register/x86-mm-xmm-write.test (1243 of 2153)
PASS: lldb-api :: lang/cpp/class_static/TestStaticVariables.py (1244 of 2153)
PASS: lldb-shell :: Host/TestCustomShell.test (1245 of 2153)
PASS: lldb-unit :: UnwindAssembly/PPC64/./PPC64InstEmulationTests/TestPPC64InstEmulation.TestMediumFunction (1246 of 2153)
PASS: lldb-unit :: ScriptInterpreter/Python/./ScriptInterpreterPythonTests/PythonDataObjectsTest.TestPythonIntegerToStructuredInteger (1247 of 2153)
PASS: lldb-unit :: Expression/./ExpressionTests/DiagnosticManagerTest.GetStringPreserveOrder (1248 of 2153)
PASS: lldb-unit :: SymbolFile/DWARF/./SymbolFileDWARFTests/SymbolFileDWARFTests.ParseArangesNonzeroSegmentSize (1249 of 2153)
PASS: lldb-unit :: Language/Highlighting/./HighlighterTests/HighlighterTest.ClangCursorPosAfterOtherToken (1250 of 2153)
PASS: lldb-unit :: Utility/./UtilityTests/StreamTeeTest.DefaultConstructor (1251 of 2153)
PASS: lldb-shell :: Reproducer/TestRelativePath.test (1252 of 2153)
PASS: lldb-shell :: Settings/TestSettingsWrite.test (1253 of 2153)
UNSUPPORTED: lldb-api :: functionalities/breakpoint/hardware_breakpoints/write_memory_with_hw_breakpoint/TestWriteMemoryWithHWBreakpoint.py (1254 of 2153)
PASS: lldb-unit :: Utility/./UtilityTests/UUIDTest.StringConverion (1255 of 2153)
PASS: lldb-unit :: Process/./ProcessEventDataTests/ProcessEventDataTest.DoOnRemoval (1256 of 2153)
PASS: lldb-unit :: ScriptInterpreter/Python/./ScriptInterpreterPythonTests/PythonDataObjectsTest.TestPythonBoolean (1257 of 2153)
PASS: lldb-unit :: Utility/./UtilityTests/Flags.AllSet (1258 of 2153)
PASS: lldb-api :: commands/target/stop-hook/enable/TestTargetStopHookEnable.py (1259 of 2153)
UNSUPPORTED: lldb-api :: functionalities/thread/create_during_step/TestCreateDuringStep.py (1260 of 2153)
PASS: lldb-shell :: SymbolFile/DWARF/debug-types-dwarf5.s (1261 of 2153)
PASS: lldb-shell :: Reproducer/TestDriverOptions.test (1262 of 2153)
PASS: lldb-unit :: UnwindAssembly/x86/./UnwindAssemblyx86Tests/Testx86AssemblyInspectionEngine.TestPushEBP (1263 of 2153)
PASS: lldb-api :: iohandler/resize/TestIOHandlerResizeNoEditline.py (1264 of 2153)
PASS: lldb-api :: functionalities/unwind/noreturn/TestNoreturnUnwind.py (1265 of 2153)
PASS: lldb-api :: functionalities/load_using_paths/TestLoadUsingPaths.py (1266 of 2153)
PASS: lldb-unit :: Utility/./UtilityTests/LogChannelEnabledTest.log_options (1267 of 2153)
PASS: lldb-unit :: SymbolFile/NativePDB/./SymbolFileNativePDBTests/PDBFPOProgramToDWARFExpressionTests.MissingTargetRegister (1268 of 2153)
PASS: lldb-api :: commands/command/source/TestCommandSource.py (1269 of 2153)
PASS: lldb-api :: commands/watchpoints/multiple_threads/TestWatchpointMultipleThreads.py (1270 of 2153)
PASS: lldb-unit :: Utility/./UtilityTests/CompletionRequest.TryCompleteCurrentArgMode (1271 of 2153)
PASS: lldb-unit :: Process/minidump/./LLDBMinidumpTests/MinidumpParserTest.GetMemory (1272 of 2153)
PASS: lldb-unit :: UnwindAssembly/ARM64/./Arm64InstEmulationTests/TestArm64InstEmulation.TestRegisterDoubleSpills (1273 of 2153)
PASS: lldb-shell :: ObjectFile/ELF/avr-basic-info.yaml (1274 of 2153)
PASS: lldb-unit :: Utility/./UtilityTests/UriParserTest.SchemeHostSeparator4 (1275 of 2153)
PASS: lldb-unit :: ScriptInterpreter/Python/./ScriptInterpreterPythonTests/PythonDataObjectsTest.TestExceptions (1276 of 2153)
PASS: lldb-unit :: ScriptInterpreter/Python/./ScriptInterpreterPythonTests/PythonDataObjectsTest.TestPythonFile (1277 of 2153)
PASS: lldb-unit :: Symbol/./SymbolTests/TestTypeSystemClang.TestGetTypeClassTypeOfExpr (1278 of 2153)
PASS: lldb-unit :: Utility/./UtilityTests/OptionsWithRawTest.ArgsButNoLeadingDash (1279 of 2153)
PASS: lldb-api :: functionalities/data-formatter/data-formatter-enum-format/TestDataFormatterEnumFormat.py (1280 of 2153)
PASS: lldb-api :: functionalities/gdb_remote_client/TestArmRegisterDefinition.py (1281 of 2153)
PASS: lldb-unit :: Utility/./UtilityTests/StreamTest.AddressSize (1282 of 2153)
PASS: lldb-unit :: Utility/./UtilityTests/ListenerTest.GetEventImmediate (1283 of 2153)
PASS: lldb-api :: commands/log/invalid-args/TestInvalidArgsLog.py (1284 of 2153)
PASS: lldb-unit :: Language/Highlighting/./HighlighterTests/HighlighterTest.ClangStringLiterals (1285 of 2153)
PASS: lldb-api :: functionalities/data-formatter/hexcaps/TestDataFormatterHexCaps.py (1286 of 2153)
PASS: lldb-shell :: ObjectFile/Breakpad/uuid-matching-mac.test (1287 of 2153)
PASS: lldb-shell :: ObjectFile/PECOFF/section-types.yaml (1288 of 2153)
PASS: lldb-unit :: Utility/./UtilityTests/StringExtractorTest.GetNameColonValueSuccess (1289 of 2153)
PASS: lldb-api :: functionalities/thread/concurrent_events/TestConcurrentWatchpointDelayWatchpointOneBreakpoint.py (1290 of 2153)
PASS: lldb-unit :: Utility/./UtilityTests/StringExtractorTest.GetHexBytesAvail_Partial (1291 of 2153)
PASS: lldb-api :: tools/lldb-server/TestGdbRemoteProcessInfo.py (1292 of 2153)
PASS: lldb-api :: functionalities/data-formatter/data-formatter-stl/libcxx/list/loop/TestDataFormatterLibcxxListLoop.py (1293 of 2153)
PASS: lldb-api :: functionalities/thread/concurrent_events/TestConcurrentTwoWatchpointThreads.py (1294 of 2153)
PASS: lldb-unit :: Expression/./ExpressionTests/CppModuleConfigurationTest.MissingUsrInclude (1295 of 2153)
PASS: lldb-api :: lang/c/modules/TestCModules.py (1296 of 2153)
PASS: lldb-shell :: Reproducer/Functionalities/TestExpressionEvaluation.test (1297 of 2153)
PASS: lldb-unit :: Utility/./UtilityTests/RangeTest.Union (1298 of 2153)
PASS: lldb-unit :: Utility/./UtilityTests/LogTest.LLDB_LOG_nullptr (1299 of 2153)
PASS: lldb-api :: functionalities/data-formatter/data-formatter-script/TestDataFormatterScript.py (1300 of 2153)
PASS: lldb-unit :: Thread/./ThreadTests/ThreadTest.GetPrivateStopInfo (1301 of 2153)
PASS: lldb-unit :: Symbol/./SymbolTests/SymbolsTest.TerminateLocateExecutableSymbolFileForUnknownExecutableAndUnknownSymbolFile (1302 of 2153)
PASS: lldb-api :: functionalities/data-formatter/nsdictionarysynth/TestNSDictionarySynthetic.py (1303 of 2153)
PASS: lldb-shell :: Reproducer/TestFileRepro.test (1304 of 2153)
PASS: lldb-unit :: Utility/./UtilityTests/ArchSpecTest.TestSetTriple (1305 of 2153)
PASS: lldb-shell :: ObjectFile/ELF/section-types.yaml (1306 of 2153)
PASS: lldb-unit :: Language/Highlighting/./HighlighterTests/HighlighterTest.DefaultHighlighterWithCursor (1307 of 2153)
PASS: lldb-api :: lang/c/find_struct_type/TestFindStructTypes.py (1308 of 2153)
PASS: lldb-unit :: Utility/./UtilityTests/PassiveReplayTest.InstrumentedBar (1309 of 2153)
UNSUPPORTED: lldb-shell :: Unwind/eh-frame-small-fde.test (1310 of 2153)
PASS: lldb-unit :: Utility/./UtilityTests/StringLexerTest.Next (1311 of 2153)
PASS: lldb-unit :: Utility/./UtilityTests/StringExtractorTest.GetHexBytes_Underflow (1312 of 2153)
PASS: lldb-api :: commands/gui/basic/TestGuiBasic.py (1313 of 2153)
PASS: lldb-shell :: ScriptInterpreter/Python/scripted_breakpoint.test (1314 of 2153)
PASS: lldb-api :: commands/apropos/with-process/TestAproposWithProcess.py (1315 of 2153)
PASS: lldb-api :: tools/lldb-server/inferior-crash/TestGdbRemoteSegFault.py (1316 of 2153)
UNSUPPORTED: lldb-shell :: ObjectFile/ELF/minidebuginfo-set-and-hit-breakpoint.test (1317 of 2153)
PASS: lldb-api :: functionalities/wrong_commands/TestWrongCommands.py (1318 of 2153)
PASS: lldb-unit :: Utility/./UtilityTests/LogTest.Register (1319 of 2153)
PASS: lldb-api :: functionalities/breakpoint/breakpoint_command/TestBreakpointCommandsFromPython.py (1320 of 2153)
PASS: lldb-api :: commands/expression/save_jit_objects/TestSaveJITObjects.py (1321 of 2153)
UNSUPPORTED: lldb-api :: tools/lldb-server/TestGdbRemoteCompletion.py (1322 of 2153)
PASS: lldb-unit :: Host/./HostTests/SocketTest.TCPListen0GetPort (1323 of 2153)
PASS: lldb-unit :: Utility/./UtilityTests/SerializationRountripTest.SerializeDeserializeObjectPointer (1324 of 2153)
PASS: lldb-unit :: debugserver/./debugserverTests/RNBSocket.LoopBackListenIPv4 (1325 of 2153)
PASS: lldb-shell :: SymbolFile/NativePDB/global-classes.cpp (1326 of 2153)
PASS: lldb-api :: sample_test/TestSampleTest.py (1327 of 2153)
PASS: lldb-unit :: Target/./TargetTests/ExecutionContextTest.GetByteOrderProcess (1328 of 2153)
PASS: lldb-unit :: Utility/./UtilityTests/RangeTest.LessThanInvalid (1329 of 2153)
PASS: lldb-api :: functionalities/data-formatter/synthupdate/TestSyntheticFilterRecompute.py (1330 of 2153)
UNSUPPORTED: lldb-api :: commands/register/register/aarch64_sve_registers/rw_access_static_config/TestSVERegisters.py (1331 of 2153)
PASS: lldb-shell :: SymbolFile/DWARF/find-function-regex.cpp (1332 of 2153)
PASS: lldb-api :: commands/expression/unicode-in-variable/TestUnicodeInVariable.py (1333 of 2153)
PASS: lldb-api :: functionalities/gdb_remote_client/TestPlatformClient.py (1334 of 2153)
PASS: lldb-unit :: Utility/./UtilityTests/StreamTeeTest.SetStreamAtIndexOutOfBounds (1335 of 2153)
PASS: lldb-unit :: Host/./HostTests/FileSystemTest.Readable (1336 of 2153)
PASS: lldb-unit :: Host/./HostTests/SocketTest.UDPConnect (1337 of 2153)
PASS: lldb-unit :: UnwindAssembly/x86/./UnwindAssemblyx86Tests/Testx86AssemblyInspectionEngine.TestReturnDetect (1338 of 2153)
PASS: lldb-api :: commands/expression/import-std-module/queue/TestQueueFromStdModule.py (1339 of 2153)
PASS: lldb-api :: lang/cpp/dynamic-value/TestDynamicValue.py (1340 of 2153)
PASS: lldb-api :: python_api/interpreter/TestCommandInterpreterAPI.py (1341 of 2153)
PASS: lldb-unit :: UnwindAssembly/x86/./UnwindAssemblyx86Tests/Testx86AssemblyInspectionEngine.TestPopR13 (1342 of 2153)
PASS: lldb-api :: python_api/frame/TestFrames.py (1343 of 2153)
PASS: lldb-api :: commands/command/script/import/rdar-12586188/TestRdar12586188.py (1344 of 2153)
PASS: lldb-api :: commands/expression/import-std-module/weak_ptr-dbg-info-content/TestDbgInfoContentWeakPtrFromStdModule.py (1345 of 2153)
PASS: lldb-unit :: Utility/./UtilityTests/RangeDataVector.CustomSort (1346 of 2153)
PASS: lldb-unit :: Language/Highlighting/./HighlighterTests/HighlighterTest.ClangIdentifiers (1347 of 2153)
PASS: lldb-api :: functionalities/data-formatter/user-format-vs-summary/TestUserFormatVsSummary.py (1348 of 2153)
PASS: lldb-shell :: SymbolFile/Breakpad/unwind-via-raSearch.test (1349 of 2153)
PASS: lldb-unit :: Expression/./ExpressionTests/CppModuleConfigurationTest.Linux (1350 of 2153)
PASS: lldb-api :: functionalities/mtc/simple/TestMTCSimple.py (1351 of 2153)
PASS: lldb-unit :: Utility/./UtilityTests/UriParserTest.Minimal (1352 of 2153)
PASS: lldb-shell :: ScriptInterpreter/None/import_module.test (1353 of 2153)
PASS: lldb-api :: sanity/TestSettingSkipping.py (1354 of 2153)
PASS: lldb-shell :: Commands/CommandScriptImmediateOutput/CommandScriptImmediateOutputConsole.test (1355 of 2153)
PASS: lldb-shell :: SymbolFile/DWARF/module-ownership.mm (1356 of 2153)
PASS: lldb-unit :: ScriptInterpreter/Python/./ScriptInterpreterPythonTests/PythonDataObjectsTest.TestInstanceNameResolutionNoDot (1357 of 2153)
PASS: lldb-unit :: Utility/./UtilityTests/CompletionRequest.FakeLastArg (1358 of 2153)
PASS: lldb-unit :: Expression/./ExpressionTests/CppModuleConfigurationTest.Xcode (1359 of 2153)
PASS: lldb-unit :: Utility/./UtilityTests/StreamTest.AddressEmptyPrefix (1360 of 2153)
PASS: lldb-unit :: Symbol/./SymbolTests/TestTypeSystemClang.TestRecordHasFields (1361 of 2153)
PASS: lldb-api :: commands/expression/pr35310/TestExprsBug35310.py (1362 of 2153)
PASS: lldb-api :: functionalities/data-formatter/data-formatter-synthtype/TestDataFormatterSynthType.py (1363 of 2153)
PASS: lldb-unit :: Core/./LLDBCoreTests/MangledTest.EmptyForInvalidName (1364 of 2153)
UNSUPPORTED: lldb-shell :: ScriptInterpreter/Lua/convenience_variables.test (1365 of 2153)
PASS: lldb-unit :: Utility/./UtilityTests/UriParserTest.BadPort (1366 of 2153)
PASS: lldb-shell :: ObjectFile/MachO/lc_build_version.yaml (1367 of 2153)
PASS: lldb-unit :: Language/Highlighting/./HighlighterTests/HighlighterTest.ClangScalarLiterals (1368 of 2153)
PASS: lldb-api :: commands/expression/function_template_specialization_temp_args/TestFunctionTemplateSpecializationTempArgs.py (1369 of 2153)
PASS: lldb-unit :: ScriptInterpreter/Python/./ScriptInterpreterPythonTests/PythonDataObjectsTest.TestPythonListValueEquality (1370 of 2153)
PASS: lldb-api :: functionalities/tail_call_frames/ambiguous_tail_call_seq2/TestAmbiguousTailCallSeq2.py (1371 of 2153)
PASS: lldb-api :: commands/disassemble/basic/TestDisassembleBreakpoint.py (1372 of 2153)
PASS: lldb-unit :: Process/minidump/./LLDBMinidumpTests/MinidumpParserTest.GetLinuxProcStatus (1373 of 2153)
PASS: lldb-unit :: Utility/./UtilityTests/ArchSpecTest.YAML (1374 of 2153)
PASS: lldb-api :: functionalities/thread/concurrent_events/TestConcurrentCrashWithWatchpoint.py (1375 of 2153)
UNSUPPORTED: lldb-api :: lang/objc/rdar-12408181/TestRdar12408181.py (1376 of 2153)
PASS: lldb-unit :: Utility/./UtilityTests/BinaryStreamTest.PutULEB128EightBytes (1377 of 2153)
PASS: lldb-unit :: Symbol/./SymbolTests/TestTypeSystemClang.TestRemoveFastQualifiers (1378 of 2153)
PASS: lldb-api :: commands/watchpoints/watchpoint_events/TestWatchpointEvents.py (1379 of 2153)
PASS: lldb-unit :: Utility/./UtilityTests/StringExtractorTest.GetHexU8_Underflow (1380 of 2153)
PASS: lldb-shell :: SymbolFile/NativePDB/function-types-calling-conv.cpp (1381 of 2153)
PASS: lldb-api :: macosx/order/TestOrderFile.py (1382 of 2153)
PASS: lldb-api :: lang/c/local_variables/TestLocalVariables.py (1383 of 2153)
PASS: lldb-api :: functionalities/breakpoint/cpp/TestCPPBreakpointLocations.py (1384 of 2153)
PASS: lldb-unit :: Utility/./UtilityTests/OptionsWithRawTest.EmptySuffix (1385 of 2153)
PASS: lldb-unit :: ScriptInterpreter/Python/./ScriptInterpreterPythonTests/PythonDataObjectsTest.TestPythonIntegerToStr (1386 of 2153)
UNSUPPORTED: lldb-shell :: SymbolFile/NativePDB/stack_unwinding01.cpp (1387 of 2153)
PASS: lldb-api :: commands/platform/file/close/TestPlatformFileClose.py (1388 of 2153)
PASS: lldb-api :: functionalities/inferior-crashing/recursive-inferior/TestRecursiveInferior.py (1389 of 2153)
PASS: lldb-api :: python_api/watchpoint/TestSetWatchpoint.py (1390 of 2153)
PASS: lldb-unit :: Symbol/./SymbolTests/SymbolsTest.LocateExecutableSymbolFileForUnknownExecutableAndMissingSymbolFile (1391 of 2153)
PASS: lldb-unit :: Utility/./UtilityTests/ReproducerTest.SetCapture (1392 of 2153)
PASS: lldb-api :: commands/expression/import-std-module/unique_ptr-dbg-info-content/TestUniquePtrDbgInfoContent.py (1393 of 2153)
PASS: lldb-shell :: Breakpoint/split-dwarf5-debug-stroffsets.test (1394 of 2153)
UNSUPPORTED: lldb-shell :: SymbolFile/PDB/calling-conventions.test (1395 of 2153)
PASS: lldb-shell :: ObjectFile/PECOFF/basic-info-arm.yaml (1396 of 2153)
PASS: lldb-unit :: Expression/./ExpressionTests/DiagnosticManagerTest.AppendMessageNoDiag (1397 of 2153)
PASS: lldb-unit :: UnwindAssembly/x86/./UnwindAssemblyx86Tests/Testx86AssemblyInspectionEngine.TestSimple64bitFrameFunction (1398 of 2153)
PASS: lldb-api :: functionalities/ptr_refs/TestPtrRefs.py (1399 of 2153)
PASS: lldb-api :: commands/expression/fixits/TestFixIts.py (1400 of 2153)
PASS: lldb-api :: lang/cpp/virtual-functions/TestCppVirtualFunctions.py (1401 of 2153)
UNSUPPORTED: lldb-api :: benchmarks/libcxxlist/TestBenchmarkLibcxxList.py (1402 of 2153)
PASS: lldb-shell :: SymbolFile/DWARF/debug_line-relative_path.s (1403 of 2153)
PASS: lldb-unit :: Utility/./UtilityTests/ProcessInstanceInfo.DumpTable (1404 of 2153)
PASS: lldb-api :: python_api/process/TestProcessAPI.py (1405 of 2153)
PASS: lldb-api :: commands/expression/call-function/TestCallUserDefinedFunction.py (1406 of 2153)
PASS: lldb-unit :: DataFormatter/./LLDBFormatterTests/StringPrinterTests.CxxASCII (1407 of 2153)
PASS: lldb-unit :: Utility/./UtilityTests/VMRange.ContainsRange (1408 of 2153)
PASS: lldb-unit :: Utility/./UtilityTests/ScalarTest.APIntConstructor (1409 of 2153)
UNSUPPORTED: lldb-shell :: Register/x86-64-zmm-read.test (1410 of 2153)
UNSUPPORTED: lldb-api :: tools/lldb-server/registers-target-xml-reading/TestGdbRemoteTargetXmlPacket.py (1411 of 2153)
PASS: lldb-api :: commands/watchpoints/watchpoint_disable/TestWatchpointDisable.py (1412 of 2153)
PASS: lldb-unit :: Utility/./UtilityTests/DataExtractorTest.GetBitfield (1413 of 2153)
PASS: lldb-unit :: Language/CPlusPlus/./LanguageCPlusPlusTests/CPlusPlusLanguage.ExtractContextAndIdentifier (1414 of 2153)
PASS: lldb-api :: python_api/process/read-mem-cstring/TestReadMemCString.py (1415 of 2153)
PASS: lldb-shell :: ScriptInterpreter/None/none.test (1416 of 2153)
PASS: lldb-unit :: Utility/./UtilityTests/StreamTest.PutHex8 (1417 of 2153)
UNSUPPORTED: lldb-api :: commands/watchpoints/variable_out_of_scope/TestWatchedVarHitWhenInScope.py (1418 of 2153)
PASS: lldb-unit :: SymbolFile/NativePDB/./SymbolFileNativePDBTests/PDBFPOProgramToDWARFExpressionTests.SingleAssignmentRegisterRef (1419 of 2153)
PASS: lldb-unit :: Utility/./UtilityTests/StringExtractorTest.GetNameColonValueContainsColon (1420 of 2153)
PASS: lldb-api :: commands/expression/ir-interpreter-phi-nodes/TestIRInterpreterPHINodes.py (1421 of 2153)
UNSUPPORTED: lldb-shell :: SymbolFile/NativePDB/ast-functions-msvc.cpp (1422 of 2153)
PASS: lldb-unit :: Host/./HostTests/ConnectionFileDescriptorTest.TCPGetURIv4 (1423 of 2153)
PASS: lldb-unit :: Utility/./UtilityTests/GeneratorTest.YamlMultiProvider (1424 of 2153)
PASS: lldb-api :: commands/watchpoints/watchpoint_on_vectors/TestValueOfVectorVariable.py (1425 of 2153)
PASS: lldb-unit :: Utility/./UtilityTests/StreamTest.PutMaxHex64ByteOrderBig (1426 of 2153)
PASS: lldb-shell :: BuildScript/modes.test (1427 of 2153)
PASS: lldb-unit :: UnwindAssembly/x86/./UnwindAssemblyx86Tests/Testx86AssemblyInspectionEngine.TestPushRBP (1428 of 2153)
PASS: lldb-api :: lang/cpp/multiple-inheritance/TestCppMultipleInheritance.py (1429 of 2153)
PASS: lldb-shell :: ScriptInterpreter/Python/crashlog.test (1430 of 2153)
PASS: lldb-unit :: UnwindAssembly/x86/./UnwindAssemblyx86Tests/Testx86AssemblyInspectionEngine.TestMovRSPtoRBP (1431 of 2153)
PASS: lldb-api :: python_api/file_handle/TestFileHandle.py (1432 of 2153)
PASS: lldb-unit :: Language/Highlighting/./HighlighterTests/HighlighterTest.ClangCursorPos (1433 of 2153)
PASS: lldb-shell :: ObjectFile/ELF/netbsd-exec-8.99.30-amd64.yaml (1434 of 2153)
PASS: lldb-unit :: Utility/./UtilityTests/SerializationRountripTest.SerializeDeserializeObjectReference (1435 of 2153)
PASS: lldb-api :: types/TestLongTypes.py (1436 of 2153)
PASS: lldb-unit :: UnwindAssembly/x86/./UnwindAssemblyx86Tests/Testx86AssemblyInspectionEngine.TestPopR14 (1437 of 2153)
PASS: lldb-api :: lang/objc/bitfield_ivars/TestBitfieldIvars.py (1438 of 2153)
PASS: lldb-api :: iohandler/unicode/TestUnicode.py (1439 of 2153)
PASS: lldb-api :: lang/cpp/function_refs/TestFunctionRefs.py (1440 of 2153)
PASS: lldb-api :: commands/expression/codegen-crash-typedefdecl-not-in_declcontext/TestCodegenCrashTypedefDeclNotInDeclContext.py (1441 of 2153)
PASS: lldb-api :: lang/cpp/unicode-literals/TestUnicodeLiterals.py (1442 of 2153)
PASS: lldb-api :: commands/expression/radar_9673664/TestExprHelpExamples.py (1443 of 2153)
PASS: lldb-api :: functionalities/thread/concurrent_events/TestConcurrentCrashWithWatchpointBreakpointSignal.py (1444 of 2153)
PASS: lldb-unit :: Utility/./UtilityTests/BroadcasterTest.EventTypeHasListeners (1445 of 2153)
PASS: lldb-api :: functionalities/gdb_remote_client/TestNoWatchpointSupportInfo.py (1446 of 2153)
PASS: lldb-unit :: Utility/./UtilityTests/RegularExpression.Valid (1447 of 2153)
PASS: lldb-unit :: SymbolFile/DWARF/./SymbolFileDWARFTests/SymbolFileDWARFTests.ParseAranges (1448 of 2153)
UNSUPPORTED: lldb-shell :: ScriptInterpreter/Lua/io.test (1449 of 2153)
PASS: lldb-shell :: Minidump/disassemble-no-module.yaml (1450 of 2153)
PASS: lldb-unit :: Utility/./UtilityTests/StringExtractorTest.GetHexU8_Exact (1451 of 2153)
PASS: lldb-unit :: ObjectFile/ELF/./ObjectFileELFTests/ObjectFileELFTest.SectionsResolveConsistently (1452 of 2153)
PASS: lldb-api :: lang/c/stepping/TestThreadStepping.py (1453 of 2153)
PASS: lldb-unit :: Utility/./UtilityTests/UriParserTest.MinimalPath (1454 of 2153)
PASS: lldb-unit :: Expression/./ExpressionTests/DiagnosticManagerTest.GetStringNoDiags (1455 of 2153)
PASS: lldb-api :: lang/objc/foundation/TestFoundationDisassembly.py (1456 of 2153)
PASS: lldb-shell :: Minidump/Windows/arm-fp-unwind.test (1457 of 2153)
PASS: lldb-unit :: Utility/./UtilityTests/NameMatchesTest.Equals (1458 of 2153)
PASS: lldb-shell :: SymbolFile/Breakpad/symtab.test (1459 of 2153)
PASS: lldb-api :: functionalities/memory/find/TestMemoryFind.py (1460 of 2153)
PASS: lldb-api :: commands/expression/call-throws/TestCallThatThrows.py (1461 of 2153)
PASS: lldb-api :: lang/cpp/class-template-parameter-pack/TestClassTemplateParameterPack.py (1462 of 2153)
PASS: lldb-api :: commands/statistics/basic/TestStats.py (1463 of 2153)
PASS: lldb-unit :: UnwindAssembly/x86/./UnwindAssemblyx86Tests/Testx86AssemblyInspectionEngine.TestPopEBP (1464 of 2153)
PASS: lldb-unit :: Language/Highlighting/./HighlighterTests/HighlighterTest.ClangCursorPosEndOfLine (1465 of 2153)
PASS: lldb-api :: commands/expression/xvalue/TestXValuePrinting.py (1466 of 2153)
PASS: lldb-unit :: Editline/./EditlineTests/EditlineTestFixture.EditlineReceivesMultiLineText (1467 of 2153)
UNSUPPORTED: lldb-api :: functionalities/darwin_log/filter/regex/message/TestDarwinLogFilterRegexMessage.py (1468 of 2153)
PASS: lldb-api :: commands/expression/unwind_expression/TestUnwindExpression.py (1469 of 2153)
UNSUPPORTED: lldb-api :: tools/lldb-server/thread-name/TestGdbRemoteThreadName.py (1470 of 2153)
PASS: lldb-unit :: Process/minidump/./LLDBMinidumpTests/MinidumpParserTest.GetPid (1471 of 2153)
PASS: lldb-api :: assert_messages_test/TestAssertMessages.py (1472 of 2153)
PASS: lldb-unit :: Utility/./UtilityTests/StreamTest.ShiftOperatorChars (1473 of 2153)
PASS: lldb-unit :: Utility/./UtilityTests/StringListTest.GetSize (1474 of 2153)
PASS: lldb-api :: lang/objc/objc-class-method/TestObjCClassMethod.py (1475 of 2153)
PASS: lldb-unit :: DataFormatter/./LLDBFormatterTests/TypeMatcherTests.GetMatchStringRegex (1476 of 2153)
PASS: lldb-unit :: ObjectFile/ELF/./ObjectFileELFTests/ObjectFileELFTest.GetSymtab_NoSymEntryPointArmThumbAddressClass (1477 of 2153)
PASS: lldb-api :: functionalities/tail_call_frames/disambiguate_tail_call_seq/TestDisambiguateTailCallSeq.py (1478 of 2153)
PASS: lldb-api :: functionalities/tail_call_frames/disambiguate_paths_to_common_sink/TestDisambiguatePathsToCommonSink.py (1479 of 2153)
PASS: lldb-unit :: UnwindAssembly/x86/./UnwindAssemblyx86Tests/Testx86AssemblyInspectionEngine.TestSimplex86_64Augmented (1480 of 2153)
PASS: lldb-unit :: Utility/./UtilityTests/RangeTest.EqualInvalid (1481 of 2153)
PASS: lldb-api :: lang/cpp/global_variables/TestCPPGlobalVariables.py (1482 of 2153)
PASS: lldb-api :: functionalities/thread/concurrent_events/TestConcurrentManyWatchpoints.py (1483 of 2153)
UNSUPPORTED: lldb-api :: functionalities/breakpoint/breakpoint_in_delayslot/TestAvoidBreakpointInDelaySlot.py (1484 of 2153)
PASS: lldb-unit :: Thread/./ThreadTests/ThreadTest.SetStopInfo (1485 of 2153)
PASS: lldb-api :: macosx/lc-note/kern-ver-str/TestKernVerStrLCNOTE.py (1486 of 2153)
PASS: lldb-unit :: Utility/./UtilityTests/ArgsTest.TestInsertArg (1487 of 2153)
PASS: lldb-api :: tools/lldb-vscode/runInTerminal/TestVSCode_runInTerminal.py (1488 of 2153)
PASS: lldb-unit :: Utility/./UtilityTests/StringListTest.SplitIntoLinesEmpty (1489 of 2153)
PASS: lldb-api :: functionalities/breakpoint/breakpoint_names/TestBreakpointNames.py (1490 of 2153)
PASS: lldb-api :: functionalities/thread/concurrent_events/TestConcurrentSignalWatch.py (1491 of 2153)
PASS: lldb-unit :: Utility/./UtilityTests/OptionsWithRawTest.UnterminatedQuote (1492 of 2153)
UNSUPPORTED: lldb-shell :: SymbolFile/PDB/type-quals.test (1493 of 2153)
PASS: lldb-unit :: Utility/./UtilityTests/RecordReplayTest.InstrumentedBarPtr (1494 of 2153)
PASS: lldb-unit :: UnwindAssembly/x86/./UnwindAssemblyx86Tests/Testx86AssemblyInspectionEngine.Test32bitFramelessSmallStackFrame (1495 of 2153)
PASS: lldb-shell :: ObjectFile/ELF/PT_LOAD-overlap-PT_INTERP.yaml (1496 of 2153)
PASS: lldb-api :: functionalities/thread/concurrent_events/TestConcurrentTwoWatchpointsOneDelayBreakpoint.py (1497 of 2153)
PASS: lldb-api :: commands/watchpoints/watchpoint_size/TestWatchpointSizes.py (1498 of 2153)
PASS: lldb-shell :: VSCode/TestOptions.test (1499 of 2153)
PASS: lldb-api :: commands/expression/import-std-module/shared_ptr/TestSharedPtrFromStdModule.py (1500 of 2153)
PASS: lldb-api :: lang/cpp/dynamic-value/TestCppValueCast.py (1501 of 2153)
PASS: lldb-api :: lang/objc/objc-runtime-ivars/TestRuntimeIvars.py (1502 of 2153)
XFAIL: lldb-shell :: SymbolFile/DWARF/find-type-in-function.cpp (1503 of 2153)
PASS: lldb-unit :: Utility/./UtilityTests/StreamTeeTest.CopyConstructor (1504 of 2153)
PASS: lldb-unit :: Symbol/./SymbolTests/TestClangASTImporter.MetadataPropagation (1505 of 2153)
UNSUPPORTED: lldb-api :: functionalities/darwin_log/filter/regex/activity-chain/TestDarwinLogFilterRegexActivityChain.py (1506 of 2153)
PASS: lldb-api :: functionalities/breakpoint/auto_continue/TestBreakpointAutoContinue.py (1507 of 2153)
PASS: lldb-shell :: SymbolFile/DWARF/DW_AT_data_bit_offset-DW_OP_stack_value.s (1508 of 2153)
UNSUPPORTED: lldb-shell :: SymbolFile/PDB/function-nested-block.test (1509 of 2153)
PASS: lldb-unit :: Language/Highlighting/./HighlighterTests/HighlighterTest.Colons (1510 of 2153)
PASS: lldb-unit :: Utility/./UtilityTests/StreamTeeTest.Flush (1511 of 2153)
PASS: lldb-shell :: SymbolFile/DWARF/debug_loc.s (1512 of 2153)
PASS: lldb-api :: functionalities/data-formatter/summary-string-onfail/Test-rdar-9974002.py (1513 of 2153)
PASS: lldb-api :: commands/expression/import-std-module/weak_ptr/TestWeakPtrFromStdModule.py (1514 of 2153)
PASS: lldb-unit :: UnwindAssembly/x86/./UnwindAssemblyx86Tests/Testx86AssemblyInspectionEngine.TestPushEAX (1515 of 2153)
PASS: lldb-shell :: SymbolFile/DWARF/DW_TAG_variable-DW_AT_const_value.s (1516 of 2153)
PASS: lldb-api :: lang/objc/conflicting-definition/TestConflictingDefinition.py (1517 of 2153)
PASS: lldb-unit :: Process/minidump/./LLDBMinidumpTests/MinidumpParserTest.GetThreadContext_x86_64 (1518 of 2153)
PASS: lldb-unit :: Utility/./UtilityTests/RangeTest.ContainsRangeStartingFromZero (1519 of 2153)
PASS: lldb-api :: types/TestFloatTypes.py (1520 of 2153)
PASS: lldb-api :: commands/session/save/TestSessionSave.py (1521 of 2153)
UNSUPPORTED: lldb-api :: benchmarks/libcxxmap/TestBenchmarkLibcxxMap.py (1522 of 2153)
PASS: lldb-api :: functionalities/unwind/noreturn/module-end/TestNoReturnModuleEnd.py (1523 of 2153)
PASS: lldb-unit :: Signals/./SignalsTests/UnixSignalsTest.GetFilteredSignals (1524 of 2153)
PASS: lldb-api :: lang/cpp/offsetof/TestOffsetofCpp.py (1525 of 2153)
PASS: lldb-unit :: Utility/./UtilityTests/NameMatchesTest.EndsWith (1526 of 2153)
PASS: lldb-api :: python_api/symbol-context/two-files/TestSymbolContextTwoFiles.py (1527 of 2153)
PASS: lldb-api :: lang/cpp/nested-class-other-compilation-unit/TestNestedClassWithParentInAnotherCU.py (1528 of 2153)
PASS: lldb-api :: functionalities/type_completion/TestTypeCompletion.py (1529 of 2153)
PASS: lldb-shell :: Commands/CommandScriptImmediateOutput/CommandScriptImmediateOutputFile.test (1530 of 2153)
PASS: lldb-api :: tools/lldb-server/TestGdbRemote_vCont.py (1531 of 2153)
PASS: lldb-unit :: Utility/./UtilityTests/StringExtractorTest.GetU32BigEndian (1532 of 2153)
PASS: lldb-api :: functionalities/gdb_remote_client/TestStopPCs.py (1533 of 2153)
PASS: lldb-api :: lang/cpp/operator-overload/TestOperatorOverload.py (1534 of 2153)
PASS: lldb-unit :: Utility/./UtilityTests/SharedCluster.ClusterManager (1535 of 2153)
UNSUPPORTED: lldb-shell :: ScriptInterpreter/Lua/lua.test (1536 of 2153)
UNSUPPORTED: lldb-api :: tools/lldb-vscode/completions/TestVSCode_completions.py (1537 of 2153)
PASS: lldb-api :: lang/c/step-target/TestStepTarget.py (1538 of 2153)
PASS: lldb-unit :: SymbolFile/NativePDB/./SymbolFileNativePDBTests/PDBFPOProgramToDWARFExpressionTests.InvalidAssignmentMultiple (1539 of 2153)
PASS: lldb-unit :: Process/minidump/./LLDBMinidumpTests/MinidumpParserTest.GetArchitecture (1540 of 2153)
PASS: lldb-unit :: Utility/./UtilityTests/StringListTest.GetMaxStringLengthEqualSize (1541 of 2153)
PASS: lldb-unit :: Expression/./ExpressionTests/CppModuleConfigurationTest.Sysroot (1542 of 2153)
PASS: lldb-shell :: Commands/command-regex-unalias.test (1543 of 2153)
PASS: lldb-api :: lang/objc/objc-checker/TestObjCCheckers.py (1544 of 2153)
PASS: lldb-shell :: Reproducer/TestHomeDir.test (1545 of 2153)
PASS: lldb-unit :: ScriptInterpreter/Python/./ScriptInterpreterPythonTests/PythonDataObjectsTest.TestPythonStringToStructuredString (1546 of 2153)
PASS: lldb-unit :: Symbol/./SymbolTests/TestTypeSystemClang.TestUnifyAccessSpecifiers (1547 of 2153)
PASS: lldb-unit :: Utility/./UtilityTests/StringListTest.JoinEmpty (1548 of 2153)
PASS: lldb-unit :: Utility/./UtilityTests/ArgsTest.TestQuotedTrailingBackslash (1549 of 2153)
PASS: lldb-unit :: Symbol/./SymbolTests/TestTypeSystemClang.TestDisplayNameEmpty (1550 of 2153)
PASS: lldb-unit :: Utility/./UtilityTests/EnvironmentTest.EnvpConstruction (1551 of 2153)
PASS: lldb-unit :: DataFormatter/./LLDBFormatterTests/TypeMatcherTests.RegexName (1552 of 2153)
PASS: lldb-unit :: Utility/./UtilityTests/RangeVector.CombineConsecutiveRanges (1553 of 2153)
PASS: lldb-shell :: ObjectFile/PECOFF/export-dllfunc.yaml (1554 of 2153)
UNSUPPORTED: lldb-api :: functionalities/darwin_log/filter/exact_match/activity-chain/TestDarwinLogFilterMatchActivityChain.py (1555 of 2153)
PASS: lldb-api :: lang/objc/objc-baseclass-sbtype/TestObjCBaseClassSBType.py (1556 of 2153)
PASS: lldb-unit :: Utility/./UtilityTests/RangeTest.NotEqualInvalid (1557 of 2153)
PASS: lldb-unit :: Language/Highlighting/./HighlighterTests/HighlighterTest.HighlighterSelectionType (1558 of 2153)
PASS: lldb-api :: lang/c/function_types/TestFunctionTypes.py (1559 of 2153)
PASS: lldb-api :: functionalities/tsan/basic/TestTsanBasic.py (1560 of 2153)
PASS: lldb-api :: lang/objc/modules-compile-error/TestModulesCompileError.py (1561 of 2153)
PASS: lldb-api :: lang/cpp/wchar_t/TestCxxWCharT.py (1562 of 2153)
UNSUPPORTED: lldb-api :: functionalities/darwin_log/filter/regex/category/TestDarwinLogFilterRegexCategory.py (1563 of 2153)
PASS: lldb-unit :: Utility/./UtilityTests/LogChannelEnabledTest.LogThread (1564 of 2153)
PASS: lldb-unit :: Process/gdb-remote/./ProcessGdbRemoteTests/GDBRemoteCommunicationServerTest.SendErrorResponse_Status (1565 of 2153)
PASS: lldb-api :: functionalities/inferior-changed/TestInferiorChanged.py (1566 of 2153)
PASS: lldb-unit :: Utility/./UtilityTests/StringListTest.Join (1567 of 2153)
PASS: lldb-unit :: Host/./HostTests/FileSystemTest.GetPermissions (1568 of 2153)
PASS: lldb-unit :: Utility/./UtilityTests/StringExtractorTest.GetHexBytes_OddPair (1569 of 2153)
PASS: lldb-api :: functionalities/thread/num_threads/TestNumThreads.py (1570 of 2153)
PASS: lldb-unit :: UnwindAssembly/x86/./UnwindAssemblyx86Tests/Testx86AssemblyInspectionEngine.TestPushImm (1571 of 2153)
PASS: lldb-shell :: SymbolFile/NativePDB/source-list.cpp (1572 of 2153)
PASS: lldb-api :: sanity/TestModuleCacheSanity.py (1573 of 2153)
PASS: lldb-api :: commands/expression/persistent_types/TestPersistentTypes.py (1574 of 2153)
UNSUPPORTED: lldb-api :: functionalities/thread/state/TestThreadStates.py (1575 of 2153)
PASS: lldb-api :: tools/lldb-vscode/launch/TestVSCode_launch.py (1576 of 2153)
PASS: lldb-unit :: Utility/./UtilityTests/CompletionRequest.TestCompletionOwnership (1577 of 2153)
PASS: lldb-api :: commands/watchpoints/multiple_hits/TestMultipleHits.py (1578 of 2153)
PASS: lldb-shell :: SymbolFile/DWARF/debug_rnglists.s (1579 of 2153)
PASS: lldb-shell :: ObjectFile/ELF/duplicate-section.yaml (1580 of 2153)
PASS: lldb-unit :: Utility/./UtilityTests/BinaryStreamTest.PutSLEB128MaxValue (1581 of 2153)
PASS: lldb-api :: commands/target/stop-hooks/TestStopHooks.py (1582 of 2153)
PASS: lldb-api :: lang/c/offsetof/TestOffsetof.py (1583 of 2153)
PASS: lldb-api :: functionalities/thread/concurrent_events/TestConcurrentManyBreakpoints.py (1584 of 2153)
PASS: lldb-api :: functionalities/thread_plan/TestThreadPlanCommands.py (1585 of 2153)
PASS: lldb-unit :: Utility/./UtilityTests/XcodeSDKTest.SDKSupportsSwift (1586 of 2153)
PASS: lldb-api :: functionalities/thread/concurrent_events/TestConcurrentWatchBreak.py (1587 of 2153)
PASS: lldb-unit :: DataFormatter/./LLDBFormatterTests/FormatManagerTests.CompatibleLangs (1588 of 2153)
PASS: lldb-unit :: debugserver/./debugserverTests/JSON.Parse (1589 of 2153)
PASS: lldb-unit :: Process/gdb-remote/./ProcessGdbRemoteTests/GDBRemoteClientBaseTest.SendContinueDelegateInterface (1590 of 2153)
PASS: lldb-api :: functionalities/breakpoint/source_regexp/TestSourceRegexBreakpoints.py (1591 of 2153)
PASS: lldb-unit :: Utility/./UtilityTests/SerializationRountripTest.SerializeDeserializeCStringNull (1592 of 2153)
PASS: lldb-unit :: Utility/./UtilityTests/StringListTest.ForRange (1593 of 2153)
PASS: lldb-unit :: Language/Highlighting/./HighlighterTests/HighlighterTest.ClangOperators (1594 of 2153)
PASS: lldb-api :: functionalities/postmortem/netbsd-core/TestNetBSDCore.py (1595 of 2153)
PASS: lldb-api :: functionalities/asan/TestReportData.py (1596 of 2153)
PASS: lldb-unit :: Target/./TargetTests/ModuleCacheTest.GetAndPutUuidExists (1597 of 2153)
PASS: lldb-unit :: Core/./LLDBCoreTests/MangledTest.ResultForBlockInvocation (1598 of 2153)
PASS: lldb-unit :: Utility/./UtilityTests/ArgsTest.GetQuotedCommandString (1599 of 2153)
PASS: lldb-api :: lang/cpp/gmodules/TestWithModuleDebugging.py (1600 of 2153)
PASS: lldb-api :: functionalities/data-formatter/data-formatter-skip-summary/TestDataFormatterSkipSummary.py (1601 of 2153)
PASS: lldb-shell :: Expr/TestIRMemoryMap.test (1602 of 2153)
PASS: lldb-unit :: Utility/./UtilityTests/StringListTest.GetMaxStringLengthMixed (1603 of 2153)
PASS: lldb-api :: lang/objc/modules-auto-import/TestModulesAutoImport.py (1604 of 2153)
PASS: lldb-unit :: Utility/./UtilityTests/ArgsTest.Yaml (1605 of 2153)
PASS: lldb-unit :: Utility/./UtilityTests/RangeTest.Clear (1606 of 2153)
PASS: lldb-shell :: Driver/TestTarget.test (1607 of 2153)
PASS: lldb-api :: lang/objc/ivar-IMP/TestObjCiVarIMP.py (1608 of 2153)
PASS: lldb-unit :: Utility/./UtilityTests/DataExtractorTest.GetMaxU64 (1609 of 2153)
PASS: lldb-api :: lang/objc/objc-static-method-stripped/TestObjCStaticMethodStripped.py (1610 of 2153)
PASS: lldb-unit :: Utility/./UtilityTests/ScalarTest.CastOperations (1611 of 2153)
PASS: lldb-unit :: Utility/./UtilityTests/DataExtractorTest.PeekData (1612 of 2153)
PASS: lldb-api :: functionalities/data-formatter/data-formatter-objc/cmtime/TestDataFormatterCMTime.py (1613 of 2153)
PASS: lldb-unit :: Utility/./UtilityTests/StreamTest.PutCString (1614 of 2153)
PASS: lldb-unit :: Utility/./UtilityTests/DataExtractorTest.GetULEB128_bit63 (1615 of 2153)
PASS: lldb-api :: commands/reproducer/invalid-args/TestInvalidArgsReproducer.py (1616 of 2153)
PASS: lldb-unit :: UnwindAssembly/x86/./UnwindAssemblyx86Tests/Testx86AssemblyInspectionEngine.TestPopRBP (1617 of 2153)
PASS: lldb-api :: commands/gui/invalid-args/TestInvalidArgsGui.py (1618 of 2153)
PASS: lldb-unit :: Language/Highlighting/./HighlighterTests/HighlighterTest.ClangSquareBrackets (1619 of 2153)
PASS: lldb-api :: commands/expression/completion-crash-incomplete-record/TestCompletionCrashIncompleteRecord.py (1620 of 2153)
PASS: lldb-unit :: Process/gdb-remote/./ProcessGdbRemoteTests/GDBRemoteCommunicationServerTest.SendErrorResponse_ErrorList (1621 of 2153)
PASS: lldb-unit :: Utility/./UtilityTests/StreamTest.PutHex32ByteOrderBig (1622 of 2153)
PASS: lldb-shell :: Driver/TestProcessAttach.test (1623 of 2153)
PASS: lldb-api :: commands/expression/inline-namespace/TestInlineNamespace.py (1624 of 2153)
PASS: lldb-shell :: ObjectFile/MachO/lc_build_version_notools.yaml (1625 of 2153)
PASS: lldb-unit :: Utility/./UtilityTests/OptionsWithRawTest.ArgsButNoDelimiter (1626 of 2153)
PASS: lldb-unit :: Utility/./UtilityTests/RangeTest.LessThan (1627 of 2153)
PASS: lldb-unit :: Host/./HostTests/HostInfoTest.GetAugmentedArchSpec (1628 of 2153)
PASS: lldb-api :: functionalities/data-formatter/data-formatter-stl/libcxx/tuple/TestDataFormatterLibcxxTuple.py (1629 of 2153)
PASS: lldb-unit :: Process/gdb-remote/./ProcessGdbRemoteTests/GDBRemoteClientBaseTest.SendContinueAndInterrupt (1630 of 2153)
PASS: lldb-api :: tools/lldb-vscode/stackTrace/TestVSCode_stackTrace.py (1631 of 2153)
PASS: lldb-api :: python_api/thread/TestThreadAPI.py (1632 of 2153)
PASS: lldb-unit :: Utility/./UtilityTests/FileSpecTest.Match (1633 of 2153)
PASS: lldb-unit :: Utility/./UtilityTests/RangeDataVector.FindEntryThatContains (1634 of 2153)
PASS: lldb-api :: python_api/exprpath_synthetic/TestExprPathSynthetic.py (1635 of 2153)
PASS: lldb-api :: functionalities/data-formatter/stringprinter/TestStringPrinter.py (1636 of 2153)
PASS: lldb-api :: python_api/class_members/TestSBTypeClassMembers.py (1637 of 2153)
PASS: lldb-api :: api/listeners/TestListener.py (1638 of 2153)
PASS: lldb-api :: python_api/section/TestSectionAPI.py (1639 of 2153)
PASS: lldb-shell :: ScriptInterpreter/Python/sb_address_exception.test (1640 of 2153)
UNSUPPORTED: lldb-shell :: Reproducer/TestLuaImport.test (1641 of 2153)
PASS: lldb-unit :: SymbolFile/DWARF/./SymbolFileDWARFTests/SymbolFileDWARFTests.TestAbbrevValidAttrNullForm (1642 of 2153)
UNSUPPORTED: lldb-shell :: ScriptInterpreter/Lua/watchpoint_callback.test (1643 of 2153)
PASS: lldb-unit :: Utility/./UtilityTests/StringListTest.Assignment (1644 of 2153)
PASS: lldb-unit :: Expression/./ExpressionTests/ClangHostTest.MacOSX (1645 of 2153)
PASS: lldb-api :: functionalities/exec/TestExec.py (1646 of 2153)
PASS: lldb-shell :: SymbolFile/DWARF/parallel-indexing-stress.s (1647 of 2153)
PASS: lldb-unit :: Utility/./UtilityTests/StatusTest.ErrorCodeConstructor (1648 of 2153)
PASS: lldb-unit :: Utility/./UtilityTests/StringLexerTest.AdvanceIf (1649 of 2153)
PASS: lldb-unit :: Utility/./UtilityTests/StructuredDataTest.StringDump (1650 of 2153)
PASS: lldb-unit :: Utility/./UtilityTests/StringExtractorTest.InitMisc (1651 of 2153)
PASS: lldb-api :: python_api/type/TestTypeList.py (1652 of 2153)
UNSUPPORTED: lldb-api :: functionalities/process_save_core/TestProcessSaveCore.py (1653 of 2153)
PASS: lldb-unit :: Utility/./UtilityTests/TimerTest.CategoryTimes2 (1654 of 2153)
UNSUPPORTED: lldb-shell :: SymbolFile/PDB/udt-layout.test (1655 of 2153)
PASS: lldb-unit :: ScriptInterpreter/Python/./ScriptInterpreterPythonTests/PythonDataObjectsTest.TestGlobalNameResolutionWithDot (1656 of 2153)
PASS: lldb-api :: lang/objc/modules-inline-functions/TestModulesInlineFunctions.py (1657 of 2153)
PASS: lldb-api :: lang/cpp/diamond/TestDiamond.py (1658 of 2153)
PASS: lldb-unit :: UnwindAssembly/x86/./UnwindAssemblyx86Tests/Testx86AssemblyInspectionEngine.TestStackRealignMSVC_i386 (1659 of 2153)
PASS: lldb-unit :: SymbolFile/NativePDB/./SymbolFileNativePDBTests/PDBFPOProgramToDWARFExpressionTests.InvalidOpBinary (1660 of 2153)
UNSUPPORTED: lldb-shell :: Register/aarch64-fp-read.test (1661 of 2153)
PASS: lldb-unit :: ObjectFile/Breakpad/./ObjectFileBreakpadTests/StackWinRecord.parse (1662 of 2153)
PASS: lldb-api :: lang/c/stepping/TestStepAndBreakpoints.py (1663 of 2153)
PASS: lldb-unit :: Utility/./UtilityTests/StringExtractorTest.DecodeHexU8_InvalidHex2 (1664 of 2153)
PASS: lldb-api :: functionalities/non-overlapping-index-variable-i/TestIndexVariable.py (1665 of 2153)
PASS: lldb-unit :: Symbol/./SymbolTests/TestClangASTImporter.MetadataPropagationAfterCopying (1666 of 2153)
PASS: lldb-unit :: ScriptInterpreter/Python/./ScriptInterpreterPythonTests/PythonDataObjectsTest.TestPythonDictionaryManipulation (1667 of 2153)
PASS: lldb-unit :: Utility/./UtilityTests/StreamTest.PutHex64ByteOrderLittle (1668 of 2153)
PASS: lldb-api :: functionalities/data-formatter/data-formatter-stl/libcxx/unique_ptr/TestDataFormatterLibcxxUniquePtr.py (1669 of 2153)
PASS: lldb-unit :: Utility/./UtilityTests/StreamTest.AddressPrefix (1670 of 2153)
PASS: lldb-unit :: Utility/./UtilityTests/ConstStringTest.MangledCounterpart (1671 of 2153)
PASS: lldb-unit :: Utility/./UtilityTests/UriParserTest.BracketedHostnameWithPortIPv6 (1672 of 2153)
UNSUPPORTED: lldb-shell :: SymbolFile/PDB/pointers.test (1673 of 2153)
PASS: lldb-unit :: Process/gdb-remote/./ProcessGdbRemoteTests/GDBRemoteCommunicationClientTest.GetModulesInfoInvalidResponse (1674 of 2153)
PASS: lldb-unit :: Process/gdb-remote/./ProcessGdbRemoteTests/GDBRemoteClientBaseTest.SendContinueAndInterrupt2PacketBug (1675 of 2153)
PASS: lldb-api :: macosx/macCatalyst/TestMacCatalyst.py (1676 of 2153)
PASS: lldb-unit :: Utility/./UtilityTests/StreamTeeTest.GetStreamAtIndexOutOfBoundsEmpty (1677 of 2153)
PASS: lldb-api :: types/TestLongTypesExpr.py (1678 of 2153)
PASS: lldb-api :: functionalities/tail_call_frames/thread_step_out_or_return/TestSteppingOutWithArtificialFrames.py (1679 of 2153)
PASS: lldb-unit :: UnwindAssembly/x86/./UnwindAssemblyx86Tests/Testx86AssemblyInspectionEngine.TestPopRBPWithREX (1680 of 2153)
PASS: lldb-api :: functionalities/data-formatter/data-formatter-stl/libcxx/optional/TestDataFormatterLibcxxOptional.py (1681 of 2153)
PASS: lldb-api :: commands/target/stop-hook/disable/TestTargetStopHookDisable.py (1682 of 2153)
PASS: lldb-api :: functionalities/data-formatter/data-formatter-proper-plurals/TestFormattersOneIsSingular.py (1683 of 2153)
PASS: lldb-shell :: Commands/command-backtrace.test (1684 of 2153)
PASS: lldb-unit :: UnwindAssembly/x86/./UnwindAssemblyx86Tests/Testx86AssemblyInspectionEngine.TestPopEBX (1685 of 2153)
PASS: lldb-api :: functionalities/target_var/no_vars/TestTargetVarNoVars.py (1686 of 2153)
PASS: lldb-api :: functionalities/dynamic_value_child_count/TestDynamicValueChildCount.py (1687 of 2153)
PASS: lldb-api :: functionalities/breakpoint/breakpoint_command/TestBreakpointCommand.py (1688 of 2153)
PASS: lldb-unit :: Utility/./UtilityTests/StringListTest.InsertStringAtIndexMove (1689 of 2153)
PASS: lldb-unit :: Utility/./UtilityTests/StreamTeeTest.Constructor2Streams (1690 of 2153)
PASS: lldb-unit :: ScriptInterpreter/Python/./ScriptInterpreterPythonTests/PythonDataObjectsTest.TestGlobalNameResolutionNoDot (1691 of 2153)
PASS: lldb-unit :: Utility/./UtilityTests/StringExtractorTest.DecodeHexU8_Underflow (1692 of 2153)
PASS: lldb-shell :: Process/TestEnvironment.test (1693 of 2153)
PASS: lldb-unit :: Host/./HostTests/SocketAddressTest.GetAddressInfo (1694 of 2153)
PASS: lldb-api :: python_api/debugger/TestDebuggerAPI.py (1695 of 2153)
PASS: lldb-shell :: Settings/TestEchoCommands.test (1696 of 2153)
PASS: lldb-api :: commands/expression/import-std-module/vector-of-vectors/TestVectorOfVectorsFromStdModule.py (1697 of 2153)
PASS: lldb-api :: functionalities/gdb_remote_client/TestNestedRegDefinitions.py (1698 of 2153)
PASS: lldb-api :: python_api/symbol-context/TestSymbolContext.py (1699 of 2153)
PASS: lldb-unit :: DataFormatter/./LLDBFormatterTests/TypeMatcherTests.RegexMatchPart (1700 of 2153)
PASS: lldb-unit :: Utility/./UtilityTests/StringListTest.JoinMultiCharSeparator (1701 of 2153)
PASS: lldb-api :: functionalities/data-formatter/synthcapping/TestSyntheticCapping.py (1702 of 2153)
PASS: lldb-unit :: ObjectFile/Breakpad/./ObjectFileBreakpadTests/FuncRecord.parse (1703 of 2153)
PASS: lldb-unit :: Utility/./UtilityTests/StringListTest.SetSize (1704 of 2153)
PASS: lldb-api :: tools/lldb-server/inferior-crash/TestGdbRemoteAbort.py (1705 of 2153)
PASS: lldb-unit :: Utility/./UtilityTests/StatusTest.Formatv (1706 of 2153)
PASS: lldb-api :: functionalities/data-formatter/data-formatter-objc/TestDataFormatterObjCPlain.py (1707 of 2153)
PASS: lldb-api :: functionalities/plugins/python_os_plugin/stepping_plugin_threads/TestOSPluginStepping.py (1708 of 2153)
PASS: lldb-unit :: Disassembler/./DisassemblerTests/TestArmv7Disassembly.TestCortexFPDisass (1709 of 2153)
PASS: lldb-api :: lang/objc/modules-non-objc-target/TestObjCModulesNonObjCTarget.py (1710 of 2153)
PASS: lldb-api :: functionalities/signal/TestSendSignal.py (1711 of 2153)
PASS: lldb-unit :: Utility/./UtilityTests/XcodeSDKTest.ParseTest (1712 of 2153)
PASS: lldb-unit :: ObjectFile/PECOFF/./ObjectFilePECOFFTests/PECallFrameInfoTest.Chained_eh (1713 of 2153)
PASS: lldb-unit :: UnwindAssembly/x86/./UnwindAssemblyx86Tests/Testx86AssemblyInspectionEngine.TestPushESI (1714 of 2153)
PASS: lldb-unit :: ObjectFile/Breakpad/./ObjectFileBreakpadTests/InfoRecord.parse (1715 of 2153)
PASS: lldb-api :: api/multiple-targets/TestMultipleTargets.py (1716 of 2153)
PASS: lldb-shell :: SymbolFile/DWARF/DW_AT_const_value-bitfields.s (1717 of 2153)
UNSUPPORTED: lldb-api :: functionalities/unwind/ehframe/TestEhFrameUnwind.py (1718 of 2153)
PASS: lldb-unit :: Utility/./UtilityTests/StringListTest.InsertStringAtIndexStdString (1719 of 2153)
PASS: lldb-shell :: SymbolFile/DWARF/debug-line-basic.s (1720 of 2153)
PASS: lldb-shell :: SymbolFile/NativePDB/bitfields.cpp (1721 of 2153)
PASS: lldb-api :: commands/expression/radar_9531204/TestPrintfAfterUp.py (1722 of 2153)
PASS: lldb-api :: functionalities/data-formatter/builtin-formats/TestBuiltinFormats.py (1723 of 2153)
PASS: lldb-unit :: UnwindAssembly/x86/./UnwindAssemblyx86Tests/Testx86AssemblyInspectionEngine.TestPushR13 (1724 of 2153)
UNSUPPORTED: lldb-api :: functionalities/darwin_log/basic/TestDarwinLogBasic.py (1725 of 2153)
PASS: lldb-unit :: Utility/./UtilityTests/StreamTest.Indent (1726 of 2153)
PASS: lldb-api :: functionalities/gdb_remote_client/TestWasm.py (1727 of 2153)
PASS: lldb-unit :: Utility/./UtilityTests/AnsiTerminal.AtStart (1728 of 2153)
PASS: lldb-api :: functionalities/breakpoint/hardware_breakpoints/require_hw_breakpoints/TestRequireHWBreakpoints.py (1729 of 2153)
UNSUPPORTED: lldb-api :: commands/target/auto-install-main-executable/TestAutoInstallMainExecutable.py (1730 of 2153)
PASS: lldb-unit :: Utility/./UtilityTests/StreamTest.PutHex16ByteOrderBig (1731 of 2153)
PASS: lldb-unit :: Utility/./UtilityTests/PassiveReplayTest.InstrumentedFoo (1732 of 2153)
PASS: lldb-api :: commands/expression/import-std-module/basic/TestImportStdModule.py (1733 of 2153)
PASS: lldb-unit :: Utility/./UtilityTests/RecordReplayTest.InstrumentedBar (1734 of 2153)
PASS: lldb-api :: functionalities/data-formatter/typedef_array/TestTypedefArray.py (1735 of 2153)
PASS: lldb-api :: lang/cpp/scope/TestCppScope.py (1736 of 2153)
PASS: lldb-unit :: Interpreter/./InterpreterTests/CompletionTest.FileCompletionAbsolute (1737 of 2153)
PASS: lldb-shell :: Process/TestAbortExitCode.test (1738 of 2153)
PASS: lldb-unit :: Utility/./UtilityTests/StatusTest.ErrorConstructor (1739 of 2153)
PASS: lldb-unit :: Utility/./UtilityTests/StreamTeeTest.AppendStream (1740 of 2153)
PASS: lldb-api :: lang/cpp/covariant-return-types/TestCovariantReturnTypes.py (1741 of 2153)
PASS: lldb-api :: commands/expression/scoped_enums/TestScopedEnumType.py (1742 of 2153)
PASS: lldb-shell :: SymbolFile/DWARF/dwarf5-debug_line.s (1743 of 2153)
PASS: lldb-shell :: ObjectFile/ELF/netbsd-core-amd64.test (1744 of 2153)
PASS: lldb-shell :: SymbolFile/NativePDB/function-types-builtins.cpp (1745 of 2153)
PASS: lldb-api :: functionalities/thread/concurrent_events/TestConcurrentDelayWatchBreak.py (1746 of 2153)
PASS: lldb-unit :: SymbolFile/DWARF/./SymbolFileDWARFTests/SymbolFileDWARFTests.TestAbbrevInvalidNULLTag (1747 of 2153)
PASS: lldb-shell :: SymbolFile/DWARF/find-method.cpp (1748 of 2153)
PASS: lldb-unit :: Utility/./UtilityTests/UriParserTest.BadPort2 (1749 of 2153)
PASS: lldb-shell :: SymbolFile/DWARF/DW_AT_declaration-with-children.s (1750 of 2153)
PASS: lldb-unit :: Utility/./UtilityTests/StringLexerTest.NextIf (1751 of 2153)
PASS: lldb-unit :: Symbol/./SymbolTests/PostfixExpression.ParseFPOProgram (1752 of 2153)
PASS: lldb-shell :: ScriptInterpreter/Python/python.test (1753 of 2153)
UNSUPPORTED: lldb-shell :: ScriptInterpreter/Lua/quit.test (1754 of 2153)
UNSUPPORTED: lldb-api :: benchmarks/frame_variable/TestFrameVariableResponse.py (1755 of 2153)
PASS: lldb-unit :: SymbolFile/NativePDB/./SymbolFileNativePDBTests/PDBFPOProgramToDWARFExpressionTests.UnknownOp (1756 of 2153)
PASS: lldb-unit :: Utility/./UtilityTests/StreamTeeTest.GetStreamAtIndexOutOfBounds (1757 of 2153)
PASS: lldb-unit :: Utility/./UtilityTests/StringListTest.AppendListCStringArrayEmpty (1758 of 2153)
PASS: lldb-api :: functionalities/dead-strip/TestDeadStrip.py (1759 of 2153)
PASS: lldb-unit :: Utility/./UtilityTests/StreamTest.PutBytesAsRawHex8ToBigEndian (1760 of 2153)
UNSUPPORTED: lldb-api :: tools/lldb-server/TestGdbRemoteAuxvSupport.py (1761 of 2153)
PASS: lldb-unit :: Process/gdb-remote/./ProcessGdbRemoteTests/GDBRemoteCommunicationTest.ReadPacket_checksum (1762 of 2153)
PASS: lldb-shell :: Quit/TestQuitExitCodeNonInt.test (1763 of 2153)
PASS: lldb-api :: functionalities/conditional_break/TestConditionalBreak.py (1764 of 2153)
UNSUPPORTED: lldb-shell :: Register/aarch64-gp-read.test (1765 of 2153)
PASS: lldb-unit :: Host/./HostTests/SocketTest.TCPListen0ConnectAccept (1766 of 2153)
PASS: lldb-unit :: Utility/./UtilityTests/ProcessInstanceInfo.Dump (1767 of 2153)
PASS: lldb-unit :: Utility/./UtilityTests/FileSpecTest.FileAndDirectoryComponents (1768 of 2153)
PASS: lldb-api :: python_api/value/empty_class/TestValueAPIEmptyClass.py (1769 of 2153)
PASS: lldb-shell :: SymbolFile/NativePDB/ast-functions.cpp (1770 of 2153)
PASS: lldb-api :: lang/cpp/std-function-step-into-callable/TestStdFunctionStepIntoCallable.py (1771 of 2153)
PASS: lldb-shell :: Reproducer/TestDSYM.test (1772 of 2153)
PASS: lldb-shell :: SymbolFile/NativePDB/ast-methods.cpp (1773 of 2153)
PASS: lldb-unit :: Utility/./UtilityTests/AnsiTerminal.Empty (1774 of 2153)
PASS: lldb-shell :: SymbolFile/NativePDB/ast-types.cpp (1775 of 2153)
PASS: lldb-api :: functionalities/data-formatter/data-formatter-stl/libcxx/queue/TestDataFormatterLibcxxQueue.py (1776 of 2153)
PASS: lldb-api :: functionalities/thread/exit_during_expression/TestExitDuringExpression.py (1777 of 2153)
PASS: lldb-unit :: Utility/./UtilityTests/StreamTest.PutMaxHex64ByteOrderLittle (1778 of 2153)
PASS: lldb-shell :: ObjectFile/ELF/many-sections.s (1779 of 2153)
PASS: lldb-unit :: ScriptInterpreter/Python/./ScriptInterpreterPythonTests/PythonDataObjectsTest.TestPythonListToStructuredList (1780 of 2153)
PASS: lldb-shell :: ObjectFile/wasm/embedded-debug-sections.yaml (1781 of 2153)
PASS: lldb-unit :: SymbolFile/NativePDB/./SymbolFileNativePDBTests/PDBFPOProgramToDWARFExpressionTests.MultipleDependentAssignments (1782 of 2153)
PASS: lldb-shell :: Driver/TestError.test (1783 of 2153)
PASS: lldb-unit :: Utility/./UtilityTests/StringLexerTest.Peek (1784 of 2153)
PASS: lldb-api :: lang/c/complex_int/TestComplexInt.py (1785 of 2153)
PASS: lldb-api :: python_api/sbstructureddata/TestStructuredDataAPI.py (1786 of 2153)
PASS: lldb-unit :: Utility/./UtilityTests/StringListTest.ForRangeEmpty (1787 of 2153)
PASS: lldb-unit :: debugserver/./debugserverTests/RNBSocket.LoopBackListenIPv6 (1788 of 2153)
UNSUPPORTED: lldb-shell :: ScriptInterpreter/Lua/persistent_state.test (1789 of 2153)
PASS: lldb-unit :: Utility/./UtilityTests/ArgsTest.ReplaceArgumentAtIndexLonger (1790 of 2153)
PASS: lldb-unit :: Interpreter/./InterpreterTests/OptionArgParserTest.toChar (1791 of 2153)
PASS: lldb-shell :: ObjectFile/ELF/PT_LOAD-overlap-section.yaml (1792 of 2153)
PASS: lldb-api :: lang/cpp/elaborated-types/TestElaboratedTypes.py (1793 of 2153)
PASS: lldb-api :: tools/lldb-server/register-reading/TestGdbRemoteGPacket.py (1794 of 2153)
PASS: lldb-unit :: Utility/./UtilityTests/RegisterValueTest.GetSet8 (1795 of 2153)
PASS: lldb-shell :: Commands/command-target-modules-dump-sections.yaml (1796 of 2153)
PASS: lldb-api :: functionalities/thread/concurrent_events/TestConcurrentSignalDelayWatch.py (1797 of 2153)
PASS: lldb-api :: lang/objc/ptr_refs/TestPtrRefsObjC.py (1798 of 2153)
PASS: lldb-unit :: Core/./LLDBCoreTests/RichManglingContextTest.Basic (1799 of 2153)
PASS: lldb-api :: lang/objc/modules-hash-mismatch/TestClangModulesHashMismatch.py (1800 of 2153)
PASS: lldb-unit :: Utility/./UtilityTests/ScalarTest.Promotion (1801 of 2153)
PASS: lldb-unit :: Process/gdb-remote/./ProcessGdbRemoteTests/GDBRemoteCommunicationServerTest.SendErrorResponse_StringError (1802 of 2153)
PASS: lldb-unit :: Utility/./UtilityTests/RecordReplayTest.InstrumentedBarRef (1803 of 2153)
PASS: lldb-unit :: Utility/./UtilityTests/StringExtractorTest.GetHexU8_Underflow2 (1804 of 2153)
UNSUPPORTED: lldb-api :: functionalities/data-formatter/data-formatter-stl/libstdcpp/smart_ptr/TestDataFormatterStdSmartPtr.py (1805 of 2153)
UNSUPPORTED: lldb-api :: functionalities/darwin_log/filter/exact_match/category/TestDarwinLogFilterMatchCategory.py (1806 of 2153)
PASS: lldb-api :: commands/expression/dollar-in-variable/TestDollarInVariable.py (1807 of 2153)
PASS: lldb-api :: commands/expression/multiline-completion/TestMultilineCompletion.py (1808 of 2153)
PASS: lldb-api :: driver/batch_mode/TestBatchMode.py (1809 of 2153)
PASS: lldb-unit :: Platform/./LLDBPlatformTests/PlatformAppleSimulatorTest.TestSimHasSimEnvionament (1810 of 2153)
PASS: lldb-api :: lang/c/struct_types/TestStructTypes.py (1811 of 2153)
PASS: lldb-shell :: SymbolFile/DWARF/debug_line-tombstone.s (1812 of 2153)
PASS: lldb-api :: commands/frame/diagnose/dereference-function-return/TestDiagnoseDereferenceFunctionReturn.py (1813 of 2153)
PASS: lldb-api :: functionalities/breakpoint/breakpoint_ids/TestBreakpointIDs.py (1814 of 2153)
PASS: lldb-api :: commands/process/signal/TestProcessSignal.py (1815 of 2153)
PASS: lldb-api :: lang/objcxx/hide-runtime-values/TestObjCXXHideRuntimeValues.py (1816 of 2153)
PASS: lldb-api :: lang/c/forward/TestForwardDeclaration.py (1817 of 2153)
PASS: lldb-api :: functionalities/data-formatter/data-formatter-stl/libcxx/bitset/TestDataFormatterLibcxxBitset.py (1818 of 2153)
PASS: lldb-api :: lang/objc/objc-dyn-sbtype/TestObjCDynamicSBType.py (1819 of 2153)
PASS: lldb-shell :: SymbolFile/DWARF/debug-types-line-tables.s (1820 of 2153)
PASS: lldb-unit :: UnwindAssembly/ARM64/./Arm64InstEmulationTests/TestArm64InstEmulation.TestCFARegisterTrackedAcrossJumps (1821 of 2153)
PASS: lldb-api :: lang/cpp/subst_template_type_param/TestSubstTemplateTypeParam.py (1822 of 2153)
PASS: lldb-shell :: SymbolFile/NativePDB/locate-pdb.cpp (1823 of 2153)
PASS: lldb-unit :: UnwindAssembly/x86/./UnwindAssemblyx86Tests/Testx86AssemblyInspectionEngine.Test32bitFramelessBigStackFrame (1824 of 2153)
PASS: lldb-unit :: Utility/./UtilityTests/StringExtractorTest.GetHexU8_Extra_NoEof (1825 of 2153)
PASS: lldb-api :: lang/cpp/exceptions/TestCPPExceptionBreakpoints.py (1826 of 2153)
PASS: lldb-api :: functionalities/breakpoint/debugbreak/TestDebugBreak.py (1827 of 2153)
UNSUPPORTED: lldb-shell :: Register/x86-ymm-read.test (1828 of 2153)
UNSUPPORTED: lldb-shell :: SymbolFile/PDB/ast-restore.test (1829 of 2153)
PASS: lldb-shell :: ObjectFile/ELF/minidebuginfo-corrupt-xz.yaml (1830 of 2153)
PASS: lldb-unit :: Symbol/./SymbolTests/TestTypeSystemClang.TestGetTypeClassDeclType (1831 of 2153)
PASS: lldb-api :: functionalities/data-formatter/varscript_formatting/TestDataFormatterVarScriptFormatting.py (1832 of 2153)
PASS: lldb-api :: functionalities/gdb_remote_client/TestGDBRemoteLoad.py (1833 of 2153)
PASS: lldb-api :: lang/cpp/breakpoint-commands/TestCPPBreakpointCommands.py (1834 of 2153)
PASS: lldb-unit :: Utility/./UtilityTests/LogChannelTest.Enable (1835 of 2153)
PASS: lldb-api :: iohandler/completion/TestIOHandlerCompletion.py (1836 of 2153)
PASS: lldb-unit :: Utility/./UtilityTests/RangeDataVector.FindEntryThatContains_Overlap (1837 of 2153)
PASS: lldb-unit :: Utility/./UtilityTests/StringExtractorTest.GetHexU8_InvalidHex (1838 of 2153)
PASS: lldb-shell :: SymbolFile/Breakpad/unwind-via-stack-win-no-memory-info.yaml (1839 of 2153)
PASS: lldb-unit :: Target/./TargetTests/RemoteAwarePlatformTest.TestResolveExecutabelOnClientByPlatform (1840 of 2153)
PASS: lldb-api :: commands/expression/namespace_local_var_same_name_cpp_and_c/TestNamespaceLocalVarSameNameCppAndC.py (1841 of 2153)
PASS: lldb-api :: python_api/process/io/TestProcessIO.py (1842 of 2153)
PASS: lldb-api :: functionalities/lazy-loading/TestLazyLoading.py (1843 of 2153)
UNSUPPORTED: lldb-shell :: SymbolFile/DWARF/split-dwarf-expression-eval-bug.cpp (1844 of 2153)
PASS: lldb-api :: commands/breakpoint/command/list/TestBreakpointCommandList.py (1845 of 2153)
PASS: lldb-unit :: Host/./HostTests/NativeProcessProtocolTest.SetBreakpoint (1846 of 2153)
PASS: lldb-unit :: Expression/./ExpressionTests/CppModuleConfigurationTest.UnrelatedLibrary (1847 of 2153)
PASS: lldb-unit :: ScriptInterpreter/Python/./ScriptInterpreterPythonTests/PythonDataObjectsTest.TestPythonStringToStr (1848 of 2153)
UNSUPPORTED: lldb-api :: functionalities/darwin_log/filter/regex/subsystem/TestDarwinLogFilterRegexSubsystem.py (1849 of 2153)
PASS: lldb-unit :: Process/gdb-remote/./ProcessGdbRemoteTests/GDBRemoteCommunicationClientTest.SendGetTraceConfigPacket (1850 of 2153)
UNSUPPORTED: lldb-shell :: SymbolFile/PDB/function-level-linking.test (1851 of 2153)
PASS: lldb-api :: functionalities/thread/step_until/TestStepUntil.py (1852 of 2153)
PASS: lldb-api :: commands/expression/persistent_variables/TestPersistentVariables.py (1853 of 2153)
PASS: lldb-api :: commands/watchpoints/watchpoint_commands/command/TestWatchpointCommandLLDB.py (1854 of 2153)
PASS: lldb-unit :: Process/minidump/./LLDBMinidumpTests/MinidumpParserTest.GetThreadContext_x86_32_wow64 (1855 of 2153)
PASS: lldb-api :: lang/objc/objc-new-syntax/TestObjCNewSyntaxArray.py (1856 of 2153)
PASS: lldb-api :: functionalities/data-formatter/data-formatter-caching/TestDataFormatterCaching.py (1857 of 2153)
PASS: lldb-api :: functionalities/thread/concurrent_events/TestConcurrentCrashWithBreak.py (1858 of 2153)
PASS: lldb-unit :: Language/Highlighting/./HighlighterTests/HighlighterTest.ClangEmptyInput (1859 of 2153)
PASS: lldb-unit :: tools/lldb-server/tests/./LLDBServerTests/TestBase.DebugserverEnv (1860 of 2153)
PASS: lldb-unit :: UnwindAssembly/x86/./UnwindAssemblyx86Tests/Testx86AssemblyInspectionEngine.TestPopRBX (1861 of 2153)
PASS: lldb-unit :: Utility/./UtilityTests/RangeTest.Equal (1862 of 2153)
PASS: lldb-unit :: Expression/./ExpressionTests/DWARFExpression.DW_OP_unknown (1863 of 2153)
PASS: lldb-api :: lang/objc/foundation/TestObjCMethodsNSArray.py (1864 of 2153)
PASS: lldb-unit :: Utility/./UtilityTests/StringExtractorTest.GetNameColonValueNoColon (1865 of 2153)
PASS: lldb-unit :: Interpreter/./InterpreterTests/OptionArgParserTest.toScriptLanguage (1866 of 2153)
PASS: lldb-api :: commands/platform/basic/TestPlatformCommand.py (1867 of 2153)
PASS: lldb-api :: commands/watchpoints/step_over_watchpoint/TestStepOverWatchpoint.py (1868 of 2153)
PASS: lldb-shell :: SymbolFile/dissassemble-entry-point.s (1869 of 2153)
PASS: lldb-shell :: SymbolFile/NativePDB/s_constant.cpp (1870 of 2153)
PASS: lldb-unit :: Utility/./UtilityTests/ProcessInstanceInfo.DumpTable_invalidUID (1871 of 2153)
PASS: lldb-unit :: Target/./TargetTests/ExecutionContextTest.GetByteOrderTarget (1872 of 2153)
PASS: lldb-unit :: Utility/./UtilityTests/RangeTest.Constructor (1873 of 2153)
PASS: lldb-unit :: Utility/./UtilityTests/StringExtractorTest.InitEmpty (1874 of 2153)
PASS: lldb-unit :: ScriptInterpreter/Python/./ScriptInterpreterPythonTests/PythonDataObjectsTest.TestPythonListManipulation (1875 of 2153)
PASS: lldb-api :: functionalities/show_location/TestShowLocationDwarf5.py (1876 of 2153)
PASS: lldb-unit :: Process/./ProcessEventDataTests/ProcessEventDataTest.ShouldStop (1877 of 2153)
PASS: lldb-api :: commands/expression/persist_objc_pointeetype/TestPersistObjCPointeeType.py (1878 of 2153)
PASS: lldb-api :: commands/frame/language/TestGuessLanguage.py (1879 of 2153)
PASS: lldb-api :: functionalities/data-formatter/data-formatter-objc/TestDataFormatterObjCNSData.py (1880 of 2153)
PASS: lldb-shell :: ObjectFile/ELF/compressed-sections.yaml (1881 of 2153)
PASS: lldb-unit :: Symbol/./SymbolTests/TestTypeSystemClang.TestDisplayName (1882 of 2153)
PASS: lldb-unit :: Utility/./UtilityTests/BinaryStreamTest.PutSLEB128FourBytes (1883 of 2153)
PASS: lldb-unit :: Utility/./UtilityTests/ProcessInstanceInfoList.Yaml (1884 of 2153)
PASS: lldb-unit :: Utility/./UtilityTests/StreamTest.PutRawBytesToBigEndian (1885 of 2153)
PASS: lldb-shell :: Reproducer/TestProcessList.test (1886 of 2153)
PASS: lldb-api :: functionalities/inferior-assert/TestInferiorAssert.py (1887 of 2153)
PASS: lldb-unit :: UnwindAssembly/x86/./UnwindAssemblyx86Tests/Testx86AssemblyInspectionEngine.TestLEAVE (1888 of 2153)
UNSUPPORTED: lldb-shell :: ScriptInterpreter/Lua/bindings.test (1889 of 2153)
PASS: lldb-api :: commands/expression/import_builtin_fileid/TestImportBuiltinFileID.py (1890 of 2153)
PASS: lldb-api :: commands/expression/import-std-module/pair/TestPairFromStdModule.py (1891 of 2153)
PASS: lldb-unit :: Host/./HostTests/FileSystemTest.EnumerateDirectory (1892 of 2153)
UNSUPPORTED: lldb-api :: linux/thread/create_during_instruction_step/TestCreateDuringInstructionStep.py (1893 of 2153)
PASS: lldb-api :: commands/target/create-deps/TestTargetCreateDeps.py (1894 of 2153)
PASS: lldb-shell :: SymbolFile/DWARF/DW_AT_location-DW_AT_const_value.s (1895 of 2153)
PASS: lldb-api :: functionalities/data-formatter/parray/TestPrintArray.py (1896 of 2153)
PASS: lldb-shell :: SymbolFile/Breakpad/line-table.test (1897 of 2153)
PASS: lldb-unit :: Utility/./UtilityTests/LogChannelTest.EnableOptions (1898 of 2153)
PASS: lldb-shell :: SymbolFile/DWARF/dwarf5-atomic.s (1899 of 2153)
PASS: lldb-shell :: SymbolFile/DWARF/DW_TAG_variable-invalid_location.s (1900 of 2153)
PASS: lldb-unit :: Utility/./UtilityTests/PassiveReplayTest.InstrumentedBarRef (1901 of 2153)
UNSUPPORTED: lldb-api :: functionalities/darwin_log/filter/exact_match/message/TestDarwinLogFilterMatchMessage.py (1902 of 2153)
PASS: lldb-shell :: ObjectFile/ELF/section-addresses.yaml (1903 of 2153)
PASS: lldb-shell :: SymbolFile/DWARF/compilercontext.ll (1904 of 2153)
PASS: lldb-unit :: Utility/./UtilityTests/UriParserTest.BracketedHostnameWithPortIPv4 (1905 of 2153)
PASS: lldb-api :: functionalities/breakpoint/objc/TestObjCBreakpoints.py (1906 of 2153)
PASS: lldb-shell :: ObjectFile/ELF/PT_LOAD-overlap.yaml (1907 of 2153)
PASS: lldb-unit :: Utility/./UtilityTests/StreamTest.PutChar (1908 of 2153)
PASS: lldb-unit :: Process/gdb-remote/./ProcessGdbRemoteTests/GDBRemoteClientBaseTest.SendPacketAndReceiveResponseWithOutputSupport (1909 of 2153)
PASS: lldb-api :: functionalities/breakpoint/consecutive_breakpoints/TestConsecutiveBreakpoints.py (1910 of 2153)
PASS: lldb-unit :: Utility/./UtilityTests/StringLexerTest.PutBack (1911 of 2153)
PASS: lldb-api :: commands/expression/top-level/TestTopLevelExprs.py (1912 of 2153)
PASS: lldb-api :: commands/frame/var/TestFrameVar.py (1913 of 2153)
PASS: lldb-shell :: SymbolFile/DWARF/gnu-style-compression.cpp (1914 of 2153)
PASS: lldb-unit :: Utility/./UtilityTests/SubsystemRAIITest.SubsystemWithErrorFailure (1915 of 2153)
PASS: lldb-api :: functionalities/thread/concurrent_events/TestConcurrentManyCrash.py (1916 of 2153)
PASS: lldb-api :: lang/objc/objc-ivar-protocols/TestIvarProtocols.py (1917 of 2153)
PASS: lldb-unit :: Utility/./UtilityTests/Flags.IsClear (1918 of 2153)
PASS: lldb-unit :: Core/./LLDBCoreTests/CommunicationTest.SynchronizeWhileClosing (1919 of 2153)
UNSUPPORTED: lldb-api :: commands/expression/call-restarts/TestCallThatRestarts.py (1920 of 2153)
PASS: lldb-unit :: Utility/./UtilityTests/ArchSpecTest.TestParseMachCPUDashSubtypeTripleExtra (1921 of 2153)
PASS: lldb-api :: macosx/save_crashlog/TestSaveCrashlog.py (1922 of 2153)
PASS: lldb-api :: functionalities/data-formatter/data-formatter-cpp/TestDataFormatterCpp.py (1923 of 2153)
PASS: lldb-unit :: UnwindAssembly/x86/./UnwindAssemblyx86Tests/Testx86AssemblyInspectionEngine.Test64bitFramelessBigStackFrame (1924 of 2153)
PASS: lldb-shell :: Minidump/memory-region-from-module.yaml (1925 of 2153)
PASS: lldb-api :: commands/expression/import-std-module/deque-basic/TestDequeFromStdModule.py (1926 of 2153)
PASS: lldb-unit :: Process/minidump/./LLDBMinidumpTests/MinidumpParserTest.GetMiscInfo_no_stream (1927 of 2153)
PASS: lldb-unit :: Utility/./UtilityTests/FileSpecTest.CopyByAppendingPathComponent (1928 of 2153)
PASS: lldb-api :: functionalities/data-formatter/nssetsynth/TestNSSetSynthetic.py (1929 of 2153)
PASS: lldb-api :: commands/expression/calculator_mode/TestCalculatorMode.py (1930 of 2153)
PASS: lldb-api :: commands/command/delete/TestCommandDelete.py (1931 of 2153)
PASS: lldb-unit :: Utility/./UtilityTests/StringListTest.ShiftMove (1932 of 2153)
PASS: lldb-shell :: SymbolFile/DWARF/debug-names-compressed.cpp (1933 of 2153)
UNSUPPORTED: lldb-shell :: Register/x86-gp-read.test (1934 of 2153)
PASS: lldb-unit :: Utility/./UtilityTests/StringListTest.InsertStringAtIndexEnd (1935 of 2153)
PASS: lldb-unit :: Utility/./UtilityTests/StreamTest.AddressSuffix (1936 of 2153)
PASS: lldb-unit :: Utility/./UtilityTests/UriParserTest.MinimalPort (1937 of 2153)
PASS: lldb-unit :: Utility/./UtilityTests/FileSpecTest.Equal (1938 of 2153)
PASS: lldb-shell :: Driver/LocalLLDBInit.test (1939 of 2153)
PASS: lldb-unit :: Utility/./UtilityTests/OptionsWithRawTest.EmptySuffixSingleWhitespace (1940 of 2153)
PASS: lldb-unit :: ScriptInterpreter/Python/./ScriptInterpreterPythonTests/PythonDataObjectsTest.TestTypeNameResolutionNoDot (1941 of 2153)
PASS: lldb-unit :: Utility/./UtilityTests/StringExtractorTest.GetHexBytesAvail_OddPair (1942 of 2153)
PASS: lldb-api :: functionalities/thread/concurrent_events/TestConcurrentCrashWithSignal.py (1943 of 2153)
PASS: lldb-unit :: Symbol/./SymbolTests/DWARFCallFrameInfoTest.Basic_dwarf4 (1944 of 2153)
PASS: lldb-unit :: Utility/./UtilityTests/StringExtractorTest.GetHexBytesAvail_FullString (1945 of 2153)
PASS: lldb-unit :: Host/./HostTests/FileSystemTest.Resolve (1946 of 2153)
PASS: lldb-api :: python_api/value/change_values/TestChangeValueAPI.py (1947 of 2153)
PASS: lldb-unit :: Symbol/./SymbolTests/TestClangASTImporter.DeportDeclTagDecl (1948 of 2153)
PASS: lldb-unit :: Utility/./UtilityTests/SerializationRountripTest.SerializeDeserializeCStringArray (1949 of 2153)
PASS: lldb-unit :: Utility/./UtilityTests/SerializationRountripTest.SerializeDeserializeCString (1950 of 2153)
PASS: lldb-api :: functionalities/inferior-crashing/TestInferiorCrashingStep.py (1951 of 2153)
PASS: lldb-unit :: ScriptInterpreter/Python/./ScriptInterpreterPythonTests/PythonDataObjectsTest.TestResetting (1952 of 2153)
PASS: lldb-unit :: Utility/./UtilityTests/NameMatchesTest.Contains (1953 of 2153)
PASS: lldb-unit :: ScriptInterpreter/Python/./ScriptInterpreterPythonTests/PythonDataObjectsTest.TestPythonInteger (1954 of 2153)
PASS: lldb-unit :: Utility/./UtilityTests/StringExtractorTest.GetU64LittleEndian (1955 of 2153)
PASS: lldb-shell :: Breakpoint/single-file-split-dwarf.test (1956 of 2153)
PASS: lldb-unit :: Utility/./UtilityTests/UriParserTest.TypicalPortPathIPv4 (1957 of 2153)
FAIL: lldb-api :: commands/target/stop-hooks/TestStopHookScripted.py (1958 of 2153)
******************** TEST 'lldb-api :: commands/target/stop-hooks/TestStopHookScripted.py' FAILED ********************
Script:
--
/usr/local/Frameworks/Python.framework/Versions/3.7/bin/python3.7 /Users/buildslave/jenkins/workspace/lldb-cmake/llvm-project/lldb/test/API/dotest.py -s /Users/buildslave/jenkins/workspace/lldb-cmake/lldb-build/lldb-test-traces -S nm -u CXXFLAGS -u CFLAGS --codesign-identity - --server /Users/buildslave/jenkins/workspace/lldb-cmake/lldb-build/./bin/debugserver --arch x86_64 --build-dir /Users/buildslave/jenkins/workspace/lldb-cmake/lldb-build/lldb-test-build.noindex -s=/Users/buildslave/jenkins/workspace/lldb-cmake/test/logs -t --env TERM=vt100 --env LLVM_LIBS_DIR=/Users/buildslave/jenkins/workspace/lldb-cmake/lldb-build/./lib --arch x86_64 --build-dir /Users/buildslave/jenkins/workspace/lldb-cmake/lldb-build/lldb-test-build.noindex --lldb-module-cache-dir /Users/buildslave/jenkins/workspace/lldb-cmake/lldb-build/lldb-test-build.noindex/module-cache-lldb/lldb-api --clang-module-cache-dir /Users/buildslave/jenkins/workspace/lldb-cmake/lldb-build/lldb-test-build.noindex/module-cache-clang/lldb-api --executable /Users/buildslave/jenkins/workspace/lldb-cmake/lldb-build/./bin/lldb --compiler /Users/buildslave/jenkins/workspace/lldb-cmake/lldb-build/./bin/clang --dsymutil /Users/buildslave/jenkins/workspace/lldb-cmake/lldb-build/./bin/dsymutil --filecheck /Users/buildslave/jenkins/workspace/lldb-cmake/lldb-build/./bin/FileCheck --yaml2obj /Users/buildslave/jenkins/workspace/lldb-cmake/lldb-build/./bin/yaml2obj --lldb-libs-dir /Users/buildslave/jenkins/workspace/lldb-cmake/lldb-build/./lib /Users/buildslave/jenkins/workspace/lldb-cmake/llvm-project/lldb/test/API/commands/target/stop-hooks -p TestStopHookScripted.py
--
Exit Code: 1

Hide Details

Command Output (stdout): -- lldb version 12.0.99 clang revision b3a722e66b75328ab5e2eb5c8572022cb083855b llvm revision b3a722e66b75328ab5e2eb5c8572022cb083855b libstdcxx tests will not be run because: Don't know how to build with libstdcxx on macosx Skipping following debug info categories: ['dwo'] Running command: target stop-hook add -P stop_hook.stop_handler -k increment -v 5 -k return_false -v 1 -n step_out_of_me I have stopped 1 times.

Hide Details

-- Command Output (stderr): --

Hide Details

Session logs for test failures/errors/unexpected successes will go into directory '/Users/buildslave/jenkins/workspace/lldb-cmake/test/logs' Change dir to: /Users/buildslave/jenkins/workspace/lldb-cmake/llvm-project/lldb/test/API/commands/target/stop-hooks runCmd: settings clear -all output:

Hide Details

runCmd: settings set symbols.enable-external-lookup false output:

Hide Details

runCmd: settings set target.inherit-tcc true output:

Hide Details

runCmd: settings set target.auto-apply-fixits false output:

Hide Details

runCmd: settings set plugin.process.gdb-remote.packet-timeout 60 output:

Hide Details

runCmd: settings set symbols.clang-modules-cache-path "/Users/buildslave/jenkins/workspace/lldb-cmake/lldb-build/lldb-test-build.noindex/module-cache-lldb/lldb-api" output:

Hide Details

runCmd: settings set use-color false output:

Hide Details

runCmd: setting set target.prefer-dynamic-value no-dynamic-values output:

Hide Details

FAIL: LLDB (/Users/buildslave/jenkins/workspace/lldb-cmake/lldb-build/bin/clang-x86_64) :: test_stop_hooks_scripted_return_false (TestStopHookScripted.TestStopHooks) <bound method SBProcess.Kill of <lldb.SBProcess; proxy of <Swig Object of type 'lldb::SBProcess *' at 0x1140454e0> >>: success

Hide Details

Restore dir to: /Users/buildslave/jenkins/workspace/lldb-cmake/lldb-build/tools/lldb/test ====================================================================== FAIL: test_stop_hooks_scripted_return_false (TestStopHookScripted.TestStopHooks) Test that the returning False from a stop hook works ---------------------------------------------------------------------- Traceback (most recent call last): File "/Users/buildslave/jenkins/workspace/lldb-cmake/llvm-project/lldb/test/API/commands/target/stop-hooks/TestStopHookScripted.py", line 54, in test_stop_hooks_scripted_return_false self.do_test_auto_continue(True) File "/Users/buildslave/jenkins/workspace/lldb-cmake/llvm-project/lldb/test/API/commands/target/stop-hooks/TestStopHookScripted.py", line 91, in do_test_auto_continue self.assertEqual("main", func_name, "Didn't stop at the expected function.") AssertionError: 'main' != 'step_out_of_me' - main+ step_out_of_me : Didn't stop at the expected function. Config=x86_64-/Users/buildslave/jenkins/workspace/lldb-cmake/lldb-build/bin/clang ---------------------------------------------------------------------- Ran 1 test in 1.418s

Hide Details

RESULT: FAILED (0 passes, 1 failures, 0 errors, 0 skipped, 0 expected failures, 0 unexpected successes)

Hide Details

--

Hide Details

******************** UNSUPPORTED: lldb-shell :: SymbolFile/PDB/compilands.test (1959 of 2153) PASS: lldb-api :: commands/disassemble/basic/TestFrameDisassemble.py (1960 of 2153) PASS: lldb-api :: functionalities/breakpoint/breakpoint_locations/TestBreakpointLocations.py (1961 of 2153) PASS: lldb-api :: lang/objc/print-obj/TestPrintObj.py (1962 of 2153) PASS: lldb-unit :: UnwindAssembly/x86/./UnwindAssemblyx86Tests/Testx86AssemblyInspectionEngine.TestSpillRegToStackViaMOVx86_64 (1963 of 2153) PASS: lldb-unit :: Host/./HostTests/SocketTest.DecodeHostAndPort (1964 of 2153) PASS: lldb-unit :: Host/./HostTests/MainLoopTest.UnmonitoredSignal (1965 of 2153) PASS: lldb-api :: commands/process/attach/TestProcessAttach.py (1966 of 2153) PASS: lldb-shell :: Breakpoint/debug_addrx.test (1967 of 2153) PASS: lldb-api :: lang/objc/foundation/TestSymbolTable.py (1968 of 2153) PASS: lldb-unit :: Symbol/./SymbolTests/PostfixExpression.ParseOneExpression (1969 of 2153) PASS: lldb-unit :: ScriptInterpreter/Python/./ScriptInterpreterPythonTests/PythonDataObjectsTest.TestDictionaryResolutionWithDot (1970 of 2153) PASS: lldb-unit :: Utility/./UtilityTests/RangeTest.SlideZero (1971 of 2153) PASS: lldb-api :: lang/cpp/chained-calls/TestCppChainedCalls.py (1972 of 2153) PASS: lldb-api :: functionalities/tsan/global_location/TestTsanGlobalLocation.py (1973 of 2153) PASS: lldb-api :: commands/target/modules/search-paths/insert/TestTargetModulesSearchpathsInsert.py (1974 of 2153) PASS: lldb-shell :: Reproducer/Modules/TestModuleCXX.test (1975 of 2153) UNSUPPORTED: lldb-api :: android/platform/TestDefaultCacheLineSize.py (1976 of 2153) PASS: lldb-api :: macosx/DBGSourcePathRemapping/TestDSYMSourcePathRemapping.py (1977 of 2153) PASS: lldb-api :: macosx/function-starts/TestFunctionStarts.py (1978 of 2153) PASS: lldb-unit :: ScriptInterpreter/Python/./ScriptInterpreterPythonTests/PythonDataObjectsTest.TestOwnedReferences (1979 of 2153) PASS: lldb-api :: functionalities/postmortem/elf-core/thread_crash/TestLinuxCoreThreads.py (1980 of 2153) PASS: lldb-shell :: Minidump/Windows/broken-unwind.test (1981 of 2153) PASS: lldb-api :: tools/lldb-vscode/breakpoint/TestVSCode_setBreakpoints.py (1982 of 2153) PASS: lldb-unit :: Utility/./UtilityTests/CompletionRequest.DuplicateFiltering (1983 of 2153) PASS: lldb-unit :: SymbolFile/NativePDB/./SymbolFileNativePDBTests/PDBFPOProgramToDWARFExpressionTests.UnresolvedRegisterReference (1984 of 2153) PASS: lldb-unit :: Utility/./UtilityTests/ArgsTest.TestSingleArgWithQuotedSpace (1985 of 2153) PASS: lldb-api :: functionalities/thread/concurrent_events/TestConcurrentBreakpointDelayBreakpointOneSignal.py (1986 of 2153) PASS: lldb-unit :: Utility/./UtilityTests/PassiveReplayTest.InstrumentedBarPtr (1987 of 2153) PASS: lldb-api :: functionalities/breakpoint/breakpoint_ignore_count/TestBreakpointIgnoreCount.py (1988 of 2153) PASS: lldb-unit :: SymbolFile/DWARF/./SymbolFileDWARFTests/SymbolFileDWARFTests.TestAbbrevOrder1Start1 (1989 of 2153) PASS: lldb-api :: tools/lldb-server/TestGdbRemote_qThreadStopInfo.py (1990 of 2153) UNSUPPORTED: lldb-api :: functionalities/data-formatter/data-formatter-stl/libstdcpp/string/TestDataFormatterStdString.py (1991 of 2153) PASS: lldb-api :: lang/cpp/namespace/TestNamespaceLookup.py (1992 of 2153) PASS: lldb-unit :: Process/gdb-remote/./ProcessGdbRemoteTests/GDBRemoteClientBaseTest.SendContinueAndAsyncSignal (1993 of 2153) PASS: lldb-unit :: Utility/./UtilityTests/StreamTest.PutBytesAsRawHex8ToMixedEndian (1994 of 2153) PASS: lldb-api :: commands/platform/file/read/TestPlatformFileRead.py (1995 of 2153) PASS: lldb-api :: functionalities/thread/concurrent_events/TestConcurrentTwoBreakpointsOneSignal.py (1996 of 2153) PASS: lldb-unit :: Symbol/./SymbolTests/TestTypeSystemClang.TestOwningModule (1997 of 2153) PASS: lldb-unit :: Utility/./UtilityTests/OptionsWithRawTest.QuotedSuffix (1998 of 2153) PASS: lldb-api :: python_api/default-constructor/TestDefaultConstructorForAPIObjects.py (1999 of 2153) PASS: lldb-api :: functionalities/multiword-commands/TestMultiWordCommands.py (2000 of 2153) PASS: lldb-api :: commands/frame/diagnose/virtual-method-call/TestDiagnoseDereferenceVirtualMethodCall.py (2001 of 2153) UNSUPPORTED: lldb-api :: functionalities/signal/handle-segv/TestHandleSegv.py (2002 of 2153) UNSUPPORTED: lldb-api :: functionalities/darwin_log/source/info/TestDarwinLogSourceInfo.py (2003 of 2153) PASS: lldb-api :: commands/expression/argument_passing_restrictions/TestArgumentPassingRestrictions.py (2004 of 2153) PASS: lldb-unit :: Utility/./UtilityTests/StreamTest.PutPtr (2005 of 2153) PASS: lldb-api :: commands/watchpoints/watchpoint_count/TestWatchpointCount.py (2006 of 2153) PASS: lldb-api :: commands/session/history/TestSessionHistory.py (2007 of 2153) PASS: lldb-unit :: Core/./LLDBCoreTests/MangledTest.ResultForValidName (2008 of 2153) PASS: lldb-shell :: Driver/TestHelp.test (2009 of 2153) PASS: lldb-api :: functionalities/signal/raise/TestRaise.py (2010 of 2153) PASS: lldb-shell :: Quit/TestQuitExitCodeHex0.test (2011 of 2153) PASS: lldb-shell :: SymbolFile/Breakpad/stack-cfi-arm.yaml (2012 of 2153) PASS: lldb-unit :: Utility/./UtilityTests/BinaryStreamTest.PutULEB128One (2013 of 2153) PASS: lldb-shell :: SymbolFile/DWARF/debug_loclists-dwo.s (2014 of 2153) PASS: lldb-unit :: Utility/./UtilityTests/EventTest.DumpEventDataBytes (2015 of 2153) PASS: lldb-unit :: Host/./HostTests/FileSystemTest.OpenErrno (2016 of 2153) PASS: lldb-unit :: Utility/./UtilityTests/BinaryStreamTest.PutSLEB128SevenBytes (2017 of 2153) PASS: lldb-api :: functionalities/thread/thread_exit/TestThreadExit.py (2018 of 2153) PASS: lldb-api :: lang/cpp/trivial_abi/TestTrivialABI.py (2019 of 2153) PASS: lldb-api :: functionalities/breakpoint/breakpoint_options/TestBreakpointOptions.py (2020 of 2153) PASS: lldb-api :: lang/cpp/namespace/TestNamespace.py (2021 of 2153) PASS: lldb-unit :: Utility/./UtilityTests/ArchSpecTest.OperatorBool (2022 of 2153) UNSUPPORTED: lldb-api :: functionalities/darwin_log/filter/exact_match/subsystem/TestDarwinLogFilterMatchSubsystem.py (2023 of 2153) PASS: lldb-api :: python_api/disassemble-raw-data/TestDisassembleRawData.py (2024 of 2153) PASS: lldb-shell :: Commands/command-thread-select.test (2025 of 2153) UNSUPPORTED: lldb-shell :: Register/x86-ymm-write.test (2026 of 2153) PASS: lldb-unit :: UnwindAssembly/x86/./UnwindAssemblyx86Tests/Testx86AssemblyInspectionEngine.TestAddESP (2027 of 2153) PASS: lldb-api :: python_api/sbvalue_const_addrof/TestSBValueConstAddrOf.py (2028 of 2153) PASS: lldb-unit :: Utility/./UtilityTests/UserIDResolver.GetUserName (2029 of 2153) PASS: lldb-unit :: DataFormatter/./LLDBFormatterTests/TypeMatcherTests.ExactName (2030 of 2153) PASS: lldb-api :: functionalities/breakpoint/breakpoint_language/TestBreakpointLanguage.py (2031 of 2153) PASS: lldb-shell :: ObjectFile/MachO/symtab.yaml (2032 of 2153) PASS: lldb-api :: commands/expression/context-object/TestContextObject.py (2033 of 2153) PASS: lldb-api :: functionalities/param_entry_vals/basic_entry_values/TestBasicEntryValues.py (2034 of 2153) UNSUPPORTED: lldb-api :: functionalities/data-formatter/data-formatter-stl/libstdcpp/iterator/TestDataFormatterStdIterator.py (2035 of 2153) PASS: lldb-unit :: Utility/./UtilityTests/UriParserTest.BracketedHostnameWithColon (2036 of 2153) PASS: lldb-shell :: Settings/TestSettingsSet.test (2037 of 2153) PASS: lldb-unit :: Utility/./UtilityTests/SerializationRountripTest.SerializeDeserializePodPointers (2038 of 2153) PASS: lldb-unit :: Utility/./UtilityTests/RegularExpression.Match (2039 of 2153) PASS: lldb-api :: commands/log/basic/TestLogging.py (2040 of 2153) PASS: lldb-api :: functionalities/data-formatter/ptr_ref_typedef/TestPtrRef2Typedef.py (2041 of 2153) PASS: lldb-unit :: ScriptInterpreter/Python/./ScriptInterpreterPythonTests/PythonDataObjectsTest.TestPythonTupleInitializerList2 (2042 of 2153) PASS: lldb-api :: commands/frame/recognizer/TestFrameRecognizer.py (2043 of 2153) PASS: lldb-unit :: Utility/./UtilityTests/ArchSpecTest.Compatibility (2044 of 2153) PASS: lldb-unit :: Utility/./UtilityTests/RangeTest.ClearWithStarAddress (2045 of 2153) PASS: lldb-api :: tools/lldb-server/TestLldbGdbServer.py (2046 of 2153) PASS: lldb-api :: functionalities/data-formatter/data-formatter-stl/libcxx/string/TestDataFormatterLibcxxString.py (2047 of 2153) PASS: lldb-unit :: Language/Highlighting/./HighlighterTests/HighlighterTest.ClangPPDirectives (2048 of 2153) PASS: lldb-shell :: Reproducer/Functionalities/TestStepping.test (2049 of 2153) PASS: lldb-shell :: SymbolFile/DWARF/static_scope.s (2050 of 2153) PASS: lldb-api :: lang/cpp/stl/TestSTL.py (2051 of 2153) PASS: lldb-unit :: Expression/./ExpressionTests/DiagnosticManagerTest.PutString (2052 of 2153) PASS: lldb-api :: functionalities/paths/TestPaths.py (2053 of 2153) PASS: lldb-unit :: Utility/./UtilityTests/StreamTest.ShiftOperatorPtr (2054 of 2153) PASS: lldb-api :: functionalities/postmortem/minidump-new/TestMiniDumpUUID.py (2055 of 2153) PASS: lldb-unit :: Core/./LLDBCoreTests/RichManglingContextTest.SwitchProvider (2056 of 2153) PASS: lldb-api :: types/TestFloatTypesExpr.py (2057 of 2153) PASS: lldb-unit :: Utility/./UtilityTests/StringListTest.LongestCommonPrefix (2058 of 2153) PASS: lldb-unit :: UnwindAssembly/PPC64/./PPC64InstEmulationTests/TestPPC64InstEmulation.TestSimpleFunction (2059 of 2153) PASS: lldb-unit :: API/./APITests/SBCommandInterpreterTest.SingleWordCommand (2060 of 2153) PASS: lldb-unit :: Utility/./UtilityTests/StringListTest.Clear (2061 of 2153) PASS: lldb-api :: functionalities/step-avoids-no-debug/TestStepNoDebug.py (2062 of 2153) PASS: lldb-shell :: SymbolFile/DWARF/deterministic-build.cpp (2063 of 2153) PASS: lldb-unit :: Utility/./UtilityTests/VMRange.IsValid (2064 of 2153) UNSUPPORTED: lldb-shell :: Watchpoint/netbsd-nouserdbregs.test (2065 of 2153) PASS: lldb-unit :: Symbol/./SymbolTests/TestClangASTImporter.RecordLayout (2066 of 2153) PASS: lldb-api :: commands/expression/result_numbering/TestResultNumbering.py (2067 of 2153) PASS: lldb-unit :: Utility/./UtilityTests/StreamTeeTest.Write (2068 of 2153) PASS: lldb-unit :: Core/./LLDBCoreTests/RichManglingContextTest.FromCxxMethodName (2069 of 2153) PASS: lldb-api :: python_api/sbenvironment/TestSBEnvironment.py (2070 of 2153) PASS: lldb-shell :: SymbolFile/DWARF/inline-function-address.ll (2071 of 2153) PASS: lldb-api :: commands/expression/call-function/TestCallStopAndContinue.py (2072 of 2153) PASS: lldb-unit :: SymbolFile/NativePDB/./SymbolFileNativePDBTests/PDBFPOProgramToDWARFExpressionTests.UnresolvedCyclicRegisterAssignmentReference (2073 of 2153) PASS: lldb-api :: lang/objc/objc-ivar-stripped/TestObjCIvarStripped.py (2074 of 2153) PASS: lldb-unit :: Utility/./UtilityTests/StringExtractorTest.GetHexBytes_FullString (2075 of 2153) UNSUPPORTED: lldb-shell :: ObjectFile/ELF/minidebuginfo-no-lzma.yaml (2076 of 2153) PASS: lldb-shell :: SymbolFile/DWARF/debug-types-missing-signature.test (2077 of 2153) PASS: lldb-unit :: Utility/./UtilityTests/BinaryStreamTest.PutSLEB128FiveBytes (2078 of 2153) PASS: lldb-api :: functionalities/step_scripted/TestStepScripted.py (2079 of 2153) PASS: lldb-unit :: Symbol/./SymbolTests/TestTypeSystemClang.TestGetEnumIntegerTypeUnexpectedType (2080 of 2153) PASS: lldb-unit :: Utility/./UtilityTests/OptionsWithRawTest.EmptyInput (2081 of 2153) PASS: lldb-api :: tools/lldb-server/TestGdbRemoteKill.py (2082 of 2153) PASS: lldb-api :: functionalities/data-formatter/data-formatter-stl/libcxx/vbool/TestDataFormatterLibcxxVBool.py (2083 of 2153) PASS: lldb-unit :: Language/CPlusPlus/./LanguageCPlusPlusTests/CPlusPlusLanguage.MethodNameParsing (2084 of 2153) PASS: lldb-unit :: Process/minidump/./LLDBMinidumpTests/MinidumpParserTest.MinidumpDuplicateModuleMinAddress (2085 of 2153) PASS: lldb-unit :: Expression/./ExpressionTests/DiagnosticManagerTest.GetStringBasic (2086 of 2153) PASS: lldb-unit :: Utility/./UtilityTests/GeneratorTest.Get (2087 of 2153) PASS: lldb-shell :: ObjectFile/PECOFF/disassemble-thumb.yaml (2088 of 2153) PASS: lldb-api :: functionalities/breakpoint/comp_dir_symlink/TestCompDirSymLink.py (2089 of 2153) UNSUPPORTED: lldb-api :: commands/watchpoints/multi_watchpoint_slots/TestWatchpointMultipleSlots.py (2090 of 2153) PASS: lldb-unit :: Process/gdb-remote/./ProcessGdbRemoteTests/GDBRemoteCommunicationClientTest.SaveRestoreRegistersNoSuffix (2091 of 2153) PASS: lldb-unit :: Host/./HostTests/MainLoopTest.ReadObject (2092 of 2153) PASS: lldb-shell :: Reproducer/TestVerify.test (2093 of 2153) PASS: lldb-unit :: Core/./LLDBCoreTests/ModuleSpecTest.InvalidInMemoryBuffer (2094 of 2153) PASS: lldb-api :: functionalities/object-file/TestImageListMultiArchitecture.py (2095 of 2153) PASS: lldb-unit :: Platform/./LLDBPlatformTests/PlatformDarwinTest.TestParseVersionBuildDir (2096 of 2153) PASS: lldb-shell :: Commands/command-script-import.test (2097 of 2153) PASS: lldb-api :: functionalities/data-formatter/data-formatter-stl/libcxx/unordered/TestDataFormatterUnordered.py (2098 of 2153) PASS: lldb-api :: lang/cpp/frame-var-anon-unions/TestFrameVariableAnonymousUnions.py (2099 of 2153) PASS: lldb-api :: functionalities/data-formatter/type_summary_list_script/TestTypeSummaryListScript.py (2100 of 2153) PASS: lldb-api :: lang/cpp/unsigned_types/TestUnsignedTypes.py (2101 of 2153) PASS: lldb-shell :: SymbolFile/NativePDB/globals-bss.cpp (2102 of 2153) PASS: lldb-unit :: Utility/./UtilityTests/StreamTest.PutCharNull (2103 of 2153) PASS: lldb-api :: types/TestIntegerTypeExpr.py (2104 of 2153) PASS: lldb-api :: functionalities/tsan/thread_numbers/TestTsanThreadNumbers.py (2105 of 2153) PASS: lldb-shell :: Reproducer/TestMultipleTargets.test (2106 of 2153) PASS: lldb-api :: functionalities/data-formatter/compactvectors/TestCompactVectors.py (2107 of 2153) PASS: lldb-unit :: Utility/./UtilityTests/AnsiTerminal.Basic (2108 of 2153) PASS: lldb-unit :: Utility/./UtilityTests/SerializationRountripTest.SerializeDeserializePodReferences (2109 of 2153) PASS: lldb-shell :: ObjectFile/MachO/lc_version_min.yaml (2110 of 2153) PASS: lldb-api :: python_api/lldbutil/process/TestPrintStackTraces.py (2111 of 2153) PASS: lldb-unit :: UnwindAssembly/x86/./UnwindAssemblyx86Tests/Testx86AssemblyInspectionEngine.TestAddRSP (2112 of 2153) PASS: lldb-api :: functionalities/thread/create_after_attach/TestCreateAfterAttach.py (2113 of 2153) PASS: lldb-api :: functionalities/breakpoint/breakpoint_command/TestRegexpBreakCommand.py (2114 of 2153) PASS: lldb-api :: commands/expression/two-files/TestObjCTypeQueryFromOtherCompileUnit.py (2115 of 2153) PASS: lldb-unit :: Host/./HostTests/SocketAddressTest.Set (2116 of 2153) PASS: lldb-unit :: Utility/./UtilityTests/StringExtractorTest.GetHexBytesAvail (2117 of 2153) UNSUPPORTED: lldb-shell :: ScriptInterpreter/Lua/lua-python.test (2118 of 2153) PASS: lldb-unit :: Utility/./UtilityTests/ArgsTest.ReplaceArgumentAtIndexShort (2119 of 2153) PASS: lldb-unit :: ScriptInterpreter/Python/./ScriptInterpreterPythonTests/PythonDataObjectsTest.TestPythonDictionaryValueEquality (2120 of 2153) PASS: lldb-unit :: Utility/./UtilityTests/ArgsTest.TestArgv (2121 of 2153) PASS: lldb-api :: functionalities/thread/concurrent_events/TestConcurrentNWatchNBreak.py (2122 of 2153) PASS: lldb-api :: functionalities/tsan/multiple/TestTsanMultiple.py (2123 of 2153) UNSUPPORTED: lldb-shell :: Register/x86-gp-write.test (2124 of 2153) UNSUPPORTED: lldb-api :: macosx/macCatalystAppMacOSFramework/TestMacCatalystAppWithMacOSFramework.py (2125 of 2153) PASS: lldb-api :: python_api/sbplatform/TestSBPlatform.py (2126 of 2153) PASS: lldb-api :: functionalities/tail_call_frames/unambiguous_sequence/TestUnambiguousTailCalls.py (2127 of 2153) PASS: lldb-shell :: SymbolFile/NativePDB/globals-fundamental.cpp (2128 of 2153) PASS: lldb-unit :: Target/./TargetTests/MCBasedABI.MapRegisterName (2129 of 2153) PASS: lldb-api :: macosx/add-dsym/TestAddDsymMidExecutionCommand.py (2130 of 2153) PASS: lldb-api :: lang/objcxx/class-name-clash/TestNameClash.py (2131 of 2153) PASS: lldb-api :: functionalities/data-formatter/data-formatter-objc/TestDataFormatterObjCNSDate.py (2132 of 2153) PASS: lldb-unit :: Utility/./UtilityTests/BinaryStreamTest.PutULEB128SixBytes (2133 of 2153) PASS: lldb-api :: lang/objc/objc-struct-return/TestObjCStructReturn.py (2134 of 2153) PASS: lldb-unit :: Utility/./UtilityTests/BinaryStreamTest.PutULEB128OneByte (2135 of 2153) PASS: lldb-api :: functionalities/tail_call_frames/disambiguate_call_site/TestDisambiguateCallSite.py (2136 of 2153) PASS: lldb-shell :: Reproducer/TestDebugSymbols.test (2137 of 2153) PASS: lldb-unit :: Utility/./UtilityTests/BinaryStreamTest.PutSLEB128TwoBytes (2138 of 2153) PASS: lldb-unit :: Utility/./UtilityTests/Flags.GetBitSize (2139 of 2153) PASS: lldb-unit :: Utility/./UtilityTests/ScalarTest.Scalar_512 (2140 of 2153) PASS: lldb-shell :: Minidump/dump-all.test (2141 of 2153) PASS: lldb-api :: functionalities/gdb_remote_client/TestGDBRemoteClient.py (2142 of 2153) PASS: lldb-unit :: Utility/./UtilityTests/ArgsTest.AppendArguments (2143 of 2153) PASS: lldb-unit :: Utility/./UtilityTests/StringListTest.AppendStringMove (2144 of 2153) PASS: lldb-api :: functionalities/data-formatter/data-formatter-stl/libcxx/map/TestDataFormatterLibccMap.py (2145 of 2153) PASS: lldb-api :: lang/cpp/auto/TestCPPAuto.py (2146 of 2153) PASS: lldb-unit :: UnwindAssembly/x86/./UnwindAssemblyx86Tests/Testx86AssemblyInspectionEngine.TestPushR14 (2147 of 2153) PASS: lldb-unit :: Target/./TargetTests/PathMappingListTest.AbsoluteTests (2148 of 2153) UNSUPPORTED: lldb-api :: functionalities/data-formatter/data-formatter-stl/libstdcpp/vbool/TestDataFormatterStdVBool.py (2149 of 2153) PASS: lldb-unit :: Symbol/./SymbolTests/TestTypeSystemClang.TestGetTypeClassTypeOf (2150 of 2153) PASS: lldb-api :: commands/process/launch/TestProcessLaunch.py (2151 of 2153) PASS: lldb-api :: tools/lldb-vscode/attach/TestVSCode_attach.py (2152 of 2153) PASS: lldb-api :: functionalities/set-data/TestSetData.py (2153 of 2153) Slowest Tests: -------------------------------------------------------------------------- 327.97s: lldb-api :: macosx/simulator/TestSimulatorPlatform.py 122.13s: lldb-api :: functionalities/data-formatter/data-formatter-objc/TestDataFormatterObjCExpr.py 103.17s: lldb-api :: tools/lldb-server/TestLldbGdbServer.py 96.24s: lldb-api :: functionalities/asan/TestMemoryHistory.py 86.88s: lldb-api :: lang/objc/modules-cache/TestClangModulesCache.py 71.09s: lldb-api :: lang/objc/exceptions/TestObjCExceptions.py 69.04s: lldb-api :: lang/cpp/alignas_base_class/TestAlignAsBaseClass.py 60.38s: lldb-api :: lang/objc/foundation/TestObjCMethods.py 59.04s: lldb-api :: benchmarks/continue/TestBenchmarkContinue.py 53.20s: lldb-api :: lang/objc/hidden-ivars/TestHiddenIvars.py 52.72s: lldb-api :: lang/c/shared_lib/TestSharedLib.py 52.47s: lldb-api :: lang/objc/foundation/TestFoundationDisassembly.py 50.59s: lldb-api :: functionalities/gdb_remote_client/TestRegDefinitionInParts.py 49.36s: lldb-api :: api/multithreaded/TestMultithreaded.py 49.16s: lldb-api :: commands/expression/namespace_local_var_same_name_obj_c/TestNamespaceLocalVarSameNameObjC.py 47.77s: lldb-api :: functionalities/postmortem/minidump/TestMiniDump.py 44.47s: lldb-api :: types/TestLongTypesExpr.py 42.79s: lldb-shell :: ObjectFile/ELF/PT_LOAD-overlap-PT_TLS.yaml 42.09s: lldb-api :: lang/cpp/namespace/TestNamespaceLookup.py 39.79s: lldb-api :: lang/objc/objc-new-syntax/TestObjCNewSyntaxLiteral.py

Hide Details

Tests Times: -------------------------------------------------------------------------- [ Range ] :: [ Percentage ] :: [ Count ] -------------------------------------------------------------------------- [320s,340s) :: [ ] :: [ 1/2153] [300s,320s) :: [ ] :: [ 0/2153] [280s,300s) :: [ ] :: [ 0/2153] [260s,280s) :: [ ] :: [ 0/2153] [240s,260s) :: [ ] :: [ 0/2153] [220s,240s) :: [ ] :: [ 0/2153] [200s,220s) :: [ ] :: [ 0/2153] [180s,200s) :: [ ] :: [ 0/2153] [160s,180s) :: [ ] :: [ 0/2153] [140s,160s) :: [ ] :: [ 0/2153] [120s,140s) :: [ ] :: [ 1/2153] [100s,120s) :: [ ] :: [ 1/2153] [ 80s,100s) :: [ ] :: [ 2/2153] [ 60s, 80s) :: [ ] :: [ 4/2153] [ 40s, 60s) :: [ ] :: [ 11/2153] [ 20s, 40s) :: [ ] :: [ 32/2153] [ 0s, 20s) :: [*************************************** ] :: [2101/2153] -------------------------------------------------------------------------- ******************** Failed Tests (1): lldb-api :: commands/target/stop-hooks/TestStopHookScripted.py

Hide Details

Hide Details

Testing Time: 1804.33s Unsupported : 153 Passed : 1993 Expectedly Failed: 6 Failed : 1 FAILED: tools/lldb/test/CMakeFiles/check-lldb-lit cd /Users/buildslave/jenkins/workspace/lldb-cmake/lldb-build/tools/lldb/test && /usr/local/Frameworks/Python.framework/Versions/3.7/bin/python3.7 /Users/buildslave/jenkins/workspace/lldb-cmake/lldb-build/./bin/llvm-lit -v --time-tests --shuffle --xunit-xml-output=/Users/buildslave/jenkins/workspace/lldb-cmake/test/results.xml -v -j 4 /Users/buildslave/jenkins/workspace/lldb-cmake/lldb-build/tools/lldb/test ninja: build stopped: subcommand failed. Command failed: Command '['/usr/bin/env', 'TERM=vt100', '/usr/local/bin/ninja', '-v', 'check-lldb']' returned non-zero exit status 1 Command: ['/usr/bin/env', 'TERM=vt100', '/usr/local/bin/ninja', '-v', 'check-lldb'] [Pipeline] } [Pipeline] // timeout [Pipeline] } [Pipeline] // stage [Pipeline] stage [Pipeline] { (Declarative: Post Actions) [Pipeline] scanForIssues [Clang (LLVM based)] Sleeping for 5 seconds due to JENKINS-32191... [Clang (LLVM based)] Parsing console log (workspace: '/Users/buildslave/jenkins/workspace/lldb-cmake') [Clang (LLVM based)] Successfully parsed console log [Clang (LLVM based)] -> found 6 issues (skipped 12 duplicates) [Clang (LLVM based)] Post processing issues on 'green-dragon-10' with source code encoding 'UTF-8' [Clang (LLVM based)] Creating SCM blamer to obtain author and commit information for affected files [Clang (LLVM based)] Creating SCM miner to obtain statistics for affected repository files [Clang (LLVM based)] Resolving file names for all issues in source directory '/Users/buildslave/jenkins/workspace/lldb-cmake' [Clang (LLVM based)] -> resolved paths in source directory (4 found, 0 not found) [Clang (LLVM based)] Resolving module names from module definitions (build.xml, pom.xml, or Manifest.mf files) [Clang (LLVM based)] -> resolved module names for 6 issues [Clang (LLVM based)] Resolving package names (or namespaces) by parsing the affected files [Clang (LLVM based)] -> resolved package names of 4 affected files [Clang (LLVM based)] No filter has been set, publishing all 6 issues [Clang (LLVM based)] Creating fingerprints for all affected code blocks to track issues over different builds [Clang (LLVM based)] -> created fingerprints for 6 issues (skipped 0 issues) [Clang (LLVM based)] Copying affected files to Jenkins' build folder '/Users/Shared/Jenkins/Home/jobs/lldb-cmake/builds/23996/files-with-issues' [Clang (LLVM based)] -> 4 copied, 0 not in workspace, 0 not-found, 0 with I/O error [Pipeline] junit Recording test results [Pipeline] } [Pipeline] // stage [Pipeline] } [Pipeline] // withEnv [Pipeline] } [Pipeline] // node [Pipeline] End of Pipeline ERROR: script returned exit code 1 Finished: FAILURE