FailedConsole Output

Skipping 16,383 KB.. Full Log
 :: functionalities/darwin_log/filter/exact_match/subsystem/TestDarwinLogFilterMatchSubsystem.py (659 of 2154)
PASS: lldb-unit :: Utility/./UtilityTests/UriParserTest.SchemeHostSeparator4 (660 of 2154)
PASS: lldb-api :: commands/frame/recognizer/TestFrameRecognizer.py (661 of 2154)
PASS: lldb-api :: functionalities/breakpoint/debugbreak/TestDebugBreak.py (662 of 2154)
PASS: lldb-api :: iohandler/resize/TestIOHandlerResizeNoEditline.py (663 of 2154)
PASS: lldb-unit :: Language/CPlusPlus/./LanguageCPlusPlusTests/CPlusPlusLanguage.ExtractContextAndIdentifier (664 of 2154)
PASS: lldb-api :: functionalities/float-display/TestFloatDisplay.py (665 of 2154)
PASS: lldb-unit :: Utility/./UtilityTests/StringExtractorTest.GetHexU8_Exact_NoEof (666 of 2154)
PASS: lldb-unit :: Host/./HostTests/NativeProcessProtocolTest.ReadCStringFromMemory_CrossPageBoundary (667 of 2154)
PASS: lldb-unit :: tools/lldb-server/tests/./LLDBServerTests/TestBase.LaunchModePreservesEnvironment (668 of 2154)
PASS: lldb-shell :: Breakpoint/split-dwarf-5-addrbase.test (669 of 2154)
PASS: lldb-api :: commands/expression/po_verbosity/TestPoVerbosity.py (670 of 2154)
PASS: lldb-api :: python_api/frame/get-variables/TestGetVariables.py (671 of 2154)
PASS: lldb-api :: functionalities/process_crash_info/TestProcessCrashInfo.py (672 of 2154)
PASS: lldb-unit :: Symbol/./SymbolTests/TestTypeSystemClang.TestGetBasicTypeFromEnum (673 of 2154)
PASS: lldb-api :: commands/expression/char/TestExprsChar.py (674 of 2154)
PASS: lldb-unit :: Utility/./UtilityTests/RangeTest.ContainsAddrInvalid (675 of 2154)
PASS: lldb-unit :: Utility/./UtilityTests/ListenerTest.GetEventImmediate (676 of 2154)
PASS: lldb-api :: commands/expression/test/TestExprs2.py (677 of 2154)
PASS: lldb-api :: commands/process/attach/attach_denied/TestAttachDenied.py (678 of 2154)
PASS: lldb-api :: lang/objc/objc-super/TestObjCSuper.py (679 of 2154)
PASS: lldb-unit :: UnwindAssembly/ARM64/./Arm64InstEmulationTests/TestArm64InstEmulation.TestCFARegisterTrackedAcrossJumps (680 of 2154)
PASS: lldb-unit :: Process/minidump/./LLDBMinidumpTests/MinidumpParserTest.GetMiscInfo_no_stream (681 of 2154)
PASS: lldb-api :: functionalities/step-avoids-no-debug/TestStepNoDebug.py (682 of 2154)
UNSUPPORTED: lldb-api :: linux/sepdebugsymlink/TestTargetSymbolsSepDebugSymlink.py (683 of 2154)
PASS: lldb-api :: python_api/symbol-context/TestSymbolContext.py (684 of 2154)
PASS: lldb-api :: functionalities/thread/concurrent_events/TestConcurrentDelaySignalBreak.py (685 of 2154)
PASS: lldb-unit :: Utility/./UtilityTests/BinaryStreamTest.PutSLEB128FourBytes (686 of 2154)
PASS: lldb-api :: functionalities/breakpoint/breakpoint_conditions/TestBreakpointConditions.py (687 of 2154)
PASS: lldb-unit :: UnwindAssembly/x86/./UnwindAssemblyx86Tests/Testx86AssemblyInspectionEngine.TestSimplex86_64Augmented (688 of 2154)
PASS: lldb-unit :: Utility/./UtilityTests/StringListTest.SplitIntoLines (689 of 2154)
PASS: lldb-unit :: Utility/./UtilityTests/FileSpecTest.EqualDotsWindows (690 of 2154)
PASS: lldb-api :: functionalities/gdb_remote_client/TestqOffsets.py (691 of 2154)
UNSUPPORTED: lldb-api :: functionalities/unwind/standard/TestStandardUnwind.py (692 of 2154)
PASS: lldb-api :: lang/cpp/bool/TestCPPBool.py (693 of 2154)
PASS: lldb-unit :: Utility/./UtilityTests/StreamTeeTest.Assignment (694 of 2154)
PASS: lldb-api :: python_api/function_symbol/TestSymbolAPI.py (695 of 2154)
PASS: lldb-api :: functionalities/inferior-crashing/TestInferiorCrashingStep.py (696 of 2154)
PASS: lldb-api :: functionalities/reproducers/attach/TestReproducerAttach.py (697 of 2154)
PASS: lldb-unit :: Language/Highlighting/./HighlighterTests/HighlighterTest.ClangComments (698 of 2154)
PASS: lldb-api :: tools/lldb-server/commandline/TestStubReverseConnect.py (699 of 2154)
PASS: lldb-api :: commands/expression/import-std-module/shared_ptr-dbg-info-content/TestSharedPtrDbgInfoContentFromStdModule.py (700 of 2154)
PASS: lldb-shell :: Reproducer/Functionalities/TestImageList.test (701 of 2154)
PASS: lldb-unit :: UnwindAssembly/x86/./UnwindAssemblyx86Tests/Testx86AssemblyInspectionEngine.TestPopRBPWithREX (702 of 2154)
PASS: lldb-api :: lang/c/step-target/TestStepTarget.py (703 of 2154)
PASS: lldb-api :: lang/cpp/gmodules/TestWithModuleDebugging.py (704 of 2154)
PASS: lldb-api :: commands/platform/process/list/TestProcessList.py (705 of 2154)
PASS: lldb-unit :: ScriptInterpreter/Python/./ScriptInterpreterPythonTests/PythonDataObjectsTest.TestInstanceNameResolutionNoDot (706 of 2154)
PASS: lldb-unit :: Host/./HostTests/NativeProcessProtocolTest.SetBreakpoint (707 of 2154)
PASS: lldb-api :: functionalities/testid/TestTestId.py (708 of 2154)
PASS: lldb-unit :: Utility/./UtilityTests/RangeTest.SetRangeBase (709 of 2154)
PASS: lldb-api :: commands/session/history/TestSessionHistory.py (710 of 2154)
PASS: lldb-unit :: ScriptInterpreter/Python/./ScriptInterpreterPythonTests/PythonDataObjectsTest.TestPythonDictionaryValueEquality (711 of 2154)
PASS: lldb-api :: python_api/disassemble-raw-data/TestDisassembleRawData.py (712 of 2154)
PASS: lldb-api :: types/TestIntegerTypeExpr.py (713 of 2154)
PASS: lldb-shell :: SymbolFile/DWARF/DW_AT_low_pc-addrx.s (714 of 2154)
PASS: lldb-api :: functionalities/thread/concurrent_events/TestConcurrentSignalNWatchNBreak.py (715 of 2154)
PASS: lldb-unit :: Utility/./UtilityTests/RecordReplayTest.InstrumentedFoo (716 of 2154)
PASS: lldb-unit :: Utility/./UtilityTests/CompletionRequest.TestCompletionOwnership (717 of 2154)
PASS: lldb-unit :: Utility/./UtilityTests/LogChannelEnabledTest.log_options (718 of 2154)
PASS: lldb-api :: functionalities/pre_run_dylibs/TestPreRunDylibs.py (719 of 2154)
PASS: lldb-unit :: SymbolFile/DWARF/./SymbolFileDWARFTests/SymbolFileDWARFTests.TestAbbrevValidAttrNullForm (720 of 2154)
UNSUPPORTED: lldb-shell :: SymbolFile/PDB/enums-layout.test (721 of 2154)
UNSUPPORTED: lldb-api :: functionalities/tty/TestTerminal.py (722 of 2154)
PASS: lldb-shell :: Settings/TestLineMarkerColor.test (723 of 2154)
PASS: lldb-unit :: Utility/./UtilityTests/DeserializerTest.HasData (724 of 2154)
PASS: lldb-api :: commands/expression/call-function/TestCallUserDefinedFunction.py (725 of 2154)
PASS: lldb-unit :: UnwindAssembly/ARM64/./Arm64InstEmulationTests/TestArm64InstEmulation.TestRegisterSavedTwice (726 of 2154)
PASS: lldb-api :: macosx/version_zero/TestGetVersionZeroVersion.py (727 of 2154)
PASS: lldb-unit :: Expression/./ExpressionTests/DiagnosticManagerTest.PutStringMultiple (728 of 2154)
PASS: lldb-unit :: UnwindAssembly/ARM64/./Arm64InstEmulationTests/TestArm64InstEmulation.TestSimpleDarwinFunction (729 of 2154)
PASS: lldb-api :: commands/platform/basic/TestPlatformCommand.py (730 of 2154)
PASS: lldb-api :: commands/expression/import_base_class_when_class_has_derived_member/TestImportBaseClassWhenClassHasDerivedMember.py (731 of 2154)
PASS: lldb-shell :: ObjectFile/PECOFF/sections-names.yaml (732 of 2154)
PASS: lldb-shell :: ObjectFile/ELF/netbsd-core-amd64.test (733 of 2154)
PASS: lldb-api :: commands/expression/import-std-module/deque-basic/TestDequeFromStdModule.py (734 of 2154)
UNSUPPORTED: lldb-shell :: Register/arm-fp-read.test (735 of 2154)
PASS: lldb-unit :: Language/Highlighting/./HighlighterTests/HighlighterTest.ClangTrailingBackslashMissingNewLine (736 of 2154)
PASS: lldb-shell :: ObjectFile/wasm/unified-debug-sections.yaml (737 of 2154)
PASS: lldb-api :: commands/expression/import-std-module/deque-dbg-info-content/TestDbgInfoContentDequeFromStdModule.py (738 of 2154)
PASS: lldb-unit :: Symbol/./SymbolTests/Type.CompilerContextPattern (739 of 2154)
PASS: lldb-unit :: Process/minidump/./LLDBMinidumpTests/MinidumpParserTest.GetArchitecture (740 of 2154)
PASS: lldb-api :: functionalities/data-formatter/data-formatter-stl/libcxx/iterator/TestDataFormatterLibccIterator.py (741 of 2154)
PASS: lldb-shell :: Minidump/Windows/Sigsegv/sigsegv.test (742 of 2154)
PASS: lldb-unit :: Utility/./UtilityTests/UriParserTest.BracketedHostnameWithPortIPv6 (743 of 2154)
UNSUPPORTED: lldb-shell :: ObjectFile/ELF/minidebuginfo-no-lzma.yaml (744 of 2154)
PASS: lldb-unit :: Utility/./UtilityTests/StringExtractorTest.DecodeHexU8_InvalidHex (745 of 2154)
PASS: lldb-unit :: Expression/./ExpressionTests/DWARFExpression.DW_OP_pick (746 of 2154)
PASS: lldb-shell :: VSCode/TestOptions.test (747 of 2154)
PASS: lldb-api :: types/TestIntegerType.py (748 of 2154)
PASS: lldb-unit :: ScriptInterpreter/Python/./ScriptInterpreterPythonTests/PythonDataObjectsTest.TestGlobalNameResolutionWithDot (749 of 2154)
PASS: lldb-unit :: Utility/./UtilityTests/Flags.AllSet (750 of 2154)
PASS: lldb-unit :: SymbolFile/NativePDB/./SymbolFileNativePDBTests/PDBFPOProgramToDWARFExpressionTests.UnsupportedRASearch (751 of 2154)
PASS: lldb-unit :: UnwindAssembly/x86/./UnwindAssemblyx86Tests/Testx86AssemblyInspectionEngine.TestDisassemblyJunkBytes (752 of 2154)
PASS: lldb-unit :: Utility/./UtilityTests/UriParserTest.LongPath (753 of 2154)
PASS: lldb-unit :: UnwindAssembly/ARM64/./Arm64InstEmulationTests/TestArm64InstEmulation.TestMediumDarwinFunction (754 of 2154)
UNSUPPORTED: lldb-api :: tools/lldb-server/platform-process-connect/TestPlatformProcessConnect.py (755 of 2154)
PASS: lldb-unit :: Language/Highlighting/./HighlighterTests/HighlighterTest.ClangSquareBrackets (756 of 2154)
PASS: lldb-api :: functionalities/thread/step_until/TestStepUntil.py (757 of 2154)
PASS: lldb-api :: functionalities/tail_call_frames/sbapi_support/TestTailCallFrameSBAPI.py (758 of 2154)
PASS: lldb-api :: commands/expression/persistent_types/TestPersistentTypes.py (759 of 2154)
PASS: lldb-api :: macosx/add-dsym/TestAddDsymMidExecutionCommand.py (760 of 2154)
PASS: lldb-unit :: Utility/./UtilityTests/FileSpecTest.RemoveLastPathComponent (761 of 2154)
PASS: lldb-unit :: Utility/./UtilityTests/SerializationRountripTest.SerializeDeserializeCStringArrayNullptrElem (762 of 2154)
PASS: lldb-unit :: Utility/./UtilityTests/AnsiTerminal.KnownPrefix (763 of 2154)
UNSUPPORTED: lldb-api :: functionalities/darwin_log/filter/regex/category/TestDarwinLogFilterRegexCategory.py (764 of 2154)
PASS: lldb-api :: functionalities/show_location/TestShowLocationDwarf5.py (765 of 2154)
PASS: lldb-api :: functionalities/thread/concurrent_events/TestConcurrentSignalDelayBreak.py (766 of 2154)
PASS: lldb-shell :: ObjectFile/ELF/PT_LOAD-overlap-section.yaml (767 of 2154)
PASS: lldb-unit :: Platform/Android/./AdbClientTests/AdbClientTest.CreateByDeviceId_ByEnvVar (768 of 2154)
PASS: lldb-unit :: debugserver/./debugserverTests/RNBSocket.LoopBackListenIPv6 (769 of 2154)
UNSUPPORTED: lldb-api :: linux/add-symbols/TestTargetSymbolsAddCommand.py (770 of 2154)
PASS: lldb-unit :: Language/Highlighting/./HighlighterTests/HighlighterTest.ClangUnterminatedString (771 of 2154)
PASS: lldb-unit :: Utility/./UtilityTests/ArgsTest.TestSingleArgWithQuotedSpace (772 of 2154)
UNSUPPORTED: lldb-api :: functionalities/darwin_log/source/debug/TestDarwinLogSourceDebug.py (773 of 2154)
PASS: lldb-api :: commands/source/info/TestSourceInfo.py (774 of 2154)
PASS: lldb-shell :: ObjectFile/ELF/short-build-id.yaml (775 of 2154)
PASS: lldb-shell :: SymbolFile/Breakpad/unwind-via-stack-cfi.test (776 of 2154)
PASS: lldb-unit :: Utility/./UtilityTests/StatusTest.ErrorConversion (777 of 2154)
PASS: lldb-unit :: Process/gdb-remote/./ProcessGdbRemoteTests/GDBRemoteCommunicationClientTest.TestPacketSpeedJSON (778 of 2154)
PASS: lldb-shell :: SymbolFile/DWARF/debug-types-missing-signature.test (779 of 2154)
PASS: lldb-unit :: Utility/./UtilityTests/StreamTest.PutSLEB128 (780 of 2154)
PASS: lldb-api :: lang/objc/modules-app-update/TestClangModulesAppUpdate.py (781 of 2154)
PASS: lldb-unit :: API/./APITests/SBCommandInterpreterTest.SingleWordCommand (782 of 2154)
PASS: lldb-api :: functionalities/data-formatter/data-formatter-objc/nsindexpath/TestDataFormatterNSIndexPath.py (783 of 2154)
UNSUPPORTED: lldb-api :: functionalities/darwin_log/filter/exact_match/activity/TestDarwinLogFilterMatchActivity.py (784 of 2154)
PASS: lldb-api :: commands/command/script_alias/TestCommandScriptAlias.py (785 of 2154)
PASS: lldb-unit :: Process/gdb-remote/./ProcessGdbRemoteTests/GDBRemoteCommunicationClientTest.GetModulesInfo_UUID20 (786 of 2154)
PASS: lldb-api :: functionalities/data-formatter/synthcapping/TestSyntheticCapping.py (787 of 2154)
UNSUPPORTED: lldb-shell :: ScriptInterpreter/Lua/breakpoint_callback.test (788 of 2154)
UNSUPPORTED: lldb-api :: commands/watchpoints/multi_watchpoint_slots/TestWatchpointMultipleSlots.py (789 of 2154)
PASS: lldb-unit :: Utility/./UtilityTests/NameMatchesTest.Ignore (790 of 2154)
PASS: lldb-unit :: Process/minidump/./LLDBMinidumpTests/MinidumpParserTest.GetMemory (791 of 2154)
PASS: lldb-unit :: Expression/./ExpressionTests/ClangExpressionDeclMapTest.TestPersistentDeclLookup (792 of 2154)
PASS: lldb-unit :: Utility/./UtilityTests/StringExtractorTest.GetNameColonValueSuccess (793 of 2154)
PASS: lldb-unit :: Process/gdb-remote/./ProcessGdbRemoteTests/GDBRemoteClientBaseTest.SendContinueAndAsyncSignal (794 of 2154)
UNSUPPORTED: lldb-api :: functionalities/darwin_log/filter/regex/activity/TestDarwinLogFilterRegexActivity.py (795 of 2154)
XFAIL: lldb-shell :: Unwind/prefer-debug-over-eh-frame.test (796 of 2154)
PASS: lldb-api :: lang/cpp/unicode-literals/TestUnicodeLiterals.py (797 of 2154)
PASS: lldb-unit :: Utility/./UtilityTests/Flags.Clear (798 of 2154)
PASS: lldb-shell :: SymbolFile/DWARF/compilercontext.ll (799 of 2154)
PASS: lldb-unit :: Utility/./UtilityTests/SerializationRountripTest.SerializeDeserializeCStringNull (800 of 2154)
PASS: lldb-unit :: Symbol/./SymbolTests/TestClangASTImporter.MetadataPropagationIndirectImport (801 of 2154)
PASS: lldb-unit :: Utility/./UtilityTests/FileSpecTest.GetPath (802 of 2154)
PASS: lldb-unit :: Utility/./UtilityTests/StringExtractorTest.InitEmpty (803 of 2154)
PASS: lldb-shell :: SymbolFile/DWARF/inline-function-address-shared.test (804 of 2154)
PASS: lldb-api :: macosx/thread_suspend/TestInternalThreadSuspension.py (805 of 2154)
PASS: lldb-api :: functionalities/object-file/TestImageListMultiArchitecture.py (806 of 2154)
PASS: lldb-shell :: SymbolFile/DWARF/DW_AT_location-DW_AT_const_value.s (807 of 2154)
PASS: lldb-unit :: Utility/./UtilityTests/FileSpecTest.GuessPathStyle (808 of 2154)
PASS: lldb-api :: python_api/lldbutil/process/TestPrintStackTraces.py (809 of 2154)
PASS: lldb-shell :: ObjectFile/PECOFF/symbol.yaml (810 of 2154)
PASS: lldb-unit :: Utility/./UtilityTests/ArgsTest.DoubleQuotedItem (811 of 2154)
PASS: lldb-unit :: Utility/./UtilityTests/StringExtractorTest.DecodeHexU8_Underflow2 (812 of 2154)
UNSUPPORTED: lldb-shell :: Register/x86-zmm-read.test (813 of 2154)
PASS: lldb-api :: lang/cpp/char8_t/TestCxxChar8_t.py (814 of 2154)
PASS: lldb-api :: commands/expression/radar_9531204/TestPrintfAfterUp.py (815 of 2154)
PASS: lldb-api :: commands/quit/TestQuit.py (816 of 2154)
PASS: lldb-api :: python_api/value/change_values/TestChangeValueAPI.py (817 of 2154)
PASS: lldb-api :: commands/expression/call-function/TestCallBuiltinFunction.py (818 of 2154)
PASS: lldb-api :: functionalities/gdb_remote_client/TestPlatformClient.py (819 of 2154)
PASS: lldb-unit :: Utility/./UtilityTests/VMRange.Comparison (820 of 2154)
PASS: lldb-unit :: DataFormatter/./LLDBFormatterTests/StringPrinterTests.CxxASCII (821 of 2154)
PASS: lldb-shell :: Driver/TestUseColor.test (822 of 2154)
PASS: lldb-unit :: Utility/./UtilityTests/ConstStringTest.CompareConstString (823 of 2154)
PASS: lldb-api :: functionalities/data-formatter/data-formatter-stl/libcxx/function/TestLibCxxFunction.py (824 of 2154)
PASS: lldb-api :: functionalities/data-formatter/data-formatter-stl/libcxx/unique_ptr/TestDataFormatterLibcxxUniquePtr.py (825 of 2154)
PASS: lldb-unit :: Utility/./UtilityTests/SerializationRountripTest.SerializeDeserializePodReferences (826 of 2154)
PASS: lldb-unit :: SymbolFile/NativePDB/./SymbolFileNativePDBTests/PDBFPOProgramToDWARFExpressionTests.InvalidOpBinary (827 of 2154)
PASS: lldb-unit :: Process/gdb-remote/./ProcessGdbRemoteTests/GDBRemoteClientBaseTest.InterruptNoResponse (828 of 2154)
PASS: lldb-api :: commands/expression/regression-access-function-template-in-record/TestRegressionAccessFunctionTemplateInRecord.py (829 of 2154)
UNSUPPORTED: lldb-api :: tools/lldb-server/TestGdbRemoteAuxvSupport.py (830 of 2154)
PASS: lldb-api :: functionalities/data-formatter/data-formatter-stl/libcxx/optional/TestDataFormatterLibcxxOptional.py (831 of 2154)
PASS: lldb-unit :: Utility/./UtilityTests/StreamTeeTest.CopyConstructor (832 of 2154)
PASS: lldb-shell :: ExecControl/StopHook/stop-hook.test (833 of 2154)
PASS: lldb-shell :: Driver/TestSingleQuote.test (834 of 2154)
PASS: lldb-api :: types/TestLongTypes.py (835 of 2154)
UNSUPPORTED: lldb-api :: functionalities/data-formatter/data-formatter-stl/libstdcpp/vector/TestDataFormatterStdVector.py (836 of 2154)
PASS: lldb-unit :: Utility/./UtilityTests/TimerTest.CategoryTimesStats (837 of 2154)
PASS: lldb-shell :: SymbolFile/NativePDB/function-types-builtins.cpp (838 of 2154)
PASS: lldb-api :: functionalities/data-formatter/data-formatter-objc/TestDataFormatterObjCNSError.py (839 of 2154)
PASS: lldb-api :: python_api/module_section/TestModuleAndSection.py (840 of 2154)
PASS: lldb-api :: functionalities/deleted-executable/TestDeletedExecutable.py (841 of 2154)
PASS: lldb-api :: functionalities/data-formatter/data-formatter-objc/cmtime/TestDataFormatterCMTime.py (842 of 2154)
UNSUPPORTED: lldb-shell :: Register/x86-ymm-read.test (843 of 2154)
PASS: lldb-unit :: Utility/./UtilityTests/OptionsWithRawTest.EmptySuffix (844 of 2154)
PASS: lldb-unit :: Utility/./UtilityTests/StreamTest.PutRawBytesToLittleEndian (845 of 2154)
PASS: lldb-unit :: Utility/./UtilityTests/ScalarTest.GetValue (846 of 2154)
PASS: lldb-unit :: Utility/./UtilityTests/FileSpecTest.Match (847 of 2154)
PASS: lldb-api :: lang/c/shared_lib_stripped_symbols/TestSharedLibStrippedSymbols.py (848 of 2154)
PASS: lldb-shell :: SymbolFile/DWARF/dir-separator-windows.s (849 of 2154)
PASS: lldb-shell :: Settings/TestSettingsSet.test (850 of 2154)
PASS: lldb-api :: tools/lldb-vscode/variables/TestVSCode_variables.py (851 of 2154)
PASS: lldb-api :: lang/objc/objc-property/TestObjCProperty.py (852 of 2154)
PASS: lldb-unit :: Utility/./UtilityTests/PassiveReplayTest.InstrumentedFooInvalid (853 of 2154)
PASS: lldb-unit :: Target/./TargetTests/PathMappingListTest.RelativeTests (854 of 2154)
PASS: lldb-api :: lang/cpp/global_operators/TestCppGlobalOperators.py (855 of 2154)
PASS: lldb-unit :: Utility/./UtilityTests/StringLexerTest.NextIfList (856 of 2154)
PASS: lldb-unit :: Utility/./UtilityTests/StringLexerTest.AdvanceIf (857 of 2154)
PASS: lldb-api :: functionalities/tail_call_frames/thread_step_out_or_return/TestSteppingOutWithArtificialFrames.py (858 of 2154)
PASS: lldb-unit :: Utility/./UtilityTests/StreamTest.AddressSuffix (859 of 2154)
PASS: lldb-shell :: ObjectFile/ELF/avr-basic-info.yaml (860 of 2154)
PASS: lldb-api :: commands/watchpoints/watchpoint_commands/condition/TestWatchpointConditionCmd.py (861 of 2154)
PASS: lldb-unit :: DataFormatter/./LLDBFormatterTests/TypeMatcherTests.CreatedBySameMatchString (862 of 2154)
PASS: lldb-unit :: ObjectFile/Breakpad/./ObjectFileBreakpadTests/ModuleRecord.parse (863 of 2154)
UNSUPPORTED: lldb-shell :: ScriptInterpreter/Lua/quit.test (864 of 2154)
PASS: lldb-shell :: Reproducer/Functionalities/TestExpressionEvaluation.test (865 of 2154)
UNSUPPORTED: lldb-shell :: Breakpoint/case-insensitive.test (866 of 2154)
PASS: lldb-unit :: Symbol/./SymbolTests/PostfixExpression.ParseFPOProgram (867 of 2154)
PASS: lldb-shell :: Breakpoint/dummy-target.test (868 of 2154)
UNSUPPORTED: lldb-api :: commands/register/register/intel_xtended_registers/TestMPXRegisters.py (869 of 2154)
PASS: lldb-api :: commands/gui/viewlarge/TestGuiViewLarge.py (870 of 2154)
PASS: lldb-api :: commands/watchpoints/watchpoint_count/TestWatchpointCount.py (871 of 2154)
PASS: lldb-unit :: Utility/./UtilityTests/StringExtractorTest.GetHexU8_Extra (872 of 2154)
PASS: lldb-unit :: Utility/./UtilityTests/RangeTest.DefaultConstructor (873 of 2154)
PASS: lldb-api :: commands/expression/import-std-module/basic/TestImportStdModule.py (874 of 2154)
PASS: lldb-api :: functionalities/tail_call_frames/ambiguous_tail_call_seq1/TestAmbiguousTailCallSeq1.py (875 of 2154)
UNSUPPORTED: lldb-api :: functionalities/thread/thread_specific_break_plus_condition/TestThreadSpecificBpPlusCondition.py (876 of 2154)
PASS: lldb-unit :: Utility/./UtilityTests/ScalarTest.Promotion (877 of 2154)
PASS: lldb-api :: macosx/find-dsym/deep-bundle/TestDeepBundle.py (878 of 2154)
PASS: lldb-api :: commands/expression/import-std-module/unique_ptr/TestUniquePtrFromStdModule.py (879 of 2154)
PASS: lldb-unit :: Utility/./UtilityTests/StringListTest.ForRangeEmpty (880 of 2154)
PASS: lldb-unit :: Utility/./UtilityTests/ScalarTest.Comparison (881 of 2154)
PASS: lldb-unit :: ScriptInterpreter/Python/./ScriptInterpreterPythonTests/PythonDataObjectsTest.TestPythonListManipulation (882 of 2154)
PASS: lldb-shell :: ObjectFile/PECOFF/invalid-export-table.yaml (883 of 2154)
PASS: lldb-api :: functionalities/thread/concurrent_events/TestConcurrentCrashWithSignal.py (884 of 2154)
PASS: lldb-unit :: ObjectFile/MachO/./ObjectFileMachOTests/ObjectFileMachOTest.ModuleFromSharedCacheInfo (885 of 2154)
PASS: lldb-unit :: Utility/./UtilityTests/StringExtractorTest.GetU64LittleEndian (886 of 2154)
PASS: lldb-unit :: Utility/./UtilityTests/StringListTest.Assignment (887 of 2154)
PASS: lldb-unit :: Utility/./UtilityTests/StringLexerTest.Peek (888 of 2154)
PASS: lldb-unit :: Utility/./UtilityTests/VMRange.SetEndAddress (889 of 2154)
PASS: lldb-unit :: UnwindAssembly/x86/./UnwindAssemblyx86Tests/Testx86AssemblyInspectionEngine.TestAddRSP (890 of 2154)
PASS: lldb-unit :: Utility/./UtilityTests/UserIDResolver.GetGroupName (891 of 2154)
PASS: lldb-api :: commands/frame/select/TestFrameSelect.py (892 of 2154)
PASS: lldb-api :: commands/expression/diagnostics/TestExprDiagnostics.py (893 of 2154)
PASS: lldb-unit :: Expression/./ExpressionTests/CppModuleConfigurationTest.Sysroot (894 of 2154)
PASS: lldb-api :: commands/statistics/basic/TestStats.py (895 of 2154)
PASS: lldb-unit :: Utility/./UtilityTests/FileSpecTest.Equal (896 of 2154)
PASS: lldb-api :: commands/expression/ir-interpreter-phi-nodes/TestIRInterpreterPHINodes.py (897 of 2154)
PASS: lldb-unit :: ScriptInterpreter/Python/./ScriptInterpreterPythonTests/PythonDataObjectsTest.TestPythonString (898 of 2154)
PASS: lldb-api :: functionalities/data-formatter/data-formatter-cpp/TestDataFormatterCpp.py (899 of 2154)
PASS: lldb-api :: lang/objc/modules-auto-import/TestModulesAutoImport.py (900 of 2154)
PASS: lldb-unit :: Utility/./UtilityTests/RecordReplayTest.InstrumentedBarRef (901 of 2154)
PASS: lldb-unit :: Utility/./UtilityTests/ProcessInstanceInfo.Yaml (902 of 2154)
PASS: lldb-unit :: Signals/./SignalsTests/UnixSignalsTest.VersionChange (903 of 2154)
PASS: lldb-api :: functionalities/gdb_remote_client/TestWriteMemory.py (904 of 2154)
PASS: lldb-api :: functionalities/data-formatter/typedef_array/TestTypedefArray.py (905 of 2154)
PASS: lldb-unit :: Utility/./UtilityTests/PassiveReplayTest.InstrumentedFoo (906 of 2154)
PASS: lldb-shell :: Expr/TestIRMemoryMap.test (907 of 2154)
PASS: lldb-unit :: Utility/./UtilityTests/RangeTest.Slide (908 of 2154)
PASS: lldb-shell :: SymbolFile/NativePDB/disassembly.cpp (909 of 2154)
UNSUPPORTED: lldb-api :: commands/register/register/aarch64_sve_registers/rw_access_static_config/TestSVERegisters.py (910 of 2154)
PASS: lldb-api :: functionalities/data-formatter/data-formatter-enum-format/TestDataFormatterEnumFormat.py (911 of 2154)
PASS: lldb-shell :: SymbolFile/DWARF/debug-names-compressed.cpp (912 of 2154)
PASS: lldb-api :: types/TestShortType.py (913 of 2154)
PASS: lldb-unit :: Core/./LLDBCoreTests/MangledTest.NameIndexes_FindFunctionSymbols (914 of 2154)
UNSUPPORTED: lldb-api :: functionalities/darwin_log/format/TestDarwinLogMessageFormat.py (915 of 2154)
PASS: lldb-api :: functionalities/tsan/thread_leak/TestTsanThreadLeak.py (916 of 2154)
PASS: lldb-api :: lang/cpp/member-and-local-vars-with-same-name/TestMembersAndLocalsWithSameName.py (917 of 2154)
PASS: lldb-unit :: Utility/./UtilityTests/StringListTest.JoinSingle (918 of 2154)
PASS: lldb-shell :: Commands/CommandScriptImmediateOutput/CommandScriptImmediateOutputConsole.test (919 of 2154)
PASS: lldb-unit :: Utility/./UtilityTests/SubsystemRAIITest.SubsystemWithErrorFailure (920 of 2154)
UNSUPPORTED: lldb-shell :: ScriptInterpreter/Lua/lua-python.test (921 of 2154)
PASS: lldb-unit :: Utility/./UtilityTests/FileSpecTest.AppendPathComponent (922 of 2154)
PASS: lldb-api :: lang/objc/forward-decl/TestForwardDecl.py (923 of 2154)
PASS: lldb-shell :: Reproducer/TestWorkingDir.test (924 of 2154)
PASS: lldb-unit :: Utility/./UtilityTests/StreamTest.PutHex8 (925 of 2154)
PASS: lldb-api :: source-manager/TestSourceManager.py (926 of 2154)
UNSUPPORTED: lldb-shell :: Unwind/unwind-plan-dwarf-dump.test (927 of 2154)
UNSUPPORTED: lldb-api :: macosx/macCatalystAppMacOSFramework/TestMacCatalystAppWithMacOSFramework.py (928 of 2154)
PASS: lldb-api :: python_api/sbenvironment/TestSBEnvironment.py (929 of 2154)
PASS: lldb-api :: functionalities/breakpoint/move_nearest/TestMoveNearest.py (930 of 2154)
UNSUPPORTED: lldb-shell :: SymbolFile/PDB/pointers.test (931 of 2154)
PASS: lldb-shell :: ScriptInterpreter/None/import_module.test (932 of 2154)
PASS: lldb-shell :: Minidump/Windows/arm-fp-unwind.test (933 of 2154)
PASS: lldb-api :: functionalities/gdb_remote_client/TestWasm.py (934 of 2154)
PASS: lldb-shell :: SymbolFile/DWARF/array-sizes.s (935 of 2154)
PASS: lldb-shell :: Register/x86-64-gp-read.test (936 of 2154)
PASS: lldb-shell :: Breakpoint/case-sensitive.test (937 of 2154)
PASS: lldb-unit :: Utility/./UtilityTests/ArgsTest.ReplaceArgumentAtIndexEqual (938 of 2154)
PASS: lldb-api :: functionalities/avoids-fd-leak/TestFdLeak.py (939 of 2154)
PASS: lldb-api :: functionalities/thread/concurrent_events/TestConcurrentTwoWatchpointsOneDelayBreakpoint.py (940 of 2154)
UNSUPPORTED: lldb-shell :: ScriptInterpreter/Lua/watchpoint_callback.test (941 of 2154)
PASS: lldb-shell :: SymbolFile/DWARF/split-dwarf-multiple-cu.ll (942 of 2154)
UNSUPPORTED: lldb-api :: lang/objc/rdar-12408181/TestRdar12408181.py (943 of 2154)
PASS: lldb-api :: functionalities/data-formatter/compactvectors/TestCompactVectors.py (944 of 2154)
PASS: lldb-api :: functionalities/data-formatter/data-formatter-stl/libcxx/deque/TestDataFormatterLibcxxDeque.py (945 of 2154)
PASS: lldb-api :: python_api/sbdata/TestSBData.py (946 of 2154)
PASS: lldb-shell :: SymbolFile/DWARF/debug-types-dwarf5.s (947 of 2154)
PASS: lldb-api :: functionalities/data-formatter/data-formatter-ptr-to-array/TestPtrToArrayFormatting.py (948 of 2154)
PASS: lldb-unit :: Utility/./UtilityTests/UriParserTest.BracketedHostname (949 of 2154)
PASS: lldb-api :: commands/watchpoints/watchpoint_commands/TestWatchpointCommands.py (950 of 2154)
PASS: lldb-unit :: Utility/./UtilityTests/StringListTest.GetMaxStringLengthEmpty (951 of 2154)
PASS: lldb-api :: lang/c/record_decl_in_expr/TestRecordDeclInExpr.py (952 of 2154)
PASS: lldb-api :: functionalities/data-formatter/data-formatter-globals/TestDataFormatterGlobals.py (953 of 2154)
PASS: lldb-unit :: Utility/./UtilityTests/ConstStringTest.FromMidOfBufferStringRef (954 of 2154)
PASS: lldb-unit :: Utility/./UtilityTests/StringExtractorTest.GetHexBytesAvail_OddPair (955 of 2154)
PASS: lldb-unit :: Process/minidump/./LLDBMinidumpTests/MinidumpParserTest.MinidumpDuplicateModuleSeparateCode (956 of 2154)
PASS: lldb-unit :: Utility/./UtilityTests/FileSpecTest.FormatFileSpec (957 of 2154)
PASS: lldb-api :: commands/watchpoints/watchpoint_commands/command/TestWatchpointCommandLLDB.py (958 of 2154)
PASS: lldb-api :: commands/expression/persist_objc_pointeetype/TestPersistObjCPointeeType.py (959 of 2154)
PASS: lldb-unit :: Utility/./UtilityTests/LogChannelTest.List (960 of 2154)
PASS: lldb-unit :: Utility/./UtilityTests/BinaryStreamTest.PutULEB128FourBytes (961 of 2154)
PASS: lldb-unit :: Expression/./ExpressionTests/DiagnosticManagerTest.HasFixits (962 of 2154)
PASS: lldb-unit :: Symbol/./SymbolTests/TestTypeSystemClang.TestFunctionTemplateConstruction (963 of 2154)
PASS: lldb-unit :: Utility/./UtilityTests/FileSpecTest.OperatorBool (964 of 2154)
PASS: lldb-unit :: ScriptInterpreter/Python/./ScriptInterpreterPythonTests/PythonDataObjectsTest.TestObjectAttributes (965 of 2154)
PASS: lldb-unit :: Host/./HostTests/FileSystemTest.Resolve (966 of 2154)
PASS: lldb-api :: lang/cpp/exceptions/TestCPPExceptionBreakpoints.py (967 of 2154)
PASS: lldb-unit :: Utility/./UtilityTests/StringExtractorTest.GetHexBytes_OddPair (968 of 2154)
PASS: lldb-api :: lang/objc/direct-dispatch-step/TestObjCDirectDispatchStepping.py (969 of 2154)
PASS: lldb-api :: functionalities/tail_call_frames/disambiguate_paths_to_common_sink/TestDisambiguatePathsToCommonSink.py (970 of 2154)
PASS: lldb-api :: assert_messages_test/TestAssertMessages.py (971 of 2154)
PASS: lldb-shell :: Breakpoint/debug_addrx.test (972 of 2154)
PASS: lldb-unit :: Utility/./UtilityTests/DataExtractorTest.GetCStrAtEnd (973 of 2154)
PASS: lldb-api :: python_api/process/TestProcessAPI.py (974 of 2154)
PASS: lldb-unit :: Process/minidump/./LLDBMinidumpTests/MinidumpParserTest.GetThreadContext_x86_32 (975 of 2154)
PASS: lldb-api :: functionalities/data-formatter/nsarraysynth/TestNSArraySynthetic.py (976 of 2154)
PASS: lldb-unit :: Utility/./UtilityTests/FileSpecTest.EqualDotsPosixRoot (977 of 2154)
PASS: lldb-api :: lang/cpp/this_class_type_mixing/TestThisClassTypeMixing.py (978 of 2154)
PASS: lldb-unit :: Utility/./UtilityTests/BinaryStreamTest.PutSLEB128ThreeBytes (979 of 2154)
PASS: lldb-api :: commands/disassemble/basic/TestFrameDisassemble.py (980 of 2154)
PASS: lldb-api :: commands/process/attach/TestProcessAttach.py (981 of 2154)
PASS: lldb-api :: commands/expression/pr35310/TestExprsBug35310.py (982 of 2154)
XFAIL: lldb-shell :: SymbolFile/DWARF/find-type-in-function.cpp (983 of 2154)
PASS: lldb-api :: functionalities/thread/exit_during_expression/TestExitDuringExpression.py (984 of 2154)
PASS: lldb-unit :: Utility/./UtilityTests/RangeTest.Copy (985 of 2154)
PASS: lldb-unit :: Utility/./UtilityTests/StringLexerTest.GetUnlexed (986 of 2154)
PASS: lldb-shell :: ObjectFile/Breakpad/sections-trailing-func.test (987 of 2154)
PASS: lldb-unit :: Utility/./UtilityTests/BroadcasterTest.BroadcastEvent (988 of 2154)
PASS: lldb-api :: lang/c/inlines/TestRedefinitionsInInlines.py (989 of 2154)
PASS: lldb-unit :: Symbol/./SymbolTests/TestTypeSystemClang.TestUnifyAccessSpecifiers (990 of 2154)
PASS: lldb-unit :: DataFormatter/./LLDBFormatterTests/TypeMatcherTests.RegexName (991 of 2154)
PASS: lldb-shell :: SymbolFile/Breakpad/symtab.test (992 of 2154)
PASS: lldb-api :: python_api/name_lookup/TestNameLookup.py (993 of 2154)
PASS: lldb-shell :: Reproducer/TestDSYM.test (994 of 2154)
PASS: lldb-unit :: Symbol/./SymbolTests/TestClangASTImporter.CanImportInvalidType (995 of 2154)
XFAIL: lldb-shell :: Register/x86-mm-xmm-write.test (996 of 2154)
PASS: lldb-shell :: Reproducer/TestDiscard.test (997 of 2154)
PASS: lldb-unit :: Utility/./UtilityTests/RegisterValueTest.GetSet8 (998 of 2154)
PASS: lldb-unit :: Host/./HostTests/NativeProcessProtocolTest.ReadCStringFromMemory_MaxSize (999 of 2154)
PASS: lldb-api :: python_api/findvalue_duplist/TestSBFrameFindValue.py (1000 of 2154)
PASS: lldb-unit :: Expression/./ExpressionTests/CppModuleConfigurationTest.IgnoreLibStdCpp (1001 of 2154)
PASS: lldb-shell :: Reproducer/TestPythonImport.test (1002 of 2154)
PASS: lldb-api :: functionalities/dynamic_value_child_count/TestDynamicValueChildCount.py (1003 of 2154)
PASS: lldb-unit :: Utility/./UtilityTests/OptionsWithRawTest.QuotedSuffix (1004 of 2154)
UNSUPPORTED: lldb-api :: tools/lldb-server/TestGdbRemote_vContThreads.py (1005 of 2154)
PASS: lldb-unit :: Target/./TargetTests/PathMappingListTest.AbsoluteTests (1006 of 2154)
PASS: lldb-api :: commands/expression/persistent_variables/TestPersistentVariables.py (1007 of 2154)
PASS: lldb-unit :: Process/gdb-remote/./ProcessGdbRemoteTests/GDBRemoteClientBaseTest.SendContinueAndInterrupt (1008 of 2154)
PASS: lldb-unit :: Utility/./UtilityTests/ReproducerTest.SetCapture (1009 of 2154)
PASS: lldb-unit :: Symbol/./SymbolTests/LineEntryTest.GetSameLineContiguousAddressRangeNoInlines (1010 of 2154)
PASS: lldb-api :: lang/objcxx/class-name-clash/TestNameClash.py (1011 of 2154)
PASS: lldb-unit :: Utility/./UtilityTests/FileSpecTest.CopyByAppendingPathComponent (1012 of 2154)
UNSUPPORTED: lldb-shell :: SymbolFile/PDB/typedefs.test (1013 of 2154)
PASS: lldb-shell :: Minidump/Windows/broken-unwind.test (1014 of 2154)
PASS: lldb-shell :: BuildScript/compiler-full-path.test (1015 of 2154)
PASS: lldb-unit :: Process/gdb-remote/./ProcessGdbRemoteTests/GDBRemoteCommunicationServerTest.SendErrorResponse_Status (1016 of 2154)
PASS: lldb-unit :: Utility/./UtilityTests/ScalarTest.RightShiftOperator (1017 of 2154)
PASS: lldb-unit :: Utility/./UtilityTests/UriParserTest.MinimalPath (1018 of 2154)
PASS: lldb-unit :: Utility/./UtilityTests/StringExtractorTest.GetHexU8_Underflow (1019 of 2154)
PASS: lldb-shell :: SymbolFile/DWARF/debug-types-signature-loop.s (1020 of 2154)
PASS: lldb-api :: commands/command/invalid-args/TestInvalidArgsCommand.py (1021 of 2154)
PASS: lldb-api :: commands/gui/basic/TestGuiBasic.py (1022 of 2154)
PASS: lldb-unit :: ObjectFile/Breakpad/./ObjectFileBreakpadTests/StackWinRecord.parse (1023 of 2154)
PASS: lldb-unit :: Utility/./UtilityTests/TimerTest.CategoryTimesNested (1024 of 2154)
PASS: lldb-unit :: UnwindAssembly/ARM64/./Arm64InstEmulationTests/TestArm64InstEmulation.TestFramelessThreeEpilogueFunction (1025 of 2154)
PASS: lldb-api :: python_api/default-constructor/TestDefaultConstructorForAPIObjects.py (1026 of 2154)
PASS: lldb-api :: tools/lldb-server/inferior-crash/TestGdbRemoteSegFault.py (1027 of 2154)
PASS: lldb-api :: lang/objc/rdar-11355592/TestRdar11355592.py (1028 of 2154)
UNSUPPORTED: lldb-shell :: ExecControl/StopHook/stop-hook-threads.test (1029 of 2154)
UNSUPPORTED: lldb-shell :: ScriptInterpreter/Lua/io.test (1030 of 2154)
PASS: lldb-shell :: Minidump/dump-all.test (1031 of 2154)
PASS: lldb-shell :: SymbolFile/DWARF/clang-ast-from-dwarf-objc-property.m (1032 of 2154)
PASS: lldb-api :: commands/platform/file/close/TestPlatformFileClose.py (1033 of 2154)
PASS: lldb-api :: tools/lldb-vscode/runInTerminal/TestVSCode_runInTerminal.py (1034 of 2154)
PASS: lldb-api :: tools/lldb-vscode/attach/TestVSCode_attach.py (1035 of 2154)
UNSUPPORTED: lldb-shell :: SymbolFile/DWARF/DW_TAG_GNU_call_site-DW_AT_low_pc.s (1036 of 2154)
PASS: lldb-api :: functionalities/thread/ignore_suspended/TestIgnoreSuspendedThread.py (1037 of 2154)
PASS: lldb-shell :: SymbolFile/DWARF/find-function-regex.cpp (1038 of 2154)
PASS: lldb-unit :: Utility/./UtilityTests/DataExtractorTest.GetULEB128_bit63 (1039 of 2154)
PASS: lldb-api :: commands/watchpoints/watchpoint_commands/command/TestWatchpointCommandPython.py (1040 of 2154)
PASS: lldb-api :: commands/target/select/TestTargetSelect.py (1041 of 2154)
PASS: lldb-api :: commands/expression/context-object-objc/TestContextObjectObjc.py (1042 of 2154)
PASS: lldb-api :: tools/lldb-server/TestLldbGdbServer.py (1043 of 2154)
PASS: lldb-unit :: Utility/./UtilityTests/StreamTest.PutCStringWithStringRef (1044 of 2154)
PASS: lldb-unit :: Expression/./ExpressionTests/DiagnosticManagerTest.GetStringBasic (1045 of 2154)
PASS: lldb-unit :: Utility/./UtilityTests/ArgsTest.BareSingleQuote (1046 of 2154)
PASS: lldb-shell :: SymbolFile/NativePDB/tag-types.cpp (1047 of 2154)
PASS: lldb-shell :: ObjectFile/MachO/symtab.yaml (1048 of 2154)
PASS: lldb-api :: lang/objc/rdar-10967107/TestRdar10967107.py (1049 of 2154)
PASS: lldb-unit :: Utility/./UtilityTests/VASprintfTest.EncodingError (1050 of 2154)
PASS: lldb-unit :: UnwindAssembly/x86/./UnwindAssemblyx86Tests/Testx86AssemblyInspectionEngine.TestLEAVE (1051 of 2154)
PASS: lldb-api :: functionalities/param_entry_vals/basic_entry_values/TestBasicEntryValues.py (1052 of 2154)
PASS: lldb-unit :: Utility/./UtilityTests/RangeTest.ClearWithStarAddress (1053 of 2154)
PASS: lldb-unit :: Host/./HostTests/SocketTest.TCPGetAddress (1054 of 2154)
PASS: lldb-unit :: Utility/./UtilityTests/Flags.Test (1055 of 2154)
PASS: lldb-api :: lang/cpp/bitfields/TestCppBitfields.py (1056 of 2154)
PASS: lldb-unit :: Utility/./UtilityTests/ArchSpecTest.TripleComponentsWereSpecified (1057 of 2154)
PASS: lldb-unit :: Host/./HostTests/FileSystemTest.GetByteSize (1058 of 2154)
PASS: lldb-shell :: Reproducer/TestGDBRemoteRepro.test (1059 of 2154)
PASS: lldb-unit :: UnwindAssembly/x86/./UnwindAssemblyx86Tests/Testx86AssemblyInspectionEngine.TestPushR13 (1060 of 2154)
PASS: lldb-shell :: Reproducer/Functionalities/TestDataFormatter.test (1061 of 2154)
PASS: lldb-unit :: tools/lldb-server/tests/./LLDBServerTests/TestBase.DebugserverEnv (1062 of 2154)
PASS: lldb-unit :: Utility/./UtilityTests/LogChannelEnabledTest.LLDB_LOG_ERROR (1063 of 2154)
PASS: lldb-shell :: Minidump/memory-region-from-module.yaml (1064 of 2154)
UNSUPPORTED: lldb-api :: tools/lldb-server/TestGdbRemoteCompletion.py (1065 of 2154)
PASS: lldb-unit :: UnwindAssembly/x86/./UnwindAssemblyx86Tests/Testx86AssemblyInspectionEngine.TestSubRSP (1066 of 2154)
UNSUPPORTED: lldb-shell :: Register/x86-ymm-write.test (1067 of 2154)
UNSUPPORTED: lldb-shell :: Register/x86-64-xmm16-write.test (1068 of 2154)
PASS: lldb-unit :: Utility/./UtilityTests/StringExtractorTest.GetHexU8_InvalidHex (1069 of 2154)
PASS: lldb-api :: lang/c/stepping/TestThreadStepping.py (1070 of 2154)
PASS: lldb-api :: functionalities/data-formatter/dump_dynamic/TestDumpDynamic.py (1071 of 2154)
PASS: lldb-unit :: ScriptInterpreter/Python/./ScriptInterpreterPythonTests/PythonDataObjectsTest.TestCallable (1072 of 2154)
PASS: lldb-api :: functionalities/data-formatter/data-formatter-synthval/TestDataFormatterSynthVal.py (1073 of 2154)
PASS: lldb-unit :: Utility/./UtilityTests/RangeTest.ContainsRangeStartingFromZero (1074 of 2154)
PASS: lldb-unit :: Process/gdb-remote/./ProcessGdbRemoteTests/GDBRemoteCommunicationClientTest.SendStopTracePacket (1075 of 2154)
PASS: lldb-unit :: Utility/./UtilityTests/StreamTest.ShiftOperatorStrings (1076 of 2154)
PASS: lldb-shell :: SymbolFile/DWARF/dir-separator-no-comp-dir.s (1077 of 2154)
PASS: lldb-api :: functionalities/limit-debug-info/TestLimitDebugInfo.py (1078 of 2154)
PASS: lldb-api :: types/TestCharType.py (1079 of 2154)
PASS: lldb-unit :: Host/./HostTests/FileActionTest.Open (1080 of 2154)
PASS: lldb-unit :: Utility/./UtilityTests/DataExtractorTest.GetDouble (1081 of 2154)
PASS: lldb-unit :: Utility/./UtilityTests/ArgsTest.ReplaceArgumentAtIndexOutOfRange (1082 of 2154)
PASS: lldb-unit :: Core/./LLDBCoreTests/SourceFileCache.FindSourceFileFound (1083 of 2154)
PASS: lldb-api :: lang/objc/objc-new-syntax/TestObjCNewSyntaxLiteral.py (1084 of 2154)
PASS: lldb-unit :: Interpreter/./InterpreterTests/OptionValueFileColonLine.setFromString (1085 of 2154)
PASS: lldb-unit :: Process/minidump/./LLDBMinidumpTests/MinidumpParserTest.GetMemoryRegionInfo (1086 of 2154)
PASS: lldb-api :: commands/session/save/TestSessionSave.py (1087 of 2154)
PASS: lldb-unit :: Utility/./UtilityTests/DataExtractorTest.GetCStrUnterminated (1088 of 2154)
PASS: lldb-api :: functionalities/breakpoint/breakpoint_ids/TestBreakpointIDs.py (1089 of 2154)
PASS: lldb-shell :: SymbolFile/Breakpad/unwind-via-stack-win.test (1090 of 2154)
PASS: lldb-unit :: SymbolFile/DWARF/./SymbolFileDWARFTests/SymbolFileDWARFTests.TestAbilitiesForDWARF (1091 of 2154)
PASS: lldb-api :: sanity/TestModuleCacheSanity.py (1092 of 2154)
PASS: lldb-unit :: Utility/./UtilityTests/StreamTest.PutBytesAsRawHex8ToLittleEndian (1093 of 2154)
PASS: lldb-unit :: Interpreter/./InterpreterTests/CompletionTest.DirCompletionAbsolute (1094 of 2154)
PASS: lldb-unit :: Process/gdb-remote/./ProcessGdbRemoteTests/GDBRemoteCommunicationClientTest.SendGetMetaDataPacket (1095 of 2154)
PASS: lldb-api :: functionalities/thread/concurrent_events/TestConcurrentSignalBreak.py (1096 of 2154)
PASS: lldb-unit :: Interpreter/./InterpreterTests/OptionArgParserTest.toScriptLanguage (1097 of 2154)
PASS: lldb-api :: lang/cpp/multiple-inheritance/TestCppMultipleInheritance.py (1098 of 2154)
PASS: lldb-unit :: Utility/./UtilityTests/ArgsTest.TestInsertArg (1099 of 2154)
PASS: lldb-api :: functionalities/signal/raise/TestRaise.py (1100 of 2154)
PASS: lldb-api :: lang/objc/objc-ivar-stripped/TestObjCIvarStripped.py (1101 of 2154)
PASS: lldb-api :: python_api/objc_type/TestObjCType.py (1102 of 2154)
PASS: lldb-shell :: ObjectFile/ELF/many-sections.s (1103 of 2154)
PASS: lldb-unit :: Utility/./UtilityTests/UriParserTest.BracketedHostnameWithPortIPv4 (1104 of 2154)
PASS: lldb-api :: tools/lldb-server/TestGdbRemoteRegisterState.py (1105 of 2154)
PASS: lldb-api :: functionalities/breakpoint/breakpoint_set_restart/TestBreakpointSetRestart.py (1106 of 2154)
PASS: lldb-unit :: Utility/./UtilityTests/BinaryStreamTest.PutULEB128SixBytes (1107 of 2154)
PASS: lldb-unit :: Symbol/./SymbolTests/SymbolsTest.LocateExecutableSymbolFileForUnknownExecutableAndMissingSymbolFile (1108 of 2154)
PASS: lldb-api :: commands/expression/import-std-module/forward_decl_from_module/TestForwardDeclFromStdModule.py (1109 of 2154)
PASS: lldb-api :: python_api/watchpoint/TestWatchpointIter.py (1110 of 2154)
PASS: lldb-api :: functionalities/data-formatter/type_summary_list_script/TestTypeSummaryListScript.py (1111 of 2154)
PASS: lldb-shell :: Recognizer/assert.test (1112 of 2154)
PASS: lldb-unit :: UnwindAssembly/x86/./UnwindAssemblyx86Tests/Testx86AssemblyInspectionEngine.TestSpillRegToStackViaMOVi386 (1113 of 2154)
PASS: lldb-api :: commands/expression/class_template_specialization_empty_pack/TestClassTemplateSpecializationParametersHandling.py (1114 of 2154)
PASS: lldb-unit :: Utility/./UtilityTests/ArgsTest.TestSingleArg (1115 of 2154)
PASS: lldb-api :: functionalities/abbreviation/TestCommonShortSpellings.py (1116 of 2154)
PASS: lldb-unit :: Utility/./UtilityTests/Flags.IsClear (1117 of 2154)
PASS: lldb-unit :: Utility/./UtilityTests/ArchSpecTest.MergeFrom (1118 of 2154)
PASS: lldb-api :: functionalities/data-formatter/nsdictionarysynth/TestNSDictionarySynthetic.py (1119 of 2154)
PASS: lldb-shell :: ScriptInterpreter/None/none.test (1120 of 2154)
PASS: lldb-unit :: UnwindAssembly/x86/./UnwindAssemblyx86Tests/Testx86AssemblyInspectionEngine.TestPopEBX (1121 of 2154)
PASS: lldb-api :: python_api/sbtype_typeclass/TestSBTypeTypeClass.py (1122 of 2154)
PASS: lldb-shell :: ObjectFile/PECOFF/section-types.yaml (1123 of 2154)
PASS: lldb-api :: lang/cpp/namespace/TestNamespaceLookup.py (1124 of 2154)
PASS: lldb-api :: functionalities/gdb_remote_client/TestArmRegisterDefinition.py (1125 of 2154)
PASS: lldb-api :: lang/cpp/diamond/TestDiamond.py (1126 of 2154)
UNSUPPORTED: lldb-api :: commands/watchpoints/hello_watchlocation/TestWatchLocation.py (1127 of 2154)
PASS: lldb-api :: functionalities/data-formatter/data-formatter-objc/TestDataFormatterObjCPlain.py (1128 of 2154)
PASS: lldb-unit :: UnwindAssembly/x86/./UnwindAssemblyx86Tests/Testx86AssemblyInspectionEngine.TestPushEDX (1129 of 2154)
PASS: lldb-api :: lang/cpp/class_types/TestClassTypes.py (1130 of 2154)
PASS: lldb-shell :: SymbolFile/DWARF/debug_rnglists-dwo.s (1131 of 2154)
PASS: lldb-unit :: SymbolFile/NativePDB/./SymbolFileNativePDBTests/PDBFPOProgramToDWARFExpressionTests.UnknownOp (1132 of 2154)
PASS: lldb-unit :: Utility/./UtilityTests/ArgsTest.TestTrailingBackslash (1133 of 2154)
PASS: lldb-unit :: Utility/./UtilityTests/NameMatchesTest.StartsWith (1134 of 2154)
PASS: lldb-api :: lang/c/conflicting-symbol/TestConflictingSymbol.py (1135 of 2154)
PASS: lldb-unit :: Symbol/./SymbolTests/TestTypeSystemClang.TestGetTypeClassTypeOfExpr (1136 of 2154)
PASS: lldb-unit :: Utility/./UtilityTests/StringExtractorTest.GetHexU8_InvalidHex_NoEof (1137 of 2154)
PASS: lldb-shell :: SymbolFile/DWARF/module-ownership.mm (1138 of 2154)
UNSUPPORTED: lldb-shell :: ScriptInterpreter/Lua/lua.test (1139 of 2154)
PASS: lldb-api :: functionalities/breakpoint/source_regexp/TestSourceRegexBreakpoints.py (1140 of 2154)
PASS: lldb-unit :: Target/./TargetTests/ModuleCacheTest.GetAndPutStrangeHostname (1141 of 2154)
PASS: lldb-unit :: Signals/./SignalsTests/UnixSignalsTest.GetFilteredSignals (1142 of 2154)
PASS: lldb-api :: functionalities/data-formatter/type_summary_list_arg/TestTypeSummaryListArg.py (1143 of 2154)
PASS: lldb-api :: arm/emulation/TestEmulations.py (1144 of 2154)
PASS: lldb-unit :: Utility/./UtilityTests/ScalarTest.Getters (1145 of 2154)
PASS: lldb-shell :: ObjectFile/MachO/lc_build_version.yaml (1146 of 2154)
PASS: lldb-shell :: ObjectFile/ELF/section-types.yaml (1147 of 2154)
PASS: lldb-api :: commands/expression/import-std-module/sysroot/TestStdModuleSysroot.py (1148 of 2154)
PASS: lldb-unit :: Utility/./UtilityTests/StreamTeeTest.SetStreamAtIndexOutOfBounds (1149 of 2154)
PASS: lldb-unit :: Process/gdb-remote/./ProcessGdbRemoteTests/GDBRemoteCommunicationServerTest.SendErrorResponse_ErrorNumber (1150 of 2154)
PASS: lldb-api :: functionalities/data-formatter/data-formatter-objc/nsstring/TestDataFormatterNSString.py (1151 of 2154)
PASS: lldb-unit :: ScriptInterpreter/Python/./ScriptInterpreterPythonTests/PythonDataObjectsTest.TestRun (1152 of 2154)
PASS: lldb-api :: lang/cpp/accelerator-table/TestCPPAccelerator.py (1153 of 2154)
PASS: lldb-api :: lang/objc/foundation/TestFoundationDisassembly.py (1154 of 2154)
PASS: lldb-unit :: Process/minidump/./LLDBMinidumpTests/MinidumpParserTest.GetPid (1155 of 2154)
PASS: lldb-unit :: Symbol/./SymbolTests/TestTypeSystemClang.TestRemoveFastQualifiers (1156 of 2154)
PASS: lldb-api :: commands/expression/options/TestExprOptions.py (1157 of 2154)
PASS: lldb-shell :: SymbolFile/NativePDB/function-types-classes.cpp (1158 of 2154)
PASS: lldb-unit :: UnwindAssembly/x86/./UnwindAssemblyx86Tests/Testx86AssemblyInspectionEngine.TestPushRBP (1159 of 2154)
PASS: lldb-api :: python_api/value/TestValueAPI.py (1160 of 2154)
PASS: lldb-unit :: Utility/./UtilityTests/SubsystemRAIITest.SubsystemWithErrorSuccess (1161 of 2154)
PASS: lldb-unit :: Expression/./ExpressionTests/DWARFExpression.DW_OP_piece (1162 of 2154)
PASS: lldb-unit :: DataFormatter/./LLDBFormatterTests/TypeMatcherTests.CreatedBySameMatchStringExactNamePrefixes (1163 of 2154)
PASS: lldb-api :: functionalities/inferior-crashing/recursive-inferior/TestRecursiveInferiorStep.py (1164 of 2154)
PASS: lldb-unit :: Utility/./UtilityTests/CompletionRequest.FakeLastArg (1165 of 2154)
PASS: lldb-unit :: Utility/./UtilityTests/ReproducerTest.SetReplay (1166 of 2154)
PASS: lldb-api :: iohandler/resize/TestIOHandlerResize.py (1167 of 2154)
PASS: lldb-unit :: Utility/./UtilityTests/RangeTest.ContainsEndInclusiveInvalid (1168 of 2154)
PASS: lldb-api :: lang/objc/objc-new-syntax/TestObjCNewSyntaxArray.py (1169 of 2154)
PASS: lldb-unit :: Utility/./UtilityTests/StringListTest.GetSize (1170 of 2154)
PASS: lldb-api :: functionalities/data-formatter/data-formatter-smart-array/TestDataFormatterSmartArray.py (1171 of 2154)
UNSUPPORTED: lldb-shell :: ScriptInterpreter/Lua/command_script_import.test (1172 of 2154)
PASS: lldb-unit :: Language/Highlighting/./HighlighterTests/HighlighterTest.ClangCursorOutOfBounds (1173 of 2154)
PASS: lldb-api :: functionalities/data-formatter/varscript_formatting/TestDataFormatterVarScriptFormatting.py (1174 of 2154)
PASS: lldb-api :: python_api/lldbutil/frame/TestFrameUtils.py (1175 of 2154)
PASS: lldb-api :: lang/c/complex_int/TestComplexInt.py (1176 of 2154)
UNSUPPORTED: lldb-api :: benchmarks/startup/TestStartupDelays.py (1177 of 2154)
PASS: lldb-unit :: UnwindAssembly/x86/./UnwindAssemblyx86Tests/Testx86AssemblyInspectionEngine.TestPushRBPWithREX (1178 of 2154)
PASS: lldb-unit :: ScriptInterpreter/Python/./ScriptInterpreterPythonTests/PythonDataObjectsTest.TestExceptions (1179 of 2154)
PASS: lldb-shell :: SymbolFile/DWARF/debug-types-line-tables.s (1180 of 2154)
PASS: lldb-api :: functionalities/tail_call_frames/cross_dso/TestCrossDSOTailCalls.py (1181 of 2154)
PASS: lldb-unit :: Symbol/./SymbolTests/TestTypeSystemClang.TestOwningModule (1182 of 2154)
PASS: lldb-api :: functionalities/memory/read/TestMemoryRead.py (1183 of 2154)
PASS: lldb-unit :: Utility/./UtilityTests/StreamTest.Indent (1184 of 2154)
PASS: lldb-unit :: Utility/./UtilityTests/StreamTest.AddressRangeInvalidRange (1185 of 2154)
PASS: lldb-shell :: ScriptInterpreter/Python/sb_address_exception.test (1186 of 2154)
PASS: lldb-shell :: Quit/TestQuitExitCode30.test (1187 of 2154)
PASS: lldb-api :: functionalities/thread/concurrent_events/TestConcurrentManyBreakpoints.py (1188 of 2154)
UNSUPPORTED: lldb-api :: benchmarks/expression/TestExpressionCmd.py (1189 of 2154)
PASS: lldb-unit :: Expression/./ExpressionTests/DiagnosticManagerTest.GetStringSeverityLabels (1190 of 2154)
PASS: lldb-api :: lang/cpp/virtual-overload/TestVirtualOverload.py (1191 of 2154)
PASS: lldb-unit :: Process/minidump/./LLDBMinidumpTests/MinidumpParserTest.GetFilteredModuleList (1192 of 2154)
PASS: lldb-unit :: Utility/./UtilityTests/NameMatchesTest.RegularExpression (1193 of 2154)
PASS: lldb-unit :: Utility/./UtilityTests/NameMatchesTest.Contains (1194 of 2154)
PASS: lldb-api :: functionalities/wrong_commands/TestWrongCommands.py (1195 of 2154)
PASS: lldb-unit :: Utility/./UtilityTests/AnsiTerminal.WhiteSpace (1196 of 2154)
PASS: lldb-api :: functionalities/ptr_refs/TestPtrRefs.py (1197 of 2154)
PASS: lldb-api :: functionalities/data-formatter/data-formatter-stl/libcxx/atomic/TestLibCxxAtomic.py (1198 of 2154)
PASS: lldb-unit :: Symbol/./SymbolTests/TestClangASTImporter.DeportDeclTagDecl (1199 of 2154)
PASS: lldb-shell :: SymbolFile/DWARF/DW_OP_piece-struct.s (1200 of 2154)
PASS: lldb-shell :: Quit/TestQuitExitCodeNonInt.test (1201 of 2154)
PASS: lldb-api :: lang/c/local_types/TestUseClosestType.py (1202 of 2154)
PASS: lldb-api :: commands/expression/codegen-crash-import-def-arraytype-element/TestImportDefinitionArrayType.py (1203 of 2154)
PASS: lldb-unit :: Utility/./UtilityTests/CompletionRequest.ShiftArguments (1204 of 2154)
PASS: lldb-shell :: SymbolFile/DWARF/debug_loc-aslr.s (1205 of 2154)
PASS: lldb-api :: lang/cpp/extern_c/TestExternCSymbols.py (1206 of 2154)
PASS: lldb-unit :: Process/gdb-remote/./ProcessGdbRemoteTests/GDBRemoteCommunicationClientTest.SendSignalsToIgnore (1207 of 2154)
PASS: lldb-unit :: Utility/./UtilityTests/StreamTest.ChangingByteOrder (1208 of 2154)
UNSUPPORTED: lldb-api :: lang/cpp/printf/TestPrintf.py (1209 of 2154)
PASS: lldb-api :: commands/expression/top-level/TestTopLevelExprs.py (1210 of 2154)
PASS: lldb-api :: commands/expression/import-std-module/list/TestListFromStdModule.py (1211 of 2154)
PASS: lldb-unit :: Utility/./UtilityTests/AnsiTerminal.AtStart (1212 of 2154)
PASS: lldb-api :: commands/expression/call-function/TestCallStopAndContinue.py (1213 of 2154)
PASS: lldb-api :: functionalities/breakpoint/breakpoint_ignore_count/TestBreakpointIgnoreCount.py (1214 of 2154)
FAIL: lldb-api :: commands/target/stop-hooks/TestStopHookScripted.py (1215 of 2154)
******************** TEST 'lldb-api :: commands/target/stop-hooks/TestStopHookScripted.py' FAILED ********************
Script:
--
/usr/local/Frameworks/Python.framework/Versions/3.7/bin/python3.7 /Users/buildslave/jenkins/workspace/lldb-cmake/llvm-project/lldb/test/API/dotest.py -s /Users/buildslave/jenkins/workspace/lldb-cmake/lldb-build/lldb-test-traces -S nm -u CXXFLAGS -u CFLAGS --codesign-identity - --server /Users/buildslave/jenkins/workspace/lldb-cmake/lldb-build/./bin/debugserver --arch x86_64 --build-dir /Users/buildslave/jenkins/workspace/lldb-cmake/lldb-build/lldb-test-build.noindex -s=/Users/buildslave/jenkins/workspace/lldb-cmake/test/logs -t --env TERM=vt100 --env LLVM_LIBS_DIR=/Users/buildslave/jenkins/workspace/lldb-cmake/lldb-build/./lib --arch x86_64 --build-dir /Users/buildslave/jenkins/workspace/lldb-cmake/lldb-build/lldb-test-build.noindex --lldb-module-cache-dir /Users/buildslave/jenkins/workspace/lldb-cmake/lldb-build/lldb-test-build.noindex/module-cache-lldb/lldb-api --clang-module-cache-dir /Users/buildslave/jenkins/workspace/lldb-cmake/lldb-build/lldb-test-build.noindex/module-cache-clang/lldb-api --executable /Users/buildslave/jenkins/workspace/lldb-cmake/lldb-build/./bin/lldb --compiler /Users/buildslave/jenkins/workspace/lldb-cmake/lldb-build/./bin/clang --dsymutil /Users/buildslave/jenkins/workspace/lldb-cmake/lldb-build/./bin/dsymutil --filecheck /Users/buildslave/jenkins/workspace/lldb-cmake/lldb-build/./bin/FileCheck --yaml2obj /Users/buildslave/jenkins/workspace/lldb-cmake/lldb-build/./bin/yaml2obj --lldb-libs-dir /Users/buildslave/jenkins/workspace/lldb-cmake/lldb-build/./lib /Users/buildslave/jenkins/workspace/lldb-cmake/llvm-project/lldb/test/API/commands/target/stop-hooks -p TestStopHookScripted.py
--
Exit Code: 1

Hide Details

Command Output (stdout): -- lldb version 12.0.99 clang revision 40e86ca749a7c38875858d1005f34d1e2f53743b llvm revision 40e86ca749a7c38875858d1005f34d1e2f53743b libstdcxx tests will not be run because: Don't know how to build with libstdcxx on macosx Skipping following debug info categories: ['dwo'] Running command: target stop-hook add -P stop_hook.stop_handler -k increment -v 5 -k return_false -v 1 -n step_out_of_me I have stopped 1 times.

Hide Details

-- Command Output (stderr): --

Hide Details

Session logs for test failures/errors/unexpected successes will go into directory '/Users/buildslave/jenkins/workspace/lldb-cmake/test/logs' Change dir to: /Users/buildslave/jenkins/workspace/lldb-cmake/llvm-project/lldb/test/API/commands/target/stop-hooks runCmd: settings clear -all output:

Hide Details

runCmd: settings set symbols.enable-external-lookup false output:

Hide Details

runCmd: settings set target.inherit-tcc true output:

Hide Details

runCmd: settings set target.auto-apply-fixits false output:

Hide Details

runCmd: settings set plugin.process.gdb-remote.packet-timeout 60 output:

Hide Details

runCmd: settings set symbols.clang-modules-cache-path "/Users/buildslave/jenkins/workspace/lldb-cmake/lldb-build/lldb-test-build.noindex/module-cache-lldb/lldb-api" output:

Hide Details

runCmd: settings set use-color false output:

Hide Details

runCmd: setting set target.prefer-dynamic-value no-dynamic-values output:

Hide Details

FAIL: LLDB (/Users/buildslave/jenkins/workspace/lldb-cmake/lldb-build/bin/clang-x86_64) :: test_stop_hooks_scripted_return_false (TestStopHookScripted.TestStopHooks) <bound method SBProcess.Kill of <lldb.SBProcess; proxy of <Swig Object of type 'lldb::SBProcess *' at 0x10f7a94b0> >>: success

Hide Details

Restore dir to: /Users/buildslave/jenkins/workspace/lldb-cmake/lldb-build/tools/lldb/test ====================================================================== FAIL: test_stop_hooks_scripted_return_false (TestStopHookScripted.TestStopHooks) Test that the returning False from a stop hook works ---------------------------------------------------------------------- Traceback (most recent call last): File "/Users/buildslave/jenkins/workspace/lldb-cmake/llvm-project/lldb/test/API/commands/target/stop-hooks/TestStopHookScripted.py", line 54, in test_stop_hooks_scripted_return_false self.do_test_auto_continue(True) File "/Users/buildslave/jenkins/workspace/lldb-cmake/llvm-project/lldb/test/API/commands/target/stop-hooks/TestStopHookScripted.py", line 91, in do_test_auto_continue self.assertEqual("main", func_name, "Didn't stop at the expected function.") AssertionError: 'main' != 'step_out_of_me' - main+ step_out_of_me : Didn't stop at the expected function. Config=x86_64-/Users/buildslave/jenkins/workspace/lldb-cmake/lldb-build/bin/clang ---------------------------------------------------------------------- Ran 1 test in 1.243s

Hide Details

RESULT: FAILED (0 passes, 1 failures, 0 errors, 0 skipped, 0 expected failures, 0 unexpected successes)

Hide Details

--

Hide Details

******************** PASS: lldb-unit :: Utility/./UtilityTests/StreamTest.ShiftOperatorPtr (1216 of 2154) PASS: lldb-unit :: Utility/./UtilityTests/StringListTest.JoinThree (1217 of 2154) PASS: lldb-shell :: SymbolFile/DWARF/dwarf5-debug_line.s (1218 of 2154) PASS: lldb-api :: lang/cpp/dynamic-value/TestCppValueCast.py (1219 of 2154) PASS: lldb-api :: python_api/value/linked_list/TestValueAPILinkedList.py (1220 of 2154) PASS: lldb-unit :: Utility/./UtilityTests/OptionsWithRawTest.EmptyArgsOnlySuffix (1221 of 2154) PASS: lldb-unit :: Utility/./UtilityTests/StreamTest.AddressNoSuffix (1222 of 2154) PASS: lldb-unit :: Core/./LLDBCoreTests/ModuleSpecTest.TestCOFFFile (1223 of 2154) PASS: lldb-shell :: ObjectFile/ELF/compressed-sections.yaml (1224 of 2154) PASS: lldb-unit :: Process/gdb-remote/./ProcessGdbRemoteTests/GDBRemoteCommunicationClientTest.GetModulesInfo (1225 of 2154) PASS: lldb-unit :: Expression/./ExpressionTests/DiagnosticManagerTest.AppendMessageAttachToLastDiag (1226 of 2154) PASS: lldb-api :: iohandler/completion/TestIOHandlerCompletion.py (1227 of 2154) PASS: lldb-shell :: ObjectFile/PECOFF/export-dllfunc.yaml (1228 of 2154) PASS: lldb-api :: driver/batch_mode/TestBatchMode.py (1229 of 2154) PASS: lldb-shell :: SymbolFile/DWARF/find-basic-namespace.cpp (1230 of 2154) PASS: lldb-shell :: Driver/TestError.test (1231 of 2154) PASS: lldb-shell :: Reproducer/TestDebugSymbols.test (1232 of 2154) PASS: lldb-unit :: ScriptInterpreter/Python/./ScriptInterpreterPythonTests/PythonDataObjectsTest.TestOwnedReferences (1233 of 2154) PASS: lldb-unit :: Utility/./UtilityTests/ArgsTest.StringListConstructor (1234 of 2154) PASS: lldb-api :: functionalities/type_lookup/TestTypeLookup.py (1235 of 2154) PASS: lldb-unit :: Utility/./UtilityTests/StreamTeeTest.Constructor1Stream (1236 of 2154) PASS: lldb-unit :: Utility/./UtilityTests/BinaryStreamTest.PutSLEB128One (1237 of 2154) PASS: lldb-unit :: Utility/./UtilityTests/GeneratorTest.YamlMultiProvider (1238 of 2154) PASS: lldb-shell :: SymbolFile/NativePDB/break-by-line.cpp (1239 of 2154) PASS: lldb-shell :: BuildScript/toolchain-clang.test (1240 of 2154) PASS: lldb-unit :: SymbolFile/DWARF/./SymbolFileDWARFTests/XcodeSDKModuleTests.TestModuleGetXcodeSDK (1241 of 2154) PASS: lldb-shell :: SymbolFile/DWARF/split-dwarf-inlining.cpp (1242 of 2154) UNSUPPORTED: lldb-api :: commands/trace/TestTraceSchema.py (1243 of 2154) PASS: lldb-api :: functionalities/thread/concurrent_events/TestConcurrentBreakpointsDelayedBreakpointOneWatchpoint.py (1244 of 2154) PASS: lldb-unit :: Utility/./UtilityTests/StringExtractorTest.GetHexBytes_Underflow (1245 of 2154) PASS: lldb-unit :: Utility/./UtilityTests/StringListTest.Join (1246 of 2154) PASS: lldb-unit :: Utility/./UtilityTests/StreamTest.AddressSize (1247 of 2154) PASS: lldb-api :: functionalities/gdb_remote_client/TestGDBRemoteDiskFileCompletion.py (1248 of 2154) PASS: lldb-unit :: Utility/./UtilityTests/TimerTest.CategoryTimes2 (1249 of 2154) PASS: lldb-unit :: ScriptInterpreter/Python/./ScriptInterpreterPythonTests/PythonDataObjectsTest.TestPythonCallableCheck (1250 of 2154) UNSUPPORTED: lldb-api :: arm/breakpoint-it/TestBreakpointIt.py (1251 of 2154) PASS: lldb-api :: functionalities/pointer_num_children/TestPointerNumChildren.py (1252 of 2154) PASS: lldb-api :: lang/cpp/incomplete-types/TestCppIncompleteTypes.py (1253 of 2154) PASS: lldb-api :: lang/cpp/modules-import/TestCXXModulesImport.py (1254 of 2154) PASS: lldb-unit :: Utility/./UtilityTests/StreamTest.AddressRangeEmptyRange (1255 of 2154) PASS: lldb-unit :: Utility/./UtilityTests/LogChannelEnabledTest.LogGetLogThread (1256 of 2154) PASS: lldb-api :: tools/lldb-server/TestGdbRemoteProcessInfo.py (1257 of 2154) PASS: lldb-api :: lang/cpp/operators/TestCppOperators.py (1258 of 2154) PASS: lldb-unit :: Utility/./UtilityTests/TimeoutTest.Format (1259 of 2154) PASS: lldb-unit :: Utility/./UtilityTests/LogTest.LLDB_LOG_nullptr (1260 of 2154) PASS: lldb-unit :: Utility/./UtilityTests/StringExtractorTest.DecodeHexU8_Extra (1261 of 2154) PASS: lldb-unit :: ScriptInterpreter/Python/./ScriptInterpreterPythonTests/PythonDataObjectsTest.TestResetting (1262 of 2154) PASS: lldb-api :: python_api/frame/inlines/TestInlinedFrame.py (1263 of 2154) PASS: lldb-shell :: ObjectFile/ELF/minidebuginfo-find-symbols.yaml (1264 of 2154) PASS: lldb-shell :: BuildScript/modes.test (1265 of 2154) PASS: lldb-unit :: Utility/./UtilityTests/LogChannelTest.Disable (1266 of 2154) PASS: lldb-unit :: Utility/./UtilityTests/StatusTest.Formatv (1267 of 2154) PASS: lldb-api :: lang/c/step_over_no_deadlock/TestStepOverDoesntBlock.py (1268 of 2154) PASS: lldb-unit :: Host/./HostTests/ConnectionFileDescriptorTest.TCPGetURIv4 (1269 of 2154) PASS: lldb-shell :: Process/TestEnvironment.test (1270 of 2154) PASS: lldb-unit :: Language/Highlighting/./HighlighterTests/HighlighterTest.ClangCursorPos (1271 of 2154) PASS: lldb-api :: functionalities/data-formatter/data-formatter-objc/TestDataFormatterObjNSException.py (1272 of 2154) PASS: lldb-unit :: Utility/./UtilityTests/CompletionRequest.TryCompleteCurrentArgBad (1273 of 2154) PASS: lldb-api :: functionalities/data-formatter/data-formatter-objc/TestDataFormatterObjCExpr.py (1274 of 2154) PASS: lldb-unit :: Symbol/./SymbolTests/TestClangASTImporter.MetadataPropagation (1275 of 2154) PASS: lldb-unit :: Utility/./UtilityTests/StreamTest.PutNHex8 (1276 of 2154) PASS: lldb-unit :: Utility/./UtilityTests/RangeTest.ContainsAddr (1277 of 2154) PASS: lldb-api :: sanity/TestSettingSkipping.py (1278 of 2154) UNSUPPORTED: lldb-api :: commands/trace/TestTraceLoad.py (1279 of 2154) PASS: lldb-unit :: Utility/./UtilityTests/OptionsWithRawTest.SingleWordSuffix (1280 of 2154) PASS: lldb-unit :: Host/./HostTests/NativeProcessProtocolTest.SetBreakpointFailWrite (1281 of 2154) PASS: lldb-api :: python_api/hello_world/TestHelloWorld.py (1282 of 2154) PASS: lldb-unit :: UnwindAssembly/PPC64/./PPC64InstEmulationTests/TestPPC64InstEmulation.TestMediumFunction (1283 of 2154) PASS: lldb-api :: functionalities/tsan/thread_numbers/TestTsanThreadNumbers.py (1284 of 2154) PASS: lldb-unit :: UnwindAssembly/x86/./UnwindAssemblyx86Tests/Testx86AssemblyInspectionEngine.TestPopRBP (1285 of 2154) PASS: lldb-shell :: Commands/command-backtrace.test (1286 of 2154) PASS: lldb-api :: functionalities/data-formatter/data-formatter-stl/libcxx/vector/TestDataFormatterLibcxxVector.py (1287 of 2154) PASS: lldb-api :: commands/expression/rdar42038760/TestScalarURem.py (1288 of 2154) UNSUPPORTED: lldb-shell :: BuildScript/toolchain-clang-cl.test (1289 of 2154) PASS: lldb-unit :: Utility/./UtilityTests/DataExtractorTest.GetCStrAtNullOffset (1290 of 2154) PASS: lldb-unit :: Process/minidump/./LLDBMinidumpTests/MinidumpParserTest.MinidumpDuplicateModuleMappedSecond (1291 of 2154) PASS: lldb-api :: python_api/lldbutil/iter/TestLLDBIterator.py (1292 of 2154) PASS: lldb-api :: commands/expression/namespace_local_var_same_name_cpp_and_c/TestNamespaceLocalVarSameNameCppAndC.py (1293 of 2154) PASS: lldb-shell :: ObjectFile/PECOFF/disassemble-thumb.yaml (1294 of 2154) UNSUPPORTED: lldb-api :: lang/c/typedef/Testtypedef.py (1295 of 2154) PASS: lldb-unit :: ScriptInterpreter/Python/./ScriptInterpreterPythonTests/PythonDataObjectsTest.TestPythonInteger (1296 of 2154) PASS: lldb-api :: tools/lldb-server/TestGdbRemoteHostInfo.py (1297 of 2154) PASS: lldb-unit :: debugserver/./debugserverTests/RNBSocket.LoopBackConnectIPv6 (1298 of 2154) PASS: lldb-api :: commands/frame/diagnose/local-variable/TestLocalVariable.py (1299 of 2154) PASS: lldb-api :: functionalities/data-formatter/data-formatter-disabling/TestDataFormatterDisabling.py (1300 of 2154) PASS: lldb-unit :: SymbolFile/DWARF/./SymbolFileDWARFTests/SymbolFileDWARFTests.ParseAranges (1301 of 2154) PASS: lldb-unit :: Utility/./UtilityTests/LogChannelTest.EnableOptions (1302 of 2154) PASS: lldb-api :: functionalities/signal/handle-abrt/TestHandleAbort.py (1303 of 2154) PASS: lldb-unit :: Utility/./UtilityTests/FileSpecTest.EqualSeparator (1304 of 2154) PASS: lldb-unit :: Utility/./UtilityTests/ProcessInfoTest.Constructor (1305 of 2154) PASS: lldb-api :: commands/command/delete/TestCommandDelete.py (1306 of 2154) PASS: lldb-unit :: Utility/./UtilityTests/VASprintfTest.NoBufferResize (1307 of 2154) PASS: lldb-api :: functionalities/asan/TestMemoryHistory.py (1308 of 2154) PASS: lldb-api :: lang/objc/foundation/TestObjectDescriptionAPI.py (1309 of 2154) PASS: lldb-unit :: Utility/./UtilityTests/TildeExpressionResolver.ResolveFullPath (1310 of 2154) PASS: lldb-api :: tools/lldb-server/TestGdbRemoteKill.py (1311 of 2154) PASS: lldb-unit :: Utility/./UtilityTests/OptionsWithRawTest.WhitespaceInput (1312 of 2154) PASS: lldb-shell :: Breakpoint/debug_rnglistx_rlex.test (1313 of 2154) PASS: lldb-unit :: ScriptInterpreter/Python/./ScriptInterpreterPythonTests/PythonDataObjectsTest.TestDictionaryResolutionWithDot (1314 of 2154) PASS: lldb-api :: functionalities/backticks/TestBackticksWithoutATarget.py (1315 of 2154) PASS: lldb-unit :: Symbol/./SymbolTests/PostfixExpression.ToDWARF (1316 of 2154) PASS: lldb-unit :: Utility/./UtilityTests/StreamTest.PutCharWhitespace (1317 of 2154) PASS: lldb-api :: lang/c/function_types/TestFunctionTypes.py (1318 of 2154) PASS: lldb-api :: functionalities/breakpoint/hardware_breakpoints/require_hw_breakpoints/TestRequireHWBreakpoints.py (1319 of 2154) UNSUPPORTED: lldb-shell :: SymbolFile/PDB/function-level-linking.test (1320 of 2154) PASS: lldb-unit :: Process/gdb-remote/./ProcessGdbRemoteTests/GDBRemoteClientBaseTest.SendContinueDelegateStructuredDataReceipt (1321 of 2154) PASS: lldb-unit :: Language/Highlighting/./HighlighterTests/HighlighterTest.FallbackHighlighter (1322 of 2154) PASS: lldb-api :: functionalities/breakpoint/breakpoint_names/TestBreakpointNames.py (1323 of 2154) PASS: lldb-unit :: DataFormatter/./LLDBFormatterTests/TypeMatcherTests.GetMatchStringRegex (1324 of 2154) PASS: lldb-api :: lang/cpp/chained-calls/TestCppChainedCalls.py (1325 of 2154) PASS: lldb-shell :: Driver/TestCommands.test (1326 of 2154) PASS: lldb-unit :: Utility/./UtilityTests/BinaryStreamTest.PutULEB128MaxValue (1327 of 2154) PASS: lldb-unit :: Utility/./UtilityTests/AnsiTerminal.Empty (1328 of 2154) PASS: lldb-unit :: Utility/./UtilityTests/IndexToObjectTest.ObjectForIndex (1329 of 2154) PASS: lldb-api :: functionalities/return-value/TestReturnValue.py (1330 of 2154) PASS: lldb-unit :: Process/minidump/./LLDBMinidumpTests/MinidumpParserTest.MinidumpModuleOrder (1331 of 2154) UNSUPPORTED: lldb-shell :: Unwind/eh-frame-small-fde.test (1332 of 2154) PASS: lldb-unit :: Utility/./UtilityTests/Flags.Reset (1333 of 2154) PASS: lldb-api :: tools/lldb-server/TestAppleSimulatorOSType.py (1334 of 2154) PASS: lldb-unit :: Utility/./UtilityTests/ArgsTest.AppendArguments (1335 of 2154) PASS: lldb-api :: functionalities/unwind/zeroth_frame/TestZerothFrame.py (1336 of 2154) PASS: lldb-unit :: Language/Highlighting/./HighlighterTests/HighlighterTest.ClangCursorPosBeforeOtherToken (1337 of 2154) PASS: lldb-api :: api/multiple-targets/TestMultipleTargets.py (1338 of 2154) PASS: lldb-unit :: Expression/./ExpressionTests/CppModuleConfigurationTest.AmbiguousCLib (1339 of 2154) PASS: lldb-api :: functionalities/postmortem/elf-core/thread_crash/TestLinuxCoreThreads.py (1340 of 2154) PASS: lldb-unit :: Symbol/./SymbolTests/TestTypeSystemClang.TestGetEnumIntegerTypeInvalid (1341 of 2154) PASS: lldb-api :: tools/lldb-server/TestGdbRemote_qThreadStopInfo.py (1342 of 2154) PASS: lldb-unit :: ScriptInterpreter/Python/./ScriptInterpreterPythonTests/PythonDataObjectsTest.TestModuleNameResolutionNoDot (1343 of 2154) PASS: lldb-api :: functionalities/abbreviation/TestAbbreviations.py (1344 of 2154) PASS: lldb-unit :: UnwindAssembly/x86/./UnwindAssemblyx86Tests/Testx86AssemblyInspectionEngine.TestPushExtended (1345 of 2154) PASS: lldb-unit :: Utility/./UtilityTests/ProcessInstanceInfoMatch.Name (1346 of 2154) PASS: lldb-unit :: Core/./LLDBCoreTests/ModuleSpecTest.TestMachOFile (1347 of 2154) PASS: lldb-shell :: SymbolFile/DWARF/parallel-indexing-stress.s (1348 of 2154) PASS: lldb-unit :: Utility/./UtilityTests/ScalarTest.ExtractBitfield (1349 of 2154) PASS: lldb-unit :: Language/Highlighting/./HighlighterTests/HighlighterTest.ClangBraces (1350 of 2154) PASS: lldb-api :: functionalities/recursion/TestValueObjectRecursion.py (1351 of 2154) PASS: lldb-unit :: Host/./HostTests/Host.WaitStatusFormat (1352 of 2154) PASS: lldb-unit :: Host/./HostTests/FileSystemTest.MakeAbsolute (1353 of 2154) UNSUPPORTED: lldb-shell :: Register/x86-gp-read.test (1354 of 2154) PASS: lldb-api :: lang/cpp/scope/TestCppScope.py (1355 of 2154) PASS: lldb-unit :: Expression/./ExpressionTests/DiagnosticManagerTest.GetStringNoDiags (1356 of 2154) PASS: lldb-shell :: ObjectFile/ELF/section-overlap.yaml (1357 of 2154) XFAIL: lldb-shell :: Register/x86-64-ymm-write.test (1358 of 2154) PASS: lldb-api :: commands/expression/import-std-module/vector/TestVectorFromStdModule.py (1359 of 2154) UNSUPPORTED: lldb-shell :: SymbolFile/NativePDB/local-variables.cpp (1360 of 2154) PASS: lldb-api :: lang/objc/foundation/TestObjCMethodsNSArray.py (1361 of 2154) PASS: lldb-api :: functionalities/thread/concurrent_events/TestConcurrentCrashWithWatchpointBreakpointSignal.py (1362 of 2154) UNSUPPORTED: lldb-api :: functionalities/unwind/ehframe/TestEhFrameUnwind.py (1363 of 2154) PASS: lldb-unit :: Utility/./UtilityTests/UUIDTest.SetFromStringRef (1364 of 2154) PASS: lldb-unit :: Interpreter/./InterpreterTests/CompletionTest.FileCompletionAbsolute (1365 of 2154) UNSUPPORTED: lldb-shell :: SymbolFile/PDB/calling-conventions.test (1366 of 2154) PASS: lldb-api :: functionalities/data-formatter/stringprinter/TestStringPrinter.py (1367 of 2154) PASS: lldb-api :: functionalities/completion/TestCompletion.py (1368 of 2154) PASS: lldb-api :: commands/target/create-deps/TestTargetCreateDeps.py (1369 of 2154) PASS: lldb-unit :: Symbol/./SymbolTests/TestTypeSystemClang.TestFunctionTemplateInRecordConstruction (1370 of 2154) PASS: lldb-unit :: UnwindAssembly/x86/./UnwindAssemblyx86Tests/Testx86AssemblyInspectionEngine.TestSubESP (1371 of 2154) PASS: lldb-api :: lang/objc/objc-foundation-dictionary-empty/TestNSDictionary0.py (1372 of 2154) PASS: lldb-unit :: Process/minidump/./LLDBMinidumpTests/MinidumpParserTest.InvalidMinidump (1373 of 2154) PASS: lldb-shell :: Process/TestAbortExitCode.test (1374 of 2154) PASS: lldb-unit :: UnwindAssembly/x86/./UnwindAssemblyx86Tests/Testx86AssemblyInspectionEngine.Testi386IgnoredRegisters (1375 of 2154) PASS: lldb-api :: functionalities/thread/concurrent_events/TestConcurrentWatchBreak.py (1376 of 2154) PASS: lldb-unit :: Utility/./UtilityTests/UriParserTest.SchemeHostSeparator (1377 of 2154) PASS: lldb-unit :: Utility/./UtilityTests/RangeTest.DoesIntersect (1378 of 2154) PASS: lldb-api :: functionalities/conditional_break/TestConditionalBreak.py (1379 of 2154) PASS: lldb-unit :: Utility/./UtilityTests/BinaryStreamTest.PutULEB128One (1380 of 2154) PASS: lldb-shell :: SymbolFile/NativePDB/function-types-calling-conv.cpp (1381 of 2154) PASS: lldb-api :: tools/lldb-server/TestGdbRemoteAttach.py (1382 of 2154) PASS: lldb-unit :: Expression/./ExpressionTests/CppModuleConfigurationTest.LibCppV2 (1383 of 2154) PASS: lldb-shell :: SymbolFile/NativePDB/globals-fundamental.cpp (1384 of 2154) PASS: lldb-api :: commands/target/modules/search-paths/insert/TestTargetModulesSearchpathsInsert.py (1385 of 2154) PASS: lldb-unit :: Utility/./UtilityTests/OptionsWithRawTest.EmptySuffixSingleWhitespace (1386 of 2154) PASS: lldb-unit :: Symbol/./SymbolTests/TestTypeSystemClang.TestGetTypeClassTypeOf (1387 of 2154) PASS: lldb-unit :: Utility/./UtilityTests/StreamTest.QuotedCString (1388 of 2154) PASS: lldb-api :: functionalities/data-formatter/parray/TestPrintArray.py (1389 of 2154) PASS: lldb-shell :: Driver/TestNoUseColor.test (1390 of 2154) PASS: lldb-api :: commands/frame/diagnose/virtual-method-call/TestDiagnoseDereferenceVirtualMethodCall.py (1391 of 2154) PASS: lldb-unit :: Utility/./UtilityTests/PassiveReplayTest.InstrumentedBar (1392 of 2154) PASS: lldb-api :: functionalities/stats_api/TestStatisticsAPI.py (1393 of 2154) PASS: lldb-unit :: Utility/./UtilityTests/RangeTest.Union (1394 of 2154) PASS: lldb-shell :: Settings/TestFrameFormatColor.test (1395 of 2154) UNSUPPORTED: lldb-api :: tools/lldb-vscode/disconnect/TestVSCode_disconnect.py (1396 of 2154) PASS: lldb-shell :: ObjectFile/Breakpad/uuid-matching-mac.test (1397 of 2154) PASS: lldb-api :: lang/c/forward/TestForwardDeclaration.py (1398 of 2154) PASS: lldb-unit :: ScriptInterpreter/Python/./ScriptInterpreterPythonTests/PythonDataObjectsTest.TestPythonTupleInitializerList (1399 of 2154) PASS: lldb-unit :: Process/minidump/./LLDBMinidumpTests/MinidumpParserTest.GetPidWow64 (1400 of 2154) PASS: lldb-unit :: ObjectFile/Breakpad/./ObjectFileBreakpadTests/FileRecord.parse (1401 of 2154) PASS: lldb-unit :: Host/./HostTests/FileSystemTest.EnumerateDirectory (1402 of 2154) PASS: lldb-api :: functionalities/data-formatter/data-formatter-stl/libcxx/set/TestDataFormatterLibcxxSet.py (1403 of 2154) PASS: lldb-api :: functionalities/target_var/TestTargetVar.py (1404 of 2154) PASS: lldb-unit :: UnwindAssembly/x86/./UnwindAssemblyx86Tests/Testx86AssemblyInspectionEngine.TestPushR12 (1405 of 2154) PASS: lldb-api :: macosx/queues/TestQueues.py (1406 of 2154) PASS: lldb-api :: macosx/macCatalyst/TestMacCatalyst.py (1407 of 2154) PASS: lldb-unit :: SymbolFile/DWARF/./SymbolFileDWARFTests/SymbolFileDWARFTests.ParseArangesNonzeroSegmentSize (1408 of 2154) PASS: lldb-api :: lang/c/anonymous/TestAnonymous.py (1409 of 2154) PASS: lldb-api :: tools/lldb-server/TestGdbRemote_vCont.py (1410 of 2154) PASS: lldb-api :: functionalities/thread/concurrent_events/TestConcurrentBreakpointOneDelayBreakpointThreads.py (1411 of 2154) PASS: lldb-unit :: Utility/./UtilityTests/StringExtractorTest.GetHexU8_Extra_NoEof (1412 of 2154) PASS: lldb-unit :: Expression/./ExpressionTests/CppModuleConfigurationTest.AmbiguousLibCpp (1413 of 2154) PASS: lldb-shell :: Settings/TestSettingsWrite.test (1414 of 2154) UNSUPPORTED: lldb-api :: android/platform/TestDefaultCacheLineSize.py (1415 of 2154) PASS: lldb-api :: macosx/lc-note/kern-ver-str/TestKernVerStrLCNOTE.py (1416 of 2154) PASS: lldb-api :: functionalities/thread/concurrent_events/TestConcurrentWatchpointDelayWatchpointOneBreakpoint.py (1417 of 2154) PASS: lldb-unit :: Language/Highlighting/./HighlighterTests/HighlighterTest.ClangPPDirectives (1418 of 2154) PASS: lldb-api :: lang/cpp/breakpoint_in_member_func_w_non_primitive_params/TestBreakpointInMemberFuncWNonPrimitiveParams.py (1419 of 2154) PASS: lldb-unit :: Utility/./UtilityTests/UUIDTest.StringConverion (1420 of 2154) PASS: lldb-shell :: ObjectFile/ELF/duplicate-section.yaml (1421 of 2154) PASS: lldb-shell :: SymbolFile/DWARF/dir-separator-posix.s (1422 of 2154) UNSUPPORTED: lldb-shell :: Register/x86-64-zmm-write.test (1423 of 2154) PASS: lldb-unit :: Process/minidump/./LLDBMinidumpTests/MinidumpParserTest.GetMemoryRegionInfoFromMemory64List (1424 of 2154) PASS: lldb-api :: lang/cpp/virtual-functions/TestCppVirtualFunctions.py (1425 of 2154) PASS: lldb-unit :: Utility/./UtilityTests/RegularExpression.Invalid (1426 of 2154) PASS: lldb-unit :: Utility/./UtilityTests/LogChannelEnabledTest.LogVerboseThread (1427 of 2154) UNSUPPORTED: lldb-api :: commands/target/auto-install-main-executable/TestAutoInstallMainExecutable.py (1428 of 2154) PASS: lldb-api :: commands/help/TestHelp.py (1429 of 2154) PASS: lldb-api :: functionalities/gdb_remote_client/TestRegDefinitionInParts.py (1430 of 2154) PASS: lldb-api :: lang/c/global_variables/TestGlobalVariables.py (1431 of 2154) PASS: lldb-api :: lang/cpp/breakpoint-commands/TestCPPBreakpointCommands.py (1432 of 2154) PASS: lldb-api :: functionalities/gdb_remote_client/TestGDBRemoteLoad.py (1433 of 2154) PASS: lldb-unit :: UnwindAssembly/x86/./UnwindAssemblyx86Tests/Testx86AssemblyInspectionEngine.TestPushESI (1434 of 2154) PASS: lldb-shell :: Commands/command-thread-select.test (1435 of 2154) PASS: lldb-unit :: Utility/./UtilityTests/StructuredDataTest.ParseJSONFromFile (1436 of 2154) PASS: lldb-unit :: Core/./LLDBCoreTests/RichManglingContextTest.Basic (1437 of 2154) PASS: lldb-unit :: SymbolFile/DWARF/./SymbolFileDWARFTests/SymbolFileDWARFTests.TestAbbrevNullAttrValidForm (1438 of 2154) PASS: lldb-shell :: SymbolFile/DWARF/DW_AT_loclists_base.s (1439 of 2154) PASS: lldb-unit :: Host/./HostTests/FileSystemTest.Readable (1440 of 2154) PASS: lldb-api :: commands/frame/diagnose/dereference-this/TestDiagnoseDereferenceThis.py (1441 of 2154) PASS: lldb-unit :: Utility/./UtilityTests/BinaryStreamTest.PutULEB128FiveBytes (1442 of 2154) PASS: lldb-unit :: Utility/./UtilityTests/BinaryStreamTest.PutSLEB128EightBytes (1443 of 2154) PASS: lldb-unit :: Utility/./UtilityTests/DataExtractorTest.GetCStrEmpty (1444 of 2154) PASS: lldb-api :: tools/lldb-vscode/breakpoint-events/TestVSCode_breakpointEvents.py (1445 of 2154) PASS: lldb-unit :: ScriptInterpreter/Python/./ScriptInterpreterPythonTests/PythonDataObjectsTest.TestPythonTupleToStructuredList (1446 of 2154) PASS: lldb-unit :: Utility/./UtilityTests/StringListTest.GetMaxStringLengthDecreasingSize (1447 of 2154) PASS: lldb-shell :: Commands/command-disassemble.s (1448 of 2154) PASS: lldb-api :: functionalities/optimized_code/TestNoASanExceptionAfterEvalOP_piece.py (1449 of 2154) PASS: lldb-api :: commands/expression/call-function/TestCallStdStringFunction.py (1450 of 2154) PASS: lldb-api :: macosx/order/TestOrderFile.py (1451 of 2154) PASS: lldb-api :: functionalities/gdb_remote_client/TestStopPCs.py (1452 of 2154) PASS: lldb-api :: functionalities/breakpoint/breakpoint_hit_count/TestBreakpointHitCount.py (1453 of 2154) PASS: lldb-unit :: Utility/./UtilityTests/StringExtractorTest.GetNameColonValueContainsColon (1454 of 2154) PASS: lldb-unit :: Symbol/./SymbolTests/TestTypeSystemClang.TestNotDeletingUserCopyCstrDueToMoveCStr (1455 of 2154) PASS: lldb-api :: python_api/type/TestTypeList.py (1456 of 2154) PASS: lldb-unit :: Symbol/./SymbolTests/TestClangASTImporter.CopyTypeTagDecl (1457 of 2154) PASS: lldb-shell :: Breakpoint/debug_rnglist_rlestartend.test (1458 of 2154) PASS: lldb-unit :: Utility/./UtilityTests/RangeTest.EqualInvalid (1459 of 2154) UNSUPPORTED: lldb-api :: tools/lldb-server/TestGdbRemoteModuleInfo.py (1460 of 2154) PASS: lldb-unit :: Utility/./UtilityTests/StreamTest.PutCharNull (1461 of 2154) PASS: lldb-unit :: Utility/./UtilityTests/StringLexerTest.NextIf (1462 of 2154) PASS: lldb-unit :: Utility/./UtilityTests/StreamTest.PutRawBytesToMixedEndian (1463 of 2154) PASS: lldb-api :: functionalities/asan/TestReportData.py (1464 of 2154) PASS: lldb-unit :: Symbol/./SymbolTests/Type.GetTypeScopeAndBasename (1465 of 2154) PASS: lldb-unit :: SymbolFile/NativePDB/./SymbolFileNativePDBTests/PDBFPOProgramToDWARFExpressionTests.InvalidAssignmentSingle (1466 of 2154) PASS: lldb-unit :: Process/gdb-remote/./ProcessGdbRemoteTests/GDBRemoteCommunicationClientTest.WriteRegisterNoSuffix (1467 of 2154) PASS: lldb-api :: commands/expression/import-std-module/weak_ptr/TestWeakPtrFromStdModule.py (1468 of 2154) PASS: lldb-api :: commands/expression/multiline-navigation/TestMultilineNavigation.py (1469 of 2154) PASS: lldb-shell :: Quit/TestQuitExitCodeHexA.test (1470 of 2154) PASS: lldb-unit :: Utility/./UtilityTests/StringExtractorTest.GetHexBytes_Partial (1471 of 2154) PASS: lldb-unit :: SymbolFile/NativePDB/./SymbolFileNativePDBTests/PDBFPOProgramToDWARFExpressionTests.InvalidAssignmentMultiple (1472 of 2154) PASS: lldb-api :: functionalities/rerun/TestRerun.py (1473 of 2154) PASS: lldb-unit :: Symbol/./SymbolTests/TestClangASTImporter.DeportTypeTagDecl (1474 of 2154) UNSUPPORTED: lldb-api :: tools/intel-features/intel-pt/test/TestIntelPTSimpleBinary.py (1475 of 2154) PASS: lldb-unit :: Utility/./UtilityTests/StatusTest.ErrorConstructor (1476 of 2154) PASS: lldb-api :: functionalities/postmortem/netbsd-core/TestNetBSDCore.py (1477 of 2154) PASS: lldb-unit :: Utility/./UtilityTests/FileSpecTest.PrependPathComponent (1478 of 2154) PASS: lldb-unit :: UnwindAssembly/x86/./UnwindAssemblyx86Tests/Testx86AssemblyInspectionEngine.TestPushEBX (1479 of 2154) PASS: lldb-unit :: Expression/./ExpressionTests/ClangExpressionDeclMapTest.TestUnknownIdentifierLookup (1480 of 2154) PASS: lldb-api :: commands/process/signal/TestProcessSignal.py (1481 of 2154) PASS: lldb-shell :: SymbolFile/NativePDB/bitfields.cpp (1482 of 2154) PASS: lldb-unit :: Language/Highlighting/./HighlighterTests/HighlighterTest.ClangOperators (1483 of 2154) UNSUPPORTED: lldb-api :: functionalities/data-formatter/data-formatter-stl/libstdcpp/vbool/TestDataFormatterStdVBool.py (1484 of 2154) UNSUPPORTED: lldb-api :: functionalities/data-formatter/data-formatter-stl/libstdcpp/iterator/TestDataFormatterStdIterator.py (1485 of 2154) PASS: lldb-api :: commands/watchpoints/multiple_threads/TestWatchpointMultipleThreads.py (1486 of 2154) PASS: lldb-shell :: Breakpoint/debug_rnglist_offset_pair.test (1487 of 2154) PASS: lldb-api :: functionalities/data-formatter/setvaluefromcstring/TestSetValueFromCString.py (1488 of 2154) PASS: lldb-unit :: Utility/./UtilityTests/StringExtractorTest.GetHexBytes_OddPair2 (1489 of 2154) PASS: lldb-unit :: Host/./HostTests/SocketTest.DomainListenConnectAccept (1490 of 2154) PASS: lldb-api :: functionalities/thread/concurrent_events/TestConcurrentSignalWatchBreak.py (1491 of 2154) UNSUPPORTED: lldb-shell :: Register/x86-64-gp-write.test (1492 of 2154) PASS: lldb-unit :: Utility/./UtilityTests/PassiveReplayTest.InstrumentedBarRef (1493 of 2154) PASS: lldb-api :: lang/objc/bitfield_ivars/TestBitfieldIvars.py (1494 of 2154) PASS: lldb-unit :: Utility/./UtilityTests/SerializationRountripTest.SerializeDeserializeCStringArray (1495 of 2154) PASS: lldb-api :: types/TestRecursiveTypes.py (1496 of 2154) PASS: lldb-api :: terminal/TestSTTYBeforeAndAfter.py (1497 of 2154) PASS: lldb-api :: functionalities/fat_archives/TestFatArchives.py (1498 of 2154) PASS: lldb-unit :: Utility/./UtilityTests/RangeDataVector.FindEntryThatContains_Overlap (1499 of 2154) PASS: lldb-unit :: Utility/./UtilityTests/AnsiTerminal.Twice (1500 of 2154) PASS: lldb-unit :: Utility/./UtilityTests/Predicate.WaitForValueEqualTo (1501 of 2154) PASS: lldb-api :: tools/lldb-vscode/console/TestVSCode_console.py (1502 of 2154) PASS: lldb-shell :: SymbolFile/Breakpad/line-table-mixed-path-styles.test (1503 of 2154) PASS: lldb-unit :: Process/gdb-remote/./ProcessGdbRemoteTests/GDBRemoteClientBaseTest.SendContinueAndAsyncPacket (1504 of 2154) PASS: lldb-api :: functionalities/history/TestHistoryRecall.py (1505 of 2154) PASS: lldb-api :: macosx/profile_vrs_detach/TestDetachVrsProfile.py (1506 of 2154) PASS: lldb-shell :: SymbolFile/DWARF/debug_loclists-dwo.s (1507 of 2154) PASS: lldb-unit :: Expression/./ExpressionTests/DiagnosticManagerTest.AddDiagnostic (1508 of 2154) PASS: lldb-shell :: Quit/TestQuitExitCode-30.test (1509 of 2154) PASS: lldb-api :: python_api/process/read-mem-cstring/TestReadMemCString.py (1510 of 2154) UNSUPPORTED: lldb-api :: functionalities/breakpoint/hardware_breakpoints/hardware_breakpoint_on_multiple_threads/TestHWBreakMultiThread.py (1511 of 2154) PASS: lldb-unit :: UnwindAssembly/x86/./UnwindAssemblyx86Tests/Testx86AssemblyInspectionEngine.TestSpArithx86_64Augmented (1512 of 2154) PASS: lldb-unit :: Utility/./UtilityTests/StringListTest.GetMaxStringLengthIncreasingSize (1513 of 2154) PASS: lldb-unit :: Utility/./UtilityTests/StringExtractorTest.GetU32BigEndian (1514 of 2154) PASS: lldb-unit :: Utility/./UtilityTests/StringListTest.LongestCommonPrefixDuplicateElement (1515 of 2154) PASS: lldb-unit :: Utility/./UtilityTests/FileSpecTest.Yaml (1516 of 2154) PASS: lldb-shell :: SymbolFile/DWARF/find-basic-type.cpp (1517 of 2154) PASS: lldb-api :: lang/objc/print-obj/TestPrintObj.py (1518 of 2154) PASS: lldb-api :: lang/objc/self/TestObjCSelf.py (1519 of 2154) PASS: lldb-unit :: ScriptInterpreter/Python/./ScriptInterpreterPythonTests/PythonDataObjectsTest.TestPythonBoolean (1520 of 2154) PASS: lldb-unit :: Utility/./UtilityTests/StreamTest.PutBytesAsRawHex8ToMixedEndian (1521 of 2154) PASS: lldb-api :: lang/objc/unicode-string/TestUnicodeString.py (1522 of 2154) PASS: lldb-unit :: Core/./LLDBCoreTests/MangledTest.ResultForValidName (1523 of 2154) PASS: lldb-unit :: Utility/./UtilityTests/DataExtractorTest.PeekData (1524 of 2154) PASS: lldb-shell :: SymbolFile/DWARF/debug-types-address-ranges.s (1525 of 2154) UNSUPPORTED: lldb-api :: functionalities/data-formatter/data-formatter-stl/libstdcpp/smart_ptr/TestDataFormatterStdSmartPtr.py (1526 of 2154) PASS: lldb-shell :: SymbolFile/DWARF/dwp-debug-types.s (1527 of 2154) PASS: lldb-api :: commands/expression/import-std-module/vector-dbg-info-content/TestDbgInfoContentVectorFromStdModule.py (1528 of 2154) PASS: lldb-unit :: UnwindAssembly/x86/./UnwindAssemblyx86Tests/Testx86AssemblyInspectionEngine.TestPushEDI (1529 of 2154) PASS: lldb-unit :: Utility/./UtilityTests/StreamTest.PutULEB128 (1530 of 2154) PASS: lldb-api :: functionalities/data-formatter/data-formatter-objc/TestDataFormatterObjCNSContainer.py (1531 of 2154) PASS: lldb-api :: tools/lldb-vscode/coreFile/TestVSCode_coreFile.py (1532 of 2154) PASS: lldb-api :: functionalities/data-formatter/data-formatter-stl/libcxx/bitset/TestDataFormatterLibcxxBitset.py (1533 of 2154) PASS: lldb-api :: functionalities/gdb_remote_client/TestNoWatchpointSupportInfo.py (1534 of 2154) PASS: lldb-unit :: Utility/./UtilityTests/UserIDResolver.GetUserName (1535 of 2154) PASS: lldb-api :: functionalities/data-formatter/data-formatter-objc/TestDataFormatterObjCNSURL.py (1536 of 2154) PASS: lldb-unit :: Host/./HostTests/NativeProcessProtocolTest.ReadMemoryWithoutTrap (1537 of 2154) PASS: lldb-unit :: Utility/./UtilityTests/StreamTest.AddressPrefixAndSuffix (1538 of 2154) PASS: lldb-unit :: Utility/./UtilityTests/UriParserTest.BracketedHostnameWithColon (1539 of 2154) PASS: lldb-api :: commands/expression/import-std-module/pair/TestPairFromStdModule.py (1540 of 2154) PASS: lldb-unit :: Utility/./UtilityTests/StringExtractorTest.GetHexBytesAvail (1541 of 2154) PASS: lldb-api :: functionalities/data-formatter/data-formatter-stl/libcxx/initializerlist/TestInitializerList.py (1542 of 2154) PASS: lldb-unit :: Utility/./UtilityTests/SerializationRountripTest.SerializeDeserializePodPointers (1543 of 2154) UNSUPPORTED: lldb-api :: functionalities/darwin_log/filter/regex/activity-chain/TestDarwinLogFilterRegexActivityChain.py (1544 of 2154) PASS: lldb-unit :: UnwindAssembly/x86/./UnwindAssemblyx86Tests/Testx86AssemblyInspectionEngine.TestPushEAX (1545 of 2154) PASS: lldb-unit :: ObjectFile/Breakpad/./ObjectFileBreakpadTests/PublicRecord.parse (1546 of 2154) PASS: lldb-api :: python_api/breakpoint/TestBreakpointAPI.py (1547 of 2154) PASS: lldb-api :: commands/target/stop-hook/delete/TestTargetStopHookDelete.py (1548 of 2154) PASS: lldb-unit :: Utility/./UtilityTests/ArgsTest.TestUnknownEscape (1549 of 2154) PASS: lldb-unit :: Utility/./UtilityTests/XcodeSDKTest.MergeTest (1550 of 2154) PASS: lldb-api :: lang/cpp/rvalue-references/TestRvalueReferences.py (1551 of 2154) PASS: lldb-unit :: Expression/./ExpressionTests/DiagnosticManagerTest.AppendMessageNoDiag (1552 of 2154) PASS: lldb-api :: functionalities/postmortem/minidump-new/TestMiniDumpNew.py (1553 of 2154) PASS: lldb-api :: lang/cpp/namespace_definitions/TestNamespaceDefinitions.py (1554 of 2154) PASS: lldb-api :: commands/gui/breakpoints/TestGuiBreakpoints.py (1555 of 2154) PASS: lldb-shell :: SymbolFile/DWARF/find-basic-function.cpp (1556 of 2154) UNSUPPORTED: lldb-shell :: Register/x86-64-zmm-read.test (1557 of 2154) PASS: lldb-unit :: Core/./LLDBCoreTests/StreamCallbackTest.Callback (1558 of 2154) PASS: lldb-unit :: Core/./LLDBCoreTests/UniqueCStringMap.NoDefaultConstructor (1559 of 2154) PASS: lldb-api :: commands/settings/quoting/TestQuoting.py (1560 of 2154) PASS: lldb-api :: lang/cpp/trivial_abi/TestTrivialABI.py (1561 of 2154) PASS: lldb-unit :: Host/./HostTests/MainLoopTest.ReadObject (1562 of 2154) PASS: lldb-api :: lang/cpp/typeof/TestTypeOfDeclTypeExpr.py (1563 of 2154) PASS: lldb-unit :: Utility/./UtilityTests/StreamTest.PutMaxHex64ByteOrderBig (1564 of 2154) PASS: lldb-api :: macosx/function-starts/TestFunctionStarts.py (1565 of 2154) PASS: lldb-api :: lang/cpp/class_static/TestStaticVariables.py (1566 of 2154) PASS: lldb-unit :: Utility/./UtilityTests/DataExtractorTest.GetFloatUnaligned (1567 of 2154) PASS: lldb-api :: lang/cpp/lambdas/TestLambdas.py (1568 of 2154) PASS: lldb-unit :: UnwindAssembly/x86/./UnwindAssemblyx86Tests/Testx86AssemblyInspectionEngine.TestPopEBP (1569 of 2154) PASS: lldb-unit :: Utility/./UtilityTests/RecordReplayTest.InstrumentedBarPtr (1570 of 2154) PASS: lldb-shell :: ObjectFile/ELF/aarch64-relocations.yaml (1571 of 2154) PASS: lldb-api :: lang/objc/objc-builtin-types/TestObjCBuiltinTypes.py (1572 of 2154) PASS: lldb-shell :: SymbolFile/DWARF/find-method.cpp (1573 of 2154) PASS: lldb-api :: functionalities/data-formatter/data-formatter-objc/TestDataFormatterObjCCF.py (1574 of 2154) PASS: lldb-shell :: ObjectFile/ELF/netbsd-exec-8.99.30-amd64.yaml (1575 of 2154) PASS: lldb-api :: commands/target/dump-symtab-demangle/TestDumpSymtabDemangle.py (1576 of 2154) PASS: lldb-unit :: Process/minidump/./LLDBMinidumpTests/MinidumpParserTest.GetThreadContext_x86_64 (1577 of 2154) PASS: lldb-unit :: SymbolFile/NativePDB/./SymbolFileNativePDBTests/PDBFPOProgramToDWARFExpressionTests.UnresolvedRegisterAssignmentReference (1578 of 2154) PASS: lldb-api :: functionalities/postmortem/elf-core/gcore/TestGCore.py (1579 of 2154) PASS: lldb-shell :: SymbolFile/DWARF/static_scope.s (1580 of 2154) PASS: lldb-api :: functionalities/data-formatter/frameformat_smallstruct/TestFrameFormatSmallStruct.py (1581 of 2154) PASS: lldb-api :: lang/objc/modules-compile-error/TestModulesCompileError.py (1582 of 2154) PASS: lldb-shell :: Settings/TestFrameFormatNoColor.test (1583 of 2154) PASS: lldb-shell :: Driver/TestRepl.test (1584 of 2154) PASS: lldb-unit :: Utility/./UtilityTests/DataExtractorTest.GetMaxS64 (1585 of 2154) PASS: lldb-api :: functionalities/thread/thread_exit/TestThreadExit.py (1586 of 2154) PASS: lldb-unit :: Utility/./UtilityTests/RangeTest.SizeTypes (1587 of 2154) PASS: lldb-unit :: Disassembler/./DisassemblerTests/TestArm64Disassembly.TestArmv81Instruction (1588 of 2154) PASS: lldb-unit :: Expression/./ExpressionTests/DWARFExpression.DW_OP_convert (1589 of 2154) PASS: lldb-unit :: Symbol/./SymbolTests/SymbolsTest.TerminateLocateExecutableSymbolFileForUnknownExecutableAndUnknownSymbolFile (1590 of 2154) PASS: lldb-shell :: ObjectFile/PECOFF/dep-modules.yaml (1591 of 2154) PASS: lldb-shell :: Reproducer/TestVersionCheck.test (1592 of 2154) PASS: lldb-unit :: Utility/./UtilityTests/DataExtractorTest.GetCStr (1593 of 2154) PASS: lldb-unit :: Utility/./UtilityTests/StringListTest.RemoveBlankLines (1594 of 2154) PASS: lldb-shell :: Minidump/no-process-id.yaml (1595 of 2154) PASS: lldb-unit :: Utility/./UtilityTests/ProcessInstanceInfo.DumpTable_invalidUID (1596 of 2154) PASS: lldb-unit :: Utility/./UtilityTests/OptionsWithRawTest.LeadingSpaceArgs (1597 of 2154) PASS: lldb-api :: functionalities/thread/exit_during_break/TestExitDuringBreak.py (1598 of 2154) PASS: lldb-api :: commands/frame/diagnose/array/TestArray.py (1599 of 2154) PASS: lldb-api :: functionalities/gdb_remote_client/TestIOSSimulator.py (1600 of 2154) PASS: lldb-api :: lang/cpp/const_this/TestConstThis.py (1601 of 2154) PASS: lldb-unit :: Utility/./UtilityTests/RecordReplayTest.InstrumentedBar (1602 of 2154) PASS: lldb-unit :: UnwindAssembly/x86/./UnwindAssemblyx86Tests/Testx86AssemblyInspectionEngine.TestMovRSPtoRBP (1603 of 2154) PASS: lldb-api :: functionalities/data-formatter/data-formatter-stl/libcxx/list/loop/TestDataFormatterLibcxxListLoop.py (1604 of 2154) PASS: lldb-shell :: SymbolFile/Breakpad/stack-cfi-parsing.test (1605 of 2154) PASS: lldb-shell :: SymbolFile/DWARF/DW_TAG_basic_type_DW_ATE_UTF_nonC.ll (1606 of 2154) PASS: lldb-api :: lang/cpp/typedef/TestCppTypedef.py (1607 of 2154) PASS: lldb-api :: types/TestFloatTypes.py (1608 of 2154) PASS: lldb-api :: functionalities/process_group/TestChangeProcessGroup.py (1609 of 2154) PASS: lldb-unit :: DataFormatter/./LLDBFormatterTests/StringPrinterTests.SwiftUTF8 (1610 of 2154) PASS: lldb-unit :: Utility/./UtilityTests/StreamTeeTest.DefaultConstructor (1611 of 2154) PASS: lldb-unit :: SymbolFile/DWARF/./SymbolFileDWARFTests/DWARFASTParserClangTests.EnsureAllDIEsInDeclContextHaveBeenParsedParsesOnlyMatchingEntries (1612 of 2154) PASS: lldb-shell :: SymbolFile/DWARF/debug_loc.s (1613 of 2154) PASS: lldb-shell :: Settings/TestFrameFormatMangling.test (1614 of 2154) PASS: lldb-api :: commands/expression/import-std-module/vector-bool/TestVectorBoolFromStdModule.py (1615 of 2154) PASS: lldb-unit :: SymbolFile/NativePDB/./SymbolFileNativePDBTests/PDBFPOProgramToDWARFExpressionTests.DependencyChain (1616 of 2154) PASS: lldb-api :: functionalities/gdb_remote_client/TestQemuAArch64TargetXml.py (1617 of 2154) PASS: lldb-unit :: Interpreter/./InterpreterTests/OptionArgParserTest.toChar (1618 of 2154) PASS: lldb-api :: commands/expression/dollar-in-variable/TestDollarInVariable.py (1619 of 2154) PASS: lldb-unit :: Utility/./UtilityTests/StringListTest.ShiftStdString (1620 of 2154) PASS: lldb-unit :: Language/Highlighting/./HighlighterTests/HighlighterTest.ClangEmptyInput (1621 of 2154) PASS: lldb-api :: functionalities/breakpoint/step_over_breakpoint/TestStepOverBreakpoint.py (1622 of 2154) PASS: lldb-api :: functionalities/thread/concurrent_events/TestConcurrentNWatchNBreak.py (1623 of 2154) PASS: lldb-api :: lang/cpp/class-template-parameter-pack/TestClassTemplateParameterPack.py (1624 of 2154) PASS: lldb-unit :: Language/CPlusPlus/./LanguageCPlusPlusTests/CPlusPlusLanguage.MethodNameParsing (1625 of 2154) PASS: lldb-unit :: UnwindAssembly/x86/./UnwindAssemblyx86Tests/Testx86AssemblyInspectionEngine.Test64bitFramelessBigStackFrame (1626 of 2154) PASS: lldb-unit :: ScriptInterpreter/Python/./ScriptInterpreterPythonTests/PythonDataObjectsTest.TestPythonListValueEquality (1627 of 2154) PASS: lldb-unit :: Utility/./UtilityTests/Predicate.WaitForValueNotEqualTo (1628 of 2154) PASS: lldb-api :: functionalities/tail_call_frames/disambiguate_tail_call_seq/TestDisambiguateTailCallSeq.py (1629 of 2154) PASS: lldb-api :: functionalities/breakpoint/global_constructor/TestBreakpointInGlobalConstructor.py (1630 of 2154) PASS: lldb-unit :: Utility/./UtilityTests/XcodeSDKTest.GetCanonicalNameAndConstruct (1631 of 2154) PASS: lldb-shell :: SymbolFile/DWARF/dwp.s (1632 of 2154) PASS: lldb-unit :: Utility/./UtilityTests/CompletionRequest.TryCompleteCurrentArgGood (1633 of 2154) PASS: lldb-shell :: Driver/TestCore.test (1634 of 2154) PASS: lldb-unit :: Host/./HostTests/SocketTest.TCPGetConnectURI (1635 of 2154) PASS: lldb-unit :: Host/./HostTests/HostInfoTest.GetHostname (1636 of 2154) PASS: lldb-api :: lang/cpp/alignas_base_class/TestAlignAsBaseClass.py (1637 of 2154) PASS: lldb-unit :: Utility/./UtilityTests/StreamTest.PutHex32ByteOrderLittle (1638 of 2154) PASS: lldb-shell :: Commands/CommandScriptImmediateOutput/CommandScriptImmediateOutputFile.test (1639 of 2154) PASS: lldb-shell :: Commands/command-disassemble-process.yaml (1640 of 2154) PASS: lldb-shell :: Reproducer/TestReuseDirectory.test (1641 of 2154) PASS: lldb-unit :: Platform/./LLDBPlatformTests/PlatformDarwinTest.TestParseVersionBuildDir (1642 of 2154) PASS: lldb-api :: lang/cpp/subst_template_type_param/TestSubstTemplateTypeParam.py (1643 of 2154) UNSUPPORTED: lldb-api :: functionalities/darwin_log/filter/exact_match/category/TestDarwinLogFilterMatchCategory.py (1644 of 2154) PASS: lldb-unit :: Utility/./UtilityTests/SharedCluster.ClusterManager (1645 of 2154) PASS: lldb-unit :: Expression/./ExpressionTests/DiagnosticManagerTest.GetStringMultipleDiags (1646 of 2154) PASS: lldb-unit :: Utility/./UtilityTests/RangeTest.Constructor (1647 of 2154) UNSUPPORTED: lldb-api :: commands/watchpoints/variable_out_of_scope/TestWatchedVarHitWhenInScope.py (1648 of 2154) PASS: lldb-api :: python_api/frame/TestFrames.py (1649 of 2154) PASS: lldb-unit :: Utility/./UtilityTests/SerializationRountripTest.SerializeDeserializeObjectPointer (1650 of 2154) PASS: lldb-unit :: Utility/./UtilityTests/SubsystemRAIITest.NormalSubsystem (1651 of 2154) PASS: lldb-unit :: Process/gdb-remote/./ProcessGdbRemoteTests/GDBRemoteClientBaseTest.SendPacketAndReceiveResponseWithOutputSupport (1652 of 2154) PASS: lldb-api :: api/log/TestAPILog.py (1653 of 2154) PASS: lldb-unit :: Utility/./UtilityTests/LogTest.Unregister (1654 of 2154) PASS: lldb-unit :: Utility/./UtilityTests/ArgsTest.TestOverwriteArgs (1655 of 2154) PASS: lldb-api :: functionalities/inferior-assert/TestInferiorAssert.py (1656 of 2154) PASS: lldb-shell :: SymbolFile/NativePDB/s_constant.cpp (1657 of 2154) PASS: lldb-shell :: SymbolFile/Breakpad/unwind-via-raSearch.test (1658 of 2154) PASS: lldb-api :: lang/objc/objc-ivar-offsets/TestObjCIvarOffsets.py (1659 of 2154) PASS: lldb-shell :: SymbolFile/DWARF/dir-separator-no-comp-dir-relative-name.s (1660 of 2154) PASS: lldb-unit :: Host/./HostTests/FileSystemTest.FileAndDirectoryComponents (1661 of 2154) PASS: lldb-unit :: UnwindAssembly/x86/./UnwindAssemblyx86Tests/Testx86AssemblyInspectionEngine.TestSpillRegToStackViaMOVx86_64 (1662 of 2154) PASS: lldb-unit :: Process/minidump/./LLDBMinidumpTests/MinidumpParserTest.GetPidWindows (1663 of 2154) PASS: lldb-api :: lang/mixed/TestMixedLanguages.py (1664 of 2154) PASS: lldb-unit :: UnwindAssembly/x86/./UnwindAssemblyx86Tests/Testx86AssemblyInspectionEngine.TestPushECX (1665 of 2154) UNSUPPORTED: lldb-api :: functionalities/darwin_log/source/info/TestDarwinLogSourceInfo.py (1666 of 2154) PASS: lldb-unit :: Utility/./UtilityTests/DataExtractorTest.GetMaxU64 (1667 of 2154) PASS: lldb-unit :: Language/Highlighting/./HighlighterTests/HighlighterTest.HighlighterSelectionPath (1668 of 2154) UNSUPPORTED: lldb-shell :: ObjectFile/ELF/minidebuginfo-set-and-hit-breakpoint.test (1669 of 2154) PASS: lldb-api :: lang/objc/variadic_methods/TestVariadicMethods.py (1670 of 2154) PASS: lldb-unit :: Process/gdb-remote/./ProcessGdbRemoteTests/GDBRemoteCommunicationClientTest.SendGetTraceConfigPacket (1671 of 2154) PASS: lldb-api :: lang/cpp/template/TestTemplateArgs.py (1672 of 2154) PASS: lldb-api :: commands/platform/file/read/TestPlatformFileRead.py (1673 of 2154) PASS: lldb-unit :: Utility/./UtilityTests/SerializationRountripTest.SerializeDeserializePod (1674 of 2154) PASS: lldb-api :: macosx/universal/TestUniversal.py (1675 of 2154) PASS: lldb-unit :: Utility/./UtilityTests/DataExtractorTest.UncommonAddressSize (1676 of 2154) PASS: lldb-api :: python_api/lldbutil/TestSwigVersion.py (1677 of 2154) PASS: lldb-unit :: Process/gdb-remote/./ProcessGdbRemoteTests/GDBRemoteCommunicationClientTest.GetModulesInfoInvalidResponse (1678 of 2154) PASS: lldb-unit :: ObjectFile/Breakpad/./ObjectFileBreakpadTests/LineRecord.parse (1679 of 2154) PASS: lldb-unit :: Utility/./UtilityTests/StreamTeeTest.GetStreamAtIndexOutOfBoundsEmpty (1680 of 2154) PASS: lldb-api :: commands/command/nested_alias/TestNestedAlias.py (1681 of 2154) PASS: lldb-unit :: ScriptInterpreter/Python/./ScriptInterpreterPythonTests/PythonDataObjectsTest.TestGlobalNameResolutionNoDot (1682 of 2154) PASS: lldb-shell :: Minidump/Windows/find-module.test (1683 of 2154) PASS: lldb-unit :: Utility/./UtilityTests/ArgsTest.TestQuotedUnknownEscape (1684 of 2154) PASS: lldb-shell :: Reproducer/TestCaptureEnvOverride.test (1685 of 2154) PASS: lldb-unit :: UnwindAssembly/x86/./UnwindAssemblyx86Tests/Testx86AssemblyInspectionEngine.TestPushEBP (1686 of 2154) PASS: lldb-api :: sample_test/TestSampleInlineTest.py (1687 of 2154) PASS: lldb-shell :: SymbolFile/DWARF/debug_line-relative_path.s (1688 of 2154) PASS: lldb-shell :: Commands/command-target-modules-dump-sections.yaml (1689 of 2154) PASS: lldb-api :: lang/cpp/inlines/TestInlines.py (1690 of 2154) PASS: lldb-api :: lang/objc/foundation/TestConstStrings.py (1691 of 2154) PASS: lldb-api :: lang/cpp/stl/TestStdCXXDisassembly.py (1692 of 2154) PASS: lldb-unit :: Platform/./LLDBPlatformTests/PlatformDarwinTest.FindComponentInPath (1693 of 2154) UNSUPPORTED: lldb-shell :: Unwind/eh-frame-augment-noop.test (1694 of 2154) PASS: lldb-unit :: Utility/./UtilityTests/StreamTest.PutHex64ByteOrderLittle (1695 of 2154) UNSUPPORTED: lldb-api :: lang/cpp/static_members/TestCPPStaticMembers.py (1696 of 2154) PASS: lldb-shell :: ObjectFile/ELF/PT_LOAD-overlap-PT_TLS.yaml (1697 of 2154) PASS: lldb-api :: functionalities/thread/crash_during_step/TestCrashDuringStep.py (1698 of 2154) PASS: lldb-unit :: Process/gdb-remote/./ProcessGdbRemoteTests/GDBRemoteCommunicationClientTest.SendGetDataPacket (1699 of 2154) PASS: lldb-unit :: Utility/./UtilityTests/ScalarTest.ComparisonFloat (1700 of 2154) PASS: lldb-unit :: Symbol/./SymbolTests/TestTypeSystemClang.TestGetEnumIntegerTypeBasicTypes (1701 of 2154) PASS: lldb-shell :: Process/Optimization.test (1702 of 2154) PASS: lldb-api :: commands/frame/diagnose/complicated-expression/TestComplicatedExpression.py (1703 of 2154) PASS: lldb-unit :: ObjectFile/PECOFF/./ObjectFilePECOFFTests/PECallFrameInfoTest.Chained_eh (1704 of 2154) PASS: lldb-api :: functionalities/data-formatter/poarray/TestPrintObjectArray.py (1705 of 2154) PASS: lldb-unit :: UnwindAssembly/x86/./UnwindAssemblyx86Tests/Testx86AssemblyInspectionEngine.TestPopESI (1706 of 2154) PASS: lldb-api :: commands/expression/no-deadlock/TestExprDoesntBlock.py (1707 of 2154) PASS: lldb-api :: functionalities/tsan/multiple/TestTsanMultiple.py (1708 of 2154) PASS: lldb-unit :: Utility/./UtilityTests/RangeTest.ContainsEndInclusive (1709 of 2154) PASS: lldb-shell :: Quit/TestQuitExitCode0.test (1710 of 2154) PASS: lldb-unit :: UnwindAssembly/x86/./UnwindAssemblyx86Tests/Testx86AssemblyInspectionEngine.TestPushR15 (1711 of 2154) PASS: lldb-api :: functionalities/thread/concurrent_events/TestConcurrentDelaySignalWatch.py (1712 of 2154) PASS: lldb-api :: commands/expression/weak_symbols/TestWeakSymbols.py (1713 of 2154) PASS: lldb-api :: python_api/value/empty_class/TestValueAPIEmptyClass.py (1714 of 2154) PASS: lldb-api :: commands/settings/use_source_cache/TestUseSourceCache.py (1715 of 2154) PASS: lldb-unit :: SymbolFile/NativePDB/./SymbolFileNativePDBTests/PDBFPOProgramToDWARFExpressionTests.UnresolvedRegisterReference (1716 of 2154) PASS: lldb-unit :: Process/minidump/./LLDBMinidumpTests/MinidumpParserTest.GetExceptionStream (1717 of 2154) PASS: lldb-api :: lang/c/register_variables/TestRegisterVariables.py (1718 of 2154) PASS: lldb-shell :: SymbolFile/DWARF/DW_AT_declaration-with-children.s (1719 of 2154) PASS: lldb-unit :: Utility/./UtilityTests/NameMatchesTest.EndsWith (1720 of 2154) PASS: lldb-unit :: Utility/./UtilityTests/PassiveReplayTest.InstrumentedBarPtr (1721 of 2154) UNSUPPORTED: lldb-shell :: SymbolFile/PDB/function-nested-block.test (1722 of 2154) PASS: lldb-unit :: Utility/./UtilityTests/AnsiTerminal.AtEnd (1723 of 2154) PASS: lldb-shell :: Settings/TestDisableColor.test (1724 of 2154) PASS: lldb-unit :: Utility/./UtilityTests/FileSpecTest.FileAndDirectoryComponents (1725 of 2154) PASS: lldb-api :: functionalities/thread/concurrent_events/TestConcurrentTwoWatchpointThreads.py (1726 of 2154) UNSUPPORTED: lldb-api :: functionalities/darwin_log/basic/TestDarwinLogBasic.py (1727 of 2154) PASS: lldb-unit :: Host/./HostTests/HostInfoTest.GetAugmentedArchSpec (1728 of 2154) PASS: lldb-api :: lang/c/strings/TestCStrings.py (1729 of 2154) PASS: lldb-api :: functionalities/data-formatter/data-formatter-categories/TestDataFormatterCategories.py (1730 of 2154) PASS: lldb-api :: functionalities/plugins/python_os_plugin/TestPythonOSPlugin.py (1731 of 2154) PASS: lldb-shell :: Commands/command-regex-unalias.test (1732 of 2154) PASS: lldb-shell :: SymbolFile/DWARF/DW_OP_piece-smaller-than-struct.s (1733 of 2154) PASS: lldb-api :: functionalities/breakpoint/serialize/TestBreakpointSerialization.py (1734 of 2154) PASS: lldb-api :: lang/objc/exceptions/TestObjCExceptions.py (1735 of 2154) PASS: lldb-api :: functionalities/thread/thread_specific_break/TestThreadSpecificBreakpoint.py (1736 of 2154) PASS: lldb-api :: functionalities/thread/concurrent_events/TestConcurrentDelayedCrashWithBreakpointWatchpoint.py (1737 of 2154) PASS: lldb-unit :: Utility/./UtilityTests/ArgsTest.TestArgv (1738 of 2154) PASS: lldb-unit :: Language/Highlighting/./HighlighterTests/HighlighterTest.DefaultHighlighter (1739 of 2154) PASS: lldb-unit :: Utility/./UtilityTests/DataExtractorTest.GetBitfield (1740 of 2154) PASS: lldb-api :: python_api/watchpoint/watchlocation/TestTargetWatchAddress.py (1741 of 2154) UNSUPPORTED: lldb-api :: functionalities/data-formatter/data-formatter-stl/libstdcpp/tuple/TestDataFormatterStdTuple.py (1742 of 2154) PASS: lldb-api :: commands/expression/codegen-crash-typedefdecl-not-in_declcontext/TestCodegenCrashTypedefDeclNotInDeclContext.py (1743 of 2154) PASS: lldb-shell :: SymbolFile/NativePDB/break-by-function.cpp (1744 of 2154) PASS: lldb-api :: lang/objc/modules-incomplete/TestIncompleteModules.py (1745 of 2154) PASS: lldb-api :: lang/cpp/unique-types/TestUniqueTypes.py (1746 of 2154) PASS: lldb-unit :: Utility/./UtilityTests/ArgsTest.GetArgumentArrayRef (1747 of 2154) PASS: lldb-unit :: Symbol/./SymbolTests/LineEntryTest.GetSameLineContiguousAddressRangeOneInline (1748 of 2154) UNSUPPORTED: lldb-shell :: SymbolFile/NativePDB/stack_unwinding01.cpp (1749 of 2154) PASS: lldb-unit :: Core/./LLDBCoreTests/ModuleSpecTest.TestELFFile (1750 of 2154) PASS: lldb-api :: commands/expression/anonymous-struct/TestCallUserAnonTypedef.py (1751 of 2154) PASS: lldb-shell :: SymbolFile/DWARF/apple-index-is-used.cpp (1752 of 2154) PASS: lldb-api :: commands/expression/radar_8638051/Test8638051.py (1753 of 2154) PASS: lldb-unit :: Process/minidump/./LLDBMinidumpTests/MinidumpParserTest.MinidumpDuplicateModuleMappedFirst (1754 of 2154) PASS: lldb-unit :: Utility/./UtilityTests/StringListTest.Clear (1755 of 2154) PASS: lldb-unit :: Symbol/./SymbolTests/TestTypeSystemClang.TemplateArguments (1756 of 2154) PASS: lldb-unit :: Language/Highlighting/./HighlighterTests/HighlighterTest.ClangTrailingBackslashWithWhitespace (1757 of 2154) PASS: lldb-api :: python_api/function_symbol/TestDisasmAPI.py (1758 of 2154) PASS: lldb-unit :: ObjectFile/PECOFF/./ObjectFilePECOFFTests/PECallFrameInfoTest.Basic_eh (1759 of 2154) PASS: lldb-api :: commands/expression/test/TestExprs.py (1760 of 2154) PASS: lldb-api :: commands/gui/basicdebug/TestGuiBasicDebug.py (1761 of 2154) PASS: lldb-api :: commands/target/basic/TestTargetCommand.py (1762 of 2154) PASS: lldb-api :: api/check_public_api_headers/TestPublicAPIHeaders.py (1763 of 2154) UNSUPPORTED: lldb-shell :: ScriptInterpreter/Lua/convenience_variables.test (1764 of 2154) PASS: lldb-unit :: Host/./HostTests/ProcessLaunchInfoTest.Constructor (1765 of 2154) PASS: lldb-api :: commands/expression/save_jit_objects/TestSaveJITObjects.py (1766 of 2154) PASS: lldb-api :: functionalities/breakpoint/breakpoint_callback_command_source/TestBreakpointCallbackCommandSource.py (1767 of 2154) PASS: lldb-unit :: Utility/./UtilityTests/RecordReplayTest.InstrumentedFooSameThis (1768 of 2154) PASS: lldb-unit :: Utility/./UtilityTests/FileSpecTest.IsRelative (1769 of 2154) PASS: lldb-api :: functionalities/memory/find/TestMemoryFind.py (1770 of 2154) PASS: lldb-unit :: Utility/./UtilityTests/TimerTest.CategoryTimes (1771 of 2154) PASS: lldb-unit :: Utility/./UtilityTests/XcodeSDKTest.FindXcodeContentsDirectoryInPath (1772 of 2154) PASS: lldb-unit :: ObjectFile/Breakpad/./ObjectFileBreakpadTests/Record.classify (1773 of 2154) PASS: lldb-unit :: Process/minidump/./LLDBMinidumpTests/MinidumpParserTest.GetThreadsAndGetThreadContext (1774 of 2154) PASS: lldb-api :: lang/c/struct_types/TestStructTypes.py (1775 of 2154) PASS: lldb-shell :: Commands/command-stop-hook-output.test (1776 of 2154) PASS: lldb-unit :: Language/CPlusPlus/./LanguageCPlusPlusTests/CPlusPlusLanguage.CPlusPlusNameParser (1777 of 2154) PASS: lldb-api :: functionalities/thread/concurrent_events/TestConcurrentSignalWatch.py (1778 of 2154) PASS: lldb-unit :: Utility/./UtilityTests/BroadcasterTest.EventTypeHasListeners (1779 of 2154) PASS: lldb-unit :: Utility/./UtilityTests/RangeDataVector.FindEntryIndexesThatContain (1780 of 2154) PASS: lldb-unit :: SymbolFile/DWARF/./SymbolFileDWARFTests/SymbolFileDWARFTests.TestAbbrevMissingTerminator (1781 of 2154) PASS: lldb-unit :: Process/minidump/./LLDBMinidumpTests/RegisterContextMinidump.ConvertMinidumpContext_x86_32 (1782 of 2154) PASS: lldb-unit :: Utility/./UtilityTests/StringListTest.AppendList (1783 of 2154) PASS: lldb-shell :: SymbolFile/DWARF/childless-compile-unit.s (1784 of 2154) PASS: lldb-api :: commands/expression/import-std-module/shared_ptr/TestSharedPtrFromStdModule.py (1785 of 2154) PASS: lldb-unit :: Utility/./UtilityTests/BinaryStreamTest.PutULEB128OneByte (1786 of 2154) PASS: lldb-shell :: SymbolFile/Breakpad/stack-cfi-arm.yaml (1787 of 2154) PASS: lldb-unit :: Utility/./UtilityTests/StreamTest.AddressPrefix (1788 of 2154) PASS: lldb-unit :: Utility/./UtilityTests/StreamTeeTest.SetStreamAtIndexOverwrite (1789 of 2154) PASS: lldb-api :: commands/expression/namespace_local_var_same_name_obj_c/TestNamespaceLocalVarSameNameObjC.py (1790 of 2154) UNSUPPORTED: lldb-shell :: ScriptInterpreter/Lua/bindings.test (1791 of 2154) PASS: lldb-unit :: Host/./HostTests/Host.GetEnvironment (1792 of 2154) PASS: lldb-unit :: ScriptInterpreter/Python/./ScriptInterpreterPythonTests/PythonDataObjectsTest.TestPythonFile (1793 of 2154) PASS: lldb-api :: functionalities/postmortem/elf-core/TestLinuxCore.py (1794 of 2154) PASS: lldb-api :: lang/cpp/auto/TestCPPAuto.py (1795 of 2154) PASS: lldb-unit :: Utility/./UtilityTests/NameMatchesTest.Equals (1796 of 2154) UNSUPPORTED: lldb-shell :: Watchpoint/netbsd-nouserdbregs.test (1797 of 2154) PASS: lldb-api :: functionalities/tail_call_frames/thread_step_out_message/TestArtificialFrameStepOutMessage.py (1798 of 2154) PASS: lldb-unit :: Symbol/./SymbolTests/TestTypeSystemClang.TestGetTypeClassDeclType (1799 of 2154) UNSUPPORTED: lldb-api :: benchmarks/turnaround/TestCompileRunToBreakpointTurnaround.py (1800 of 2154) PASS: lldb-api :: functionalities/target-new-solib-notifications/TestModuleLoadedNotifys.py (1801 of 2154) PASS: lldb-shell :: ObjectFile/ELF/base-address.yaml (1802 of 2154) PASS: lldb-unit :: Expression/./ExpressionTests/DiagnosticManagerTest.AppendMessageSubsequentDiags (1803 of 2154) PASS: lldb-unit :: Utility/./UtilityTests/ArgsTest.TestMultipleArgs (1804 of 2154) UNSUPPORTED: lldb-api :: functionalities/thread/multi_break/TestMultipleBreakpoints.py (1805 of 2154) PASS: lldb-api :: functionalities/data-formatter/builtin-formats/TestBuiltinFormats.py (1806 of 2154) PASS: lldb-unit :: Core/./LLDBCoreTests/MangledTest.ResultForBlockInvocation (1807 of 2154) PASS: lldb-unit :: UnwindAssembly/x86/./UnwindAssemblyx86Tests/Testx86AssemblyInspectionEngine.TestPopEDI (1808 of 2154) PASS: lldb-unit :: Utility/./UtilityTests/StringExtractorTest.DecodeHexU8_InvalidHex2 (1809 of 2154) PASS: lldb-unit :: Utility/./UtilityTests/StringLexerTest.HasAtLeast (1810 of 2154) PASS: lldb-api :: lang/cpp/limit-debug-info/TestWithLimitDebugInfo.py (1811 of 2154) PASS: lldb-api :: lang/objc/objc-ivar-protocols/TestIvarProtocols.py (1812 of 2154) PASS: lldb-api :: commands/watchpoints/watchpoint_events/TestWatchpointEvents.py (1813 of 2154) PASS: lldb-api :: functionalities/data-formatter/data-formatter-synthtype/TestDataFormatterSynthType.py (1814 of 2154) PASS: lldb-api :: tools/lldb-server/TestGdbRemoteThreadsInStopReply.py (1815 of 2154) PASS: lldb-api :: lang/c/unions/TestUnionMembers.py (1816 of 2154) UNSUPPORTED: lldb-shell :: SymbolFile/PDB/ast-restore.test (1817 of 2154) PASS: lldb-api :: lang/objc/foundation/TestObjCMethodsString.py (1818 of 2154) PASS: lldb-unit :: Expression/./ExpressionTests/CppModuleConfigurationTest.UnrelatedLibrary (1819 of 2154) PASS: lldb-unit :: Utility/./UtilityTests/StreamTest.PutPtr (1820 of 2154) PASS: lldb-unit :: Target/./TargetTests/ExecutionContextTest.GetByteOrder (1821 of 2154) PASS: lldb-shell :: SymbolFile/DWARF/inline-function-address.ll (1822 of 2154) PASS: lldb-shell :: Reproducer/TestRelativePath.test (1823 of 2154) PASS: lldb-unit :: Utility/./UtilityTests/BinaryStreamTest.PutULEB128TwoBytes (1824 of 2154) PASS: lldb-api :: lang/cpp/type_lookup/TestCppTypeLookup.py (1825 of 2154) PASS: lldb-shell :: Breakpoint/split-dwarf5-debug-stroffsets.test (1826 of 2154) PASS: lldb-unit :: Target/./TargetTests/ModuleCacheTest.GetAndPutUuidExists (1827 of 2154) PASS: lldb-unit :: Utility/./UtilityTests/RangeDataVector.CustomSort (1828 of 2154) PASS: lldb-shell :: Breakpoint/jitbp_elf.test (1829 of 2154) PASS: lldb-unit :: Utility/./UtilityTests/StringListTest.AppendStringMove (1830 of 2154) PASS: lldb-unit :: Core/./LLDBCoreTests/MangledTest.EmptyForInvalidName (1831 of 2154) PASS: lldb-shell :: Breakpoint/debug_rnglist_basic.test (1832 of 2154) PASS: lldb-api :: python_api/section/TestSectionAPI.py (1833 of 2154) PASS: lldb-api :: functionalities/breakpoint/comp_dir_symlink/TestCompDirSymLink.py (1834 of 2154) PASS: lldb-unit :: Symbol/./SymbolTests/DWARFCallFrameInfoTest.Basic_dwarf3 (1835 of 2154) PASS: lldb-unit :: Utility/./UtilityTests/StreamTest.AddressEmptyPrefix (1836 of 2154) PASS: lldb-unit :: ObjectFile/PECOFF/./ObjectFilePECOFFTests/PECallFrameInfoTest.Frame_reg_eh (1837 of 2154) PASS: lldb-shell :: SymbolFile/Breakpad/line-table-discontinuous-file-ids.test (1838 of 2154) PASS: lldb-unit :: Utility/./UtilityTests/StringExtractorTest.GetNameColonValueNoSemicolon (1839 of 2154) PASS: lldb-unit :: Utility/./UtilityTests/ProcessInstanceInfo.Dump (1840 of 2154) UNSUPPORTED: lldb-api :: python_api/event/TestEvents.py (1841 of 2154) PASS: lldb-unit :: Utility/./UtilityTests/RegularExpression.Empty (1842 of 2154) PASS: lldb-api :: lang/c/bitfields/TestBitfields.py (1843 of 2154) PASS: lldb-api :: commands/expression/function_template_specialization_temp_args/TestFunctionTemplateSpecializationTempArgs.py (1844 of 2154) PASS: lldb-unit :: Utility/./UtilityTests/GeneratorTest.Get (1845 of 2154) PASS: lldb-api :: functionalities/data-formatter/cstring-utf8-summary/TestCstringUnicode.py (1846 of 2154) PASS: lldb-api :: functionalities/data-formatter/user-format-vs-summary/TestUserFormatVsSummary.py (1847 of 2154) PASS: lldb-api :: lang/cpp/covariant-return-types/TestCovariantReturnTypes.py (1848 of 2154) PASS: lldb-shell :: Quit/TestQuitExitCodeTooManyArgs.test (1849 of 2154) PASS: lldb-shell :: ObjectFile/ELF/basic-info.yaml (1850 of 2154) PASS: lldb-unit :: Utility/./UtilityTests/ArchSpecTest.MergeFromMachOUnknown (1851 of 2154) PASS: lldb-unit :: Utility/./UtilityTests/CompletionRequest.Constructor (1852 of 2154) PASS: lldb-unit :: Utility/./UtilityTests/EventTest.DumpEventDataBytes (1853 of 2154) PASS: lldb-unit :: Symbol/./SymbolTests/DWARFCallFrameInfoTest.Basic_dwarf4 (1854 of 2154) UNSUPPORTED: lldb-api :: functionalities/thread/break_after_join/TestBreakAfterJoin.py (1855 of 2154) PASS: lldb-api :: macosx/nslog/TestDarwinNSLogOutput.py (1856 of 2154) PASS: lldb-unit :: Utility/./UtilityTests/StreamTest.PutHex16ByteOrderLittle (1857 of 2154) PASS: lldb-api :: lang/cpp/call-function/TestCallCPPFunction.py (1858 of 2154) PASS: lldb-api :: lang/objc/objc-stepping/TestObjCStepping.py (1859 of 2154) PASS: lldb-shell :: SymbolFile/Breakpad/unwind-via-stack-win-no-memory-info.yaml (1860 of 2154) PASS: lldb-unit :: Symbol/./SymbolTests/TestClangASTImporter.CopyDeclTagDecl (1861 of 2154) PASS: lldb-api :: lang/cpp/nsimport/TestCppNsImport.py (1862 of 2154) PASS: lldb-api :: macosx/load-kext/TestLoadKext.py (1863 of 2154) UNSUPPORTED: lldb-api :: functionalities/darwin_log/filter/regex/subsystem/TestDarwinLogFilterRegexSubsystem.py (1864 of 2154) PASS: lldb-unit :: Utility/./UtilityTests/StringListTest.LongestCommonPrefixSingleElement (1865 of 2154) PASS: lldb-unit :: ScriptInterpreter/Python/./ScriptInterpreterPythonTests/PythonDataObjectsTest.TestScript (1866 of 2154) PASS: lldb-api :: lang/cpp/nested-class-other-compilation-unit/TestNestedClassWithParentInAnotherCU.py (1867 of 2154) PASS: lldb-unit :: DataFormatter/./LLDBFormatterTests/FormatManagerTests.CompatibleLangs (1868 of 2154) PASS: lldb-unit :: Utility/./UtilityTests/StringListTest.SplitIntoLinesEmpty (1869 of 2154) PASS: lldb-api :: tools/lldb-vscode/breakpoint/TestVSCode_setBreakpoints.py (1870 of 2154) PASS: lldb-unit :: SymbolFile/NativePDB/./SymbolFileNativePDBTests/PDBFPOProgramToDWARFExpressionTests.InvalidOpUnary (1871 of 2154) PASS: lldb-unit :: ObjectFile/ELF/./ObjectFileELFTests/ObjectFileELFTest.GetSymtab_NoSymEntryPointArmAddressClass (1872 of 2154) UNSUPPORTED: lldb-api :: benchmarks/stepping/TestSteppingSpeed.py (1873 of 2154) PASS: lldb-shell :: Reproducer/TestCrash.test (1874 of 2154) PASS: lldb-unit :: Utility/./UtilityTests/StringListTest.InsertStringAtIndexEnd (1875 of 2154) PASS: lldb-api :: python_api/sbplatform/TestSBPlatform.py (1876 of 2154) UNSUPPORTED: lldb-shell :: Register/aarch64-gp-read.test (1877 of 2154) PASS: lldb-unit :: Process/gdb-remote/./ProcessGdbRemoteTests/GDBRemoteClientBaseTest.SendContinueDelegateInterface (1878 of 2154) PASS: lldb-unit :: Utility/./UtilityTests/ScalarTest.CastOperations (1879 of 2154) PASS: lldb-api :: python_api/file_handle/TestFileHandle.py (1880 of 2154) PASS: lldb-unit :: Utility/./UtilityTests/StreamTest.ShiftOperatorChars (1881 of 2154) PASS: lldb-api :: functionalities/tsan/cpp_global_location/TestTsanCPPGlobalLocation.py (1882 of 2154) PASS: lldb-api :: functionalities/signal/TestSendSignal.py (1883 of 2154) PASS: lldb-unit :: SymbolFile/NativePDB/./SymbolFileNativePDBTests/PDBFPOProgramToDWARFExpressionTests.UnresolvedCyclicRegisterAssignmentReference (1884 of 2154) PASS: lldb-api :: functionalities/tsan/global_location/TestTsanGlobalLocation.py (1885 of 2154) PASS: lldb-unit :: Process/minidump/./LLDBMinidumpTests/MinidumpParserTest.GetLinuxProcStatus_no_stream (1886 of 2154) PASS: lldb-shell :: Commands/command-script-import.test (1887 of 2154) PASS: lldb-shell :: Expr/TestMultilineExpr.test (1888 of 2154) PASS: lldb-unit :: ScriptInterpreter/Python/./ScriptInterpreterPythonTests/PythonDataObjectsTest.TestPythonStringToStructuredString (1889 of 2154) PASS: lldb-unit :: Expression/./ExpressionTests/CppModuleConfigurationTest.MissingUsrInclude (1890 of 2154) PASS: lldb-unit :: Utility/./UtilityTests/StringListTest.ShiftMove (1891 of 2154) PASS: lldb-unit :: Utility/./UtilityTests/ScalarTest.APIntConstructor (1892 of 2154) PASS: lldb-unit :: Utility/./UtilityTests/StringExtractorTest.GetHexBytesAvail_FullString (1893 of 2154) PASS: lldb-unit :: Utility/./UtilityTests/StringExtractorTest.DecodeHexU8_Underflow (1894 of 2154) PASS: lldb-api :: lang/cpp/wchar_t/TestCxxWCharT.py (1895 of 2154) PASS: lldb-unit :: Core/./LLDBCoreTests/ModuleSpecTest.InvalidInMemoryBuffer (1896 of 2154) PASS: lldb-unit :: Utility/./UtilityTests/UriParserTest.Minimal (1897 of 2154) PASS: lldb-unit :: Utility/./UtilityTests/RangeTest.Equal (1898 of 2154) PASS: lldb-unit :: Process/gdb-remote/./ProcessGdbRemoteTests/GDBRemoteCommunicationClientTest.ReadRegister (1899 of 2154) PASS: lldb-shell :: Reproducer/TestProcessList.test (1900 of 2154) PASS: lldb-unit :: Utility/./UtilityTests/CompletionRequest.DuplicateFilteringWithComments (1901 of 2154) PASS: lldb-unit :: Utility/./UtilityTests/BinaryStreamTest.PutSLEB128NineBytes (1902 of 2154) PASS: lldb-unit :: Target/./TargetTests/ExecutionContextTest.GetByteOrderProcess (1903 of 2154) PASS: lldb-api :: commands/frame/diagnose/inheritance/TestDiagnoseInheritance.py (1904 of 2154) PASS: lldb-api :: lang/cpp/class_types/TestClassTypesDisassembly.py (1905 of 2154) PASS: lldb-unit :: UnwindAssembly/x86/./UnwindAssemblyx86Tests/Testx86AssemblyInspectionEngine.TestPopR12 (1906 of 2154) PASS: lldb-unit :: SymbolFile/NativePDB/./SymbolFileNativePDBTests/PDBFPOProgramToDWARFExpressionTests.MultipleDependentAssignments (1907 of 2154) PASS: lldb-api :: commands/target/stop-hooks/TestStopHooks.py (1908 of 2154) PASS: lldb-api :: iohandler/unicode/TestUnicode.py (1909 of 2154) PASS: lldb-unit :: Utility/./UtilityTests/ScalarTest.LongLongAssigmentOperator (1910 of 2154) PASS: lldb-unit :: UnwindAssembly/x86/./UnwindAssemblyx86Tests/Testx86AssemblyInspectionEngine.TestPushRBX (1911 of 2154) PASS: lldb-shell :: SymbolFile/Breakpad/line-table-edgecases.test (1912 of 2154) PASS: lldb-shell :: Driver/TestHelp.test (1913 of 2154) PASS: lldb-unit :: Utility/./UtilityTests/StreamTeeTest.Flush (1914 of 2154) PASS: lldb-shell :: Minidump/memory-region.yaml (1915 of 2154) PASS: lldb-api :: lang/c/stepping/TestStepAndBreakpoints.py (1916 of 2154) PASS: lldb-api :: commands/settings/TestSettings.py (1917 of 2154) PASS: lldb-unit :: Expression/./ExpressionTests/DiagnosticManagerTest.PutString (1918 of 2154) UNSUPPORTED: lldb-api :: functionalities/signal/handle-segv/TestHandleSegv.py (1919 of 2154) PASS: lldb-unit :: Symbol/./SymbolTests/TestTypeSystemClang.TestDisplayNameEmpty (1920 of 2154) PASS: lldb-api :: tools/lldb-server/TestGdbRemoteExpeditedRegisters.py (1921 of 2154) PASS: lldb-shell :: SymbolFile/DWARF/find-basic-variable.cpp (1922 of 2154) PASS: lldb-api :: functionalities/data-formatter/hexcaps/TestDataFormatterHexCaps.py (1923 of 2154) PASS: lldb-api :: lang/cpp/enum_types/TestCPP11EnumTypes.py (1924 of 2154) PASS: lldb-api :: functionalities/thread/concurrent_events/TestConcurrentSignalDelayWatch.py (1925 of 2154) PASS: lldb-api :: functionalities/data-formatter/data-formatter-stl/libcxx/variant/TestDataFormatterLibcxxVariant.py (1926 of 2154) PASS: lldb-unit :: ScriptInterpreter/Python/./ScriptInterpreterPythonTests/PythonDataObjectsTest.TestPythonCallableInvoke (1927 of 2154) PASS: lldb-unit :: Utility/./UtilityTests/GeneratorTest.Create (1928 of 2154) PASS: lldb-shell :: Commands/command-source.test (1929 of 2154) PASS: lldb-api :: functionalities/ubsan/user-expression/TestUbsanUserExpression.py (1930 of 2154) UNSUPPORTED: lldb-api :: benchmarks/libcxxlist/TestBenchmarkLibcxxList.py (1931 of 2154) PASS: lldb-api :: functionalities/plugins/command_plugin/TestPluginCommands.py (1932 of 2154) UNSUPPORTED: lldb-shell :: SymbolFile/NativePDB/typedefs.cpp (1933 of 2154) PASS: lldb-api :: lang/objc/objc-new-syntax/TestObjCNewSyntaxDictionary.py (1934 of 2154) PASS: lldb-unit :: Utility/./UtilityTests/BinaryStreamTest.PutSLEB128OneByte (1935 of 2154) PASS: lldb-unit :: Utility/./UtilityTests/ConstStringTest.NullAndEmptyStates (1936 of 2154) PASS: lldb-unit :: Utility/./UtilityTests/XcodeSDKTest.ParseTest (1937 of 2154) PASS: lldb-api :: functionalities/data-formatter/data-formatter-stl/libcxx/map/TestDataFormatterLibccMap.py (1938 of 2154) PASS: lldb-api :: lang/objc/objc_direct-methods/TestObjCDirectMethods.py (1939 of 2154) PASS: lldb-unit :: Utility/./UtilityTests/CompletionRequest.DuplicateFiltering (1940 of 2154) UNSUPPORTED: lldb-shell :: SymbolFile/PDB/variables.test (1941 of 2154) PASS: lldb-unit :: Process/minidump/./LLDBMinidumpTests/MinidumpParserTest.GetMiscInfoWindows (1942 of 2154) PASS: lldb-unit :: UnwindAssembly/x86/./UnwindAssemblyx86Tests/Testx86AssemblyInspectionEngine.TestStackRealign8BitDisp_i386 (1943 of 2154) PASS: lldb-unit :: Utility/./UtilityTests/ArgsTest.TestAppendArg (1944 of 2154) PASS: lldb-api :: types/TestFloatTypesExpr.py (1945 of 2154) PASS: lldb-api :: macosx/safe-to-func-call/TestSafeFuncCalls.py (1946 of 2154) PASS: lldb-api :: lang/objc/objc-checker/TestObjCCheckers.py (1947 of 2154) PASS: lldb-unit :: Utility/./UtilityTests/DataExtractorTest.GetFloat (1948 of 2154) PASS: lldb-unit :: UnwindAssembly/x86/./UnwindAssemblyx86Tests/Testx86AssemblyInspectionEngine.TestPopRBX (1949 of 2154) PASS: lldb-unit :: Utility/./UtilityTests/LogChannelTest.Enable (1950 of 2154) PASS: lldb-unit :: Utility/./UtilityTests/StringListTest.CopyList (1951 of 2154) PASS: lldb-unit :: Expression/./ExpressionTests/DWARFExpression.DW_OP_unknown (1952 of 2154) PASS: lldb-api :: functionalities/breakpoint/breakpoint_language/TestBreakpointLanguage.py (1953 of 2154) PASS: lldb-api :: lang/objc/foundation/TestRuntimeTypes.py (1954 of 2154) XFAIL: lldb-shell :: Register/x86-mm-xmm-read.test (1955 of 2154) PASS: lldb-unit :: Utility/./UtilityTests/AnsiTerminal.Unknown (1956 of 2154) PASS: lldb-unit :: Host/./HostTests/SocketTest.TCPListen0GetPort (1957 of 2154) PASS: lldb-unit :: Utility/./UtilityTests/ArgsTest.TestQuotedTrailingBackslash (1958 of 2154) PASS: lldb-unit :: Utility/./UtilityTests/ArchSpecTest.OperatorBool (1959 of 2154) PASS: lldb-shell :: Unwind/thread-step-out-ret-addr-check.test (1960 of 2154) PASS: lldb-api :: commands/frame/diagnose/dereference-argument/TestDiagnoseDereferenceArgument.py (1961 of 2154) PASS: lldb-unit :: Utility/./UtilityTests/FileSpecTest.EqualDotsPosix (1962 of 2154) PASS: lldb-unit :: Utility/./UtilityTests/BinaryStreamTest.PutULEB128SevenBytes (1963 of 2154) UNSUPPORTED: lldb-shell :: SymbolFile/PDB/type-quals.test (1964 of 2154) PASS: lldb-api :: macosx/save_crashlog/TestSaveCrashlog.py (1965 of 2154) PASS: lldb-shell :: Reproducer/TestDriverOptions.test (1966 of 2154) UNSUPPORTED: lldb-api :: functionalities/data-formatter/data-formatter-stl/libstdcpp/string/TestDataFormatterStdString.py (1967 of 2154) PASS: lldb-api :: functionalities/thread/concurrent_events/TestConcurrentDelayWatchBreak.py (1968 of 2154) PASS: lldb-shell :: Driver/TestFile.test (1969 of 2154) PASS: lldb-api :: commands/expression/import-std-module/empty-module/TestEmptyStdModule.py (1970 of 2154) PASS: lldb-unit :: Utility/./UtilityTests/AnsiTerminal.Basic (1971 of 2154) PASS: lldb-unit :: Utility/./UtilityTests/StringLexerTest.Next (1972 of 2154) PASS: lldb-api :: commands/expression/unwind_expression/TestUnwindExpression.py (1973 of 2154) PASS: lldb-unit :: Utility/./UtilityTests/BinaryStreamTest.PutULEB128Zero (1974 of 2154) PASS: lldb-unit :: Utility/./UtilityTests/StringExtractorTest.GetHexBytesAvail_OddPair2 (1975 of 2154) PASS: lldb-unit :: Utility/./UtilityTests/ConstStringTest.MangledCounterpart (1976 of 2154) PASS: lldb-shell :: Quit/TestQuitExitCodeImplicit0.test (1977 of 2154) UNSUPPORTED: lldb-api :: functionalities/data-formatter/data-formatter-stl/libstdcpp/unique_ptr/TestDataFormatterStdUniquePtr.py (1978 of 2154) PASS: lldb-unit :: Expression/./ExpressionTests/CppModuleConfigurationTest.Xcode (1979 of 2154) PASS: lldb-api :: commands/platform/basic/TestPlatformPython.py (1980 of 2154) PASS: lldb-unit :: Utility/./UtilityTests/ArchSpecTest.Compatibility (1981 of 2154) PASS: lldb-unit :: Utility/./UtilityTests/StringListTest.AppendStringStdString (1982 of 2154) PASS: lldb-shell :: SymbolFile/DWARF/deterministic-build.cpp (1983 of 2154) PASS: lldb-unit :: Utility/./UtilityTests/StringListTest.GetMaxStringLengthMixed (1984 of 2154) PASS: lldb-api :: lang/c/offsetof/TestOffsetof.py (1985 of 2154) PASS: lldb-unit :: Utility/./UtilityTests/RangeTest.LessThanInvalid (1986 of 2154) PASS: lldb-api :: functionalities/data-formatter/refpointer-recursion/TestDataFormatterRefPtrRecursion.py (1987 of 2154) PASS: lldb-unit :: Utility/./UtilityTests/StringListTest.LongestCommonPrefix (1988 of 2154) PASS: lldb-api :: functionalities/breakpoint/consecutive_breakpoints/TestConsecutiveBreakpoints.py (1989 of 2154) PASS: lldb-api :: functionalities/unwind/noreturn/TestNoreturnUnwind.py (1990 of 2154) PASS: lldb-api :: commands/expression/fixits/TestFixIts.py (1991 of 2154) UNSUPPORTED: lldb-shell :: Register/x86-64-ymm16-read.test (1992 of 2154) PASS: lldb-api :: functionalities/memory-region/TestMemoryRegion.py (1993 of 2154) PASS: lldb-shell :: SymbolFile/DWARF/find-method-local-struct.cpp (1994 of 2154) UNSUPPORTED: lldb-api :: benchmarks/libcxxmap/TestBenchmarkLibcxxMap.py (1995 of 2154) PASS: lldb-api :: functionalities/breakpoint/breakpoint_by_file_colon_line/TestBreakpointByFileColonLine.py (1996 of 2154) PASS: lldb-api :: commands/watchpoints/watchpoint_disable/TestWatchpointDisable.py (1997 of 2154) PASS: lldb-api :: lang/objcxx/hide-runtime-values/TestObjCXXHideRuntimeValues.py (1998 of 2154) PASS: lldb-unit :: Utility/./UtilityTests/GeneratorTest.GetOrCreate (1999 of 2154) PASS: lldb-api :: commands/expression/import-std-module/weak_ptr-dbg-info-content/TestDbgInfoContentWeakPtrFromStdModule.py (2000 of 2154) PASS: lldb-unit :: Utility/./UtilityTests/UUIDTest.RelationalOperators (2001 of 2154) PASS: lldb-unit :: Symbol/./SymbolTests/TestTypeSystemClang.TestRecordHasFields (2002 of 2154) PASS: lldb-unit :: Language/Highlighting/./HighlighterTests/HighlighterTest.ClangIdentifiers (2003 of 2154) PASS: lldb-shell :: ObjectFile/ELF/PT_LOAD.yaml (2004 of 2154) PASS: lldb-api :: lang/objc/blocks/TestObjCIvarsInBlocks.py (2005 of 2154) PASS: lldb-shell :: SymbolFile/DWARF/debug-types-basic.test (2006 of 2154) PASS: lldb-unit :: Utility/./UtilityTests/OptionsWithRawTest.WhitespaceSuffix (2007 of 2154) PASS: lldb-unit :: ScriptInterpreter/Python/./ScriptInterpreterPythonTests/PythonDataObjectsTest.TestPythonBytes (2008 of 2154) PASS: lldb-api :: functionalities/postmortem/mach-core/TestMachCore.py (2009 of 2154) PASS: lldb-unit :: debugserver/./debugserverTests/RNBSocket.AnyListen (2010 of 2154) PASS: lldb-api :: functionalities/tail_call_frames/cross_object/TestCrossObjectTailCalls.py (2011 of 2154) PASS: lldb-shell :: Driver/TestTarget.test (2012 of 2154) PASS: lldb-api :: lang/c/set_values/TestSetValues.py (2013 of 2154) PASS: lldb-unit :: Utility/./UtilityTests/VMRange.Ordering (2014 of 2154) PASS: lldb-api :: lang/objc/orderedset/TestOrderedSet.py (2015 of 2154) PASS: lldb-unit :: Utility/./UtilityTests/SerializationRountripTest.SerializeDeserializeCString (2016 of 2154) PASS: lldb-unit :: Utility/./UtilityTests/Flags.AnyClear (2017 of 2154) PASS: lldb-shell :: Settings/TestEchoCommands.test (2018 of 2154) PASS: lldb-api :: lang/c/const_variables/TestConstVariables.py (2019 of 2154) PASS: lldb-shell :: Reproducer/TestSynchronous.test (2020 of 2154) PASS: lldb-api :: functionalities/gdb_remote_client/TestNoGPacketSupported.py (2021 of 2154) PASS: lldb-unit :: Utility/./UtilityTests/UriParserTest.BadPort (2022 of 2154) PASS: lldb-api :: macosx/lc-note/firmware-corefile/TestFirmwareCorefiles.py (2023 of 2154) PASS: lldb-api :: commands/expression/import-std-module/vector-of-vectors/TestVectorOfVectorsFromStdModule.py (2024 of 2154) PASS: lldb-unit :: Utility/./UtilityTests/OptionsWithRawTest.MultiWordSuffix (2025 of 2154) PASS: lldb-unit :: Process/gdb-remote/./ProcessGdbRemoteTests/GDBRemoteCommunicationServerTest.SendErrorResponse_StringError (2026 of 2154) PASS: lldb-api :: functionalities/thread/backtrace_all/TestBacktraceAll.py (2027 of 2154) PASS: lldb-api :: functionalities/data-formatter/var-in-aggregate-misuse/TestVarInAggregateMisuse.py (2028 of 2154) PASS: lldb-unit :: Utility/./UtilityTests/StringExtractorTest.InitMisc (2029 of 2154) PASS: lldb-unit :: Symbol/./SymbolTests/TestTypeSystemClang.AddMethodToObjCObjectType (2030 of 2154) PASS: lldb-shell :: SymbolFile/DWARF/DW_AT_data_bit_offset-DW_OP_stack_value.s (2031 of 2154) PASS: lldb-shell :: Reproducer/TestVerify.test (2032 of 2154) PASS: lldb-shell :: SymbolFile/DWARF/win-i386-line-table.s (2033 of 2154) PASS: lldb-unit :: Utility/./UtilityTests/StringListTest.SplitIntoLinesSingleTrailingCR (2034 of 2154) PASS: lldb-shell :: ScriptInterpreter/Python/python.test (2035 of 2154) PASS: lldb-api :: lang/c/array_types/TestArrayTypes.py (2036 of 2154) PASS: lldb-shell :: Heap/heap-cstr.test (2037 of 2154) PASS: lldb-api :: commands/expression/static-initializers/TestStaticInitializers.py (2038 of 2154) PASS: lldb-api :: lang/c/modules/TestCModules.py (2039 of 2154) PASS: lldb-api :: commands/frame/var-scope/TestFrameVariableScope.py (2040 of 2154) PASS: lldb-api :: functionalities/unwind/noreturn/module-end/TestNoReturnModuleEnd.py (2041 of 2154) PASS: lldb-api :: functionalities/thread/concurrent_events/TestConcurrentTwoBreakpointsOneSignal.py (2042 of 2154) PASS: lldb-unit :: Language/Highlighting/./HighlighterTests/HighlighterTest.ClangCursorPosInOtherToken (2043 of 2154) PASS: lldb-unit :: ScriptInterpreter/Python/./ScriptInterpreterPythonTests/PythonDataObjectsTest.TestTypeNameResolutionNoDot (2044 of 2154) PASS: lldb-api :: commands/expression/rdar44436068/Test128BitsInteger.py (2045 of 2154) PASS: lldb-api :: functionalities/lazy-loading/TestLazyLoading.py (2046 of 2154) PASS: lldb-api :: python_api/class_members/TestSBTypeClassMembers.py (2047 of 2154) PASS: lldb-shell :: SymbolFile/DWARF/debug_rnglists.s (2048 of 2154) PASS: lldb-api :: lang/objc/objc-static-method/TestObjCStaticMethod.py (2049 of 2154) PASS: lldb-shell :: SymbolFile/DWARF/debug-line-basic.s (2050 of 2154) PASS: lldb-unit :: Utility/./UtilityTests/StringListTest.InsertStringAtIndexMove (2051 of 2154) PASS: lldb-unit :: SymbolFile/NativePDB/./SymbolFileNativePDBTests/PDBFPOProgramToDWARFExpressionTests.SingleAssignmentRegisterRef (2052 of 2154) PASS: lldb-unit :: Interpreter/./InterpreterTests/OptionArgParserTest.toBoolean (2053 of 2154) PASS: lldb-api :: lang/objc/foundation/TestSymbolTable.py (2054 of 2154) UNSUPPORTED: lldb-api :: benchmarks/expression/TestRepeatedExprs.py (2055 of 2154) PASS: lldb-unit :: Target/./TargetTests/ModuleCacheTest.GetAndPut (2056 of 2154) PASS: lldb-api :: lang/cpp/char1632_t/TestChar1632T.py (2057 of 2154) PASS: lldb-unit :: Utility/./UtilityTests/SerializationRountripTest.SerializeDeserializeCStringArrayNullptr (2058 of 2154) PASS: lldb-unit :: Expression/./ExpressionTests/DiagnosticManagerTest.PutStringSeverities (2059 of 2154) PASS: lldb-shell :: BuildScript/script-args.test (2060 of 2154) PASS: lldb-unit :: Target/./TargetTests/MemoryRegionInfoTest.Formatv (2061 of 2154) PASS: lldb-api :: functionalities/data-formatter/synthupdate/TestSyntheticFilterRecompute.py (2062 of 2154) PASS: lldb-api :: types/TestDoubleTypes.py (2063 of 2154) PASS: lldb-unit :: Target/./TargetTests/MCBasedABI.MapRegisterName (2064 of 2154) PASS: lldb-shell :: Settings/TestDisassemblyFormat.test (2065 of 2154) PASS: lldb-api :: commands/add-dsym/uuid/TestAddDsymCommand.py (2066 of 2154) PASS: lldb-unit :: Utility/./UtilityTests/XcodeSDKTest.GetSDKTypeForTriple (2067 of 2154) PASS: lldb-unit :: Breakpoint/./LLDBBreakpointTests/BreakpointIDTest.StringIsBreakpointName (2068 of 2154) PASS: lldb-api :: commands/expression/persistent_types/TestNestedPersistentTypes.py (2069 of 2154) PASS: lldb-unit :: Process/gdb-remote/./ProcessGdbRemoteTests/GDBRemoteCommunicationClientTest.GetMemoryRegionInfoInvalidResponse (2070 of 2154) PASS: lldb-shell :: ObjectFile/ELF/PT_LOAD-empty.yaml (2071 of 2154) PASS: lldb-api :: tools/lldb-server/TestGdbRemoteExitCode.py (2072 of 2154) PASS: lldb-unit :: Utility/./UtilityTests/ScalarTest.Scalar_512 (2073 of 2154) PASS: lldb-unit :: Utility/./UtilityTests/Flags.AnySet (2074 of 2154) PASS: lldb-api :: functionalities/multiword-commands/TestMultiWordCommands.py (2075 of 2154) UNSUPPORTED: lldb-shell :: SymbolFile/PDB/variables-locations.test (2076 of 2154) PASS: lldb-api :: commands/command/script/import/rdar-12586188/TestRdar12586188.py (2077 of 2154) UNSUPPORTED: lldb-api :: tools/lldb-server/libraries-svr4/TestGdbRemoteLibrariesSvr4Support.py (2078 of 2154) PASS: lldb-unit :: Host/./HostTests/File.GetWaitableHandleFileno (2079 of 2154) PASS: lldb-unit :: Utility/./UtilityTests/StringListTest.CopyListSingle (2080 of 2154) PASS: lldb-unit :: Process/minidump/./LLDBMinidumpTests/MinidumpParserTest.FindMemoryRangeWithFullMemoryMinidump (2081 of 2154) PASS: lldb-unit :: Language/Highlighting/./HighlighterTests/HighlighterTest.ClangTrailingBackslashBeforeNewline (2082 of 2154) PASS: lldb-api :: lang/objc/objc-dyn-sbtype/TestObjCDynamicSBType.py (2083 of 2154) PASS: lldb-unit :: Expression/./ExpressionTests/CppModuleConfigurationTest.MissingLibCpp (2084 of 2154) PASS: lldb-unit :: UnwindAssembly/x86/./UnwindAssemblyx86Tests/Testx86AssemblyInspectionEngine.TestCALLNextInsn (2085 of 2154) PASS: lldb-api :: functionalities/breakpoint/breakpoint_command/TestBreakpointCommand.py (2086 of 2154) PASS: lldb-unit :: UnwindAssembly/x86/./UnwindAssemblyx86Tests/Testx86AssemblyInspectionEngine.TestSimple32bitFrameFunction (2087 of 2154) PASS: lldb-unit :: Language/CLanguages/./LanguageCLanguagesTests/CLanguages.LookupCLanguagesByLanguageType (2088 of 2154) PASS: lldb-api :: lang/c/local_variables/TestLocalVariables.py (2089 of 2154) PASS: lldb-unit :: ScriptInterpreter/Python/./ScriptInterpreterPythonTests/PythonDataObjectsTest.TestExtractingUInt64ThroughStructuredData (2090 of 2154) PASS: lldb-api :: commands/expression/vector_of_enums/TestVectorOfEnums.py (2091 of 2154) PASS: lldb-api :: functionalities/data-formatter/ptr_ref_typedef/TestPtrRef2Typedef.py (2092 of 2154) PASS: lldb-api :: tools/lldb-vscode/module/TestVSCode_module.py (2093 of 2154) PASS: lldb-api :: macosx/simulator/TestSimulatorPlatform.py (2094 of 2154) PASS: lldb-api :: functionalities/data-formatter/pyobjsynthprovider/TestPyObjSynthProvider.py (2095 of 2154) PASS: lldb-unit :: Language/Highlighting/./HighlighterTests/HighlighterTest.ClangCursorPosEndOfLine (2096 of 2154) PASS: lldb-unit :: Process/gdb-remote/./ProcessGdbRemoteTests/GDBRemoteCommunicationServerTest.SendErrorResponse_ErrorList (2097 of 2154) PASS: lldb-api :: functionalities/inferior-changed/TestInferiorChanged.py (2098 of 2154) PASS: lldb-api :: functionalities/inferior-crashing/recursive-inferior/TestRecursiveInferior.py (2099 of 2154) PASS: lldb-unit :: DataFormatter/./LLDBFormatterTests/TypeMatcherTests.GetMatchStringExactName (2100 of 2154) PASS: lldb-api :: functionalities/thread/step_out/TestThreadStepOut.py (2101 of 2154) PASS: lldb-unit :: Utility/./UtilityTests/RangeVector.CombineConsecutiveRanges (2102 of 2154) PASS: lldb-api :: functionalities/data-formatter/data-formatter-proper-plurals/TestFormattersOneIsSingular.py (2103 of 2154) PASS: lldb-api :: commands/watchpoints/watchpoint_on_vectors/TestValueOfVectorVariable.py (2104 of 2154) PASS: lldb-api :: functionalities/data-formatter/data-formatter-objc/TestDataFormatterObjCNSDate.py (2105 of 2154) PASS: lldb-shell :: ObjectFile/MachO/subsections.yaml (2106 of 2154) PASS: lldb-shell :: Breakpoint/implicit_const_form_support.test (2107 of 2154) PASS: lldb-shell :: SymbolFile/Breakpad/symtab-macho.test (2108 of 2154) PASS: lldb-unit :: Utility/./UtilityTests/VASprintfTest.BufferResize (2109 of 2154) PASS: lldb-shell :: SymbolFile/DWARF/debug_aranges-empty-section.s (2110 of 2154) PASS: lldb-api :: lang/objc/objc-class-method/TestObjCClassMethod.py (2111 of 2154) PASS: lldb-shell :: Unwind/trap_frame_sym_ctx.test (2112 of 2154) PASS: lldb-api :: tools/lldb-vscode/breakpoint/TestVSCode_setFunctionBreakpoints.py (2113 of 2154) PASS: lldb-shell :: ObjectFile/ELF/section-addresses.yaml (2114 of 2154) PASS: lldb-api :: functionalities/data-formatter/boolreference/TestFormattersBoolRefPtr.py (2115 of 2154) PASS: lldb-unit :: Process/minidump/./LLDBMinidumpTests/MinidumpParserTest.GetLinuxProcStatus (2116 of 2154) PASS: lldb-unit :: Symbol/./SymbolTests/TestTypeSystemClang.TestDeletingImplicitCopyCstrDueToMoveCStr (2117 of 2154) PASS: lldb-unit :: UnwindAssembly/x86/./UnwindAssemblyx86Tests/Testx86AssemblyInspectionEngine.TestStackRealign32BitDisp_x86_64 (2118 of 2154) PASS: lldb-api :: functionalities/dead-strip/TestDeadStrip.py (2119 of 2154) PASS: lldb-unit :: Utility/./UtilityTests/OptionsWithRawTest.ArgsButNoLeadingDash (2120 of 2154) PASS: lldb-api :: lang/objc/objc-baseclass-sbtype/TestObjCBaseClassSBType.py (2121 of 2154) PASS: lldb-api :: commands/expression/argument_passing_restrictions/TestArgumentPassingRestrictions.py (2122 of 2154) PASS: lldb-api :: functionalities/data-formatter/summary-string-onfail/Test-rdar-9974002.py (2123 of 2154) PASS: lldb-unit :: Utility/./UtilityTests/OptionsWithRawTest.TerminatedQuote (2124 of 2154) PASS: lldb-api :: commands/expression/unicode-in-variable/TestUnicodeInVariable.py (2125 of 2154) PASS: lldb-api :: tools/lldb-vscode/step/TestVSCode_step.py (2126 of 2154) PASS: lldb-api :: functionalities/data-formatter/data-formatter-objc/TestDataFormatterObjCNSData.py (2127 of 2154) PASS: lldb-api :: lang/objc/objc++/TestObjCXX.py (2128 of 2154) UNSUPPORTED: lldb-shell :: SymbolFile/PDB/expressions.test (2129 of 2154) UNSUPPORTED: lldb-shell :: Expr/TestIRMemoryMapWindows.test (2130 of 2154) PASS: lldb-unit :: Language/Highlighting/./HighlighterTests/HighlighterTest.Colons (2131 of 2154) PASS: lldb-api :: lang/cpp/operator-overload/TestOperatorOverload.py (2132 of 2154) PASS: lldb-api :: lang/cpp/template-function/TestTemplateFunctions.py (2133 of 2154) PASS: lldb-unit :: SymbolFile/NativePDB/./SymbolFileNativePDBTests/PDBFPOProgramToDWARFExpressionTests.MissingTargetRegister (2134 of 2154) PASS: lldb-shell :: Reproducer/TestHomeDir.test (2135 of 2154) PASS: lldb-unit :: Symbol/./SymbolTests/TestTypeSystemClang.TestGetEnumIntegerTypeUnexpectedType (2136 of 2154) UNSUPPORTED: lldb-shell :: Register/x86-gp-write.test (2137 of 2154) PASS: lldb-shell :: ObjectFile/Breakpad/breakpad-identification.test (2138 of 2154) PASS: lldb-api :: functionalities/data-formatter/data-formatter-objc/TestDataFormatterObjCNSBundle.py (2139 of 2154) PASS: lldb-unit :: Expression/./ExpressionTests/ClangHostTest.ComputeClangResourceDirectory (2140 of 2154) UNSUPPORTED: lldb-shell :: Register/x86-zmm-write.test (2141 of 2154) PASS: lldb-api :: lang/cpp/frame-var-anon-unions/TestFrameVariableAnonymousUnions.py (2142 of 2154) PASS: lldb-api :: commands/expression/import-std-module/list-dbg-info-content/TestDbgInfoContentListFromStdModule.py (2143 of 2154) UNSUPPORTED: lldb-api :: functionalities/data-formatter/data-formatter-stl/libstdcpp/map/TestDataFormatterStdMap.py (2144 of 2154) PASS: lldb-api :: functionalities/exec/TestExec.py (2145 of 2154) PASS: lldb-api :: lang/cpp/dynamic-value/TestDynamicValue.py (2146 of 2154) PASS: lldb-unit :: UnwindAssembly/x86/./UnwindAssemblyx86Tests/Testx86AssemblyInspectionEngine.TestStackRealignMSVC_i386 (2147 of 2154) PASS: lldb-api :: functionalities/mtc/simple/TestMTCSimple.py (2148 of 2154) PASS: lldb-unit :: Thread/./ThreadTests/ThreadTest.GetPrivateStopInfo (2149 of 2154) PASS: lldb-api :: functionalities/thread/concurrent_events/TestConcurrentWatchpointWithDelayWatchpointThreads.py (2150 of 2154) PASS: lldb-api :: lang/c/shared_lib/TestSharedLib.py (2151 of 2154) PASS: lldb-api :: lang/cpp/template-specialization-type/TestTemplateSpecializationType.py (2152 of 2154) PASS: lldb-unit :: Host/./HostTests/MainLoopTest.UnmonitoredSignal (2153 of 2154) PASS: lldb-api :: commands/expression/import-std-module/forward_list/TestForwardListFromStdModule.py (2154 of 2154) Slowest Tests: -------------------------------------------------------------------------- 190.12s: lldb-api :: macosx/simulator/TestSimulatorPlatform.py 115.54s: lldb-api :: functionalities/gdb_remote_client/TestGDBRemoteClient.py 100.72s: lldb-api :: tools/lldb-server/TestLldbGdbServer.py 60.02s: lldb-api :: lang/objc/hidden-ivars/TestHiddenIvars.py 56.08s: lldb-api :: lang/objc/foundation/TestObjCMethods.py 52.45s: lldb-api :: lang/objc/foundation/TestFoundationDisassembly.py 51.82s: lldb-api :: lang/objc/exceptions/TestObjCExceptions.py 49.58s: lldb-api :: functionalities/inferior-crashing/recursive-inferior/TestRecursiveInferior.py 49.53s: lldb-api :: types/TestLongTypesExpr.py 49.27s: lldb-api :: api/multithreaded/TestMultithreaded.py 42.99s: lldb-api :: lang/cpp/namespace/TestNamespaceLookup.py 42.27s: lldb-api :: functionalities/inferior-changed/TestInferiorChanged.py 41.21s: lldb-api :: lang/objc/objc-dynamic-value/TestObjCDynamicValue.py 38.12s: lldb-api :: lang/objc/objc-new-syntax/TestObjCNewSyntaxLiteral.py 37.76s: lldb-api :: functionalities/completion/TestCompletion.py 37.16s: lldb-api :: functionalities/data-formatter/pyobjsynthprovider/TestPyObjSynthProvider.py 35.93s: lldb-api :: python_api/target/TestTargetAPI.py 35.89s: lldb-api :: functionalities/gdb_remote_client/TestTargetXMLArch.py 33.08s: lldb-api :: lang/objc/objc-new-syntax/TestObjCNewSyntaxArray.py 32.74s: lldb-shell :: SymbolFile/NativePDB/global-classes.cpp

Hide Details

Tests Times: -------------------------------------------------------------------------- [ Range ] :: [ Percentage ] :: [ Count ] -------------------------------------------------------------------------- [190s,200s) :: [ ] :: [ 1/2154] [180s,190s) :: [ ] :: [ 0/2154] [170s,180s) :: [ ] :: [ 0/2154] [160s,170s) :: [ ] :: [ 0/2154] [150s,160s) :: [ ] :: [ 0/2154] [140s,150s) :: [ ] :: [ 0/2154] [130s,140s) :: [ ] :: [ 0/2154] [120s,130s) :: [ ] :: [ 1/2154] [110s,120s) :: [ ] :: [ 0/2154] [100s,110s) :: [ ] :: [ 1/2154] [ 90s,100s) :: [ ] :: [ 0/2154] [ 80s, 90s) :: [ ] :: [ 0/2154] [ 70s, 80s) :: [ ] :: [ 0/2154] [ 60s, 70s) :: [ ] :: [ 1/2154] [ 50s, 60s) :: [ ] :: [ 6/2154] [ 40s, 50s) :: [ ] :: [ 4/2154] [ 30s, 40s) :: [ ] :: [ 12/2154] [ 20s, 30s) :: [ ] :: [ 28/2154] [ 10s, 20s) :: [** ] :: [ 152/2154] [ 0s, 10s) :: [************************************ ] :: [1948/2154] -------------------------------------------------------------------------- ******************** Failed Tests (2): lldb-api :: functionalities/gdb_remote_client/TestGDBRemoteClient.py lldb-api :: commands/target/stop-hooks/TestStopHookScripted.py

Hide Details

Hide Details

Testing Time: 1638.41s Unsupported : 153 Passed : 1993 Expectedly Failed: 6 Failed : 2 FAILED: tools/lldb/test/CMakeFiles/check-lldb-lit cd /Users/buildslave/jenkins/workspace/lldb-cmake/lldb-build/tools/lldb/test && /usr/local/Frameworks/Python.framework/Versions/3.7/bin/python3.7 /Users/buildslave/jenkins/workspace/lldb-cmake/lldb-build/./bin/llvm-lit -v --time-tests --shuffle --xunit-xml-output=/Users/buildslave/jenkins/workspace/lldb-cmake/test/results.xml -v -j 4 /Users/buildslave/jenkins/workspace/lldb-cmake/lldb-build/tools/lldb/test ninja: build stopped: subcommand failed. Command failed: Command '['/usr/bin/env', 'TERM=vt100', '/usr/local/bin/ninja', '-v', 'check-lldb']' returned non-zero exit status 1 Command: ['/usr/bin/env', 'TERM=vt100', '/usr/local/bin/ninja', '-v', 'check-lldb'] [Pipeline] } [Pipeline] // timeout [Pipeline] } [Pipeline] // stage [Pipeline] stage [Pipeline] { (Declarative: Post Actions) [Pipeline] scanForIssues [Clang (LLVM based)] Sleeping for 5 seconds due to JENKINS-32191... [Clang (LLVM based)] Parsing console log (workspace: '/Users/buildslave/jenkins/workspace/lldb-cmake') [Clang (LLVM based)] Successfully parsed console log [Clang (LLVM based)] -> found 8 issues (skipped 12 duplicates) [Clang (LLVM based)] Post processing issues on 'green-dragon-10' with source code encoding 'UTF-8' [Clang (LLVM based)] Creating SCM blamer to obtain author and commit information for affected files [Clang (LLVM based)] Creating SCM miner to obtain statistics for affected repository files [Clang (LLVM based)] Resolving file names for all issues in source directory '/Users/buildslave/jenkins/workspace/lldb-cmake' [Clang (LLVM based)] -> resolved paths in source directory (6 found, 0 not found) [Clang (LLVM based)] Resolving module names from module definitions (build.xml, pom.xml, or Manifest.mf files) [Clang (LLVM based)] -> resolved module names for 8 issues [Clang (LLVM based)] Resolving package names (or namespaces) by parsing the affected files [Clang (LLVM based)] -> resolved package names of 6 affected files [Clang (LLVM based)] No filter has been set, publishing all 8 issues [Clang (LLVM based)] Creating fingerprints for all affected code blocks to track issues over different builds [Clang (LLVM based)] -> created fingerprints for 8 issues (skipped 0 issues) [Clang (LLVM based)] Copying affected files to Jenkins' build folder '/Users/Shared/Jenkins/Home/jobs/lldb-cmake/builds/23997/files-with-issues' [Clang (LLVM based)] -> 4 copied, 2 not in workspace, 0 not-found, 0 with I/O error [Pipeline] junit Recording test results [Pipeline] } [Pipeline] // stage [Pipeline] } [Pipeline] // withEnv [Pipeline] } [Pipeline] // node [Pipeline] End of Pipeline ERROR: script returned exit code 1 Finished: FAILURE