FailedConsole Output

Skipping 9,098 KB.. Full Log
s.py (739 of 2154)
PASS: lldb-api :: functionalities/postmortem/elf-core/gcore/TestGCore.py (740 of 2154)
PASS: lldb-unit :: Utility/./UtilityTests/DataExtractorTest.GetBitfield (741 of 2154)
PASS: lldb-api :: commands/expression/import-std-module/weak_ptr-dbg-info-content/TestDbgInfoContentWeakPtrFromStdModule.py (742 of 2154)
PASS: lldb-api :: types/TestIntegerType.py (743 of 2154)
PASS: lldb-unit :: Utility/./UtilityTests/StreamTeeTest.GetStreamAtIndexOutOfBoundsEmpty (744 of 2154)
PASS: lldb-unit :: Utility/./UtilityTests/StreamTest.PutNHex8 (745 of 2154)
PASS: lldb-unit :: Utility/./UtilityTests/StringExtractorTest.GetHexU8_Underflow2 (746 of 2154)
PASS: lldb-unit :: ScriptInterpreter/Python/./ScriptInterpreterPythonTests/PythonDataObjectsTest.TestGlobalNameResolutionWithDot (747 of 2154)
PASS: lldb-unit :: Core/./LLDBCoreTests/CommunicationTest.SynchronizeWhileClosing (748 of 2154)
PASS: lldb-unit :: Utility/./UtilityTests/StreamTeeTest.Write (749 of 2154)
PASS: lldb-api :: commands/expression/context-object-objc/TestContextObjectObjc.py (750 of 2154)
PASS: lldb-api :: lang/cpp/dynamic-value/TestDynamicValue.py (751 of 2154)
PASS: lldb-unit :: Process/minidump/./LLDBMinidumpTests/MinidumpParserTest.MinidumpDuplicateModuleMappedFirst (752 of 2154)
PASS: lldb-api :: functionalities/thread/concurrent_events/TestConcurrentCrashWithWatchpointBreakpointSignal.py (753 of 2154)
PASS: lldb-api :: commands/quit/TestQuit.py (754 of 2154)
PASS: lldb-shell :: Minidump/disassemble-no-module.yaml (755 of 2154)
PASS: lldb-shell :: ObjectFile/MachO/lc_build_version_notools.yaml (756 of 2154)
PASS: lldb-unit :: Process/gdb-remote/./ProcessGdbRemoteTests/GDBRemoteCommunicationClientTest.GetMemoryRegionInfo (757 of 2154)
PASS: lldb-unit :: Expression/./ExpressionTests/DiagnosticManagerTest.AddDiagnostic (758 of 2154)
PASS: lldb-api :: commands/command/invalid-args/TestInvalidArgsCommand.py (759 of 2154)
PASS: lldb-unit :: UnwindAssembly/ARM64/./Arm64InstEmulationTests/TestArm64InstEmulation.TestCFARegisterTrackedAcrossJumps (760 of 2154)
PASS: lldb-shell :: Breakpoint/implicit_const_form_support.test (761 of 2154)
PASS: lldb-api :: lang/cpp/accelerator-table/TestCPPAccelerator.py (762 of 2154)
PASS: lldb-unit :: Utility/./UtilityTests/StreamTest.PutHex32ByteOrderBig (763 of 2154)
PASS: lldb-unit :: Utility/./UtilityTests/StringExtractorTest.GetHexBytesAvail_OddPair (764 of 2154)
UNSUPPORTED: lldb-api :: lang/cpp/function-template-parameter-pack/TestFunctionTemplateParameterPack.py (765 of 2154)
PASS: lldb-shell :: SymbolFile/DWARF/dwarf5_locations.s (766 of 2154)
PASS: lldb-unit :: Expression/./ExpressionTests/DiagnosticManagerTest.GetStringSeverityLabels (767 of 2154)
PASS: lldb-unit :: Utility/./UtilityTests/ScalarTest.SetValueFromCString (768 of 2154)
PASS: lldb-unit :: UnwindAssembly/x86/./UnwindAssemblyx86Tests/Testx86AssemblyInspectionEngine.TestPushEBX (769 of 2154)
PASS: lldb-unit :: Utility/./UtilityTests/RangeTest.SlideZero (770 of 2154)
UNSUPPORTED: lldb-api :: commands/register/register/intel_xtended_registers/TestMPXRegisters.py (771 of 2154)
PASS: lldb-api :: lang/objc/objc++/TestObjCXX.py (772 of 2154)
UNSUPPORTED: lldb-shell :: ScriptInterpreter/Lua/breakpoint_callback.test (773 of 2154)
PASS: lldb-unit :: Editline/./EditlineTests/EditlineTestFixture.EditlineReceivesMultiLineText (774 of 2154)
PASS: lldb-unit :: ScriptInterpreter/Python/./ScriptInterpreterPythonTests/PythonDataObjectsTest.TestPythonByteArray (775 of 2154)
PASS: lldb-unit :: Utility/./UtilityTests/StreamTest.PutRawBytesToMixedEndian (776 of 2154)
PASS: lldb-api :: lang/c/blocks/TestBlocks.py (777 of 2154)
PASS: lldb-shell :: Reproducer/TestMultipleTargets.test (778 of 2154)
UNSUPPORTED: lldb-api :: benchmarks/stepping/TestSteppingSpeed.py (779 of 2154)
PASS: lldb-api :: lang/objc/objc-checker/TestObjCCheckers.py (780 of 2154)
PASS: lldb-unit :: Utility/./UtilityTests/StringExtractorTest.GetHexU8_InvalidHex (781 of 2154)
PASS: lldb-unit :: Utility/./UtilityTests/AnsiTerminal.Twice (782 of 2154)
PASS: lldb-unit :: Utility/./UtilityTests/PassiveReplayTest.InstrumentedFoo (783 of 2154)
PASS: lldb-api :: functionalities/dlopen_other_executable/TestDlopenOtherExecutable.py (784 of 2154)
PASS: lldb-unit :: Process/minidump/./LLDBMinidumpTests/MinidumpParserTest.GetMemoryRegionInfoLinuxMaps (785 of 2154)
PASS: lldb-unit :: DataFormatter/./LLDBFormatterTests/TypeMatcherTests.ExactName (786 of 2154)
PASS: lldb-unit :: Utility/./UtilityTests/DataExtractorTest.GetMaxS64 (787 of 2154)
PASS: lldb-unit :: UnwindAssembly/x86/./UnwindAssemblyx86Tests/Testx86AssemblyInspectionEngine.TestAddESP (788 of 2154)
UNSUPPORTED: lldb-shell :: Register/x86-64-xmm16-write.test (789 of 2154)
PASS: lldb-unit :: Process/gdb-remote/./ProcessGdbRemoteTests/GDBRemoteCommunicationClientTest.SendStartTracePacket (790 of 2154)
PASS: lldb-unit :: Platform/./LLDBPlatformTests/PlatformAppleSimulatorTest.TestSimHasSimEnvionament (791 of 2154)
PASS: lldb-unit :: UnwindAssembly/x86/./UnwindAssemblyx86Tests/Testx86AssemblyInspectionEngine.TestPopR13 (792 of 2154)
PASS: lldb-api :: functionalities/gdb_remote_client/TestRestartBug.py (793 of 2154)
PASS: lldb-unit :: Utility/./UtilityTests/DataExtractorTest.GetMaxU64 (794 of 2154)
PASS: lldb-unit :: Utility/./UtilityTests/StreamTeeTest.SetStreamAtIndexOutOfBounds (795 of 2154)
PASS: lldb-unit :: Expression/./ExpressionTests/DiagnosticManagerTest.GetStringBasic (796 of 2154)
PASS: lldb-api :: types/TestCharType.py (797 of 2154)
PASS: lldb-unit :: ObjectFile/MachO/./ObjectFileMachOTests/ObjectFileMachOTest.ModuleFromSharedCacheInfo (798 of 2154)
PASS: lldb-api :: functionalities/data-formatter/type_summary_list_script/TestTypeSummaryListScript.py (799 of 2154)
PASS: lldb-unit :: Utility/./UtilityTests/UriParserTest.TypicalPortPathIPv4 (800 of 2154)
UNSUPPORTED: lldb-api :: tools/lldb-server/platform-process-connect/TestPlatformProcessConnect.py (801 of 2154)
PASS: lldb-api :: functionalities/thread/concurrent_events/TestConcurrentWatchpointWithDelayWatchpointThreads.py (802 of 2154)
PASS: lldb-unit :: Utility/./UtilityTests/RegularExpression.Match (803 of 2154)
PASS: lldb-api :: functionalities/data-formatter/builtin-formats/TestBuiltinFormats.py (804 of 2154)
PASS: lldb-unit :: Utility/./UtilityTests/SerializationRountripTest.SerializeDeserializeCStringArrayNullptr (805 of 2154)
PASS: lldb-unit :: Utility/./UtilityTests/LogTest.LLDB_LOG_nullptr (806 of 2154)
PASS: lldb-unit :: Utility/./UtilityTests/FileSpecTest.IsRelative (807 of 2154)
UNSUPPORTED: lldb-api :: functionalities/thread/multi_break/TestMultipleBreakpoints.py (808 of 2154)
PASS: lldb-api :: lang/objc/foundation/TestObjectDescriptionAPI.py (809 of 2154)
PASS: lldb-api :: functionalities/data-formatter/data-formatter-caching/TestDataFormatterCaching.py (810 of 2154)
PASS: lldb-api :: functionalities/data-formatter/data-formatter-objc/TestDataFormatterObjNSException.py (811 of 2154)
PASS: lldb-api :: functionalities/gdb_remote_client/TestStopPCs.py (812 of 2154)
PASS: lldb-shell :: Driver/TestCommands.test (813 of 2154)
PASS: lldb-api :: functionalities/data-formatter/data-formatter-proper-plurals/TestFormattersOneIsSingular.py (814 of 2154)
PASS: lldb-api :: lang/c/global_variables/TestGlobalVariables.py (815 of 2154)
PASS: lldb-unit :: Utility/./UtilityTests/StreamTest.PutHex64ByteOrderLittle (816 of 2154)
PASS: lldb-api :: commands/expression/import-std-module/forward_list/TestForwardListFromStdModule.py (817 of 2154)
PASS: lldb-unit :: Utility/./UtilityTests/DataExtractorTest.GetSLEB128_bit63 (818 of 2154)
UNSUPPORTED: lldb-api :: linux/thread/create_during_instruction_step/TestCreateDuringInstructionStep.py (819 of 2154)
PASS: lldb-unit :: Symbol/./SymbolTests/TestTypeSystemClang.TestGetTypeClassNested (820 of 2154)
PASS: lldb-unit :: Symbol/./SymbolTests/TestClangASTImporter.CopyTypeTagDecl (821 of 2154)
UNSUPPORTED: lldb-api :: tools/lldb-server/thread-name/TestGdbRemoteThreadName.py (822 of 2154)
PASS: lldb-shell :: ObjectFile/ELF/minidebuginfo-corrupt-xz.yaml (823 of 2154)
PASS: lldb-api :: lang/objcxx/class-name-clash/TestNameClash.py (824 of 2154)
PASS: lldb-api :: functionalities/data-formatter/data-formatter-disabling/TestDataFormatterDisabling.py (825 of 2154)
PASS: lldb-unit :: ObjectFile/ELF/./ObjectFileELFTests/ObjectFileELFTest.SectionsResolveConsistently (826 of 2154)
PASS: lldb-unit :: Utility/./UtilityTests/StreamTest.AddressPrefixAndSuffix (827 of 2154)
PASS: lldb-unit :: Expression/./ExpressionTests/DiagnosticManagerTest.PutString (828 of 2154)
PASS: lldb-shell :: Quit/TestQuitExitCode0.test (829 of 2154)
PASS: lldb-unit :: ScriptInterpreter/Python/./ScriptInterpreterPythonTests/PythonDataObjectsTest.TestPythonTupleSize (830 of 2154)
UNSUPPORTED: lldb-shell :: SymbolFile/PDB/vbases.test (831 of 2154)
PASS: lldb-api :: types/TestLongTypes.py (832 of 2154)
PASS: lldb-shell :: Settings/TestLineMarkerColor.test (833 of 2154)
PASS: lldb-api :: functionalities/thread_plan/TestThreadPlanCommands.py (834 of 2154)
PASS: lldb-unit :: Utility/./UtilityTests/BinaryStreamTest.PutSLEB128EightBytes (835 of 2154)
PASS: lldb-unit :: Language/Highlighting/./HighlighterTests/HighlighterTest.ClangCursorPosAfterOtherToken (836 of 2154)
PASS: lldb-unit :: Utility/./UtilityTests/CompletionRequest.TryCompleteCurrentArgGood (837 of 2154)
PASS: lldb-api :: commands/platform/basic/TestPlatformPython.py (838 of 2154)
PASS: lldb-api :: python_api/watchpoint/watchlocation/TestTargetWatchAddress.py (839 of 2154)
PASS: lldb-shell :: SymbolFile/NativePDB/tag-types.cpp (840 of 2154)
PASS: lldb-unit :: Utility/./UtilityTests/StringExtractorTest.GetHexU8_Extra_NoEof (841 of 2154)
PASS: lldb-api :: python_api/frame/inlines/TestInlinedFrame.py (842 of 2154)
PASS: lldb-unit :: Utility/./UtilityTests/VMRange.Ordering (843 of 2154)
PASS: lldb-unit :: ScriptInterpreter/Python/./ScriptInterpreterPythonTests/PythonDataObjectsTest.TestDictionaryResolutionWithDot (844 of 2154)
PASS: lldb-api :: functionalities/tail_call_frames/cross_dso/TestCrossDSOTailCalls.py (845 of 2154)
PASS: lldb-unit :: UnwindAssembly/x86/./UnwindAssemblyx86Tests/Testx86AssemblyInspectionEngine.TestCALLNextInsn (846 of 2154)
PASS: lldb-api :: lang/mixed/TestMixedLanguages.py (847 of 2154)
PASS: lldb-api :: commands/watchpoints/watchpoint_commands/TestWatchpointCommands.py (848 of 2154)
PASS: lldb-api :: functionalities/plugins/command_plugin/TestPluginCommands.py (849 of 2154)
PASS: lldb-api :: commands/add-dsym/uuid/TestAddDsymCommand.py (850 of 2154)
PASS: lldb-api :: commands/watchpoints/watchpoint_set_command/TestWatchLocationWithWatchSet.py (851 of 2154)
PASS: lldb-unit :: SymbolFile/NativePDB/./SymbolFileNativePDBTests/PDBFPOProgramToDWARFExpressionTests.MissingTargetRegister (852 of 2154)
PASS: lldb-unit :: Expression/./ExpressionTests/ClangExpressionDeclMapTest.TestPersistentDeclLookup (853 of 2154)
PASS: lldb-unit :: Expression/./ExpressionTests/DiagnosticManagerTest.GetStringNoDiags (854 of 2154)
PASS: lldb-unit :: Core/./LLDBCoreTests/UniqueCStringMap.NoDefaultConstructor (855 of 2154)
PASS: lldb-shell :: Settings/TestDisableColor.test (856 of 2154)
PASS: lldb-api :: commands/version/TestVersion.py (857 of 2154)
PASS: lldb-api :: commands/expression/formatters/TestFormatters.py (858 of 2154)
PASS: lldb-shell :: SymbolFile/DWARF/dwarf5-atomic.s (859 of 2154)
PASS: lldb-api :: functionalities/thread/concurrent_events/TestConcurrentDelaySignalWatch.py (860 of 2154)
PASS: lldb-api :: commands/expression/entry-bp/TestExprEntryBP.py (861 of 2154)
PASS: lldb-unit :: Utility/./UtilityTests/VMRange.Comparison (862 of 2154)
UNSUPPORTED: lldb-shell :: Register/x86-64-zmm-write.test (863 of 2154)
PASS: lldb-shell :: SymbolFile/DWARF/find-method.cpp (864 of 2154)
PASS: lldb-api :: commands/expression/import-std-module/empty-module/TestEmptyStdModule.py (865 of 2154)
PASS: lldb-api :: lang/c/complex_int/TestComplexInt.py (866 of 2154)
PASS: lldb-unit :: Symbol/./SymbolTests/TestClangASTImporter.ImportInvalidType (867 of 2154)
PASS: lldb-unit :: SymbolFile/NativePDB/./SymbolFileNativePDBTests/PDBFPOProgramToDWARFExpressionTests.MultipleIndependentAssignments (868 of 2154)
PASS: lldb-unit :: Utility/./UtilityTests/StreamTest.PutCString (869 of 2154)
PASS: lldb-unit :: Utility/./UtilityTests/GeneratorTest.GetOrCreate (870 of 2154)
PASS: lldb-unit :: SymbolFile/NativePDB/./SymbolFileNativePDBTests/PDBFPOProgramToDWARFExpressionTests.InvalidAssignmentSingle (871 of 2154)
UNSUPPORTED: lldb-shell :: Register/x86-gp-read.test (872 of 2154)
PASS: lldb-api :: commands/expression/fixits/TestFixIts.py (873 of 2154)
PASS: lldb-api :: lang/objc/foundation/TestRuntimeTypes.py (874 of 2154)
PASS: lldb-unit :: DataFormatter/./LLDBFormatterTests/TypeMatcherTests.CreatedBySameMatchStringExactNamePrefixes (875 of 2154)
PASS: lldb-unit :: DataFormatter/./LLDBFormatterTests/StringPrinterTests.SwiftUTF8 (876 of 2154)
PASS: lldb-shell :: ObjectFile/wasm/unified-debug-sections.yaml (877 of 2154)
PASS: lldb-unit :: ObjectFile/Breakpad/./ObjectFileBreakpadTests/FuncRecord.parse (878 of 2154)
UNSUPPORTED: lldb-api :: commands/register/register/intel_xtended_registers/mpx_bound_violation/TestBoundViolation.py (879 of 2154)
PASS: lldb-api :: tools/lldb-server/TestGdbRemote_vCont.py (880 of 2154)
PASS: lldb-api :: commands/expression/cast_int_to_anonymous_enum/TestCastIntToAnonymousEnum.py (881 of 2154)
PASS: lldb-unit :: Utility/./UtilityTests/ArgsTest.ReplaceArgumentAtIndexFarOutOfRange (882 of 2154)
PASS: lldb-api :: lang/cpp/virtual-overload/TestVirtualOverload.py (883 of 2154)
PASS: lldb-shell :: Breakpoint/debug_rnglistx_rlex.test (884 of 2154)
PASS: lldb-unit :: Host/./HostTests/MainLoopTest.Signal (885 of 2154)
PASS: lldb-unit :: Process/gdb-remote/./ProcessGdbRemoteTests/GDBRemoteCommunicationClientTest.SendSignalsToIgnore (886 of 2154)
PASS: lldb-unit :: Signals/./SignalsTests/UnixSignalsTest.VersionChange (887 of 2154)
PASS: lldb-shell :: SymbolFile/DWARF/dir-separator-no-comp-dir-relative-name.s (888 of 2154)
PASS: lldb-shell :: Heap/heap-cstr.test (889 of 2154)
PASS: lldb-shell :: ObjectFile/ELF/PT_LOAD-overlap-PT_INTERP.yaml (890 of 2154)
PASS: lldb-api :: functionalities/data-formatter/data-formatter-stl/libcxx/set/TestDataFormatterLibcxxSet.py (891 of 2154)
PASS: lldb-api :: commands/breakpoint/command/list/TestBreakpointCommandList.py (892 of 2154)
PASS: lldb-unit :: Symbol/./SymbolTests/TestTypeSystemClang.TestGetTypeClassDeclType (893 of 2154)
PASS: lldb-unit :: Expression/./ExpressionTests/CppModuleConfigurationTest.AmbiguousCLib (894 of 2154)
PASS: lldb-unit :: debugserver/./debugserverTests/RNBSocket.LoopBackConnectIPv4 (895 of 2154)
PASS: lldb-unit :: Utility/./UtilityTests/Flags.Clear (896 of 2154)
PASS: lldb-unit :: Language/CLanguages/./LanguageCLanguagesTests/CLanguages.LookupCLanguagesByLanguageType (897 of 2154)
PASS: lldb-unit :: Utility/./UtilityTests/DataExtractorTest.GetULEB128_bit63 (898 of 2154)
PASS: lldb-unit :: Utility/./UtilityTests/RangeTest.ContainsAddr (899 of 2154)
PASS: lldb-shell :: Settings/TestModuleCacheSanity.test (900 of 2154)
PASS: lldb-unit :: Signals/./SignalsTests/UnixSignalsTest.GetFilteredSignals (901 of 2154)
PASS: lldb-unit :: Utility/./UtilityTests/BinaryStreamTest.PutSLEB128FourBytes (902 of 2154)
PASS: lldb-api :: functionalities/thread/concurrent_events/TestConcurrentCrashWithBreak.py (903 of 2154)
PASS: lldb-unit :: Core/./LLDBCoreTests/ModuleSpecTest.TestMachOFile (904 of 2154)
PASS: lldb-api :: tools/lldb-server/TestAppleSimulatorOSType.py (905 of 2154)
PASS: lldb-api :: commands/command/script/TestCommandScript.py (906 of 2154)
PASS: lldb-unit :: Host/./HostTests/FileSystemTest.EnumerateDirectory (907 of 2154)
PASS: lldb-api :: python_api/lldbutil/frame/TestFrameUtils.py (908 of 2154)
PASS: lldb-unit :: Process/minidump/./LLDBMinidumpTests/MinidumpParserTest.GetPid (909 of 2154)
PASS: lldb-shell :: SymbolFile/DWARF/dwp-debug-types.s (910 of 2154)
PASS: lldb-shell :: SymbolFile/NativePDB/break-by-line.cpp (911 of 2154)
PASS: lldb-unit :: Utility/./UtilityTests/FileSpecTest.GetPath (912 of 2154)
PASS: lldb-api :: api/multiple-debuggers/TestMultipleDebuggers.py (913 of 2154)
PASS: lldb-shell :: Driver/TestCore.test (914 of 2154)
PASS: lldb-unit :: Process/gdb-remote/./ProcessGdbRemoteTests/GDBRemoteCommunicationClientTest.GetModulesInfo (915 of 2154)
UNSUPPORTED: lldb-shell :: Breakpoint/case-insensitive.test (916 of 2154)
PASS: lldb-unit :: Utility/./UtilityTests/RecordReplayTest.InstrumentedBarPtr (917 of 2154)
PASS: lldb-api :: commands/expression/rdar42038760/TestScalarURem.py (918 of 2154)
PASS: lldb-unit :: SymbolFile/DWARF/./SymbolFileDWARFTests/XcodeSDKModuleTests.TestModuleGetXcodeSDK (919 of 2154)
PASS: lldb-shell :: ObjectFile/wasm/stripped-debug-sections.yaml (920 of 2154)
PASS: lldb-api :: commands/frame/diagnose/array/TestArray.py (921 of 2154)
PASS: lldb-unit :: ScriptInterpreter/Python/./ScriptInterpreterPythonTests/PythonDataObjectsTest.TestPythonBoolean (922 of 2154)
PASS: lldb-unit :: SymbolFile/NativePDB/./SymbolFileNativePDBTests/PDBFPOProgramToDWARFExpressionTests.UnresolvedDependentCyclicRegisterAssignmentReference (923 of 2154)
PASS: lldb-unit :: Utility/./UtilityTests/OptionsWithRawTest.EmptyArgsOnlySuffix (924 of 2154)
PASS: lldb-api :: functionalities/target_var/TestTargetVar.py (925 of 2154)
UNSUPPORTED: lldb-shell :: ScriptInterpreter/Lua/independent_state.test (926 of 2154)
PASS: lldb-unit :: Language/Highlighting/./HighlighterTests/HighlighterTest.ClangCursorPosInOtherToken (927 of 2154)
PASS: lldb-unit :: Utility/./UtilityTests/VMRange.ContainsRange (928 of 2154)
UNSUPPORTED: lldb-api :: tools/lldb-server/TestGdbRemoteAuxvSupport.py (929 of 2154)
PASS: lldb-unit :: Utility/./UtilityTests/Flags.GetBitSize (930 of 2154)
PASS: lldb-unit :: Utility/./UtilityTests/StringLexerTest.NextIf (931 of 2154)
PASS: lldb-unit :: Utility/./UtilityTests/RegisterValueTest.GetSet8 (932 of 2154)
PASS: lldb-unit :: UnwindAssembly/x86/./UnwindAssemblyx86Tests/Testx86AssemblyInspectionEngine.TestPushRBX (933 of 2154)
PASS: lldb-shell :: Driver/TestTarget.test (934 of 2154)
PASS: lldb-api :: lang/c/record_decl_in_expr/TestRecordDeclInExpr.py (935 of 2154)
PASS: lldb-unit :: ScriptInterpreter/Python/./ScriptInterpreterPythonTests/PythonDataObjectsTest.TestRun (936 of 2154)
PASS: lldb-unit :: UnwindAssembly/PPC64/./PPC64InstEmulationTests/TestPPC64InstEmulation.TestMediumFunction (937 of 2154)
PASS: lldb-unit :: Utility/./UtilityTests/StringListTest.InsertStringAtIndexOutOfBounds (938 of 2154)
PASS: lldb-unit :: SymbolFile/NativePDB/./SymbolFileNativePDBTests/PDBFPOProgramToDWARFExpressionTests.DependencyChain (939 of 2154)
PASS: lldb-api :: functionalities/testid/TestTestId.py (940 of 2154)
PASS: lldb-api :: functionalities/thread/concurrent_events/TestConcurrentSignalNWatchNBreak.py (941 of 2154)
PASS: lldb-shell :: ObjectFile/ELF/duplicate-section.yaml (942 of 2154)
PASS: lldb-unit :: Expression/./ExpressionTests/CppModuleConfigurationTest.Linux (943 of 2154)
PASS: lldb-api :: commands/statistics/basic/TestStats.py (944 of 2154)
PASS: lldb-unit :: Process/minidump/./LLDBMinidumpTests/MinidumpParserTest.MinidumpModuleOrder (945 of 2154)
PASS: lldb-api :: lang/c/unions/TestUnionMembers.py (946 of 2154)
PASS: lldb-api :: functionalities/breakpoint/move_nearest/TestMoveNearest.py (947 of 2154)
PASS: lldb-unit :: ScriptInterpreter/Python/./ScriptInterpreterPythonTests/PythonDataObjectsTest.TestPythonStringToStr (948 of 2154)
PASS: lldb-shell :: Breakpoint/ppc64-localentry.test (949 of 2154)
PASS: lldb-api :: functionalities/thread/concurrent_events/TestConcurrentManyWatchpoints.py (950 of 2154)
PASS: lldb-unit :: Expression/./ExpressionTests/DiagnosticManagerTest.AppendMessageNoDiag (951 of 2154)
PASS: lldb-api :: functionalities/data-formatter/data-formatter-objc/TestDataFormatterObjCNSDate.py (952 of 2154)
PASS: lldb-unit :: Utility/./UtilityTests/Flags.AllClear (953 of 2154)
PASS: lldb-unit :: Utility/./UtilityTests/BinaryStreamTest.PutULEB128TwoBytes (954 of 2154)
PASS: lldb-unit :: SymbolFile/DWARF/./SymbolFileDWARFTests/SymbolFileDWARFTests.TestAbbrevOutOfOrder (955 of 2154)
PASS: lldb-api :: commands/frame/diagnose/virtual-method-call/TestDiagnoseDereferenceVirtualMethodCall.py (956 of 2154)
PASS: lldb-shell :: Minidump/breakpad-symbols.test (957 of 2154)
PASS: lldb-api :: lang/objc/foundation/TestObjCMethods.py (958 of 2154)
PASS: lldb-api :: macosx/macCatalyst/TestMacCatalyst.py (959 of 2154)
UNSUPPORTED: lldb-shell :: SymbolFile/NativePDB/ast-functions-msvc.cpp (960 of 2154)
PASS: lldb-unit :: Utility/./UtilityTests/BinaryStreamTest.PutULEB128NineBytes (961 of 2154)
PASS: lldb-unit :: Utility/./UtilityTests/ProcessInstanceInfo.Yaml (962 of 2154)
PASS: lldb-unit :: DataFormatter/./LLDBFormatterTests/StringPrinterTests.CxxASCII (963 of 2154)
PASS: lldb-unit :: Utility/./UtilityTests/RangeTest.ClearWithStarAddress (964 of 2154)
PASS: lldb-unit :: UnwindAssembly/x86/./UnwindAssemblyx86Tests/Testx86AssemblyInspectionEngine.TestPushExtended (965 of 2154)
PASS: lldb-unit :: Host/./HostTests/HostInfoTest.GetXcodeSDK (966 of 2154)
PASS: lldb-api :: functionalities/tail_call_frames/cross_object/TestCrossObjectTailCalls.py (967 of 2154)
PASS: lldb-unit :: Expression/./ExpressionTests/CppModuleConfigurationTest.AmbiguousLibCpp (968 of 2154)
PASS: lldb-api :: functionalities/breakpoint/objc/TestObjCBreakpoints.py (969 of 2154)
UNSUPPORTED: lldb-api :: linux/sepdebugsymlink/TestTargetSymbolsSepDebugSymlink.py (970 of 2154)
PASS: lldb-unit :: Utility/./UtilityTests/StructuredDataTest.ParseJSONFromFile (971 of 2154)
PASS: lldb-api :: lang/objc/modules-hash-mismatch/TestClangModulesHashMismatch.py (972 of 2154)
PASS: lldb-api :: python_api/disassemble-raw-data/TestDisassembleRawData.py (973 of 2154)
PASS: lldb-api :: python_api/watchpoint/TestSetWatchpoint.py (974 of 2154)
UNSUPPORTED: lldb-shell :: Register/arm-fp-read.test (975 of 2154)
PASS: lldb-unit :: Symbol/./SymbolTests/LineEntryTest.GetSameLineContiguousAddressRangeNoInlines (976 of 2154)
PASS: lldb-api :: functionalities/gdb_remote_client/TestWriteMemory.py (977 of 2154)
PASS: lldb-unit :: Utility/./UtilityTests/StringExtractorTest.GetHexBytes_OddPair (978 of 2154)
PASS: lldb-api :: commands/frame/diagnose/complicated-expression/TestComplicatedExpression.py (979 of 2154)
PASS: lldb-unit :: ScriptInterpreter/Python/./ScriptInterpreterPythonTests/PythonDataObjectsTest.TestPythonInteger (980 of 2154)
PASS: lldb-unit :: Process/minidump/./LLDBMinidumpTests/MinidumpParserTest.GetMemoryRegionInfo (981 of 2154)
PASS: lldb-unit :: Symbol/./SymbolTests/TestClangASTImporter.MetadataPropagation (982 of 2154)
PASS: lldb-api :: lang/cpp/char8_t/TestCxxChar8_t.py (983 of 2154)
PASS: lldb-unit :: UnwindAssembly/ARM64/./Arm64InstEmulationTests/TestArm64InstEmulation.TestMediumDarwinFunction (984 of 2154)
PASS: lldb-shell :: SymbolFile/DWARF/split-dwarf-inlining.cpp (985 of 2154)
PASS: lldb-api :: commands/thread/select/TestThreadSelect.py (986 of 2154)
PASS: lldb-api :: lang/cpp/breakpoint-commands/TestCPPBreakpointCommands.py (987 of 2154)
PASS: lldb-unit :: Utility/./UtilityTests/StringListTest.GetMaxStringLengthEqualSize (988 of 2154)
PASS: lldb-unit :: Utility/./UtilityTests/StreamTest.ShiftOperatorStrings (989 of 2154)
PASS: lldb-unit :: Utility/./UtilityTests/RecordReplayTest.InstrumentedFooSameThis (990 of 2154)
PASS: lldb-api :: functionalities/rerun/TestRerun.py (991 of 2154)
PASS: lldb-unit :: Process/gdb-remote/./ProcessGdbRemoteTests/GDBRemoteCommunicationClientTest.TestPacketSpeedJSON (992 of 2154)
UNSUPPORTED: lldb-api :: commands/watchpoints/variable_out_of_scope/TestWatchedVarHitWhenInScope.py (993 of 2154)
PASS: lldb-unit :: Language/Highlighting/./HighlighterTests/HighlighterTest.ClangCursorPosBeforeOtherToken (994 of 2154)
PASS: lldb-unit :: Utility/./UtilityTests/RangeDataVector.CustomSort (995 of 2154)
PASS: lldb-unit :: Utility/./UtilityTests/VASprintfTest.NoBufferResize (996 of 2154)
PASS: lldb-unit :: Utility/./UtilityTests/StreamTeeTest.CopyConstructor (997 of 2154)
PASS: lldb-shell :: ObjectFile/ELF/base-address.yaml (998 of 2154)
PASS: lldb-shell :: Breakpoint/debug_rnglist_offset_pair.test (999 of 2154)
PASS: lldb-api :: commands/expression/timeout/TestCallWithTimeout.py (1000 of 2154)
PASS: lldb-api :: functionalities/object-file/TestImageListMultiArchitecture.py (1001 of 2154)
PASS: lldb-unit :: Language/Highlighting/./HighlighterTests/HighlighterTest.ClangTrailingBackslashMissingNewLine (1002 of 2154)
PASS: lldb-unit :: Process/gdb-remote/./ProcessGdbRemoteTests/GDBRemoteCommunicationServerTest.SendErrorResponse_StringError (1003 of 2154)
PASS: lldb-unit :: Utility/./UtilityTests/ScalarTest.ExtractBitfield (1004 of 2154)
PASS: lldb-shell :: ObjectFile/ELF/section-overlap.yaml (1005 of 2154)
PASS: lldb-api :: functionalities/conditional_break/TestConditionalBreak.py (1006 of 2154)
PASS: lldb-unit :: Utility/./UtilityTests/StringListTest.ForRangeEmpty (1007 of 2154)
PASS: lldb-unit :: Process/gdb-remote/./ProcessGdbRemoteTests/GDBRemoteClientBaseTest.SendContinueAndInterrupt2PacketBug (1008 of 2154)
PASS: lldb-unit :: Utility/./UtilityTests/StreamTest.PutHex8 (1009 of 2154)
PASS: lldb-shell :: Commands/command-regex-delete.test (1010 of 2154)
PASS: lldb-unit :: Utility/./UtilityTests/StringExtractorTest.DecodeHexU8_Underflow (1011 of 2154)
PASS: lldb-unit :: SymbolFile/DWARF/./SymbolFileDWARFTests/SymbolFileDWARFTests.TestAbbrevNullAttrValidForm (1012 of 2154)
PASS: lldb-shell :: Breakpoint/debug_rnglist_basic.test (1013 of 2154)
PASS: lldb-unit :: Language/Highlighting/./HighlighterTests/HighlighterTest.ClangBraces (1014 of 2154)
PASS: lldb-api :: functionalities/data-formatter/data-formatter-script/TestDataFormatterScript.py (1015 of 2154)
PASS: lldb-unit :: Expression/./ExpressionTests/CppModuleConfigurationTest.UnrelatedLibrary (1016 of 2154)
PASS: lldb-shell :: SymbolFile/DWARF/inline-function-address-shared.test (1017 of 2154)
PASS: lldb-unit :: UnwindAssembly/x86/./UnwindAssemblyx86Tests/Testx86AssemblyInspectionEngine.TestPopR15 (1018 of 2154)
PASS: lldb-unit :: Utility/./UtilityTests/StreamTest.PutMaxHex64ByteOrderBig (1019 of 2154)
PASS: lldb-unit :: Utility/./UtilityTests/StringListTest.SplitIntoLines (1020 of 2154)
PASS: lldb-unit :: DataFormatter/./LLDBFormatterTests/StringPrinterTests.CxxUTF8 (1021 of 2154)
PASS: lldb-api :: functionalities/data-formatter/data-formatter-stl/libcxx/queue/TestDataFormatterLibcxxQueue.py (1022 of 2154)
PASS: lldb-shell :: SymbolFile/DWARF/DW_AT_declaration-with-children.s (1023 of 2154)
PASS: lldb-unit :: Utility/./UtilityTests/BroadcasterTest.EventTypeHasListeners (1024 of 2154)
PASS: lldb-api :: functionalities/tail_call_frames/disambiguate_tail_call_seq/TestDisambiguateTailCallSeq.py (1025 of 2154)
PASS: lldb-shell :: Driver/TestSingleQuote.test (1026 of 2154)
PASS: lldb-api :: commands/expression/codegen-crash-typedefdecl-not-in_declcontext/TestCodegenCrashTypedefDeclNotInDeclContext.py (1027 of 2154)
PASS: lldb-unit :: Utility/./UtilityTests/StringListTest.AppendListCStringArray (1028 of 2154)
PASS: lldb-api :: commands/expression/multiline-navigation/TestMultilineNavigation.py (1029 of 2154)
PASS: lldb-unit :: SymbolFile/NativePDB/./SymbolFileNativePDBTests/PDBFPOProgramToDWARFExpressionTests.SingleAssignmentRegisterRef (1030 of 2154)
PASS: lldb-shell :: ScriptInterpreter/Python/sb_address_exception.test (1031 of 2154)
PASS: lldb-api :: lang/objc/orderedset/TestOrderedSet.py (1032 of 2154)
PASS: lldb-api :: commands/expression/import-std-module/forward_decl_from_module/TestForwardDeclFromStdModule.py (1033 of 2154)
PASS: lldb-unit :: SymbolFile/DWARF/./SymbolFileDWARFTests/SymbolFileDWARFTests.TestAbilitiesForDWARF (1034 of 2154)
PASS: lldb-unit :: UnwindAssembly/x86/./UnwindAssemblyx86Tests/Testx86AssemblyInspectionEngine.TestAddRSP (1035 of 2154)
PASS: lldb-unit :: Utility/./UtilityTests/StringLexerTest.AdvanceIf (1036 of 2154)
PASS: lldb-api :: lang/cpp/chained-calls/TestCppChainedCalls.py (1037 of 2154)
XFAIL: lldb-shell :: Register/x86-64-write.test (1038 of 2154)
PASS: lldb-api :: commands/expression/issue_11588/Test11588.py (1039 of 2154)
PASS: lldb-unit :: ScriptInterpreter/Python/./ScriptInterpreterPythonTests/PythonDataObjectsTest.TestPythonTupleToStructuredList (1040 of 2154)
PASS: lldb-api :: functionalities/breakpoint/breakpoint_ids/TestBreakpointIDs.py (1041 of 2154)
PASS: lldb-shell :: SymbolFile/Breakpad/symtab.test (1042 of 2154)
PASS: lldb-api :: commands/frame/diagnose/dereference-this/TestDiagnoseDereferenceThis.py (1043 of 2154)
PASS: lldb-unit :: ObjectFile/PECOFF/./ObjectFilePECOFFTests/PECallFrameInfoTest.Frame_reg_eh (1044 of 2154)
PASS: lldb-api :: python_api/name_lookup/TestNameLookup.py (1045 of 2154)
PASS: lldb-shell :: ObjectFile/ELF/compressed-sections.yaml (1046 of 2154)
PASS: lldb-api :: python_api/breakpoint/TestBreakpointAPI.py (1047 of 2154)
PASS: lldb-api :: python_api/value/change_values/TestChangeValueAPI.py (1048 of 2154)
PASS: lldb-unit :: Utility/./UtilityTests/LogChannelTest.Enable (1049 of 2154)
UNSUPPORTED: lldb-api :: functionalities/data-formatter/data-formatter-stl/libstdcpp/tuple/TestDataFormatterStdTuple.py (1050 of 2154)
PASS: lldb-api :: functionalities/breakpoint/address_breakpoints/TestAddressBreakpoints.py (1051 of 2154)
PASS: lldb-unit :: Utility/./UtilityTests/StringListTest.InsertStringAtIndexEnd (1052 of 2154)
PASS: lldb-api :: commands/register/register/register_command/TestRegisters.py (1053 of 2154)
PASS: lldb-shell :: ObjectFile/MachO/subsections.yaml (1054 of 2154)
PASS: lldb-api :: functionalities/thread/concurrent_events/TestConcurrentDelaySignalBreak.py (1055 of 2154)
PASS: lldb-api :: functionalities/breakpoint/breakpoint_by_line_and_column/TestBreakpointByLineAndColumn.py (1056 of 2154)
UNSUPPORTED: lldb-shell :: ScriptInterpreter/Lua/bindings.test (1057 of 2154)
PASS: lldb-unit :: UnwindAssembly/x86/./UnwindAssemblyx86Tests/Testx86AssemblyInspectionEngine.TestPushRBP (1058 of 2154)
PASS: lldb-api :: functionalities/data-formatter/hexcaps/TestDataFormatterHexCaps.py (1059 of 2154)
PASS: lldb-shell :: SymbolFile/Breakpad/line-table.test (1060 of 2154)
PASS: lldb-api :: functionalities/data-formatter/data-formatter-objc/TestDataFormatterObjCKVO.py (1061 of 2154)
PASS: lldb-shell :: VSCode/TestOptions.test (1062 of 2154)
PASS: lldb-api :: lang/objc/objc-ivar-protocols/TestIvarProtocols.py (1063 of 2154)
PASS: lldb-unit :: Expression/./ExpressionTests/DWARFExpression.DW_OP_pick (1064 of 2154)
PASS: lldb-unit :: Utility/./UtilityTests/ConstStringTest.CompareStringRef (1065 of 2154)
PASS: lldb-unit :: Utility/./UtilityTests/TimerTest.CategoryTimesStats (1066 of 2154)
UNSUPPORTED: lldb-api :: functionalities/darwin_log/filter/regex/category/TestDarwinLogFilterRegexCategory.py (1067 of 2154)
UNSUPPORTED: lldb-shell :: Register/arm-gp-read.test (1068 of 2154)
UNSUPPORTED: lldb-api :: lang/cpp/static_members/TestCPPStaticMembers.py (1069 of 2154)
PASS: lldb-unit :: Core/./LLDBCoreTests/ModuleSpecTest.InvalidInMemoryBufferValidFile (1070 of 2154)
PASS: lldb-unit :: Utility/./UtilityTests/StatusTest.ErrorCodeConstructor (1071 of 2154)
PASS: lldb-unit :: Utility/./UtilityTests/ArgsTest.EscapeLLDBCommandArgument (1072 of 2154)
PASS: lldb-api :: tools/lldb-vscode/breakpoint-events/TestVSCode_breakpointEvents.py (1073 of 2154)
PASS: lldb-unit :: Utility/./UtilityTests/ProcessInstanceInfoMatch.Name (1074 of 2154)
PASS: lldb-unit :: Utility/./UtilityTests/StringListTest.RemoveBlankLines (1075 of 2154)
PASS: lldb-unit :: Utility/./UtilityTests/VMRange.Reset (1076 of 2154)
PASS: lldb-unit :: Expression/./ExpressionTests/DWARFExpression.DW_OP_unknown (1077 of 2154)
PASS: lldb-shell :: ObjectFile/ELF/PT_LOAD.yaml (1078 of 2154)
PASS: lldb-api :: functionalities/gdb_remote_client/TestRegDefinitionInParts.py (1079 of 2154)
PASS: lldb-api :: lang/cpp/class_static/TestStaticVariables.py (1080 of 2154)
PASS: lldb-api :: functionalities/memory-region/TestMemoryRegion.py (1081 of 2154)
PASS: lldb-unit :: Utility/./UtilityTests/ReproducerTest.SetReplay (1082 of 2154)
PASS: lldb-api :: lang/objc/modules/TestObjCModules.py (1083 of 2154)
PASS: lldb-unit :: Utility/./UtilityTests/ArchSpecTest.OperatorBool (1084 of 2154)
PASS: lldb-shell :: ScriptInterpreter/None/none.test (1085 of 2154)
PASS: lldb-unit :: Expression/./ExpressionTests/ClangHostTest.ComputeClangResourceDirectory (1086 of 2154)
PASS: lldb-api :: functionalities/postmortem/mach-core/TestMachCore.py (1087 of 2154)
PASS: lldb-unit :: Utility/./UtilityTests/Flags.Reset (1088 of 2154)
PASS: lldb-shell :: ScriptInterpreter/Python/python.test (1089 of 2154)
PASS: lldb-api :: functionalities/unwind/sigtramp/TestSigtrampUnwind.py (1090 of 2154)
PASS: lldb-api :: python_api/function_symbol/TestDisasmAPI.py (1091 of 2154)
UNSUPPORTED: lldb-api :: benchmarks/expression/TestRepeatedExprs.py (1092 of 2154)
PASS: lldb-shell :: SymbolFile/Breakpad/stack-cfi-parsing.test (1093 of 2154)
PASS: lldb-api :: commands/expression/call-function/TestCallBuiltinFunction.py (1094 of 2154)
PASS: lldb-unit :: Utility/./UtilityTests/GeneratorTest.YamlMultiProvider (1095 of 2154)
UNSUPPORTED: lldb-shell :: Register/x86-ymm-read.test (1096 of 2154)
PASS: lldb-unit :: Utility/./UtilityTests/StringListTest.InsertStringAtIndexMove (1097 of 2154)
PASS: lldb-api :: macosx/lc-note/kern-ver-str/TestKernVerStrLCNOTE.py (1098 of 2154)
PASS: lldb-api :: commands/expression/namespace_local_var_same_name_cpp_and_c/TestNamespaceLocalVarSameNameCppAndC.py (1099 of 2154)
UNSUPPORTED: lldb-shell :: ScriptInterpreter/Lua/watchpoint_callback.test (1100 of 2154)
PASS: lldb-unit :: Utility/./UtilityTests/StreamTest.PutRawBytesToLittleEndian (1101 of 2154)
UNSUPPORTED: lldb-api :: functionalities/data-formatter/data-formatter-stl/libstdcpp/map/TestDataFormatterStdMap.py (1102 of 2154)
PASS: lldb-unit :: Process/gdb-remote/./ProcessGdbRemoteTests/GDBRemoteClientBaseTest.InterruptNoResponse (1103 of 2154)
PASS: lldb-unit :: ObjectFile/Breakpad/./ObjectFileBreakpadTests/PublicRecord.parse (1104 of 2154)
PASS: lldb-api :: lang/cpp/global_operators/TestCppGlobalOperators.py (1105 of 2154)
PASS: lldb-api :: tools/lldb-server/commandline/TestStubReverseConnect.py (1106 of 2154)
PASS: lldb-unit :: Utility/./UtilityTests/UriParserTest.Empty (1107 of 2154)
PASS: lldb-unit :: UnwindAssembly/ARM64/./Arm64InstEmulationTests/TestArm64InstEmulation.TestSimpleDarwinFunction (1108 of 2154)
PASS: lldb-api :: lang/cpp/trivial_abi/TestTrivialABI.py (1109 of 2154)
PASS: lldb-unit :: Process/gdb-remote/./ProcessGdbRemoteTests/GDBRemoteClientBaseTest.SendContinueAndWait (1110 of 2154)
PASS: lldb-unit :: Utility/./UtilityTests/RangeTest.LessThan (1111 of 2154)
PASS: lldb-unit :: Utility/./UtilityTests/LogChannelTest.List (1112 of 2154)
PASS: lldb-api :: lang/objc/modules-inline-functions/TestModulesInlineFunctions.py (1113 of 2154)
PASS: lldb-unit :: Language/Highlighting/./HighlighterTests/HighlighterTest.DefaultHighlighterWithCursorOutOfBounds (1114 of 2154)
PASS: lldb-shell :: Reproducer/Functionalities/TestImageList.test (1115 of 2154)
PASS: lldb-unit :: UnwindAssembly/x86/./UnwindAssemblyx86Tests/Testx86AssemblyInspectionEngine.Test64bitFramelessBigStackFrame (1116 of 2154)
UNSUPPORTED: lldb-api :: arm/breakpoint-thumb-codesection/TestBreakpointThumbCodesection.py (1117 of 2154)
PASS: lldb-unit :: Utility/./UtilityTests/StringListTest.GetMaxStringLengthIncreasingSize (1118 of 2154)
PASS: lldb-api :: functionalities/data-formatter/data-formatter-ptr-to-array/TestPtrToArrayFormatting.py (1119 of 2154)
PASS: lldb-unit :: Symbol/./SymbolTests/TestTypeSystemClang.TestGetTypeClassTypeOfExpr (1120 of 2154)
PASS: lldb-api :: commands/process/launch/TestProcessLaunch.py (1121 of 2154)
PASS: lldb-api :: commands/expression/xvalue/TestXValuePrinting.py (1122 of 2154)
PASS: lldb-shell :: Commands/command-backtrace.test (1123 of 2154)
PASS: lldb-unit :: Utility/./UtilityTests/AnsiTerminal.Incomplete (1124 of 2154)
PASS: lldb-api :: sample_test/TestSampleTest.py (1125 of 2154)
UNSUPPORTED: lldb-shell :: Register/x86-gp-write.test (1126 of 2154)
PASS: lldb-shell :: SymbolFile/DWARF/dwo-type-in-main-file.s (1127 of 2154)
PASS: lldb-unit :: Utility/./UtilityTests/StringListTest.LongestCommonPrefixDuplicateElement (1128 of 2154)
PASS: lldb-unit :: Utility/./UtilityTests/StringListTest.CopyListEmpty (1129 of 2154)
PASS: lldb-unit :: Utility/./UtilityTests/DataExtractorTest.GetMaxU64_unchecked (1130 of 2154)
PASS: lldb-shell :: SymbolFile/DWARF/debug_ranges.s (1131 of 2154)
PASS: lldb-unit :: Utility/./UtilityTests/ScalarTest.Equality (1132 of 2154)
PASS: lldb-api :: lang/c/anonymous/TestAnonymous.py (1133 of 2154)
UNSUPPORTED: lldb-api :: functionalities/signal/handle-segv/TestHandleSegv.py (1134 of 2154)
PASS: lldb-api :: functionalities/ubsan/user-expression/TestUbsanUserExpression.py (1135 of 2154)
PASS: lldb-unit :: Utility/./UtilityTests/StreamTest.PutHex16ByteOrderBig (1136 of 2154)
PASS: lldb-unit :: Utility/./UtilityTests/ArgsTest.TestQuotedUnknownEscape (1137 of 2154)
PASS: lldb-unit :: Symbol/./SymbolTests/TestClangASTImporter.CopyDeclTagDecl (1138 of 2154)
PASS: lldb-unit :: Utility/./UtilityTests/StreamTest.ShiftOperatorChars (1139 of 2154)
PASS: lldb-unit :: Utility/./UtilityTests/StringExtractorTest.GetNameColonValueNoColon (1140 of 2154)
PASS: lldb-api :: lang/cpp/virtual-functions/TestCppVirtualFunctions.py (1141 of 2154)
PASS: lldb-unit :: Utility/./UtilityTests/StreamTest.PutHex32ByteOrderLittle (1142 of 2154)
PASS: lldb-api :: lang/cpp/namespace/TestNamespaceLookup.py (1143 of 2154)
UNSUPPORTED: lldb-api :: commands/watchpoints/multi_watchpoint_slots/TestWatchpointMultipleSlots.py (1144 of 2154)
PASS: lldb-api :: tools/lldb-vscode/step/TestVSCode_step.py (1145 of 2154)
PASS: lldb-unit :: Utility/./UtilityTests/DataExtractorTest.GetFloatUnaligned (1146 of 2154)
PASS: lldb-api :: commands/gui/basicdebug/TestGuiBasicDebug.py (1147 of 2154)
PASS: lldb-shell :: Breakpoint/split-dwarf5-debug-stroffsets.test (1148 of 2154)
PASS: lldb-api :: functionalities/history/TestHistoryRecall.py (1149 of 2154)
PASS: lldb-api :: python_api/get-value-32bit-int/TestGetValue32BitInt.py (1150 of 2154)
PASS: lldb-unit :: Utility/./UtilityTests/StringListTest.SplitIntoLinesEmpty (1151 of 2154)
PASS: lldb-unit :: Expression/./ExpressionTests/DiagnosticManagerTest.GetStringPreserveOrder (1152 of 2154)
PASS: lldb-unit :: Host/./HostTests/SocketAddressTest.GetAddressInfo (1153 of 2154)
PASS: lldb-api :: functionalities/data-formatter/data-formatter-stl/libcxx/vector/TestDataFormatterLibcxxVector.py (1154 of 2154)
PASS: lldb-unit :: Utility/./UtilityTests/RangeTest.Clear (1155 of 2154)
PASS: lldb-api :: commands/command/script/import/rdar-12586188/TestRdar12586188.py (1156 of 2154)
PASS: lldb-api :: lang/c/unicode/TestUnicodeSymbols.py (1157 of 2154)
PASS: lldb-api :: api/log/TestAPILog.py (1158 of 2154)
PASS: lldb-api :: commands/expression/vector_of_enums/TestVectorOfEnums.py (1159 of 2154)
PASS: lldb-api :: commands/expression/import-std-module/vector/TestVectorFromStdModule.py (1160 of 2154)
PASS: lldb-api :: functionalities/data-formatter/data-formatter-objc/TestDataFormatterObjCPlain.py (1161 of 2154)
PASS: lldb-unit :: Utility/./UtilityTests/RecordReplayTest.InstrumentedBar (1162 of 2154)
PASS: lldb-unit :: Utility/./UtilityTests/ArgsTest.AppendArguments (1163 of 2154)
PASS: lldb-unit :: Utility/./UtilityTests/StringListTest.GetMaxStringLengthMixed (1164 of 2154)
PASS: lldb-unit :: Process/minidump/./LLDBMinidumpTests/MinidumpParserTest.GetPidWow64 (1165 of 2154)
PASS: lldb-unit :: Process/gdb-remote/./ProcessGdbRemoteTests/GDBRemoteClientBaseTest.SendContinueDelegateInterface (1166 of 2154)
PASS: lldb-api :: commands/frame/select/TestFrameSelect.py (1167 of 2154)
UNSUPPORTED: lldb-api :: commands/watchpoints/hello_watchlocation/TestWatchLocation.py (1168 of 2154)
PASS: lldb-api :: commands/expression/import_builtin_fileid/TestImportBuiltinFileID.py (1169 of 2154)
PASS: lldb-unit :: Utility/./UtilityTests/StringLexerTest.GetUnlexed (1170 of 2154)
PASS: lldb-api :: functionalities/data-formatter/data-formatter-stl/libcxx/string/TestDataFormatterLibcxxString.py (1171 of 2154)
PASS: lldb-unit :: Language/Highlighting/./HighlighterTests/HighlighterTest.ClangIdentifiers (1172 of 2154)
PASS: lldb-unit :: Signals/./SignalsTests/UnixSignalsTest.Iteration (1173 of 2154)
PASS: lldb-api :: macosx/queues/TestQueues.py (1174 of 2154)
PASS: lldb-api :: functionalities/tail_call_frames/thread_step_out_or_return/TestSteppingOutWithArtificialFrames.py (1175 of 2154)
PASS: lldb-api :: functionalities/thread/concurrent_events/TestConcurrentCrashWithSignal.py (1176 of 2154)
PASS: lldb-shell :: Reproducer/Functionalities/TestDataFormatter.test (1177 of 2154)
PASS: lldb-unit :: Interpreter/./InterpreterTests/CompletionTest.DirCompletionAbsolute (1178 of 2154)
PASS: lldb-shell :: SymbolFile/NativePDB/function-types-classes.cpp (1179 of 2154)
PASS: lldb-shell :: Reproducer/TestWorkingDir.test (1180 of 2154)
PASS: lldb-unit :: Utility/./UtilityTests/StatusTest.ErrorConstructor (1181 of 2154)
PASS: lldb-api :: functionalities/data-formatter/data-formatter-stl/libcxx/function/TestLibCxxFunction.py (1182 of 2154)
PASS: lldb-unit :: Utility/./UtilityTests/RegularExpression.Empty (1183 of 2154)
PASS: lldb-unit :: Utility/./UtilityTests/TimerTest.CategoryTimesNested (1184 of 2154)
PASS: lldb-api :: lang/c/set_values/TestSetValues.py (1185 of 2154)
PASS: lldb-unit :: Symbol/./SymbolTests/TestTypeSystemClang.TestConvertAccessTypeToAccessSpecifier (1186 of 2154)
PASS: lldb-api :: commands/expression/po_verbosity/TestPoVerbosity.py (1187 of 2154)
PASS: lldb-unit :: Utility/./UtilityTests/RecordReplayTest.InstrumentedBarRef (1188 of 2154)
PASS: lldb-unit :: Symbol/./SymbolTests/TestClangASTImporter.DeportDeclTagDecl (1189 of 2154)
PASS: lldb-api :: commands/disassemble/basic/TestDisassembleBreakpoint.py (1190 of 2154)
PASS: lldb-shell :: Breakpoint/case-sensitive.test (1191 of 2154)
PASS: lldb-unit :: Target/./TargetTests/PathMappingListTest.RemapRoot (1192 of 2154)
PASS: lldb-unit :: Utility/./UtilityTests/StringExtractorTest.DecodeHexU8_Underflow2 (1193 of 2154)
UNSUPPORTED: lldb-api :: functionalities/data-formatter/data-formatter-stl/libstdcpp/list/TestDataFormatterStdList.py (1194 of 2154)
PASS: lldb-api :: functionalities/breakpoint/breakpoint_options/TestBreakpointOptions.py (1195 of 2154)
PASS: lldb-shell :: SymbolFile/NativePDB/locate-pdb.cpp (1196 of 2154)
PASS: lldb-shell :: SymbolFile/DWARF/debug_rnglists-dwo.s (1197 of 2154)
PASS: lldb-api :: commands/process/attach/TestProcessAttach.py (1198 of 2154)
PASS: lldb-unit :: API/./APITests/SBCommandInterpreterTest.MultiWordCommand (1199 of 2154)
PASS: lldb-unit :: Utility/./UtilityTests/ArchSpecTest.YAML (1200 of 2154)
UNSUPPORTED: lldb-shell :: ScriptInterpreter/Lua/command_script_import.test (1201 of 2154)
PASS: lldb-unit :: UnwindAssembly/x86/./UnwindAssemblyx86Tests/Testx86AssemblyInspectionEngine.TestSpillRegToStackViaMOVi386 (1202 of 2154)
PASS: lldb-api :: functionalities/thread/concurrent_events/TestConcurrentTwoBreakpointsOneWatchpoint.py (1203 of 2154)
UNSUPPORTED: lldb-shell :: ScriptInterpreter/Lua/quit.test (1204 of 2154)
PASS: lldb-api :: functionalities/data-formatter/user-format-vs-summary/TestUserFormatVsSummary.py (1205 of 2154)
PASS: lldb-unit :: Utility/./UtilityTests/StringListTest.DefaultConstructor (1206 of 2154)
PASS: lldb-unit :: Utility/./UtilityTests/FileSpecTest.FileAndDirectoryComponents (1207 of 2154)
PASS: lldb-api :: lang/objc/blocks/TestObjCIvarsInBlocks.py (1208 of 2154)
PASS: lldb-api :: lang/objc/objc-builtin-types/TestObjCBuiltinTypes.py (1209 of 2154)
PASS: lldb-api :: functionalities/data-formatter/data-formatter-objc/TestDataFormatterObjCNSBundle.py (1210 of 2154)
UNSUPPORTED: lldb-api :: commands/trace/TestTraceSchema.py (1211 of 2154)
PASS: lldb-api :: lang/objc/modules-incomplete/TestIncompleteModules.py (1212 of 2154)
PASS: lldb-unit :: Utility/./UtilityTests/CompletionRequest.TryCompleteCurrentArgMode (1213 of 2154)
PASS: lldb-unit :: Platform/Android/./AdbClientTests/AdbClientTest.CreateByDeviceId (1214 of 2154)
PASS: lldb-unit :: Signals/./SignalsTests/UnixSignalsTest.GetInfo (1215 of 2154)
PASS: lldb-unit :: Utility/./UtilityTests/BinaryStreamTest.PutSLEB128ThreeBytes (1216 of 2154)
PASS: lldb-api :: functionalities/thread/concurrent_events/TestConcurrentTwoWatchpointsOneBreakpoint.py (1217 of 2154)
PASS: lldb-unit :: Symbol/./SymbolTests/TestClangASTImporter.RecordLayout (1218 of 2154)
PASS: lldb-api :: functionalities/fat_archives/TestFatArchives.py (1219 of 2154)
PASS: lldb-unit :: Utility/./UtilityTests/DataExtractorTest.GetCStrEmpty (1220 of 2154)
PASS: lldb-api :: functionalities/type_lookup/TestTypeLookup.py (1221 of 2154)
UNSUPPORTED: lldb-shell :: Reproducer/TestLuaImport.test (1222 of 2154)
PASS: lldb-api :: commands/frame/diagnose/dereference-argument/TestDiagnoseDereferenceArgument.py (1223 of 2154)
PASS: lldb-api :: lang/c/array_types/TestArrayTypes.py (1224 of 2154)
PASS: lldb-unit :: Utility/./UtilityTests/StringExtractorTest.GetHexU8_Exact_NoEof (1225 of 2154)
PASS: lldb-api :: functionalities/unwind/zeroth_frame/TestZerothFrame.py (1226 of 2154)
PASS: lldb-unit :: ScriptInterpreter/Python/./ScriptInterpreterPythonTests/PythonDataObjectsTest.TestPythonListValueEquality (1227 of 2154)
PASS: lldb-shell :: ObjectFile/ELF/short-build-id.yaml (1228 of 2154)
PASS: lldb-shell :: SymbolFile/Breakpad/unwind-via-raSearch.test (1229 of 2154)
PASS: lldb-unit :: Process/minidump/./LLDBMinidumpTests/MinidumpParserTest.MinidumpDuplicateModuleMinAddress (1230 of 2154)
PASS: lldb-shell :: Register/x86-64-gp-read.test (1231 of 2154)
PASS: lldb-api :: commands/expression/argument_passing_restrictions/TestArgumentPassingRestrictions.py (1232 of 2154)
PASS: lldb-shell :: ObjectFile/ELF/aarch64-relocations.yaml (1233 of 2154)
PASS: lldb-api :: functionalities/data-formatter/data-formatter-cpp/TestDataFormatterCpp.py (1234 of 2154)
PASS: lldb-api :: functionalities/tsan/basic/TestTsanBasic.py (1235 of 2154)
PASS: lldb-shell :: Driver/TestProcessAttach.test (1236 of 2154)
PASS: lldb-api :: lang/objc/objc-new-syntax/TestObjCNewSyntaxArray.py (1237 of 2154)
PASS: lldb-shell :: ObjectFile/wasm/basic.yaml (1238 of 2154)
PASS: lldb-unit :: SymbolFile/DWARF/./SymbolFileDWARFTests/SymbolFileDWARFTests.ParseArangesNonzeroSegmentSize (1239 of 2154)
PASS: lldb-unit :: Utility/./UtilityTests/StringExtractorTest.GetHexBytes_FullString (1240 of 2154)
UNSUPPORTED: lldb-api :: benchmarks/expression/TestExpressionCmd.py (1241 of 2154)
PASS: lldb-api :: commands/expression/namespace_local_var_same_name_obj_c/TestNamespaceLocalVarSameNameObjC.py (1242 of 2154)
PASS: lldb-shell :: Settings/TestFrameFormatColor.test (1243 of 2154)
PASS: lldb-api :: lang/c/shared_lib_stripped_symbols/TestSharedLibStrippedSymbols.py (1244 of 2154)
PASS: lldb-api :: tools/lldb-server/TestGdbRemoteExitCode.py (1245 of 2154)
PASS: lldb-api :: functionalities/breakpoint/debugbreak/TestDebugBreak.py (1246 of 2154)
PASS: lldb-unit :: Symbol/./SymbolTests/TestTypeSystemClang.TestIsClangType (1247 of 2154)
PASS: lldb-unit :: Utility/./UtilityTests/BinaryStreamTest.PutSLEB128Zero (1248 of 2154)
PASS: lldb-unit :: UnwindAssembly/PPC64/./PPC64InstEmulationTests/TestPPC64InstEmulation.TestSimpleFunction (1249 of 2154)
PASS: lldb-api :: python_api/thread/TestThreadAPI.py (1250 of 2154)
PASS: lldb-unit :: Utility/./UtilityTests/XcodeSDKTest.SDKSupportsModules (1251 of 2154)
PASS: lldb-unit :: Utility/./UtilityTests/ArchSpecTest.TestParseMachCPUDashSubtypeTripleExtra (1252 of 2154)
PASS: lldb-api :: tools/lldb-vscode/variables/TestVSCode_variables.py (1253 of 2154)
PASS: lldb-api :: functionalities/postmortem/minidump-new/TestMiniDumpNew.py (1254 of 2154)
PASS: lldb-unit :: Utility/./UtilityTests/RangeDataVector.FindEntryIndexesThatContain (1255 of 2154)
PASS: lldb-api :: tools/lldb-server/TestGdbRemoteSingleStep.py (1256 of 2154)
PASS: lldb-shell :: Breakpoint/debug_addrx.test (1257 of 2154)
UNSUPPORTED: lldb-api :: commands/register/register/aarch64_sve_registers/rw_access_static_config/TestSVERegisters.py (1258 of 2154)
PASS: lldb-shell :: ObjectFile/ELF/PT_LOAD-overlap.yaml (1259 of 2154)
PASS: lldb-unit :: Platform/Android/./AdbClientTests/AdbClientTest.CreateByDeviceId_ByEnvVar (1260 of 2154)
PASS: lldb-api :: functionalities/var_path/TestVarPath.py (1261 of 2154)
PASS: lldb-unit :: Expression/./ExpressionTests/ClangHostTest.MacOSX (1262 of 2154)
PASS: lldb-api :: python_api/sbvalue_persist/TestSBValuePersist.py (1263 of 2154)
PASS: lldb-unit :: UnwindAssembly/x86/./UnwindAssemblyx86Tests/Testx86AssemblyInspectionEngine.TestPushR13 (1264 of 2154)
PASS: lldb-shell :: ObjectFile/ELF/gnu-debuglink.yaml (1265 of 2154)
PASS: lldb-api :: lang/cpp/signed_types/TestSignedTypes.py (1266 of 2154)
PASS: lldb-api :: functionalities/data-formatter/array_typedef/TestArrayTypedef.py (1267 of 2154)
PASS: lldb-unit :: Utility/./UtilityTests/NameMatchesTest.Equals (1268 of 2154)
PASS: lldb-unit :: Utility/./UtilityTests/OptionsWithRawTest.UnterminatedQuote (1269 of 2154)
PASS: lldb-api :: functionalities/thread/num_threads/TestNumThreads.py (1270 of 2154)
PASS: lldb-api :: functionalities/gdb_remote_client/TestProcessConnect.py (1271 of 2154)
PASS: lldb-api :: commands/watchpoints/hello_watchpoint/TestMyFirstWatchpoint.py (1272 of 2154)
PASS: lldb-unit :: Utility/./UtilityTests/OptionsWithRawTest.LeadingSpaceArgs (1273 of 2154)
PASS: lldb-unit :: Utility/./UtilityTests/StreamTest.PutMaxHex64ByteOrderLittle (1274 of 2154)
PASS: lldb-unit :: Symbol/./SymbolTests/TestTypeSystemClang.TestBuiltinTypeForEncodingAndBitSize (1275 of 2154)
PASS: lldb-unit :: Process/gdb-remote/./ProcessGdbRemoteTests/GDBRemoteCommunicationClientTest.SendStopTracePacket (1276 of 2154)
PASS: lldb-unit :: Utility/./UtilityTests/StringLexerTest.Peek (1277 of 2154)
PASS: lldb-unit :: Disassembler/./DisassemblerTests/TestArm64Disassembly.TestArmv81Instruction (1278 of 2154)
PASS: lldb-shell :: SymbolFile/DWARF/debug-types-signature-loop.s (1279 of 2154)
PASS: lldb-api :: lang/cpp/bitfields/TestCppBitfields.py (1280 of 2154)
PASS: lldb-shell :: Reproducer/TestCrash.test (1281 of 2154)
PASS: lldb-unit :: Utility/./UtilityTests/AnsiTerminal.AtStart (1282 of 2154)
PASS: lldb-unit :: Utility/./UtilityTests/LogChannelEnabledTest.LLDB_LOG_ERROR (1283 of 2154)
PASS: lldb-unit :: Utility/./UtilityTests/TimerTest.CategoryTimes2 (1284 of 2154)
PASS: lldb-unit :: SymbolFile/DWARF/./SymbolFileDWARFTests/SymbolFileDWARFTests.TestAbbrevOrder1Start5 (1285 of 2154)
PASS: lldb-api :: functionalities/thread/concurrent_events/TestConcurrentTwoBreakpointsOneSignal.py (1286 of 2154)
UNSUPPORTED: lldb-api :: lang/objc/objc-dynamic-value/TestObjCDynamicValue.py (1287 of 2154)
PASS: lldb-shell :: BuildScript/script-args.test (1288 of 2154)
PASS: lldb-api :: commands/expression/call-function/TestCallStdStringFunction.py (1289 of 2154)
PASS: lldb-api :: functionalities/data-formatter/poarray/TestPrintObjectArray.py (1290 of 2154)
PASS: lldb-unit :: Utility/./UtilityTests/FileSpecTest.EqualSeparator (1291 of 2154)
PASS: lldb-unit :: UnwindAssembly/x86/./UnwindAssemblyx86Tests/Testx86AssemblyInspectionEngine.TestPushECX (1292 of 2154)
PASS: lldb-api :: lang/cpp/unique-types/TestUniqueTypes.py (1293 of 2154)
PASS: lldb-unit :: Symbol/./SymbolTests/TestTypeSystemClang.TestDisplayName (1294 of 2154)
PASS: lldb-api :: commands/expression/import-std-module/shared_ptr/TestSharedPtrFromStdModule.py (1295 of 2154)
PASS: lldb-api :: lang/objc/forward-decl/TestForwardDecl.py (1296 of 2154)
PASS: lldb-api :: functionalities/data-formatter/type_summary_list_arg/TestTypeSummaryListArg.py (1297 of 2154)
PASS: lldb-unit :: Utility/./UtilityTests/UriParserTest.BracketedHostname (1298 of 2154)
PASS: lldb-api :: lang/objc/objc_direct-methods/TestObjCDirectMethods.py (1299 of 2154)
PASS: lldb-unit :: Process/gdb-remote/./ProcessGdbRemoteTests/GDBRemoteCommunicationTest.ReadPacket_checksum (1300 of 2154)
PASS: lldb-api :: python_api/function_symbol/TestSymbolAPI.py (1301 of 2154)
PASS: lldb-api :: commands/expression/persistent_ptr_update/TestPersistentPtrUpdate.py (1302 of 2154)
PASS: lldb-shell :: ObjectFile/PECOFF/section-types.yaml (1303 of 2154)
PASS: lldb-unit :: Symbol/./SymbolTests/TestTypeSystemClang.TestGetEnumIntegerTypeBasicTypes (1304 of 2154)
PASS: lldb-api :: commands/expression/import-std-module/pair/TestPairFromStdModule.py (1305 of 2154)
PASS: lldb-unit :: Utility/./UtilityTests/RangeTest.ContainsRangeStartingFromZero (1306 of 2154)
PASS: lldb-api :: api/multiple-targets/TestMultipleTargets.py (1307 of 2154)
PASS: lldb-api :: lang/cpp/covariant-return-types/TestCovariantReturnTypes.py (1308 of 2154)
PASS: lldb-unit :: Utility/./UtilityTests/AnsiTerminal.Unknown (1309 of 2154)
PASS: lldb-unit :: Utility/./UtilityTests/StringExtractorTest.GetHexBytes_Underflow (1310 of 2154)
PASS: lldb-api :: functionalities/thread/ignore_suspended/TestIgnoreSuspendedThread.py (1311 of 2154)
PASS: lldb-unit :: Utility/./UtilityTests/ScalarTest.GetBytes (1312 of 2154)
PASS: lldb-unit :: Platform/./LLDBPlatformTests/PlatformDarwinTest.FindComponentInPath (1313 of 2154)
PASS: lldb-unit :: Process/minidump/./LLDBMinidumpTests/MinidumpParserTest.GetThreadsAndGetThreadContext (1314 of 2154)
PASS: lldb-unit :: Utility/./UtilityTests/AnsiTerminal.KnownPrefix (1315 of 2154)
PASS: lldb-api :: python_api/value_var_update/TestValueVarUpdate.py (1316 of 2154)
PASS: lldb-unit :: Host/./HostTests/FileSystemTest.GetPermissions (1317 of 2154)
PASS: lldb-shell :: Commands/command-regex-unalias.test (1318 of 2154)
UNSUPPORTED: lldb-shell :: SymbolFile/PDB/function-level-linking.test (1319 of 2154)
PASS: lldb-unit :: UnwindAssembly/x86/./UnwindAssemblyx86Tests/Testx86AssemblyInspectionEngine.TestPopEBP (1320 of 2154)
PASS: lldb-unit :: Language/Highlighting/./HighlighterTests/HighlighterTest.DefaultHighlighter (1321 of 2154)
PASS: lldb-unit :: Symbol/./SymbolTests/TestTypeSystemClang.TestUnifyAccessSpecifiers (1322 of 2154)
PASS: lldb-unit :: Utility/./UtilityTests/FileSpecTest.EqualDotsPosix (1323 of 2154)
PASS: lldb-api :: terminal/TestEditline.py (1324 of 2154)
PASS: lldb-api :: commands/target/basic/TestTargetCommand.py (1325 of 2154)
PASS: lldb-api :: functionalities/data-formatter/synthupdate/TestSyntheticFilterRecompute.py (1326 of 2154)
PASS: lldb-unit :: Utility/./UtilityTests/FileSpecTest.GuessPathStyle (1327 of 2154)
PASS: lldb-unit :: Utility/./UtilityTests/ProcessInstanceInfoList.Yaml (1328 of 2154)
PASS: lldb-shell :: Breakpoint/single-file-split-dwarf.test (1329 of 2154)
PASS: lldb-api :: assert_messages_test/TestAssertMessages.py (1330 of 2154)
PASS: lldb-unit :: Host/./HostTests/FileSystemTest.Exists (1331 of 2154)
PASS: lldb-api :: tools/lldb-server/inferior-crash/TestGdbRemoteSegFault.py (1332 of 2154)
PASS: lldb-unit :: Utility/./UtilityTests/StringListTest.SplitIntoLinesSingleTrailingCR (1333 of 2154)
PASS: lldb-api :: commands/target/select/TestTargetSelect.py (1334 of 2154)
PASS: lldb-unit :: Expression/./ExpressionTests/CppModuleConfigurationTest.UnknownLibCppFile (1335 of 2154)
PASS: lldb-unit :: Utility/./UtilityTests/FileSpecTest.CopyByAppendingPathComponent (1336 of 2154)
PASS: lldb-api :: tools/lldb-vscode/attach/TestVSCode_attach.py (1337 of 2154)
PASS: lldb-unit :: Symbol/./SymbolTests/TestTypeSystemClang.TestFunctionTemplateInRecordConstruction (1338 of 2154)
PASS: lldb-unit :: debugserver/./debugserverTests/RNBSocket.AnyListen (1339 of 2154)
PASS: lldb-unit :: Utility/./UtilityTests/ScalarTest.LongLongAssigmentOperator (1340 of 2154)
PASS: lldb-unit :: Utility/./UtilityTests/ScalarTest.APIntConstructor (1341 of 2154)
UNSUPPORTED: lldb-shell :: ScriptInterpreter/Lua/io.test (1342 of 2154)
PASS: lldb-unit :: Symbol/./SymbolTests/TestClangASTImporter.DeportTypeTagDecl (1343 of 2154)
PASS: lldb-shell :: Reproducer/TestFileRepro.test (1344 of 2154)
PASS: lldb-api :: lang/cpp/typedef/TestCppTypedef.py (1345 of 2154)
PASS: lldb-unit :: Utility/./UtilityTests/VMRange.CollectionContains (1346 of 2154)
PASS: lldb-unit :: Utility/./UtilityTests/StringExtractorTest.GetHexBytes_Partial (1347 of 2154)
PASS: lldb-unit :: Utility/./UtilityTests/StringLexerTest.HasAtLeast (1348 of 2154)
PASS: lldb-api :: functionalities/gdb_remote_client/TestNestedRegDefinitions.py (1349 of 2154)
PASS: lldb-unit :: Utility/./UtilityTests/OptionsWithRawTest.WhitespaceInput (1350 of 2154)
UNSUPPORTED: lldb-api :: functionalities/data-formatter/data-formatter-stl/libstdcpp/iterator/TestDataFormatterStdIterator.py (1351 of 2154)
PASS: lldb-unit :: SymbolFile/NativePDB/./SymbolFileNativePDBTests/PDBFPOProgramToDWARFExpressionTests.InvalidOpBinary (1352 of 2154)
PASS: lldb-api :: commands/expression/weak_symbols/TestWeakSymbols.py (1353 of 2154)
PASS: lldb-api :: functionalities/data-formatter/dump_dynamic/TestDumpDynamic.py (1354 of 2154)
PASS: lldb-api :: functionalities/step_scripted/TestStepScripted.py (1355 of 2154)
PASS: lldb-unit :: Utility/./UtilityTests/StreamTest.AddressRange (1356 of 2154)
PASS: lldb-api :: python_api/frame/TestFrames.py (1357 of 2154)
PASS: lldb-api :: commands/expression/char/TestExprsChar.py (1358 of 2154)
PASS: lldb-unit :: UnwindAssembly/x86/./UnwindAssemblyx86Tests/Testx86AssemblyInspectionEngine.TestPushRBPWithREX (1359 of 2154)
PASS: lldb-shell :: Host/TestCustomShell.test (1360 of 2154)
UNSUPPORTED: lldb-shell :: ScriptInterpreter/Lua/nested_sessions.test (1361 of 2154)
PASS: lldb-unit :: UnwindAssembly/x86/./UnwindAssemblyx86Tests/Testx86AssemblyInspectionEngine.TestPopR12 (1362 of 2154)
PASS: lldb-unit :: Utility/./UtilityTests/StringExtractorTest.GetHexBytesAvail (1363 of 2154)
PASS: lldb-api :: lang/objc/objc-stepping/TestObjCStepping.py (1364 of 2154)
PASS: lldb-shell :: SymbolFile/DWARF/DW_AT_location-DW_AT_const_value.s (1365 of 2154)
PASS: lldb-api :: lang/c/tls_globals/TestTlsGlobals.py (1366 of 2154)
PASS: lldb-unit :: Utility/./UtilityTests/UriParserTest.BadPort2 (1367 of 2154)
PASS: lldb-unit :: Utility/./UtilityTests/BinaryStreamTest.PutSLEB128One (1368 of 2154)
PASS: lldb-api :: functionalities/tail_call_frames/disambiguate_paths_to_common_sink/TestDisambiguatePathsToCommonSink.py (1369 of 2154)
PASS: lldb-shell :: Unwind/trap_frame_sym_ctx.test (1370 of 2154)
PASS: lldb-unit :: Utility/./UtilityTests/StringListTest.GetMaxStringLengthEmpty (1371 of 2154)
PASS: lldb-unit :: SymbolFile/NativePDB/./SymbolFileNativePDBTests/PDBFPOProgramToDWARFExpressionTests.UnresolvedRegisterReference (1372 of 2154)
PASS: lldb-api :: functionalities/gdb_remote_client/TestIOSSimulator.py (1373 of 2154)
PASS: lldb-unit :: Expression/./ExpressionTests/DWARFExpression.DW_OP_stack_value (1374 of 2154)
PASS: lldb-api :: macosx/add-dsym/TestAddDsymMidExecutionCommand.py (1375 of 2154)
PASS: lldb-shell :: SymbolFile/DWARF/debug-types-missing-signature.test (1376 of 2154)
PASS: lldb-unit :: Symbol/./SymbolTests/TestClangASTImporter.CanImportInvalidType (1377 of 2154)
PASS: lldb-api :: commands/watchpoints/multiple_threads/TestWatchpointMultipleThreads.py (1378 of 2154)
PASS: lldb-unit :: Target/./TargetTests/ModuleCacheTest.GetAndPut (1379 of 2154)
PASS: lldb-unit :: Utility/./UtilityTests/StreamTest.QuotedCString (1380 of 2154)
PASS: lldb-api :: functionalities/data-formatter/data-formatter-objc/nsindexpath/TestDataFormatterNSIndexPath.py (1381 of 2154)
PASS: lldb-unit :: Process/minidump/./LLDBMinidumpTests/MinidumpParserTest.GetMemory (1382 of 2154)
PASS: lldb-api :: macosx/indirect_symbol/TestIndirectSymbols.py (1383 of 2154)
PASS: lldb-api :: functionalities/process_group/TestChangeProcessGroup.py (1384 of 2154)
PASS: lldb-api :: lang/c/find_struct_type/TestFindStructTypes.py (1385 of 2154)
PASS: lldb-unit :: Utility/./UtilityTests/AnsiTerminal.WhiteSpace (1386 of 2154)
PASS: lldb-api :: lang/c/forward/TestForwardDeclaration.py (1387 of 2154)
PASS: lldb-api :: python_api/symbol-context/two-files/TestSymbolContextTwoFiles.py (1388 of 2154)
PASS: lldb-unit :: Core/./LLDBCoreTests/RichManglingContextTest.SwitchProvider (1389 of 2154)
PASS: lldb-unit :: Disassembler/./DisassemblerTests/TestArmv7Disassembly.TestCortexFPDisass (1390 of 2154)
UNSUPPORTED: lldb-shell :: ObjectFile/ELF/minidebuginfo-set-and-hit-breakpoint.test (1391 of 2154)
PASS: lldb-unit :: Symbol/./SymbolTests/TestTypeSystemClang.TestGetEnumIntegerTypeUnexpectedType (1392 of 2154)
PASS: lldb-unit :: Utility/./UtilityTests/CompletionRequest.FakeLastArg (1393 of 2154)
PASS: lldb-api :: python_api/watchpoint/condition/TestWatchpointConditionAPI.py (1394 of 2154)
PASS: lldb-api :: lang/objc/objc-optimized/TestObjcOptimized.py (1395 of 2154)
PASS: lldb-api :: lang/cpp/global_variables/TestCPPGlobalVariables.py (1396 of 2154)
PASS: lldb-unit :: Target/./TargetTests/RemoteAwarePlatformTest.TestResolveExecutabelOnClientByPlatform (1397 of 2154)
PASS: lldb-api :: functionalities/tail_call_frames/ambiguous_tail_call_seq2/TestAmbiguousTailCallSeq2.py (1398 of 2154)
PASS: lldb-api :: functionalities/postmortem/elf-core/thread_crash/TestLinuxCoreThreads.py (1399 of 2154)
PASS: lldb-shell :: Breakpoint/dummy-target.test (1400 of 2154)
PASS: lldb-shell :: Reproducer/TestPythonImport.test (1401 of 2154)
PASS: lldb-unit :: Utility/./UtilityTests/StringExtractorTest.InitMisc (1402 of 2154)
PASS: lldb-api :: tools/lldb-server/TestGdbRemoteAttach.py (1403 of 2154)
PASS: lldb-api :: commands/watchpoints/multiple_hits/TestMultipleHits.py (1404 of 2154)
PASS: lldb-api :: functionalities/thread/concurrent_events/TestConcurrentTwoBreakpointThreads.py (1405 of 2154)
PASS: lldb-shell :: Commands/command-thread-select.test (1406 of 2154)
PASS: lldb-api :: lang/objc/direct-dispatch-step/TestObjCDirectDispatchStepping.py (1407 of 2154)
PASS: lldb-shell :: Settings/TestFrameFormatNoColor.test (1408 of 2154)
PASS: lldb-unit :: Utility/./UtilityTests/Flags.Test (1409 of 2154)
PASS: lldb-unit :: UnwindAssembly/x86/./UnwindAssemblyx86Tests/Testx86AssemblyInspectionEngine.TestStackRealign32BitDisp_x86_64 (1410 of 2154)
PASS: lldb-shell :: SymbolFile/DWARF/dir-separator-no-comp-dir.s (1411 of 2154)
PASS: lldb-api :: lang/cpp/elaborated-types/TestElaboratedTypes.py (1412 of 2154)
PASS: lldb-api :: functionalities/tail_call_frames/inlining_and_tail_calls/TestInliningAndTailCalls.py (1413 of 2154)
PASS: lldb-unit :: Core/./LLDBCoreTests/ModuleSpecTest.TestELFFile (1414 of 2154)
PASS: lldb-api :: lang/objc/objc-static-method/TestObjCStaticMethod.py (1415 of 2154)
PASS: lldb-shell :: ObjectFile/PECOFF/dep-modules.yaml (1416 of 2154)
PASS: lldb-api :: commands/expression/pr35310/TestExprsBug35310.py (1417 of 2154)
PASS: lldb-api :: commands/process/attach-resume/TestAttachResume.py (1418 of 2154)
PASS: lldb-api :: lang/objc/objc-foundation-dictionary-empty/TestNSDictionary0.py (1419 of 2154)
PASS: lldb-shell :: ObjectFile/PECOFF/basic-info-arm.yaml (1420 of 2154)
PASS: lldb-unit :: Core/./LLDBCoreTests/MangledTest.ResultForBlockInvocation (1421 of 2154)
PASS: lldb-unit :: ScriptInterpreter/Python/./ScriptInterpreterPythonTests/PythonDataObjectsTest.TestPythonBytes (1422 of 2154)
PASS: lldb-shell :: SymbolFile/DWARF/clang-ast-from-dwarf-objc-property.m (1423 of 2154)
PASS: lldb-unit :: Language/Highlighting/./HighlighterTests/HighlighterTest.ClangCursorOutOfBounds (1424 of 2154)
PASS: lldb-unit :: debugserver/./debugserverTests/RNBSocket.LoopBackConnectIPv6 (1425 of 2154)
PASS: lldb-api :: functionalities/breakpoint/breakpoint_ignore_count/TestBreakpointIgnoreCount.py (1426 of 2154)
PASS: lldb-shell :: SymbolFile/DWARF/DW_OP_piece-struct.s (1427 of 2154)
PASS: lldb-unit :: Utility/./UtilityTests/StringListTest.LongestCommonPrefix (1428 of 2154)
PASS: lldb-shell :: SymbolFile/Breakpad/line-table-edgecases.test (1429 of 2154)
PASS: lldb-unit :: Utility/./UtilityTests/RangeTest.ContainsEndInclusiveInvalid (1430 of 2154)
PASS: lldb-unit :: Utility/./UtilityTests/FileSpecTest.Match (1431 of 2154)
PASS: lldb-unit :: Process/minidump/./LLDBMinidumpTests/MinidumpParserTest.GetExceptionStream (1432 of 2154)
PASS: lldb-api :: python_api/exprpath_synthetic/TestExprPathSynthetic.py (1433 of 2154)
PASS: lldb-shell :: ObjectFile/ELF/PT_LOAD-overlap-PT_TLS.yaml (1434 of 2154)
UNSUPPORTED: lldb-api :: functionalities/data-formatter/data-formatter-stl/libstdcpp/smart_ptr/TestDataFormatterStdSmartPtr.py (1435 of 2154)
PASS: lldb-shell :: SymbolFile/DWARF/limit-debug-info.s (1436 of 2154)
UNSUPPORTED: lldb-api :: commands/register/register/intel_xtended_registers/mpx_offset_intersection/TestMPXOffsetIntersection.py (1437 of 2154)
PASS: lldb-unit :: Target/./TargetTests/MemoryRegionInfoTest.Formatv (1438 of 2154)
UNSUPPORTED: lldb-shell :: SymbolFile/PDB/type-quals.test (1439 of 2154)
PASS: lldb-shell :: SymbolFile/DWARF/DW_AT_data_bit_offset-DW_OP_stack_value.s (1440 of 2154)
PASS: lldb-api :: functionalities/data-formatter/format-propagation/TestFormatPropagation.py (1441 of 2154)
PASS: lldb-unit :: Interpreter/./InterpreterTests/OptionArgParserTest.toBoolean (1442 of 2154)
PASS: lldb-unit :: Utility/./UtilityTests/StatusTest.Formatv (1443 of 2154)
UNSUPPORTED: lldb-shell :: SymbolFile/DWARF/DW_TAG_GNU_call_site-DW_AT_low_pc.s (1444 of 2154)
PASS: lldb-unit :: Core/./LLDBCoreTests/MangledTest.EmptyForInvalidName (1445 of 2154)
PASS: lldb-unit :: Expression/./ExpressionTests/DiagnosticManagerTest.PutStringMultiple (1446 of 2154)
UNSUPPORTED: lldb-api :: functionalities/darwin_log/filter/exact_match/category/TestDarwinLogFilterMatchCategory.py (1447 of 2154)
PASS: lldb-api :: lang/cpp/namespace_definitions/TestNamespaceDefinitions.py (1448 of 2154)
PASS: lldb-shell :: ScriptInterpreter/Python/scripted_breakpoint.test (1449 of 2154)
PASS: lldb-unit :: API/./APITests/SBCommandInterpreterTest.SingleWordCommand (1450 of 2154)
PASS: lldb-unit :: Utility/./UtilityTests/OptionsWithRawTest.MultiWordSuffix (1451 of 2154)
UNSUPPORTED: lldb-api :: benchmarks/libcxxmap/TestBenchmarkLibcxxMap.py (1452 of 2154)
PASS: lldb-unit :: Process/./ProcessEventDataTests/ProcessEventDataTest.DoOnRemoval (1453 of 2154)
PASS: lldb-unit :: Utility/./UtilityTests/XcodeSDKTest.GetSDKTypeForTriple (1454 of 2154)
PASS: lldb-unit :: debugserver/./debugserverTests/RNBSocket.LoopBackListenIPv4 (1455 of 2154)
PASS: lldb-api :: tools/lldb-server/commandline/TestStubSetSID.py (1456 of 2154)
PASS: lldb-api :: lang/objc/objc-dyn-sbtype/TestObjCDynamicSBType.py (1457 of 2154)
PASS: lldb-api :: functionalities/data-formatter/data-formatter-synth/TestDataFormatterSynth.py (1458 of 2154)
PASS: lldb-api :: commands/expression/import-std-module/weak_ptr/TestWeakPtrFromStdModule.py (1459 of 2154)
PASS: lldb-api :: commands/settings/TestSettings.py (1460 of 2154)
PASS: lldb-unit :: Utility/./UtilityTests/UriParserTest.SchemeHostSeparator3 (1461 of 2154)
PASS: lldb-api :: commands/expression/expr-in-syscall/TestExpressionInSyscall.py (1462 of 2154)
PASS: lldb-unit :: Utility/./UtilityTests/BinaryStreamTest.PutULEB128ThreeBytes (1463 of 2154)
PASS: lldb-unit :: Breakpoint/./LLDBBreakpointTests/BreakpointIDTest.StringIsBreakpointName (1464 of 2154)
PASS: lldb-api :: python_api/sbvalue_const_addrof/TestSBValueConstAddrOf.py (1465 of 2154)
PASS: lldb-api :: functionalities/plugins/python_os_plugin/stepping_plugin_threads/TestOSPluginStepping.py (1466 of 2154)
PASS: lldb-unit :: Utility/./UtilityTests/ListenerTest.GetEventWait (1467 of 2154)
PASS: lldb-unit :: Utility/./UtilityTests/StringListTest.AppendListCStringArrayEmpty (1468 of 2154)
PASS: lldb-unit :: Utility/./UtilityTests/AnsiTerminal.Basic (1469 of 2154)
PASS: lldb-unit :: Utility/./UtilityTests/ScalarTest.TruncOrExtendTo (1470 of 2154)
PASS: lldb-shell :: SymbolFile/NativePDB/globals-fundamental.cpp (1471 of 2154)
PASS: lldb-api :: commands/target/stop-hooks/TestStopHooks.py (1472 of 2154)
PASS: lldb-unit :: Utility/./UtilityTests/StringExtractorTest.GetU64LittleEndian (1473 of 2154)
UNSUPPORTED: lldb-shell :: SymbolFile/PDB/enums-layout.test (1474 of 2154)
PASS: lldb-api :: functionalities/breakpoint/hardware_breakpoints/require_hw_breakpoints/TestRequireHWBreakpoints.py (1475 of 2154)
PASS: lldb-api :: lang/objc/modules-non-objc-target/TestObjCModulesNonObjCTarget.py (1476 of 2154)
PASS: lldb-api :: commands/watchpoints/watchpoint_events/TestWatchpointEvents.py (1477 of 2154)
PASS: lldb-unit :: ScriptInterpreter/Python/./ScriptInterpreterPythonTests/PythonDataObjectsTest.TestPythonStringToStructuredString (1478 of 2154)
PASS: lldb-api :: lang/objc/modules-cache/TestClangModulesCache.py (1479 of 2154)
PASS: lldb-unit :: SymbolFile/DWARF/./SymbolFileDWARFTests/SymbolFileDWARFTests.ParseAranges (1480 of 2154)
PASS: lldb-unit :: Utility/./UtilityTests/StringListTest.JoinMultiCharSeparator (1481 of 2154)
PASS: lldb-api :: functionalities/multidebugger_commands/TestMultipleDebuggersCommands.py (1482 of 2154)
PASS: lldb-api :: sample_test/TestSampleInlineTest.py (1483 of 2154)
PASS: lldb-api :: functionalities/data-formatter/data-formatter-smart-array/TestDataFormatterSmartArray.py (1484 of 2154)
PASS: lldb-unit :: Utility/./UtilityTests/ArgsTest.GetQuotedCommandString (1485 of 2154)
PASS: lldb-unit :: ScriptInterpreter/Python/./ScriptInterpreterPythonTests/PythonDataObjectsTest.TestModuleNameResolutionNoDot (1486 of 2154)
PASS: lldb-shell :: Settings/TestSettingsWrite.test (1487 of 2154)
PASS: lldb-unit :: Utility/./UtilityTests/Flags.IsClear (1488 of 2154)
PASS: lldb-api :: python_api/section/TestSectionAPI.py (1489 of 2154)
PASS: lldb-shell :: Process/Optimization.test (1490 of 2154)
UNSUPPORTED: lldb-api :: functionalities/darwin_log/filter/regex/activity-chain/TestDarwinLogFilterRegexActivityChain.py (1491 of 2154)
PASS: lldb-unit :: Utility/./UtilityTests/StringListTest.Join (1492 of 2154)
PASS: lldb-api :: functionalities/target-new-solib-notifications/TestModuleLoadedNotifys.py (1493 of 2154)
PASS: lldb-api :: lang/cpp/template/TestTemplateArgs.py (1494 of 2154)
PASS: lldb-unit :: Utility/./UtilityTests/FileSpecTest.EqualDotsPosixRoot (1495 of 2154)
PASS: lldb-api :: functionalities/paths/TestPaths.py (1496 of 2154)
PASS: lldb-unit :: Utility/./UtilityTests/RangeTest.ContainsRange (1497 of 2154)
PASS: lldb-unit :: Expression/./ExpressionTests/CppModuleConfigurationTest.IgnoreLibStdCpp (1498 of 2154)
PASS: lldb-unit :: Utility/./UtilityTests/StreamTeeTest.Flush (1499 of 2154)
PASS: lldb-unit :: Utility/./UtilityTests/UriParserTest.SchemeHostSeparator (1500 of 2154)
PASS: lldb-unit :: Utility/./UtilityTests/StringExtractorTest.InitEmpty (1501 of 2154)
PASS: lldb-api :: functionalities/memory/cache/TestMemoryCache.py (1502 of 2154)
PASS: lldb-api :: lang/cpp/enum_types/TestCPP11EnumTypes.py (1503 of 2154)
PASS: lldb-unit :: Utility/./UtilityTests/StreamTest.PutCharNull (1504 of 2154)
UNSUPPORTED: lldb-shell :: Register/x86-zmm-write.test (1505 of 2154)
PASS: lldb-unit :: Process/minidump/./LLDBMinidumpTests/RegisterContextMinidump.ConvertMinidumpContext_x86_64 (1506 of 2154)
PASS: lldb-unit :: Utility/./UtilityTests/ConstStringTest.format_provider (1507 of 2154)
PASS: lldb-api :: lang/objc/objc-struct-argument/TestObjCStructArgument.py (1508 of 2154)
PASS: lldb-api :: commands/expression/import-std-module/vector-of-vectors/TestVectorOfVectorsFromStdModule.py (1509 of 2154)
PASS: lldb-api :: commands/expression/completion-in-lambda-and-unnamed-class/TestCompletionInLambdaAndUnnamedClass.py (1510 of 2154)
PASS: lldb-api :: functionalities/thread/create_after_attach/TestCreateAfterAttach.py (1511 of 2154)
PASS: lldb-unit :: UnwindAssembly/x86/./UnwindAssemblyx86Tests/Testx86AssemblyInspectionEngine.TestPushR15 (1512 of 2154)
PASS: lldb-unit :: DataFormatter/./LLDBFormatterTests/FormatManagerTests.CompatibleLangs (1513 of 2154)
PASS: lldb-unit :: Utility/./UtilityTests/UriParserTest.BracketedHostnameWithPortIPv4 (1514 of 2154)
PASS: lldb-shell :: Minidump/Windows/broken-unwind.test (1515 of 2154)
PASS: lldb-shell :: Minidump/no-process-id.yaml (1516 of 2154)
PASS: lldb-api :: functionalities/gdb_remote_client/TestWasm.py (1517 of 2154)
PASS: lldb-shell :: SymbolFile/DWARF/childless-compile-unit.s (1518 of 2154)
PASS: lldb-unit :: Utility/./UtilityTests/UriParserTest.SchemeHostSeparator4 (1519 of 2154)
PASS: lldb-api :: functionalities/data-formatter/data-formatter-synthtype/TestDataFormatterSynthType.py (1520 of 2154)
PASS: lldb-unit :: UnwindAssembly/x86/./UnwindAssemblyx86Tests/Testx86AssemblyInspectionEngine.TestSpillRegToStackViaMOVx86_64 (1521 of 2154)
PASS: lldb-unit :: Utility/./UtilityTests/RangeTest.Constructor (1522 of 2154)
PASS: lldb-unit :: Core/./LLDBCoreTests/StreamCallbackTest.Callback (1523 of 2154)
PASS: lldb-unit :: Expression/./ExpressionTests/CppModuleConfigurationTest.MissingLibCpp (1524 of 2154)
PASS: lldb-api :: commands/apropos/basic/TestApropos.py (1525 of 2154)
PASS: lldb-unit :: Utility/./UtilityTests/FileSpecTest.EqualDotsWindows (1526 of 2154)
PASS: lldb-api :: python_api/sblaunchinfo/TestSBLaunchInfo.py (1527 of 2154)
PASS: lldb-shell :: ObjectFile/MachO/symtab.yaml (1528 of 2154)
XFAIL: lldb-shell :: SymbolFile/DWARF/find-type-in-function.cpp (1529 of 2154)
UNSUPPORTED: lldb-api :: macosx/macCatalystAppMacOSFramework/TestMacCatalystAppWithMacOSFramework.py (1530 of 2154)
PASS: lldb-unit :: ScriptInterpreter/Python/./ScriptInterpreterPythonTests/PythonDataObjectsTest.TestPythonTupleInitializerList2 (1531 of 2154)
PASS: lldb-unit :: Utility/./UtilityTests/PassiveReplayTest.InstrumentedBar (1532 of 2154)
PASS: lldb-api :: functionalities/breakpoint/step_over_breakpoint/TestStepOverBreakpoint.py (1533 of 2154)
PASS: lldb-unit :: Symbol/./SymbolTests/DWARFCallFrameInfoTest.Basic_eh (1534 of 2154)
PASS: lldb-shell :: Driver/LocalLLDBInit.test (1535 of 2154)
PASS: lldb-api :: commands/expression/two-files/TestObjCTypeQueryFromOtherCompileUnit.py (1536 of 2154)
PASS: lldb-api :: functionalities/data-formatter/data-formatter-objc/TestDataFormatterObjCCF.py (1537 of 2154)
PASS: lldb-shell :: SymbolFile/DWARF/apple-index-is-used.cpp (1538 of 2154)
PASS: lldb-unit :: Utility/./UtilityTests/FileSpecTest.PrependPathComponent (1539 of 2154)
PASS: lldb-unit :: Utility/./UtilityTests/FileSpecTest.RemoveLastPathComponent (1540 of 2154)
PASS: lldb-unit :: Utility/./UtilityTests/ArchSpecTest.Compatibility (1541 of 2154)
PASS: lldb-unit :: Utility/./UtilityTests/UriParserTest.MinimalPort (1542 of 2154)
PASS: lldb-api :: functionalities/plugins/python_os_plugin/TestPythonOSPlugin.py (1543 of 2154)
PASS: lldb-unit :: Host/./HostTests/File.GetWaitableHandleFileno (1544 of 2154)
PASS: lldb-unit :: Interpreter/./InterpreterTests/CompletionTest.FileCompletionAbsolute (1545 of 2154)
PASS: lldb-api :: macosx/thread-names/TestInterruptThreadNames.py (1546 of 2154)
PASS: lldb-unit :: Utility/./UtilityTests/LogTest.Unregister (1547 of 2154)
PASS: lldb-api :: functionalities/type_completion/TestTypeCompletion.py (1548 of 2154)
PASS: lldb-api :: commands/expression/import-std-module/conflicts/TestStdModuleWithConflicts.py (1549 of 2154)
PASS: lldb-shell :: Reproducer/TestCaptureEnvOverride.test (1550 of 2154)
PASS: lldb-shell :: Reproducer/TestDiscard.test (1551 of 2154)
PASS: lldb-unit :: Utility/./UtilityTests/StringExtractorTest.GetNameColonValueContainsColon (1552 of 2154)
PASS: lldb-api :: python_api/lldbutil/iter/TestLLDBIterator.py (1553 of 2154)
PASS: lldb-api :: lang/c/bitfields/TestBitfields.py (1554 of 2154)
PASS: lldb-unit :: Utility/./UtilityTests/ArgsTest.StringListConstructor (1555 of 2154)
UNSUPPORTED: lldb-shell :: Register/x86-64-ymm16-read.test (1556 of 2154)
PASS: lldb-shell :: ObjectFile/PECOFF/basic-info-arm64.yaml (1557 of 2154)
UNSUPPORTED: lldb-api :: functionalities/breakpoint/hardware_breakpoints/hardware_breakpoint_on_multiple_threads/TestHWBreakMultiThread.py (1558 of 2154)
UNSUPPORTED: lldb-api :: functionalities/breakpoint/breakpoint_in_delayslot/TestAvoidBreakpointInDelaySlot.py (1559 of 2154)
PASS: lldb-api :: commands/expression/anonymous-struct/TestCallUserAnonTypedef.py (1560 of 2154)
PASS: lldb-shell :: SymbolFile/NativePDB/bitfields.cpp (1561 of 2154)
PASS: lldb-unit :: Host/./HostTests/SocketTest.DomainGetConnectURI (1562 of 2154)
PASS: lldb-unit :: Language/Highlighting/./HighlighterTests/HighlighterTest.FallbackHighlighter (1563 of 2154)
PASS: lldb-unit :: UnwindAssembly/x86/./UnwindAssemblyx86Tests/Testx86AssemblyInspectionEngine.TestStackRealignMSVC_i386 (1564 of 2154)
PASS: lldb-unit :: Utility/./UtilityTests/ArgsTest.TestUnknownEscape (1565 of 2154)
PASS: lldb-unit :: ObjectFile/Breakpad/./ObjectFileBreakpadTests/Record.classify (1566 of 2154)
PASS: lldb-unit :: UnwindAssembly/x86/./UnwindAssemblyx86Tests/Testx86AssemblyInspectionEngine.TestDisassemblyJunkBytes (1567 of 2154)
PASS: lldb-unit :: UnwindAssembly/x86/./UnwindAssemblyx86Tests/Testx86AssemblyInspectionEngine.TestPushR14 (1568 of 2154)
PASS: lldb-unit :: ScriptInterpreter/Python/./ScriptInterpreterPythonTests/PythonDataObjectsTest.TestBorrowedReferences (1569 of 2154)
PASS: lldb-api :: functionalities/completion/TestCompletion.py (1570 of 2154)
PASS: lldb-shell :: Commands/command-target-modules-dump-sections.yaml (1571 of 2154)
PASS: lldb-api :: commands/expression/result_numbering/TestResultNumbering.py (1572 of 2154)
PASS: lldb-api :: lang/objc/radar-9691614/TestObjCMethodReturningBOOL.py (1573 of 2154)
PASS: lldb-api :: functionalities/breakpoint/address_breakpoints/TestBadAddressBreakpoints.py (1574 of 2154)
PASS: lldb-api :: functionalities/gdb_remote_client/TestThreadSelectionBug.py (1575 of 2154)
PASS: lldb-unit :: Utility/./UtilityTests/StringListTest.JoinSingle (1576 of 2154)
UNSUPPORTED: lldb-api :: functionalities/unwind/ehframe/TestEhFrameUnwind.py (1577 of 2154)
PASS: lldb-unit :: Utility/./UtilityTests/StreamTeeTest.SetStreamAtIndexOverwrite (1578 of 2154)
UNSUPPORTED: lldb-shell :: Expr/TestIRMemoryMapWindows.test (1579 of 2154)
PASS: lldb-unit :: Host/./HostTests/ConnectionFileDescriptorTest.TCPGetURIv4 (1580 of 2154)
PASS: lldb-unit :: SymbolFile/NativePDB/./SymbolFileNativePDBTests/PDBFPOProgramToDWARFExpressionTests.MultipleDependentAssignments (1581 of 2154)
PASS: lldb-shell :: SymbolFile/DWARF/find-qualified-variable.cpp (1582 of 2154)
PASS: lldb-api :: functionalities/tail_call_frames/thread_step_out_message/TestArtificialFrameStepOutMessage.py (1583 of 2154)
PASS: lldb-unit :: Utility/./UtilityTests/StringExtractorTest.GetHexBytesAvail_Partial (1584 of 2154)
PASS: lldb-api :: functionalities/load_using_paths/TestLoadUsingPaths.py (1585 of 2154)
PASS: lldb-api :: functionalities/ubsan/basic/TestUbsanBasic.py (1586 of 2154)
PASS: lldb-unit :: Expression/./ExpressionTests/DiagnosticManagerTest.PutStringSeverities (1587 of 2154)
PASS: lldb-unit :: Language/Highlighting/./HighlighterTests/HighlighterTest.ClangSquareBrackets (1588 of 2154)
FAIL: lldb-api :: functionalities/gdb_remote_client/TestGDBRemoteLoad.py (1589 of 2154)
******************** TEST 'lldb-api :: functionalities/gdb_remote_client/TestGDBRemoteLoad.py' FAILED ********************
Script:
--
/usr/local/Frameworks/Python.framework/Versions/3.7/bin/python3.7 /Users/buildslave/jenkins/workspace/lldb-cmake/llvm-project/lldb/test/API/dotest.py -s /Users/buildslave/jenkins/workspace/lldb-cmake/lldb-build/lldb-test-traces -S nm -u CXXFLAGS -u CFLAGS --codesign-identity - --server /Users/buildslave/jenkins/workspace/lldb-cmake/lldb-build/./bin/debugserver --arch x86_64 --build-dir /Users/buildslave/jenkins/workspace/lldb-cmake/lldb-build/lldb-test-build.noindex -s=/Users/buildslave/jenkins/workspace/lldb-cmake/test/logs -t --env TERM=vt100 --env LLVM_LIBS_DIR=/Users/buildslave/jenkins/workspace/lldb-cmake/lldb-build/./lib --arch x86_64 --build-dir /Users/buildslave/jenkins/workspace/lldb-cmake/lldb-build/lldb-test-build.noindex --lldb-module-cache-dir /Users/buildslave/jenkins/workspace/lldb-cmake/lldb-build/lldb-test-build.noindex/module-cache-lldb/lldb-api --clang-module-cache-dir /Users/buildslave/jenkins/workspace/lldb-cmake/lldb-build/lldb-test-build.noindex/module-cache-clang/lldb-api --executable /Users/buildslave/jenkins/workspace/lldb-cmake/lldb-build/./bin/lldb --compiler /Users/buildslave/jenkins/workspace/lldb-cmake/lldb-build/./bin/clang --dsymutil /Users/buildslave/jenkins/workspace/lldb-cmake/lldb-build/./bin/dsymutil --filecheck /Users/buildslave/jenkins/workspace/lldb-cmake/lldb-build/./bin/FileCheck --yaml2obj /Users/buildslave/jenkins/workspace/lldb-cmake/lldb-build/./bin/yaml2obj --lldb-libs-dir /Users/buildslave/jenkins/workspace/lldb-cmake/lldb-build/./lib /Users/buildslave/jenkins/workspace/lldb-cmake/llvm-project/lldb/test/API/functionalities/gdb_remote_client -p TestGDBRemoteLoad.py
--
Exit Code: 1

Hide Details

Command Output (stdout): -- lldb version 12.0.99 clang revision 5dbf80cad9556e222c4383960007fc0b27ea9541 llvm revision 5dbf80cad9556e222c4383960007fc0b27ea9541 libstdcxx tests will not be run because: Don't know how to build with libstdcxx on macosx Skipping following debug info categories: ['dwo']

Hide Details

-- Command Output (stderr): --

Hide Details

Session logs for test failures/errors/unexpected successes will go into directory '/Users/buildslave/jenkins/workspace/lldb-cmake/test/logs' Change dir to: /Users/buildslave/jenkins/workspace/lldb-cmake/llvm-project/lldb/test/API/functionalities/gdb_remote_client runCmd: settings clear -all output:

Hide Details

runCmd: settings set symbols.enable-external-lookup false output:

Hide Details

runCmd: settings set target.inherit-tcc true output:

Hide Details

runCmd: settings set target.auto-apply-fixits false output:

Hide Details

runCmd: settings set plugin.process.gdb-remote.packet-timeout 60 output:

Hide Details

runCmd: settings set symbols.clang-modules-cache-path "/Users/buildslave/jenkins/workspace/lldb-cmake/lldb-build/lldb-test-build.noindex/module-cache-lldb/lldb-api" output:

Hide Details

runCmd: settings set use-color false output:

Hide Details

runCmd: setting set target.prefer-dynamic-value no-dynamic-values output:

Hide Details

FAIL: LLDB (/Users/buildslave/jenkins/workspace/lldb-cmake/lldb-build/bin/clang-x86_64) :: test_flash_load (TestGDBRemoteLoad.TestGDBRemoteLoad) <bound method SBProcess.Kill of <lldb.SBProcess; proxy of <Swig Object of type 'lldb::SBProcess *' at 0x10e88c630> >>: success

Hide Details

runCmd: settings clear -all output:

Hide Details

runCmd: settings set symbols.enable-external-lookup false output:

Hide Details

runCmd: settings set target.inherit-tcc true output:

Hide Details

runCmd: settings set target.auto-apply-fixits false output:

Hide Details

runCmd: settings set plugin.process.gdb-remote.packet-timeout 60 output:

Hide Details

runCmd: settings set symbols.clang-modules-cache-path "/Users/buildslave/jenkins/workspace/lldb-cmake/lldb-build/lldb-test-build.noindex/module-cache-lldb/lldb-api" output:

Hide Details

runCmd: settings set use-color false output:

Hide Details

runCmd: setting set target.prefer-dynamic-value no-dynamic-values output:

Hide Details

<bound method SBProcess.Kill of <lldb.SBProcess; proxy of <Swig Object of type 'lldb::SBProcess *' at 0x107336c30> >>: success

Hide Details

PASS: LLDB (/Users/buildslave/jenkins/workspace/lldb-cmake/lldb-build/bin/clang-x86_64) :: test_module_load_address (TestGDBRemoteLoad.TestGDBRemoteLoad) runCmd: settings clear -all output:

Hide Details

runCmd: settings set symbols.enable-external-lookup false output:

Hide Details

runCmd: settings set target.inherit-tcc true output:

Hide Details

runCmd: settings set target.auto-apply-fixits false output:

Hide Details

runCmd: settings set plugin.process.gdb-remote.packet-timeout 60 output:

Hide Details

runCmd: settings set symbols.clang-modules-cache-path "/Users/buildslave/jenkins/workspace/lldb-cmake/lldb-build/lldb-test-build.noindex/module-cache-lldb/lldb-api" output:

Hide Details

runCmd: settings set use-color false output:

Hide Details

runCmd: setting set target.prefer-dynamic-value no-dynamic-values output:

Hide Details

<bound method SBProcess.Kill of <lldb.SBProcess; proxy of <Swig Object of type 'lldb::SBProcess *' at 0x10e88c690> >>: success

Hide Details

PASS: LLDB (/Users/buildslave/jenkins/workspace/lldb-cmake/lldb-build/bin/clang-x86_64) :: test_ram_load (TestGDBRemoteLoad.TestGDBRemoteLoad) Restore dir to: /Users/buildslave/jenkins/workspace/lldb-cmake/lldb-build/tools/lldb/test ====================================================================== FAIL: test_flash_load (TestGDBRemoteLoad.TestGDBRemoteLoad) Test loading an object file to a target's flash memory ---------------------------------------------------------------------- Traceback (most recent call last): File "/Users/buildslave/jenkins/workspace/lldb-cmake/llvm-project/lldb/test/API/functionalities/gdb_remote_client/TestGDBRemoteLoad.py", line 67, in test_flash_load process = self.connect(target) File "/Users/buildslave/jenkins/workspace/lldb-cmake/llvm-project/lldb/test/API/functionalities/gdb_remote_client/gdbclientutils.py", line 524, in connect self.assertTrue(error.Success(), error.description) AssertionError: False is not True : failed to get reply to handshake packet Config=x86_64-/Users/buildslave/jenkins/workspace/lldb-cmake/lldb-build/bin/clang ---------------------------------------------------------------------- Ran 3 tests in 100.132s

Hide Details

RESULT: FAILED (2 passes, 1 failures, 0 errors, 0 skipped, 0 expected failures, 0 unexpected successes)

Hide Details

--

Hide Details

******************** PASS: lldb-shell :: Reproducer/Modules/TestModuleCXX.test (1590 of 2154) PASS: lldb-api :: tools/lldb-server/TestGdbRemoteRegisterState.py (1591 of 2154) PASS: lldb-api :: commands/expression/save_jit_objects/TestSaveJITObjects.py (1592 of 2154) PASS: lldb-unit :: Host/./HostTests/FileActionTest.Open (1593 of 2154) PASS: lldb-api :: commands/expression/import-std-module/forward_list-dbg-info-content/TestDbgInfoContentForwardListFromStdModule.py (1594 of 2154) PASS: lldb-unit :: ObjectFile/Breakpad/./ObjectFileBreakpadTests/ModuleRecord.parse (1595 of 2154) PASS: lldb-unit :: debugserver/./debugserverTests/RNBSocket.LoopBackListenIPv6 (1596 of 2154) PASS: lldb-shell :: Commands/CommandScriptImmediateOutput/CommandScriptImmediateOutputConsole.test (1597 of 2154) PASS: lldb-shell :: SymbolFile/DWARF/find-method-local-struct.cpp (1598 of 2154) UNSUPPORTED: lldb-api :: commands/trace/TestTraceLoad.py (1599 of 2154) PASS: lldb-unit :: UnwindAssembly/x86/./UnwindAssemblyx86Tests/Testx86AssemblyInspectionEngine.Test64bitFramelessSmallStackFrame (1600 of 2154) PASS: lldb-api :: functionalities/tsan/global_location/TestTsanGlobalLocation.py (1601 of 2154) PASS: lldb-api :: functionalities/thread/concurrent_events/TestConcurrentTwoWatchpointThreads.py (1602 of 2154) PASS: lldb-unit :: Utility/./UtilityTests/VMRange.IsValid (1603 of 2154) UNSUPPORTED: lldb-shell :: Unwind/unwind-plan-dwarf-dump.test (1604 of 2154) PASS: lldb-unit :: ScriptInterpreter/Python/./ScriptInterpreterPythonTests/PythonDataObjectsTest.TestPythonIntegerToStr (1605 of 2154) PASS: lldb-shell :: Unwind/eh-frame-dwarf-unwind.test (1606 of 2154) PASS: lldb-unit :: Utility/./UtilityTests/BinaryStreamTest.PutSLEB128OneByte (1607 of 2154) PASS: lldb-api :: functionalities/breakpoint/comp_dir_symlink/TestCompDirSymLink.py (1608 of 2154) PASS: lldb-shell :: SymbolFile/DWARF/debug-types-dwo-cross-reference.cpp (1609 of 2154) PASS: lldb-api :: iohandler/autosuggestion/TestAutosuggestion.py (1610 of 2154) PASS: lldb-unit :: Utility/./UtilityTests/TimeoutTest.Format (1611 of 2154) PASS: lldb-api :: macosx/DBGSourcePathRemapping/TestDSYMSourcePathRemapping.py (1612 of 2154) UNSUPPORTED: lldb-api :: lang/cpp/printf/TestPrintf.py (1613 of 2154) PASS: lldb-unit :: UnwindAssembly/x86/./UnwindAssemblyx86Tests/Testx86AssemblyInspectionEngine.TestPushImm (1614 of 2154) XFAIL: lldb-shell :: Unwind/prefer-debug-over-eh-frame.test (1615 of 2154) PASS: lldb-unit :: Utility/./UtilityTests/BinaryStreamTest.PutSLEB128NineBytes (1616 of 2154) PASS: lldb-api :: functionalities/thread/concurrent_events/TestConcurrentSignalDelayBreak.py (1617 of 2154) PASS: lldb-unit :: UnwindAssembly/x86/./UnwindAssemblyx86Tests/Testx86AssemblyInspectionEngine.Testi386IgnoredRegisters (1618 of 2154) PASS: lldb-shell :: ObjectFile/ELF/section-addresses.yaml (1619 of 2154) PASS: lldb-api :: lang/cpp/breakpoint_in_member_func_w_non_primitive_params/TestBreakpointInMemberFuncWNonPrimitiveParams.py (1620 of 2154) PASS: lldb-api :: functionalities/thread/crash_during_step/TestCrashDuringStep.py (1621 of 2154) PASS: lldb-unit :: DataFormatter/./LLDBFormatterTests/TypeMatcherTests.CreatedBySameMatchString (1622 of 2154) PASS: lldb-unit :: Utility/./UtilityTests/SerializationRountripTest.SerializeDeserializeCStringArray (1623 of 2154) PASS: lldb-shell :: SymbolFile/NativePDB/global-classes.cpp (1624 of 2154) PASS: lldb-unit :: Process/gdb-remote/./ProcessGdbRemoteTests/GDBRemoteCommunicationServerTest.SendErrorResponse_UnimplementedError (1625 of 2154) PASS: lldb-shell :: Driver/TestNoUseColor.test (1626 of 2154) PASS: lldb-unit :: Process/minidump/./LLDBMinidumpTests/MinidumpParserTest.GetThreadContext_x86_32_wow64 (1627 of 2154) UNSUPPORTED: lldb-shell :: SymbolFile/target-symbols-add-unwind.test (1628 of 2154) PASS: lldb-api :: commands/process/launch-with-shellexpand/TestLaunchWithShellExpand.py (1629 of 2154) PASS: lldb-unit :: Process/minidump/./LLDBMinidumpTests/MinidumpParserTest.GetThreadContext_x86_32 (1630 of 2154) PASS: lldb-api :: lang/cpp/inlines/TestInlines.py (1631 of 2154) PASS: lldb-api :: commands/frame/language/TestGuessLanguage.py (1632 of 2154) PASS: lldb-unit :: Utility/./UtilityTests/StringListTest.CopyListSingle (1633 of 2154) PASS: lldb-unit :: Process/gdb-remote/./ProcessGdbRemoteTests/GDBRemoteCommunicationServerTest.SendErrorResponse_Status (1634 of 2154) PASS: lldb-api :: lang/cpp/constructors/TestCppConstructors.py (1635 of 2154) PASS: lldb-unit :: Expression/./ExpressionTests/CppModuleConfigurationTest.LinuxLocalLibCpp (1636 of 2154) PASS: lldb-unit :: Utility/./UtilityTests/PassiveReplayTest.InstrumentedBarPtr (1637 of 2154) PASS: lldb-api :: python_api/lldbutil/iter/TestRegistersIterator.py (1638 of 2154) PASS: lldb-api :: commands/session/save/TestSessionSave.py (1639 of 2154) PASS: lldb-unit :: Process/minidump/./LLDBMinidumpTests/MinidumpParserTest.GetArchitecture (1640 of 2154) PASS: lldb-api :: macosx/find-app-in-bundle/TestFindAppInBundle.py (1641 of 2154) PASS: lldb-unit :: Utility/./UtilityTests/DataExtractorTest.GetCStrAtEnd (1642 of 2154) PASS: lldb-unit :: Utility/./UtilityTests/StringListTest.LongestCommonPrefixEmpty (1643 of 2154) UNSUPPORTED: lldb-api :: benchmarks/frame_variable/TestFrameVariableResponse.py (1644 of 2154) PASS: lldb-unit :: Utility/./UtilityTests/ScalarTest.SetValueFromData (1645 of 2154) PASS: lldb-unit :: ScriptInterpreter/Python/./ScriptInterpreterPythonTests/PythonDataObjectsTest.TestPythonTupleInitializerList (1646 of 2154) UNSUPPORTED: lldb-api :: commands/target/auto-install-main-executable/TestAutoInstallMainExecutable.py (1647 of 2154) PASS: lldb-api :: lang/cpp/symbols/TestSymbols.py (1648 of 2154) PASS: lldb-shell :: SymbolFile/NativePDB/function-types-builtins.cpp (1649 of 2154) UNSUPPORTED: lldb-api :: functionalities/unwind/standard/TestStandardUnwind.py (1650 of 2154) PASS: lldb-unit :: Process/minidump/./LLDBMinidumpTests/RegisterContextMinidump.ConvertMinidumpContext_x86_32 (1651 of 2154) PASS: lldb-api :: tools/lldb-vscode/breakpoint/TestVSCode_setExceptionBreakpoints.py (1652 of 2154) PASS: lldb-api :: functionalities/data-formatter/data-formatter-stl/libcxx/deque/TestDataFormatterLibcxxDeque.py (1653 of 2154) PASS: lldb-unit :: Utility/./UtilityTests/ArgsTest.GetArgumentArrayRef (1654 of 2154) PASS: lldb-api :: lang/cpp/extern_c/TestExternCSymbols.py (1655 of 2154) PASS: lldb-api :: types/TestCharTypeExpr.py (1656 of 2154) PASS: lldb-unit :: Symbol/./SymbolTests/TestClangASTImporter.MetadataPropagationIndirectImport (1657 of 2154) PASS: lldb-api :: commands/expression/rdar44436068/Test128BitsInteger.py (1658 of 2154) PASS: lldb-api :: lang/c/strings/TestCStrings.py (1659 of 2154) PASS: lldb-unit :: Utility/./UtilityTests/StringListTest.ForRange (1660 of 2154) PASS: lldb-shell :: SymbolFile/Breakpad/line-table-mixed-path-styles.test (1661 of 2154) PASS: lldb-api :: functionalities/breakpoint/serialize/TestBreakpointSerialization.py (1662 of 2154) PASS: lldb-api :: functionalities/data-formatter/data-formatter-objc/TestDataFormatterObjCNSURL.py (1663 of 2154) PASS: lldb-shell :: SymbolFile/DWARF/debug-line-basic.s (1664 of 2154) PASS: lldb-unit :: Symbol/./SymbolTests/TestTypeSystemClang.TestOwningModule (1665 of 2154) PASS: lldb-shell :: ObjectFile/ELF/section-types.yaml (1666 of 2154) PASS: lldb-unit :: SymbolFile/NativePDB/./SymbolFileNativePDBTests/PDBFPOProgramToDWARFExpressionTests.UnresolvedCyclicRegisterAssignmentReference (1667 of 2154) PASS: lldb-unit :: Utility/./UtilityTests/RegularExpression.CopyAssignment (1668 of 2154) PASS: lldb-unit :: ObjectFile/ELF/./ObjectFileELFTests/ObjectFileELFTest.GetSymtab_NoSymEntryPointArmAddressClass (1669 of 2154) PASS: lldb-unit :: Utility/./UtilityTests/Flags.AnySet (1670 of 2154) PASS: lldb-api :: functionalities/value_md5_crash/TestValueMD5Crash.py (1671 of 2154) PASS: lldb-unit :: Process/gdb-remote/./ProcessGdbRemoteTests/GDBRemoteCommunicationClientTest.SaveRestoreRegistersNoSuffix (1672 of 2154) PASS: lldb-unit :: Utility/./UtilityTests/OptionsWithRawTest.WhitespaceSuffix (1673 of 2154) PASS: lldb-api :: functionalities/inferior-crashing/TestInferiorCrashingStep.py (1674 of 2154) PASS: lldb-unit :: UnwindAssembly/x86/./UnwindAssemblyx86Tests/Testx86AssemblyInspectionEngine.TestSimple32bitFrameFunction (1675 of 2154) PASS: lldb-unit :: Utility/./UtilityTests/RecordReplayTest.InstrumentedFoo (1676 of 2154) PASS: lldb-api :: tools/lldb-server/TestGdbRemoteExpeditedRegisters.py (1677 of 2154) PASS: lldb-unit :: ScriptInterpreter/Python/./ScriptInterpreterPythonTests/PythonDataObjectsTest.TestPythonCallableInvoke (1678 of 2154) PASS: lldb-api :: lang/objc/print-obj/TestPrintObj.py (1679 of 2154) PASS: lldb-unit :: Symbol/./SymbolTests/TestClangASTImporter.MetadataPropagationAfterCopying (1680 of 2154) PASS: lldb-shell :: SymbolFile/NativePDB/ast-types.cpp (1681 of 2154) UNSUPPORTED: lldb-api :: functionalities/data-formatter/data-formatter-stl/libstdcpp/unique_ptr/TestDataFormatterStdUniquePtr.py (1682 of 2154) PASS: lldb-api :: python_api/file_handle/TestFileHandle.py (1683 of 2154) PASS: lldb-unit :: Utility/./UtilityTests/BinaryStreamTest.PutULEB128EightBytes (1684 of 2154) PASS: lldb-shell :: ObjectFile/MachO/lc_version_min.yaml (1685 of 2154) PASS: lldb-unit :: Symbol/./SymbolTests/PostfixExpression.ParseFPOProgram (1686 of 2154) PASS: lldb-shell :: Commands/command-disassemble.s (1687 of 2154) UNSUPPORTED: lldb-shell :: Register/x86-64-ymm16-write.test (1688 of 2154) PASS: lldb-api :: macosx/thread_suspend/TestInternalThreadSuspension.py (1689 of 2154) PASS: lldb-api :: lang/c/local_types/TestUseClosestType.py (1690 of 2154) PASS: lldb-api :: functionalities/breakpoint/auto_continue/TestBreakpointAutoContinue.py (1691 of 2154) PASS: lldb-api :: macosx/safe-to-func-call/TestSafeFuncCalls.py (1692 of 2154) PASS: lldb-api :: functionalities/data-formatter/stringprinter/TestStringPrinter.py (1693 of 2154) PASS: lldb-api :: functionalities/avoids-fd-leak/TestFdLeak.py (1694 of 2154) PASS: lldb-api :: functionalities/memory/read/TestMemoryRead.py (1695 of 2154) PASS: lldb-unit :: Utility/./UtilityTests/StringListTest.AppendStringStdString (1696 of 2154) PASS: lldb-shell :: Driver/TestFile.test (1697 of 2154) PASS: lldb-shell :: SymbolFile/DWARF/split-dwarf-multiple-cu.ll (1698 of 2154) PASS: lldb-api :: tools/lldb-server/register-reading/TestGdbRemoteGPacket.py (1699 of 2154) PASS: lldb-unit :: Utility/./UtilityTests/BinaryStreamTest.PutULEB128Zero (1700 of 2154) PASS: lldb-unit :: Utility/./UtilityTests/StringExtractorTest.GetHexU8_Exact (1701 of 2154) PASS: lldb-api :: functionalities/pointer_num_children/TestPointerNumChildren.py (1702 of 2154) PASS: lldb-api :: functionalities/data-formatter/data-formatter-stl/libcxx/tuple/TestDataFormatterLibcxxTuple.py (1703 of 2154) PASS: lldb-unit :: Utility/./UtilityTests/GeneratorTest.Create (1704 of 2154) PASS: lldb-unit :: Utility/./UtilityTests/StatusTest.ErrorConversion (1705 of 2154) PASS: lldb-shell :: ObjectFile/Breakpad/sections.test (1706 of 2154) PASS: lldb-api :: lang/c/conflicting-symbol/TestConflictingSymbol.py (1707 of 2154) UNSUPPORTED: lldb-api :: benchmarks/turnaround/TestCompileRunToBreakpointTurnaround.py (1708 of 2154) PASS: lldb-unit :: Language/CPlusPlus/./LanguageCPlusPlusTests/CPlusPlusLanguage.MethodNameParsing (1709 of 2154) UNSUPPORTED: lldb-api :: commands/expression/completion-crash-invalid-iterator/TestInvalidIteratorCompletionCrash.py (1710 of 2154) PASS: lldb-api :: functionalities/thread/concurrent_events/TestConcurrentDelayedCrashWithBreakpointSignal.py (1711 of 2154) PASS: lldb-unit :: Utility/./UtilityTests/TimeoutTest.Construction (1712 of 2154) PASS: lldb-api :: lang/objc/objc-static-method-stripped/TestObjCStaticMethodStripped.py (1713 of 2154) PASS: lldb-api :: functionalities/data-formatter/nsarraysynth/TestNSArraySynthetic.py (1714 of 2154) UNSUPPORTED: lldb-api :: tools/lldb-server/TestGdbRemoteCompletion.py (1715 of 2154) PASS: lldb-shell :: SymbolFile/DWARF/DW_OP_piece-smaller-than-struct.s (1716 of 2154) PASS: lldb-unit :: Utility/./UtilityTests/StringListTest.LongestCommonPrefixSingleElement (1717 of 2154) PASS: lldb-shell :: Process/UnsupportedLanguage.test (1718 of 2154) PASS: lldb-api :: commands/target/create-no-such-arch/TestNoSuchArch.py (1719 of 2154) PASS: lldb-shell :: SymbolFile/DWARF/inline-function-address.ll (1720 of 2154) PASS: lldb-api :: functionalities/pre_run_dylibs/TestPreRunDylibs.py (1721 of 2154) PASS: lldb-unit :: Core/./LLDBCoreTests/RichManglingContextTest.FromCxxMethodName (1722 of 2154) PASS: lldb-shell :: Reproducer/TestVerify.test (1723 of 2154) PASS: lldb-unit :: Utility/./UtilityTests/UUIDTest.SetFromStringRef (1724 of 2154) PASS: lldb-api :: functionalities/signal/TestSendSignal.py (1725 of 2154) UNSUPPORTED: lldb-shell :: ExecControl/StopHook/stop-hook-threads.test (1726 of 2154) PASS: lldb-shell :: Process/TestAbortExitCode.test (1727 of 2154) PASS: lldb-api :: commands/log/basic/TestLogging.py (1728 of 2154) PASS: lldb-unit :: Utility/./UtilityTests/ArchSpecTest.MergeFromMachOUnknown (1729 of 2154) UNSUPPORTED: lldb-api :: python_api/event/TestEvents.py (1730 of 2154) PASS: lldb-unit :: Utility/./UtilityTests/StringExtractorTest.GetHexBytesAvail_Underflow (1731 of 2154) PASS: lldb-api :: lang/objc/conflicting-definition/TestConflictingDefinition.py (1732 of 2154) PASS: lldb-unit :: Expression/./ExpressionTests/CppModuleConfigurationTest.Xcode (1733 of 2154) PASS: lldb-unit :: Process/minidump/./LLDBMinidumpTests/MinidumpParserTest.GetMiscInfoWindows (1734 of 2154) PASS: lldb-unit :: Host/./HostTests/NativeProcessProtocolTest.ReadCStringFromMemory_MaxSize (1735 of 2154) PASS: lldb-unit :: Process/minidump/./LLDBMinidumpTests/MinidumpParserTest.GetLinuxProcStatus_no_stream (1736 of 2154) PASS: lldb-api :: commands/frame/diagnose/dereference-function-return/TestDiagnoseDereferenceFunctionReturn.py (1737 of 2154) PASS: lldb-unit :: Utility/./UtilityTests/Predicate.WaitForValueEqualTo (1738 of 2154) PASS: lldb-unit :: Utility/./UtilityTests/RangeTest.NotEqualInvalid (1739 of 2154) PASS: lldb-api :: functionalities/gdb_remote_client/TestArmRegisterDefinition.py (1740 of 2154) PASS: lldb-api :: lang/cpp/stl/TestSTL.py (1741 of 2154) PASS: lldb-api :: python_api/objc_type/TestObjCType.py (1742 of 2154) PASS: lldb-unit :: Utility/./UtilityTests/StreamTest.PutHex16ByteOrderLittle (1743 of 2154) PASS: lldb-unit :: Expression/./ExpressionTests/DiagnosticManagerTest.FixedExpression (1744 of 2154) PASS: lldb-api :: lang/cpp/class_types/TestClassTypesDisassembly.py (1745 of 2154) PASS: lldb-unit :: Process/gdb-remote/./ProcessGdbRemoteTests/GDBRemoteClientBaseTest.SendPacketAndReceiveResponseWithOutputSupport (1746 of 2154) PASS: lldb-api :: lang/c/shared_lib/TestSharedLib.py (1747 of 2154) PASS: lldb-unit :: ObjectFile/PECOFF/./ObjectFilePECOFFTests/PECallFrameInfoTest.Chained_eh (1748 of 2154) PASS: lldb-unit :: Utility/./UtilityTests/RangeDataVector.FindEntryThatContains_Overlap (1749 of 2154) PASS: lldb-unit :: Utility/./UtilityTests/SubsystemRAIITest.NormalSubsystem (1750 of 2154) PASS: lldb-unit :: Utility/./UtilityTests/XcodeSDKTest.ParseTest (1751 of 2154) PASS: lldb-unit :: Symbol/./SymbolTests/Type.CompilerContextPattern (1752 of 2154) PASS: lldb-api :: commands/expression/dont_allow_jit/TestAllowJIT.py (1753 of 2154) PASS: lldb-api :: functionalities/thread/concurrent_events/TestConcurrentManyCrash.py (1754 of 2154) PASS: lldb-unit :: Utility/./UtilityTests/StringListTest.SetSize (1755 of 2154) PASS: lldb-unit :: Language/Highlighting/./HighlighterTests/HighlighterTest.ClangComments (1756 of 2154) PASS: lldb-shell :: SymbolFile/DWARF/find-basic-type.cpp (1757 of 2154) PASS: lldb-api :: commands/command/nested_alias/TestNestedAlias.py (1758 of 2154) PASS: lldb-unit :: Utility/./UtilityTests/RangeTest.LessThanInvalid (1759 of 2154) PASS: lldb-unit :: Utility/./UtilityTests/EventTest.DumpEventDataBytes (1760 of 2154) UNSUPPORTED: lldb-api :: functionalities/data-formatter/data-formatter-stl/libstdcpp/string/TestDataFormatterStdString.py (1761 of 2154) PASS: lldb-unit :: Utility/./UtilityTests/FileSpecTest.FormatFileSpec (1762 of 2154) PASS: lldb-api :: commands/expression/import_base_class_when_class_has_derived_member/TestImportBaseClassWhenClassHasDerivedMember.py (1763 of 2154) PASS: lldb-unit :: Utility/./UtilityTests/DataExtractorTest.PeekData (1764 of 2154) PASS: lldb-unit :: Core/./LLDBCoreTests/ModuleSpecTest.InvalidInMemoryBuffer (1765 of 2154) PASS: lldb-unit :: Host/./HostTests/SocketTest.UDPConnect (1766 of 2154) PASS: lldb-unit :: SymbolFile/NativePDB/./SymbolFileNativePDBTests/PDBFPOProgramToDWARFExpressionTests.UnresolvedRegisterAssignmentReference (1767 of 2154) PASS: lldb-shell :: Register/x86-64-ymm-read.test (1768 of 2154) PASS: lldb-unit :: Utility/./UtilityTests/ProcessInfoTest.Constructor (1769 of 2154) PASS: lldb-api :: functionalities/data-formatter/nssetsynth/TestNSSetSynthetic.py (1770 of 2154) PASS: lldb-shell :: Expr/TestIRMemoryMap.test (1771 of 2154) PASS: lldb-unit :: Language/Highlighting/./HighlighterTests/HighlighterTest.ClangOperators (1772 of 2154) PASS: lldb-unit :: Utility/./UtilityTests/ArgsTest.TestMultipleArgs (1773 of 2154) PASS: lldb-unit :: Expression/./ExpressionTests/CppModuleConfigurationTest.MissingUsrInclude (1774 of 2154) PASS: lldb-unit :: Utility/./UtilityTests/SerializationRountripTest.SerializeDeserializeObjectReference (1775 of 2154) PASS: lldb-unit :: Host/./HostTests/HostInfoTest.GetAugmentedArchSpec (1776 of 2154) UNSUPPORTED: lldb-api :: functionalities/darwin_log/source/debug/TestDarwinLogSourceDebug.py (1777 of 2154) PASS: lldb-api :: lang/cpp/frame-var-anon-unions/TestFrameVariableAnonymousUnions.py (1778 of 2154) PASS: lldb-unit :: Host/./HostTests/FileSystemTest.FileAndDirectoryComponents (1779 of 2154) PASS: lldb-unit :: SymbolFile/DWARF/./SymbolFileDWARFTests/SymbolFileDWARFTests.TestAbbrevOrder1Start1 (1780 of 2154) PASS: lldb-unit :: Host/./HostTests/SocketTest.DecodeHostAndPort (1781 of 2154) PASS: lldb-api :: iohandler/resize/TestIOHandlerResize.py (1782 of 2154) PASS: lldb-shell :: SymbolFile/dissassemble-entry-point.s (1783 of 2154) PASS: lldb-unit :: Utility/./UtilityTests/RangeTest.ContainsEndInclusive (1784 of 2154) PASS: lldb-shell :: Minidump/Windows/arm-fp-unwind.test (1785 of 2154) PASS: lldb-api :: commands/expression/radar_9673664/TestExprHelpExamples.py (1786 of 2154) PASS: lldb-api :: lang/c/register_variables/TestRegisterVariables.py (1787 of 2154) PASS: lldb-unit :: Utility/./UtilityTests/TildeExpressionResolver.ResolveFullPath (1788 of 2154) PASS: lldb-api :: tools/lldb-server/TestGdbRemoteKill.py (1789 of 2154) FAIL: lldb-api :: functionalities/gdb_remote_client/TestQemuAArch64TargetXml.py (1790 of 2154) ******************** TEST 'lldb-api :: functionalities/gdb_remote_client/TestQemuAArch64TargetXml.py' FAILED ******************** Script: -- /usr/local/Frameworks/Python.framework/Versions/3.7/bin/python3.7 /Users/buildslave/jenkins/workspace/lldb-cmake/llvm-project/lldb/test/API/dotest.py -s /Users/buildslave/jenkins/workspace/lldb-cmake/lldb-build/lldb-test-traces -S nm -u CXXFLAGS -u CFLAGS --codesign-identity - --server /Users/buildslave/jenkins/workspace/lldb-cmake/lldb-build/./bin/debugserver --arch x86_64 --build-dir /Users/buildslave/jenkins/workspace/lldb-cmake/lldb-build/lldb-test-build.noindex -s=/Users/buildslave/jenkins/workspace/lldb-cmake/test/logs -t --env TERM=vt100 --env LLVM_LIBS_DIR=/Users/buildslave/jenkins/workspace/lldb-cmake/lldb-build/./lib --arch x86_64 --build-dir /Users/buildslave/jenkins/workspace/lldb-cmake/lldb-build/lldb-test-build.noindex --lldb-module-cache-dir /Users/buildslave/jenkins/workspace/lldb-cmake/lldb-build/lldb-test-build.noindex/module-cache-lldb/lldb-api --clang-module-cache-dir /Users/buildslave/jenkins/workspace/lldb-cmake/lldb-build/lldb-test-build.noindex/module-cache-clang/lldb-api --executable /Users/buildslave/jenkins/workspace/lldb-cmake/lldb-build/./bin/lldb --compiler /Users/buildslave/jenkins/workspace/lldb-cmake/lldb-build/./bin/clang --dsymutil /Users/buildslave/jenkins/workspace/lldb-cmake/lldb-build/./bin/dsymutil --filecheck /Users/buildslave/jenkins/workspace/lldb-cmake/lldb-build/./bin/FileCheck --yaml2obj /Users/buildslave/jenkins/workspace/lldb-cmake/lldb-build/./bin/yaml2obj --lldb-libs-dir /Users/buildslave/jenkins/workspace/lldb-cmake/lldb-build/./lib /Users/buildslave/jenkins/workspace/lldb-cmake/llvm-project/lldb/test/API/functionalities/gdb_remote_client -p TestQemuAArch64TargetXml.py -- Exit Code: 1

Hide Details

Command Output (stdout): -- lldb version 12.0.99 clang revision 5dbf80cad9556e222c4383960007fc0b27ea9541 llvm revision 5dbf80cad9556e222c4383960007fc0b27ea9541 libstdcxx tests will not be run because: Don't know how to build with libstdcxx on macosx Skipping following debug info categories: ['dwo']

Hide Details

-- Command Output (stderr): --

Hide Details

Session logs for test failures/errors/unexpected successes will go into directory '/Users/buildslave/jenkins/workspace/lldb-cmake/test/logs' Change dir to: /Users/buildslave/jenkins/workspace/lldb-cmake/llvm-project/lldb/test/API/functionalities/gdb_remote_client runCmd: settings clear -all output:

Hide Details

runCmd: settings set symbols.enable-external-lookup false output:

Hide Details

runCmd: settings set target.inherit-tcc true output:

Hide Details

runCmd: settings set target.auto-apply-fixits false output:

Hide Details

runCmd: settings set plugin.process.gdb-remote.packet-timeout 60 output:

Hide Details

runCmd: settings set symbols.clang-modules-cache-path "/Users/buildslave/jenkins/workspace/lldb-cmake/lldb-build/lldb-test-build.noindex/module-cache-lldb/lldb-api" output:

Hide Details

runCmd: settings set use-color false output:

Hide Details

runCmd: setting set target.prefer-dynamic-value no-dynamic-values output:

Hide Details

FAIL: LLDB (/Users/buildslave/jenkins/workspace/lldb-cmake/lldb-build/bin/clang-x86_64) :: test_register_augmentation (TestQemuAArch64TargetXml.TestQemuAarch64TargetXml) <bound method SBProcess.Kill of <lldb.SBProcess; proxy of <Swig Object of type 'lldb::SBProcess *' at 0x109ef8600> >>: success

Hide Details

Restore dir to: /Users/buildslave/jenkins/workspace/lldb-cmake/lldb-build/tools/lldb/test ====================================================================== FAIL: test_register_augmentation (TestQemuAArch64TargetXml.TestQemuAarch64TargetXml) ---------------------------------------------------------------------- Traceback (most recent call last): File "/Users/buildslave/jenkins/workspace/lldb-cmake/llvm-project/lldb/test/API/functionalities/gdb_remote_client/TestQemuAArch64TargetXml.py", line 67, in test_register_augmentation process = self.connect(target) File "/Users/buildslave/jenkins/workspace/lldb-cmake/llvm-project/lldb/test/API/functionalities/gdb_remote_client/gdbclientutils.py", line 524, in connect self.assertTrue(error.Success(), error.description) AssertionError: False is not True : failed to get reply to handshake packet Config=x86_64-/Users/buildslave/jenkins/workspace/lldb-cmake/lldb-build/bin/clang ---------------------------------------------------------------------- Ran 1 test in 102.175s

Hide Details

RESULT: FAILED (0 passes, 1 failures, 0 errors, 0 skipped, 0 expected failures, 0 unexpected successes)

Hide Details

--

Hide Details

******************** PASS: lldb-unit :: Interpreter/./InterpreterTests/OptionArgParserTest.toChar (1791 of 2154) PASS: lldb-api :: commands/expression/persistent_variables/TestPersistentVariables.py (1792 of 2154) PASS: lldb-unit :: Symbol/./SymbolTests/Type.GetTypeScopeAndBasename (1793 of 2154) PASS: lldb-unit :: Utility/./UtilityTests/VMRange.Clear (1794 of 2154) PASS: lldb-unit :: Utility/./UtilityTests/BinaryStreamTest.PutSLEB128FiveBytes (1795 of 2154) PASS: lldb-api :: functionalities/source-map/TestTargetSourceMap.py (1796 of 2154) PASS: lldb-unit :: ObjectFile/ELF/./ObjectFileELFTests/ObjectFileELFTest.GetSymtab_NoSymEntryPointArmThumbAddressClass (1797 of 2154) PASS: lldb-unit :: Utility/./UtilityTests/UriParserTest.BracketedHostnamePort (1798 of 2154) PASS: lldb-unit :: UnwindAssembly/x86/./UnwindAssemblyx86Tests/Testx86AssemblyInspectionEngine.TestPushESI (1799 of 2154) PASS: lldb-api :: commands/apropos/with-process/TestAproposWithProcess.py (1800 of 2154) PASS: lldb-api :: lang/cpp/static_methods/TestCPPStaticMethods.py (1801 of 2154) UNSUPPORTED: lldb-api :: benchmarks/libcxxlist/TestBenchmarkLibcxxList.py (1802 of 2154) PASS: lldb-api :: functionalities/thread/jump/TestThreadJump.py (1803 of 2154) PASS: lldb-unit :: Utility/./UtilityTests/StreamTeeTest.Constructor1Stream (1804 of 2154) PASS: lldb-api :: tools/lldb-vscode/runInTerminal/TestVSCode_runInTerminal.py (1805 of 2154) PASS: lldb-shell :: ObjectFile/ELF/PT_LOAD-empty.yaml (1806 of 2154) PASS: lldb-api :: source-manager/TestSourceManager.py (1807 of 2154) PASS: lldb-unit :: Utility/./UtilityTests/StreamTest.PutBytesAsRawHex8ToBigEndian (1808 of 2154) PASS: lldb-api :: functionalities/gdb_remote_client/TestGDBRemoteDiskFileCompletion.py (1809 of 2154) PASS: lldb-api :: functionalities/set-data/TestSetData.py (1810 of 2154) PASS: lldb-api :: functionalities/asan/TestMemoryHistory.py (1811 of 2154) PASS: lldb-unit :: Utility/./UtilityTests/DataExtractorTest.GetCStrUnterminated (1812 of 2154) PASS: lldb-api :: functionalities/data-formatter/data-formatter-objc/TestDataFormatterObjCNSContainer.py (1813 of 2154) PASS: lldb-api :: lang/cpp/member-and-local-vars-with-same-name/TestMembersAndLocalsWithSameName.py (1814 of 2154) XFAIL: lldb-shell :: Register/x86-64-ymm-write.test (1815 of 2154) PASS: lldb-api :: lang/cpp/function_refs/TestFunctionRefs.py (1816 of 2154) PASS: lldb-api :: commands/breakpoint/set/func-regex/TestBreakpointRegexError.py (1817 of 2154) UNSUPPORTED: lldb-api :: tools/lldb-server/registers-target-xml-reading/TestGdbRemoteTargetXmlPacket.py (1818 of 2154) PASS: lldb-api :: commands/expression/import-std-module/basic/TestImportStdModule.py (1819 of 2154) PASS: lldb-unit :: Process/gdb-remote/./ProcessGdbRemoteTests/GDBRemoteCommunicationClientTest.WriteRegister (1820 of 2154) UNSUPPORTED: lldb-api :: benchmarks/continue/TestBenchmarkContinue.py (1821 of 2154) PASS: lldb-api :: lang/cpp/namespace/TestNamespace.py (1822 of 2154) PASS: lldb-shell :: SymbolFile/DWARF/debug-names-compressed.cpp (1823 of 2154) PASS: lldb-api :: functionalities/gdb_remote_client/TestNoGPacketSupported.py (1824 of 2154) PASS: lldb-shell :: ObjectFile/Breakpad/uuid-matching-mac.test (1825 of 2154) PASS: lldb-unit :: Process/minidump/./LLDBMinidumpTests/MinidumpParserTest.InvalidMinidump (1826 of 2154) PASS: lldb-shell :: SymbolFile/Breakpad/unwind-via-stack-win-no-memory-info.yaml (1827 of 2154) PASS: lldb-unit :: ScriptInterpreter/Python/./ScriptInterpreterPythonTests/PythonDataObjectsTest.TestPythonTupleValues (1828 of 2154) PASS: lldb-unit :: Utility/./UtilityTests/ArgsTest.Yaml (1829 of 2154) PASS: lldb-api :: commands/gui/basic/TestGuiBasic.py (1830 of 2154) PASS: lldb-api :: macosx/simulator/TestSimulatorPlatform.py (1831 of 2154) PASS: lldb-shell :: Reproducer/TestDump.test (1832 of 2154) PASS: lldb-unit :: Utility/./UtilityTests/StringExtractorTest.GetHexU8_InvalidHex_NoEof (1833 of 2154) UNSUPPORTED: lldb-shell :: SymbolFile/DWARF/debug-types-expressions.test (1834 of 2154) PASS: lldb-api :: functionalities/jitloader_gdb/TestJITLoaderGDB.py (1835 of 2154) PASS: lldb-unit :: Utility/./UtilityTests/SerializationRountripTest.SerializeDeserializeObjectPointer (1836 of 2154) PASS: lldb-api :: functionalities/gdb_remote_client/TestGDBRemoteClient.py (1837 of 2154) PASS: lldb-api :: commands/expression/ir-interpreter-phi-nodes/TestIRInterpreterPHINodes.py (1838 of 2154) PASS: lldb-unit :: Symbol/./SymbolTests/DWARFCallFrameInfoTest.Basic_dwarf3 (1839 of 2154) PASS: lldb-unit :: Utility/./UtilityTests/ScalarTest.Division (1840 of 2154) PASS: lldb-unit :: Utility/./UtilityTests/StreamTest.AddressRangeInvalidRange (1841 of 2154) PASS: lldb-unit :: Expression/./ExpressionTests/DWARFExpression.DW_OP_piece (1842 of 2154) PASS: lldb-unit :: UnwindAssembly/x86/./UnwindAssemblyx86Tests/Testx86AssemblyInspectionEngine.TestSimple64bitFrameFunction (1843 of 2154) PASS: lldb-unit :: Utility/./UtilityTests/EnvironmentTest.EnvpConversion (1844 of 2154) PASS: lldb-api :: functionalities/inferior-crashing/recursive-inferior/TestRecursiveInferiorStep.py (1845 of 2154) PASS: lldb-unit :: Utility/./UtilityTests/LogTest.Register (1846 of 2154) PASS: lldb-shell :: Commands/command-script-import.test (1847 of 2154) PASS: lldb-unit :: Process/minidump/./LLDBMinidumpTests/MinidumpParserTest.GetPidWindows (1848 of 2154) PASS: lldb-unit :: UnwindAssembly/x86/./UnwindAssemblyx86Tests/Testx86AssemblyInspectionEngine.TestPopRBPWithREX (1849 of 2154) PASS: lldb-unit :: Utility/./UtilityTests/OptionsWithRawTest.EmptySuffix (1850 of 2154) PASS: lldb-unit :: Utility/./UtilityTests/StreamTest.AddressRangeSize (1851 of 2154) PASS: lldb-api :: functionalities/wrong_commands/TestWrongCommands.py (1852 of 2154) PASS: lldb-api :: functionalities/data-formatter/data-formatter-globals/TestDataFormatterGlobals.py (1853 of 2154) PASS: lldb-shell :: ObjectFile/wasm/embedded-debug-sections.yaml (1854 of 2154) PASS: lldb-unit :: Utility/./UtilityTests/ScalarTest.GetValue (1855 of 2154) PASS: lldb-unit :: SymbolFile/DWARF/./SymbolFileDWARFTests/SymbolFileDWARFTests.TestAbbrevInvalidNULLTag (1856 of 2154) PASS: lldb-api :: commands/expression/scoped_enums/TestScopedEnumType.py (1857 of 2154) PASS: lldb-unit :: ScriptInterpreter/Python/./ScriptInterpreterPythonTests/PythonDataObjectsTest.TestObjectAttributes (1858 of 2154) PASS: lldb-unit :: Symbol/./SymbolTests/SymbolsTest.LocateExecutableSymbolFileForUnknownExecutableAndMissingSymbolFile (1859 of 2154) PASS: lldb-unit :: Expression/./ExpressionTests/DiagnosticManagerTest.GetStringMultipleDiags (1860 of 2154) PASS: lldb-shell :: SymbolFile/DWARF/DW_TAG_variable-invalid_location.s (1861 of 2154) PASS: lldb-api :: lang/c/step-target/TestStepTarget.py (1862 of 2154) PASS: lldb-api :: lang/objc/objc-property/TestObjCProperty.py (1863 of 2154) UNSUPPORTED: lldb-api :: functionalities/darwin_log/filter/exact_match/subsystem/TestDarwinLogFilterMatchSubsystem.py (1864 of 2154) PASS: lldb-unit :: Utility/./UtilityTests/OptionsWithRawTest.ArgsButNoLeadingDash (1865 of 2154) PASS: lldb-api :: commands/target/stop-hook/enable/TestTargetStopHookEnable.py (1866 of 2154) PASS: lldb-unit :: UnwindAssembly/x86/./UnwindAssemblyx86Tests/Testx86AssemblyInspectionEngine.TestPopESI (1867 of 2154) PASS: lldb-api :: functionalities/limit-debug-info/TestLimitDebugInfo.py (1868 of 2154) PASS: lldb-api :: functionalities/postmortem/elf-core/TestLinuxCore.py (1869 of 2154) PASS: lldb-shell :: ScriptInterpreter/Python/eof.test (1870 of 2154) PASS: lldb-api :: commands/expression/invalid-args/TestInvalidArgsExpression.py (1871 of 2154) UNSUPPORTED: lldb-api :: functionalities/darwin_log/source/info/TestDarwinLogSourceInfo.py (1872 of 2154) PASS: lldb-unit :: Utility/./UtilityTests/Flags.AllSet (1873 of 2154) UNSUPPORTED: lldb-api :: functionalities/darwin_log/filter/regex/subsystem/TestDarwinLogFilterRegexSubsystem.py (1874 of 2154) PASS: lldb-api :: lang/c/local_variables/TestLocalVariables.py (1875 of 2154) PASS: lldb-api :: lang/cpp/offsetof/TestOffsetofCpp.py (1876 of 2154) PASS: lldb-shell :: SymbolFile/DWARF/debug_rnglists.s (1877 of 2154) PASS: lldb-unit :: Utility/./UtilityTests/ArchSpecTest.TestParseMachCPUDashSubtypeTripleSimple (1878 of 2154) PASS: lldb-api :: lang/objc/objc-super/TestObjCSuper.py (1879 of 2154) PASS: lldb-unit :: Utility/./UtilityTests/VMRange.SetEndAddress (1880 of 2154) PASS: lldb-api :: commands/frame/var-scope/TestFrameVariableScope.py (1881 of 2154) PASS: lldb-api :: functionalities/gdb_remote_client/TestRecognizeBreakpoint.py (1882 of 2154) PASS: lldb-api :: functionalities/data-formatter/data-formatter-objc/nsstring/TestDataFormatterNSString.py (1883 of 2154) PASS: lldb-unit :: Symbol/./SymbolTests/TestTypeSystemClang.AddMethodToObjCObjectType (1884 of 2154) PASS: lldb-api :: functionalities/non-overlapping-index-variable-i/TestIndexVariable.py (1885 of 2154) PASS: lldb-api :: api/multithreaded/TestMultithreaded.py (1886 of 2154) PASS: lldb-unit :: UnwindAssembly/ARM64/./Arm64InstEmulationTests/TestArm64InstEmulation.TestFramelessThreeEpilogueFunction (1887 of 2154) PASS: lldb-api :: lang/objc/foundation/TestConstStrings.py (1888 of 2154) PASS: lldb-api :: functionalities/breakpoint/breakpoint_names/TestBreakpointNames.py (1889 of 2154) PASS: lldb-api :: commands/expression/import-std-module/list-dbg-info-content/TestDbgInfoContentListFromStdModule.py (1890 of 2154) PASS: lldb-unit :: Utility/./UtilityTests/BinaryStreamTest.PutULEB128FourBytes (1891 of 2154) PASS: lldb-unit :: Utility/./UtilityTests/ConstStringTest.FromMidOfBufferStringRef (1892 of 2154) PASS: lldb-api :: commands/expression/import-std-module/queue/TestQueueFromStdModule.py (1893 of 2154) PASS: lldb-unit :: Host/./HostTests/HostInfoTest.GetHostname (1894 of 2154) PASS: lldb-shell :: Minidump/memory-region-from-module.yaml (1895 of 2154) PASS: lldb-api :: lang/c/complex/TestComplexC99.py (1896 of 2154) PASS: lldb-api :: functionalities/inline-stepping/TestInlineStepping.py (1897 of 2154) PASS: lldb-unit :: ScriptInterpreter/Python/./ScriptInterpreterPythonTests/PythonDataObjectsTest.TestTypeNameResolutionNoDot (1898 of 2154) PASS: lldb-unit :: Utility/./UtilityTests/RangeTest.Slide (1899 of 2154) PASS: lldb-unit :: Utility/./UtilityTests/ConstStringTest.CompareConstString (1900 of 2154) PASS: lldb-unit :: Interpreter/./InterpreterTests/OptionArgParserTest.toScriptLanguage (1901 of 2154) PASS: lldb-unit :: Utility/./UtilityTests/SerializationRountripTest.SerializeDeserializePod (1902 of 2154) UNSUPPORTED: lldb-shell :: SymbolFile/PDB/expressions.test (1903 of 2154) PASS: lldb-shell :: SymbolFile/NativePDB/nested-types.cpp (1904 of 2154) PASS: lldb-api :: functionalities/thread/concurrent_events/TestConcurrentBreakpointsDelayedBreakpointOneWatchpoint.py (1905 of 2154) PASS: lldb-unit :: UnwindAssembly/x86/./UnwindAssemblyx86Tests/Testx86AssemblyInspectionEngine.Test32BitOnlyInstruction (1906 of 2154) PASS: lldb-unit :: Symbol/./SymbolTests/TestTypeSystemClang.TemplateArguments (1907 of 2154) PASS: lldb-shell :: Reproducer/TestGDBRemoteRepro.test (1908 of 2154) PASS: lldb-unit :: Host/./HostTests/SocketAddressTest.Set (1909 of 2154) PASS: lldb-shell :: SymbolFile/DWARF/dwp-separate-debug-file.cpp (1910 of 2154) PASS: lldb-unit :: Core/./LLDBCoreTests/ModuleSpecTest.TestCOFFFile (1911 of 2154) PASS: lldb-unit :: Utility/./UtilityTests/ArgsTest.TestSingleQuotedArgWithSpace (1912 of 2154) PASS: lldb-unit :: ScriptInterpreter/Python/./ScriptInterpreterPythonTests/PythonDataObjectsTest.TestPythonCallableCheck (1913 of 2154) PASS: lldb-unit :: Utility/./UtilityTests/StreamTest.PutCStringWithStringRef (1914 of 2154) PASS: lldb-unit :: Host/./HostTests/NativeProcessProtocolTest.ReadCStringFromMemory_CrossPageBoundary (1915 of 2154) UNSUPPORTED: lldb-api :: benchmarks/startup/TestStartupDelays.py (1916 of 2154) PASS: lldb-unit :: Symbol/./SymbolTests/SymbolsTest.TerminateLocateExecutableSymbolFileForUnknownExecutableAndUnknownSymbolFile (1917 of 2154) PASS: lldb-unit :: Utility/./UtilityTests/OptionsWithRawTest.ArgsButNoDelimiter (1918 of 2154) PASS: lldb-unit :: Expression/./ExpressionTests/DiagnosticManagerTest.AppendMessageAttachToLastDiag (1919 of 2154) PASS: lldb-api :: functionalities/thread/thread_exit/TestThreadExit.py (1920 of 2154) PASS: lldb-unit :: ScriptInterpreter/Python/./ScriptInterpreterPythonTests/PythonDataObjectsTest.TestCallable (1921 of 2154) PASS: lldb-api :: functionalities/param_entry_vals/basic_entry_values/TestBasicEntryValues.py (1922 of 2154) PASS: lldb-api :: functionalities/gdb_remote_client/TestPlatformClient.py (1923 of 2154) PASS: lldb-unit :: SymbolFile/NativePDB/./SymbolFileNativePDBTests/PDBFPOProgramToDWARFExpressionTests.InvalidAssignmentMultiple (1924 of 2154) PASS: lldb-api :: functionalities/thread/concurrent_events/TestConcurrentTwoWatchpointsOneDelayBreakpoint.py (1925 of 2154) PASS: lldb-api :: types/TestDoubleTypesExpr.py (1926 of 2154) PASS: lldb-unit :: SymbolFile/NativePDB/./SymbolFileNativePDBTests/PDBFPOProgramToDWARFExpressionTests.InvalidOpUnary (1927 of 2154) PASS: lldb-unit :: Language/Highlighting/./HighlighterTests/HighlighterTest.DefaultHighlighterWithCursor (1928 of 2154) PASS: lldb-api :: functionalities/step-avoids-no-debug/TestStepNoDebug.py (1929 of 2154) PASS: lldb-unit :: ScriptInterpreter/Python/./ScriptInterpreterPythonTests/PythonDataObjectsTest.TestPythonIntegerToStructuredInteger (1930 of 2154) PASS: lldb-api :: commands/expression/unicode-in-variable/TestUnicodeInVariable.py (1931 of 2154) PASS: lldb-api :: commands/expression/import-std-module/unique_ptr/TestUniquePtrFromStdModule.py (1932 of 2154) PASS: lldb-shell :: Reproducer/TestVersionCheck.test (1933 of 2154) PASS: lldb-unit :: Platform/./LLDBPlatformTests/PlatformDarwinTest.TestParseVersionBuildDir (1934 of 2154) PASS: lldb-unit :: Process/gdb-remote/./ProcessGdbRemoteTests/GDBRemoteCommunicationClientTest.GetModulesInfo_UUID20 (1935 of 2154) PASS: lldb-api :: commands/expression/import-std-module/vector-bool/TestVectorBoolFromStdModule.py (1936 of 2154) PASS: lldb-unit :: UnwindAssembly/x86/./UnwindAssemblyx86Tests/Testx86AssemblyInspectionEngine.TestStackRealign8BitDisp_i386 (1937 of 2154) PASS: lldb-unit :: Utility/./UtilityTests/StreamTest.AddressEmptyPrefix (1938 of 2154) PASS: lldb-shell :: Reproducer/TestReuseDirectory.test (1939 of 2154) PASS: lldb-api :: commands/expression/diagnostics/TestExprDiagnostics.py (1940 of 2154) PASS: lldb-unit :: SymbolFile/NativePDB/./SymbolFileNativePDBTests/PDBFPOProgramToDWARFExpressionTests.UnknownOp (1941 of 2154) PASS: lldb-unit :: Utility/./UtilityTests/StringListTest.GetMaxStringLengthDecreasingSize (1942 of 2154) PASS: lldb-unit :: Expression/./ExpressionTests/CppModuleConfigurationTest.LibCppV2 (1943 of 2154) PASS: lldb-api :: lang/c/vla/TestVLA.py (1944 of 2154) PASS: lldb-api :: functionalities/postmortem/wow64_minidump/TestWow64MiniDump.py (1945 of 2154) PASS: lldb-unit :: ScriptInterpreter/Python/./ScriptInterpreterPythonTests/PythonDataObjectsTest.TestExceptions (1946 of 2154) UNSUPPORTED: lldb-api :: linux/add-symbols/TestTargetSymbolsAddCommand.py (1947 of 2154) PASS: lldb-unit :: Utility/./UtilityTests/StringExtractorTest.GetHexU8_Underflow_NoEof (1948 of 2154) PASS: lldb-shell :: Reproducer/TestHomeDir.test (1949 of 2154) UNSUPPORTED: lldb-shell :: Register/aarch64-gp-read.test (1950 of 2154) PASS: lldb-unit :: Utility/./UtilityTests/StringListTest.AppendList (1951 of 2154) PASS: lldb-api :: python_api/debugger/TestDebuggerAPI.py (1952 of 2154) UNSUPPORTED: lldb-api :: functionalities/process_save_core/TestProcessSaveCore.py (1953 of 2154) PASS: lldb-unit :: UnwindAssembly/x86/./UnwindAssemblyx86Tests/Testx86AssemblyInspectionEngine.Test32bitFramelessBigStackFrame (1954 of 2154) UNSUPPORTED: lldb-shell :: Watchpoint/netbsd-nouserdbregs.test (1955 of 2154) PASS: lldb-unit :: UnwindAssembly/x86/./UnwindAssemblyx86Tests/Testx86AssemblyInspectionEngine.TestSubESP (1956 of 2154) PASS: lldb-api :: functionalities/signal/handle-abrt/TestHandleAbort.py (1957 of 2154) PASS: lldb-api :: macosx/lc-note/firmware-corefile/TestFirmwareCorefiles.py (1958 of 2154) PASS: lldb-unit :: Utility/./UtilityTests/StreamTest.PutPtr (1959 of 2154) PASS: lldb-unit :: Language/Highlighting/./HighlighterTests/HighlighterTest.HighlighterSelectionPath (1960 of 2154) PASS: lldb-shell :: ObjectFile/PECOFF/uuid.yaml (1961 of 2154) PASS: lldb-api :: lang/cpp/dynamic-value-same-basename/TestDynamicValueSameBase.py (1962 of 2154) PASS: lldb-unit :: Utility/./UtilityTests/StreamTest.PutSLEB128 (1963 of 2154) PASS: lldb-api :: commands/target/stop-hook/disable/TestTargetStopHookDisable.py (1964 of 2154) PASS: lldb-api :: commands/expression/import-std-module/stack/TestStackFromStdModule.py (1965 of 2154) PASS: lldb-unit :: Utility/./UtilityTests/UriParserTest.BracketedHostnameWithColon (1966 of 2154) PASS: lldb-unit :: Symbol/./SymbolTests/TestTypeSystemClang.TestGetBasicTypeFromName (1967 of 2154) PASS: lldb-shell :: ObjectFile/ELF/section-permissions.yaml (1968 of 2154) UNSUPPORTED: lldb-shell :: Register/x86-ymm-write.test (1969 of 2154) UNSUPPORTED: lldb-api :: functionalities/longjmp/TestLongjmp.py (1970 of 2154) PASS: lldb-api :: lang/objc/exceptions/TestObjCExceptions.py (1971 of 2154) PASS: lldb-api :: python_api/lldbutil/process/TestPrintStackTraces.py (1972 of 2154) PASS: lldb-api :: commands/expression/import-std-module/no-std-module/TestMissingStdModule.py (1973 of 2154) PASS: lldb-unit :: tools/lldb-server/tests/./LLDBServerTests/TestBase.LaunchModePreservesEnvironment (1974 of 2154) PASS: lldb-shell :: SymbolFile/DWARF/win-i386-line-table.s (1975 of 2154) PASS: lldb-api :: lang/objc/bitfield_ivars/TestBitfieldIvars.py (1976 of 2154) PASS: lldb-shell :: SymbolFile/DWARF/dwarf5-partial-index.cpp (1977 of 2154) UNSUPPORTED: lldb-shell :: SymbolFile/NativePDB/typedefs.cpp (1978 of 2154) PASS: lldb-unit :: Host/./HostTests/NativeProcessProtocolTest.SetBreakpointFailVerify (1979 of 2154) PASS: lldb-api :: functionalities/return-value/TestReturnValue.py (1980 of 2154) PASS: lldb-unit :: Process/gdb-remote/./ProcessGdbRemoteTests/GDBRemoteCommunicationClientTest.GetQOffsets (1981 of 2154) PASS: lldb-api :: python_api/interpreter/TestCommandInterpreterAPI.py (1982 of 2154) UNSUPPORTED: lldb-shell :: BuildScript/toolchain-msvc.test (1983 of 2154) PASS: lldb-unit :: ScriptInterpreter/Python/./ScriptInterpreterPythonTests/PythonDataObjectsTest.TestInstanceNameResolutionNoDot (1984 of 2154) PASS: lldb-api :: commands/expression/import-std-module/deque-basic/TestDequeFromStdModule.py (1985 of 2154) PASS: lldb-api :: functionalities/thread/state_after_expression/TestStateAfterExpression.py (1986 of 2154) PASS: lldb-api :: functionalities/gdb_remote_client/TestqOffsets.py (1987 of 2154) PASS: lldb-api :: tools/lldb-server/TestGdbRemoteProcessInfo.py (1988 of 2154) PASS: lldb-api :: python_api/sbtype_typeclass/TestSBTypeTypeClass.py (1989 of 2154) PASS: lldb-api :: functionalities/data-formatter/var-in-aggregate-misuse/TestVarInAggregateMisuse.py (1990 of 2154) PASS: lldb-unit :: Instruction/./EmulatorTests/TestAArch64Emulator.TestOverflow (1991 of 2154) PASS: lldb-unit :: SymbolFile/DWARF/./SymbolFileDWARFTests/SymbolFileDWARFTests.TestAbbrevMissingTerminator (1992 of 2154) PASS: lldb-unit :: Symbol/./SymbolTests/TestTypeSystemClang.TestGetTypeClassTypeOf (1993 of 2154) PASS: lldb-api :: functionalities/thread/concurrent_events/TestConcurrentSignalBreak.py (1994 of 2154) PASS: lldb-shell :: Breakpoint/split-dwarf-5-addrbase.test (1995 of 2154) PASS: lldb-unit :: Utility/./UtilityTests/GeneratorTest.Get (1996 of 2154) PASS: lldb-unit :: ScriptInterpreter/Python/./ScriptInterpreterPythonTests/PythonDataObjectsTest.TestPythonFile (1997 of 2154) PASS: lldb-api :: lang/cpp/llvm-style/TestLLVMStyle.py (1998 of 2154) PASS: lldb-unit :: Utility/./UtilityTests/ProcessInstanceInfo.DumpTable_invalidUID (1999 of 2154) PASS: lldb-unit :: Host/./HostTests/ProcessLaunchInfoTest.Constructor (2000 of 2154) PASS: lldb-unit :: Target/./TargetTests/MCBasedABI.MapRegisterName (2001 of 2154) PASS: lldb-unit :: Symbol/./SymbolTests/TestTypeSystemClang.TestFunctionTemplateConstruction (2002 of 2154) UNSUPPORTED: lldb-shell :: SymbolFile/PDB/calling-conventions.test (2003 of 2154) PASS: lldb-unit :: Utility/./UtilityTests/RangeDataVector.FindEntryIndexesThatContain_Overlap (2004 of 2154) PASS: lldb-unit :: Process/gdb-remote/./ProcessGdbRemoteTests/GDBRemoteCommunicationClientTest.WriteRegisterNoSuffix (2005 of 2154) PASS: lldb-api :: functionalities/unwind/noreturn/TestNoreturnUnwind.py (2006 of 2154) PASS: lldb-unit :: Host/./HostTests/SocketTest.TCPGetConnectURI (2007 of 2154) PASS: lldb-unit :: Symbol/./SymbolTests/PostfixExpression.ToDWARF (2008 of 2154) PASS: lldb-api :: functionalities/data-formatter/boolreference/TestFormattersBoolRefPtr.py (2009 of 2154) PASS: lldb-shell :: SymbolFile/DWARF/debug_loclists-dwo.s (2010 of 2154) PASS: lldb-unit :: Utility/./UtilityTests/SharedCluster.ClusterManager (2011 of 2154) UNSUPPORTED: lldb-api :: linux/mix-dwo-and-regular-objects/TestMixedDwarfBinary.py (2012 of 2154) PASS: lldb-api :: types/TestShortType.py (2013 of 2154) PASS: lldb-api :: lang/cpp/char1632_t/TestChar1632T.py (2014 of 2154) PASS: lldb-api :: commands/expression/import-std-module/shared_ptr-dbg-info-content/TestSharedPtrDbgInfoContentFromStdModule.py (2015 of 2154) PASS: lldb-unit :: Utility/./UtilityTests/CompletionRequest.Constructor (2016 of 2154) PASS: lldb-api :: commands/expression/completion/TestExprCompletion.py (2017 of 2154) PASS: lldb-unit :: Process/minidump/./LLDBMinidumpTests/MinidumpParserTest.GetArchitectureWindows (2018 of 2154) PASS: lldb-unit :: ScriptInterpreter/Python/./ScriptInterpreterPythonTests/PythonDataObjectsTest.TestGlobalNameResolutionNoDot (2019 of 2154) PASS: lldb-api :: lang/objc/objc-baseclass-sbtype/TestObjCBaseClassSBType.py (2020 of 2154) PASS: lldb-api :: macosx/find-dsym/bundle-with-dot-in-filename/TestBundleWithDotInFilename.py (2021 of 2154) PASS: lldb-unit :: Utility/./UtilityTests/UUIDTest.Validity (2022 of 2154) PASS: lldb-unit :: Utility/./UtilityTests/BroadcasterTest.BroadcastEvent (2023 of 2154) PASS: lldb-unit :: Utility/./UtilityTests/StreamTest.PutChar (2024 of 2154) PASS: lldb-api :: commands/expression/top-level/TestTopLevelExprs.py (2025 of 2154) PASS: lldb-api :: commands/expression/radar_8638051/Test8638051.py (2026 of 2154) PASS: lldb-unit :: Host/./HostTests/NativeProcessProtocolTest.SetBreakpointFailRead (2027 of 2154) PASS: lldb-unit :: Language/Highlighting/./HighlighterTests/HighlighterTest.ClangStringLiterals (2028 of 2154) PASS: lldb-unit :: debugserver/./debugserverTests/JSON.Parse (2029 of 2154) PASS: lldb-unit :: Utility/./UtilityTests/SerializationRountripTest.SerializeDeserializeCStringArrayNullptrElem (2030 of 2154) PASS: lldb-unit :: Process/minidump/./LLDBMinidumpTests/MinidumpParserTest.GetFilteredModuleList (2031 of 2154) PASS: lldb-unit :: Process/minidump/./LLDBMinidumpTests/MinidumpParserTest.FindMemoryRangeWithFullMemoryMinidump (2032 of 2154) PASS: lldb-api :: functionalities/breakpoint/breakpoint_callback_command_source/TestBreakpointCallbackCommandSource.py (2033 of 2154) PASS: lldb-shell :: Driver/TestError.test (2034 of 2154) PASS: lldb-api :: lang/objcxx/objcxx-ivar-vector/TestIvarVector.py (2035 of 2154) PASS: lldb-shell :: SymbolFile/DWARF/DW_AT_low_pc-addrx.s (2036 of 2154) PASS: lldb-api :: lang/c/struct_types/TestStructTypes.py (2037 of 2154) PASS: lldb-unit :: Utility/./UtilityTests/StringExtractorTest.GetNameColonValueNoSemicolon (2038 of 2154) PASS: lldb-unit :: Utility/./UtilityTests/BinaryStreamTest.PutULEB128OneByte (2039 of 2154) PASS: lldb-api :: functionalities/ptr_refs/TestPtrRefs.py (2040 of 2154) PASS: lldb-unit :: Utility/./UtilityTests/RangeTest.Copy (2041 of 2154) PASS: lldb-shell :: SymbolFile/NativePDB/disassembly.cpp (2042 of 2154) PASS: lldb-unit :: Utility/./UtilityTests/DataExtractorTest.GetDoubleUnaligned (2043 of 2154) UNSUPPORTED: lldb-api :: commands/expression/macros/TestMacros.py (2044 of 2154) PASS: lldb-unit :: Expression/./ExpressionTests/DiagnosticManagerTest.GetStringMultiline (2045 of 2154) PASS: lldb-api :: linux/builtin_trap/TestBuiltinTrap.py (2046 of 2154) PASS: lldb-unit :: Process/minidump/./LLDBMinidumpTests/MinidumpParserTest.MinidumpDuplicateModuleSeparateCode (2047 of 2154) PASS: lldb-unit :: Utility/./UtilityTests/StringListTest.Clear (2048 of 2154) PASS: lldb-unit :: DataFormatter/./LLDBFormatterTests/TypeMatcherTests.GetMatchStringExactName (2049 of 2154) UNSUPPORTED: lldb-shell :: SymbolFile/PDB/ast-restore.test (2050 of 2154) PASS: lldb-unit :: UnwindAssembly/x86/./UnwindAssemblyx86Tests/Testx86AssemblyInspectionEngine.TestPush0 (2051 of 2154) UNSUPPORTED: lldb-api :: tools/lldb-server/TestGdbRemoteModuleInfo.py (2052 of 2154) PASS: lldb-api :: commands/watchpoints/watchpoint_size/TestWatchpointSizes.py (2053 of 2154) PASS: lldb-api :: python_api/sbdata/TestSBData.py (2054 of 2154) PASS: lldb-unit :: Utility/./UtilityTests/ConstStringTest.MangledCounterpart (2055 of 2154) PASS: lldb-unit :: Host/./HostTests/SocketTest.DomainListenConnectAccept (2056 of 2154) PASS: lldb-unit :: tools/lldb-server/tests/./LLDBServerTests/TestBase.DebugserverEnv (2057 of 2154) PASS: lldb-shell :: ScriptInterpreter/None/import_module.test (2058 of 2154) PASS: lldb-unit :: Utility/./UtilityTests/LogChannelTest.EnableOptions (2059 of 2154) PASS: lldb-api :: functionalities/breakpoint/dummy_target_breakpoints/TestBreakpointsWithNoTargets.py (2060 of 2154) PASS: lldb-unit :: Utility/./UtilityTests/StreamTeeTest.DefaultConstructor (2061 of 2154) PASS: lldb-api :: functionalities/postmortem/minidump/TestMiniDump.py (2062 of 2154) PASS: lldb-api :: commands/expression/class_template_specialization_empty_pack/TestClassTemplateSpecializationParametersHandling.py (2063 of 2154) UNSUPPORTED: lldb-api :: tools/lldb-server/signal-filtering/TestGdbRemote_QPassSignals.py (2064 of 2154) PASS: lldb-api :: functionalities/tsan/thread_leak/TestTsanThreadLeak.py (2065 of 2154) PASS: lldb-api :: functionalities/data-formatter/data-formatter-stl/libcxx/atomic/TestLibCxxAtomic.py (2066 of 2154) PASS: lldb-api :: tools/lldb-server/TestGdbRemoteThreadsInStopReply.py (2067 of 2154) PASS: lldb-unit :: Core/./LLDBCoreTests/MangledTest.NameIndexes_FindFunctionSymbols (2068 of 2154) PASS: lldb-api :: commands/expression/test/TestExprs2.py (2069 of 2154) PASS: lldb-unit :: Utility/./UtilityTests/ArgsTest.DoubleQuotedItem (2070 of 2154) PASS: lldb-api :: lang/cpp/diamond/TestDiamond.py (2071 of 2154) PASS: lldb-api :: lang/objc/ptr_refs/TestPtrRefsObjC.py (2072 of 2154) UNSUPPORTED: lldb-shell :: Unwind/eh-frame-augment-noop.test (2073 of 2154) PASS: lldb-unit :: Interpreter/./InterpreterTests/CompletionTest.DirCompletionUsername (2074 of 2154) PASS: lldb-api :: functionalities/tsan/cpp_global_location/TestTsanCPPGlobalLocation.py (2075 of 2154) PASS: lldb-api :: functionalities/breakpoint/breakpoint_by_file_colon_line/TestBreakpointByFileColonLine.py (2076 of 2154) PASS: lldb-unit :: Host/./HostTests/File.GetStreamFromDescriptor (2077 of 2154) PASS: lldb-unit :: Utility/./UtilityTests/CompletionRequest.DuplicateFiltering (2078 of 2154) XFAIL: lldb-shell :: Register/x86-mm-xmm-write.test (2079 of 2154) PASS: lldb-unit :: Utility/./UtilityTests/XcodeSDKTest.SDKSupportsSwift (2080 of 2154) PASS: lldb-api :: python_api/frame/get-variables/TestGetVariables.py (2081 of 2154) PASS: lldb-shell :: Driver/TestPositionalArgs.test (2082 of 2154) PASS: lldb-shell :: SymbolFile/DWARF/debug_loc.s (2083 of 2154) PASS: lldb-unit :: Utility/./UtilityTests/SerializationRountripTest.SerializeDeserializePodPointers (2084 of 2154) PASS: lldb-api :: functionalities/thread/concurrent_events/TestConcurrentBreakpointDelayBreakpointOneSignal.py (2085 of 2154) PASS: lldb-unit :: Utility/./UtilityTests/FileSpecTest.AppendPathComponent (2086 of 2154) PASS: lldb-unit :: Utility/./UtilityTests/ArgsTest.ReplaceArgumentAtIndexEqual (2087 of 2154) UNSUPPORTED: lldb-shell :: Register/x86-64-zmm-read.test (2088 of 2154) PASS: lldb-api :: lang/cpp/dynamic-value/TestCppValueCast.py (2089 of 2154) PASS: lldb-unit :: Utility/./UtilityTests/ArgsTest.TestSingleArg (2090 of 2154) PASS: lldb-api :: commands/gui/viewlarge/TestGuiViewLarge.py (2091 of 2154) PASS: lldb-unit :: Utility/./UtilityTests/StreamTest.ChangingByteOrder (2092 of 2154) PASS: lldb-shell :: BuildScript/modes.test (2093 of 2154) PASS: lldb-unit :: Utility/./UtilityTests/UriParserTest.LongPath (2094 of 2154) PASS: lldb-unit :: ScriptInterpreter/Python/./ScriptInterpreterPythonTests/PythonDataObjectsTest.TestPythonDictionaryValueEquality (2095 of 2154) PASS: lldb-shell :: ObjectFile/MachO/lc_build_version.yaml (2096 of 2154) PASS: lldb-api :: functionalities/thread/concurrent_events/TestConcurrentManyBreakpoints.py (2097 of 2154) PASS: lldb-shell :: SymbolFile/DWARF/find-variable-dwo.cpp (2098 of 2154) PASS: lldb-unit :: UnwindAssembly/x86/./UnwindAssemblyx86Tests/Testx86AssemblyInspectionEngine.TestPushR12 (2099 of 2154) PASS: lldb-shell :: SymbolFile/DWARF/dwarf5-index-is-used.cpp (2100 of 2154) PASS: lldb-api :: lang/cpp/nsimport/TestCppNsImport.py (2101 of 2154) PASS: lldb-api :: commands/expression/deleting-implicit-copy-constructor/TestDeletingImplicitCopyConstructor.py (2102 of 2154) PASS: lldb-unit :: Editline/./EditlineTests/EditlineTestFixture.EditlineReceivesSingleLineText (2103 of 2154) PASS: lldb-shell :: SymbolFile/DWARF/dwp.s (2104 of 2154) UNSUPPORTED: lldb-shell :: SymbolFile/PDB/variables.test (2105 of 2154) UNSUPPORTED: lldb-api :: functionalities/darwin_log/filter/exact_match/message/TestDarwinLogFilterMatchMessage.py (2106 of 2154) PASS: lldb-api :: lang/objc/modules-compile-error/TestModulesCompileError.py (2107 of 2154) PASS: lldb-api :: functionalities/data-formatter/data-formatter-advanced/TestDataFormatterAdv.py (2108 of 2154) PASS: lldb-unit :: Utility/./UtilityTests/BinaryStreamTest.PutSLEB128SevenBytes (2109 of 2154) PASS: lldb-unit :: ScriptInterpreter/Python/./ScriptInterpreterPythonTests/PythonDataObjectsTest.TestOwnedReferences (2110 of 2154) PASS: lldb-api :: macosx/version_zero/TestGetVersionZeroVersion.py (2111 of 2154) PASS: lldb-shell :: SymbolFile/Breakpad/symtab-macho.test (2112 of 2154) PASS: lldb-api :: python_api/symbol-context/TestSymbolContext.py (2113 of 2154) PASS: lldb-unit :: Process/gdb-remote/./ProcessGdbRemoteTests/GDBRemoteCommunicationClientTest.GetModulesInfoInvalidResponse (2114 of 2154) PASS: lldb-unit :: Utility/./UtilityTests/SerializationRountripTest.SerializeDeserializePodReferences (2115 of 2154) PASS: lldb-api :: python_api/type/TestTypeList.py (2116 of 2154) PASS: lldb-unit :: ScriptInterpreter/Python/./ScriptInterpreterPythonTests/PythonDataObjectsTest.TestScript (2117 of 2154) PASS: lldb-unit :: Utility/./UtilityTests/IndexToObjectTest.ObjectForIndex (2118 of 2154) PASS: lldb-api :: functionalities/data-formatter/data-formatter-objc/TestDataFormatterObjCNSData.py (2119 of 2154) PASS: lldb-shell :: ObjectFile/PECOFF/basic-info.yaml (2120 of 2154) PASS: lldb-api :: commands/expression/import-std-module/unique_ptr-dbg-info-content/TestUniquePtrDbgInfoContent.py (2121 of 2154) PASS: lldb-api :: commands/platform/process/list/TestProcessList.py (2122 of 2154) PASS: lldb-api :: commands/watchpoints/step_over_watchpoint/TestStepOverWatchpoint.py (2123 of 2154) PASS: lldb-shell :: SymbolFile/NativePDB/ast-functions.cpp (2124 of 2154) PASS: lldb-unit :: UnwindAssembly/x86/./UnwindAssemblyx86Tests/Testx86AssemblyInspectionEngine.TestPopEBX (2125 of 2154) PASS: lldb-api :: lang/cpp/type_lookup/TestCppTypeLookup.py (2126 of 2154) PASS: lldb-api :: functionalities/reproducers/attach/TestReproducerAttach.py (2127 of 2154) PASS: lldb-api :: lang/objcxx/cxx-bridged-po/TestObjCXXBridgedPO.py (2128 of 2154) PASS: lldb-api :: commands/expression/dollar-in-variable/TestDollarInVariable.py (2129 of 2154) PASS: lldb-unit :: Utility/./UtilityTests/ReproducerTest.SetCapture (2130 of 2154) PASS: lldb-shell :: SymbolFile/DWARF/find-basic-namespace.cpp (2131 of 2154) PASS: lldb-shell :: ObjectFile/ELF/PT_LOAD-overlap-section.yaml (2132 of 2154) PASS: lldb-api :: functionalities/gdb_remote_client/TestNoWatchpointSupportInfo.py (2133 of 2154) PASS: lldb-api :: functionalities/lazy-loading/TestLazyLoading.py (2134 of 2154) PASS: lldb-api :: functionalities/data-formatter/cstring-utf8-summary/TestCstringUnicode.py (2135 of 2154) PASS: lldb-unit :: Utility/./UtilityTests/StreamTest.SetIndentLevel (2136 of 2154) UNSUPPORTED: lldb-api :: tools/lldb-server/TestGdbRemote_vContThreads.py (2137 of 2154) PASS: lldb-api :: functionalities/tsan/thread_numbers/TestTsanThreadNumbers.py (2138 of 2154) PASS: lldb-api :: functionalities/data-formatter/data-formatter-objc/TestDataFormatterObjCNSError.py (2139 of 2154) PASS: lldb-api :: commands/expression/persistent_types/TestPersistentTypes.py (2140 of 2154) PASS: lldb-shell :: SymbolFile/DWARF/find-inline-method.s (2141 of 2154) PASS: lldb-api :: tools/lldb-vscode/console/TestVSCode_console.py (2142 of 2154) PASS: lldb-shell :: BuildScript/toolchain-clang.test (2143 of 2154) PASS: lldb-api :: functionalities/data-formatter/data-formatter-stl/libcxx/list/TestDataFormatterLibcxxList.py (2144 of 2154) PASS: lldb-api :: functionalities/data-formatter/summary-string-onfail/Test-rdar-9974002.py (2145 of 2154) PASS: lldb-api :: functionalities/breakpoint/breakpoint_set_restart/TestBreakpointSetRestart.py (2146 of 2154) PASS: lldb-api :: commands/gui/invalid-args/TestInvalidArgsGui.py (2147 of 2154) PASS: lldb-api :: functionalities/thread/concurrent_events/TestConcurrentWatchpointDelayWatchpointOneBreakpoint.py (2148 of 2154) PASS: lldb-unit :: Utility/./UtilityTests/VASprintfTest.BufferResize (2149 of 2154) PASS: lldb-api :: lang/cpp/const_this/TestConstThis.py (2150 of 2154) PASS: lldb-unit :: Utility/./UtilityTests/ArgsTest.ReplaceArgumentAtIndexOutOfRange (2151 of 2154) PASS: lldb-api :: lang/c/inlines/TestRedefinitionsInInlines.py (2152 of 2154) PASS: lldb-api :: types/TestShortTypeExpr.py (2153 of 2154) PASS: lldb-api :: tools/lldb-vscode/module/TestVSCode_module.py (2154 of 2154) Slowest Tests: -------------------------------------------------------------------------- 464.11s: lldb-api :: macosx/simulator/TestSimulatorPlatform.py 124.93s: lldb-api :: python_api/objc_type/TestObjCType.py 120.92s: lldb-api :: lang/c/shared_lib/TestSharedLib.py 107.24s: lldb-api :: functionalities/gdb_remote_client/TestQemuAArch64TargetXml.py 100.58s: lldb-api :: functionalities/gdb_remote_client/TestGDBRemoteLoad.py 98.60s: lldb-api :: functionalities/postmortem/mach-core/TestMachCore.py 98.39s: lldb-api :: tools/lldb-server/TestLldbGdbServer.py 64.48s: lldb-api :: commands/target/basic/TestTargetCommand.py 60.70s: lldb-api :: lang/objc/hidden-ivars/TestHiddenIvars.py 58.83s: lldb-api :: lang/objc/objc-new-syntax/TestObjCNewSyntaxArray.py 57.91s: lldb-api :: lang/c/register_variables/TestRegisterVariables.py 56.28s: lldb-api :: functionalities/gdb_remote_client/TestRegDefinitionInParts.py 55.01s: lldb-api :: api/multithreaded/TestMultithreaded.py 53.86s: lldb-api :: lang/objc/foundation/TestFoundationDisassembly.py 53.15s: lldb-api :: functionalities/gdb_remote_client/TestArmRegisterDefinition.py 52.67s: lldb-api :: lang/objc/foundation/TestObjCMethods.py 52.08s: lldb-api :: lang/cpp/stl/TestSTL.py 51.48s: lldb-api :: lang/objc/exceptions/TestObjCExceptions.py 48.31s: lldb-api :: lang/cpp/namespace/TestNamespaceLookup.py 47.89s: lldb-api :: functionalities/completion/TestCompletion.py

Hide Details

Tests Times: -------------------------------------------------------------------------- [ Range ] :: [ Percentage ] :: [ Count ] -------------------------------------------------------------------------- [460s,480s) :: [ ] :: [ 1/2154] [440s,460s) :: [ ] :: [ 0/2154] [420s,440s) :: [ ] :: [ 0/2154] [400s,420s) :: [ ] :: [ 0/2154] [380s,400s) :: [ ] :: [ 0/2154] [360s,380s) :: [ ] :: [ 0/2154] [340s,360s) :: [ ] :: [ 0/2154] [320s,340s) :: [ ] :: [ 0/2154] [300s,320s) :: [ ] :: [ 0/2154] [280s,300s) :: [ ] :: [ 0/2154] [260s,280s) :: [ ] :: [ 0/2154] [240s,260s) :: [ ] :: [ 0/2154] [220s,240s) :: [ ] :: [ 0/2154] [200s,220s) :: [ ] :: [ 0/2154] [180s,200s) :: [ ] :: [ 0/2154] [160s,180s) :: [ ] :: [ 0/2154] [140s,160s) :: [ ] :: [ 0/2154] [120s,140s) :: [ ] :: [ 2/2154] [100s,120s) :: [ ] :: [ 4/2154] [ 80s,100s) :: [ ] :: [ 0/2154] [ 60s, 80s) :: [ ] :: [ 3/2154] [ 40s, 60s) :: [ ] :: [ 20/2154] [ 20s, 40s) :: [* ] :: [ 69/2154] [ 0s, 20s) :: [************************************** ] :: [2055/2154] -------------------------------------------------------------------------- ******************** Failed Tests (3): lldb-api :: commands/target/stop-hooks/TestStopHookScripted.py lldb-api :: functionalities/gdb_remote_client/TestGDBRemoteLoad.py lldb-api :: functionalities/gdb_remote_client/TestQemuAArch64TargetXml.py

Hide Details

Hide Details

Testing Time: 2221.82s Unsupported : 153 Passed : 1992 Expectedly Failed: 6 Failed : 3 FAILED: tools/lldb/test/CMakeFiles/check-lldb-lit cd /Users/buildslave/jenkins/workspace/lldb-cmake/lldb-build/tools/lldb/test && /usr/local/Frameworks/Python.framework/Versions/3.7/bin/python3.7 /Users/buildslave/jenkins/workspace/lldb-cmake/lldb-build/./bin/llvm-lit -v --time-tests --shuffle --xunit-xml-output=/Users/buildslave/jenkins/workspace/lldb-cmake/test/results.xml -v -j 4 /Users/buildslave/jenkins/workspace/lldb-cmake/lldb-build/tools/lldb/test ninja: build stopped: subcommand failed. Command failed: Command '['/usr/bin/env', 'TERM=vt100', '/usr/local/bin/ninja', '-v', 'check-lldb']' returned non-zero exit status 1 Command: ['/usr/bin/env', 'TERM=vt100', '/usr/local/bin/ninja', '-v', 'check-lldb'] [Pipeline] } [Pipeline] // timeout [Pipeline] } [Pipeline] // stage [Pipeline] stage [Pipeline] { (Declarative: Post Actions) [Pipeline] scanForIssues [Clang (LLVM based)] Sleeping for 5 seconds due to JENKINS-32191... [Clang (LLVM based)] Parsing console log (workspace: '/Users/buildslave/jenkins/workspace/lldb-cmake') [Clang (LLVM based)] Successfully parsed console log [Clang (LLVM based)] -> found 8 issues (skipped 12 duplicates) [Clang (LLVM based)] Post processing issues on 'green-dragon-10' with source code encoding 'UTF-8' [Clang (LLVM based)] Creating SCM blamer to obtain author and commit information for affected files [Clang (LLVM based)] Creating SCM miner to obtain statistics for affected repository files [Clang (LLVM based)] Resolving file names for all issues in source directory '/Users/buildslave/jenkins/workspace/lldb-cmake' [Clang (LLVM based)] -> resolved paths in source directory (6 found, 0 not found) [Clang (LLVM based)] Resolving module names from module definitions (build.xml, pom.xml, or Manifest.mf files) [Clang (LLVM based)] -> resolved module names for 8 issues [Clang (LLVM based)] Resolving package names (or namespaces) by parsing the affected files [Clang (LLVM based)] -> resolved package names of 6 affected files [Clang (LLVM based)] No filter has been set, publishing all 8 issues [Clang (LLVM based)] Creating fingerprints for all affected code blocks to track issues over different builds [Clang (LLVM based)] -> created fingerprints for 8 issues (skipped 0 issues) [Clang (LLVM based)] Copying affected files to Jenkins' build folder '/Users/Shared/Jenkins/Home/jobs/lldb-cmake/builds/23999/files-with-issues' [Clang (LLVM based)] -> 4 copied, 2 not in workspace, 0 not-found, 0 with I/O error [Pipeline] junit Recording test results [Pipeline] } [Pipeline] // stage [Pipeline] } [Pipeline] // withEnv [Pipeline] } [Pipeline] // node [Pipeline] End of Pipeline ERROR: script returned exit code 1 Finished: FAILURE