Started 18 days ago
Took 2 hr 18 min

Failed Build clang-d379351-g87e280110d91-t18470-b18470.tar.gz (Feb 8, 2021 3:06:26 PM)

Issues

Found 3 issues:
Ninja target: matrix-types-spec.cpp.o
[8844/11531] : && /Users/buildslave/jenkins/workspace/test-suite-verify-machineinstrs-aarch64-O3@2/test-suite-build/tools/timeit --summary SingleSource/UnitTests/Vector/NEON/Vector-NEON-simple.link.time /Users/buildslave/jenkins/workspace/test-suite-verify-machineinstrs-aarch64-O3@2/compiler/bin/clang -B /Applications/Xcode.app/Contents/Developer/Toolchains/XcodeDefault.xctoolchain/usr/bin    -Wno-unused-command-line-argument -mllvm -verify-machineinstrs -O3 -arch arm64 -isysroot /Applications/Xcode.app/Contents/Developer/Platforms/iPhoneOS.platform/Developer/SDKs/iPhoneOS13.5.sdk -Wl,-search_paths_first -Wl,-headerpad_max_install_names -B /Applications/Xcode.app/Contents/Developer/Toolchains/XcodeDefault.xctoolchain/usr/bin SingleSource/UnitTests/Vector/NEON/CMakeFiles/Vector-NEON-simple.dir/simple.c.o  -o SingleSource/UnitTests/Vector/NEON/Vector-NEON-simple   && cd /Users/buildslave/jenkins/workspace/test-suite-verify-machineinstrs-aarch64-O3@2/test-suite-build/SingleSource/UnitTests/Vector/NEON && /usr/local/Cellar/cmake/3.17.2/bin/cmake -E create_symlink /Users/buildslave/jenkins/workspace/test-suite-verify-machineinstrs-aarch64-O3@2/test-suite/SingleSource/UnitTests/Vector/NEON/simple.reference_output /Users/buildslave/jenkins/workspace/test-suite-verify-machineinstrs-aarch64-O3@2/test-suite-build/SingleSource/UnitTests/Vector/NEON/simple.reference_output
[8845/11531] /Users/buildslave/jenkins/workspace/test-suite-verify-machineinstrs-aarch64-O3@2/test-suite-build/tools/timeit --summary SingleSource/UnitTests/ObjC/CMakeFiles/trivial-interface.dir/trivial-interface.m.o.time /Users/buildslave/jenkins/workspace/test-suite-verify-machineinstrs-aarch64-O3@2/compiler/bin/clang -DNDEBUG  -B /Applications/Xcode.app/Contents/Developer/Toolchains/XcodeDefault.xctoolchain/usr/bin    -Wno-unused-command-line-argument -mllvm -verify-machineinstrs -O3 -arch arm64 -isysroot /Applications/Xcode.app/Contents/Developer/Platforms/iPhoneOS.platform/Developer/SDKs/iPhoneOS13.5.sdk   -w -Werror=date-time -MD -MT SingleSource/UnitTests/ObjC/CMakeFiles/trivial-interface.dir/trivial-interface.m.o -MF SingleSource/UnitTests/ObjC/CMakeFiles/trivial-interface.dir/trivial-interface.m.o.d -o SingleSource/UnitTests/ObjC/CMakeFiles/trivial-interface.dir/trivial-interface.m.o   -c '/Users/buildslave/jenkins/workspace/test-suite-verify-machineinstrs-aarch64-O3@2/test-suite/SingleSource/UnitTests/ObjC/trivial-interface.m'
[8846/11531] : && /Users/buildslave/jenkins/workspace/test-suite-verify-machineinstrs-aarch64-O3@2/test-suite-build/tools/timeit --summary SingleSource/UnitTests/ObjC/trivial-interface.link.time /Users/buildslave/jenkins/workspace/test-suite-verify-machineinstrs-aarch64-O3@2/compiler/bin/clang -B /Applications/Xcode.app/Contents/Developer/Toolchains/XcodeDefault.xctoolchain/usr/bin    -Wno-unused-command-line-argument -mllvm -verify-machineinstrs -O3 -arch arm64 -isysroot /Applications/Xcode.app/Contents/Developer/Platforms/iPhoneOS.platform/Developer/SDKs/iPhoneOS13.5.sdk -Wl,-search_paths_first -Wl,-headerpad_max_install_names -B /Applications/Xcode.app/Contents/Developer/Toolchains/XcodeDefault.xctoolchain/usr/bin SingleSource/UnitTests/ObjC/CMakeFiles/trivial-interface.dir/trivial-interface.m.o  -o SingleSource/UnitTests/ObjC/trivial-interface  -lobjc -framework Foundation && cd /Users/buildslave/jenkins/workspace/test-suite-verify-machineinstrs-aarch64-O3@2/test-suite-build/SingleSource/UnitTests/ObjC && /usr/local/Cellar/cmake/3.17.2/bin/cmake -E create_symlink /Users/buildslave/jenkins/workspace/test-suite-verify-machineinstrs-aarch64-O3@2/test-suite/SingleSource/UnitTests/ObjC/trivial-interface.reference_output /Users/buildslave/jenkins/workspace/test-suite-verify-machineinstrs-aarch64-O3@2/test-suite-build/SingleSource/UnitTests/ObjC/trivial-interface.reference_output
[8847/11531] /Users/buildslave/jenkins/workspace/test-suite-verify-machineinstrs-aarch64-O3@2/test-suite-build/tools/timeit --summary SingleSource/UnitTests/ObjC/CMakeFiles/dot-syntax-2.dir/dot-syntax-2.m.o.time /Users/buildslave/jenkins/workspace/test-suite-verify-machineinstrs-aarch64-O3@2/compiler/bin/clang -DNDEBUG  -B /Applications/Xcode.app/Contents/Developer/Toolchains/XcodeDefault.xctoolchain/usr/bin    -Wno-unused-command-line-argument -mllvm -verify-machineinstrs -O3 -arch arm64 -isysroot /Applications/Xcode.app/Contents/Developer/Platforms/iPhoneOS.platform/Developer/SDKs/iPhoneOS13.5.sdk   -w -Werror=date-time -MD -MT SingleSource/UnitTests/ObjC/CMakeFiles/dot-syntax-2.dir/dot-syntax-2.m.o -MF SingleSource/UnitTests/ObjC/CMakeFiles/dot-syntax-2.dir/dot-syntax-2.m.o.d -o SingleSource/UnitTests/ObjC/CMakeFiles/dot-syntax-2.dir/dot-syntax-2.m.o   -c '/Users/buildslave/jenkins/workspace/test-suite-verify-machineinstrs-aarch64-O3@2/test-suite/SingleSource/UnitTests/ObjC/dot-syntax-2.m'
[8848/11531] /Users/buildslave/jenkins/workspace/test-suite-verify-machineinstrs-aarch64-O3@2/test-suite-build/tools/timeit --summary SingleSource/UnitTests/CMakeFiles/matrix-types-spec.dir/matrix-types-spec.cpp.o.time /Users/buildslave/jenkins/workspace/test-suite-verify-machineinstrs-aarch64-O3@2/compiler/bin/clang++  -DNDEBUG  -B /Applications/Xcode.app/Contents/Developer/Toolchains/XcodeDefault.xctoolchain/usr/bin    -Wno-unused-command-line-argument -mllvm -verify-machineinstrs -O3 -arch arm64 -isysroot /Applications/Xcode.app/Contents/Developer/Platforms/iPhoneOS.platform/Developer/SDKs/iPhoneOS13.5.sdk   -w -Werror=date-time -fenable-matrix -MD -MT SingleSource/UnitTests/CMakeFiles/matrix-types-spec.dir/matrix-types-spec.cpp.o -MF SingleSource/UnitTests/CMakeFiles/matrix-types-spec.dir/matrix-types-spec.cpp.o.d -o SingleSource/UnitTests/CMakeFiles/matrix-types-spec.dir/matrix-types-spec.cpp.o -c '/Users/buildslave/jenkins/workspace/test-suite-verify-machineinstrs-aarch64-O3@2/test-suite/SingleSource/UnitTests/matrix-types-spec.cpp'
FAILED: SingleSource/UnitTests/CMakeFiles/matrix-types-spec.dir/matrix-types-spec.cpp.o 
/Users/buildslave/jenkins/workspace/test-suite-verify-machineinstrs-aarch64-O3@2/test-suite-build/tools/timeit --summary SingleSource/UnitTests/CMakeFiles/matrix-types-spec.dir/matrix-types-spec.cpp.o.time /Users/buildslave/jenkins/workspace/test-suite-verify-machineinstrs-aarch64-O3@2/compiler/bin/clang++  -DNDEBUG  -B /Applications/Xcode.app/Contents/Developer/Toolchains/XcodeDefault.xctoolchain/usr/bin    -Wno-unused-command-line-argument -mllvm -verify-machineinstrs -O3 -arch arm64 -isysroot /Applications/Xcode.app/Contents/Developer/Platforms/iPhoneOS.platform/Developer/SDKs/iPhoneOS13.5.sdk   -w -Werror=date-time -fenable-matrix -MD -MT SingleSource/UnitTests/CMakeFiles/matrix-types-spec.dir/matrix-types-spec.cpp.o -MF SingleSource/UnitTests/CMakeFiles/matrix-types-spec.dir/matrix-types-spec.cpp.o.d -o SingleSource/UnitTests/CMakeFiles/matrix-types-spec.dir/matrix-types-spec.cpp.o -c '/Users/buildslave/jenkins/workspace/test-suite-verify-machineinstrs-aarch64-O3@2/test-suite/SingleSource/UnitTests/matrix-types-spec.cpp'
Assertion failed: ((VF == 1 || VF == cast<FixedVectorType>(VecTy)->getNumElements()) && "Vector argument does not match VF"), function getOperandsScalarizationOverhead, file /Users/buildslave/jenkins/workspace/clang-stage1-RA/llvm-project/llvm/include/llvm/CodeGen/BasicTTIImpl.h, line 632.
assertion: (VF == 1 || VF == cast<FixedVectorType>(VecTy)->getNumElements()) && "Vector argument does not match VF"
[8846/11531] : && /Users/buildslave/jenkins/workspace/test-suite-verify-machineinstrs-aarch64-O3@2/test-suite-build/tools/timeit --summary SingleSource/UnitTests/ObjC/trivial-interface.link.time /Users/buildslave/jenkins/workspace/test-suite-verify-machineinstrs-aarch64-O3@2/compiler/bin/clang -B /Applications/Xcode.app/Contents/Developer/Toolchains/XcodeDefault.xctoolchain/usr/bin    -Wno-unused-command-line-argument -mllvm -verify-machineinstrs -O3 -arch arm64 -isysroot /Applications/Xcode.app/Contents/Developer/Platforms/iPhoneOS.platform/Developer/SDKs/iPhoneOS13.5.sdk -Wl,-search_paths_first -Wl,-headerpad_max_install_names -B /Applications/Xcode.app/Contents/Developer/Toolchains/XcodeDefault.xctoolchain/usr/bin SingleSource/UnitTests/ObjC/CMakeFiles/trivial-interface.dir/trivial-interface.m.o  -o SingleSource/UnitTests/ObjC/trivial-interface  -lobjc -framework Foundation && cd /Users/buildslave/jenkins/workspace/test-suite-verify-machineinstrs-aarch64-O3@2/test-suite-build/SingleSource/UnitTests/ObjC && /usr/local/Cellar/cmake/3.17.2/bin/cmake -E create_symlink /Users/buildslave/jenkins/workspace/test-suite-verify-machineinstrs-aarch64-O3@2/test-suite/SingleSource/UnitTests/ObjC/trivial-interface.reference_output /Users/buildslave/jenkins/workspace/test-suite-verify-machineinstrs-aarch64-O3@2/test-suite-build/SingleSource/UnitTests/ObjC/trivial-interface.reference_output
[8847/11531] /Users/buildslave/jenkins/workspace/test-suite-verify-machineinstrs-aarch64-O3@2/test-suite-build/tools/timeit --summary SingleSource/UnitTests/ObjC/CMakeFiles/dot-syntax-2.dir/dot-syntax-2.m.o.time /Users/buildslave/jenkins/workspace/test-suite-verify-machineinstrs-aarch64-O3@2/compiler/bin/clang -DNDEBUG  -B /Applications/Xcode.app/Contents/Developer/Toolchains/XcodeDefault.xctoolchain/usr/bin    -Wno-unused-command-line-argument -mllvm -verify-machineinstrs -O3 -arch arm64 -isysroot /Applications/Xcode.app/Contents/Developer/Platforms/iPhoneOS.platform/Developer/SDKs/iPhoneOS13.5.sdk   -w -Werror=date-time -MD -MT SingleSource/UnitTests/ObjC/CMakeFiles/dot-syntax-2.dir/dot-syntax-2.m.o -MF SingleSource/UnitTests/ObjC/CMakeFiles/dot-syntax-2.dir/dot-syntax-2.m.o.d -o SingleSource/UnitTests/ObjC/CMakeFiles/dot-syntax-2.dir/dot-syntax-2.m.o   -c '/Users/buildslave/jenkins/workspace/test-suite-verify-machineinstrs-aarch64-O3@2/test-suite/SingleSource/UnitTests/ObjC/dot-syntax-2.m'
[8848/11531] /Users/buildslave/jenkins/workspace/test-suite-verify-machineinstrs-aarch64-O3@2/test-suite-build/tools/timeit --summary SingleSource/UnitTests/CMakeFiles/matrix-types-spec.dir/matrix-types-spec.cpp.o.time /Users/buildslave/jenkins/workspace/test-suite-verify-machineinstrs-aarch64-O3@2/compiler/bin/clang++  -DNDEBUG  -B /Applications/Xcode.app/Contents/Developer/Toolchains/XcodeDefault.xctoolchain/usr/bin    -Wno-unused-command-line-argument -mllvm -verify-machineinstrs -O3 -arch arm64 -isysroot /Applications/Xcode.app/Contents/Developer/Platforms/iPhoneOS.platform/Developer/SDKs/iPhoneOS13.5.sdk   -w -Werror=date-time -fenable-matrix -MD -MT SingleSource/UnitTests/CMakeFiles/matrix-types-spec.dir/matrix-types-spec.cpp.o -MF SingleSource/UnitTests/CMakeFiles/matrix-types-spec.dir/matrix-types-spec.cpp.o.d -o SingleSource/UnitTests/CMakeFiles/matrix-types-spec.dir/matrix-types-spec.cpp.o -c '/Users/buildslave/jenkins/workspace/test-suite-verify-machineinstrs-aarch64-O3@2/test-suite/SingleSource/UnitTests/matrix-types-spec.cpp'
FAILED: SingleSource/UnitTests/CMakeFiles/matrix-types-spec.dir/matrix-types-spec.cpp.o 
/Users/buildslave/jenkins/workspace/test-suite-verify-machineinstrs-aarch64-O3@2/test-suite-build/tools/timeit --summary SingleSource/UnitTests/CMakeFiles/matrix-types-spec.dir/matrix-types-spec.cpp.o.time /Users/buildslave/jenkins/workspace/test-suite-verify-machineinstrs-aarch64-O3@2/compiler/bin/clang++  -DNDEBUG  -B /Applications/Xcode.app/Contents/Developer/Toolchains/XcodeDefault.xctoolchain/usr/bin    -Wno-unused-command-line-argument -mllvm -verify-machineinstrs -O3 -arch arm64 -isysroot /Applications/Xcode.app/Contents/Developer/Platforms/iPhoneOS.platform/Developer/SDKs/iPhoneOS13.5.sdk   -w -Werror=date-time -fenable-matrix -MD -MT SingleSource/UnitTests/CMakeFiles/matrix-types-spec.dir/matrix-types-spec.cpp.o -MF SingleSource/UnitTests/CMakeFiles/matrix-types-spec.dir/matrix-types-spec.cpp.o.d -o SingleSource/UnitTests/CMakeFiles/matrix-types-spec.dir/matrix-types-spec.cpp.o -c '/Users/buildslave/jenkins/workspace/test-suite-verify-machineinstrs-aarch64-O3@2/test-suite/SingleSource/UnitTests/matrix-types-spec.cpp'
Assertion failed: ((VF == 1 || VF == cast<FixedVectorType>(VecTy)->getNumElements()) && "Vector argument does not match VF"), function getOperandsScalarizationOverhead, file /Users/buildslave/jenkins/workspace/clang-stage1-RA/llvm-project/llvm/include/llvm/CodeGen/BasicTTIImpl.h, line 632.
PLEASE submit a bug report to https://bugs.llvm.org/ and include the crash backtrace, preprocessed source, and associated run script.
Stack dump:
Error: clang frontend command failed with exit code 134 (use -v to see invocation)
48 clang++                  0x000000010e27462d clang::driver::Compilation::ExecuteCommand(clang::driver::Command const&, clang::driver::Command const*&) const + 221
49 clang++                  0x000000010e274b5d clang::driver::Compilation::ExecuteJobs(clang::driver::JobList const&, llvm::SmallVectorImpl<std::__1::pair<int, clang::driver::Command const*> >&) const + 125
50 clang++                  0x000000010e28b0bc clang::driver::Driver::ExecuteCompilation(clang::driver::Compilation&, llvm::SmallVectorImpl<std::__1::pair<int, clang::driver::Command const*> >&) + 204
51 clang++                  0x000000010bb3b25b main + 10251
52 libdyld.dylib            0x00007fff71684cc9 start + 1
clang-13: error: clang frontend command failed with exit code 134 (use -v to see invocation)
clang version 13.0.0 (https://github.com/llvm/llvm-project.git 87e280110d91edda0353eddb621cb96f72c7ece3)
Target: aarch64-apple-darwin19.5.0

Build Log

Changes
  1. [scudo/standalone] Use .arch_extension memtag, not mte (details)
  2. DebugInfo/Symbolize: Allow STT_NOTYPE/STT_GNU_IFUNC symbols for .symtab symbolization (details)
  3. [AArch64] Use '//' as comment string for MSVC assembly (details)
  4. Revert "[Test] Add failing test for PR49087" (details)
  5. [AArch64][GlobalISel] Support the 'returned' parameter attribute. (details)
  6. [CMake] [MinGW] Enable use of LLVM_USE_SANITIZER in a MinGW environment (details)
  7. [gn build] reformat all gn files (details)
  8. [SimpleLoopUnswitch] Don't non-trivially unswitch loops that are unsafe to clone (details)
  9. [ARM] One-off identity shuffle (details)
  10. [Verifier] Allow DW_TAG_class_type/DW_TAG_union_type to have no filename (details)
  11. [FileCheck] Default --allow-unused-prefixes to false (details)
  12. [test] Fix unused check prefixes (details)
  13. [flang][NFC] Add comment. (details)
  14. [NVPTX][NewPM] Re-enable NVVMReflectPass (details)
  15. AMDGPU/GlobalISel: Remove dead check prefixes (details)
  16. AMDGPU: Stop adding stack passed wide arguments to call conv handler (details)
  17. GlobalISel: Use correct calling convention in handleAssignments (details)

Started by upstream project relay-test-suite-verify-machineinstrs build number 9262
originally caused by:

This run spent:

  • 1 hr 46 min waiting;
  • 2 hr 18 min build duration;
  • 2 hr 18 min total from scheduled to completion.
Revision: 1d4d24022c169956be72efdfbf8fa38de8f4f975
  • refs/remotes/origin/main
Revision: 87e280110d91edda0353eddb621cb96f72c7ece3
  • detached
Revision: f48d431f44610e339d00a33d57564c6029c4ff43
  • refs/remotes/origin/main
Revision: 3a39afc9019cad5bd69d8c70503339ac95ddd2ed
  • refs/remotes/origin/main

Identified problems

Assertion failure

This build failed because of an assertion failure. Below is a list of all errors in the build log:
Indication 1

Ninja target failed

Below is a link to the first failed ninja target.
Indication 2

Compile Error

This build failed because of a compile error. Below is a list of all errors in the build log:
Indication 3