Started 1 day 17 hr ago
Took 2 hr 7 min

Failed Build clang-d385546-gc3f127146415-t20151-b20151.tar.gz (Apr 15, 2021 12:03:41 AM)

Issues

Found 3 issues:
Ninja target: macroblock.c.o
[6235/11549] /Users/buildslave/jenkins/workspace/test-suite-verify-machineinstrs-aarch64-O3/test-suite-build/tools/timeit --summary MultiSource/Applications/JM/lencod/CMakeFiles/lencod.dir/image.c.o.time /Users/buildslave/jenkins/workspace/test-suite-verify-machineinstrs-aarch64-O3/compiler/bin/clang -DNDEBUG  -B /Applications/Xcode.app/Contents/Developer/Toolchains/XcodeDefault.xctoolchain/usr/bin    -Wno-unused-command-line-argument -mllvm -verify-machineinstrs -O3 -arch arm64 -isysroot /Applications/Xcode.app/Contents/Developer/Platforms/iPhoneOS.platform/Developer/SDKs/iPhoneOS13.5.sdk   -w -Werror=date-time -fcommon -D__USE_LARGEFILE64 -D_FILE_OFFSET_BITS=64 -MD -MT MultiSource/Applications/JM/lencod/CMakeFiles/lencod.dir/image.c.o -MF MultiSource/Applications/JM/lencod/CMakeFiles/lencod.dir/image.c.o.d -o MultiSource/Applications/JM/lencod/CMakeFiles/lencod.dir/image.c.o   -c /Users/buildslave/jenkins/workspace/test-suite-verify-machineinstrs-aarch64-O3/test-suite/MultiSource/Applications/JM/lencod/image.c
[6236/11549] /Users/buildslave/jenkins/workspace/test-suite-verify-machineinstrs-aarch64-O3/test-suite-build/tools/timeit --summary MultiSource/Applications/JM/lencod/CMakeFiles/lencod.dir/md_highloss.c.o.time /Users/buildslave/jenkins/workspace/test-suite-verify-machineinstrs-aarch64-O3/compiler/bin/clang -DNDEBUG  -B /Applications/Xcode.app/Contents/Developer/Toolchains/XcodeDefault.xctoolchain/usr/bin    -Wno-unused-command-line-argument -mllvm -verify-machineinstrs -O3 -arch arm64 -isysroot /Applications/Xcode.app/Contents/Developer/Platforms/iPhoneOS.platform/Developer/SDKs/iPhoneOS13.5.sdk   -w -Werror=date-time -fcommon -D__USE_LARGEFILE64 -D_FILE_OFFSET_BITS=64 -MD -MT MultiSource/Applications/JM/lencod/CMakeFiles/lencod.dir/md_highloss.c.o -MF MultiSource/Applications/JM/lencod/CMakeFiles/lencod.dir/md_highloss.c.o.d -o MultiSource/Applications/JM/lencod/CMakeFiles/lencod.dir/md_highloss.c.o   -c /Users/buildslave/jenkins/workspace/test-suite-verify-machineinstrs-aarch64-O3/test-suite/MultiSource/Applications/JM/lencod/md_highloss.c
[6237/11549] /Users/buildslave/jenkins/workspace/test-suite-verify-machineinstrs-aarch64-O3/test-suite-build/tools/timeit --summary MultiSource/Applications/JM/lencod/CMakeFiles/lencod.dir/md_highfast.c.o.time /Users/buildslave/jenkins/workspace/test-suite-verify-machineinstrs-aarch64-O3/compiler/bin/clang -DNDEBUG  -B /Applications/Xcode.app/Contents/Developer/Toolchains/XcodeDefault.xctoolchain/usr/bin    -Wno-unused-command-line-argument -mllvm -verify-machineinstrs -O3 -arch arm64 -isysroot /Applications/Xcode.app/Contents/Developer/Platforms/iPhoneOS.platform/Developer/SDKs/iPhoneOS13.5.sdk   -w -Werror=date-time -fcommon -D__USE_LARGEFILE64 -D_FILE_OFFSET_BITS=64 -MD -MT MultiSource/Applications/JM/lencod/CMakeFiles/lencod.dir/md_highfast.c.o -MF MultiSource/Applications/JM/lencod/CMakeFiles/lencod.dir/md_highfast.c.o.d -o MultiSource/Applications/JM/lencod/CMakeFiles/lencod.dir/md_highfast.c.o   -c /Users/buildslave/jenkins/workspace/test-suite-verify-machineinstrs-aarch64-O3/test-suite/MultiSource/Applications/JM/lencod/md_highfast.c
[6238/11549] /Users/buildslave/jenkins/workspace/test-suite-verify-machineinstrs-aarch64-O3/test-suite-build/tools/timeit --summary MultiSource/Applications/JM/lencod/CMakeFiles/lencod.dir/md_low.c.o.time /Users/buildslave/jenkins/workspace/test-suite-verify-machineinstrs-aarch64-O3/compiler/bin/clang -DNDEBUG  -B /Applications/Xcode.app/Contents/Developer/Toolchains/XcodeDefault.xctoolchain/usr/bin    -Wno-unused-command-line-argument -mllvm -verify-machineinstrs -O3 -arch arm64 -isysroot /Applications/Xcode.app/Contents/Developer/Platforms/iPhoneOS.platform/Developer/SDKs/iPhoneOS13.5.sdk   -w -Werror=date-time -fcommon -D__USE_LARGEFILE64 -D_FILE_OFFSET_BITS=64 -MD -MT MultiSource/Applications/JM/lencod/CMakeFiles/lencod.dir/md_low.c.o -MF MultiSource/Applications/JM/lencod/CMakeFiles/lencod.dir/md_low.c.o.d -o MultiSource/Applications/JM/lencod/CMakeFiles/lencod.dir/md_low.c.o   -c /Users/buildslave/jenkins/workspace/test-suite-verify-machineinstrs-aarch64-O3/test-suite/MultiSource/Applications/JM/lencod/md_low.c
[6239/11549] /Users/buildslave/jenkins/workspace/test-suite-verify-machineinstrs-aarch64-O3/test-suite-build/tools/timeit --summary MultiSource/Applications/JM/lencod/CMakeFiles/lencod.dir/macroblock.c.o.time /Users/buildslave/jenkins/workspace/test-suite-verify-machineinstrs-aarch64-O3/compiler/bin/clang -DNDEBUG  -B /Applications/Xcode.app/Contents/Developer/Toolchains/XcodeDefault.xctoolchain/usr/bin    -Wno-unused-command-line-argument -mllvm -verify-machineinstrs -O3 -arch arm64 -isysroot /Applications/Xcode.app/Contents/Developer/Platforms/iPhoneOS.platform/Developer/SDKs/iPhoneOS13.5.sdk   -w -Werror=date-time -fcommon -D__USE_LARGEFILE64 -D_FILE_OFFSET_BITS=64 -MD -MT MultiSource/Applications/JM/lencod/CMakeFiles/lencod.dir/macroblock.c.o -MF MultiSource/Applications/JM/lencod/CMakeFiles/lencod.dir/macroblock.c.o.d -o MultiSource/Applications/JM/lencod/CMakeFiles/lencod.dir/macroblock.c.o   -c /Users/buildslave/jenkins/workspace/test-suite-verify-machineinstrs-aarch64-O3/test-suite/MultiSource/Applications/JM/lencod/macroblock.c
FAILED: MultiSource/Applications/JM/lencod/CMakeFiles/lencod.dir/macroblock.c.o 
/Users/buildslave/jenkins/workspace/test-suite-verify-machineinstrs-aarch64-O3/test-suite-build/tools/timeit --summary MultiSource/Applications/JM/lencod/CMakeFiles/lencod.dir/macroblock.c.o.time /Users/buildslave/jenkins/workspace/test-suite-verify-machineinstrs-aarch64-O3/compiler/bin/clang -DNDEBUG  -B /Applications/Xcode.app/Contents/Developer/Toolchains/XcodeDefault.xctoolchain/usr/bin    -Wno-unused-command-line-argument -mllvm -verify-machineinstrs -O3 -arch arm64 -isysroot /Applications/Xcode.app/Contents/Developer/Platforms/iPhoneOS.platform/Developer/SDKs/iPhoneOS13.5.sdk   -w -Werror=date-time -fcommon -D__USE_LARGEFILE64 -D_FILE_OFFSET_BITS=64 -MD -MT MultiSource/Applications/JM/lencod/CMakeFiles/lencod.dir/macroblock.c.o -MF MultiSource/Applications/JM/lencod/CMakeFiles/lencod.dir/macroblock.c.o.d -o MultiSource/Applications/JM/lencod/CMakeFiles/lencod.dir/macroblock.c.o   -c /Users/buildslave/jenkins/workspace/test-suite-verify-machineinstrs-aarch64-O3/test-suite/MultiSource/Applications/JM/lencod/macroblock.c
Assertion failed: (!isInvalid() && "Loop not in a valid state!"), function getBlocks, file /Users/buildslave/jenkins/workspace/clang-stage1-RA/llvm-project/llvm/include/llvm/Analysis/LoopInfo.h, line 172.
assertion: !isInvalid() && "Loop not in a valid state!"
[6237/11549] /Users/buildslave/jenkins/workspace/test-suite-verify-machineinstrs-aarch64-O3/test-suite-build/tools/timeit --summary MultiSource/Applications/JM/lencod/CMakeFiles/lencod.dir/md_highfast.c.o.time /Users/buildslave/jenkins/workspace/test-suite-verify-machineinstrs-aarch64-O3/compiler/bin/clang -DNDEBUG  -B /Applications/Xcode.app/Contents/Developer/Toolchains/XcodeDefault.xctoolchain/usr/bin    -Wno-unused-command-line-argument -mllvm -verify-machineinstrs -O3 -arch arm64 -isysroot /Applications/Xcode.app/Contents/Developer/Platforms/iPhoneOS.platform/Developer/SDKs/iPhoneOS13.5.sdk   -w -Werror=date-time -fcommon -D__USE_LARGEFILE64 -D_FILE_OFFSET_BITS=64 -MD -MT MultiSource/Applications/JM/lencod/CMakeFiles/lencod.dir/md_highfast.c.o -MF MultiSource/Applications/JM/lencod/CMakeFiles/lencod.dir/md_highfast.c.o.d -o MultiSource/Applications/JM/lencod/CMakeFiles/lencod.dir/md_highfast.c.o   -c /Users/buildslave/jenkins/workspace/test-suite-verify-machineinstrs-aarch64-O3/test-suite/MultiSource/Applications/JM/lencod/md_highfast.c
[6238/11549] /Users/buildslave/jenkins/workspace/test-suite-verify-machineinstrs-aarch64-O3/test-suite-build/tools/timeit --summary MultiSource/Applications/JM/lencod/CMakeFiles/lencod.dir/md_low.c.o.time /Users/buildslave/jenkins/workspace/test-suite-verify-machineinstrs-aarch64-O3/compiler/bin/clang -DNDEBUG  -B /Applications/Xcode.app/Contents/Developer/Toolchains/XcodeDefault.xctoolchain/usr/bin    -Wno-unused-command-line-argument -mllvm -verify-machineinstrs -O3 -arch arm64 -isysroot /Applications/Xcode.app/Contents/Developer/Platforms/iPhoneOS.platform/Developer/SDKs/iPhoneOS13.5.sdk   -w -Werror=date-time -fcommon -D__USE_LARGEFILE64 -D_FILE_OFFSET_BITS=64 -MD -MT MultiSource/Applications/JM/lencod/CMakeFiles/lencod.dir/md_low.c.o -MF MultiSource/Applications/JM/lencod/CMakeFiles/lencod.dir/md_low.c.o.d -o MultiSource/Applications/JM/lencod/CMakeFiles/lencod.dir/md_low.c.o   -c /Users/buildslave/jenkins/workspace/test-suite-verify-machineinstrs-aarch64-O3/test-suite/MultiSource/Applications/JM/lencod/md_low.c
[6239/11549] /Users/buildslave/jenkins/workspace/test-suite-verify-machineinstrs-aarch64-O3/test-suite-build/tools/timeit --summary MultiSource/Applications/JM/lencod/CMakeFiles/lencod.dir/macroblock.c.o.time /Users/buildslave/jenkins/workspace/test-suite-verify-machineinstrs-aarch64-O3/compiler/bin/clang -DNDEBUG  -B /Applications/Xcode.app/Contents/Developer/Toolchains/XcodeDefault.xctoolchain/usr/bin    -Wno-unused-command-line-argument -mllvm -verify-machineinstrs -O3 -arch arm64 -isysroot /Applications/Xcode.app/Contents/Developer/Platforms/iPhoneOS.platform/Developer/SDKs/iPhoneOS13.5.sdk   -w -Werror=date-time -fcommon -D__USE_LARGEFILE64 -D_FILE_OFFSET_BITS=64 -MD -MT MultiSource/Applications/JM/lencod/CMakeFiles/lencod.dir/macroblock.c.o -MF MultiSource/Applications/JM/lencod/CMakeFiles/lencod.dir/macroblock.c.o.d -o MultiSource/Applications/JM/lencod/CMakeFiles/lencod.dir/macroblock.c.o   -c /Users/buildslave/jenkins/workspace/test-suite-verify-machineinstrs-aarch64-O3/test-suite/MultiSource/Applications/JM/lencod/macroblock.c
FAILED: MultiSource/Applications/JM/lencod/CMakeFiles/lencod.dir/macroblock.c.o 
/Users/buildslave/jenkins/workspace/test-suite-verify-machineinstrs-aarch64-O3/test-suite-build/tools/timeit --summary MultiSource/Applications/JM/lencod/CMakeFiles/lencod.dir/macroblock.c.o.time /Users/buildslave/jenkins/workspace/test-suite-verify-machineinstrs-aarch64-O3/compiler/bin/clang -DNDEBUG  -B /Applications/Xcode.app/Contents/Developer/Toolchains/XcodeDefault.xctoolchain/usr/bin    -Wno-unused-command-line-argument -mllvm -verify-machineinstrs -O3 -arch arm64 -isysroot /Applications/Xcode.app/Contents/Developer/Platforms/iPhoneOS.platform/Developer/SDKs/iPhoneOS13.5.sdk   -w -Werror=date-time -fcommon -D__USE_LARGEFILE64 -D_FILE_OFFSET_BITS=64 -MD -MT MultiSource/Applications/JM/lencod/CMakeFiles/lencod.dir/macroblock.c.o -MF MultiSource/Applications/JM/lencod/CMakeFiles/lencod.dir/macroblock.c.o.d -o MultiSource/Applications/JM/lencod/CMakeFiles/lencod.dir/macroblock.c.o   -c /Users/buildslave/jenkins/workspace/test-suite-verify-machineinstrs-aarch64-O3/test-suite/MultiSource/Applications/JM/lencod/macroblock.c
Assertion failed: (!isInvalid() && "Loop not in a valid state!"), function getBlocks, file /Users/buildslave/jenkins/workspace/clang-stage1-RA/llvm-project/llvm/include/llvm/Analysis/LoopInfo.h, line 172.
PLEASE submit a bug report to https://bugs.llvm.org/ and include the crash backtrace, preprocessed source, and associated run script.
Stack dump:
Error: clang frontend command failed with exit code 134 (use -v to see invocation)
59 clang                    0x000000010716fcfd clang::driver::Compilation::ExecuteJobs(clang::driver::JobList const&, llvm::SmallVectorImpl<std::__1::pair<int, clang::driver::Command const*> >&) const + 125
60 clang                    0x000000010718638c clang::driver::Driver::ExecuteCompilation(clang::driver::Compilation&, llvm::SmallVectorImpl<std::__1::pair<int, clang::driver::Command const*> >&) + 204
61 clang                    0x0000000104963765 main + 10389
62 libdyld.dylib            0x00007fff72e18cc9 start + 1
63 libdyld.dylib            0x000000000000001a start + 18446603338588779346
clang-13: error: clang frontend command failed with exit code 134 (use -v to see invocation)
clang version 13.0.0 (https://github.com/llvm/llvm-project.git c3f127146415c1dd59db798fc244e14ec9feeed1)
Target: aarch64-apple-darwin19.5.0

Build Log

Changes
  1. Fix Interface doc generation after recent change to add_mlir_doc() API (details)
  2. [Test] Propagate nofree attribute from function to calls (details)
  3. Fix the build of `mlir-doc` (again) (details)
  4. [scudo] Restore zxtest compatibility (details)
  5. [RISCV][Clang] Add vmv and vfmv series intrinsic functions. (details)
  6. [RISCV] Add a PatFrag to shorten repeated (XLenVT (VLOp GPR:$vl)) in V extension patterns. (details)

Started by upstream project relay-test-suite-verify-machineinstrs build number 9643
originally caused by:

This run spent:

  • 5.4 sec waiting;
  • 2 hr 7 min build duration;
  • 2 hr 7 min total from scheduled to completion.
Revision: f785f4216432aa0d249ee3ad1f86515caf4c7b10
  • refs/remotes/origin/main
Revision: c3f127146415c1dd59db798fc244e14ec9feeed1
  • detached
Revision: f48d431f44610e339d00a33d57564c6029c4ff43
  • refs/remotes/origin/main
Revision: d590d0b156e471cbe8db457c453341bf9536a009
  • refs/remotes/origin/main

Identified problems

Compile Error

This build failed because of a compile error. Below is a list of all errors in the build log:
Indication 1

Ninja target failed

Below is a link to the first failed ninja target.
Indication 2

Assertion failure

This build failed because of an assertion failure. Below is a list of all errors in the build log:
Indication 3