FailedConsole Output

Skipping 17,351 KB.. Full Log
-objc/TestDataFormatterObjCExpr.py (645 of 2122)
PASS: lldb-api :: functionalities/gdb_remote_client/TestRegDefinitionInParts.py (646 of 2122)
PASS: lldb-unit :: Utility/./UtilityTests/LogChannelTest.Disable (647 of 2122)
PASS: lldb-shell :: Breakpoint/single-file-split-dwarf.test (648 of 2122)
PASS: lldb-api :: commands/frame/language/TestGuessLanguage.py (649 of 2122)
PASS: lldb-unit :: Utility/./UtilityTests/ListenerTest.GetEventWait (650 of 2122)
PASS: lldb-api :: functionalities/data-formatter/data-formatter-objc/TestDataFormatterObjCNSBundle.py (651 of 2122)
PASS: lldb-unit :: Utility/./UtilityTests/ConstStringTest.UpdateMangledCounterpart (652 of 2122)
PASS: lldb-unit :: Process/gdb-remote/./ProcessGdbRemoteTests/GDBRemoteClientBaseTest.SendContinueAndAsyncSignal (653 of 2122)
PASS: lldb-api :: lang/cpp/class-template-parameter-pack/TestClassTemplateParameterPack.py (654 of 2122)
PASS: lldb-unit :: SymbolFile/DWARF/./SymbolFileDWARFTests/SymbolFileDWARFTests.TestAbbrevValidAttrNullForm (655 of 2122)
PASS: lldb-unit :: Expression/./ExpressionTests/DiagnosticManagerTest.GetStringMultipleDiags (656 of 2122)
UNSUPPORTED: lldb-api :: functionalities/data-formatter/data-formatter-stl/libstdcpp/tuple/TestDataFormatterStdTuple.py (657 of 2122)
PASS: lldb-unit :: Symbol/./SymbolTests/TestTypeSystemClang.TestGetTypeClassNested (658 of 2122)
PASS: lldb-unit :: Utility/./UtilityTests/DataExtractorTest.GetCStrAtEnd (659 of 2122)
PASS: lldb-api :: iohandler/resize/TestIOHandlerResize.py (660 of 2122)
UNSUPPORTED: lldb-api :: python_api/event/TestEvents.py (661 of 2122)
PASS: lldb-unit :: Utility/./UtilityTests/StringExtractorTest.DecodeHexU8_Underflow2 (662 of 2122)
PASS: lldb-unit :: Utility/./UtilityTests/RangeTest.Copy (663 of 2122)
PASS: lldb-api :: functionalities/breakpoint/breakpoint_hit_count/TestBreakpointHitCount.py (664 of 2122)
PASS: lldb-api :: tools/lldb-server/TestLldbGdbServer.py (665 of 2122)
PASS: lldb-shell :: ObjectFile/ELF/PT_LOAD-overlap-PT_TLS.yaml (666 of 2122)
PASS: lldb-shell :: Breakpoint/split-dwarf-5-addrbase.test (667 of 2122)
PASS: lldb-api :: functionalities/thread/num_threads/TestNumThreads.py (668 of 2122)
PASS: lldb-unit :: Utility/./UtilityTests/RangeTest.ContainsAddrInvalid (669 of 2122)
PASS: lldb-shell :: Driver/TestSingleQuote.test (670 of 2122)
PASS: lldb-unit :: Process/minidump/./LLDBMinidumpTests/MinidumpParserTest.GetPid (671 of 2122)
PASS: lldb-shell :: SymbolFile/DWARF/DW_AT_loclists_base.s (672 of 2122)
PASS: lldb-api :: functionalities/breakpoint/breakpoint_conditions/TestBreakpointConditions.py (673 of 2122)
PASS: lldb-unit :: Utility/./UtilityTests/VMRange.ContainsAddr (674 of 2122)
PASS: lldb-shell :: SymbolFile/NativePDB/function-types-calling-conv.cpp (675 of 2122)
PASS: lldb-unit :: Utility/./UtilityTests/DataExtractorTest.GetULEB128_bit63 (676 of 2122)
PASS: lldb-shell :: SymbolFile/DWARF/limit-debug-info.s (677 of 2122)
PASS: lldb-unit :: Expression/./ExpressionTests/CppModuleConfigurationTest.Xcode (678 of 2122)
PASS: lldb-unit :: Utility/./UtilityTests/ConstStringTest.CompareStringRef (679 of 2122)
PASS: lldb-unit :: Utility/./UtilityTests/StringExtractorTest.GetHexBytesAvail_OddPair (680 of 2122)
PASS: lldb-unit :: Utility/./UtilityTests/StringExtractorTest.GetHexU8_InvalidHex (681 of 2122)
PASS: lldb-shell :: SymbolFile/NativePDB/globals-bss.cpp (682 of 2122)
PASS: lldb-shell :: SymbolFile/NativePDB/nested-types.cpp (683 of 2122)
PASS: lldb-api :: functionalities/data-formatter/data-formatter-synthtype/TestDataFormatterSynthType.py (684 of 2122)
PASS: lldb-api :: commands/watchpoints/multiple_threads/TestWatchpointMultipleThreads.py (685 of 2122)
PASS: lldb-unit :: SymbolFile/DWARF/./SymbolFileDWARFTests/SymbolFileDWARFTests.TestAbbrevOrder1Start5 (686 of 2122)
PASS: lldb-api :: functionalities/data-formatter/ptr_ref_typedef/TestPtrRef2Typedef.py (687 of 2122)
PASS: lldb-api :: tools/lldb-server/TestGdbRemoteProcessInfo.py (688 of 2122)
PASS: lldb-shell :: ObjectFile/MachO/lc_build_version_notools.yaml (689 of 2122)
PASS: lldb-unit :: Process/gdb-remote/./ProcessGdbRemoteTests/GDBRemoteCommunicationClientTest.GetMemoryRegionInfoInvalidResponse (690 of 2122)
PASS: lldb-unit :: ObjectFile/ELF/./ObjectFileELFTests/ObjectFileELFTest.SectionsResolveConsistently (691 of 2122)
PASS: lldb-unit :: Utility/./UtilityTests/XcodeSDKTest.SDKSupportsSwift (692 of 2122)
PASS: lldb-unit :: UnwindAssembly/x86/./UnwindAssemblyx86Tests/Testx86AssemblyInspectionEngine.TestStackRealignMSVC_i386 (693 of 2122)
PASS: lldb-api :: functionalities/thread/concurrent_events/TestConcurrentDelayedCrashWithBreakpointWatchpoint.py (694 of 2122)
PASS: lldb-api :: functionalities/data-formatter/type_summary_list_arg/TestTypeSummaryListArg.py (695 of 2122)
PASS: lldb-unit :: Symbol/./SymbolTests/LineEntryTest.GetSameLineContiguousAddressRangeOneInline (696 of 2122)
PASS: lldb-unit :: Utility/./UtilityTests/XcodeSDKTest.ParseTest (697 of 2122)
PASS: lldb-api :: commands/expression/regression-access-function-template-in-record/TestRegressionAccessFunctionTemplateInRecord.py (698 of 2122)
PASS: lldb-api :: functionalities/breakpoint/serialize/TestBreakpointSerialization.py (699 of 2122)
PASS: lldb-shell :: Host/TestCustomShell.test (700 of 2122)
PASS: lldb-api :: functionalities/breakpoint/step_over_breakpoint/TestStepOverBreakpoint.py (701 of 2122)
PASS: lldb-unit :: Utility/./UtilityTests/BinaryStreamTest.PutSLEB128NineBytes (702 of 2122)
PASS: lldb-shell :: ObjectFile/PECOFF/section-types.yaml (703 of 2122)
PASS: lldb-unit :: Utility/./UtilityTests/StringListTest.InsertStringAtIndexOutOfBounds (704 of 2122)
PASS: lldb-api :: functionalities/breakpoint/debugbreak/TestDebugBreak.py (705 of 2122)
PASS: lldb-api :: lang/c/unions/TestUnionMembers.py (706 of 2122)
PASS: lldb-unit :: Language/Highlighting/./HighlighterTests/HighlighterTest.DefaultHighlighterWithCursor (707 of 2122)
PASS: lldb-api :: commands/expression/call-function/TestCallUserDefinedFunction.py (708 of 2122)
PASS: lldb-unit :: Utility/./UtilityTests/StringListTest.LongestCommonPrefixEmpty (709 of 2122)
PASS: lldb-unit :: Language/Highlighting/./HighlighterTests/HighlighterTest.ClangScalarLiterals (710 of 2122)
PASS: lldb-api :: lang/c/strings/TestCStrings.py (711 of 2122)
PASS: lldb-unit :: Utility/./UtilityTests/Flags.AnyClear (712 of 2122)
PASS: lldb-unit :: Utility/./UtilityTests/CompletionRequest.FakeLastArg (713 of 2122)
PASS: lldb-unit :: Host/./HostTests/NativeProcessProtocolTest.SetBreakpointFailRead (714 of 2122)
PASS: lldb-api :: functionalities/step-avoids-no-debug/TestStepNoDebug.py (715 of 2122)
UNSUPPORTED: lldb-api :: api/multiple-debuggers/TestMultipleDebuggers.py (716 of 2122)
PASS: lldb-shell :: SymbolFile/NativePDB/break-by-line.cpp (717 of 2122)
UNSUPPORTED: lldb-shell :: SymbolFile/PDB/udt-layout.test (718 of 2122)
PASS: lldb-unit :: UnwindAssembly/ARM64/./Arm64InstEmulationTests/TestArm64InstEmulation.TestMediumDarwinFunction (719 of 2122)
PASS: lldb-unit :: Utility/./UtilityTests/ArgsTest.TestInsertArg (720 of 2122)
UNSUPPORTED: lldb-api :: functionalities/longjmp/TestLongjmp.py (721 of 2122)
PASS: lldb-api :: functionalities/unwind/noreturn/module-end/TestNoReturnModuleEnd.py (722 of 2122)
PASS: lldb-api :: lang/c/const_variables/TestConstVariables.py (723 of 2122)
PASS: lldb-api :: commands/expression/dont_allow_jit/TestAllowJIT.py (724 of 2122)
PASS: lldb-unit :: Expression/./ExpressionTests/DWARFExpression.DW_OP_unknown (725 of 2122)
UNSUPPORTED: lldb-shell :: SymbolFile/PDB/enums-layout.test (726 of 2122)
PASS: lldb-api :: macosx/simulator/TestSimulatorPlatform.py (727 of 2122)
PASS: lldb-unit :: Target/./TargetTests/ExecutionContextTest.GetByteOrder (728 of 2122)
PASS: lldb-api :: commands/frame/diagnose/dereference-argument/TestDiagnoseDereferenceArgument.py (729 of 2122)
PASS: lldb-unit :: UnwindAssembly/x86/./UnwindAssemblyx86Tests/Testx86AssemblyInspectionEngine.TestSimple64bitFrameFunction (730 of 2122)
PASS: lldb-unit :: Utility/./UtilityTests/SerializationRountripTest.SerializeDeserializePodPointers (731 of 2122)
PASS: lldb-api :: commands/process/launch/TestProcessLaunch.py (732 of 2122)
XFAIL: lldb-shell :: Register/x86-64-ymm-write.test (733 of 2122)
PASS: lldb-shell :: BuildScript/compiler-full-path.test (734 of 2122)
PASS: lldb-api :: macosx/lc-note/kern-ver-str/TestKernVerStrLCNOTE.py (735 of 2122)
PASS: lldb-api :: commands/command/delete/TestCommandDelete.py (736 of 2122)
PASS: lldb-api :: functionalities/data-formatter/data-formatter-stl/libcxx/iterator/TestDataFormatterLibccIterator.py (737 of 2122)
PASS: lldb-api :: functionalities/thread/ignore_suspended/TestIgnoreSuspendedThread.py (738 of 2122)
PASS: lldb-unit :: Utility/./UtilityTests/FileSpecTest.AppendPathComponent (739 of 2122)
UNSUPPORTED: lldb-shell :: SymbolFile/PDB/class-layout.test (740 of 2122)
PASS: lldb-unit :: Utility/./UtilityTests/UriParserTest.TypicalPortPathIPv6 (741 of 2122)
PASS: lldb-unit :: Host/./HostTests/ConnectionFileDescriptorTest.TCPGetURIv6 (742 of 2122)
PASS: lldb-unit :: Core/./LLDBCoreTests/MangledTest.ResultForValidName (743 of 2122)
PASS: lldb-api :: functionalities/data-formatter/data-formatter-stl/libcxx/atomic/TestLibCxxAtomic.py (744 of 2122)
PASS: lldb-unit :: UnwindAssembly/x86/./UnwindAssemblyx86Tests/Testx86AssemblyInspectionEngine.TestPushExtended (745 of 2122)
UNSUPPORTED: lldb-api :: commands/register/register/intel_xtended_registers/TestMPXRegisters.py (746 of 2122)
PASS: lldb-shell :: Settings/TestStopCommandSourceOnError.test (747 of 2122)
PASS: lldb-api :: functionalities/tail_call_frames/unambiguous_sequence/TestUnambiguousTailCalls.py (748 of 2122)
PASS: lldb-api :: functionalities/thread/step_out/TestThreadStepOut.py (749 of 2122)
PASS: lldb-api :: functionalities/data-formatter/format-propagation/TestFormatPropagation.py (750 of 2122)
PASS: lldb-api :: lang/objc/modules/TestObjCModules.py (751 of 2122)
PASS: lldb-api :: commands/watchpoints/multiple_hits/TestMultipleHits.py (752 of 2122)
PASS: lldb-unit :: Language/Highlighting/./HighlighterTests/HighlighterTest.Keywords (753 of 2122)
PASS: lldb-api :: functionalities/data-formatter/data-formatter-objc/TestDataFormatterObjCNSError.py (754 of 2122)
PASS: lldb-api :: lang/objc/foundation/TestObjCMethodsNSError.py (755 of 2122)
PASS: lldb-api :: commands/process/launch-with-shellexpand/TestLaunchWithShellExpand.py (756 of 2122)
PASS: lldb-unit :: Utility/./UtilityTests/LogTest.LLDB_LOG_nullptr (757 of 2122)
PASS: lldb-unit :: Utility/./UtilityTests/StringLexerTest.NextIfList (758 of 2122)
PASS: lldb-api :: functionalities/inferior-crashing/TestInferiorCrashing.py (759 of 2122)
PASS: lldb-unit :: Utility/./UtilityTests/UserIDResolver.GetUserName (760 of 2122)
UNSUPPORTED: lldb-api :: benchmarks/expression/TestRepeatedExprs.py (761 of 2122)
PASS: lldb-api :: commands/frame/diagnose/array/TestArray.py (762 of 2122)
PASS: lldb-api :: tools/lldb-vscode/console/TestVSCode_console.py (763 of 2122)
UNSUPPORTED: lldb-api :: functionalities/breakpoint/breakpoint_in_delayslot/TestAvoidBreakpointInDelaySlot.py (764 of 2122)
PASS: lldb-api :: functionalities/gdb_remote_client/TestStopPCs.py (765 of 2122)
PASS: lldb-unit :: Utility/./UtilityTests/ArgsTest.DoubleQuotedItem (766 of 2122)
PASS: lldb-unit :: Utility/./UtilityTests/AnsiTerminal.Basic (767 of 2122)
PASS: lldb-unit :: Utility/./UtilityTests/ArgsTest.ReplaceArgumentAtIndexShort (768 of 2122)
PASS: lldb-api :: commands/expression/import-std-module/empty-module/TestEmptyStdModule.py (769 of 2122)
PASS: lldb-api :: functionalities/data-formatter/parray/TestPrintArray.py (770 of 2122)
PASS: lldb-shell :: ObjectFile/ELF/section-overlap.yaml (771 of 2122)
PASS: lldb-unit :: ObjectFile/PECOFF/./ObjectFilePECOFFTests/PECallFrameInfoTest.Basic_eh (772 of 2122)
PASS: lldb-unit :: ObjectFile/Breakpad/./ObjectFileBreakpadTests/InfoRecord.parse (773 of 2122)
UNSUPPORTED: lldb-api :: android/platform/TestDefaultCacheLineSize.py (774 of 2122)
PASS: lldb-api :: lang/objc/objc-new-syntax/TestObjCNewSyntaxLiteral.py (775 of 2122)
UNSUPPORTED: lldb-api :: linux/thread/create_during_instruction_step/TestCreateDuringInstructionStep.py (776 of 2122)
PASS: lldb-api :: lang/cpp/static_methods/TestCPPStaticMethods.py (777 of 2122)
PASS: lldb-unit :: Utility/./UtilityTests/CompletionRequest.Constructor (778 of 2122)
PASS: lldb-unit :: tools/lldb-server/tests/./LLDBServerTests/StandardStartupTest.TestStopReplyContainsThreadPcs (779 of 2122)
PASS: lldb-api :: commands/watchpoints/watchpoint_commands/condition/TestWatchpointConditionCmd.py (780 of 2122)
PASS: lldb-unit :: Core/./LLDBCoreTests/StreamCallbackTest.Callback (781 of 2122)
PASS: lldb-unit :: SymbolFile/DWARF/./SymbolFileDWARFTests/XcodeSDKModuleTests.TestModuleGetXcodeSDK (782 of 2122)
PASS: lldb-unit :: Utility/./UtilityTests/ScalarTest.SetValueFromData (783 of 2122)
PASS: lldb-api :: functionalities/tail_call_frames/ambiguous_tail_call_seq2/TestAmbiguousTailCallSeq2.py (784 of 2122)
PASS: lldb-api :: lang/cpp/global_operators/TestCppGlobalOperators.py (785 of 2122)
PASS: lldb-api :: functionalities/memory/read/TestMemoryRead.py (786 of 2122)
PASS: lldb-api :: functionalities/data-formatter/data-formatter-named-summaries/TestDataFormatterNamedSummaries.py (787 of 2122)
PASS: lldb-unit :: Process/gdb-remote/./ProcessGdbRemoteTests/GDBRemoteClientBaseTest.SendContinueAndInterrupt2PacketBug (788 of 2122)
PASS: lldb-unit :: Utility/./UtilityTests/RecordReplayTest.InstrumentedFoo (789 of 2122)
PASS: lldb-unit :: Utility/./UtilityTests/ArgsTest.TestQuotedUnknownEscape (790 of 2122)
UNSUPPORTED: lldb-api :: functionalities/darwin_log/filter/regex/activity/TestDarwinLogFilterRegexActivity.py (791 of 2122)
UNSUPPORTED: lldb-api :: functionalities/unwind/standard/TestStandardUnwind.py (792 of 2122)
PASS: lldb-unit :: Process/minidump/./LLDBMinidumpTests/MinidumpParserTest.GetLinuxProcStatus (793 of 2122)
PASS: lldb-api :: functionalities/thread/concurrent_events/TestConcurrentBreakpointOneDelayBreakpointThreads.py (794 of 2122)
UNSUPPORTED: lldb-api :: functionalities/thread/thread_specific_break_plus_condition/TestThreadSpecificBpPlusCondition.py (795 of 2122)
PASS: lldb-api :: lang/cpp/covariant-return-types/TestCovariantReturnTypes.py (796 of 2122)
PASS: lldb-unit :: Utility/./UtilityTests/StringListTest.ShiftCString (797 of 2122)
UNSUPPORTED: lldb-shell :: SymbolFile/PDB/ast-restore.test (798 of 2122)
UNSUPPORTED: lldb-api :: functionalities/breakpoint/hardware_breakpoints/hardware_breakpoint_on_multiple_threads/TestHWBreakMultiThread.py (799 of 2122)
PASS: lldb-unit :: Utility/./UtilityTests/ArchSpecTest.MergeFromMachOUnknown (800 of 2122)
PASS: lldb-shell :: SymbolFile/DWARF/DW_TAG_variable-invalid_location.s (801 of 2122)
PASS: lldb-shell :: SymbolFile/DWARF/dwarf5_locations.s (802 of 2122)
XFAIL: lldb-shell :: Unwind/prefer-debug-over-eh-frame.test (803 of 2122)
PASS: lldb-unit :: Disassembler/./DisassemblerTests/TestArmv7Disassembly.TestCortexFPDisass (804 of 2122)
PASS: lldb-unit :: Utility/./UtilityTests/StringListTest.SetSize (805 of 2122)
PASS: lldb-api :: functionalities/breakpoint/breakpoint_ignore_count/TestBreakpointIgnoreCount.py (806 of 2122)
PASS: lldb-api :: functionalities/thread/crash_during_step/TestCrashDuringStep.py (807 of 2122)
PASS: lldb-api :: functionalities/data-formatter/data-formatter-stl/libcxx/tuple/TestDataFormatterLibcxxTuple.py (808 of 2122)
PASS: lldb-api :: commands/expression/call-function/TestCallStopAndContinue.py (809 of 2122)
PASS: lldb-api :: tools/lldb-server/TestGdbRemoteExitCode.py (810 of 2122)
PASS: lldb-unit :: Utility/./UtilityTests/SharedCluster.ClusterManager (811 of 2122)
PASS: lldb-unit :: Process/gdb-remote/./ProcessGdbRemoteTests/GDBRemoteClientBaseTest.SendContinueAndInterrupt (812 of 2122)
PASS: lldb-unit :: Utility/./UtilityTests/ArchSpecTest.TestParseMachCPUDashSubtypeTripleSimple (813 of 2122)
PASS: lldb-api :: commands/expression/call-throws/TestCallThatThrows.py (814 of 2122)
PASS: lldb-unit :: Utility/./UtilityTests/DataExtractorTest.GetCStrAtNullOffset (815 of 2122)
PASS: lldb-unit :: Expression/./ExpressionTests/DiagnosticManagerTest.AppendMessageNoDiag (816 of 2122)
PASS: lldb-unit :: Utility/./UtilityTests/StringExtractorTest.DecodeHexU8_InvalidHex2 (817 of 2122)
PASS: lldb-shell :: Recognizer/assert.test (818 of 2122)
PASS: lldb-api :: functionalities/unwind/sigtramp/TestSigtrampUnwind.py (819 of 2122)
PASS: lldb-shell :: ScriptInterpreter/None/none.test (820 of 2122)
PASS: lldb-unit :: Expression/./ExpressionTests/CppModuleConfigurationTest.AmbiguousLibCpp (821 of 2122)
PASS: lldb-unit :: UnwindAssembly/x86/./UnwindAssemblyx86Tests/Testx86AssemblyInspectionEngine.TestPopR14 (822 of 2122)
PASS: lldb-unit :: Core/./LLDBCoreTests/MangledTest.ResultForBlockInvocation (823 of 2122)
PASS: lldb-shell :: ObjectFile/wasm/basic.yaml (824 of 2122)
PASS: lldb-unit :: Utility/./UtilityTests/FileSpecTest.Match (825 of 2122)
PASS: lldb-shell :: ObjectFile/ELF/section-types.yaml (826 of 2122)
PASS: lldb-unit :: Utility/./UtilityTests/ProcessInfoTest.Constructor (827 of 2122)
PASS: lldb-unit :: Utility/./UtilityTests/UriParserTest.Empty (828 of 2122)
PASS: lldb-api :: lang/cpp/signed_types/TestSignedTypes.py (829 of 2122)
PASS: lldb-api :: commands/expression/import-std-module/forward_list/TestForwardListFromStdModule.py (830 of 2122)
PASS: lldb-api :: lang/c/step-target/TestStepTarget.py (831 of 2122)
PASS: lldb-unit :: Symbol/./SymbolTests/TestClangASTImporter.CanImportInvalidType (832 of 2122)
PASS: lldb-api :: lang/cpp/virtual-functions/TestCppVirtualFunctions.py (833 of 2122)
PASS: lldb-unit :: Utility/./UtilityTests/StreamTest.PutRawBytesToBigEndian (834 of 2122)
PASS: lldb-api :: python_api/sbdata/TestSBData.py (835 of 2122)
PASS: lldb-unit :: Process/minidump/./LLDBMinidumpTests/MinidumpParserTest.GetMemoryRegionInfoFromMemory64List (836 of 2122)
PASS: lldb-shell :: Reproducer/TestReuseDirectory.test (837 of 2122)
PASS: lldb-shell :: SymbolFile/NativePDB/ast-types.cpp (838 of 2122)
PASS: lldb-unit :: Utility/./UtilityTests/VASprintfTest.EncodingError (839 of 2122)
PASS: lldb-unit :: Process/minidump/./LLDBMinidumpTests/MinidumpParserTest.GetExceptionStream (840 of 2122)
UNSUPPORTED: lldb-api :: functionalities/darwin_log/filter/regex/category/TestDarwinLogFilterRegexCategory.py (841 of 2122)
PASS: lldb-api :: commands/version/TestVersion.py (842 of 2122)
PASS: lldb-unit :: Utility/./UtilityTests/BinaryStreamTest.PutSLEB128FiveBytes (843 of 2122)
PASS: lldb-shell :: SymbolFile/DWARF/split-dwarf-inlining.cpp (844 of 2122)
PASS: lldb-unit :: Editline/./EditlineTests/EditlineTestFixture.EditlineReceivesMultiLineText (845 of 2122)
PASS: lldb-shell :: Driver/TestUseColor.test (846 of 2122)
PASS: lldb-unit :: Process/gdb-remote/./ProcessGdbRemoteTests/GDBRemoteCommunicationClientTest.SaveRestoreRegistersNoSuffix (847 of 2122)
PASS: lldb-unit :: Expression/./ExpressionTests/DiagnosticManagerTest.GetStringPreserveOrder (848 of 2122)
PASS: lldb-api :: functionalities/thread/concurrent_events/TestConcurrentSignalDelayBreak.py (849 of 2122)
PASS: lldb-shell :: ObjectFile/PECOFF/dep-modules.yaml (850 of 2122)
PASS: lldb-api :: commands/expression/top-level/TestTopLevelExprs.py (851 of 2122)
PASS: lldb-unit :: Utility/./UtilityTests/UUIDTest.Validity (852 of 2122)
PASS: lldb-unit :: Process/./ProcessEventDataTests/ProcessEventDataTest.DoOnRemoval (853 of 2122)
PASS: lldb-api :: commands/expression/import-std-module/shared_ptr/TestSharedPtrFromStdModule.py (854 of 2122)
PASS: lldb-unit :: Platform/./LLDBPlatformTests/PlatformDarwinTest.TestParseVersionBuildDir (855 of 2122)
PASS: lldb-unit :: ObjectFile/Breakpad/./ObjectFileBreakpadTests/LineRecord.parse (856 of 2122)
UNSUPPORTED: lldb-shell :: Breakpoint/case-insensitive.test (857 of 2122)
PASS: lldb-api :: commands/expression/import-std-module/list-dbg-info-content/TestDbgInfoContentListFromStdModule.py (858 of 2122)
PASS: lldb-api :: lang/cpp/breakpoint-commands/TestCPPBreakpointCommands.py (859 of 2122)
PASS: lldb-unit :: Utility/./UtilityTests/StreamTest.PutMaxHex64ByteOrderBig (860 of 2122)
PASS: lldb-unit :: Target/./TargetTests/MemoryRegionInfoTest.Formatv (861 of 2122)
PASS: lldb-api :: functionalities/limit-debug-info/TestLimitDebugInfo.py (862 of 2122)
PASS: lldb-unit :: Utility/./UtilityTests/RegularExpression.Invalid (863 of 2122)
PASS: lldb-unit :: Utility/./UtilityTests/BinaryStreamTest.PutSLEB128ThreeBytes (864 of 2122)
PASS: lldb-unit :: DataFormatter/./LLDBFormatterTests/TypeMatcherTests.CreatedBySameMatchString (865 of 2122)
PASS: lldb-api :: functionalities/data-formatter/stringprinter/TestStringPrinter.py (866 of 2122)
PASS: lldb-api :: lang/objc/rdar-11355592/TestRdar11355592.py (867 of 2122)
PASS: lldb-unit :: Utility/./UtilityTests/NameMatchesTest.Contains (868 of 2122)
PASS: lldb-unit :: Utility/./UtilityTests/StringExtractorTest.GetHexBytesAvail_OddPair2 (869 of 2122)
PASS: lldb-unit :: Utility/./UtilityTests/SerializationRountripTest.SerializeDeserializeObjectReference (870 of 2122)
PASS: lldb-api :: python_api/section/TestSectionAPI.py (871 of 2122)
PASS: lldb-shell :: Commands/command-thread-select.test (872 of 2122)
PASS: lldb-api :: functionalities/data-formatter/data-formatter-objc/TestDataFormatterObjCNSContainer.py (873 of 2122)
PASS: lldb-unit :: Process/gdb-remote/./ProcessGdbRemoteTests/GDBRemoteCommunicationClientTest.SendSignalsToIgnore (874 of 2122)
PASS: lldb-unit :: UnwindAssembly/x86/./UnwindAssemblyx86Tests/Testx86AssemblyInspectionEngine.TestStackRealign8BitDisp_i386 (875 of 2122)
PASS: lldb-unit :: Process/gdb-remote/./ProcessGdbRemoteTests/GDBRemoteCommunicationClientTest.GetModulesInfo_UUID20 (876 of 2122)
PASS: lldb-unit :: Utility/./UtilityTests/StringListTest.LongestCommonPrefixNoPrefix (877 of 2122)
PASS: lldb-api :: functionalities/fat_archives/TestFatArchives.py (878 of 2122)
PASS: lldb-unit :: Utility/./UtilityTests/RangeTest.SlideZero (879 of 2122)
PASS: lldb-unit :: Utility/./UtilityTests/StringListTest.ShiftStdString (880 of 2122)
PASS: lldb-shell :: Driver/TestError.test (881 of 2122)
PASS: lldb-api :: functionalities/param_entry_vals/basic_entry_values/TestBasicEntryValues.py (882 of 2122)
PASS: lldb-unit :: Symbol/./SymbolTests/TestTypeSystemClang.TestDisplayNameEmpty (883 of 2122)
PASS: lldb-unit :: Host/./HostTests/ConnectionFileDescriptorTest.TCPGetURIv4 (884 of 2122)
PASS: lldb-unit :: DataFormatter/./LLDBFormatterTests/FormatManagerTests.CompatibleLangs (885 of 2122)
UNSUPPORTED: lldb-api :: functionalities/darwin_log/filter/exact_match/category/TestDarwinLogFilterMatchCategory.py (886 of 2122)
PASS: lldb-api :: functionalities/data-formatter/data-formatter-advanced/TestDataFormatterAdv.py (887 of 2122)
PASS: lldb-api :: functionalities/testid/TestTestId.py (888 of 2122)
PASS: lldb-unit :: UnwindAssembly/x86/./UnwindAssemblyx86Tests/Testx86AssemblyInspectionEngine.TestPopEBX (889 of 2122)
PASS: lldb-api :: sample_test/TestSampleTest.py (890 of 2122)
PASS: lldb-unit :: Process/gdb-remote/./ProcessGdbRemoteTests/GDBRemoteCommunicationServerTest.SendErrorResponse_UnimplementedError (891 of 2122)
PASS: lldb-unit :: Utility/./UtilityTests/UriParserTest.LongPath (892 of 2122)
PASS: lldb-unit :: Host/./HostTests/NativeProcessProtocolTest.ReadCStringFromMemory_CrossPageBoundary (893 of 2122)
PASS: lldb-unit :: Utility/./UtilityTests/ArgsTest.GetQuotedCommandString (894 of 2122)
PASS: lldb-unit :: Utility/./UtilityTests/ProcessInstanceInfo.Dump (895 of 2122)
PASS: lldb-shell :: SymbolFile/DWARF/DW_OP_piece-smaller-than-struct.s (896 of 2122)
PASS: lldb-shell :: Commands/command-script-import.test (897 of 2122)
PASS: lldb-unit :: ScriptInterpreter/Python/./ScriptInterpreterPythonTests/PythonDataObjectsTest.TestPythonFile (898 of 2122)
PASS: lldb-unit :: Utility/./UtilityTests/DataExtractorTest.GetCStrUnterminated (899 of 2122)
UNSUPPORTED: lldb-shell :: ScriptInterpreter/Lua/breakpoint_callback.test (900 of 2122)
PASS: lldb-api :: functionalities/thread/concurrent_events/TestConcurrentTwoBreakpointsOneSignal.py (901 of 2122)
UNSUPPORTED: lldb-api :: functionalities/darwin_log/source/debug/TestDarwinLogSourceDebug.py (902 of 2122)
PASS: lldb-unit :: Interpreter/./InterpreterTests/OptionArgParserTest.toBoolean (903 of 2122)
PASS: lldb-unit :: API/./APITests/SBCommandInterpreterTest.SingleWordCommand (904 of 2122)
PASS: lldb-unit :: Symbol/./SymbolTests/TestTypeSystemClang.TestDeletingImplicitCopyCstrDueToMoveCStr (905 of 2122)
PASS: lldb-shell :: SymbolFile/DWARF/parallel-indexing-stress.s (906 of 2122)
PASS: lldb-unit :: Utility/./UtilityTests/VMRange.ContainsRange (907 of 2122)
PASS: lldb-api :: functionalities/thread/concurrent_events/TestConcurrentCrashWithWatchpointBreakpointSignal.py (908 of 2122)
PASS: lldb-api :: lang/cpp/nsimport/TestCppNsImport.py (909 of 2122)
PASS: lldb-unit :: Utility/./UtilityTests/VMRange.CollectionContains (910 of 2122)
PASS: lldb-api :: functionalities/data-formatter/nsarraysynth/TestNSArraySynthetic.py (911 of 2122)
PASS: lldb-shell :: SymbolFile/DWARF/debug_ranges-missing-section.s (912 of 2122)
PASS: lldb-unit :: Utility/./UtilityTests/BroadcasterTest.EventTypeHasListeners (913 of 2122)
PASS: lldb-unit :: Utility/./UtilityTests/StringListTest.ForRange (914 of 2122)
PASS: lldb-api :: functionalities/breakpoint/breakpoint_command/TestRegexpBreakCommand.py (915 of 2122)
PASS: lldb-shell :: BuildScript/toolchain-clang.test (916 of 2122)
PASS: lldb-api :: functionalities/thread/concurrent_events/TestConcurrentTwoBreakpointsOneDelaySignal.py (917 of 2122)
PASS: lldb-unit :: Utility/./UtilityTests/BinaryStreamTest.PutULEB128ThreeBytes (918 of 2122)
PASS: lldb-api :: lang/c/conflicting-symbol/TestConflictingSymbol.py (919 of 2122)
PASS: lldb-unit :: Signals/./SignalsTests/UnixSignalsTest.VersionChange (920 of 2122)
PASS: lldb-shell :: ObjectFile/ELF/short-build-id.yaml (921 of 2122)
PASS: lldb-api :: python_api/watchpoint/watchlocation/TestSetWatchlocation.py (922 of 2122)
UNSUPPORTED: lldb-shell :: Process/Windows/exception_access_violation.cpp (923 of 2122)
PASS: lldb-unit :: Utility/./UtilityTests/StreamTest.AddressEmptyPrefix (924 of 2122)
PASS: lldb-unit :: UnwindAssembly/x86/./UnwindAssemblyx86Tests/Testx86AssemblyInspectionEngine.TestDisassemblyMidFunctionEpilogues (925 of 2122)
PASS: lldb-unit :: Utility/./UtilityTests/StreamTest.ShiftOperatorPtr (926 of 2122)
PASS: lldb-api :: lang/cpp/exceptions/TestCPPExceptionBreakpoints.py (927 of 2122)
PASS: lldb-api :: python_api/value/linked_list/TestValueAPILinkedList.py (928 of 2122)
PASS: lldb-api :: macosx/add-dsym/TestAddDsymMidExecutionCommand.py (929 of 2122)
UNSUPPORTED: lldb-api :: benchmarks/expression/TestExpressionCmd.py (930 of 2122)
PASS: lldb-unit :: Process/minidump/./LLDBMinidumpTests/MinidumpParserTest.FindMemoryRange (931 of 2122)
PASS: lldb-api :: commands/disassemble/basic/TestFrameDisassemble.py (932 of 2122)
PASS: lldb-unit :: Utility/./UtilityTests/BinaryStreamTest.PutSLEB128One (933 of 2122)
PASS: lldb-api :: lang/cpp/template-function/TestTemplateFunctions.py (934 of 2122)
PASS: lldb-shell :: SymbolFile/DWARF/dwarf5-atomic.s (935 of 2122)
PASS: lldb-api :: python_api/objc_type/TestObjCType.py (936 of 2122)
PASS: lldb-unit :: Process/./ProcessEventDataTests/ProcessEventDataTest.ShouldStop (937 of 2122)
PASS: lldb-unit :: ScriptInterpreter/Python/./ScriptInterpreterPythonTests/PythonDataObjectsTest.TestPythonCallableCheck (938 of 2122)
PASS: lldb-shell :: Commands/command-target-modules-dump-sections.yaml (939 of 2122)
PASS: lldb-unit :: Symbol/./SymbolTests/TestTypeSystemClang.TestGetBasicTypeFromName (940 of 2122)
PASS: lldb-shell :: Minidump/memory-region-from-module.yaml (941 of 2122)
PASS: lldb-api :: commands/command/script/import/TestImport.py (942 of 2122)
PASS: lldb-api :: commands/process/attach/attach_denied/TestAttachDenied.py (943 of 2122)
PASS: lldb-unit :: Utility/./UtilityTests/DataExtractorTest.PeekData (944 of 2122)
PASS: lldb-unit :: Utility/./UtilityTests/ProcessInstanceInfoMatch.Name (945 of 2122)
PASS: lldb-shell :: Driver/TestHelp.test (946 of 2122)
PASS: lldb-unit :: Language/Highlighting/./HighlighterTests/HighlighterTest.HighlighterSelectionType (947 of 2122)
PASS: lldb-api :: functionalities/tail_call_frames/disambiguate_call_site/TestDisambiguateCallSite.py (948 of 2122)
PASS: lldb-api :: commands/frame/diagnose/virtual-method-call/TestDiagnoseDereferenceVirtualMethodCall.py (949 of 2122)
PASS: lldb-api :: lang/cpp/gmodules/TestWithModuleDebugging.py (950 of 2122)
UNSUPPORTED: lldb-api :: functionalities/darwin_log/filter/exact_match/activity/TestDarwinLogFilterMatchActivity.py (951 of 2122)
PASS: lldb-shell :: Watchpoint/SetErrorCases.test (952 of 2122)
PASS: lldb-unit :: Utility/./UtilityTests/StringExtractorTest.InitEmpty (953 of 2122)
PASS: lldb-api :: types/TestIntegerType.py (954 of 2122)
PASS: lldb-api :: functionalities/data-formatter/synthupdate/TestSyntheticFilterRecompute.py (955 of 2122)
PASS: lldb-unit :: UnwindAssembly/x86/./UnwindAssemblyx86Tests/Testx86AssemblyInspectionEngine.TestPopRBP (956 of 2122)
PASS: lldb-shell :: ObjectFile/ELF/basic-info.yaml (957 of 2122)
PASS: lldb-api :: python_api/findvalue_duplist/TestSBFrameFindValue.py (958 of 2122)
UNSUPPORTED: lldb-api :: tools/lldb-server/signal-filtering/TestGdbRemote_QPassSignals.py (959 of 2122)
PASS: lldb-unit :: Utility/./UtilityTests/StringExtractorTest.GetHexU8_Exact (960 of 2122)
PASS: lldb-api :: functionalities/data-formatter/synthcapping/TestSyntheticCapping.py (961 of 2122)
PASS: lldb-unit :: Utility/./UtilityTests/StreamTest.QuotedCString (962 of 2122)
PASS: lldb-unit :: Host/./HostTests/MainLoopTest.UnmonitoredSignal (963 of 2122)
PASS: lldb-api :: functionalities/data-formatter/data-formatter-python-synth/TestDataFormatterPythonSynth.py (964 of 2122)
PASS: lldb-api :: commands/expression/ir-interpreter-phi-nodes/TestIRInterpreterPHINodes.py (965 of 2122)
PASS: lldb-unit :: Utility/./UtilityTests/BinaryStreamTest.PutULEB128SevenBytes (966 of 2122)
PASS: lldb-shell :: SymbolFile/DWARF/inline-function-address.ll (967 of 2122)
UNSUPPORTED: lldb-shell :: Register/arm-gp-read.test (968 of 2122)
PASS: lldb-api :: lang/c/step_over_no_deadlock/TestStepOverDoesntBlock.py (969 of 2122)
PASS: lldb-api :: functionalities/gdb_remote_client/TestNoWatchpointSupportInfo.py (970 of 2122)
PASS: lldb-unit :: Utility/./UtilityTests/VASprintfTest.BufferResize (971 of 2122)
PASS: lldb-api :: functionalities/thread/concurrent_events/TestConcurrentSignalWatch.py (972 of 2122)
PASS: lldb-unit :: Process/minidump/./LLDBMinidumpTests/RegisterContextMinidump.ConvertMinidumpContext_x86_32 (973 of 2122)
PASS: lldb-api :: functionalities/thread/concurrent_events/TestConcurrentDelaySignalWatch.py (974 of 2122)
PASS: lldb-api :: python_api/hello_world/TestHelloWorld.py (975 of 2122)
PASS: lldb-unit :: SymbolFile/NativePDB/./SymbolFileNativePDBTests/PDBFPOProgramToDWARFExpressionTests.UnresolvedDependentCyclicRegisterAssignmentReference (976 of 2122)
PASS: lldb-unit :: Utility/./UtilityTests/RecordReplayTest.InstrumentedBar (977 of 2122)
PASS: lldb-unit :: Utility/./UtilityTests/UriParserTest.BadPort (978 of 2122)
PASS: lldb-api :: macosx/profile_vrs_detach/TestDetachVrsProfile.py (979 of 2122)
PASS: lldb-unit :: UnwindAssembly/x86/./UnwindAssemblyx86Tests/Testx86AssemblyInspectionEngine.TestPushRBP (980 of 2122)
PASS: lldb-shell :: SymbolFile/Breakpad/symtab-macho.test (981 of 2122)
PASS: lldb-unit :: Expression/./ExpressionTests/CppModuleConfigurationTest.Linux (982 of 2122)
PASS: lldb-api :: functionalities/data-formatter/data-formatter-stl/libcxx/function/TestLibCxxFunction.py (983 of 2122)
PASS: lldb-unit :: Process/minidump/./LLDBMinidumpTests/MinidumpParserTest.GetLinuxProcStatus_no_stream (984 of 2122)
PASS: lldb-unit :: Core/./LLDBCoreTests/CommunicationTest.SynchronizeWhileClosing (985 of 2122)
PASS: lldb-api :: lang/objc/unicode-string/TestUnicodeString.py (986 of 2122)
PASS: lldb-unit :: Symbol/./SymbolTests/TestTypeSystemClang.TestGetEnumIntegerTypeInvalid (987 of 2122)
PASS: lldb-unit :: ObjectFile/Breakpad/./ObjectFileBreakpadTests/StackWinRecord.parse (988 of 2122)
PASS: lldb-api :: functionalities/postmortem/mach-core/TestMachCore.py (989 of 2122)
PASS: lldb-unit :: UnwindAssembly/x86/./UnwindAssemblyx86Tests/Testx86AssemblyInspectionEngine.TestPopR12 (990 of 2122)
PASS: lldb-api :: tools/lldb-vscode/attach/TestVSCode_attach.py (991 of 2122)
PASS: lldb-unit :: Core/./LLDBCoreTests/ModuleSpecTest.InvalidInMemoryBuffer (992 of 2122)
PASS: lldb-unit :: Utility/./UtilityTests/ArgsTest.TestTrailingBackslash (993 of 2122)
PASS: lldb-api :: python_api/watchpoint/TestWatchpointIgnoreCount.py (994 of 2122)
PASS: lldb-api :: functionalities/wrong_commands/TestWrongCommands.py (995 of 2122)
PASS: lldb-api :: tools/lldb-server/TestGdbRemoteAttach.py (996 of 2122)
PASS: lldb-api :: functionalities/gdb_remote_client/TestWriteMemory.py (997 of 2122)
PASS: lldb-shell :: SymbolFile/DWARF/debug-types-basic.test (998 of 2122)
PASS: lldb-api :: commands/expression/import-std-module/vector-dbg-info-content/TestDbgInfoContentVectorFromStdModule.py (999 of 2122)
PASS: lldb-api :: functionalities/thread/step_until/TestStepUntil.py (1000 of 2122)
PASS: lldb-unit :: Language/Highlighting/./HighlighterTests/HighlighterTest.ClangTrailingBackslashBeforeNewline (1001 of 2122)
PASS: lldb-shell :: Commands/CommandScriptImmediateOutput/CommandScriptImmediateOutputConsole.test (1002 of 2122)
PASS: lldb-unit :: Utility/./UtilityTests/Predicate.WaitForValueNotEqualTo (1003 of 2122)
PASS: lldb-unit :: DataFormatter/./LLDBFormatterTests/TypeMatcherTests.CreatedBySameMatchStringExactNamePrefixes (1004 of 2122)
PASS: lldb-api :: lang/cpp/typeof/TestTypeOfDeclTypeExpr.py (1005 of 2122)
PASS: lldb-api :: commands/process/signal/TestProcessSignal.py (1006 of 2122)
PASS: lldb-api :: commands/expression/import-std-module/shared_ptr-dbg-info-content/TestSharedPtrDbgInfoContentFromStdModule.py (1007 of 2122)
PASS: lldb-unit :: Process/gdb-remote/./ProcessGdbRemoteTests/GDBRemoteCommunicationServerTest.SendErrorResponse_Status (1008 of 2122)
PASS: lldb-api :: commands/watchpoints/watchpoint_events/TestWatchpointEvents.py (1009 of 2122)
PASS: lldb-api :: commands/expression/cast_int_to_anonymous_enum/TestCastIntToAnonymousEnum.py (1010 of 2122)
PASS: lldb-shell :: SymbolFile/Breakpad/line-table-mixed-path-styles.test (1011 of 2122)
PASS: lldb-shell :: Expr/TestMultilineExpr.test (1012 of 2122)
PASS: lldb-unit :: UnwindAssembly/x86/./UnwindAssemblyx86Tests/Testx86AssemblyInspectionEngine.TestPopESI (1013 of 2122)
PASS: lldb-api :: lang/cpp/function-qualifiers/TestCppFunctionQualifiers.py (1014 of 2122)
PASS: lldb-shell :: ObjectFile/ELF/PT_LOAD.yaml (1015 of 2122)
PASS: lldb-api :: macosx/DBGSourcePathRemapping/TestDSYMSourcePathRemapping.py (1016 of 2122)
PASS: lldb-shell :: Breakpoint/split-dwarf5-debug-stroffsets.test (1017 of 2122)
PASS: lldb-unit :: Host/./HostTests/SocketAddressTest.Set (1018 of 2122)
PASS: lldb-unit :: Host/./HostTests/MainLoopTest.Signal (1019 of 2122)
PASS: lldb-unit :: Process/gdb-remote/./ProcessGdbRemoteTests/GDBRemoteCommunicationClientTest.GetModulesInfoInvalidResponse (1020 of 2122)
PASS: lldb-api :: lang/cpp/dynamic-value-same-basename/TestDynamicValueSameBase.py (1021 of 2122)
PASS: lldb-unit :: Platform/Android/./AdbClientTests/AdbClientTest.CreateByDeviceId (1022 of 2122)
PASS: lldb-api :: functionalities/thread/concurrent_events/TestConcurrentBreakpointsDelayedBreakpointOneWatchpoint.py (1023 of 2122)
PASS: lldb-unit :: UnwindAssembly/x86/./UnwindAssemblyx86Tests/Testx86AssemblyInspectionEngine.TestSimplex86_64Augmented (1024 of 2122)
PASS: lldb-unit :: Utility/./UtilityTests/BinaryStreamTest.PutULEB128MaxValue (1025 of 2122)
PASS: lldb-api :: lang/objc/hidden-ivars/TestHiddenIvars.py (1026 of 2122)
PASS: lldb-unit :: Expression/./ExpressionTests/DiagnosticManagerTest.GetStringMultiline (1027 of 2122)
PASS: lldb-api :: commands/breakpoint/command/list/TestBreakpointCommandList.py (1028 of 2122)
PASS: lldb-shell :: SymbolFile/DWARF/debug_loclists-dwo.s (1029 of 2122)
PASS: lldb-unit :: Utility/./UtilityTests/StreamTest.PutMaxHex64ByteOrderLittle (1030 of 2122)
PASS: lldb-api :: lang/objc/objc-dyn-sbtype/TestObjCDynamicSBType.py (1031 of 2122)
PASS: lldb-unit :: Utility/./UtilityTests/ConstStringTest.format_provider (1032 of 2122)
PASS: lldb-api :: functionalities/gdb_remote_client/TestGDBRemoteClient.py (1033 of 2122)
PASS: lldb-api :: types/TestShortTypeExpr.py (1034 of 2122)
PASS: lldb-unit :: Utility/./UtilityTests/ProcessInstanceInfoList.Yaml (1035 of 2122)
PASS: lldb-api :: macosx/find-dsym/bundle-with-dot-in-filename/TestBundleWithDotInFilename.py (1036 of 2122)
PASS: lldb-shell :: SymbolFile/DWARF/dir-separator-posix.s (1037 of 2122)
PASS: lldb-shell :: SymbolFile/DWARF/deterministic-build.cpp (1038 of 2122)
PASS: lldb-shell :: Settings/TestSettingsWrite.test (1039 of 2122)
PASS: lldb-unit :: Utility/./UtilityTests/StringExtractorTest.DecodeHexU8_Extra (1040 of 2122)
PASS: lldb-shell :: Reproducer/TestProcessList.test (1041 of 2122)
PASS: lldb-api :: functionalities/data-formatter/data-formatter-disabling/TestDataFormatterDisabling.py (1042 of 2122)
PASS: lldb-unit :: Utility/./UtilityTests/OptionsWithRawTest.QuotedSuffix (1043 of 2122)
PASS: lldb-shell :: SymbolFile/DWARF/debug-types-dwo-cross-reference.cpp (1044 of 2122)
PASS: lldb-unit :: Target/./TargetTests/ModuleCacheTest.GetAndPutUuidExists (1045 of 2122)
PASS: lldb-api :: lang/objc/objc-static-method-stripped/TestObjCStaticMethodStripped.py (1046 of 2122)
PASS: lldb-unit :: Utility/./UtilityTests/StreamTest.ChangingByteOrder (1047 of 2122)
PASS: lldb-unit :: Utility/./UtilityTests/RangeDataVector.CustomSort (1048 of 2122)
PASS: lldb-api :: functionalities/data-formatter/data-formatter-stl/libcxx/unordered/TestDataFormatterUnordered.py (1049 of 2122)
PASS: lldb-unit :: Utility/./UtilityTests/LogTest.Unregister (1050 of 2122)
PASS: lldb-unit :: Utility/./UtilityTests/StringExtractorTest.GetU64LittleEndian (1051 of 2122)
PASS: lldb-api :: functionalities/data-formatter/data-formatter-stl/libcxx/queue/TestDataFormatterLibcxxQueue.py (1052 of 2122)
PASS: lldb-unit :: Symbol/./SymbolTests/TestClangASTImporter.DeportDeclTagDecl (1053 of 2122)
PASS: lldb-api :: functionalities/tail_call_frames/thread_step_out_message/TestArtificialFrameStepOutMessage.py (1054 of 2122)
PASS: lldb-unit :: Utility/./UtilityTests/StringLexerTest.Next (1055 of 2122)
PASS: lldb-shell :: ObjectFile/ELF/base-address.yaml (1056 of 2122)
PASS: lldb-api :: api/log/TestAPILog.py (1057 of 2122)
PASS: lldb-unit :: Utility/./UtilityTests/BroadcasterTest.BroadcastEvent (1058 of 2122)
PASS: lldb-api :: iohandler/completion/TestIOHandlerCompletion.py (1059 of 2122)
PASS: lldb-unit :: Utility/./UtilityTests/OptionsWithRawTest.ArgsButNoLeadingDash (1060 of 2122)
PASS: lldb-unit :: SymbolFile/DWARF/./SymbolFileDWARFTests/SymbolFileDWARFTests.TestAbbrevOutOfOrder (1061 of 2122)
PASS: lldb-api :: functionalities/inferior-crashing/recursive-inferior/TestRecursiveInferiorStep.py (1062 of 2122)
PASS: lldb-api :: functionalities/breakpoint/breakpoint_ids/TestBreakpointIDs.py (1063 of 2122)
XFAIL: lldb-shell :: Register/x86-mm-xmm-read.test (1064 of 2122)
PASS: lldb-shell :: SymbolFile/DWARF/find-method-local-struct.cpp (1065 of 2122)
XFAIL: lldb-shell :: Register/x86-mm-xmm-write.test (1066 of 2122)
PASS: lldb-unit :: Utility/./UtilityTests/XcodeSDKTest.MergeTest (1067 of 2122)
PASS: lldb-api :: lang/objc/objc++/TestObjCXX.py (1068 of 2122)
PASS: lldb-unit :: ScriptInterpreter/Python/./ScriptInterpreterPythonTests/PythonDataObjectsTest.TestBorrowedReferences (1069 of 2122)
PASS: lldb-unit :: Utility/./UtilityTests/StringExtractorTest.GetHexU8_InvalidHex_NoEof (1070 of 2122)
UNSUPPORTED: lldb-api :: functionalities/thread/multi_break/TestMultipleBreakpoints.py (1071 of 2122)
PASS: lldb-api :: lang/objc/modules-cache/TestClangModulesCache.py (1072 of 2122)
PASS: lldb-api :: lang/objc/objc-static-method/TestObjCStaticMethod.py (1073 of 2122)
PASS: lldb-unit :: ScriptInterpreter/Python/./ScriptInterpreterPythonTests/PythonDataObjectsTest.TestPythonTupleInitializerList2 (1074 of 2122)
PASS: lldb-shell :: Quit/TestQuitExitCodeNonInt.test (1075 of 2122)
PASS: lldb-api :: macosx/queues/TestQueues.py (1076 of 2122)
PASS: lldb-unit :: Process/gdb-remote/./ProcessGdbRemoteTests/GDBRemoteClientBaseTest.SendContinueDelegateStructuredDataReceipt (1077 of 2122)
PASS: lldb-api :: commands/expression/import-std-module/deque-dbg-info-content/TestDbgInfoContentDequeFromStdModule.py (1078 of 2122)
PASS: lldb-unit :: UnwindAssembly/x86/./UnwindAssemblyx86Tests/Testx86AssemblyInspectionEngine.TestPushR13 (1079 of 2122)
PASS: lldb-shell :: Reproducer/TestDSYM.test (1080 of 2122)
PASS: lldb-api :: commands/watchpoints/watchpoint_disable/TestWatchpointDisable.py (1081 of 2122)
PASS: lldb-api :: functionalities/tail_call_frames/sbapi_support/TestTailCallFrameSBAPI.py (1082 of 2122)
UNSUPPORTED: lldb-api :: functionalities/tty/TestTerminal.py (1083 of 2122)
UNSUPPORTED: lldb-api :: functionalities/data-formatter/data-formatter-stl/libstdcpp/smart_ptr/TestDataFormatterStdSmartPtr.py (1084 of 2122)
UNSUPPORTED: lldb-api :: commands/watchpoints/multi_watchpoint_slots/TestWatchpointMultipleSlots.py (1085 of 2122)
PASS: lldb-shell :: ScriptInterpreter/Python/crashlog.test (1086 of 2122)
PASS: lldb-api :: functionalities/data-formatter/var-in-aggregate-misuse/TestVarInAggregateMisuse.py (1087 of 2122)
PASS: lldb-unit :: Utility/./UtilityTests/BinaryStreamTest.PutULEB128FourBytes (1088 of 2122)
PASS: lldb-shell :: Reproducer/Functionalities/TestStepping.test (1089 of 2122)
PASS: lldb-shell :: Driver/TestNoUseColor.test (1090 of 2122)
PASS: lldb-api :: functionalities/plugins/python_os_plugin/TestPythonOSPlugin.py (1091 of 2122)
PASS: lldb-api :: lang/cpp/dynamic-value/TestDynamicValue.py (1092 of 2122)
PASS: lldb-api :: functionalities/data-formatter/varscript_formatting/TestDataFormatterVarScriptFormatting.py (1093 of 2122)
PASS: lldb-shell :: SymbolFile/DWARF/debug-types-missing-signature.test (1094 of 2122)
PASS: lldb-api :: commands/target/stop-hook/disable/TestTargetStopHookDisable.py (1095 of 2122)
PASS: lldb-api :: lang/objc/exceptions/TestObjCExceptions.py (1096 of 2122)
PASS: lldb-api :: functionalities/data-formatter/data-formatter-stl/libcxx/list/TestDataFormatterLibcxxList.py (1097 of 2122)
PASS: lldb-api :: macosx/safe-to-func-call/TestSafeFuncCalls.py (1098 of 2122)
PASS: lldb-unit :: Host/./HostTests/SocketTest.TCPGetConnectURI (1099 of 2122)
PASS: lldb-api :: lang/cpp/auto/TestCPPAuto.py (1100 of 2122)
PASS: lldb-shell :: SymbolFile/DWARF/static_scope.s (1101 of 2122)
PASS: lldb-api :: commands/expression/persistent_variables/TestPersistentVariables.py (1102 of 2122)
PASS: lldb-unit :: Symbol/./SymbolTests/TestTypeSystemClang.TestGetEnumIntegerTypeUnexpectedType (1103 of 2122)
PASS: lldb-unit :: Utility/./UtilityTests/StreamTest.PutHex16ByteOrderLittle (1104 of 2122)
PASS: lldb-api :: commands/expression/invalid-args/TestInvalidArgsExpression.py (1105 of 2122)
PASS: lldb-api :: functionalities/data-formatter/data-formatter-objc/TestDataFormatterObjCNSData.py (1106 of 2122)
PASS: lldb-unit :: Utility/./UtilityTests/StringListTest.PopBack (1107 of 2122)
PASS: lldb-unit :: Process/gdb-remote/./ProcessGdbRemoteTests/GDBRemoteCommunicationClientTest.SendGetDataPacket (1108 of 2122)
PASS: lldb-shell :: ObjectFile/ELF/many-sections.s (1109 of 2122)
PASS: lldb-unit :: Language/Highlighting/./HighlighterTests/HighlighterTest.Colons (1110 of 2122)
PASS: lldb-unit :: Utility/./UtilityTests/UserIDResolver.GetGroupName (1111 of 2122)
PASS: lldb-api :: commands/process/attach-resume/TestAttachResume.py (1112 of 2122)
PASS: lldb-unit :: Utility/./UtilityTests/UUIDTest.SetFromStringRef (1113 of 2122)
UNSUPPORTED: lldb-api :: tools/lldb-server/TestGdbRemote_vContThreads.py (1114 of 2122)
PASS: lldb-unit :: Host/./HostTests/File.GetWaitableHandleFileno (1115 of 2122)
PASS: lldb-unit :: Utility/./UtilityTests/StatusTest.ErrorCodeConstructor (1116 of 2122)
PASS: lldb-api :: api/multithreaded/TestMultithreaded.py (1117 of 2122)
PASS: lldb-unit :: Utility/./UtilityTests/GeneratorTest.Create (1118 of 2122)
PASS: lldb-shell :: Driver/TestTarget.test (1119 of 2122)
PASS: lldb-unit :: Host/./HostTests/NativeProcessProtocolTest.ReadCStringFromMemory_MaxSize (1120 of 2122)
PASS: lldb-unit :: Utility/./UtilityTests/StringExtractorTest.GetU64BigEndian (1121 of 2122)
PASS: lldb-api :: macosx/save_crashlog/TestSaveCrashlog.py (1122 of 2122)
PASS: lldb-api :: commands/expression/completion/TestExprCompletion.py (1123 of 2122)
PASS: lldb-api :: commands/expression/options/TestExprOptions.py (1124 of 2122)
PASS: lldb-unit :: Language/Highlighting/./HighlighterTests/HighlighterTest.ClangPreserveNewLine (1125 of 2122)
PASS: lldb-unit :: Utility/./UtilityTests/StringListTest.LongestCommonPrefixDuplicateElement (1126 of 2122)
PASS: lldb-unit :: Language/CPlusPlus/./LanguageCPlusPlusTests/CPlusPlusLanguage.ExtractContextAndIdentifier (1127 of 2122)
PASS: lldb-api :: functionalities/backticks/TestBackticksWithoutATarget.py (1128 of 2122)
PASS: lldb-api :: functionalities/stats_api/TestStatisticsAPI.py (1129 of 2122)
PASS: lldb-unit :: Utility/./UtilityTests/RangeDataVector.FindEntryIndexesThatContain_Overlap (1130 of 2122)
PASS: lldb-api :: commands/expression/inline-namespace/TestInlineNamespace.py (1131 of 2122)
PASS: lldb-api :: lang/objc/forward-decl/TestForwardDecl.py (1132 of 2122)
PASS: lldb-unit :: Core/./LLDBCoreTests/RichManglingContextTest.IPDRealloc (1133 of 2122)
PASS: lldb-unit :: Host/./HostTests/SocketAddressTest.GetAddressInfo (1134 of 2122)
PASS: lldb-api :: commands/target/stop-hook/delete/TestTargetStopHookDelete.py (1135 of 2122)
PASS: lldb-api :: commands/expression/vector_of_enums/TestVectorOfEnums.py (1136 of 2122)
PASS: lldb-unit :: UnwindAssembly/x86/./UnwindAssemblyx86Tests/Testx86AssemblyInspectionEngine.TestMovRSPtoRBP (1137 of 2122)
PASS: lldb-shell :: Driver/TestCore.test (1138 of 2122)
PASS: lldb-api :: functionalities/target_var/TestTargetVar.py (1139 of 2122)
PASS: lldb-shell :: Breakpoint/debug_rnglist_rlestartend.test (1140 of 2122)
PASS: lldb-unit :: Symbol/./SymbolTests/TestTypeSystemClang.TestIsClangType (1141 of 2122)
PASS: lldb-api :: functionalities/rerun/TestRerun.py (1142 of 2122)
PASS: lldb-unit :: Utility/./UtilityTests/StringListTest.ForRangeEmpty (1143 of 2122)
PASS: lldb-unit :: Utility/./UtilityTests/ArgsTest.TestArgv (1144 of 2122)
PASS: lldb-unit :: Host/./HostTests/FileSystemTest.GetPermissions (1145 of 2122)
PASS: lldb-unit :: SymbolFile/NativePDB/./SymbolFileNativePDBTests/PDBFPOProgramToDWARFExpressionTests.InvalidAssignmentMultiple (1146 of 2122)
PASS: lldb-shell :: SymbolFile/DWARF/debug_ranges.s (1147 of 2122)
PASS: lldb-api :: functionalities/gdb_remote_client/TestRestartBug.py (1148 of 2122)
PASS: lldb-api :: lang/cpp/constructors/TestCppConstructors.py (1149 of 2122)
UNSUPPORTED: lldb-api :: functionalities/darwin_log/basic/TestDarwinLogBasic.py (1150 of 2122)
PASS: lldb-api :: lang/objc/objc-super/TestObjCSuper.py (1151 of 2122)
PASS: lldb-shell :: ObjectFile/ELF/netbsd-core-amd64.test (1152 of 2122)
PASS: lldb-unit :: Utility/./UtilityTests/StreamTest.PutHex64ByteOrderBig (1153 of 2122)
UNSUPPORTED: lldb-shell :: ScriptInterpreter/Lua/lua.test (1154 of 2122)
PASS: lldb-unit :: ScriptInterpreter/Python/./ScriptInterpreterPythonTests/PythonDataObjectsTest.TestCallable (1155 of 2122)
PASS: lldb-unit :: Utility/./UtilityTests/StreamTest.PutBytesAsRawHex8ToMixedEndian (1156 of 2122)
PASS: lldb-unit :: Symbol/./SymbolTests/LineEntryTest.GetSameLineContiguousAddressRangeNoInlines (1157 of 2122)
PASS: lldb-api :: functionalities/lazy-loading/TestLazyLoading.py (1158 of 2122)
PASS: lldb-unit :: Platform/./LLDBPlatformTests/PlatformAppleSimulatorTest.TestHostPlatformToSim (1159 of 2122)
PASS: lldb-unit :: Utility/./UtilityTests/PassiveReplayTest.InstrumentedFoo (1160 of 2122)
PASS: lldb-api :: commands/platform/file/read/TestPlatformFileRead.py (1161 of 2122)
PASS: lldb-unit :: UnwindAssembly/x86/./UnwindAssemblyx86Tests/Testx86AssemblyInspectionEngine.TestPushEAX (1162 of 2122)
UNSUPPORTED: lldb-shell :: ScriptInterpreter/Lua/command_script_import.test (1163 of 2122)
PASS: lldb-api :: commands/command/invalid-args/TestInvalidArgsCommand.py (1164 of 2122)
PASS: lldb-unit :: Language/Highlighting/./HighlighterTests/HighlighterTest.DefaultHighlighter (1165 of 2122)
PASS: lldb-shell :: Expr/TestIRMemoryMap.test (1166 of 2122)
PASS: lldb-api :: commands/expression/call-function/TestCallStdStringFunction.py (1167 of 2122)
PASS: lldb-api :: api/multiple-targets/TestMultipleTargets.py (1168 of 2122)
PASS: lldb-api :: tools/lldb-vscode/step/TestVSCode_step.py (1169 of 2122)
PASS: lldb-api :: functionalities/thread/concurrent_events/TestConcurrentSignalNWatchNBreak.py (1170 of 2122)
PASS: lldb-unit :: Process/gdb-remote/./ProcessGdbRemoteTests/GDBRemoteCommunicationClientTest.WriteRegister (1171 of 2122)
UNSUPPORTED: lldb-shell :: ScriptInterpreter/Lua/persistent_state.test (1172 of 2122)
PASS: lldb-shell :: Commands/command-disassemble-process.yaml (1173 of 2122)
PASS: lldb-unit :: Utility/./UtilityTests/ArchSpecTest.TripleComponentsWereSpecified (1174 of 2122)
PASS: lldb-api :: commands/frame/diagnose/bad-reference/TestBadReference.py (1175 of 2122)
PASS: lldb-api :: functionalities/breakpoint/breakpoint_callback_command_source/TestBreakpointCallbackCommandSource.py (1176 of 2122)
PASS: lldb-shell :: Unwind/eh-frame-dwarf-unwind.test (1177 of 2122)
PASS: lldb-unit :: Interpreter/./InterpreterTests/CompletionTest.DirCompletionAbsolute (1178 of 2122)
PASS: lldb-api :: functionalities/var_path/TestVarPath.py (1179 of 2122)
PASS: lldb-api :: functionalities/asan/TestReportData.py (1180 of 2122)
PASS: lldb-api :: commands/expression/multiline-navigation/TestMultilineNavigation.py (1181 of 2122)
PASS: lldb-unit :: ScriptInterpreter/Python/./ScriptInterpreterPythonTests/PythonDataObjectsTest.TestPythonTupleInitializerList (1182 of 2122)
PASS: lldb-api :: tools/lldb-server/TestGdbRemoteExpeditedRegisters.py (1183 of 2122)
PASS: lldb-unit :: Utility/./UtilityTests/StringListTest.AppendList (1184 of 2122)
UNSUPPORTED: lldb-shell :: SymbolFile/PDB/type-quals.test (1185 of 2122)
PASS: lldb-unit :: Utility/./UtilityTests/StringListTest.JoinSingle (1186 of 2122)
PASS: lldb-api :: functionalities/paths/TestPaths.py (1187 of 2122)
PASS: lldb-unit :: Instruction/./EmulatorTests/TestAArch64Emulator.TestOverflow (1188 of 2122)
PASS: lldb-unit :: Utility/./UtilityTests/LogChannelTest.EnableOptions (1189 of 2122)
PASS: lldb-unit :: Utility/./UtilityTests/StreamTest.AddressNoSuffix (1190 of 2122)
PASS: lldb-unit :: tools/lldb-server/tests/./LLDBServerTests/TestBase.LaunchModePreservesEnvironment (1191 of 2122)
PASS: lldb-unit :: Expression/./ExpressionTests/ClangHostTest.ComputeClangResourceDirectory (1192 of 2122)
PASS: lldb-unit :: Utility/./UtilityTests/StreamTest.PutRawBytesToMixedEndian (1193 of 2122)
PASS: lldb-unit :: Process/minidump/./LLDBMinidumpTests/MinidumpParserTest.GetPidWindows (1194 of 2122)
PASS: lldb-unit :: Process/minidump/./LLDBMinidumpTests/MinidumpParserTest.GetFilteredModuleList (1195 of 2122)
PASS: lldb-unit :: Utility/./UtilityTests/StatusTest.ErrorConversion (1196 of 2122)
PASS: lldb-unit :: Host/./HostTests/FileSystemTest.FileAndDirectoryComponents (1197 of 2122)
PASS: lldb-api :: lang/cpp/rvalue-references/TestRvalueReferences.py (1198 of 2122)
PASS: lldb-api :: lang/objc/ptr_refs/TestPtrRefsObjC.py (1199 of 2122)
PASS: lldb-unit :: Utility/./UtilityTests/RangeTest.ContainsAddr (1200 of 2122)
PASS: lldb-unit :: SymbolFile/NativePDB/./SymbolFileNativePDBTests/PDBFPOProgramToDWARFExpressionTests.InvalidOpBinary (1201 of 2122)
PASS: lldb-api :: commands/expression/weak_symbols/TestWeakSymbols.py (1202 of 2122)
PASS: lldb-api :: lang/objc/single-entry-dictionary/TestObjCSingleEntryDictionary.py (1203 of 2122)
PASS: lldb-unit :: Utility/./UtilityTests/VMRange.IsValid (1204 of 2122)
PASS: lldb-api :: lang/cpp/enum_types/TestCPP11EnumTypes.py (1205 of 2122)
PASS: lldb-shell :: Settings/TestFrameFormatNoColor.test (1206 of 2122)
PASS: lldb-api :: functionalities/history/TestHistoryRecall.py (1207 of 2122)
PASS: lldb-api :: commands/breakpoint/set/func-regex/TestBreakpointRegexError.py (1208 of 2122)
PASS: lldb-api :: functionalities/data-formatter/data-formatter-objc/nsindexpath/TestDataFormatterNSIndexPath.py (1209 of 2122)
PASS: lldb-unit :: Language/CLanguages/./LanguageCLanguagesTests/CLanguages.LookupCLanguagesByLanguageType (1210 of 2122)
PASS: lldb-unit :: debugserver/./debugserverTests/RNBSocket.LoopBackConnectIPv4 (1211 of 2122)
PASS: lldb-api :: functionalities/data-formatter/user-format-vs-summary/TestUserFormatVsSummary.py (1212 of 2122)
PASS: lldb-api :: python_api/sbstructureddata/TestStructuredDataAPI.py (1213 of 2122)
PASS: lldb-api :: functionalities/data-formatter/language_category_updates/TestDataFormatterLanguageCategoryUpdates.py (1214 of 2122)
PASS: lldb-unit :: Breakpoint/./LLDBBreakpointTests/BreakpointIDTest.StringIsBreakpointName (1215 of 2122)
PASS: lldb-api :: tools/lldb-server/inferior-crash/TestGdbRemoteSegFault.py (1216 of 2122)
PASS: lldb-unit :: Process/minidump/./LLDBMinidumpTests/MinidumpParserTest.GetThreadContext_x86_64 (1217 of 2122)
PASS: lldb-unit :: Target/./TargetTests/ExecutionContextTest.GetByteOrderTarget (1218 of 2122)
PASS: lldb-shell :: SymbolFile/DWARF/DW_OP_piece-struct.s (1219 of 2122)
PASS: lldb-api :: commands/expression/save_jit_objects/TestSaveJITObjects.py (1220 of 2122)
PASS: lldb-unit :: Utility/./UtilityTests/StringListTest.GetMaxStringLengthDecreasingSize (1221 of 2122)
PASS: lldb-unit :: ScriptInterpreter/Python/./ScriptInterpreterPythonTests/PythonDataObjectsTest.TestPythonListToStructuredList (1222 of 2122)
PASS: lldb-api :: lang/objc/objc-new-syntax/TestObjCNewSyntaxArray.py (1223 of 2122)
PASS: lldb-unit :: Host/./HostTests/FileSystemTest.Readable (1224 of 2122)
PASS: lldb-unit :: Host/./HostTests/NativeProcessProtocolTest.ReadMemoryWithoutTrap (1225 of 2122)
PASS: lldb-shell :: SymbolFile/DWARF/dwo-type-in-main-file.s (1226 of 2122)
PASS: lldb-api :: commands/frame/recognizer/TestFrameRecognizer.py (1227 of 2122)
PASS: lldb-shell :: BuildScript/modes.test (1228 of 2122)
PASS: lldb-unit :: Utility/./UtilityTests/BinaryStreamTest.PutSLEB128MaxValue (1229 of 2122)
PASS: lldb-api :: lang/cpp/chained-calls/TestCppChainedCalls.py (1230 of 2122)
PASS: lldb-unit :: Utility/./UtilityTests/UriParserTest.BracketedHostname (1231 of 2122)
PASS: lldb-api :: lang/objc/objc-optimized/TestObjcOptimized.py (1232 of 2122)
PASS: lldb-api :: functionalities/gdb_remote_client/TestWasm.py (1233 of 2122)
UNSUPPORTED: lldb-shell :: Register/x86-64-gp-write.test (1234 of 2122)
PASS: lldb-unit :: Utility/./UtilityTests/CompletionRequest.DuplicateFiltering (1235 of 2122)
PASS: lldb-shell :: Commands/command-regex-unalias.test (1236 of 2122)
PASS: lldb-unit :: Utility/./UtilityTests/StringExtractorTest.GetU32LittleEndian (1237 of 2122)
PASS: lldb-unit :: Disassembler/./DisassemblerTests/TestArm64Disassembly.TestArmv81Instruction (1238 of 2122)
PASS: lldb-unit :: Host/./HostTests/NativeProcessProtocolTest.SetBreakpointFailWrite (1239 of 2122)
PASS: lldb-api :: commands/expression/completion-crash-incomplete-record/TestCompletionCrashIncompleteRecord.py (1240 of 2122)
PASS: lldb-api :: tools/lldb-vscode/breakpoint/TestVSCode_setBreakpoints.py (1241 of 2122)
PASS: lldb-shell :: Minidump/breakpad-symbols.test (1242 of 2122)
PASS: lldb-unit :: Core/./LLDBCoreTests/SourceFileCache.FindSourceFileFound (1243 of 2122)
PASS: lldb-api :: lang/objc/foundation/TestConstStrings.py (1244 of 2122)
PASS: lldb-shell :: SymbolFile/DWARF/find-basic-function.cpp (1245 of 2122)
PASS: lldb-api :: python_api/watchpoint/TestSetWatchpoint.py (1246 of 2122)
PASS: lldb-api :: functionalities/data-formatter/poarray/TestPrintObjectArray.py (1247 of 2122)
PASS: lldb-api :: python_api/watchpoint/watchlocation/TestTargetWatchAddress.py (1248 of 2122)
PASS: lldb-api :: lang/c/stepping/TestStepAndBreakpoints.py (1249 of 2122)
PASS: lldb-api :: commands/watchpoints/watchpoint_set_command/TestWatchLocationWithWatchSet.py (1250 of 2122)
PASS: lldb-unit :: Symbol/./SymbolTests/PostfixExpression.ParseOneExpression (1251 of 2122)
UNSUPPORTED: lldb-api :: lang/c/unicode/TestUnicodeSymbols.py (1252 of 2122)
PASS: lldb-unit :: DataFormatter/./LLDBFormatterTests/TypeMatcherTests.GetMatchStringExactName (1253 of 2122)
PASS: lldb-api :: functionalities/breakpoint/cpp_exception/TestCPPExceptionBreakpoint.py (1254 of 2122)
PASS: lldb-api :: functionalities/data-formatter/data-formatter-synthval/TestDataFormatterSynthVal.py (1255 of 2122)
PASS: lldb-shell :: SymbolFile/DWARF/find-method.cpp (1256 of 2122)
PASS: lldb-unit :: Utility/./UtilityTests/StringListTest.AppendStringMove (1257 of 2122)
PASS: lldb-api :: functionalities/data-formatter/frameformat_smallstruct/TestFrameFormatSmallStruct.py (1258 of 2122)
PASS: lldb-unit :: Process/gdb-remote/./ProcessGdbRemoteTests/GDBRemoteCommunicationClientTest.ReadRegister (1259 of 2122)
UNSUPPORTED: lldb-shell :: ScriptInterpreter/Lua/quit.test (1260 of 2122)
PASS: lldb-api :: commands/expression/import-std-module/vector-of-vectors/TestVectorOfVectorsFromStdModule.py (1261 of 2122)
PASS: lldb-unit :: Utility/./UtilityTests/SerializationRountripTest.SerializeDeserializeObjectPointer (1262 of 2122)
PASS: lldb-api :: functionalities/data-formatter/data-formatter-script/TestDataFormatterScript.py (1263 of 2122)
PASS: lldb-shell :: SymbolFile/NativePDB/bitfields.cpp (1264 of 2122)
PASS: lldb-api :: functionalities/data-formatter/compactvectors/TestCompactVectors.py (1265 of 2122)
UNSUPPORTED: lldb-api :: lang/cpp/printf/TestPrintf.py (1266 of 2122)
PASS: lldb-api :: functionalities/data-formatter/hexcaps/TestDataFormatterHexCaps.py (1267 of 2122)
PASS: lldb-api :: lang/objc/objc-baseclass-sbtype/TestObjCBaseClassSBType.py (1268 of 2122)
PASS: lldb-unit :: Target/./TargetTests/ModuleCacheTest.GetAndPutStrangeHostname (1269 of 2122)
PASS: lldb-api :: lang/c/stepping/TestThreadStepping.py (1270 of 2122)
PASS: lldb-shell :: SymbolFile/Breakpad/line-table.test (1271 of 2122)
PASS: lldb-shell :: SymbolFile/DWARF/debug_rnglists.s (1272 of 2122)
PASS: lldb-unit :: Utility/./UtilityTests/NameMatchesTest.EndsWith (1273 of 2122)
PASS: lldb-shell :: ObjectFile/ELF/PT_LOAD-overlap-section.yaml (1274 of 2122)
PASS: lldb-unit :: Utility/./UtilityTests/FileSpecTest.PrependPathComponent (1275 of 2122)
PASS: lldb-unit :: Host/./HostTests/Host.WaitStatusFormat (1276 of 2122)
PASS: lldb-api :: lang/cpp/std-function-step-into-callable/TestStdFunctionStepIntoCallable.py (1277 of 2122)
PASS: lldb-unit :: Utility/./UtilityTests/RegularExpression.Valid (1278 of 2122)
PASS: lldb-shell :: Reproducer/TestVersionCheck.test (1279 of 2122)
PASS: lldb-unit :: Process/minidump/./LLDBMinidumpTests/MinidumpParserTest.GetMemoryRegionInfo (1280 of 2122)
PASS: lldb-unit :: UnwindAssembly/x86/./UnwindAssemblyx86Tests/Testx86AssemblyInspectionEngine.TestPushR12 (1281 of 2122)
PASS: lldb-api :: commands/expression/class_template_specialization_empty_pack/TestClassTemplateSpecializationParametersHandling.py (1282 of 2122)
PASS: lldb-api :: functionalities/tsan/cpp_global_location/TestTsanCPPGlobalLocation.py (1283 of 2122)
PASS: lldb-unit :: Process/gdb-remote/./ProcessGdbRemoteTests/GDBRemoteCommunicationClientTest.TestPacketSpeedJSON (1284 of 2122)
PASS: lldb-unit :: Utility/./UtilityTests/StringListTest.InsertStringAtIndexMove (1285 of 2122)
PASS: lldb-api :: functionalities/thread/concurrent_events/TestConcurrentWatchpointDelayWatchpointOneBreakpoint.py (1286 of 2122)
PASS: lldb-unit :: Process/gdb-remote/./ProcessGdbRemoteTests/GDBRemoteCommunicationClientTest.WriteRegisterNoSuffix (1287 of 2122)
PASS: lldb-unit :: Symbol/./SymbolTests/TestClangASTImporter.CopyTypeTagDecl (1288 of 2122)
PASS: lldb-api :: tools/lldb-vscode/breakpoint/TestVSCode_setExceptionBreakpoints.py (1289 of 2122)
PASS: lldb-api :: lang/cpp/type_lookup/TestCppTypeLookup.py (1290 of 2122)
PASS: lldb-api :: commands/expression/char/TestExprsChar.py (1291 of 2122)
PASS: lldb-unit :: Utility/./UtilityTests/SubsystemRAIITest.SubsystemWithErrorSuccess (1292 of 2122)
PASS: lldb-api :: commands/frame/diagnose/dereference-this/TestDiagnoseDereferenceThis.py (1293 of 2122)
PASS: lldb-unit :: Utility/./UtilityTests/ArgsTest.BareSingleQuote (1294 of 2122)
PASS: lldb-unit :: UnwindAssembly/x86/./UnwindAssemblyx86Tests/Testx86AssemblyInspectionEngine.TestSimple32bitFrameFunction (1295 of 2122)
PASS: lldb-api :: functionalities/breakpoint/address_breakpoints/TestAddressBreakpoints.py (1296 of 2122)
PASS: lldb-unit :: Utility/./UtilityTests/BinaryStreamTest.PutSLEB128FourBytes (1297 of 2122)
PASS: lldb-unit :: Utility/./UtilityTests/ArgsTest.TestAppendArg (1298 of 2122)
PASS: lldb-shell :: SymbolFile/DWARF/DW_AT_declaration-with-children.s (1299 of 2122)
PASS: lldb-unit :: Symbol/./SymbolTests/TestTypeSystemClang.TemplateArguments (1300 of 2122)
PASS: lldb-api :: functionalities/data-formatter/data-formatter-stl/libcxx/variant/TestDataFormatterLibcxxVariant.py (1301 of 2122)
PASS: lldb-unit :: UnwindAssembly/x86/./UnwindAssemblyx86Tests/Testx86AssemblyInspectionEngine.TestPushEBX (1302 of 2122)
PASS: lldb-api :: lang/cpp/stl/TestStdCXXDisassembly.py (1303 of 2122)
PASS: lldb-api :: sanity/TestModuleCacheSanity.py (1304 of 2122)
PASS: lldb-unit :: Utility/./UtilityTests/OptionsWithRawTest.EmptyInput (1305 of 2122)
UNSUPPORTED: lldb-api :: arm/breakpoint-thumb-codesection/TestBreakpointThumbCodesection.py (1306 of 2122)
PASS: lldb-api :: lang/objcxx/objcxx-ivar-vector/TestIvarVector.py (1307 of 2122)
PASS: lldb-unit :: Utility/./UtilityTests/StreamTest.PutNHex8 (1308 of 2122)
PASS: lldb-api :: functionalities/gdb_remote_client/TestqOffsets.py (1309 of 2122)
PASS: lldb-api :: lang/objc/variadic_methods/TestVariadicMethods.py (1310 of 2122)
PASS: lldb-api :: functionalities/data-formatter/pyobjsynthprovider/TestPyObjSynthProvider.py (1311 of 2122)
PASS: lldb-unit :: UnwindAssembly/ARM64/./Arm64InstEmulationTests/TestArm64InstEmulation.TestCFARegisterTrackedAcrossJumps (1312 of 2122)
PASS: lldb-api :: commands/expression/namespace_local_var_same_name_cpp_and_c/TestNamespaceLocalVarSameNameCppAndC.py (1313 of 2122)
PASS: lldb-shell :: SymbolFile/DWARF/find-inline-method.s (1314 of 2122)
PASS: lldb-unit :: Utility/./UtilityTests/StreamTest.PutStringAsRawHex8 (1315 of 2122)
PASS: lldb-unit :: Utility/./UtilityTests/StreamTeeTest.DefaultConstructor (1316 of 2122)
UNSUPPORTED: lldb-shell :: Register/x86-64-zmm-read.test (1317 of 2122)
PASS: lldb-unit :: Host/./HostTests/FileSystemTest.OpenErrno (1318 of 2122)
PASS: lldb-unit :: UnwindAssembly/PPC64/./PPC64InstEmulationTests/TestPPC64InstEmulation.TestMediumFunction (1319 of 2122)
PASS: lldb-shell :: ObjectFile/Breakpad/breakpad-identification.test (1320 of 2122)
PASS: lldb-api :: functionalities/thread/thread_exit/TestThreadExit.py (1321 of 2122)
PASS: lldb-unit :: Host/./HostTests/HostInfoTest.GetHostname (1322 of 2122)
PASS: lldb-unit :: Target/./TargetTests/RemoteAwarePlatformTest.TestResolveExecutabelOnClientByPlatform (1323 of 2122)
PASS: lldb-shell :: Reproducer/TestWorkingDir.test (1324 of 2122)
PASS: lldb-unit :: Utility/./UtilityTests/DataExtractorTest.GetCStr (1325 of 2122)
PASS: lldb-unit :: Utility/./UtilityTests/FileSpecTest.EqualDotsWindows (1326 of 2122)
PASS: lldb-api :: lang/c/blocks/TestBlocks.py (1327 of 2122)
UNSUPPORTED: lldb-api :: tools/lldb-server/TestGdbRemoteModuleInfo.py (1328 of 2122)
PASS: lldb-api :: functionalities/tsan/thread_leak/TestTsanThreadLeak.py (1329 of 2122)
PASS: lldb-api :: functionalities/data-formatter/data-formatter-enum-format/TestDataFormatterEnumFormat.py (1330 of 2122)
PASS: lldb-shell :: SymbolFile/NativePDB/global-classes.cpp (1331 of 2122)
PASS: lldb-api :: functionalities/gdb_remote_client/TestIOSSimulator.py (1332 of 2122)
PASS: lldb-unit :: Core/./LLDBCoreTests/UniqueCStringMap.NoDefaultConstructor (1333 of 2122)
PASS: lldb-unit :: Utility/./UtilityTests/OptionsWithRawTest.EmptySuffixSingleWhitespace (1334 of 2122)
PASS: lldb-shell :: Commands/command-regex-delete.test (1335 of 2122)
PASS: lldb-unit :: Utility/./UtilityTests/StringListTest.SplitIntoLines (1336 of 2122)
PASS: lldb-unit :: Utility/./UtilityTests/BinaryStreamTest.PutULEB128EightBytes (1337 of 2122)
PASS: lldb-unit :: Language/Highlighting/./HighlighterTests/HighlighterTest.ClangBraces (1338 of 2122)
PASS: lldb-unit :: Expression/./ExpressionTests/DiagnosticManagerTest.FixedExpression (1339 of 2122)
PASS: lldb-unit :: Utility/./UtilityTests/ArgsTest.ReplaceArgumentAtIndexOutOfRange (1340 of 2122)
PASS: lldb-shell :: SymbolFile/symbol-binding.test (1341 of 2122)
PASS: lldb-unit :: Symbol/./SymbolTests/TestClangASTImporter.DeportTypeTagDecl (1342 of 2122)
PASS: lldb-unit :: Process/minidump/./LLDBMinidumpTests/MinidumpParserTest.GetArchitecture (1343 of 2122)
PASS: lldb-api :: python_api/process/read-mem-cstring/TestReadMemCString.py (1344 of 2122)
PASS: lldb-api :: commands/target/create-no-such-arch/TestNoSuchArch.py (1345 of 2122)
PASS: lldb-unit :: Utility/./UtilityTests/StreamTest.AddressSize (1346 of 2122)
PASS: lldb-unit :: Utility/./UtilityTests/ArgsTest.AppendArguments (1347 of 2122)
PASS: lldb-api :: lang/objc/objc-ivar-stripped/TestObjCIvarStripped.py (1348 of 2122)
PASS: lldb-api :: commands/watchpoints/watchpoint_size/TestWatchpointSizes.py (1349 of 2122)
PASS: lldb-api :: lang/cpp/char1632_t/TestChar1632T.py (1350 of 2122)
UNSUPPORTED: lldb-api :: functionalities/darwin_log/format/TestDarwinLogMessageFormat.py (1351 of 2122)
PASS: lldb-shell :: Minidump/Windows/broken-unwind.test (1352 of 2122)
UNSUPPORTED: lldb-shell :: ScriptInterpreter/Lua/convenience_variables.test (1353 of 2122)
UNSUPPORTED: lldb-api :: functionalities/breakpoint/hardware_breakpoints/write_memory_with_hw_breakpoint/TestWriteMemoryWithHWBreakpoint.py (1354 of 2122)
PASS: lldb-unit :: ScriptInterpreter/Python/./ScriptInterpreterPythonTests/PythonDataObjectsTest.TestPythonIntegerToStructuredInteger (1355 of 2122)
PASS: lldb-api :: functionalities/thread/create_after_attach/TestCreateAfterAttach.py (1356 of 2122)
PASS: lldb-unit :: Utility/./UtilityTests/ConstStringTest.FromMidOfBufferStringRef (1357 of 2122)
UNSUPPORTED: lldb-shell :: SymbolFile/PDB/compilands.test (1358 of 2122)
PASS: lldb-api :: commands/expression/static-initializers/TestStaticInitializers.py (1359 of 2122)
PASS: lldb-shell :: SymbolFile/Breakpad/line-table-missing-file.test (1360 of 2122)
PASS: lldb-unit :: Expression/./ExpressionTests/DWARFExpression.DW_OP_stack_value (1361 of 2122)
PASS: lldb-shell :: ObjectFile/ELF/compressed-sections.yaml (1362 of 2122)
PASS: lldb-unit :: Process/gdb-remote/./ProcessGdbRemoteTests/GDBRemoteCommunicationClientTest.SendGetTraceConfigPacket (1363 of 2122)
PASS: lldb-api :: functionalities/gdb_remote_client/TestNoGPacketSupported.py (1364 of 2122)
PASS: lldb-unit :: Symbol/./SymbolTests/TestClangASTImporter.MetadataPropagationIndirectImport (1365 of 2122)
PASS: lldb-unit :: SymbolFile/DWARF/./SymbolFileDWARFTests/SymbolFileDWARFTests.ParseArangesNonzeroSegmentSize (1366 of 2122)
PASS: lldb-api :: tools/lldb-vscode/stackTrace/TestVSCode_stackTrace.py (1367 of 2122)
PASS: lldb-shell :: Minidump/Windows/Sigsegv/sigsegv.test (1368 of 2122)
PASS: lldb-api :: functionalities/data-formatter/data-formatter-stl/libcxx/unique_ptr/TestDataFormatterLibcxxUniquePtr.py (1369 of 2122)
PASS: lldb-unit :: ScriptInterpreter/Python/./ScriptInterpreterPythonTests/PythonDataObjectsTest.TestExtractingUInt64ThroughStructuredData (1370 of 2122)
PASS: lldb-shell :: Settings/TestSettingsSet.test (1371 of 2122)
PASS: lldb-unit :: Utility/./UtilityTests/VMRange.Comparison (1372 of 2122)
PASS: lldb-api :: lang/objc/objc_direct-methods/TestObjCDirectMethods.py (1373 of 2122)
PASS: lldb-unit :: Utility/./UtilityTests/VMRange.Clear (1374 of 2122)
PASS: lldb-unit :: Utility/./UtilityTests/AnsiTerminal.WhiteSpace (1375 of 2122)
PASS: lldb-unit :: Utility/./UtilityTests/LogChannelEnabledTest.LogGetLogThread (1376 of 2122)
PASS: lldb-shell :: ObjectFile/wasm/stripped-debug-sections.yaml (1377 of 2122)
PASS: lldb-shell :: ObjectFile/PECOFF/invalid-export-table.yaml (1378 of 2122)
PASS: lldb-api :: functionalities/breakpoint/breakpoint_set_restart/TestBreakpointSetRestart.py (1379 of 2122)
PASS: lldb-api :: lang/cpp/limit-debug-info/TestWithLimitDebugInfo.py (1380 of 2122)
PASS: lldb-unit :: Utility/./UtilityTests/EventTest.DumpEventDataBytes (1381 of 2122)
PASS: lldb-unit :: SymbolFile/NativePDB/./SymbolFileNativePDBTests/PDBFPOProgramToDWARFExpressionTests.UnresolvedRegisterAssignmentReference (1382 of 2122)
PASS: lldb-unit :: Utility/./UtilityTests/SubsystemRAIITest.NormalSubsystem (1383 of 2122)
PASS: lldb-api :: tools/lldb-server/TestGdbRemote_vCont.py (1384 of 2122)
PASS: lldb-shell :: SymbolFile/NativePDB/break-by-function.cpp (1385 of 2122)
PASS: lldb-unit :: Language/Highlighting/./HighlighterTests/HighlighterTest.ClangCursorPosBeforeOtherToken (1386 of 2122)
PASS: lldb-unit :: Utility/./UtilityTests/ProcessInstanceInfo.DumpTable (1387 of 2122)
PASS: lldb-api :: commands/watchpoints/watchpoint_on_vectors/TestValueOfVectorVariable.py (1388 of 2122)
PASS: lldb-api :: commands/command/nested_alias/TestNestedAlias.py (1389 of 2122)
PASS: lldb-api :: functionalities/data-formatter/summary-string-onfail/Test-rdar-9974002.py (1390 of 2122)
PASS: lldb-unit :: Utility/./UtilityTests/StringLexerTest.NextIf (1391 of 2122)
PASS: lldb-api :: functionalities/tsan/thread_numbers/TestTsanThreadNumbers.py (1392 of 2122)
PASS: lldb-unit :: Utility/./UtilityTests/StreamTest.PutHex64ByteOrderLittle (1393 of 2122)
PASS: lldb-unit :: Process/minidump/./LLDBMinidumpTests/MinidumpParserTest.GetMemoryRegionInfoLinuxMaps (1394 of 2122)
PASS: lldb-api :: lang/objc/foundation/TestRuntimeTypes.py (1395 of 2122)
PASS: lldb-unit :: Utility/./UtilityTests/RegularExpression.Empty (1396 of 2122)
PASS: lldb-api :: lang/cpp/lambdas/TestLambdas.py (1397 of 2122)
PASS: lldb-shell :: SymbolFile/DWARF/compilercontext.ll (1398 of 2122)
PASS: lldb-unit :: UnwindAssembly/x86/./UnwindAssemblyx86Tests/Testx86AssemblyInspectionEngine.TestStackRealign32BitDisp_x86_64 (1399 of 2122)
UNSUPPORTED: lldb-shell :: SymbolFile/PDB/pointers.test (1400 of 2122)
PASS: lldb-shell :: ObjectFile/ELF/aarch64-relocations.yaml (1401 of 2122)
PASS: lldb-api :: functionalities/tsan/basic/TestTsanBasic.py (1402 of 2122)
PASS: lldb-unit :: Utility/./UtilityTests/UriParserTest.TypicalPortPathIPv4 (1403 of 2122)
PASS: lldb-shell :: ObjectFile/ELF/minidebuginfo-corrupt-xz.yaml (1404 of 2122)
PASS: lldb-api :: lang/cpp/thread_local/TestThreadLocal.py (1405 of 2122)
PASS: lldb-unit :: Expression/./ExpressionTests/CppModuleConfigurationTest.LibCppV2 (1406 of 2122)
PASS: lldb-unit :: Symbol/./SymbolTests/TestClangASTImporter.CopyDeclTagDecl (1407 of 2122)
PASS: lldb-unit :: debugserver/./debugserverTests/RNBSocket.LoopBackListenIPv6 (1408 of 2122)
PASS: lldb-unit :: ObjectFile/PECOFF/./ObjectFilePECOFFTests/PECallFrameInfoTest.Frame_reg_eh (1409 of 2122)
PASS: lldb-unit :: Utility/./UtilityTests/SerializationRountripTest.SerializeDeserializeCStringArrayNullptr (1410 of 2122)
PASS: lldb-unit :: Utility/./UtilityTests/NameMatchesTest.Equals (1411 of 2122)
PASS: lldb-api :: tools/lldb-server/commandline/TestStubReverseConnect.py (1412 of 2122)
PASS: lldb-unit :: Utility/./UtilityTests/LogChannelTest.Enable (1413 of 2122)
PASS: lldb-api :: functionalities/breakpoint/scripted_bkpt/TestScriptedResolver.py (1414 of 2122)
PASS: lldb-unit :: Utility/./UtilityTests/UriParserTest.SchemeHostSeparator3 (1415 of 2122)
PASS: lldb-api :: functionalities/data-formatter/data-formatter-caching/TestDataFormatterCaching.py (1416 of 2122)
PASS: lldb-shell :: ObjectFile/wasm/unified-debug-sections.yaml (1417 of 2122)
PASS: lldb-api :: python_api/interpreter/TestCommandInterpreterAPI.py (1418 of 2122)
PASS: lldb-api :: lang/objc/objc-struct-return/TestObjCStructReturn.py (1419 of 2122)
PASS: lldb-api :: python_api/lldbutil/frame/TestFrameUtils.py (1420 of 2122)
PASS: lldb-api :: commands/target/modules/search-paths/insert/TestTargetModulesSearchpathsInsert.py (1421 of 2122)
PASS: lldb-api :: macosx/find-app-in-bundle/TestFindAppInBundle.py (1422 of 2122)
PASS: lldb-api :: lang/c/modules/TestCModules.py (1423 of 2122)
PASS: lldb-api :: macosx/load-kext/TestLoadKext.py (1424 of 2122)
PASS: lldb-unit :: Utility/./UtilityTests/FileSpecTest.FormatFileSpec (1425 of 2122)
PASS: lldb-shell :: Breakpoint/dummy-target.test (1426 of 2122)
PASS: lldb-unit :: Utility/./UtilityTests/AnsiTerminal.Twice (1427 of 2122)
UNSUPPORTED: lldb-api :: functionalities/darwin_log/filter/regex/subsystem/TestDarwinLogFilterRegexSubsystem.py (1428 of 2122)
PASS: lldb-unit :: Utility/./UtilityTests/CompletionRequest.TryCompleteCurrentArgGood (1429 of 2122)
PASS: lldb-api :: macosx/universal/TestUniversal.py (1430 of 2122)
PASS: lldb-unit :: ScriptInterpreter/Python/./ScriptInterpreterPythonTests/PythonDataObjectsTest.TestPythonString (1431 of 2122)
PASS: lldb-unit :: SymbolFile/NativePDB/./SymbolFileNativePDBTests/PDBFPOProgramToDWARFExpressionTests.UnsupportedRASearch (1432 of 2122)
PASS: lldb-unit :: Utility/./UtilityTests/StringExtractorTest.GetHexBytes_OddPair (1433 of 2122)
PASS: lldb-shell :: Reproducer/TestSynchronous.test (1434 of 2122)
PASS: lldb-api :: functionalities/load_using_paths/TestLoadUsingPaths.py (1435 of 2122)
PASS: lldb-unit :: UnwindAssembly/x86/./UnwindAssemblyx86Tests/Testx86AssemblyInspectionEngine.TestPushRBPWithREX (1436 of 2122)
PASS: lldb-api :: lang/cpp/this_class_type_mixing/TestThisClassTypeMixing.py (1437 of 2122)
PASS: lldb-unit :: Process/minidump/./LLDBMinidumpTests/MinidumpParserTest.GetMemoryRegionInfoFromMemoryList (1438 of 2122)
PASS: lldb-unit :: Utility/./UtilityTests/RecordReplayTest.InstrumentedBarPtr (1439 of 2122)
PASS: lldb-api :: commands/expression/issue_11588/Test11588.py (1440 of 2122)
PASS: lldb-unit :: Utility/./UtilityTests/ArgsTest.TestMultipleArgs (1441 of 2122)
PASS: lldb-shell :: SymbolFile/DWARF/dir-separator-no-comp-dir-relative-name.s (1442 of 2122)
PASS: lldb-unit :: Utility/./UtilityTests/StringLexerTest.PutBack (1443 of 2122)
PASS: lldb-unit :: Utility/./UtilityTests/ReproducerTest.SetCapture (1444 of 2122)
PASS: lldb-unit :: Utility/./UtilityTests/RangeTest.EqualInvalid (1445 of 2122)
PASS: lldb-unit :: Utility/./UtilityTests/StreamTest.PutCharWhitespace (1446 of 2122)
PASS: lldb-api :: lang/cpp/modules-import/TestCXXModulesImport.py (1447 of 2122)
PASS: lldb-shell :: ObjectFile/ELF/PT_LOAD-empty.yaml (1448 of 2122)
PASS: lldb-unit :: Utility/./UtilityTests/ScalarTest.Division (1449 of 2122)
PASS: lldb-unit :: Utility/./UtilityTests/IndexToObjectTest.ObjectForIndex (1450 of 2122)
PASS: lldb-api :: lang/objc/foundation/TestObjCMethods.py (1451 of 2122)
PASS: lldb-unit :: Utility/./UtilityTests/StringListTest.RemoveBlankLines (1452 of 2122)
PASS: lldb-shell :: SymbolFile/Breakpad/stack-cfi-arm.yaml (1453 of 2122)
PASS: lldb-shell :: Settings/TestFrameFormatMangling.test (1454 of 2122)
PASS: lldb-api :: types/TestFloatTypesExpr.py (1455 of 2122)
PASS: lldb-unit :: Language/Highlighting/./HighlighterTests/HighlighterTest.ClangTrailingBackslashWithWhitespace (1456 of 2122)
PASS: lldb-unit :: Utility/./UtilityTests/ScalarTest.RightShiftOperator (1457 of 2122)
PASS: lldb-api :: lang/c/find_struct_type/TestFindStructTypes.py (1458 of 2122)
PASS: lldb-unit :: SymbolFile/NativePDB/./SymbolFileNativePDBTests/PDBFPOProgramToDWARFExpressionTests.MultipleDependentAssignments (1459 of 2122)
PASS: lldb-unit :: Utility/./UtilityTests/StreamTest.PutHex8 (1460 of 2122)
PASS: lldb-unit :: Utility/./UtilityTests/StringListTest.GetSize (1461 of 2122)
PASS: lldb-unit :: Utility/./UtilityTests/StringListTest.AppendStringStdString (1462 of 2122)
PASS: lldb-api :: functionalities/tail_call_frames/cross_dso/TestCrossDSOTailCalls.py (1463 of 2122)
PASS: lldb-unit :: Utility/./UtilityTests/BinaryStreamTest.PutULEB128TwoBytes (1464 of 2122)
PASS: lldb-api :: functionalities/ptr_refs/TestPtrRefs.py (1465 of 2122)
PASS: lldb-api :: functionalities/postmortem/minidump-new/TestMiniDumpNew.py (1466 of 2122)
PASS: lldb-api :: commands/expression/import-std-module/vector/TestVectorFromStdModule.py (1467 of 2122)
PASS: lldb-api :: commands/expression/expr-in-syscall/TestExpressionInSyscall.py (1468 of 2122)
UNSUPPORTED: lldb-api :: functionalities/data-formatter/data-formatter-stl/libstdcpp/unique_ptr/TestDataFormatterStdUniquePtr.py (1469 of 2122)
PASS: lldb-api :: python_api/process/TestProcessAPI.py (1470 of 2122)
PASS: lldb-unit :: Utility/./UtilityTests/ConstStringTest.CompareConstString (1471 of 2122)
PASS: lldb-unit :: Utility/./UtilityTests/BinaryStreamTest.PutSLEB128SixBytes (1472 of 2122)
PASS: lldb-unit :: Utility/./UtilityTests/GeneratorTest.YamlMultiProvider (1473 of 2122)
PASS: lldb-unit :: Utility/./UtilityTests/UriParserTest.PortOverflow (1474 of 2122)
PASS: lldb-api :: commands/platform/basic/TestPlatformCommand.py (1475 of 2122)
PASS: lldb-unit :: Utility/./UtilityTests/StreamTest.AddressSuffix (1476 of 2122)
PASS: lldb-shell :: SymbolFile/DWARF/DW_TAG_variable-DW_AT_const_value.s (1477 of 2122)
PASS: lldb-unit :: Utility/./UtilityTests/ProcessInstanceInfo.DumpTable_invalidUID (1478 of 2122)
PASS: lldb-shell :: ObjectFile/Breakpad/sections.test (1479 of 2122)
PASS: lldb-shell :: SymbolFile/NativePDB/function-types-builtins.cpp (1480 of 2122)
PASS: lldb-unit :: Utility/./UtilityTests/StringListTest.AppendListCStringArrayEmpty (1481 of 2122)
PASS: lldb-api :: python_api/frame/inlines/TestInlinedFrame.py (1482 of 2122)
PASS: lldb-api :: functionalities/breakpoint/auto_continue/TestBreakpointAutoContinue.py (1483 of 2122)
PASS: lldb-unit :: Utility/./UtilityTests/BinaryStreamTest.PutULEB128Zero (1484 of 2122)
PASS: lldb-api :: functionalities/tsan/global_location/TestTsanGlobalLocation.py (1485 of 2122)
PASS: lldb-unit :: Target/./TargetTests/PathMappingListTest.AbsoluteTests (1486 of 2122)
PASS: lldb-unit :: UnwindAssembly/x86/./UnwindAssemblyx86Tests/Testx86AssemblyInspectionEngine.TestAddRSP (1487 of 2122)
PASS: lldb-unit :: Utility/./UtilityTests/RangeTest.Union (1488 of 2122)
PASS: lldb-api :: functionalities/data-formatter/data-formatter-ptr-to-array/TestPtrToArrayFormatting.py (1489 of 2122)
PASS: lldb-api :: lang/objc/bitfield_ivars/TestBitfieldIvars.py (1490 of 2122)
UNSUPPORTED: lldb-api :: lang/c/typedef/Testtypedef.py (1491 of 2122)
PASS: lldb-shell :: SymbolFile/Breakpad/symtab.test (1492 of 2122)
PASS: lldb-api :: tools/lldb-vscode/launch/TestVSCode_launch.py (1493 of 2122)
PASS: lldb-unit :: Utility/./UtilityTests/ArchSpecTest.YAML (1494 of 2122)
PASS: lldb-unit :: DataFormatter/./LLDBFormatterTests/TypeMatcherTests.ExactName (1495 of 2122)
UNSUPPORTED: lldb-api :: commands/register/register/intel_xtended_registers/mpx_offset_intersection/TestMPXOffsetIntersection.py (1496 of 2122)
PASS: lldb-unit :: Utility/./UtilityTests/RangeTest.Constructor (1497 of 2122)
PASS: lldb-unit :: Utility/./UtilityTests/RecordReplayTest.InstrumentedFooSameThis (1498 of 2122)
PASS: lldb-api :: functionalities/breakpoint/hardware_breakpoints/require_hw_breakpoints/TestRequireHWBreakpoints.py (1499 of 2122)
PASS: lldb-unit :: Utility/./UtilityTests/StreamTest.AddressRangeSize (1500 of 2122)
PASS: lldb-unit :: UnwindAssembly/x86/./UnwindAssemblyx86Tests/Testx86AssemblyInspectionEngine.TestPushR15 (1501 of 2122)
PASS: lldb-api :: functionalities/data-formatter/vector-types/TestVectorTypesFormatting.py (1502 of 2122)
PASS: lldb-shell :: ObjectFile/PECOFF/uuid.yaml (1503 of 2122)
PASS: lldb-api :: commands/expression/no-deadlock/TestExprDoesntBlock.py (1504 of 2122)
PASS: lldb-api :: lang/cpp/this/TestCPPThis.py (1505 of 2122)
PASS: lldb-api :: macosx/order/TestOrderFile.py (1506 of 2122)
PASS: lldb-unit :: Utility/./UtilityTests/ScalarTest.Scalar_512 (1507 of 2122)
PASS: lldb-unit :: Utility/./UtilityTests/VMRange.Reset (1508 of 2122)
PASS: lldb-api :: lang/cpp/nested-class-other-compilation-unit/TestNestedClassWithParentInAnotherCU.py (1509 of 2122)
PASS: lldb-api :: lang/objc/rdar-10967107/TestRdar10967107.py (1510 of 2122)
PASS: lldb-api :: functionalities/thread/concurrent_events/TestConcurrentWatchpointWithDelayWatchpointThreads.py (1511 of 2122)
PASS: lldb-shell :: Quit/TestQuitExitCodeTooManyArgs.test (1512 of 2122)
UNSUPPORTED: lldb-api :: commands/target/auto-install-main-executable/TestAutoInstallMainExecutable.py (1513 of 2122)
PASS: lldb-unit :: DataFormatter/./LLDBFormatterTests/StringPrinterTests.SwiftUTF8 (1514 of 2122)
PASS: lldb-api :: python_api/process/io/TestProcessIO.py (1515 of 2122)
PASS: lldb-api :: types/TestFloatTypes.py (1516 of 2122)
PASS: lldb-unit :: Expression/./ExpressionTests/DiagnosticManagerTest.AppendMessageSubsequentDiags (1517 of 2122)
PASS: lldb-unit :: Utility/./UtilityTests/ArgsTest.Yaml (1518 of 2122)
PASS: lldb-unit :: Utility/./UtilityTests/BinaryStreamTest.PutSLEB128EightBytes (1519 of 2122)
PASS: lldb-api :: functionalities/thread/jump/TestThreadJump.py (1520 of 2122)
PASS: lldb-unit :: Utility/./UtilityTests/StringListTest.JoinEmpty (1521 of 2122)
PASS: lldb-unit :: Utility/./UtilityTests/ArgsTest.TestQuotedTrailingBackslash (1522 of 2122)
PASS: lldb-unit :: Utility/./UtilityTests/ArchSpecTest.TestParseMachCPUDashSubtypeTripleExtra (1523 of 2122)
PASS: lldb-unit :: ScriptInterpreter/Python/./ScriptInterpreterPythonTests/PythonDataObjectsTest.TestRun (1524 of 2122)
PASS: lldb-unit :: Utility/./UtilityTests/StringListTest.GetMaxStringLengthEmpty (1525 of 2122)
PASS: lldb-unit :: Utility/./UtilityTests/StreamTest.PutRawBytesToLittleEndian (1526 of 2122)
PASS: lldb-unit :: Language/Highlighting/./HighlighterTests/HighlighterTest.ClangCommas (1527 of 2122)
UNSUPPORTED: lldb-api :: tools/lldb-server/platform-process-connect/TestPlatformProcessConnect.py (1528 of 2122)
UNSUPPORTED: lldb-shell :: SymbolFile/PDB/variables.test (1529 of 2122)
UNSUPPORTED: lldb-api :: functionalities/thread/state/TestThreadStates.py (1530 of 2122)
PASS: lldb-api :: lang/objc/modules-inline-functions/TestModulesInlineFunctions.py (1531 of 2122)
PASS: lldb-unit :: Utility/./UtilityTests/ProcessInstanceInfo.Yaml (1532 of 2122)
PASS: lldb-unit :: SymbolFile/NativePDB/./SymbolFileNativePDBTests/PDBFPOProgramToDWARFExpressionTests.MissingTargetRegister (1533 of 2122)
PASS: lldb-api :: commands/expression/test/TestExprs.py (1534 of 2122)
PASS: lldb-unit :: Utility/./UtilityTests/ArgsTest.TestSingleQuotedArgWithSpace (1535 of 2122)
UNSUPPORTED: lldb-api :: functionalities/signal/handle-segv/TestHandleSegv.py (1536 of 2122)
PASS: lldb-unit :: Utility/./UtilityTests/UriParserTest.BracketedHostnamePort (1537 of 2122)
PASS: lldb-shell :: Breakpoint/case-sensitive.test (1538 of 2122)
PASS: lldb-unit :: Utility/./UtilityTests/ScalarTest.CastOperations (1539 of 2122)
PASS: lldb-shell :: Register/x86-64-read.test (1540 of 2122)
PASS: lldb-api :: commands/expression/ignore-artificial-constructors/TestIgnoreArtificialConstructors.py (1541 of 2122)
PASS: lldb-unit :: UnwindAssembly/x86/./UnwindAssemblyx86Tests/Testx86AssemblyInspectionEngine.TestSpillRegToStackViaMOVx86_64 (1542 of 2122)
PASS: lldb-api :: functionalities/data-formatter/nsdictionarysynth/TestNSDictionarySynthetic.py (1543 of 2122)
PASS: lldb-api :: lang/cpp/stl/TestSTL.py (1544 of 2122)
PASS: lldb-api :: commands/expression/multiline-completion/TestMultilineCompletion.py (1545 of 2122)
PASS: lldb-api :: functionalities/data-formatter/data-formatter-objc/TestDataFormatterObjCKVO.py (1546 of 2122)
PASS: lldb-api :: commands/log/basic/TestLogging.py (1547 of 2122)
PASS: lldb-unit :: Utility/./UtilityTests/UriParserTest.SchemeHostSeparator (1548 of 2122)
PASS: lldb-unit :: Expression/./ExpressionTests/ClangHostTest.MacOSX (1549 of 2122)
PASS: lldb-unit :: Utility/./UtilityTests/BinaryStreamTest.PutSLEB128Zero (1550 of 2122)
PASS: lldb-shell :: Heap/heap-cstr.test (1551 of 2122)
PASS: lldb-unit :: Utility/./UtilityTests/StringListTest.Assignment (1552 of 2122)
PASS: lldb-api :: functionalities/data-formatter/data-formatter-stl/libcxx/vbool/TestDataFormatterLibcxxVBool.py (1553 of 2122)
PASS: lldb-api :: macosx/indirect_symbol/TestIndirectSymbols.py (1554 of 2122)
UNSUPPORTED: lldb-shell :: SymbolFile/PDB/function-level-linking.test (1555 of 2122)
PASS: lldb-unit :: DataFormatter/./LLDBFormatterTests/StringPrinterTests.CxxUTF8 (1556 of 2122)
PASS: lldb-api :: lang/c/tls_globals/TestTlsGlobals.py (1557 of 2122)
PASS: lldb-api :: lang/c/local_variables/TestLocalVariables.py (1558 of 2122)
PASS: lldb-api :: functionalities/data-formatter/data-formatter-cpp/TestDataFormatterCpp.py (1559 of 2122)
PASS: lldb-api :: lang/cpp/trivial_abi/TestTrivialABI.py (1560 of 2122)
PASS: lldb-api :: iohandler/autosuggestion/TestAutosuggestion.py (1561 of 2122)
UNSUPPORTED: lldb-shell :: SymbolFile/PDB/vbases.test (1562 of 2122)
PASS: lldb-unit :: Language/Highlighting/./HighlighterTests/HighlighterTest.ClangPPDirectives (1563 of 2122)
PASS: lldb-unit :: Utility/./UtilityTests/SubsystemRAIITest.SubsystemWithErrorFailure (1564 of 2122)
PASS: lldb-unit :: Utility/./UtilityTests/StreamTest.PutBytesAsRawHex8ToLittleEndian (1565 of 2122)
PASS: lldb-unit :: Interpreter/./InterpreterTests/OptionArgParserTest.toScriptLanguage (1566 of 2122)
PASS: lldb-api :: types/TestDoubleTypesExpr.py (1567 of 2122)
PASS: lldb-api :: functionalities/thread/exit_during_expression/TestExitDuringExpression.py (1568 of 2122)
PASS: lldb-api :: functionalities/reproducers/attach/TestReproducerAttach.py (1569 of 2122)
PASS: lldb-shell :: SymbolFile/DWARF/dwp.s (1570 of 2122)
PASS: lldb-api :: commands/expression/unwind_expression/TestUnwindExpression.py (1571 of 2122)
PASS: lldb-unit :: Process/gdb-remote/./ProcessGdbRemoteTests/GDBRemoteCommunicationClientTest.GetModulesInfo (1572 of 2122)
PASS: lldb-unit :: ScriptInterpreter/Python/./ScriptInterpreterPythonTests/PythonDataObjectsTest.TestPythonDictionaryManipulation (1573 of 2122)
PASS: lldb-unit :: DataFormatter/./LLDBFormatterTests/TypeMatcherTests.RegexMatchPart (1574 of 2122)
PASS: lldb-api :: commands/expression/context-object-objc/TestContextObjectObjc.py (1575 of 2122)
PASS: lldb-unit :: Process/gdb-remote/./ProcessGdbRemoteTests/GDBRemoteCommunicationClientTest.SyncThreadState (1576 of 2122)
PASS: lldb-unit :: Utility/./UtilityTests/StringListTest.JoinThree (1577 of 2122)
PASS: lldb-shell :: Minidump/fb-dump.test (1578 of 2122)
UNSUPPORTED: lldb-api :: functionalities/data-formatter/data-formatter-stl/libstdcpp/vbool/TestDataFormatterStdVBool.py (1579 of 2122)
PASS: lldb-unit :: Utility/./UtilityTests/StringExtractorTest.GetHexU8_Underflow (1580 of 2122)
PASS: lldb-unit :: ScriptInterpreter/Python/./ScriptInterpreterPythonTests/PythonDataObjectsTest.TestPythonListManipulation (1581 of 2122)
PASS: lldb-unit :: Utility/./UtilityTests/Flags.IsClear (1582 of 2122)
PASS: lldb-api :: functionalities/object-file/TestImageListMultiArchitecture.py (1583 of 2122)
PASS: lldb-unit :: Language/CPlusPlus/./LanguageCPlusPlusTests/CPlusPlusLanguage.FindAlternateFunctionManglings (1584 of 2122)
PASS: lldb-api :: functionalities/avoids-fd-leak/TestFdLeak.py (1585 of 2122)
PASS: lldb-api :: lang/objc/orderedset/TestOrderedSet.py (1586 of 2122)
UNSUPPORTED: lldb-api :: tools/lldb-server/registers-target-xml-reading/TestGdbRemoteTargetXmlPacket.py (1587 of 2122)
PASS: lldb-api :: tools/lldb-server/TestGdbRemoteThreadsInStopReply.py (1588 of 2122)
PASS: lldb-shell :: SymbolFile/Breakpad/unwind-via-stack-win-no-memory-info.yaml (1589 of 2122)
PASS: lldb-api :: macosx/function-starts/TestFunctionStarts.py (1590 of 2122)
PASS: lldb-unit :: Host/./HostTests/SocketTest.DomainListenConnectAccept (1591 of 2122)
PASS: lldb-unit :: Utility/./UtilityTests/StreamTest.PutSLEB128 (1592 of 2122)
PASS: lldb-api :: commands/expression/rdar42038760/TestScalarURem.py (1593 of 2122)
PASS: lldb-api :: lang/c/vla/TestVLA.py (1594 of 2122)
PASS: lldb-api :: types/TestRecursiveTypes.py (1595 of 2122)
PASS: lldb-unit :: UnwindAssembly/x86/./UnwindAssemblyx86Tests/Testx86AssemblyInspectionEngine.TestPushImm (1596 of 2122)
PASS: lldb-shell :: SymbolFile/NativePDB/locate-pdb.cpp (1597 of 2122)
PASS: lldb-unit :: Utility/./UtilityTests/UriParserTest.Minimal (1598 of 2122)
PASS: lldb-unit :: Utility/./UtilityTests/StringLexerTest.HasAtLeast (1599 of 2122)
PASS: lldb-unit :: Symbol/./SymbolTests/SymbolsTest.LocateExecutableSymbolFileForUnknownExecutableAndMissingSymbolFile (1600 of 2122)
PASS: lldb-unit :: ObjectFile/Breakpad/./ObjectFileBreakpadTests/FileRecord.parse (1601 of 2122)
UNSUPPORTED: lldb-api :: lang/objc/rdar-12408181/TestRdar12408181.py (1602 of 2122)
PASS: lldb-api :: functionalities/data-formatter/array_typedef/TestArrayTypedef.py (1603 of 2122)
PASS: lldb-api :: lang/cpp/alignas_base_class/TestAlignAsBaseClass.py (1604 of 2122)
PASS: lldb-api :: functionalities/data-formatter/data-formatter-stl/libcxx/list/loop/TestDataFormatterLibcxxListLoop.py (1605 of 2122)
PASS: lldb-api :: python_api/thread/TestThreadAPI.py (1606 of 2122)
PASS: lldb-api :: functionalities/data-formatter/data-formatter-proper-plurals/TestFormattersOneIsSingular.py (1607 of 2122)
PASS: lldb-unit :: Utility/./UtilityTests/OptionsWithRawTest.ArgsButNoDelimiter (1608 of 2122)
PASS: lldb-unit :: SymbolFile/NativePDB/./SymbolFileNativePDBTests/PDBFPOProgramToDWARFExpressionTests.MultipleIndependentAssignments (1609 of 2122)
PASS: lldb-unit :: Language/Highlighting/./HighlighterTests/HighlighterTest.ClangComments (1610 of 2122)
PASS: lldb-unit :: Process/gdb-remote/./ProcessGdbRemoteTests/GDBRemoteClientBaseTest.SendContinueAndAsyncPacket (1611 of 2122)
PASS: lldb-unit :: ScriptInterpreter/Python/./ScriptInterpreterPythonTests/PythonDataObjectsTest.TestPythonTupleValues (1612 of 2122)
PASS: lldb-api :: types/TestCharType.py (1613 of 2122)
PASS: lldb-shell :: ScriptInterpreter/Python/eof.test (1614 of 2122)
PASS: lldb-unit :: ScriptInterpreter/Python/./ScriptInterpreterPythonTests/PythonDataObjectsTest.TestPythonDictionaryValueEquality (1615 of 2122)
PASS: lldb-api :: lang/cpp/wchar_t/TestCxxWCharT.py (1616 of 2122)
PASS: lldb-unit :: Process/gdb-remote/./ProcessGdbRemoteTests/GDBRemoteCommunicationTest.ReadPacket_checksum (1617 of 2122)
PASS: lldb-api :: functionalities/archives/TestBSDArchives.py (1618 of 2122)
PASS: lldb-api :: commands/expression/radar_8638051/Test8638051.py (1619 of 2122)
PASS: lldb-unit :: Utility/./UtilityTests/StringListTest.ShiftMove (1620 of 2122)
PASS: lldb-unit :: Utility/./UtilityTests/AnsiTerminal.Empty (1621 of 2122)
PASS: lldb-unit :: Language/CPlusPlus/./LanguageCPlusPlusTests/CPlusPlusLanguage.CPlusPlusNameParser (1622 of 2122)
PASS: lldb-api :: lang/cpp/overloaded-functions/TestOverloadedFunctions.py (1623 of 2122)
PASS: lldb-api :: functionalities/thread/concurrent_events/TestConcurrentDelayWatchBreak.py (1624 of 2122)
PASS: lldb-unit :: Target/./TargetTests/MCBasedABI.MapRegisterName (1625 of 2122)
PASS: lldb-unit :: DataFormatter/./LLDBFormatterTests/TypeMatcherTests.RegexName (1626 of 2122)
PASS: lldb-unit :: Utility/./UtilityTests/ScalarTest.APIntConstructor (1627 of 2122)
PASS: lldb-unit :: ObjectFile/PECOFF/./ObjectFilePECOFFTests/PECallFrameInfoTest.Chained_eh (1628 of 2122)
PASS: lldb-unit :: Utility/./UtilityTests/StringListTest.AppendListCStringArray (1629 of 2122)
PASS: lldb-unit :: Utility/./UtilityTests/NameMatchesTest.RegularExpression (1630 of 2122)
UNSUPPORTED: lldb-shell :: Register/x86-zmm-write.test (1631 of 2122)
PASS: lldb-api :: functionalities/data-formatter/data-formatter-objc/TestDataFormatterObjNSException.py (1632 of 2122)
PASS: lldb-api :: functionalities/data-formatter/data-formatter-smart-array/TestDataFormatterSmartArray.py (1633 of 2122)
PASS: lldb-api :: iohandler/unicode/TestUnicode.py (1634 of 2122)
PASS: lldb-unit :: Target/./TargetTests/ModuleCacheTest.GetAndPut (1635 of 2122)
PASS: lldb-shell :: SymbolFile/DWARF/debug-names-compressed.cpp (1636 of 2122)
PASS: lldb-api :: terminal/TestSTTYBeforeAndAfter.py (1637 of 2122)
PASS: lldb-unit :: Process/gdb-remote/./ProcessGdbRemoteTests/GDBRemoteCommunicationClientTest.SendStopTracePacket (1638 of 2122)
PASS: lldb-api :: commands/platform/process/list/TestProcessList.py (1639 of 2122)
PASS: lldb-api :: functionalities/data-formatter/data-formatter-globals/TestDataFormatterGlobals.py (1640 of 2122)
PASS: lldb-unit :: Utility/./UtilityTests/StreamTeeTest.CopyConstructor (1641 of 2122)
PASS: lldb-api :: commands/watchpoints/watchpoint_commands/command/TestWatchpointCommandLLDB.py (1642 of 2122)
PASS: lldb-api :: functionalities/data-formatter/dump_dynamic/TestDumpDynamic.py (1643 of 2122)
PASS: lldb-api :: functionalities/data-formatter/data-formatter-stl/libcxx/map/TestDataFormatterLibccMap.py (1644 of 2122)
PASS: lldb-api :: python_api/frame/TestFrames.py (1645 of 2122)
PASS: lldb-api :: commands/platform/file/close/TestPlatformFileClose.py (1646 of 2122)
PASS: lldb-unit :: Utility/./UtilityTests/StreamTeeTest.AppendStream (1647 of 2122)
UNSUPPORTED: lldb-api :: linux/sepdebugsymlink/TestTargetSymbolsSepDebugSymlink.py (1648 of 2122)
PASS: lldb-unit :: ObjectFile/Breakpad/./ObjectFileBreakpadTests/FuncRecord.parse (1649 of 2122)
PASS: lldb-api :: python_api/breakpoint/TestBreakpointAPI.py (1650 of 2122)
PASS: lldb-shell :: SymbolFile/DWARF/childless-compile-unit.s (1651 of 2122)
PASS: lldb-unit :: Host/./HostTests/SocketTest.UDPGetConnectURI (1652 of 2122)
PASS: lldb-unit :: Utility/./UtilityTests/ScalarTest.ComparisonFloat (1653 of 2122)
PASS: lldb-unit :: Utility/./UtilityTests/RangeTest.ContainsEndInclusiveInvalid (1654 of 2122)
PASS: lldb-unit :: Utility/./UtilityTests/BinaryStreamTest.PutULEB128OneByte (1655 of 2122)
PASS: lldb-api :: lang/objc/foundation/TestObjCMethodsString.py (1656 of 2122)
PASS: lldb-api :: functionalities/optimized_code/TestNoASanExceptionAfterEvalOP_piece.py (1657 of 2122)
PASS: lldb-api :: commands/expression/import-std-module/conflicts/TestStdModuleWithConflicts.py (1658 of 2122)
PASS: lldb-api :: lang/objc/objc-foundation-dictionary-empty/TestNSDictionary0.py (1659 of 2122)
PASS: lldb-api :: python_api/value/empty_class/TestValueAPIEmptyClass.py (1660 of 2122)
PASS: lldb-unit :: Symbol/./SymbolTests/TestClangASTImporter.CompleteFwdDeclWithOtherOrigin (1661 of 2122)
PASS: lldb-api :: sample_test/TestSampleInlineTest.py (1662 of 2122)
PASS: lldb-api :: functionalities/data-formatter/ostypeformatting/TestFormattersOsType.py (1663 of 2122)
PASS: lldb-shell :: ObjectFile/ELF/section-addresses.yaml (1664 of 2122)
PASS: lldb-unit :: Utility/./UtilityTests/ScalarTest.GetBytes (1665 of 2122)
PASS: lldb-api :: functionalities/data-formatter/data-formatter-stl/libcxx/multiset/TestDataFormatterLibcxxMultiSet.py (1666 of 2122)
PASS: lldb-shell :: SymbolFile/DWARF/find-basic-type.cpp (1667 of 2122)
PASS: lldb-api :: lang/objc/foundation/TestSymbolTable.py (1668 of 2122)
PASS: lldb-unit :: UnwindAssembly/x86/./UnwindAssemblyx86Tests/Testx86AssemblyInspectionEngine.TestPush0 (1669 of 2122)
PASS: lldb-unit :: SymbolFile/DWARF/./SymbolFileDWARFTests/DWARFASTParserClangTests.EnsureAllDIEsInDeclContextHaveBeenParsedParsesOnlyMatchingEntries (1670 of 2122)
PASS: lldb-api :: lang/cpp/member-and-local-vars-with-same-name/TestMembersAndLocalsWithSameName.py (1671 of 2122)
PASS: lldb-unit :: SymbolFile/NativePDB/./SymbolFileNativePDBTests/PDBFPOProgramToDWARFExpressionTests.UnresolvedRegisterReference (1672 of 2122)
PASS: lldb-api :: macosx/thread_suspend/TestInternalThreadSuspension.py (1673 of 2122)
PASS: lldb-unit :: Utility/./UtilityTests/TimeoutTest.Construction (1674 of 2122)
PASS: lldb-unit :: UnwindAssembly/x86/./UnwindAssemblyx86Tests/Testx86AssemblyInspectionEngine.TestPushECX (1675 of 2122)
PASS: lldb-shell :: Process/TestEnvironment.test (1676 of 2122)
PASS: lldb-unit :: Utility/./UtilityTests/DataExtractorTest.UncommonAddressSize (1677 of 2122)
PASS: lldb-unit :: Host/./HostTests/FileSystemTest.MakeAbsolute (1678 of 2122)
PASS: lldb-api :: functionalities/tail_call_frames/disambiguate_tail_call_seq/TestDisambiguateTailCallSeq.py (1679 of 2122)
PASS: lldb-unit :: Symbol/./SymbolTests/TestTypeSystemClang.TestUnifyAccessSpecifiers (1680 of 2122)
UNSUPPORTED: lldb-api :: commands/register/register/intel_xtended_registers/mpx_bound_violation/TestBoundViolation.py (1681 of 2122)
PASS: lldb-api :: commands/add-dsym/uuid/TestAddDsymCommand.py (1682 of 2122)
PASS: lldb-unit :: SymbolFile/DWARF/./SymbolFileDWARFTests/SymbolFileDWARFTests.TestAbbrevNullAttrValidForm (1683 of 2122)
PASS: lldb-unit :: Process/gdb-remote/./ProcessGdbRemoteTests/GDBRemoteCommunicationServerTest.SendErrorResponse_StringError (1684 of 2122)
PASS: lldb-api :: commands/gui/basic/TestGuiBasic.py (1685 of 2122)
UNSUPPORTED: lldb-api :: tools/lldb-server/libraries-svr4/TestGdbRemoteLibrariesSvr4Support.py (1686 of 2122)
PASS: lldb-unit :: Language/Highlighting/./HighlighterTests/HighlighterTest.ClangCursorPos (1687 of 2122)
PASS: lldb-api :: macosx/duplicate-archive-members/TestDuplicateMembers.py (1688 of 2122)
PASS: lldb-api :: python_api/watchpoint/condition/TestWatchpointConditionAPI.py (1689 of 2122)
PASS: lldb-unit :: Utility/./UtilityTests/StateTest.Formatv (1690 of 2122)
PASS: lldb-api :: functionalities/breakpoint/breakpoint_by_line_and_column/TestBreakpointByLineAndColumn.py (1691 of 2122)
PASS: lldb-unit :: Process/gdb-remote/./ProcessGdbRemoteTests/GDBRemoteCommunicationServerTest.SendErrorResponse_ErrorNumber (1692 of 2122)
PASS: lldb-unit :: Utility/./UtilityTests/StringExtractorTest.GetHexU8_Underflow_NoEof (1693 of 2122)
PASS: lldb-api :: commands/expression/import-std-module/basic/TestImportStdModule.py (1694 of 2122)
PASS: lldb-api :: functionalities/thread/backtrace_all/TestBacktraceAll.py (1695 of 2122)
PASS: lldb-shell :: Register/x86-64-gp-read.test (1696 of 2122)
PASS: lldb-unit :: SymbolFile/DWARF/./SymbolFileDWARFTests/SymbolFileDWARFTests.TestAbbrevMissingTerminator (1697 of 2122)
PASS: lldb-unit :: Utility/./UtilityTests/DataExtractorTest.GetDoubleUnaligned (1698 of 2122)
PASS: lldb-api :: python_api/debugger/TestDebuggerAPI.py (1699 of 2122)
PASS: lldb-unit :: Utility/./UtilityTests/PassiveReplayTest.InstrumentedBarPtr (1700 of 2122)
PASS: lldb-unit :: ScriptInterpreter/Python/./ScriptInterpreterPythonTests/PythonDataObjectsTest.TestScript (1701 of 2122)
PASS: lldb-unit :: Process/minidump/./LLDBMinidumpTests/MinidumpParserTest.InvalidMinidump (1702 of 2122)
PASS: lldb-api :: lang/c/offsetof/TestOffsetof.py (1703 of 2122)
PASS: lldb-api :: commands/frame/var-scope/TestFrameVariableScope.py (1704 of 2122)
UNSUPPORTED: lldb-shell :: BuildScript/toolchain-clang-cl.test (1705 of 2122)
UNSUPPORTED: lldb-api :: functionalities/data-formatter/data-formatter-stl/libstdcpp/string/TestDataFormatterStdString.py (1706 of 2122)
PASS: lldb-unit :: Language/Highlighting/./HighlighterTests/HighlighterTest.ClangSquareBrackets (1707 of 2122)
PASS: lldb-unit :: Utility/./UtilityTests/FileSpecTest.OperatorBool (1708 of 2122)
PASS: lldb-shell :: ScriptInterpreter/Python/sb_address_exception.test (1709 of 2122)
PASS: lldb-api :: linux/builtin_trap/TestBuiltinTrap.py (1710 of 2122)
PASS: lldb-shell :: SymbolFile/DWARF/debug_loc_and_loclists.s (1711 of 2122)
PASS: lldb-shell :: Settings/TestLineMarkerColor.test (1712 of 2122)
PASS: lldb-api :: lang/cpp/multiple-inheritance/TestCppMultipleInheritance.py (1713 of 2122)
PASS: lldb-unit :: Utility/./UtilityTests/RangeTest.ContainsRange (1714 of 2122)
PASS: lldb-unit :: Process/minidump/./LLDBMinidumpTests/MinidumpParserTest.MinidumpDuplicateModuleMinAddress (1715 of 2122)
PASS: lldb-api :: tools/lldb-vscode/variables/TestVSCode_variables.py (1716 of 2122)
PASS: lldb-unit :: Host/./HostTests/FileSystemTest.EmptyTest (1717 of 2122)
PASS: lldb-unit :: Utility/./UtilityTests/StringExtractorTest.GetU32BigEndian (1718 of 2122)
PASS: lldb-unit :: Process/minidump/./LLDBMinidumpTests/MinidumpParserTest.GetMiscInfoWindows (1719 of 2122)
PASS: lldb-unit :: Utility/./UtilityTests/RangeTest.SetRangeBase (1720 of 2122)
UNSUPPORTED: lldb-shell :: Register/aarch64-gp-read.test (1721 of 2122)
PASS: lldb-api :: commands/gui/viewlarge/TestGuiViewLarge.py (1722 of 2122)
PASS: lldb-api :: functionalities/breakpoint/comp_dir_symlink/TestCompDirSymLink.py (1723 of 2122)
PASS: lldb-unit :: Utility/./UtilityTests/RangeTest.DoesIntersect (1724 of 2122)
PASS: lldb-shell :: SymbolFile/DWARF/DW_AT_low_pc-addrx.s (1725 of 2122)
PASS: lldb-unit :: Utility/./UtilityTests/FileSpecTest.EqualDotsPosixRoot (1726 of 2122)
PASS: lldb-unit :: Process/gdb-remote/./ProcessGdbRemoteTests/GDBRemoteCommunicationClientTest.GetQOffsets (1727 of 2122)
PASS: lldb-unit :: Utility/./UtilityTests/StringListTest.SplitIntoLinesSingleTrailingCR (1728 of 2122)
PASS: lldb-api :: commands/expression/import-std-module/unique_ptr/TestUniquePtrFromStdModule.py (1729 of 2122)
PASS: lldb-api :: functionalities/data-formatter/data-formatter-stl/libcxx/vector/TestDataFormatterLibcxxVector.py (1730 of 2122)
PASS: lldb-api :: lang/cpp/incomplete-types/TestCppIncompleteTypes.py (1731 of 2122)
PASS: lldb-unit :: UnwindAssembly/ARM64/./Arm64InstEmulationTests/TestArm64InstEmulation.TestRegisterDoubleSpills (1732 of 2122)
PASS: lldb-api :: commands/expression/import-std-module/unique_ptr-dbg-info-content/TestUniquePtrDbgInfoContent.py (1733 of 2122)
PASS: lldb-unit :: Utility/./UtilityTests/RangeTest.Equal (1734 of 2122)
PASS: lldb-api :: python_api/sbplatform/TestSBPlatform.py (1735 of 2122)
PASS: lldb-unit :: DataFormatter/./LLDBFormatterTests/StringPrinterTests.CxxASCII (1736 of 2122)
PASS: lldb-api :: functionalities/gdb_remote_client/TestNestedRegDefinitions.py (1737 of 2122)
PASS: lldb-unit :: ObjectFile/Breakpad/./ObjectFileBreakpadTests/StackCFIRecord.parse (1738 of 2122)
PASS: lldb-unit :: Host/./HostTests/Host.GetEnvironment (1739 of 2122)
PASS: lldb-unit :: Utility/./UtilityTests/StringListTest.SplitIntoLinesEmpty (1740 of 2122)
PASS: lldb-unit :: Utility/./UtilityTests/ScalarTest.Getters (1741 of 2122)
PASS: lldb-unit :: Utility/./UtilityTests/FileSpecTest.GuessPathStyle (1742 of 2122)
PASS: lldb-shell :: SymbolFile/DWARF/dwarf5-partial-index.cpp (1743 of 2122)
PASS: lldb-unit :: Utility/./UtilityTests/EnvironmentTest.EnvpConversion (1744 of 2122)
PASS: lldb-unit :: Language/Highlighting/./HighlighterTests/HighlighterTest.ClangCursorPosInOtherToken (1745 of 2122)
PASS: lldb-unit :: Utility/./UtilityTests/StringListTest.JoinMultiCharSeparator (1746 of 2122)
PASS: lldb-api :: functionalities/thread/concurrent_events/TestConcurrentCrashWithWatchpoint.py (1747 of 2122)
PASS: lldb-unit :: ScriptInterpreter/Python/./ScriptInterpreterPythonTests/PythonDataObjectsTest.TestGlobalNameResolutionWithDot (1748 of 2122)
PASS: lldb-api :: lang/objc/foundation/TestFoundationDisassembly.py (1749 of 2122)
PASS: lldb-unit :: Utility/./UtilityTests/FileSpecTest.CopyByAppendingPathComponent (1750 of 2122)
PASS: lldb-api :: lang/cpp/llvm-style/TestLLVMStyle.py (1751 of 2122)
PASS: lldb-unit :: Utility/./UtilityTests/SerializationRountripTest.SerializeDeserializeCStringNull (1752 of 2122)
PASS: lldb-api :: commands/target/dump-symtab-demangle/TestDumpSymtabDemangle.py (1753 of 2122)
PASS: lldb-api :: lang/objc/objc-struct-argument/TestObjCStructArgument.py (1754 of 2122)
PASS: lldb-unit :: UnwindAssembly/x86/./UnwindAssemblyx86Tests/Testx86AssemblyInspectionEngine.TestLEAVE (1755 of 2122)
PASS: lldb-unit :: Utility/./UtilityTests/CompletionRequest.TestCompletionOwnership (1756 of 2122)
PASS: lldb-shell :: SymbolFile/NativePDB/function-types-classes.cpp (1757 of 2122)
PASS: lldb-api :: commands/expression/formatters/TestFormatters.py (1758 of 2122)
PASS: lldb-unit :: Utility/./UtilityTests/Flags.Test (1759 of 2122)
PASS: lldb-unit :: Utility/./UtilityTests/TimeoutTest.Format (1760 of 2122)
PASS: lldb-unit :: Utility/./UtilityTests/StreamTest.PutCString (1761 of 2122)
PASS: lldb-unit :: Core/./LLDBCoreTests/ModuleSpecTest.TestCOFFFile (1762 of 2122)
PASS: lldb-api :: commands/watchpoints/watchpoint_count/TestWatchpointCount.py (1763 of 2122)
PASS: lldb-api :: python_api/function_symbol/TestSymbolAPI.py (1764 of 2122)
PASS: lldb-unit :: ScriptInterpreter/Python/./ScriptInterpreterPythonTests/PythonDataObjectsTest.TestPythonListValueEquality (1765 of 2122)
PASS: lldb-unit :: Utility/./UtilityTests/ArgsTest.EscapeLLDBCommandArgument (1766 of 2122)
PASS: lldb-api :: python_api/sblaunchinfo/TestSBLaunchInfo.py (1767 of 2122)
PASS: lldb-shell :: ObjectFile/MachO/subsections.yaml (1768 of 2122)
PASS: lldb-api :: functionalities/breakpoint/move_nearest/TestMoveNearest.py (1769 of 2122)
PASS: lldb-api :: functionalities/pre_run_dylibs/TestPreRunDylibs.py (1770 of 2122)
PASS: lldb-unit :: Utility/./UtilityTests/StringExtractorTest.DecodeHexU8_Underflow (1771 of 2122)
PASS: lldb-unit :: Utility/./UtilityTests/ConstStringTest.NullAndEmptyStates (1772 of 2122)
PASS: lldb-api :: commands/expression/deleting-implicit-copy-constructor/TestDeletingImplicitCopyConstructor.py (1773 of 2122)
PASS: lldb-api :: functionalities/thread/concurrent_events/TestConcurrentSignalWatchBreak.py (1774 of 2122)
PASS: lldb-unit :: Host/./HostTests/FileSystemTest.GetByteSize (1775 of 2122)
PASS: lldb-unit :: Platform/./LLDBPlatformTests/PlatformAppleSimulatorTest.TestSimHasSimEnvionament (1776 of 2122)
PASS: lldb-unit :: Utility/./UtilityTests/StreamTest.PutCStringWithStringRef (1777 of 2122)
PASS: lldb-api :: commands/expression/entry-bp/TestExprEntryBP.py (1778 of 2122)
PASS: lldb-unit :: Utility/./UtilityTests/DataExtractorTest.GetMaxS64 (1779 of 2122)
PASS: lldb-api :: commands/expression/import-std-module/no-std-module/TestMissingStdModule.py (1780 of 2122)
PASS: lldb-unit :: UnwindAssembly/x86/./UnwindAssemblyx86Tests/Testx86AssemblyInspectionEngine.TestPopRBX (1781 of 2122)
PASS: lldb-unit :: SymbolFile/NativePDB/./SymbolFileNativePDBTests/PDBFPOProgramToDWARFExpressionTests.InvalidAssignmentSingle (1782 of 2122)
PASS: lldb-unit :: Utility/./UtilityTests/ReproducerTest.SetReplay (1783 of 2122)
PASS: lldb-unit :: Utility/./UtilityTests/Flags.Clear (1784 of 2122)
PASS: lldb-unit :: Core/./LLDBCoreTests/SourceFileCache.FindSourceFileNotFound (1785 of 2122)
PASS: lldb-api :: functionalities/breakpoint/source_regexp/TestSourceRegexBreakpoints.py (1786 of 2122)
PASS: lldb-shell :: Breakpoint/ppc64-localentry.test (1787 of 2122)
PASS: lldb-unit :: Process/gdb-remote/./ProcessGdbRemoteTests/GDBRemoteClientBaseTest.SendContinueAndWait (1788 of 2122)
PASS: lldb-api :: functionalities/thread/concurrent_events/TestConcurrentDelayedCrashWithBreakpointSignal.py (1789 of 2122)
PASS: lldb-unit :: Language/CPlusPlus/./LanguageCPlusPlusTests/CPlusPlusLanguage.MethodNameParsing (1790 of 2122)
PASS: lldb-api :: functionalities/inferior-crashing/recursive-inferior/TestRecursiveInferior.py (1791 of 2122)
PASS: lldb-unit :: Utility/./UtilityTests/StreamTeeTest.GetStreamAtIndexOutOfBoundsEmpty (1792 of 2122)
PASS: lldb-unit :: Utility/./UtilityTests/StringListTest.Clear (1793 of 2122)
PASS: lldb-unit :: Symbol/./SymbolTests/TestTypeSystemClang.TestRecordHasFields (1794 of 2122)
PASS: lldb-api :: commands/expression/import_base_class_when_class_has_derived_member/TestImportBaseClassWhenClassHasDerivedMember.py (1795 of 2122)
PASS: lldb-unit :: Utility/./UtilityTests/Flags.Reset (1796 of 2122)
PASS: lldb-unit :: ScriptInterpreter/Python/./ScriptInterpreterPythonTests/PythonDataObjectsTest.TestPythonInteger (1797 of 2122)
UNSUPPORTED: lldb-shell :: ExecControl/StopHook/stop-hook-threads.test (1798 of 2122)
UNSUPPORTED: lldb-shell :: Register/x86-64-zmm-write.test (1799 of 2122)
PASS: lldb-api :: functionalities/jitloader_gdb/TestJITLoaderGDB.py (1800 of 2122)
PASS: lldb-api :: functionalities/postmortem/elf-core/thread_crash/TestLinuxCoreThreads.py (1801 of 2122)
PASS: lldb-api :: functionalities/inline-stepping/TestInlineStepping.py (1802 of 2122)
PASS: lldb-unit :: Utility/./UtilityTests/TimerTest.CategoryTimes2 (1803 of 2122)
PASS: lldb-api :: commands/frame/diagnose/local-variable/TestLocalVariable.py (1804 of 2122)
PASS: lldb-api :: commands/apropos/basic/TestApropos.py (1805 of 2122)
PASS: lldb-api :: functionalities/dlopen_other_executable/TestDlopenOtherExecutable.py (1806 of 2122)
UNSUPPORTED: lldb-shell :: SymbolFile/PDB/typedefs.test (1807 of 2122)
PASS: lldb-api :: functionalities/data-formatter/builtin-formats/TestBuiltinFormats.py (1808 of 2122)
PASS: lldb-unit :: UnwindAssembly/x86/./UnwindAssemblyx86Tests/Testx86AssemblyInspectionEngine.TestSpillRegToStackViaMOVi386 (1809 of 2122)
PASS: lldb-unit :: UnwindAssembly/x86/./UnwindAssemblyx86Tests/Testx86AssemblyInspectionEngine.Test32bitFramelessSmallStackFrame (1810 of 2122)
UNSUPPORTED: lldb-shell :: Register/x86-64-ymm16-write.test (1811 of 2122)
PASS: lldb-unit :: Utility/./UtilityTests/DeserializerTest.HasData (1812 of 2122)
PASS: lldb-unit :: Expression/./ExpressionTests/CppModuleConfigurationTest.LinuxLocalLibCpp (1813 of 2122)
PASS: lldb-api :: functionalities/thread/backtrace_limit/TestBacktraceLimit.py (1814 of 2122)
PASS: lldb-unit :: Host/./HostTests/FileSystemTest.Resolve (1815 of 2122)
PASS: lldb-api :: functionalities/postmortem/elf-core/gcore/TestGCore.py (1816 of 2122)
PASS: lldb-api :: lang/cpp/dynamic-value/TestCppValueCast.py (1817 of 2122)
PASS: lldb-shell :: SymbolFile/DWARF/DW_TAG_basic_type_DW_ATE_UTF_nonC.ll (1818 of 2122)
PASS: lldb-shell :: SymbolFile/DWARF/module-ownership.mm (1819 of 2122)
PASS: lldb-shell :: SymbolFile/DWARF/clang-ast-from-dwarf-unamed-and-anon-structs.cpp (1820 of 2122)
PASS: lldb-api :: lang/cpp/frame-var-anon-unions/TestFrameVariableAnonymousUnions.py (1821 of 2122)
UNSUPPORTED: lldb-api :: functionalities/data-formatter/data-formatter-stl/libstdcpp/vector/TestDataFormatterStdVector.py (1822 of 2122)
PASS: lldb-unit :: UnwindAssembly/x86/./UnwindAssemblyx86Tests/Testx86AssemblyInspectionEngine.TestSubRSP (1823 of 2122)
PASS: lldb-shell :: Settings/TestDisableColor.test (1824 of 2122)
PASS: lldb-api :: types/TestLongTypesExpr.py (1825 of 2122)
PASS: lldb-api :: python_api/frame/get-variables/TestGetVariables.py (1826 of 2122)
PASS: lldb-shell :: ObjectFile/ELF/build-id-case.yaml (1827 of 2122)
PASS: lldb-unit :: Utility/./UtilityTests/CompletionRequest.TryCompleteCurrentArgBad (1828 of 2122)
PASS: lldb-unit :: Utility/./UtilityTests/CompletionRequest.ShiftArguments (1829 of 2122)
PASS: lldb-unit :: Host/./HostTests/FileActionTest.Open (1830 of 2122)
UNSUPPORTED: lldb-api :: lang/objc/objc-dynamic-value/TestObjCDynamicValue.py (1831 of 2122)
PASS: lldb-unit :: Utility/./UtilityTests/StringExtractorTest.GetHexU8_Exact_NoEof (1832 of 2122)
PASS: lldb-api :: functionalities/return-value/TestReturnValue.py (1833 of 2122)
PASS: lldb-unit :: Utility/./UtilityTests/StringListTest.DefaultConstructor (1834 of 2122)
PASS: lldb-api :: lang/objc/modules-auto-import/TestModulesAutoImport.py (1835 of 2122)
PASS: lldb-unit :: Utility/./UtilityTests/OptionsWithRawTest.EmptyArgsOnlySuffix (1836 of 2122)
UNSUPPORTED: lldb-api :: macosx/macCatalystAppMacOSFramework/TestMacCatalystAppWithMacOSFramework.py (1837 of 2122)
PASS: lldb-api :: lang/cpp/namespace/TestNamespace.py (1838 of 2122)
PASS: lldb-api :: functionalities/non-overlapping-index-variable-i/TestIndexVariable.py (1839 of 2122)
PASS: lldb-api :: lang/cpp/class_types/TestClassTypes.py (1840 of 2122)
PASS: lldb-api :: functionalities/inferior-assert/TestInferiorAssert.py (1841 of 2122)
PASS: lldb-api :: commands/platform/basic/TestPlatformPython.py (1842 of 2122)
PASS: lldb-unit :: Language/Highlighting/./HighlighterTests/HighlighterTest.ClangEmptyInput (1843 of 2122)
PASS: lldb-api :: functionalities/dead-strip/TestDeadStrip.py (1844 of 2122)
PASS: lldb-unit :: Editline/./EditlineTests/EditlineTestFixture.EditlineReceivesSingleLineText (1845 of 2122)
PASS: lldb-unit :: Utility/./UtilityTests/ScalarTest.TruncOrExtendTo (1846 of 2122)
PASS: lldb-unit :: Utility/./UtilityTests/TimerTest.CategoryTimesNested (1847 of 2122)
PASS: lldb-api :: functionalities/data-formatter/data-formatter-stl/libcxx/forward_list/TestDataFormatterLibcxxForwardList.py (1848 of 2122)
PASS: lldb-shell :: Driver/TestProcessAttach.test (1849 of 2122)
PASS: lldb-shell :: Minidump/Windows/find-module.test (1850 of 2122)
PASS: lldb-unit :: Utility/./UtilityTests/StreamTest.PutCharNull (1851 of 2122)
PASS: lldb-unit :: debugserver/./debugserverTests/RNBSocket.AnyListen (1852 of 2122)
PASS: lldb-unit :: UnwindAssembly/x86/./UnwindAssemblyx86Tests/Testx86AssemblyInspectionEngine.Testi386IgnoredRegisters (1853 of 2122)
PASS: lldb-unit :: Utility/./UtilityTests/StreamTest.PutHex32ByteOrderLittle (1854 of 2122)
PASS: lldb-api :: lang/c/forward/TestForwardDeclaration.py (1855 of 2122)
PASS: lldb-unit :: Symbol/./SymbolTests/TestClangASTImporter.RecordLayout (1856 of 2122)
UNSUPPORTED: lldb-api :: lang/cpp/function-template-parameter-pack/TestFunctionTemplateParameterPack.py (1857 of 2122)
PASS: lldb-api :: functionalities/breakpoint/objc/TestObjCBreakpoints.py (1858 of 2122)
PASS: lldb-unit :: Signals/./SignalsTests/UnixSignalsTest.GetInfo (1859 of 2122)
PASS: lldb-unit :: Utility/./UtilityTests/RangeTest.DoesAdjoinOrIntersect (1860 of 2122)
PASS: lldb-unit :: SymbolFile/DWARF/./SymbolFileDWARFTests/SymbolFileDWARFTests.TestAbbrevOrder1Start1 (1861 of 2122)
PASS: lldb-unit :: ScriptInterpreter/Python/./ScriptInterpreterPythonTests/PythonDataObjectsTest.TestPythonCallableInvoke (1862 of 2122)
PASS: lldb-shell :: Register/x86-64-ymm-read.test (1863 of 2122)
PASS: lldb-api :: functionalities/data-formatter/data-formatter-stl/libcxx/string/TestDataFormatterLibcxxString.py (1864 of 2122)
PASS: lldb-api :: functionalities/postmortem/minidump/TestMiniDump.py (1865 of 2122)
PASS: lldb-shell :: SymbolFile/DWARF/debug-types-address-ranges.s (1866 of 2122)
PASS: lldb-unit :: Utility/./UtilityTests/ArgsTest.ReplaceArgumentAtIndexLonger (1867 of 2122)
PASS: lldb-api :: lang/objc/print-obj/TestPrintObj.py (1868 of 2122)
PASS: lldb-unit :: Utility/./UtilityTests/NameMatchesTest.StartsWith (1869 of 2122)
PASS: lldb-api :: lang/objc/direct-dispatch-step/TestObjCDirectDispatchStepping.py (1870 of 2122)
UNSUPPORTED: lldb-shell :: ScriptInterpreter/Lua/independent_state.test (1871 of 2122)
PASS: lldb-unit :: Utility/./UtilityTests/OptionsWithRawTest.SingleWordSuffix (1872 of 2122)
PASS: lldb-api :: python_api/symbol-context/TestSymbolContext.py (1873 of 2122)
PASS: lldb-shell :: Unwind/trap_frame_sym_ctx.test (1874 of 2122)
PASS: lldb-api :: commands/expression/two-files/TestObjCTypeQueryFromOtherCompileUnit.py (1875 of 2122)
PASS: lldb-api :: tools/lldb-vscode/breakpoint/TestVSCode_setFunctionBreakpoints.py (1876 of 2122)
PASS: lldb-shell :: SymbolFile/DWARF/debug_loc-aslr.s (1877 of 2122)
PASS: lldb-api :: commands/expression/persistent_ptr_update/TestPersistentPtrUpdate.py (1878 of 2122)
PASS: lldb-api :: python_api/function_symbol/TestDisasmAPI.py (1879 of 2122)
PASS: lldb-api :: tools/lldb-server/TestGdbRemoteHostInfo.py (1880 of 2122)
PASS: lldb-api :: python_api/disassemble-raw-data/TestDisassemble_VST1_64.py (1881 of 2122)
PASS: lldb-api :: commands/target/stop-hooks/TestStopHooks.py (1882 of 2122)
PASS: lldb-api :: python_api/exprpath_synthetic/TestExprPathSynthetic.py (1883 of 2122)
PASS: lldb-api :: commands/watchpoints/hello_watchpoint/TestMyFirstWatchpoint.py (1884 of 2122)
PASS: lldb-api :: lang/cpp/char8_t/TestCxxChar8_t.py (1885 of 2122)
PASS: lldb-unit :: Utility/./UtilityTests/RangeTest.ContainsEndInclusive (1886 of 2122)
PASS: lldb-unit :: Utility/./UtilityTests/FileSpecTest.GetPath (1887 of 2122)
PASS: lldb-api :: functionalities/data-formatter/data-formatter-stl/libcxx/multimap/TestDataFormatterLibccMultiMap.py (1888 of 2122)
PASS: lldb-unit :: Symbol/./SymbolTests/LineEntryTest.GetSameLineContiguousAddressRangeNestedInline (1889 of 2122)
UNSUPPORTED: lldb-shell :: SymbolFile/NativePDB/ast-functions-msvc.cpp (1890 of 2122)
PASS: lldb-unit :: Utility/./UtilityTests/RangeTest.ClearWithStarAddress (1891 of 2122)
UNSUPPORTED: lldb-api :: commands/expression/completion-crash-invalid-iterator/TestInvalidIteratorCompletionCrash.py (1892 of 2122)
PASS: lldb-shell :: Quit/TestQuitExitCodeHexA.test (1893 of 2122)
PASS: lldb-shell :: Breakpoint/jitbp_elf.test (1894 of 2122)
PASS: lldb-unit :: Utility/./UtilityTests/DataExtractorTest.GetCStrEmpty (1895 of 2122)
PASS: lldb-unit :: Expression/./ExpressionTests/CppModuleConfigurationTest.Sysroot (1896 of 2122)
PASS: lldb-unit :: Language/Highlighting/./HighlighterTests/HighlighterTest.ClangOperators (1897 of 2122)
PASS: lldb-unit :: Interpreter/./InterpreterTests/CompletionTest.DirCompletionUsername (1898 of 2122)
PASS: lldb-shell :: ScriptInterpreter/Python/scripted_breakpoint.test (1899 of 2122)
UNSUPPORTED: lldb-api :: benchmarks/libcxxlist/TestBenchmarkLibcxxList.py (1900 of 2122)
PASS: lldb-shell :: Reproducer/Modules/TestModuleCXX.test (1901 of 2122)
PASS: lldb-api :: lang/objc/modules-update/TestClangModulesUpdate.py (1902 of 2122)
PASS: lldb-unit :: Target/./TargetTests/PathMappingListTest.RemapRoot (1903 of 2122)
PASS: lldb-api :: functionalities/completion/TestCompletion.py (1904 of 2122)
PASS: lldb-shell :: ScriptInterpreter/None/import_module.test (1905 of 2122)
PASS: lldb-api :: commands/statistics/basic/TestStats.py (1906 of 2122)
PASS: lldb-unit :: Utility/./UtilityTests/DataExtractorTest.GetFloatUnaligned (1907 of 2122)
PASS: lldb-unit :: Utility/./UtilityTests/FileSpecTest.FileAndDirectoryComponents (1908 of 2122)
PASS: lldb-api :: api/command-return-object/TestSBCommandReturnObject.py (1909 of 2122)
PASS: lldb-api :: commands/expression/dollar-in-variable/TestDollarInVariable.py (1910 of 2122)
PASS: lldb-unit :: UnwindAssembly/x86/./UnwindAssemblyx86Tests/Testx86AssemblyInspectionEngine.TestSpArithx86_64Augmented (1911 of 2122)
PASS: lldb-unit :: Symbol/./SymbolTests/TestTypeSystemClang.TestGetTypeClassTypeOf (1912 of 2122)
PASS: lldb-api :: python_api/name_lookup/TestNameLookup.py (1913 of 2122)
PASS: lldb-unit :: Utility/./UtilityTests/StringListTest.GetMaxStringLengthMixed (1914 of 2122)
PASS: lldb-api :: commands/expression/anonymous-struct/TestCallUserAnonTypedef.py (1915 of 2122)
PASS: lldb-shell :: SymbolFile/DWARF/debug_loc.s (1916 of 2122)
PASS: lldb-api :: python_api/sbvalue_persist/TestSBValuePersist.py (1917 of 2122)
PASS: lldb-unit :: Utility/./UtilityTests/RegularExpression.CopyAssignment (1918 of 2122)
PASS: lldb-unit :: Process/gdb-remote/./ProcessGdbRemoteTests/GDBRemoteCommunicationClientTest.SendStartTracePacket (1919 of 2122)
PASS: lldb-api :: commands/expression/import-std-module/forward_list-dbg-info-content/TestDbgInfoContentForwardListFromStdModule.py (1920 of 2122)
PASS: lldb-unit :: Interpreter/./InterpreterTests/OptionArgParserTest.toChar (1921 of 2122)
PASS: lldb-api :: functionalities/abbreviation/TestAbbreviations.py (1922 of 2122)
PASS: lldb-shell :: SymbolFile/Breakpad/unwind-via-stack-win.test (1923 of 2122)
FAIL: lldb-api :: functionalities/gdb_remote_client/TestThreadSelectionBug.py (1924 of 2122)
******************** TEST 'lldb-api :: functionalities/gdb_remote_client/TestThreadSelectionBug.py' FAILED ********************
Script:
--
/usr/local/Frameworks/Python.framework/Versions/3.7/bin/python3.7 /Users/buildslave/jenkins/workspace/lldb-cmake/llvm-project/lldb/test/API/dotest.py --arch x86_64 -s /Users/buildslave/jenkins/workspace/lldb-cmake/lldb-build/lldb-test-traces -S nm -u CXXFLAGS -u CFLAGS --codesign-identity - --server /Users/buildslave/jenkins/workspace/lldb-cmake/lldb-build/./bin/debugserver --arch x86_64 --build-dir /Users/buildslave/jenkins/workspace/lldb-cmake/lldb-build/lldb-test-build.noindex -s=/Users/buildslave/jenkins/workspace/lldb-cmake/test/logs -t --env TERM=vt100 --env LLVM_LIBS_DIR=/Users/buildslave/jenkins/workspace/lldb-cmake/lldb-build/./lib --build-dir /Users/buildslave/jenkins/workspace/lldb-cmake/lldb-build/lldb-test-build.noindex --lldb-module-cache-dir /Users/buildslave/jenkins/workspace/lldb-cmake/lldb-build/lldb-test-build.noindex/module-cache-lldb/lldb-api --clang-module-cache-dir /Users/buildslave/jenkins/workspace/lldb-cmake/lldb-build/lldb-test-build.noindex/module-cache-clang/lldb-api --executable /Users/buildslave/jenkins/workspace/lldb-cmake/lldb-build/./bin/lldb --compiler /Users/buildslave/jenkins/workspace/lldb-cmake/lldb-build/./bin/clang --dsymutil /Users/buildslave/jenkins/workspace/lldb-cmake/lldb-build/./bin/dsymutil --filecheck /Users/buildslave/jenkins/workspace/lldb-cmake/lldb-build/./bin/FileCheck --yaml2obj /Users/buildslave/jenkins/workspace/lldb-cmake/lldb-build/./bin/yaml2obj --lldb-libs-dir /Users/buildslave/jenkins/workspace/lldb-cmake/lldb-build/./lib /Users/buildslave/jenkins/workspace/lldb-cmake/llvm-project/lldb/test/API/functionalities/gdb_remote_client -p TestThreadSelectionBug.py
--
Exit Code: 1

Hide Details

Command Output (stdout): -- lldb version 12.0.99 clang revision 35bee3503f4c33d92434a314e49e3e6f4f7419bc llvm revision 35bee3503f4c33d92434a314e49e3e6f4f7419bc LLDB library dir: /Users/buildslave/jenkins/workspace/lldb-cmake/lldb-build/bin LLDB import library dir: /Users/buildslave/jenkins/workspace/lldb-cmake/lldb-build/./lib libstdcxx tests will not be run because: Don't know how to build with libstdcxx on macosx Skipping following debug info categories: ['dwo']

Hide Details

-- Command Output (stderr): --

Hide Details

Session logs for test failures/errors/unexpected successes will go into directory '/Users/buildslave/jenkins/workspace/lldb-cmake/test/logs' Change dir to: /Users/buildslave/jenkins/workspace/lldb-cmake/llvm-project/lldb/test/API/functionalities/gdb_remote_client runCmd: settings clear -all output:

Hide Details

runCmd: settings set symbols.enable-external-lookup false output:

Hide Details

runCmd: settings set target.inherit-tcc true output:

Hide Details

runCmd: settings set target.auto-apply-fixits false output:

Hide Details

runCmd: settings set plugin.process.gdb-remote.packet-timeout 60 output:

Hide Details

runCmd: settings set symbols.clang-modules-cache-path "/Users/buildslave/jenkins/workspace/lldb-cmake/lldb-build/lldb-test-build.noindex/module-cache-lldb/lldb-api" output:

Hide Details

runCmd: settings set use-color false output:

Hide Details

runCmd: setting set target.prefer-dynamic-value no-dynamic-values output:

Hide Details

FAIL: LLDB (/Users/buildslave/jenkins/workspace/lldb-cmake/lldb-build/bin/clang-x86_64) :: test (TestThreadSelectionBug.TestThreadSelectionBug) <bound method SBProcess.Kill of <lldb.SBProcess; proxy of <Swig Object of type 'lldb::SBProcess *' at 0x10f7643f0> >>: success

Hide Details

Restore dir to: /Users/buildslave/jenkins/workspace/lldb-cmake/lldb-build/tools/lldb/test ====================================================================== FAIL: test (TestThreadSelectionBug.TestThreadSelectionBug) ---------------------------------------------------------------------- Traceback (most recent call last): File "/Users/buildslave/jenkins/workspace/lldb-cmake/llvm-project/lldb/test/API/functionalities/gdb_remote_client/TestThreadSelectionBug.py", line 16, in test process = self.connect(target) File "/Users/buildslave/jenkins/workspace/lldb-cmake/llvm-project/lldb/test/API/functionalities/gdb_remote_client/gdbclientutils.py", line 519, in connect self.assertTrue(error.Success(), error.description) AssertionError: False is not True : failed to get reply to handshake packet Config=x86_64-/Users/buildslave/jenkins/workspace/lldb-cmake/lldb-build/bin/clang ---------------------------------------------------------------------- Ran 1 test in 92.078s

Hide Details

RESULT: FAILED (0 passes, 1 failures, 0 errors, 0 skipped, 0 expected failures, 0 unexpected successes)

Hide Details

--

Hide Details

******************** PASS: lldb-shell :: SymbolFile/DWARF/anon_class_w_and_wo_export_symbols.ll (1925 of 2122) PASS: lldb-unit :: Utility/./UtilityTests/LogTest.Register (1926 of 2122) PASS: lldb-unit :: Utility/./UtilityTests/OptionsWithRawTest.EmptySuffix (1927 of 2122) PASS: lldb-api :: lang/cpp/global_variables/TestCPPGlobalVariables.py (1928 of 2122) PASS: lldb-unit :: Utility/./UtilityTests/ScalarTest.Equality (1929 of 2122) PASS: lldb-api :: commands/expression/pr35310/TestExprsBug35310.py (1930 of 2122) PASS: lldb-api :: commands/watchpoints/watchpoint_commands/command/TestWatchpointCommandPython.py (1931 of 2122) PASS: lldb-api :: python_api/default-constructor/TestDefaultConstructorForAPIObjects.py (1932 of 2122) PASS: lldb-unit :: Host/./HostTests/ProcessLaunchInfoTest.Constructor (1933 of 2122) PASS: lldb-api :: functionalities/thread/concurrent_events/TestConcurrentManyWatchpoints.py (1934 of 2122) PASS: lldb-unit :: ScriptInterpreter/Python/./ScriptInterpreterPythonTests/PythonDataObjectsTest.TestExceptions (1935 of 2122) PASS: lldb-unit :: UnwindAssembly/x86/./UnwindAssemblyx86Tests/Testx86AssemblyInspectionEngine.TestPushR14 (1936 of 2122) PASS: lldb-api :: commands/gui/breakpoints/TestGuiBreakpoints.py (1937 of 2122) PASS: lldb-unit :: Language/Highlighting/./HighlighterTests/HighlighterTest.ClangCursorOutOfBounds (1938 of 2122) PASS: lldb-api :: functionalities/data-formatter/data-formatter-synth/TestDataFormatterSynth.py (1939 of 2122) PASS: lldb-api :: lang/objc/objc-checker/TestObjCCheckers.py (1940 of 2122) PASS: lldb-unit :: Utility/./UtilityTests/StringListTest.GetMaxStringLengthEqualSize (1941 of 2122) PASS: lldb-shell :: Unwind/thread-step-out-ret-addr-check.test (1942 of 2122) PASS: lldb-shell :: SymbolFile/DWARF/dwarf5-index-is-used.cpp (1943 of 2122) PASS: lldb-unit :: ObjectFile/Breakpad/./ObjectFileBreakpadTests/ModuleRecord.parse (1944 of 2122) PASS: lldb-unit :: Utility/./UtilityTests/StreamTeeTest.SetStreamAtIndexOutOfBounds (1945 of 2122) PASS: lldb-unit :: Utility/./UtilityTests/RangeDataVector.FindEntryThatContains (1946 of 2122) PASS: lldb-unit :: API/./APITests/SBCommandInterpreterTest.MultiWordCommand (1947 of 2122) PASS: lldb-unit :: Utility/./UtilityTests/StringListTest.InsertStringAtIndexEnd (1948 of 2122) PASS: lldb-unit :: Utility/./UtilityTests/StreamTest.PutBytesAsRawHex8ToBigEndian (1949 of 2122) PASS: lldb-unit :: Host/./HostTests/File.GetStreamFromDescriptor (1950 of 2122) PASS: lldb-unit :: Utility/./UtilityTests/PassiveReplayTest.InstrumentedFooInvalid (1951 of 2122) PASS: lldb-api :: functionalities/load_unload/TestLoadUnload.py (1952 of 2122) UNSUPPORTED: lldb-api :: functionalities/data-formatter/data-formatter-stl/libstdcpp/list/TestDataFormatterStdList.py (1953 of 2122) PASS: lldb-api :: functionalities/process_group/TestChangeProcessGroup.py (1954 of 2122) PASS: lldb-unit :: UnwindAssembly/x86/./UnwindAssemblyx86Tests/Testx86AssemblyInspectionEngine.TestPopR15 (1955 of 2122) PASS: lldb-unit :: Language/Highlighting/./HighlighterTests/HighlighterTest.DefaultHighlighterWithCursorOutOfBounds (1956 of 2122) PASS: lldb-unit :: Expression/./ExpressionTests/DWARFExpression.DW_OP_pick (1957 of 2122) PASS: lldb-unit :: Process/gdb-remote/./ProcessGdbRemoteTests/GDBRemoteCommunicationClientTest.GetMemoryRegionInfo (1958 of 2122) PASS: lldb-shell :: Breakpoint/debug_rnglist_basic.test (1959 of 2122) PASS: lldb-unit :: Expression/./ExpressionTests/DiagnosticManagerTest.GetStringSeverityLabels (1960 of 2122) UNSUPPORTED: lldb-shell :: SymbolFile/NativePDB/local-variables.cpp (1961 of 2122) PASS: lldb-shell :: ObjectFile/PECOFF/basic-info-arm.yaml (1962 of 2122) PASS: lldb-unit :: Utility/./UtilityTests/ScalarTest.GetValue (1963 of 2122) PASS: lldb-api :: lang/cpp/unique-types/TestUniqueTypes.py (1964 of 2122) PASS: lldb-unit :: Symbol/./SymbolTests/Type.GetTypeScopeAndBasename (1965 of 2122) PASS: lldb-api :: functionalities/signal/raise/TestRaise.py (1966 of 2122) PASS: lldb-api :: commands/quit/TestQuit.py (1967 of 2122) PASS: lldb-unit :: Utility/./UtilityTests/TimerTest.CategoryTimes (1968 of 2122) PASS: lldb-api :: commands/expression/ir-interpreter/TestIRInterpreter.py (1969 of 2122) PASS: lldb-unit :: Utility/./UtilityTests/RangeTest.ContainsRangeStartingFromZero (1970 of 2122) PASS: lldb-shell :: Reproducer/Functionalities/TestExpressionEvaluation.test (1971 of 2122) PASS: lldb-api :: commands/frame/diagnose/dereference-function-return/TestDiagnoseDereferenceFunctionReturn.py (1972 of 2122) UNSUPPORTED: lldb-api :: tools/lldb-vscode/completions/TestVSCode_completions.py (1973 of 2122) PASS: lldb-api :: lang/objc/modules-hash-mismatch/TestClangModulesHashMismatch.py (1974 of 2122) PASS: lldb-api :: commands/expression/import-std-module/weak_ptr-dbg-info-content/TestDbgInfoContentWeakPtrFromStdModule.py (1975 of 2122) PASS: lldb-api :: functionalities/data-formatter/setvaluefromcstring/TestSetValueFromCString.py (1976 of 2122) PASS: lldb-api :: lang/cpp/const_this/TestConstThis.py (1977 of 2122) PASS: lldb-api :: lang/c/global_variables/TestGlobalVariables.py (1978 of 2122) PASS: lldb-unit :: Process/gdb-remote/./ProcessGdbRemoteTests/GDBRemoteClientBaseTest.SendContinueDelegateInterface (1979 of 2122) PASS: lldb-api :: functionalities/set-data/TestSetData.py (1980 of 2122) PASS: lldb-api :: functionalities/data-formatter/data-formatter-objc/cmtime/TestDataFormatterCMTime.py (1981 of 2122) PASS: lldb-unit :: Utility/./UtilityTests/BinaryStreamTest.PutSLEB128TwoBytes (1982 of 2122) PASS: lldb-unit :: Expression/./ExpressionTests/ClangExpressionDeclMapTest.TestUnknownIdentifierLookup (1983 of 2122) PASS: lldb-unit :: Utility/./UtilityTests/RangeTest.Slide (1984 of 2122) PASS: lldb-api :: commands/session/history/TestSessionHistory.py (1985 of 2122) PASS: lldb-unit :: Utility/./UtilityTests/ScalarTest.Comparison (1986 of 2122) UNSUPPORTED: lldb-shell :: SymbolFile/DWARF/DW_TAG_GNU_call_site-DW_AT_low_pc.s (1987 of 2122) PASS: lldb-api :: commands/watchpoints/watchpoint_commands/TestWatchpointCommands.py (1988 of 2122) PASS: lldb-unit :: Utility/./UtilityTests/AnsiTerminal.Incomplete (1989 of 2122) PASS: lldb-api :: commands/target/basic/TestTargetCommand.py (1990 of 2122) PASS: lldb-api :: python_api/sbtype_typeclass/TestSBTypeTypeClass.py (1991 of 2122) PASS: lldb-shell :: Minidump/dump-all.test (1992 of 2122) PASS: lldb-shell :: ObjectFile/PECOFF/export-dllfunc.yaml (1993 of 2122) PASS: lldb-unit :: Utility/./UtilityTests/NameMatchesTest.Ignore (1994 of 2122) PASS: lldb-unit :: ScriptInterpreter/Python/./ScriptInterpreterPythonTests/PythonDataObjectsTest.TestTypeNameResolutionNoDot (1995 of 2122) UNSUPPORTED: lldb-shell :: Unwind/eh-frame-small-fde.test (1996 of 2122) PASS: lldb-shell :: SymbolFile/NativePDB/s_constant.cpp (1997 of 2122) PASS: lldb-api :: python_api/get-value-32bit-int/TestGetValue32BitInt.py (1998 of 2122) UNSUPPORTED: lldb-shell :: BuildScript/toolchain-msvc.test (1999 of 2122) PASS: lldb-unit :: Utility/./UtilityTests/RangeTest.SizeTypes (2000 of 2122) PASS: lldb-api :: python_api/lldbutil/process/TestPrintStackTraces.py (2001 of 2122) PASS: lldb-unit :: Core/./LLDBCoreTests/RichManglingContextTest.SwitchProvider (2002 of 2122) PASS: lldb-unit :: Utility/./UtilityTests/UUIDTest.RelationalOperators (2003 of 2122) PASS: lldb-api :: python_api/sbvalue_const_addrof/TestSBValueConstAddrOf.py (2004 of 2122) PASS: lldb-unit :: Utility/./UtilityTests/StringListTest.GetMaxStringLengthIncreasingSize (2005 of 2122) PASS: lldb-unit :: Utility/./UtilityTests/StreamTest.ShiftOperatorStrings (2006 of 2122) PASS: lldb-unit :: Utility/./UtilityTests/Flags.GetBitSize (2007 of 2122) PASS: lldb-api :: lang/objc/ivar-IMP/TestObjCiVarIMP.py (2008 of 2122) PASS: lldb-shell :: SymbolFile/DWARF/dwarf5-debug_line.s (2009 of 2122) PASS: lldb-shell :: SymbolFile/DWARF/debug_aranges-empty-section.s (2010 of 2122) PASS: lldb-api :: commands/command/source/TestCommandSource.py (2011 of 2122) PASS: lldb-api :: commands/process/attach/TestProcessAttach.py (2012 of 2122) PASS: lldb-unit :: debugserver/./debugserverTests/JSON.Parse (2013 of 2122) PASS: lldb-api :: lang/cpp/scope/TestCppScope.py (2014 of 2122) PASS: lldb-unit :: SymbolFile/NativePDB/./SymbolFileNativePDBTests/PDBFPOProgramToDWARFExpressionTests.UnresolvedCyclicRegisterAssignmentReference (2015 of 2122) PASS: lldb-shell :: Settings/TestFrameFormatColor.test (2016 of 2122) PASS: lldb-unit :: Target/./TargetTests/PathMappingListTest.RelativeTests (2017 of 2122) PASS: lldb-api :: commands/expression/persistent_types/TestPersistentTypes.py (2018 of 2122) PASS: lldb-unit :: Utility/./UtilityTests/SerializationRountripTest.SerializeDeserializePodReferences (2019 of 2122) PASS: lldb-api :: lang/cpp/symbols/TestSymbols.py (2020 of 2122) UNSUPPORTED: lldb-shell :: Register/x86-64-xmm16-read.test (2021 of 2122) PASS: lldb-api :: commands/expression/import-std-module/queue/TestQueueFromStdModule.py (2022 of 2122) PASS: lldb-api :: lang/cpp/bool/TestCPPBool.py (2023 of 2122) PASS: lldb-unit :: Signals/./SignalsTests/UnixSignalsTest.Iteration (2024 of 2122) PASS: lldb-unit :: UnwindAssembly/x86/./UnwindAssemblyx86Tests/Testx86AssemblyInspectionEngine.TestDisassemblyJunkBytes (2025 of 2122) PASS: lldb-unit :: Utility/./UtilityTests/FileSpecTest.EqualSeparator (2026 of 2122) PASS: lldb-unit :: Process/gdb-remote/./ProcessGdbRemoteTests/GDBRemoteClientBaseTest.SendPacketAndReceiveResponseWithOutputSupport (2027 of 2122) PASS: lldb-api :: python_api/disassemble-raw-data/TestDisassembleRawData.py (2028 of 2122) UNSUPPORTED: lldb-shell :: SymbolFile/PDB/variables-locations.test (2029 of 2122) PASS: lldb-api :: functionalities/asan/TestMemoryHistory.py (2030 of 2122) PASS: lldb-api :: lang/cpp/call-function/TestCallCPPFunction.py (2031 of 2122) PASS: lldb-api :: lang/objcxx/cxx-bridged-po/TestObjCXXBridgedPO.py (2032 of 2122) PASS: lldb-api :: functionalities/signal/TestSendSignal.py (2033 of 2122) PASS: lldb-unit :: Expression/./ExpressionTests/CppModuleConfigurationTest.AmbiguousCLib (2034 of 2122) PASS: lldb-shell :: SymbolFile/dissassemble-entry-point.s (2035 of 2122) PASS: lldb-shell :: Driver/TestFile.test (2036 of 2122) PASS: lldb-api :: functionalities/breakpoint/breakpoint_language/TestBreakpointLanguage.py (2037 of 2122) PASS: lldb-api :: commands/expression/fixits/TestFixIts.py (2038 of 2122) PASS: lldb-unit :: UnwindAssembly/x86/./UnwindAssemblyx86Tests/Testx86AssemblyInspectionEngine.TestPushEBP (2039 of 2122) PASS: lldb-unit :: SymbolFile/NativePDB/./SymbolFileNativePDBTests/PDBFPOProgramToDWARFExpressionTests.SingleAssignmentRegisterRef (2040 of 2122) PASS: lldb-unit :: Language/Highlighting/./HighlighterTests/HighlighterTest.FallbackHighlighter (2041 of 2122) PASS: lldb-unit :: Utility/./UtilityTests/StringExtractorTest.InitMisc (2042 of 2122) PASS: lldb-unit :: Symbol/./SymbolTests/PostfixExpression.ToDWARF (2043 of 2122) PASS: lldb-api :: python_api/target/TestTargetAPI.py (2044 of 2122) PASS: lldb-api :: functionalities/unwind/zeroth_frame/TestZerothFrame.py (2045 of 2122) PASS: lldb-unit :: Utility/./UtilityTests/StringExtractorTest.GetHexBytes (2046 of 2122) PASS: lldb-unit :: ObjectFile/MachO/./ObjectFileMachOTests/ObjectFileMachOTest.ModuleFromSharedCacheInfo (2047 of 2122) PASS: lldb-api :: functionalities/data-formatter/data-formatter-stl/libstdcpp/unique_ptr/invalid/TestDataFormatterInvalidStdUniquePtr.py (2048 of 2122) PASS: lldb-unit :: Utility/./UtilityTests/StreamTest.PutChar (2049 of 2122) PASS: lldb-shell :: ObjectFile/PECOFF/sections-names.yaml (2050 of 2122) PASS: lldb-api :: lang/mixed/TestMixedLanguages.py (2051 of 2122) PASS: lldb-api :: functionalities/inferior-changed/TestInferiorChanged.py (2052 of 2122) PASS: lldb-shell :: Driver/TestPositionalArgs.test (2053 of 2122) PASS: lldb-unit :: Utility/./UtilityTests/StreamTest.AddressPrefix (2054 of 2122) PASS: lldb-unit :: Utility/./UtilityTests/Flags.AllClear (2055 of 2122) PASS: lldb-unit :: Utility/./UtilityTests/StreamTeeTest.Flush (2056 of 2122) PASS: lldb-api :: lang/cpp/operators/TestCppOperators.py (2057 of 2122) PASS: lldb-api :: commands/settings/quoting/TestQuoting.py (2058 of 2122) PASS: lldb-api :: tools/lldb-server/TestGdbRemote_qThreadStopInfo.py (2059 of 2122) PASS: lldb-unit :: Utility/./UtilityTests/StringExtractorTest.GetHexBytes_Underflow (2060 of 2122) PASS: lldb-unit :: Utility/./UtilityTests/SerializationRountripTest.SerializeDeserializeCStringArrayNullptrElem (2061 of 2122) UNSUPPORTED: lldb-api :: benchmarks/stepping/TestSteppingSpeed.py (2062 of 2122) PASS: lldb-api :: commands/command/script_alias/TestCommandScriptAlias.py (2063 of 2122) PASS: lldb-unit :: Process/gdb-remote/./ProcessGdbRemoteTests/GDBRemoteClientBaseTest.SendContinueAndLateInterrupt (2064 of 2122) PASS: lldb-unit :: Utility/./UtilityTests/OptionsWithRawTest.WhitespaceInput (2065 of 2122) PASS: lldb-shell :: Commands/command-source.test (2066 of 2122) PASS: lldb-api :: lang/objc/objc-builtin-types/TestObjCBuiltinTypes.py (2067 of 2122) PASS: lldb-api :: functionalities/multidebugger_commands/TestMultipleDebuggersCommands.py (2068 of 2122) PASS: lldb-api :: lang/cpp/template-specialization-type/TestTemplateSpecializationType.py (2069 of 2122) PASS: lldb-api :: functionalities/deleted-executable/TestDeletedExecutable.py (2070 of 2122) PASS: lldb-api :: functionalities/data-formatter/data-formatter-objc/TestDataFormatterObjCPlain.py (2071 of 2122) PASS: lldb-unit :: Core/./LLDBCoreTests/ModuleSpecTest.TestELFFile (2072 of 2122) PASS: lldb-api :: commands/expression/import-std-module/stack/TestStackFromStdModule.py (2073 of 2122) UNSUPPORTED: lldb-shell :: Register/x86-zmm-read.test (2074 of 2122) PASS: lldb-unit :: Utility/./UtilityTests/OptionsWithRawTest.MultiWordSuffix (2075 of 2122) UNSUPPORTED: lldb-shell :: Register/x86-gp-read.test (2076 of 2122) PASS: lldb-unit :: UnwindAssembly/x86/./UnwindAssemblyx86Tests/Testx86AssemblyInspectionEngine.Test32BitOnlyInstruction (2077 of 2122) PASS: lldb-unit :: Utility/./UtilityTests/StringExtractorTest.DecodeHexU8_Exact (2078 of 2122) PASS: lldb-unit :: Utility/./UtilityTests/FileSpecTest.EqualDotsPosix (2079 of 2122) PASS: lldb-api :: lang/objc/global_ptrs/TestGlobalObjects.py (2080 of 2122) PASS: lldb-api :: tools/lldb-server/TestGdbRemoteRegisterState.py (2081 of 2122) PASS: lldb-api :: functionalities/thread/exit_during_break/TestExitDuringBreak.py (2082 of 2122) PASS: lldb-api :: types/TestDoubleTypes.py (2083 of 2122) PASS: lldb-unit :: Utility/./UtilityTests/StringListTest.InsertStringAtIndexStdString (2084 of 2122) PASS: lldb-api :: lang/c/complex_int/TestComplexInt.py (2085 of 2122) PASS: lldb-unit :: Utility/./UtilityTests/DataExtractorTest.GetSLEB128_bit63 (2086 of 2122) UNSUPPORTED: lldb-api :: functionalities/darwin_log/filter/exact_match/message/TestDarwinLogFilterMatchMessage.py (2087 of 2122) XFAIL: lldb-shell :: SymbolFile/DWARF/find-type-in-function.cpp (2088 of 2122) PASS: lldb-unit :: Utility/./UtilityTests/UriParserTest.BracketedHostnameWithPortIPv4 (2089 of 2122) PASS: lldb-api :: functionalities/target-new-solib-notifications/TestModuleLoadedNotifys.py (2090 of 2122) UNSUPPORTED: lldb-api :: benchmarks/libcxxmap/TestBenchmarkLibcxxMap.py (2091 of 2122) PASS: lldb-shell :: Settings/TestDisassemblyFormat.test (2092 of 2122) PASS: lldb-unit :: Expression/./ExpressionTests/DWARFExpression.DW_OP_convert (2093 of 2122) PASS: lldb-unit :: Utility/./UtilityTests/ArchSpecTest.MergeFrom (2094 of 2122) PASS: lldb-shell :: ExecControl/StopHook/stop-hook.test (2095 of 2122) PASS: lldb-api :: functionalities/thread/concurrent_events/TestConcurrentTwoWatchpointThreads.py (2096 of 2122) PASS: lldb-unit :: Utility/./UtilityTests/StringLexerTest.AdvanceIf (2097 of 2122) PASS: lldb-api :: functionalities/breakpoint/breakpoint_command/TestBreakpointCommand.py (2098 of 2122) PASS: lldb-unit :: Utility/./UtilityTests/StreamTeeTest.Assignment (2099 of 2122) PASS: lldb-unit :: Utility/./UtilityTests/StreamTest.SetIndentLevel (2100 of 2122) PASS: lldb-api :: functionalities/data-formatter/data-formatter-objc/TestDataFormatterObjCCF.py (2101 of 2122) PASS: lldb-api :: lang/objc/foundation/TestObjCMethodsNSArray.py (2102 of 2122) PASS: lldb-shell :: Settings/TestEchoCommands.test (2103 of 2122) PASS: lldb-unit :: Utility/./UtilityTests/StringExtractorTest.GetHexBytesAvail_Underflow (2104 of 2122) PASS: lldb-unit :: DataFormatter/./LLDBFormatterTests/TypeMatcherTests.GetMatchStringRegex (2105 of 2122) UNSUPPORTED: lldb-api :: benchmarks/startup/TestStartupDelays.py (2106 of 2122) PASS: lldb-api :: types/TestLongTypes.py (2107 of 2122) PASS: lldb-api :: lang/objc/objc-new-syntax/TestObjCNewSyntaxDictionary.py (2108 of 2122) PASS: lldb-unit :: Utility/./UtilityTests/UriParserTest.BracketedHostnameWithPortIPv6 (2109 of 2122) PASS: lldb-api :: lang/c/enum_types/TestEnumTypes.py (2110 of 2122) PASS: lldb-unit :: Symbol/./SymbolTests/TestTypeSystemClang.TestBuiltinTypeForEncodingAndBitSize (2111 of 2122) PASS: lldb-unit :: Host/./HostTests/SocketTest.TCPGetAddress (2112 of 2122) PASS: lldb-unit :: Expression/./ExpressionTests/CppModuleConfigurationTest.UnrelatedLibrary (2113 of 2122) PASS: lldb-unit :: UnwindAssembly/x86/./UnwindAssemblyx86Tests/Testx86AssemblyInspectionEngine.TestSimplei386ugmented (2114 of 2122) PASS: lldb-api :: functionalities/postmortem/minidump-new/TestMiniDumpUUID.py (2115 of 2122) PASS: lldb-unit :: Expression/./ExpressionTests/DWARFExpression.DW_OP_piece (2116 of 2122) PASS: lldb-unit :: Symbol/./SymbolTests/TestTypeSystemClang.TestOwningModule (2117 of 2122) PASS: lldb-api :: lang/objc/blocks/TestObjCIvarsInBlocks.py (2118 of 2122) PASS: lldb-unit :: Utility/./UtilityTests/UriParserTest.SchemeHostSeparator2 (2119 of 2122) PASS: lldb-api :: functionalities/postmortem/elf-core/TestLinuxCore.py (2120 of 2122) PASS: lldb-api :: types/TestShortType.py (2121 of 2122) PASS: lldb-api :: functionalities/data-formatter/data-formatter-stl/libcxx/bitset/TestDataFormatterLibcxxBitset.py (2122 of 2122) Slowest Tests: -------------------------------------------------------------------------- 292.59s: lldb-api :: macosx/simulator/TestSimulatorPlatform.py 118.02s: lldb-api :: tools/lldb-server/TestLldbGdbServer.py 92.81s: lldb-api :: functionalities/gdb_remote_client/TestGDBRemoteLoad.py 92.70s: lldb-api :: functionalities/gdb_remote_client/TestThreadSelectionBug.py 87.02s: lldb-api :: functionalities/postmortem/mach-core/TestMachCore.py 72.43s: lldb-api :: lang/objc/hidden-ivars/TestHiddenIvars.py 64.08s: lldb-api :: lang/cpp/enum_types/TestCPP11EnumTypes.py 61.82s: lldb-api :: lang/objc/foundation/TestFoundationDisassembly.py 55.30s: lldb-api :: lang/objc/foundation/TestObjCMethods.py 54.34s: lldb-api :: types/TestLongTypesExpr.py 53.82s: lldb-api :: lang/objc/exceptions/TestObjCExceptions.py 53.58s: lldb-shell :: SymbolFile/DWARF/limit-debug-info.s 50.91s: lldb-api :: functionalities/breakpoint/breakpoint_conditions/TestBreakpointConditions.py 49.04s: lldb-shell :: SymbolFile/NativePDB/globals-bss.cpp 48.01s: lldb-api :: api/multithreaded/TestMultithreaded.py 47.92s: lldb-shell :: SymbolFile/NativePDB/break-by-line.cpp 47.36s: lldb-api :: functionalities/breakpoint/serialize/TestBreakpointSerialization.py 45.93s: lldb-api :: functionalities/gdb_remote_client/TestRegDefinitionInParts.py 45.30s: lldb-shell :: SymbolFile/NativePDB/function-types-calling-conv.cpp 42.74s: lldb-api :: lang/objc/objc-new-syntax/TestObjCNewSyntaxLiteral.py

Hide Details

Tests Times: -------------------------------------------------------------------------- [ Range ] :: [ Percentage ] :: [ Count ] -------------------------------------------------------------------------- [280s,300s) :: [ ] :: [ 1/2122] [260s,280s) :: [ ] :: [ 0/2122] [240s,260s) :: [ ] :: [ 0/2122] [220s,240s) :: [ ] :: [ 0/2122] [200s,220s) :: [ ] :: [ 0/2122] [180s,200s) :: [ ] :: [ 0/2122] [160s,180s) :: [ ] :: [ 0/2122] [140s,160s) :: [ ] :: [ 0/2122] [120s,140s) :: [ ] :: [ 1/2122] [100s,120s) :: [ ] :: [ 0/2122] [ 80s,100s) :: [ ] :: [ 3/2122] [ 60s, 80s) :: [ ] :: [ 3/2122] [ 40s, 60s) :: [ ] :: [ 15/2122] [ 20s, 40s) :: [ ] :: [ 42/2122] [ 0s, 20s) :: [************************************** ] :: [2057/2122] -------------------------------------------------------------------------- ******************** Failed Tests (2): lldb-api :: functionalities/gdb_remote_client/TestGDBRemoteLoad.py lldb-api :: functionalities/gdb_remote_client/TestThreadSelectionBug.py

Hide Details

Hide Details

Testing Time: 1854.45s Unsupported : 150 Passed : 1964 Expectedly Failed: 6 Failed : 2 FAILED: tools/lldb/test/CMakeFiles/check-lldb-lit cd /Users/buildslave/jenkins/workspace/lldb-cmake/lldb-build/tools/lldb/test && /usr/local/Frameworks/Python.framework/Versions/3.7/bin/python3.7 /Users/buildslave/jenkins/workspace/lldb-cmake/lldb-build/./bin/llvm-lit -v --time-tests --shuffle --xunit-xml-output=/Users/buildslave/jenkins/workspace/lldb-cmake/test/results.xml -v -j 4 /Users/buildslave/jenkins/workspace/lldb-cmake/lldb-build/tools/lldb/test ninja: build stopped: subcommand failed. Command failed: Command '['/usr/bin/env', 'TERM=vt100', '/usr/local/bin/ninja', '-v', 'check-lldb']' returned non-zero exit status 1 Command: ['/usr/bin/env', 'TERM=vt100', '/usr/local/bin/ninja', '-v', 'check-lldb'] [Pipeline] } [Pipeline] // timeout [Pipeline] } [Pipeline] // stage [Pipeline] stage [Pipeline] { (Declarative: Post Actions) [Pipeline] scanForIssues [Clang (LLVM based)] Sleeping for 5 seconds due to JENKINS-32191... [Clang (LLVM based)] Parsing console log (workspace: '/Users/buildslave/jenkins/workspace/lldb-cmake') [Clang (LLVM based)] Successfully parsed console log [Clang (LLVM based)] -> found 14 issues (skipped 101 duplicates) [Clang (LLVM based)] Post processing issues on 'green-dragon-10' with source code encoding 'UTF-8' [Clang (LLVM based)] Creating SCM blamer to obtain author and commit information for affected files [Clang (LLVM based)] Creating SCM miner to obtain statistics for affected repository files [Clang (LLVM based)] Resolving file names for all issues in source directory '/Users/buildslave/jenkins/workspace/lldb-cmake' [Clang (LLVM based)] -> resolved paths in source directory (9 found, 0 not found) [Clang (LLVM based)] Resolving module names from module definitions (build.xml, pom.xml, or Manifest.mf files) [Clang (LLVM based)] -> resolved module names for 14 issues [Clang (LLVM based)] Resolving package names (or namespaces) by parsing the affected files [Clang (LLVM based)] -> resolved package names of 8 affected files [Clang (LLVM based)] No filter has been set, publishing all 13 issues [Clang (LLVM based)] Creating fingerprints for all affected code blocks to track issues over different builds [Clang (LLVM based)] -> created fingerprints for 13 issues (skipped 0 issues) [Clang (LLVM based)] Copying affected files to Jenkins' build folder '/Users/Shared/Jenkins/Home/jobs/lldb-cmake/builds/23336/files-with-issues' [Clang (LLVM based)] -> 6 copied, 2 not in workspace, 0 not-found, 0 with I/O error [Pipeline] junit Recording test results [Pipeline] emailext Warning: zinenko@google.com is not a recognized user, but sending mail anyway Warning: david.truby@arm.com is not a recognized user, but sending mail anyway Warning: cullen.rhodes@arm.com is not a recognized user, but sending mail anyway Warning: llvm-dev@redking.me.uk is not a recognized user, but sending mail anyway Warning: grimar@accesssoftek.com is not a recognized user, but sending mail anyway Warning: zinenko@google.com is not a recognized user, but sending mail anyway Warning: david.truby@arm.com is not a recognized user, but sending mail anyway Warning: cullen.rhodes@arm.com is not a recognized user, but sending mail anyway Warning: llvm-dev@redking.me.uk is not a recognized user, but sending mail anyway Warning: grimar@accesssoftek.com is not a recognized user, but sending mail anyway

Hide Details

Begin Pre-Send Script... Sending email to: mschifer@apple.com risemann@apple.com zinenko@google.com david.truby@arm.com cullen.rhodes@arm.com llvm-dev@redking.me.uk grimar@accesssoftek.com Erik Pilkington <epilkington@apple.com> Azhar Mohammed <azhar@apple.com>
[Pipeline] } [Pipeline] // stage [Pipeline] } [Pipeline] // withEnv [Pipeline] } [Pipeline] // node [Pipeline] End of Pipeline ERROR: script returned exit code 1 Finished: FAILURE