FailedConsole Output

Skipping 17 KB.. Full Log
s, sphinx, sphinx-bootstrap-theme
Successfully installed Pygments-2.4.2 alabaster-0.7.12 babel-2.7.0 docutils-0.15.2 imagesize-1.1.0 packaging-19.2 pep8-1.7.1 pyparsing-2.4.2 snowballstemmer-2.0.0 sphinx-1.8.5 sphinx-bootstrap-theme-0.7.1 sphinxcontrib-websupport-1.1.2
+ /Users/buildslave/jenkins/workspace/LNT_Tests/venv/bin/pip install mysql-python
DEPRECATION: Python 2.7 will reach the end of its life on January 1st, 2020. Please upgrade your Python as Python 2.7 won't be maintained after that date. A future version of pip will drop support for Python 2.7. More details about Python 2 support in pip, can be found at https://pip.pypa.io/en/latest/development/release-process/#python-2-support
Processing /Users/buildslave/Library/Caches/pip/wheels/07/d2/5f/314860e4cb53a44bf0ee0d051d4b34465e4b4fbe9de6d42f42/MySQL_python-1.2.5-cp27-cp27m-macosx_10_10_x86_64.whl
Installing collected packages: mysql-python
Successfully installed mysql-python-1.2.5
+ killall mysqld
No matching processes belonging to you were found
+ true
+ /Users/buildslave/jenkins/workspace/LNT_Tests/venv/bin/python setup.py develop
running develop
running egg_info
writing requirements to LNT.egg-info/requires.txt
writing LNT.egg-info/PKG-INFO
writing top-level names to LNT.egg-info/top_level.txt
writing dependency_links to LNT.egg-info/dependency_links.txt
writing entry points to LNT.egg-info/entry_points.txt
reading manifest file 'LNT.egg-info/SOURCES.txt'
reading manifest template 'MANIFEST.in'
no previously-included directories found matching 'tests/*/Output'
writing manifest file 'LNT.egg-info/SOURCES.txt'
running build_ext
copying build/lib.macosx-10.10-x86_64-2.7/lnt/testing/profile/cPerf.so -> lnt/testing/profile
Creating /Users/buildslave/jenkins/workspace/LNT_Tests/venv/lib/python2.7/site-packages/LNT.egg-link (link to .)
Adding LNT 0.4.2.dev0 to easy-install.pth file
Installing lnt script to /Users/buildslave/jenkins/workspace/LNT_Tests/venv/bin

Hide Details

Installed /Users/buildslave/jenkins/workspace/LNT_Tests/llvm-lnt Processing dependencies for LNT==0.4.2.dev0 Searching for lit==0.10.0.dev0 Best match: lit 0.10.0.dev0 lit 0.10.0.dev0 is already the active version in easy-install.pth Installing lit script to /Users/buildslave/jenkins/workspace/LNT_Tests/venv/bin

Hide Details

Using /Users/buildslave/jenkins/workspace/LNT_Tests/venv/src/lit Searching for future==0.18.0 Best match: future 0.18.0 Adding future 0.18.0 to easy-install.pth file Installing pasteurize script to /Users/buildslave/jenkins/workspace/LNT_Tests/venv/bin Installing futurize script to /Users/buildslave/jenkins/workspace/LNT_Tests/venv/bin

Hide Details

Using /Users/buildslave/jenkins/workspace/LNT_Tests/venv/lib/python2.7/site-packages Searching for requests==2.22.0 Best match: requests 2.22.0 Adding requests 2.22.0 to easy-install.pth file

Hide Details

Using /Users/buildslave/jenkins/workspace/LNT_Tests/venv/lib/python2.7/site-packages Searching for PyYAML==3.13 Best match: PyYAML 3.13 Adding PyYAML 3.13 to easy-install.pth file

Hide Details

Using /Users/buildslave/jenkins/workspace/LNT_Tests/venv/lib/python2.7/site-packages Searching for click==6.7 Best match: click 6.7 Adding click 6.7 to easy-install.pth file

Hide Details

Using /Users/buildslave/jenkins/workspace/LNT_Tests/venv/lib/python2.7/site-packages Searching for typing==3.7.4.1 Best match: typing 3.7.4.1 Adding typing 3.7.4.1 to easy-install.pth file

Hide Details

Using /Users/buildslave/jenkins/workspace/LNT_Tests/venv/lib/python2.7/site-packages Searching for Flask-WTF==0.12 Best match: Flask-WTF 0.12 Adding Flask-WTF 0.12 to easy-install.pth file

Hide Details

Using /Users/buildslave/jenkins/workspace/LNT_Tests/venv/lib/python2.7/site-packages Searching for WTForms==2.0.2 Best match: WTForms 2.0.2 Adding WTForms 2.0.2 to easy-install.pth file

Hide Details

Using /Users/buildslave/jenkins/workspace/LNT_Tests/venv/lib/python2.7/site-packages Searching for pytz==2016.10 Best match: pytz 2016.10 Adding pytz 2016.10 to easy-install.pth file

Hide Details

Using /Users/buildslave/jenkins/workspace/LNT_Tests/venv/lib/python2.7/site-packages Searching for python-gnupg==0.3.7 Best match: python-gnupg 0.3.7 Adding python-gnupg 0.3.7 to easy-install.pth file

Hide Details

Using /Users/buildslave/jenkins/workspace/LNT_Tests/venv/lib/python2.7/site-packages Searching for python-dateutil==2.6.0 Best match: python-dateutil 2.6.0 Adding python-dateutil 2.6.0 to easy-install.pth file

Hide Details

Using /Users/buildslave/jenkins/workspace/LNT_Tests/venv/lib/python2.7/site-packages Searching for itsdangerous==0.24 Best match: itsdangerous 0.24 Adding itsdangerous 0.24 to easy-install.pth file

Hide Details

Using /Users/buildslave/jenkins/workspace/LNT_Tests/venv/lib/python2.7/site-packages Searching for Werkzeug==0.12.2 Best match: Werkzeug 0.12.2 Adding Werkzeug 0.12.2 to easy-install.pth file

Hide Details

Using /Users/buildslave/jenkins/workspace/LNT_Tests/venv/lib/python2.7/site-packages Searching for SQLAlchemy==1.1.11 Best match: SQLAlchemy 1.1.11 Adding SQLAlchemy 1.1.11 to easy-install.pth file

Hide Details

Using /Users/buildslave/jenkins/workspace/LNT_Tests/venv/lib/python2.7/site-packages Searching for MarkupSafe==0.23 Best match: MarkupSafe 0.23 Adding MarkupSafe 0.23 to easy-install.pth file

Hide Details

Using /Users/buildslave/jenkins/workspace/LNT_Tests/venv/lib/python2.7/site-packages Searching for Jinja2==2.7.2 Best match: Jinja2 2.7.2 Adding Jinja2 2.7.2 to easy-install.pth file

Hide Details

Using /Users/buildslave/jenkins/workspace/LNT_Tests/venv/lib/python2.7/site-packages Searching for Flask-RESTful==0.3.4 Best match: Flask-RESTful 0.3.4 Adding Flask-RESTful 0.3.4 to easy-install.pth file

Hide Details

Using /Users/buildslave/jenkins/workspace/LNT_Tests/venv/lib/python2.7/site-packages Searching for Flask==0.12.2 Best match: Flask 0.12.2 Adding Flask 0.12.2 to easy-install.pth file Installing flask script to /Users/buildslave/jenkins/workspace/LNT_Tests/venv/bin

Hide Details

Using /Users/buildslave/jenkins/workspace/LNT_Tests/venv/lib/python2.7/site-packages Searching for aniso8601==1.2.0 Best match: aniso8601 1.2.0 Adding aniso8601 1.2.0 to easy-install.pth file

Hide Details

Using /Users/buildslave/jenkins/workspace/LNT_Tests/venv/lib/python2.7/site-packages Searching for six==1.12.0 Best match: six 1.12.0 Adding six 1.12.0 to easy-install.pth file

Hide Details

Using /Users/buildslave/jenkins/workspace/LNT_Tests/venv/lib/python2.7/site-packages Searching for urllib3==1.25.6 Best match: urllib3 1.25.6 Adding urllib3 1.25.6 to easy-install.pth file

Hide Details

Using /Users/buildslave/jenkins/workspace/LNT_Tests/venv/lib/python2.7/site-packages Searching for certifi==2019.9.11 Best match: certifi 2019.9.11 Adding certifi 2019.9.11 to easy-install.pth file

Hide Details

Using /Users/buildslave/jenkins/workspace/LNT_Tests/venv/lib/python2.7/site-packages Searching for chardet==3.0.4 Best match: chardet 3.0.4 Adding chardet 3.0.4 to easy-install.pth file Installing chardetect script to /Users/buildslave/jenkins/workspace/LNT_Tests/venv/bin

Hide Details

Using /Users/buildslave/jenkins/workspace/LNT_Tests/venv/lib/python2.7/site-packages Searching for idna==2.8 Best match: idna 2.8 Adding idna 2.8 to easy-install.pth file

Hide Details

Using /Users/buildslave/jenkins/workspace/LNT_Tests/venv/lib/python2.7/site-packages Finished processing dependencies for LNT==0.4.2.dev0 + cd .. + cd /Users/buildslave/jenkins/workspace/LNT_Tests/llvm-project/llvm/utils/lit + /Users/buildslave/jenkins/workspace/LNT_Tests/venv/bin/python setup.py install /Users/buildslave/jenkins/workspace/LNT_Tests/venv/lib/python2.7/site-packages/setuptools/dist.py:475: UserWarning: Normalizing '0.10.0dev' to '0.10.0.dev0' normalized_version, running install running bdist_egg running egg_info writing lit.egg-info/PKG-INFO writing top-level names to lit.egg-info/top_level.txt writing dependency_links to lit.egg-info/dependency_links.txt writing entry points to lit.egg-info/entry_points.txt reading manifest file 'lit.egg-info/SOURCES.txt' reading manifest template 'MANIFEST.in' warning: no files found matching 'TODO' warning: no previously-included files matching '*pyc' found anywhere in distribution warning: no previously-included files matching '*~' found anywhere in distribution no previously-included directories found matching 'tests/Output' no previously-included directories found matching 'tests/*/Output' no previously-included directories found matching 'tests/*/*/Output' no previously-included directories found matching 'tests/*/*/*/Output' writing manifest file 'lit.egg-info/SOURCES.txt' installing library code to build/bdist.macosx-10.10-x86_64/egg running install_lib running build_py creating build/bdist.macosx-10.10-x86_64/egg creating build/bdist.macosx-10.10-x86_64/egg/lit copying build/lib/lit/__init__.py -> build/bdist.macosx-10.10-x86_64/egg/lit copying build/lib/lit/BooleanExpression.py -> build/bdist.macosx-10.10-x86_64/egg/lit creating build/bdist.macosx-10.10-x86_64/egg/lit/builtin_commands copying build/lib/lit/builtin_commands/__init__.py -> build/bdist.macosx-10.10-x86_64/egg/lit/builtin_commands copying build/lib/lit/builtin_commands/cat.py -> build/bdist.macosx-10.10-x86_64/egg/lit/builtin_commands copying build/lib/lit/cl_arguments.py -> build/bdist.macosx-10.10-x86_64/egg/lit copying build/lib/lit/discovery.py -> build/bdist.macosx-10.10-x86_64/egg/lit copying build/lib/lit/display.py -> build/bdist.macosx-10.10-x86_64/egg/lit creating build/bdist.macosx-10.10-x86_64/egg/lit/formats copying build/lib/lit/formats/__init__.py -> build/bdist.macosx-10.10-x86_64/egg/lit/formats copying build/lib/lit/formats/base.py -> build/bdist.macosx-10.10-x86_64/egg/lit/formats copying build/lib/lit/formats/googletest.py -> build/bdist.macosx-10.10-x86_64/egg/lit/formats copying build/lib/lit/formats/shtest.py -> build/bdist.macosx-10.10-x86_64/egg/lit/formats copying build/lib/lit/LitConfig.py -> build/bdist.macosx-10.10-x86_64/egg/lit copying build/lib/lit/LitTestCase.py -> build/bdist.macosx-10.10-x86_64/egg/lit creating build/bdist.macosx-10.10-x86_64/egg/lit/llvm copying build/lib/lit/llvm/__init__.py -> build/bdist.macosx-10.10-x86_64/egg/lit/llvm copying build/lib/lit/llvm/config.py -> build/bdist.macosx-10.10-x86_64/egg/lit/llvm copying build/lib/lit/llvm/subst.py -> build/bdist.macosx-10.10-x86_64/egg/lit/llvm copying build/lib/lit/main.py -> build/bdist.macosx-10.10-x86_64/egg/lit copying build/lib/lit/ProgressBar.py -> build/bdist.macosx-10.10-x86_64/egg/lit copying build/lib/lit/run.py -> build/bdist.macosx-10.10-x86_64/egg/lit copying build/lib/lit/ShCommands.py -> build/bdist.macosx-10.10-x86_64/egg/lit copying build/lib/lit/ShUtil.py -> build/bdist.macosx-10.10-x86_64/egg/lit copying build/lib/lit/Test.py -> build/bdist.macosx-10.10-x86_64/egg/lit copying build/lib/lit/TestingConfig.py -> build/bdist.macosx-10.10-x86_64/egg/lit copying build/lib/lit/TestRunner.py -> build/bdist.macosx-10.10-x86_64/egg/lit copying build/lib/lit/util.py -> build/bdist.macosx-10.10-x86_64/egg/lit copying build/lib/lit/worker.py -> build/bdist.macosx-10.10-x86_64/egg/lit byte-compiling build/bdist.macosx-10.10-x86_64/egg/lit/__init__.py to __init__.pyc byte-compiling build/bdist.macosx-10.10-x86_64/egg/lit/BooleanExpression.py to BooleanExpression.pyc byte-compiling build/bdist.macosx-10.10-x86_64/egg/lit/builtin_commands/__init__.py to __init__.pyc byte-compiling build/bdist.macosx-10.10-x86_64/egg/lit/builtin_commands/cat.py to cat.pyc byte-compiling build/bdist.macosx-10.10-x86_64/egg/lit/cl_arguments.py to cl_arguments.pyc byte-compiling build/bdist.macosx-10.10-x86_64/egg/lit/discovery.py to discovery.pyc byte-compiling build/bdist.macosx-10.10-x86_64/egg/lit/display.py to display.pyc byte-compiling build/bdist.macosx-10.10-x86_64/egg/lit/formats/__init__.py to __init__.pyc byte-compiling build/bdist.macosx-10.10-x86_64/egg/lit/formats/base.py to base.pyc byte-compiling build/bdist.macosx-10.10-x86_64/egg/lit/formats/googletest.py to googletest.pyc byte-compiling build/bdist.macosx-10.10-x86_64/egg/lit/formats/shtest.py to shtest.pyc byte-compiling build/bdist.macosx-10.10-x86_64/egg/lit/LitConfig.py to LitConfig.pyc byte-compiling build/bdist.macosx-10.10-x86_64/egg/lit/LitTestCase.py to LitTestCase.pyc byte-compiling build/bdist.macosx-10.10-x86_64/egg/lit/llvm/__init__.py to __init__.pyc byte-compiling build/bdist.macosx-10.10-x86_64/egg/lit/llvm/config.py to config.pyc byte-compiling build/bdist.macosx-10.10-x86_64/egg/lit/llvm/subst.py to subst.pyc byte-compiling build/bdist.macosx-10.10-x86_64/egg/lit/main.py to main.pyc byte-compiling build/bdist.macosx-10.10-x86_64/egg/lit/ProgressBar.py to ProgressBar.pyc byte-compiling build/bdist.macosx-10.10-x86_64/egg/lit/run.py to run.pyc byte-compiling build/bdist.macosx-10.10-x86_64/egg/lit/ShCommands.py to ShCommands.pyc byte-compiling build/bdist.macosx-10.10-x86_64/egg/lit/ShUtil.py to ShUtil.pyc byte-compiling build/bdist.macosx-10.10-x86_64/egg/lit/Test.py to Test.pyc byte-compiling build/bdist.macosx-10.10-x86_64/egg/lit/TestingConfig.py to TestingConfig.pyc byte-compiling build/bdist.macosx-10.10-x86_64/egg/lit/TestRunner.py to TestRunner.pyc byte-compiling build/bdist.macosx-10.10-x86_64/egg/lit/util.py to util.pyc byte-compiling build/bdist.macosx-10.10-x86_64/egg/lit/worker.py to worker.pyc creating build/bdist.macosx-10.10-x86_64/egg/EGG-INFO copying lit.egg-info/PKG-INFO -> build/bdist.macosx-10.10-x86_64/egg/EGG-INFO copying lit.egg-info/SOURCES.txt -> build/bdist.macosx-10.10-x86_64/egg/EGG-INFO copying lit.egg-info/dependency_links.txt -> build/bdist.macosx-10.10-x86_64/egg/EGG-INFO copying lit.egg-info/entry_points.txt -> build/bdist.macosx-10.10-x86_64/egg/EGG-INFO copying lit.egg-info/not-zip-safe -> build/bdist.macosx-10.10-x86_64/egg/EGG-INFO copying lit.egg-info/top_level.txt -> build/bdist.macosx-10.10-x86_64/egg/EGG-INFO creating 'dist/lit-0.10.0.dev0-py2.7.egg' and adding 'build/bdist.macosx-10.10-x86_64/egg' to it removing 'build/bdist.macosx-10.10-x86_64/egg' (and everything under it) Processing lit-0.10.0.dev0-py2.7.egg creating /Users/buildslave/jenkins/workspace/LNT_Tests/venv/lib/python2.7/site-packages/lit-0.10.0.dev0-py2.7.egg Extracting lit-0.10.0.dev0-py2.7.egg to /Users/buildslave/jenkins/workspace/LNT_Tests/venv/lib/python2.7/site-packages Removing lit 0.10.0.dev0 from easy-install.pth file Adding lit 0.10.0.dev0 to easy-install.pth file Installing lit script to /Users/buildslave/jenkins/workspace/LNT_Tests/venv/bin

Hide Details

Installed /Users/buildslave/jenkins/workspace/LNT_Tests/venv/lib/python2.7/site-packages/lit-0.10.0.dev0-py2.7.egg Processing dependencies for lit==0.10.0.dev0 Finished processing dependencies for lit==0.10.0.dev0 + cd .. + cd /Users/buildslave/jenkins/workspace/LNT_Tests/llvm-lnt/tests/ + echo @@@@@@ @@@@@@ + echo '@@@ Test LNT @@@'
Test LNT

Hide Details

@@@ Test LNT @@@ + rm -rf test_run_tmp + /Users/buildslave/jenkins/workspace/LNT_Tests/venv/bin/lit -j1 --xunit-xml-output=/Users/buildslave/jenkins/workspace/LNT_Tests/lnt.xunit.xml -v --param postgres=True --param mysql=True . -- Testing: 72 tests, 1 workers -- PASS: LNT :: Formats/json.py (1 of 72) PASS: LNT :: Formats/plist.py (2 of 72) FAIL: LNT :: lnttool/MySQLDB.shtest (3 of 72) ******************** TEST 'LNT :: lnttool/MySQLDB.shtest' FAILED ******************** Script: -- : 'RUN: at line 2'; rm -rf "/Users/buildslave/jenkins/workspace/LNT_Tests/llvm-lnt/tests/test_run_tmp/lnttool/Output/MySQLDB.shtest.tmp.install" : 'RUN: at line 3'; /Users/buildslave/jenkins/workspace/LNT_Tests/llvm-lnt/tests/../tests/SharedInputs/mysql_wrapper.sh "/Users/buildslave/jenkins/workspace/LNT_Tests/llvm-lnt/tests/test_run_tmp/lnttool/Output/MySQLDB.shtest.tmp.install" 9109 /bin/sh /Users/buildslave/jenkins/workspace/LNT_Tests/llvm-lnt/tests/lnttool/MySQLDB.shtest "/Users/buildslave/jenkins/workspace/LNT_Tests/llvm-lnt/tests/test_run_tmp/lnttool/Output/MySQLDB.shtest.tmp.install" "/Users/buildslave/jenkins/workspace/LNT_Tests/llvm-lnt/tests/../tests/SharedInputs" -- Exit Code: 1

Hide Details

Command Output (stdout): -- $ ":" "RUN: at line 2" $ "rm" "-rf" "/Users/buildslave/jenkins/workspace/LNT_Tests/llvm-lnt/tests/test_run_tmp/lnttool/Output/MySQLDB.shtest.tmp.install" $ ":" "RUN: at line 3" $ "/Users/buildslave/jenkins/workspace/LNT_Tests/llvm-lnt/tests/../tests/SharedInputs/mysql_wrapper.sh" "/Users/buildslave/jenkins/workspace/LNT_Tests/llvm-lnt/tests/test_run_tmp/lnttool/Output/MySQLDB.shtest.tmp.install" "9109" "/bin/sh" "/Users/buildslave/jenkins/workspace/LNT_Tests/llvm-lnt/tests/lnttool/MySQLDB.shtest" "/Users/buildslave/jenkins/workspace/LNT_Tests/llvm-lnt/tests/test_run_tmp/lnttool/Output/MySQLDB.shtest.tmp.install" "/Users/buildslave/jenkins/workspace/LNT_Tests/llvm-lnt/tests/../tests/SharedInputs" # command output: $ mysqld --defaults-file="/Users/buildslave/jenkins/workspace/LNT_Tests/llvm-lnt/tests/test_run_tmp/lnttool/Output/MySQLDB.shtest.tmp.install/etc/my.cnf" --initialize-insecure --user=buildslave --datadir="/Users/buildslave/jenkins/workspace/LNT_Tests/llvm-lnt/tests/test_run_tmp/lnttool/Output/MySQLDB.shtest.tmp.install/data" >& "/Users/buildslave/jenkins/workspace/LNT_Tests/llvm-lnt/tests/test_run_tmp/lnttool/Output/MySQLDB.shtest.tmp.install/install_db.log" $ mysqld --defaults-file="/Users/buildslave/jenkins/workspace/LNT_Tests/llvm-lnt/tests/test_run_tmp/lnttool/Output/MySQLDB.shtest.tmp.install/etc/my.cnf" --datadir="/Users/buildslave/jenkins/workspace/LNT_Tests/llvm-lnt/tests/test_run_tmp/lnttool/Output/MySQLDB.shtest.tmp.install/data" --pid-file="/Users/buildslave/jenkins/workspace/LNT_Tests/llvm-lnt/tests/test_run_tmp/lnttool/Output/MySQLDB.shtest.tmp.install/mysqld.pid" --log-error="/Users/buildslave/jenkins/workspace/LNT_Tests/llvm-lnt/tests/test_run_tmp/lnttool/Output/MySQLDB.shtest.tmp.install/mysqld.error.log"& $ mysqladmin --defaults-file="/Users/buildslave/jenkins/workspace/LNT_Tests/llvm-lnt/tests/test_run_tmp/lnttool/Output/MySQLDB.shtest.tmp.install/etc/my.cnf" -h 127.0.0.1 -P 9109 -u root status $ mysqladmin --defaults-file="/Users/buildslave/jenkins/workspace/LNT_Tests/llvm-lnt/tests/test_run_tmp/lnttool/Output/MySQLDB.shtest.tmp.install/etc/my.cnf" -h 127.0.0.1 -P 9109 -u root status $ mysqladmin --defaults-file="/Users/buildslave/jenkins/workspace/LNT_Tests/llvm-lnt/tests/test_run_tmp/lnttool/Output/MySQLDB.shtest.tmp.install/etc/my.cnf" -h 127.0.0.1 -P 9109 -u root status $ mysqladmin --defaults-file="/Users/buildslave/jenkins/workspace/LNT_Tests/llvm-lnt/tests/test_run_tmp/lnttool/Output/MySQLDB.shtest.tmp.install/etc/my.cnf" -h 127.0.0.1 -P 9109 -u root status $ mysqladmin --defaults-file="/Users/buildslave/jenkins/workspace/LNT_Tests/llvm-lnt/tests/test_run_tmp/lnttool/Output/MySQLDB.shtest.tmp.install/etc/my.cnf" -h 127.0.0.1 -P 9109 -u root status $ mysqladmin --defaults-file="/Users/buildslave/jenkins/workspace/LNT_Tests/llvm-lnt/tests/test_run_tmp/lnttool/Output/MySQLDB.shtest.tmp.install/etc/my.cnf" -h 127.0.0.1 -P 9109 -u root status $ mysqladmin --defaults-file="/Users/buildslave/jenkins/workspace/LNT_Tests/llvm-lnt/tests/test_run_tmp/lnttool/Output/MySQLDB.shtest.tmp.install/etc/my.cnf" -h 127.0.0.1 -P 9109 -u root status $ mysqladmin --defaults-file="/Users/buildslave/jenkins/workspace/LNT_Tests/llvm-lnt/tests/test_run_tmp/lnttool/Output/MySQLDB.shtest.tmp.install/etc/my.cnf" -h 127.0.0.1 -P 9109 -u root status $ mysqladmin --defaults-file="/Users/buildslave/jenkins/workspace/LNT_Tests/llvm-lnt/tests/test_run_tmp/lnttool/Output/MySQLDB.shtest.tmp.install/etc/my.cnf" -h 127.0.0.1 -P 9109 -u root status $ mysqladmin --defaults-file="/Users/buildslave/jenkins/workspace/LNT_Tests/llvm-lnt/tests/test_run_tmp/lnttool/Output/MySQLDB.shtest.tmp.install/etc/my.cnf" -h 127.0.0.1 -P 9109 -u root status $ mysqladmin --defaults-file="/Users/buildslave/jenkins/workspace/LNT_Tests/llvm-lnt/tests/test_run_tmp/lnttool/Output/MySQLDB.shtest.tmp.install/etc/my.cnf" -h 127.0.0.1 -P 9109 -u root status $ mysqladmin --defaults-file="/Users/buildslave/jenkins/workspace/LNT_Tests/llvm-lnt/tests/test_run_tmp/lnttool/Output/MySQLDB.shtest.tmp.install/etc/my.cnf" -h 127.0.0.1 -P 9109 -u root status $ mysqladmin --defaults-file="/Users/buildslave/jenkins/workspace/LNT_Tests/llvm-lnt/tests/test_run_tmp/lnttool/Output/MySQLDB.shtest.tmp.install/etc/my.cnf" -h 127.0.0.1 -P 9109 -u root status $ mysqladmin --defaults-file="/Users/buildslave/jenkins/workspace/LNT_Tests/llvm-lnt/tests/test_run_tmp/lnttool/Output/MySQLDB.shtest.tmp.install/etc/my.cnf" -h 127.0.0.1 -P 9109 -u root status $ mysqladmin --defaults-file="/Users/buildslave/jenkins/workspace/LNT_Tests/llvm-lnt/tests/test_run_tmp/lnttool/Output/MySQLDB.shtest.tmp.install/etc/my.cnf" -h 127.0.0.1 -P 9109 -u root status $ mysqladmin --defaults-file="/Users/buildslave/jenkins/workspace/LNT_Tests/llvm-lnt/tests/test_run_tmp/lnttool/Output/MySQLDB.shtest.tmp.install/etc/my.cnf" -h 127.0.0.1 -P 9109 -u root status $ mysqladmin --defaults-file="/Users/buildslave/jenkins/workspace/LNT_Tests/llvm-lnt/tests/test_run_tmp/lnttool/Output/MySQLDB.shtest.tmp.install/etc/my.cnf" -h 127.0.0.1 -P 9109 -u root status $ mysqladmin --defaults-file="/Users/buildslave/jenkins/workspace/LNT_Tests/llvm-lnt/tests/test_run_tmp/lnttool/Output/MySQLDB.shtest.tmp.install/etc/my.cnf" -h 127.0.0.1 -P 9109 -u root status $ mysqladmin --defaults-file="/Users/buildslave/jenkins/workspace/LNT_Tests/llvm-lnt/tests/test_run_tmp/lnttool/Output/MySQLDB.shtest.tmp.install/etc/my.cnf" -h 127.0.0.1 -P 9109 -u root status $ mysqladmin --defaults-file="/Users/buildslave/jenkins/workspace/LNT_Tests/llvm-lnt/tests/test_run_tmp/lnttool/Output/MySQLDB.shtest.tmp.install/etc/my.cnf" -h 127.0.0.1 -P 9109 -u root status $ mysqladmin --defaults-file="/Users/buildslave/jenkins/workspace/LNT_Tests/llvm-lnt/tests/test_run_tmp/lnttool/Output/MySQLDB.shtest.tmp.install/etc/my.cnf" -h 127.0.0.1 -P 9109 -u root status $ mysqladmin --defaults-file="/Users/buildslave/jenkins/workspace/LNT_Tests/llvm-lnt/tests/test_run_tmp/lnttool/Output/MySQLDB.shtest.tmp.install/etc/my.cnf" -h 127.0.0.1 -P 9109 -u root status $ mysqladmin --defaults-file="/Users/buildslave/jenkins/workspace/LNT_Tests/llvm-lnt/tests/test_run_tmp/lnttool/Output/MySQLDB.shtest.tmp.install/etc/my.cnf" -h 127.0.0.1 -P 9109 -u root status $ mysqladmin --defaults-file="/Users/buildslave/jenkins/workspace/LNT_Tests/llvm-lnt/tests/test_run_tmp/lnttool/Output/MySQLDB.shtest.tmp.install/etc/my.cnf" -h 127.0.0.1 -P 9109 -u root status $ mysqladmin --defaults-file="/Users/buildslave/jenkins/workspace/LNT_Tests/llvm-lnt/tests/test_run_tmp/lnttool/Output/MySQLDB.shtest.tmp.install/etc/my.cnf" -h 127.0.0.1 -P 9109 -u root status $ mysqladmin --defaults-file="/Users/buildslave/jenkins/workspace/LNT_Tests/llvm-lnt/tests/test_run_tmp/lnttool/Output/MySQLDB.shtest.tmp.install/etc/my.cnf" -h 127.0.0.1 -P 9109 -u root status $ mysqladmin --defaults-file="/Users/buildslave/jenkins/workspace/LNT_Tests/llvm-lnt/tests/test_run_tmp/lnttool/Output/MySQLDB.shtest.tmp.install/etc/my.cnf" -h 127.0.0.1 -P 9109 -u root status $ mysqladmin --defaults-file="/Users/buildslave/jenkins/workspace/LNT_Tests/llvm-lnt/tests/test_run_tmp/lnttool/Output/MySQLDB.shtest.tmp.install/etc/my.cnf" -h 127.0.0.1 -P 9109 -u root status $ mysqladmin --defaults-file="/Users/buildslave/jenkins/workspace/LNT_Tests/llvm-lnt/tests/test_run_tmp/lnttool/Output/MySQLDB.shtest.tmp.install/etc/my.cnf" -h 127.0.0.1 -P 9109 -u root status $ mysqladmin --defaults-file="/Users/buildslave/jenkins/workspace/LNT_Tests/llvm-lnt/tests/test_run_tmp/lnttool/Output/MySQLDB.shtest.tmp.install/etc/my.cnf" -h 127.0.0.1 -P 9109 -u root status $ mysqladmin --defaults-file="/Users/buildslave/jenkins/workspace/LNT_Tests/llvm-lnt/tests/test_run_tmp/lnttool/Output/MySQLDB.shtest.tmp.install/etc/my.cnf" -h 127.0.0.1 -P 9109 -u root status $ mysqladmin --defaults-file="/Users/buildslave/jenkins/workspace/LNT_Tests/llvm-lnt/tests/test_run_tmp/lnttool/Output/MySQLDB.shtest.tmp.install/etc/my.cnf" -h 127.0.0.1 -P 9109 -u root status $ mysqladmin --defaults-file="/Users/buildslave/jenkins/workspace/LNT_Tests/llvm-lnt/tests/test_run_tmp/lnttool/Output/MySQLDB.shtest.tmp.install/etc/my.cnf" -h 127.0.0.1 -P 9109 -u root status $ mysqladmin --defaults-file="/Users/buildslave/jenkins/workspace/LNT_Tests/llvm-lnt/tests/test_run_tmp/lnttool/Output/MySQLDB.shtest.tmp.install/etc/my.cnf" -h 127.0.0.1 -P 9109 -u root status $ mysqladmin --defaults-file="/Users/buildslave/jenkins/workspace/LNT_Tests/llvm-lnt/tests/test_run_tmp/lnttool/Output/MySQLDB.shtest.tmp.install/etc/my.cnf" -h 127.0.0.1 -P 9109 -u root status $ mysqladmin --defaults-file="/Users/buildslave/jenkins/workspace/LNT_Tests/llvm-lnt/tests/test_run_tmp/lnttool/Output/MySQLDB.shtest.tmp.install/etc/my.cnf" -h 127.0.0.1 -P 9109 -u root status $ mysqladmin --defaults-file="/Users/buildslave/jenkins/workspace/LNT_Tests/llvm-lnt/tests/test_run_tmp/lnttool/Output/MySQLDB.shtest.tmp.install/etc/my.cnf" -h 127.0.0.1 -P 9109 -u root status $ mysqladmin --defaults-file="/Users/buildslave/jenkins/workspace/LNT_Tests/llvm-lnt/tests/test_run_tmp/lnttool/Output/MySQLDB.shtest.tmp.install/etc/my.cnf" -h 127.0.0.1 -P 9109 -u root status $ mysqladmin --defaults-file="/Users/buildslave/jenkins/workspace/LNT_Tests/llvm-lnt/tests/test_run_tmp/lnttool/Output/MySQLDB.shtest.tmp.install/etc/my.cnf" -h 127.0.0.1 -P 9109 -u root status $ mysqladmin --defaults-file="/Users/buildslave/jenkins/workspace/LNT_Tests/llvm-lnt/tests/test_run_tmp/lnttool/Output/MySQLDB.shtest.tmp.install/etc/my.cnf" -h 127.0.0.1 -P 9109 -u root status $ mysqladmin --defaults-file="/Users/buildslave/jenkins/workspace/LNT_Tests/llvm-lnt/tests/test_run_tmp/lnttool/Output/MySQLDB.shtest.tmp.install/etc/my.cnf" -h 127.0.0.1 -P 9109 -u root status $ mysqladmin --defaults-file="/Users/buildslave/jenkins/workspace/LNT_Tests/llvm-lnt/tests/test_run_tmp/lnttool/Output/MySQLDB.shtest.tmp.install/etc/my.cnf" -h 127.0.0.1 -P 9109 -u root status $ mysqladmin --defaults-file="/Users/buildslave/jenkins/workspace/LNT_Tests/llvm-lnt/tests/test_run_tmp/lnttool/Output/MySQLDB.shtest.tmp.install/etc/my.cnf" -h 127.0.0.1 -P 9109 -u root status $ mysqladmin --defaults-file="/Users/buildslave/jenkins/workspace/LNT_Tests/llvm-lnt/tests/test_run_tmp/lnttool/Output/MySQLDB.shtest.tmp.install/etc/my.cnf" -h 127.0.0.1 -P 9109 -u root status $ mysqladmin --defaults-file="/Users/buildslave/jenkins/workspace/LNT_Tests/llvm-lnt/tests/test_run_tmp/lnttool/Output/MySQLDB.shtest.tmp.install/etc/my.cnf" -h 127.0.0.1 -P 9109 -u root status $ mysqladmin --defaults-file="/Users/buildslave/jenkins/workspace/LNT_Tests/llvm-lnt/tests/test_run_tmp/lnttool/Output/MySQLDB.shtest.tmp.install/etc/my.cnf" -h 127.0.0.1 -P 9109 -u root status $ mysqladmin --defaults-file="/Users/buildslave/jenkins/workspace/LNT_Tests/llvm-lnt/tests/test_run_tmp/lnttool/Output/MySQLDB.shtest.tmp.install/etc/my.cnf" -h 127.0.0.1 -P 9109 -u root status $ mysqladmin --defaults-file="/Users/buildslave/jenkins/workspace/LNT_Tests/llvm-lnt/tests/test_run_tmp/lnttool/Output/MySQLDB.shtest.tmp.install/etc/my.cnf" -h 127.0.0.1 -P 9109 -u root status $ mysqladmin --defaults-file="/Users/buildslave/jenkins/workspace/LNT_Tests/llvm-lnt/tests/test_run_tmp/lnttool/Output/MySQLDB.shtest.tmp.install/etc/my.cnf" -h 127.0.0.1 -P 9109 -u root status $ mysqladmin --defaults-file="/Users/buildslave/jenkins/workspace/LNT_Tests/llvm-lnt/tests/test_run_tmp/lnttool/Output/MySQLDB.shtest.tmp.install/etc/my.cnf" -h 127.0.0.1 -P 9109 -u root status $ mysqladmin --defaults-file="/Users/buildslave/jenkins/workspace/LNT_Tests/llvm-lnt/tests/test_run_tmp/lnttool/Output/MySQLDB.shtest.tmp.install/etc/my.cnf" -h 127.0.0.1 -P 9109 -u root status $ mysqladmin --defaults-file="/Users/buildslave/jenkins/workspace/LNT_Tests/llvm-lnt/tests/test_run_tmp/lnttool/Output/MySQLDB.shtest.tmp.install/etc/my.cnf" -h 127.0.0.1 -P 9109 -u root status $ mysqladmin --defaults-file="/Users/buildslave/jenkins/workspace/LNT_Tests/llvm-lnt/tests/test_run_tmp/lnttool/Output/MySQLDB.shtest.tmp.install/etc/my.cnf" -h 127.0.0.1 -P 9109 -u root status $ mysqladmin --defaults-file="/Users/buildslave/jenkins/workspace/LNT_Tests/llvm-lnt/tests/test_run_tmp/lnttool/Output/MySQLDB.shtest.tmp.install/etc/my.cnf" -h 127.0.0.1 -P 9109 -u root status $ mysqladmin --defaults-file="/Users/buildslave/jenkins/workspace/LNT_Tests/llvm-lnt/tests/test_run_tmp/lnttool/Output/MySQLDB.shtest.tmp.install/etc/my.cnf" -h 127.0.0.1 -P 9109 -u root status $ mysqladmin --defaults-file="/Users/buildslave/jenkins/workspace/LNT_Tests/llvm-lnt/tests/test_run_tmp/lnttool/Output/MySQLDB.shtest.tmp.install/etc/my.cnf" -h 127.0.0.1 -P 9109 -u root status $ mysqladmin --defaults-file="/Users/buildslave/jenkins/workspace/LNT_Tests/llvm-lnt/tests/test_run_tmp/lnttool/Output/MySQLDB.shtest.tmp.install/etc/my.cnf" -h 127.0.0.1 -P 9109 -u root status $ mysqladmin --defaults-file="/Users/buildslave/jenkins/workspace/LNT_Tests/llvm-lnt/tests/test_run_tmp/lnttool/Output/MySQLDB.shtest.tmp.install/etc/my.cnf" -h 127.0.0.1 -P 9109 -u root status $ mysqladmin --defaults-file="/Users/buildslave/jenkins/workspace/LNT_Tests/llvm-lnt/tests/test_run_tmp/lnttool/Output/MySQLDB.shtest.tmp.install/etc/my.cnf" -h 127.0.0.1 -P 9109 -u root status $ mysqladmin --defaults-file="/Users/buildslave/jenkins/workspace/LNT_Tests/llvm-lnt/tests/test_run_tmp/lnttool/Output/MySQLDB.shtest.tmp.install/etc/my.cnf" -h 127.0.0.1 -P 9109 -u root status $ mysqladmin --defaults-file="/Users/buildslave/jenkins/workspace/LNT_Tests/llvm-lnt/tests/test_run_tmp/lnttool/Output/MySQLDB.shtest.tmp.install/etc/my.cnf" -h 127.0.0.1 -P 9109 -u root status $ mysqladmin --defaults-file="/Users/buildslave/jenkins/workspace/LNT_Tests/llvm-lnt/tests/test_run_tmp/lnttool/Output/MySQLDB.shtest.tmp.install/etc/my.cnf" -h 127.0.0.1 -P 9109 -u root status $ mysqladmin --defaults-file="/Users/buildslave/jenkins/workspace/LNT_Tests/llvm-lnt/tests/test_run_tmp/lnttool/Output/MySQLDB.shtest.tmp.install/etc/my.cnf" -h 127.0.0.1 -P 9109 -u root status $ mysqladmin --defaults-file="/Users/buildslave/jenkins/workspace/LNT_Tests/llvm-lnt/tests/test_run_tmp/lnttool/Output/MySQLDB.shtest.tmp.install/etc/my.cnf" -h 127.0.0.1 -P 9109 -u root status $ mysqladmin --defaults-file="/Users/buildslave/jenkins/workspace/LNT_Tests/llvm-lnt/tests/test_run_tmp/lnttool/Output/MySQLDB.shtest.tmp.install/etc/my.cnf" -h 127.0.0.1 -P 9109 -u root status $ mysqladmin --defaults-file="/Users/buildslave/jenkins/workspace/LNT_Tests/llvm-lnt/tests/test_run_tmp/lnttool/Output/MySQLDB.shtest.tmp.install/etc/my.cnf" -h 127.0.0.1 -P 9109 -u root status $ mysqladmin --defaults-file="/Users/buildslave/jenkins/workspace/LNT_Tests/llvm-lnt/tests/test_run_tmp/lnttool/Output/MySQLDB.shtest.tmp.install/etc/my.cnf" -h 127.0.0.1 -P 9109 -u root status $ mysqladmin --defaults-file="/Users/buildslave/jenkins/workspace/LNT_Tests/llvm-lnt/tests/test_run_tmp/lnttool/Output/MySQLDB.shtest.tmp.install/etc/my.cnf" -h 127.0.0.1 -P 9109 -u root status $ mysqladmin --defaults-file="/Users/buildslave/jenkins/workspace/LNT_Tests/llvm-lnt/tests/test_run_tmp/lnttool/Output/MySQLDB.shtest.tmp.install/etc/my.cnf" -h 127.0.0.1 -P 9109 -u root status $ mysqladmin --defaults-file="/Users/buildslave/jenkins/workspace/LNT_Tests/llvm-lnt/tests/test_run_tmp/lnttool/Output/MySQLDB.shtest.tmp.install/etc/my.cnf" -h 127.0.0.1 -P 9109 -u root status $ mysqladmin --defaults-file="/Users/buildslave/jenkins/workspace/LNT_Tests/llvm-lnt/tests/test_run_tmp/lnttool/Output/MySQLDB.shtest.tmp.install/etc/my.cnf" -h 127.0.0.1 -P 9109 -u root status $ mysqladmin --defaults-file="/Users/buildslave/jenkins/workspace/LNT_Tests/llvm-lnt/tests/test_run_tmp/lnttool/Output/MySQLDB.shtest.tmp.install/etc/my.cnf" -h 127.0.0.1 -P 9109 -u root status $ mysqladmin --defaults-file="/Users/buildslave/jenkins/workspace/LNT_Tests/llvm-lnt/tests/test_run_tmp/lnttool/Output/MySQLDB.shtest.tmp.install/etc/my.cnf" -h 127.0.0.1 -P 9109 -u root status $ mysqladmin --defaults-file="/Users/buildslave/jenkins/workspace/LNT_Tests/llvm-lnt/tests/test_run_tmp/lnttool/Output/MySQLDB.shtest.tmp.install/etc/my.cnf" -h 127.0.0.1 -P 9109 -u root status $ mysqladmin --defaults-file="/Users/buildslave/jenkins/workspace/LNT_Tests/llvm-lnt/tests/test_run_tmp/lnttool/Output/MySQLDB.shtest.tmp.install/etc/my.cnf" -h 127.0.0.1 -P 9109 -u root status $ mysqladmin --defaults-file="/Users/buildslave/jenkins/workspace/LNT_Tests/llvm-lnt/tests/test_run_tmp/lnttool/Output/MySQLDB.shtest.tmp.install/etc/my.cnf" -h 127.0.0.1 -P 9109 -u root status $ mysqladmin --defaults-file="/Users/buildslave/jenkins/workspace/LNT_Tests/llvm-lnt/tests/test_run_tmp/lnttool/Output/MySQLDB.shtest.tmp.install/etc/my.cnf" -h 127.0.0.1 -P 9109 -u root status $ mysqladmin --defaults-file="/Users/buildslave/jenkins/workspace/LNT_Tests/llvm-lnt/tests/test_run_tmp/lnttool/Output/MySQLDB.shtest.tmp.install/etc/my.cnf" -h 127.0.0.1 -P 9109 -u root status $ mysqladmin --defaults-file="/Users/buildslave/jenkins/workspace/LNT_Tests/llvm-lnt/tests/test_run_tmp/lnttool/Output/MySQLDB.shtest.tmp.install/etc/my.cnf" -h 127.0.0.1 -P 9109 -u root status $ mysqladmin --defaults-file="/Users/buildslave/jenkins/workspace/LNT_Tests/llvm-lnt/tests/test_run_tmp/lnttool/Output/MySQLDB.shtest.tmp.install/etc/my.cnf" -h 127.0.0.1 -P 9109 -u root status $ mysqladmin --defaults-file="/Users/buildslave/jenkins/workspace/LNT_Tests/llvm-lnt/tests/test_run_tmp/lnttool/Output/MySQLDB.shtest.tmp.install/etc/my.cnf" -h 127.0.0.1 -P 9109 -u root status $ mysqladmin --defaults-file="/Users/buildslave/jenkins/workspace/LNT_Tests/llvm-lnt/tests/test_run_tmp/lnttool/Output/MySQLDB.shtest.tmp.install/etc/my.cnf" -h 127.0.0.1 -P 9109 -u root status $ mysqladmin --defaults-file="/Users/buildslave/jenkins/workspace/LNT_Tests/llvm-lnt/tests/test_run_tmp/lnttool/Output/MySQLDB.shtest.tmp.install/etc/my.cnf" -h 127.0.0.1 -P 9109 -u root status $ mysqladmin --defaults-file="/Users/buildslave/jenkins/workspace/LNT_Tests/llvm-lnt/tests/test_run_tmp/lnttool/Output/MySQLDB.shtest.tmp.install/etc/my.cnf" -h 127.0.0.1 -P 9109 -u root status $ mysqladmin --defaults-file="/Users/buildslave/jenkins/workspace/LNT_Tests/llvm-lnt/tests/test_run_tmp/lnttool/Output/MySQLDB.shtest.tmp.install/etc/my.cnf" -h 127.0.0.1 -P 9109 -u root status $ mysqladmin --defaults-file="/Users/buildslave/jenkins/workspace/LNT_Tests/llvm-lnt/tests/test_run_tmp/lnttool/Output/MySQLDB.shtest.tmp.install/etc/my.cnf" -h 127.0.0.1 -P 9109 -u root status $ mysqladmin --defaults-file="/Users/buildslave/jenkins/workspace/LNT_Tests/llvm-lnt/tests/test_run_tmp/lnttool/Output/MySQLDB.shtest.tmp.install/etc/my.cnf" -h 127.0.0.1 -P 9109 -u root status $ mysqladmin --defaults-file="/Users/buildslave/jenkins/workspace/LNT_Tests/llvm-lnt/tests/test_run_tmp/lnttool/Output/MySQLDB.shtest.tmp.install/etc/my.cnf" -h 127.0.0.1 -P 9109 -u root status $ mysqladmin --defaults-file="/Users/buildslave/jenkins/workspace/LNT_Tests/llvm-lnt/tests/test_run_tmp/lnttool/Output/MySQLDB.shtest.tmp.install/etc/my.cnf" -h 127.0.0.1 -P 9109 -u root status $ mysqladmin --defaults-file="/Users/buildslave/jenkins/workspace/LNT_Tests/llvm-lnt/tests/test_run_tmp/lnttool/Output/MySQLDB.shtest.tmp.install/etc/my.cnf" -h 127.0.0.1 -P 9109 -u root status $ mysqladmin --defaults-file="/Users/buildslave/jenkins/workspace/LNT_Tests/llvm-lnt/tests/test_run_tmp/lnttool/Output/MySQLDB.shtest.tmp.install/etc/my.cnf" -h 127.0.0.1 -P 9109 -u root status $ mysqladmin --defaults-file="/Users/buildslave/jenkins/workspace/LNT_Tests/llvm-lnt/tests/test_run_tmp/lnttool/Output/MySQLDB.shtest.tmp.install/etc/my.cnf" -h 127.0.0.1 -P 9109 -u root status $ mysqladmin --defaults-file="/Users/buildslave/jenkins/workspace/LNT_Tests/llvm-lnt/tests/test_run_tmp/lnttool/Output/MySQLDB.shtest.tmp.install/etc/my.cnf" -h 127.0.0.1 -P 9109 -u root status $ mysqladmin --defaults-file="/Users/buildslave/jenkins/workspace/LNT_Tests/llvm-lnt/tests/test_run_tmp/lnttool/Output/MySQLDB.shtest.tmp.install/etc/my.cnf" -h 127.0.0.1 -P 9109 -u root status $ mysqladmin --defaults-file="/Users/buildslave/jenkins/workspace/LNT_Tests/llvm-lnt/tests/test_run_tmp/lnttool/Output/MySQLDB.shtest.tmp.install/etc/my.cnf" -h 127.0.0.1 -P 9109 -u root status $ mysqladmin --defaults-file="/Users/buildslave/jenkins/workspace/LNT_Tests/llvm-lnt/tests/test_run_tmp/lnttool/Output/MySQLDB.shtest.tmp.install/etc/my.cnf" -h 127.0.0.1 -P 9109 -u root status $ mysqladmin --defaults-file="/Users/buildslave/jenkins/workspace/LNT_Tests/llvm-lnt/tests/test_run_tmp/lnttool/Output/MySQLDB.shtest.tmp.install/etc/my.cnf" -h 127.0.0.1 -P 9109 -u root status $ mysqladmin --defaults-file="/Users/buildslave/jenkins/workspace/LNT_Tests/llvm-lnt/tests/test_run_tmp/lnttool/Output/MySQLDB.shtest.tmp.install/etc/my.cnf" -h 127.0.0.1 -P 9109 -u root status $ mysqladmin --defaults-file="/Users/buildslave/jenkins/workspace/LNT_Tests/llvm-lnt/tests/test_run_tmp/lnttool/Output/MySQLDB.shtest.tmp.install/etc/my.cnf" -h 127.0.0.1 -P 9109 -u root status $ mysqladmin --defaults-file="/Users/buildslave/jenkins/workspace/LNT_Tests/llvm-lnt/tests/test_run_tmp/lnttool/Output/MySQLDB.shtest.tmp.install/etc/my.cnf" -h 127.0.0.1 -P 9109 -u root status $ mysqladmin --defaults-file="/Users/buildslave/jenkins/workspace/LNT_Tests/llvm-lnt/tests/test_run_tmp/lnttool/Output/MySQLDB.shtest.tmp.install/etc/my.cnf" -h 127.0.0.1 -P 9109 -u root drop --force testdb $ mysqladmin --defaults-file="/Users/buildslave/jenkins/workspace/LNT_Tests/llvm-lnt/tests/test_run_tmp/lnttool/Output/MySQLDB.shtest.tmp.install/etc/my.cnf" -h 127.0.0.1 -P 9109 -u root create testdb

Hide Details

# command stderr: mysqladmin: connect to server at '127.0.0.1' failed error: 'Can't connect to MySQL server on '127.0.0.1' (61)' Check that mysqld is running on 127.0.0.1 and that the port is 9109. You can check this by doing 'telnet 127.0.0.1 9109' mysqladmin: connect to server at '127.0.0.1' failed error: 'Can't connect to MySQL server on '127.0.0.1' (61)' Check that mysqld is running on 127.0.0.1 and that the port is 9109. You can check this by doing 'telnet 127.0.0.1 9109' mysqladmin: connect to server at '127.0.0.1' failed error: 'Can't connect to MySQL server on '127.0.0.1' (60)' Check that mysqld is running on 127.0.0.1 and that the port is 9109. You can check this by doing 'telnet 127.0.0.1 9109' mysqladmin: [ERROR] Could not open required defaults file: /Users/buildslave/jenkins/workspace/LNT_Tests/llvm-lnt/tests/test_run_tmp/lnttool/Output/MySQLDB.shtest.tmp.install/etc/my.cnf mysqladmin: [ERROR] Fatal error in defaults handling. Program aborted! mysqladmin: [ERROR] Could not open required defaults file: /Users/buildslave/jenkins/workspace/LNT_Tests/llvm-lnt/tests/test_run_tmp/lnttool/Output/MySQLDB.shtest.tmp.install/etc/my.cnf mysqladmin: [ERROR] Fatal error in defaults handling. Program aborted! mysqladmin: [ERROR] Could not open required defaults file: /Users/buildslave/jenkins/workspace/LNT_Tests/llvm-lnt/tests/test_run_tmp/lnttool/Output/MySQLDB.shtest.tmp.install/etc/my.cnf mysqladmin: [ERROR] Fatal error in defaults handling. Program aborted! mysqladmin: [ERROR] Could not open required defaults file: /Users/buildslave/jenkins/workspace/LNT_Tests/llvm-lnt/tests/test_run_tmp/lnttool/Output/MySQLDB.shtest.tmp.install/etc/my.cnf mysqladmin: [ERROR] Fatal error in defaults handling. Program aborted! mysqladmin: [ERROR] Could not open required defaults file: /Users/buildslave/jenkins/workspace/LNT_Tests/llvm-lnt/tests/test_run_tmp/lnttool/Output/MySQLDB.shtest.tmp.install/etc/my.cnf mysqladmin: [ERROR] Fatal error in defaults handling. Program aborted! mysqladmin: [ERROR] Could not open required defaults file: /Users/buildslave/jenkins/workspace/LNT_Tests/llvm-lnt/tests/test_run_tmp/lnttool/Output/MySQLDB.shtest.tmp.install/etc/my.cnf mysqladmin: [ERROR] Fatal error in defaults handling. Program aborted! mysqladmin: [ERROR] Could not open required defaults file: /Users/buildslave/jenkins/workspace/LNT_Tests/llvm-lnt/tests/test_run_tmp/lnttool/Output/MySQLDB.shtest.tmp.install/etc/my.cnf mysqladmin: [ERROR] Fatal error in defaults handling. Program aborted! mysqladmin: [ERROR] Could not open required defaults file: /Users/buildslave/jenkins/workspace/LNT_Tests/llvm-lnt/tests/test_run_tmp/lnttool/Output/MySQLDB.shtest.tmp.install/etc/my.cnf mysqladmin: [ERROR] Fatal error in defaults handling. Program aborted! mysqladmin: [ERROR] Could not open required defaults file: /Users/buildslave/jenkins/workspace/LNT_Tests/llvm-lnt/tests/test_run_tmp/lnttool/Output/MySQLDB.shtest.tmp.install/etc/my.cnf mysqladmin: [ERROR] Fatal error in defaults handling. Program aborted! mysqladmin: [ERROR] Could not open required defaults file: /Users/buildslave/jenkins/workspace/LNT_Tests/llvm-lnt/tests/test_run_tmp/lnttool/Output/MySQLDB.shtest.tmp.install/etc/my.cnf mysqladmin: [ERROR] Fatal error in defaults handling. Program aborted! mysqladmin: [ERROR] Could not open required defaults file: /Users/buildslave/jenkins/workspace/LNT_Tests/llvm-lnt/tests/test_run_tmp/lnttool/Output/MySQLDB.shtest.tmp.install/etc/my.cnf mysqladmin: [ERROR] Fatal error in defaults handling. Program aborted! mysqladmin: [ERROR] Could not open required defaults file: /Users/buildslave/jenkins/workspace/LNT_Tests/llvm-lnt/tests/test_run_tmp/lnttool/Output/MySQLDB.shtest.tmp.install/etc/my.cnf mysqladmin: [ERROR] Fatal error in defaults handling. Program aborted! mysqladmin: [ERROR] Could not open required defaults file: /Users/buildslave/jenkins/workspace/LNT_Tests/llvm-lnt/tests/test_run_tmp/lnttool/Output/MySQLDB.shtest.tmp.install/etc/my.cnf mysqladmin: [ERROR] Fatal error in defaults handling. Program aborted! mysqladmin: [ERROR] Could not open required defaults file: /Users/buildslave/jenkins/workspace/LNT_Tests/llvm-lnt/tests/test_run_tmp/lnttool/Output/MySQLDB.shtest.tmp.install/etc/my.cnf mysqladmin: [ERROR] Fatal error in defaults handling. Program aborted! mysqladmin: [ERROR] Could not open required defaults file: /Users/buildslave/jenkins/workspace/LNT_Tests/llvm-lnt/tests/test_run_tmp/lnttool/Output/MySQLDB.shtest.tmp.install/etc/my.cnf mysqladmin: [ERROR] Fatal error in defaults handling. Program aborted! mysqladmin: [ERROR] Could not open required defaults file: /Users/buildslave/jenkins/workspace/LNT_Tests/llvm-lnt/tests/test_run_tmp/lnttool/Output/MySQLDB.shtest.tmp.install/etc/my.cnf mysqladmin: [ERROR] Fatal error in defaults handling. Program aborted! mysqladmin: [ERROR] Could not open required defaults file: /Users/buildslave/jenkins/workspace/LNT_Tests/llvm-lnt/tests/test_run_tmp/lnttool/Output/MySQLDB.shtest.tmp.install/etc/my.cnf mysqladmin: [ERROR] Fatal error in defaults handling. Program aborted! mysqladmin: [ERROR] Could not open required defaults file: /Users/buildslave/jenkins/workspace/LNT_Tests/llvm-lnt/tests/test_run_tmp/lnttool/Output/MySQLDB.shtest.tmp.install/etc/my.cnf mysqladmin: [ERROR] Fatal error in defaults handling. Program aborted! mysqladmin: [ERROR] Could not open required defaults file: /Users/buildslave/jenkins/workspace/LNT_Tests/llvm-lnt/tests/test_run_tmp/lnttool/Output/MySQLDB.shtest.tmp.install/etc/my.cnf mysqladmin: [ERROR] Fatal error in defaults handling. Program aborted! mysqladmin: [ERROR] Could not open required defaults file: /Users/buildslave/jenkins/workspace/LNT_Tests/llvm-lnt/tests/test_run_tmp/lnttool/Output/MySQLDB.shtest.tmp.install/etc/my.cnf mysqladmin: [ERROR] Fatal error in defaults handling. Program aborted! mysqladmin: [ERROR] Could not open required defaults file: /Users/buildslave/jenkins/workspace/LNT_Tests/llvm-lnt/tests/test_run_tmp/lnttool/Output/MySQLDB.shtest.tmp.install/etc/my.cnf mysqladmin: [ERROR] Fatal error in defaults handling. Program aborted! mysqladmin: [ERROR] Could not open required defaults file: /Users/buildslave/jenkins/workspace/LNT_Tests/llvm-lnt/tests/test_run_tmp/lnttool/Output/MySQLDB.shtest.tmp.install/etc/my.cnf mysqladmin: [ERROR] Fatal error in defaults handling. Program aborted! mysqladmin: [ERROR] Could not open required defaults file: /Users/buildslave/jenkins/workspace/LNT_Tests/llvm-lnt/tests/test_run_tmp/lnttool/Output/MySQLDB.shtest.tmp.install/etc/my.cnf mysqladmin: [ERROR] Fatal error in defaults handling. Program aborted! mysqladmin: [ERROR] Could not open required defaults file: /Users/buildslave/jenkins/workspace/LNT_Tests/llvm-lnt/tests/test_run_tmp/lnttool/Output/MySQLDB.shtest.tmp.install/etc/my.cnf mysqladmin: [ERROR] Fatal error in defaults handling. Program aborted! mysqladmin: [ERROR] Could not open required defaults file: /Users/buildslave/jenkins/workspace/LNT_Tests/llvm-lnt/tests/test_run_tmp/lnttool/Output/MySQLDB.shtest.tmp.install/etc/my.cnf mysqladmin: [ERROR] Fatal error in defaults handling. Program aborted! mysqladmin: [ERROR] Could not open required defaults file: /Users/buildslave/jenkins/workspace/LNT_Tests/llvm-lnt/tests/test_run_tmp/lnttool/Output/MySQLDB.shtest.tmp.install/etc/my.cnf mysqladmin: [ERROR] Fatal error in defaults handling. Program aborted! mysqladmin: [ERROR] Could not open required defaults file: /Users/buildslave/jenkins/workspace/LNT_Tests/llvm-lnt/tests/test_run_tmp/lnttool/Output/MySQLDB.shtest.tmp.install/etc/my.cnf mysqladmin: [ERROR] Fatal error in defaults handling. Program aborted! mysqladmin: [ERROR] Could not open required defaults file: /Users/buildslave/jenkins/workspace/LNT_Tests/llvm-lnt/tests/test_run_tmp/lnttool/Output/MySQLDB.shtest.tmp.install/etc/my.cnf mysqladmin: [ERROR] Fatal error in defaults handling. Program aborted! mysqladmin: [ERROR] Could not open required defaults file: /Users/buildslave/jenkins/workspace/LNT_Tests/llvm-lnt/tests/test_run_tmp/lnttool/Output/MySQLDB.shtest.tmp.install/etc/my.cnf mysqladmin: [ERROR] Fatal error in defaults handling. Program aborted! mysqladmin: [ERROR] Could not open required defaults file: /Users/buildslave/jenkins/workspace/LNT_Tests/llvm-lnt/tests/test_run_tmp/lnttool/Output/MySQLDB.shtest.tmp.install/etc/my.cnf mysqladmin: [ERROR] Fatal error in defaults handling. Program aborted! mysqladmin: [ERROR] Could not open required defaults file: /Users/buildslave/jenkins/workspace/LNT_Tests/llvm-lnt/tests/test_run_tmp/lnttool/Output/MySQLDB.shtest.tmp.install/etc/my.cnf mysqladmin: [ERROR] Fatal error in defaults handling. Program aborted! mysqladmin: [ERROR] Could not open required defaults file: /Users/buildslave/jenkins/workspace/LNT_Tests/llvm-lnt/tests/test_run_tmp/lnttool/Output/MySQLDB.shtest.tmp.install/etc/my.cnf mysqladmin: [ERROR] Fatal error in defaults handling. Program aborted! mysqladmin: [ERROR] Could not open required defaults file: /Users/buildslave/jenkins/workspace/LNT_Tests/llvm-lnt/tests/test_run_tmp/lnttool/Output/MySQLDB.shtest.tmp.install/etc/my.cnf mysqladmin: [ERROR] Fatal error in defaults handling. Program aborted! mysqladmin: [ERROR] Could not open required defaults file: /Users/buildslave/jenkins/workspace/LNT_Tests/llvm-lnt/tests/test_run_tmp/lnttool/Output/MySQLDB.shtest.tmp.install/etc/my.cnf mysqladmin: [ERROR] Fatal error in defaults handling. Program aborted! mysqladmin: [ERROR] Could not open required defaults file: /Users/buildslave/jenkins/workspace/LNT_Tests/llvm-lnt/tests/test_run_tmp/lnttool/Output/MySQLDB.shtest.tmp.install/etc/my.cnf mysqladmin: [ERROR] Fatal error in defaults handling. Program aborted! mysqladmin: [ERROR] Could not open required defaults file: /Users/buildslave/jenkins/workspace/LNT_Tests/llvm-lnt/tests/test_run_tmp/lnttool/Output/MySQLDB.shtest.tmp.install/etc/my.cnf mysqladmin: [ERROR] Fatal error in defaults handling. Program aborted! mysqladmin: [ERROR] Could not open required defaults file: /Users/buildslave/jenkins/workspace/LNT_Tests/llvm-lnt/tests/test_run_tmp/lnttool/Output/MySQLDB.shtest.tmp.install/etc/my.cnf mysqladmin: [ERROR] Fatal error in defaults handling. Program aborted! mysqladmin: [ERROR] Could not open required defaults file: /Users/buildslave/jenkins/workspace/LNT_Tests/llvm-lnt/tests/test_run_tmp/lnttool/Output/MySQLDB.shtest.tmp.install/etc/my.cnf mysqladmin: [ERROR] Fatal error in defaults handling. Program aborted! mysqladmin: [ERROR] Could not open required defaults file: /Users/buildslave/jenkins/workspace/LNT_Tests/llvm-lnt/tests/test_run_tmp/lnttool/Output/MySQLDB.shtest.tmp.install/etc/my.cnf mysqladmin: [ERROR] Fatal error in defaults handling. Program aborted! mysqladmin: [ERROR] Could not open required defaults file: /Users/buildslave/jenkins/workspace/LNT_Tests/llvm-lnt/tests/test_run_tmp/lnttool/Output/MySQLDB.shtest.tmp.install/etc/my.cnf mysqladmin: [ERROR] Fatal error in defaults handling. Program aborted! mysqladmin: [ERROR] Could not open required defaults file: /Users/buildslave/jenkins/workspace/LNT_Tests/llvm-lnt/tests/test_run_tmp/lnttool/Output/MySQLDB.shtest.tmp.install/etc/my.cnf mysqladmin: [ERROR] Fatal error in defaults handling. Program aborted! mysqladmin: [ERROR] Could not open required defaults file: /Users/buildslave/jenkins/workspace/LNT_Tests/llvm-lnt/tests/test_run_tmp/lnttool/Output/MySQLDB.shtest.tmp.install/etc/my.cnf mysqladmin: [ERROR] Fatal error in defaults handling. Program aborted! mysqladmin: [ERROR] Could not open required defaults file: /Users/buildslave/jenkins/workspace/LNT_Tests/llvm-lnt/tests/test_run_tmp/lnttool/Output/MySQLDB.shtest.tmp.install/etc/my.cnf mysqladmin: [ERROR] Fatal error in defaults handling. Program aborted! mysqladmin: [ERROR] Could not open required defaults file: /Users/buildslave/jenkins/workspace/LNT_Tests/llvm-lnt/tests/test_run_tmp/lnttool/Output/MySQLDB.shtest.tmp.install/etc/my.cnf mysqladmin: [ERROR] Fatal error in defaults handling. Program aborted! mysqladmin: [ERROR] Could not open required defaults file: /Users/buildslave/jenkins/workspace/LNT_Tests/llvm-lnt/tests/test_run_tmp/lnttool/Output/MySQLDB.shtest.tmp.install/etc/my.cnf mysqladmin: [ERROR] Fatal error in defaults handling. Program aborted! mysqladmin: [ERROR] Could not open required defaults file: /Users/buildslave/jenkins/workspace/LNT_Tests/llvm-lnt/tests/test_run_tmp/lnttool/Output/MySQLDB.shtest.tmp.install/etc/my.cnf mysqladmin: [ERROR] Fatal error in defaults handling. Program aborted! mysqladmin: [ERROR] Could not open required defaults file: /Users/buildslave/jenkins/workspace/LNT_Tests/llvm-lnt/tests/test_run_tmp/lnttool/Output/MySQLDB.shtest.tmp.install/etc/my.cnf mysqladmin: [ERROR] Fatal error in defaults handling. Program aborted! mysqladmin: [ERROR] Could not open required defaults file: /Users/buildslave/jenkins/workspace/LNT_Tests/llvm-lnt/tests/test_run_tmp/lnttool/Output/MySQLDB.shtest.tmp.install/etc/my.cnf mysqladmin: [ERROR] Fatal error in defaults handling. Program aborted! mysqladmin: [ERROR] Could not open required defaults file: /Users/buildslave/jenkins/workspace/LNT_Tests/llvm-lnt/tests/test_run_tmp/lnttool/Output/MySQLDB.shtest.tmp.install/etc/my.cnf mysqladmin: [ERROR] Fatal error in defaults handling. Program aborted! mysqladmin: [ERROR] Could not open required defaults file: /Users/buildslave/jenkins/workspace/LNT_Tests/llvm-lnt/tests/test_run_tmp/lnttool/Output/MySQLDB.shtest.tmp.install/etc/my.cnf mysqladmin: [ERROR] Fatal error in defaults handling. Program aborted! mysqladmin: [ERROR] Could not open required defaults file: /Users/buildslave/jenkins/workspace/LNT_Tests/llvm-lnt/tests/test_run_tmp/lnttool/Output/MySQLDB.shtest.tmp.install/etc/my.cnf mysqladmin: [ERROR] Fatal error in defaults handling. Program aborted! mysqladmin: [ERROR] Could not open required defaults file: /Users/buildslave/jenkins/workspace/LNT_Tests/llvm-lnt/tests/test_run_tmp/lnttool/Output/MySQLDB.shtest.tmp.install/etc/my.cnf mysqladmin: [ERROR] Fatal error in defaults handling. Program aborted! mysqladmin: [ERROR] Could not open required defaults file: /Users/buildslave/jenkins/workspace/LNT_Tests/llvm-lnt/tests/test_run_tmp/lnttool/Output/MySQLDB.shtest.tmp.install/etc/my.cnf mysqladmin: [ERROR] Fatal error in defaults handling. Program aborted! mysqladmin: [ERROR] Could not open required defaults file: /Users/buildslave/jenkins/workspace/LNT_Tests/llvm-lnt/tests/test_run_tmp/lnttool/Output/MySQLDB.shtest.tmp.install/etc/my.cnf mysqladmin: [ERROR] Fatal error in defaults handling. Program aborted! mysqladmin: [ERROR] Could not open required defaults file: /Users/buildslave/jenkins/workspace/LNT_Tests/llvm-lnt/tests/test_run_tmp/lnttool/Output/MySQLDB.shtest.tmp.install/etc/my.cnf mysqladmin: [ERROR] Fatal error in defaults handling. Program aborted! mysqladmin: [ERROR] Could not open required defaults file: /Users/buildslave/jenkins/workspace/LNT_Tests/llvm-lnt/tests/test_run_tmp/lnttool/Output/MySQLDB.shtest.tmp.install/etc/my.cnf mysqladmin: [ERROR] Fatal error in defaults handling. Program aborted! mysqladmin: [ERROR] Could not open required defaults file: /Users/buildslave/jenkins/workspace/LNT_Tests/llvm-lnt/tests/test_run_tmp/lnttool/Output/MySQLDB.shtest.tmp.install/etc/my.cnf mysqladmin: [ERROR] Fatal error in defaults handling. Program aborted! mysqladmin: [ERROR] Could not open required defaults file: /Users/buildslave/jenkins/workspace/LNT_Tests/llvm-lnt/tests/test_run_tmp/lnttool/Output/MySQLDB.shtest.tmp.install/etc/my.cnf mysqladmin: [ERROR] Fatal error in defaults handling. Program aborted! mysqladmin: [ERROR] Could not open required defaults file: /Users/buildslave/jenkins/workspace/LNT_Tests/llvm-lnt/tests/test_run_tmp/lnttool/Output/MySQLDB.shtest.tmp.install/etc/my.cnf mysqladmin: [ERROR] Fatal error in defaults handling. Program aborted! mysqladmin: [ERROR] Could not open required defaults file: /Users/buildslave/jenkins/workspace/LNT_Tests/llvm-lnt/tests/test_run_tmp/lnttool/Output/MySQLDB.shtest.tmp.install/etc/my.cnf mysqladmin: [ERROR] Fatal error in defaults handling. Program aborted! mysqladmin: [ERROR] Could not open required defaults file: /Users/buildslave/jenkins/workspace/LNT_Tests/llvm-lnt/tests/test_run_tmp/lnttool/Output/MySQLDB.shtest.tmp.install/etc/my.cnf mysqladmin: [ERROR] Fatal error in defaults handling. Program aborted! mysqladmin: [ERROR] Could not open required defaults file: /Users/buildslave/jenkins/workspace/LNT_Tests/llvm-lnt/tests/test_run_tmp/lnttool/Output/MySQLDB.shtest.tmp.install/etc/my.cnf mysqladmin: [ERROR] Fatal error in defaults handling. Program aborted! mysqladmin: [ERROR] Could not open required defaults file: /Users/buildslave/jenkins/workspace/LNT_Tests/llvm-lnt/tests/test_run_tmp/lnttool/Output/MySQLDB.shtest.tmp.install/etc/my.cnf mysqladmin: [ERROR] Fatal error in defaults handling. Program aborted! mysqladmin: [ERROR] Could not open required defaults file: /Users/buildslave/jenkins/workspace/LNT_Tests/llvm-lnt/tests/test_run_tmp/lnttool/Output/MySQLDB.shtest.tmp.install/etc/my.cnf mysqladmin: [ERROR] Fatal error in defaults handling. Program aborted! mysqladmin: [ERROR] Could not open required defaults file: /Users/buildslave/jenkins/workspace/LNT_Tests/llvm-lnt/tests/test_run_tmp/lnttool/Output/MySQLDB.shtest.tmp.install/etc/my.cnf mysqladmin: [ERROR] Fatal error in defaults handling. Program aborted! mysqladmin: [ERROR] Could not open required defaults file: /Users/buildslave/jenkins/workspace/LNT_Tests/llvm-lnt/tests/test_run_tmp/lnttool/Output/MySQLDB.shtest.tmp.install/etc/my.cnf mysqladmin: [ERROR] Fatal error in defaults handling. Program aborted! mysqladmin: [ERROR] Could not open required defaults file: /Users/buildslave/jenkins/workspace/LNT_Tests/llvm-lnt/tests/test_run_tmp/lnttool/Output/MySQLDB.shtest.tmp.install/etc/my.cnf mysqladmin: [ERROR] Fatal error in defaults handling. Program aborted! mysqladmin: [ERROR] Could not open required defaults file: /Users/buildslave/jenkins/workspace/LNT_Tests/llvm-lnt/tests/test_run_tmp/lnttool/Output/MySQLDB.shtest.tmp.install/etc/my.cnf mysqladmin: [ERROR] Fatal error in defaults handling. Program aborted! mysqladmin: [ERROR] Could not open required defaults file: /Users/buildslave/jenkins/workspace/LNT_Tests/llvm-lnt/tests/test_run_tmp/lnttool/Output/MySQLDB.shtest.tmp.install/etc/my.cnf mysqladmin: [ERROR] Fatal error in defaults handling. Program aborted! mysqladmin: [ERROR] Could not open required defaults file: /Users/buildslave/jenkins/workspace/LNT_Tests/llvm-lnt/tests/test_run_tmp/lnttool/Output/MySQLDB.shtest.tmp.install/etc/my.cnf mysqladmin: [ERROR] Fatal error in defaults handling. Program aborted! mysqladmin: [ERROR] Could not open required defaults file: /Users/buildslave/jenkins/workspace/LNT_Tests/llvm-lnt/tests/test_run_tmp/lnttool/Output/MySQLDB.shtest.tmp.install/etc/my.cnf mysqladmin: [ERROR] Fatal error in defaults handling. Program aborted! mysqladmin: [ERROR] Could not open required defaults file: /Users/buildslave/jenkins/workspace/LNT_Tests/llvm-lnt/tests/test_run_tmp/lnttool/Output/MySQLDB.shtest.tmp.install/etc/my.cnf mysqladmin: [ERROR] Fatal error in defaults handling. Program aborted! mysqladmin: [ERROR] Could not open required defaults file: /Users/buildslave/jenkins/workspace/LNT_Tests/llvm-lnt/tests/test_run_tmp/lnttool/Output/MySQLDB.shtest.tmp.install/etc/my.cnf mysqladmin: [ERROR] Fatal error in defaults handling. Program aborted! mysqladmin: [ERROR] Could not open required defaults file: /Users/buildslave/jenkins/workspace/LNT_Tests/llvm-lnt/tests/test_run_tmp/lnttool/Output/MySQLDB.shtest.tmp.install/etc/my.cnf mysqladmin: [ERROR] Fatal error in defaults handling. Program aborted! mysqladmin: [ERROR] Could not open required defaults file: /Users/buildslave/jenkins/workspace/LNT_Tests/llvm-lnt/tests/test_run_tmp/lnttool/Output/MySQLDB.shtest.tmp.install/etc/my.cnf mysqladmin: [ERROR] Fatal error in defaults handling. Program aborted! mysqladmin: [ERROR] Could not open required defaults file: /Users/buildslave/jenkins/workspace/LNT_Tests/llvm-lnt/tests/test_run_tmp/lnttool/Output/MySQLDB.shtest.tmp.install/etc/my.cnf mysqladmin: [ERROR] Fatal error in defaults handling. Program aborted! mysqladmin: [ERROR] Could not open required defaults file: /Users/buildslave/jenkins/workspace/LNT_Tests/llvm-lnt/tests/test_run_tmp/lnttool/Output/MySQLDB.shtest.tmp.install/etc/my.cnf mysqladmin: [ERROR] Fatal error in defaults handling. Program aborted! mysqladmin: [ERROR] Could not open required defaults file: /Users/buildslave/jenkins/workspace/LNT_Tests/llvm-lnt/tests/test_run_tmp/lnttool/Output/MySQLDB.shtest.tmp.install/etc/my.cnf mysqladmin: [ERROR] Fatal error in defaults handling. Program aborted! mysqladmin: [ERROR] Could not open required defaults file: /Users/buildslave/jenkins/workspace/LNT_Tests/llvm-lnt/tests/test_run_tmp/lnttool/Output/MySQLDB.shtest.tmp.install/etc/my.cnf mysqladmin: [ERROR] Fatal error in defaults handling. Program aborted! mysqladmin: [ERROR] Could not open required defaults file: /Users/buildslave/jenkins/workspace/LNT_Tests/llvm-lnt/tests/test_run_tmp/lnttool/Output/MySQLDB.shtest.tmp.install/etc/my.cnf mysqladmin: [ERROR] Fatal error in defaults handling. Program aborted! mysqladmin: [ERROR] Could not open required defaults file: /Users/buildslave/jenkins/workspace/LNT_Tests/llvm-lnt/tests/test_run_tmp/lnttool/Output/MySQLDB.shtest.tmp.install/etc/my.cnf mysqladmin: [ERROR] Fatal error in defaults handling. Program aborted! mysqladmin: [ERROR] Could not open required defaults file: /Users/buildslave/jenkins/workspace/LNT_Tests/llvm-lnt/tests/test_run_tmp/lnttool/Output/MySQLDB.shtest.tmp.install/etc/my.cnf mysqladmin: [ERROR] Fatal error in defaults handling. Program aborted! mysqladmin: [ERROR] Could not open required defaults file: /Users/buildslave/jenkins/workspace/LNT_Tests/llvm-lnt/tests/test_run_tmp/lnttool/Output/MySQLDB.shtest.tmp.install/etc/my.cnf mysqladmin: [ERROR] Fatal error in defaults handling. Program aborted! mysqladmin: [ERROR] Could not open required defaults file: /Users/buildslave/jenkins/workspace/LNT_Tests/llvm-lnt/tests/test_run_tmp/lnttool/Output/MySQLDB.shtest.tmp.install/etc/my.cnf mysqladmin: [ERROR] Fatal error in defaults handling. Program aborted! mysqladmin: [ERROR] Could not open required defaults file: /Users/buildslave/jenkins/workspace/LNT_Tests/llvm-lnt/tests/test_run_tmp/lnttool/Output/MySQLDB.shtest.tmp.install/etc/my.cnf mysqladmin: [ERROR] Fatal error in defaults handling. Program aborted! mysqladmin: [ERROR] Could not open required defaults file: /Users/buildslave/jenkins/workspace/LNT_Tests/llvm-lnt/tests/test_run_tmp/lnttool/Output/MySQLDB.shtest.tmp.install/etc/my.cnf mysqladmin: [ERROR] Fatal error in defaults handling. Program aborted! mysqladmin: [ERROR] Could not open required defaults file: /Users/buildslave/jenkins/workspace/LNT_Tests/llvm-lnt/tests/test_run_tmp/lnttool/Output/MySQLDB.shtest.tmp.install/etc/my.cnf mysqladmin: [ERROR] Fatal error in defaults handling. Program aborted! mysqladmin: [ERROR] Could not open required defaults file: /Users/buildslave/jenkins/workspace/LNT_Tests/llvm-lnt/tests/test_run_tmp/lnttool/Output/MySQLDB.shtest.tmp.install/etc/my.cnf mysqladmin: [ERROR] Fatal error in defaults handling. Program aborted! mysqladmin: [ERROR] Could not open required defaults file: /Users/buildslave/jenkins/workspace/LNT_Tests/llvm-lnt/tests/test_run_tmp/lnttool/Output/MySQLDB.shtest.tmp.install/etc/my.cnf mysqladmin: [ERROR] Fatal error in defaults handling. Program aborted! mysqladmin: [ERROR] Could not open required defaults file: /Users/buildslave/jenkins/workspace/LNT_Tests/llvm-lnt/tests/test_run_tmp/lnttool/Output/MySQLDB.shtest.tmp.install/etc/my.cnf mysqladmin: [ERROR] Fatal error in defaults handling. Program aborted! mysqladmin: [ERROR] Could not open required defaults file: /Users/buildslave/jenkins/workspace/LNT_Tests/llvm-lnt/tests/test_run_tmp/lnttool/Output/MySQLDB.shtest.tmp.install/etc/my.cnf mysqladmin: [ERROR] Fatal error in defaults handling. Program aborted! mysqladmin: [ERROR] Could not open required defaults file: /Users/buildslave/jenkins/workspace/LNT_Tests/llvm-lnt/tests/test_run_tmp/lnttool/Output/MySQLDB.shtest.tmp.install/etc/my.cnf mysqladmin: [ERROR] Fatal error in defaults handling. Program aborted! mysqladmin: [ERROR] Could not open required defaults file: /Users/buildslave/jenkins/workspace/LNT_Tests/llvm-lnt/tests/test_run_tmp/lnttool/Output/MySQLDB.shtest.tmp.install/etc/my.cnf mysqladmin: [ERROR] Fatal error in defaults handling. Program aborted! mysqladmin: [ERROR] Could not open required defaults file: /Users/buildslave/jenkins/workspace/LNT_Tests/llvm-lnt/tests/test_run_tmp/lnttool/Output/MySQLDB.shtest.tmp.install/etc/my.cnf mysqladmin: [ERROR] Fatal error in defaults handling. Program aborted! mysqladmin: [ERROR] Could not open required defaults file: /Users/buildslave/jenkins/workspace/LNT_Tests/llvm-lnt/tests/test_run_tmp/lnttool/Output/MySQLDB.shtest.tmp.install/etc/my.cnf mysqladmin: [ERROR] Fatal error in defaults handling. Program aborted! mysqladmin: [ERROR] Could not open required defaults file: /Users/buildslave/jenkins/workspace/LNT_Tests/llvm-lnt/tests/test_run_tmp/lnttool/Output/MySQLDB.shtest.tmp.install/etc/my.cnf mysqladmin: [ERROR] Fatal error in defaults handling. Program aborted! mysqladmin: [ERROR] Could not open required defaults file: /Users/buildslave/jenkins/workspace/LNT_Tests/llvm-lnt/tests/test_run_tmp/lnttool/Output/MySQLDB.shtest.tmp.install/etc/my.cnf mysqladmin: [ERROR] Fatal error in defaults handling. Program aborted! mysqladmin: [ERROR] Could not open required defaults file: /Users/buildslave/jenkins/workspace/LNT_Tests/llvm-lnt/tests/test_run_tmp/lnttool/Output/MySQLDB.shtest.tmp.install/etc/my.cnf mysqladmin: [ERROR] Fatal error in defaults handling. Program aborted!

Hide Details

error: command failed with exit status: 1

Hide Details

--

Hide Details

******************** UNRESOLVED: LNT :: lnttool/PostgresDB.shtest (4 of 72) ******************** TEST 'LNT :: lnttool/PostgresDB.shtest' FAILED ******************** Exception during script execution: Traceback (most recent call last): File "/Users/buildslave/jenkins/workspace/LNT_Tests/venv/lib/python2.7/site-packages/lit-0.10.0.dev0-py2.7.egg/lit/worker.py", line 63, in _execute_test File "/Users/buildslave/jenkins/workspace/LNT_Tests/venv/lib/python2.7/site-packages/lit-0.10.0.dev0-py2.7.egg/lit/formats/shtest.py", line 25, in execute File "/Users/buildslave/jenkins/workspace/LNT_Tests/venv/lib/python2.7/site-packages/lit-0.10.0.dev0-py2.7.egg/lit/TestRunner.py", line 1641, in executeShTest File "/Users/buildslave/jenkins/workspace/LNT_Tests/venv/lib/python2.7/site-packages/lit-0.10.0.dev0-py2.7.egg/lit/TestRunner.py", line 1547, in parseIntegratedTestScript File "/Users/buildslave/jenkins/workspace/LNT_Tests/venv/lib/python2.7/site-packages/lit-0.10.0.dev0-py2.7.egg/lit/TestRunner.py", line 1217, in parseIntegratedTestScriptCommands IOError: [Errno 2] No such file or directory: '/Users/buildslave/jenkins/workspace/LNT_Tests/llvm-lnt/tests/lnttool/PostgresDB.shtest'

Hide Details

Hide Details

******************** UNRESOLVED: LNT :: lnttool/Profile.py (5 of 72) ******************** TEST 'LNT :: lnttool/Profile.py' FAILED ******************** Exception during script execution: Traceback (most recent call last): File "/Users/buildslave/jenkins/workspace/LNT_Tests/venv/lib/python2.7/site-packages/lit-0.10.0.dev0-py2.7.egg/lit/worker.py", line 63, in _execute_test File "/Users/buildslave/jenkins/workspace/LNT_Tests/venv/lib/python2.7/site-packages/lit-0.10.0.dev0-py2.7.egg/lit/formats/shtest.py", line 25, in execute File "/Users/buildslave/jenkins/workspace/LNT_Tests/venv/lib/python2.7/site-packages/lit-0.10.0.dev0-py2.7.egg/lit/TestRunner.py", line 1641, in executeShTest File "/Users/buildslave/jenkins/workspace/LNT_Tests/venv/lib/python2.7/site-packages/lit-0.10.0.dev0-py2.7.egg/lit/TestRunner.py", line 1547, in parseIntegratedTestScript File "/Users/buildslave/jenkins/workspace/LNT_Tests/venv/lib/python2.7/site-packages/lit-0.10.0.dev0-py2.7.egg/lit/TestRunner.py", line 1217, in parseIntegratedTestScriptCommands IOError: [Errno 2] No such file or directory: '/Users/buildslave/jenkins/workspace/LNT_Tests/llvm-lnt/tests/lnttool/Profile.py'

Hide Details

Hide Details

******************** UNRESOLVED: LNT :: lnttool/UpdateDB.py (6 of 72) ******************** TEST 'LNT :: lnttool/UpdateDB.py' FAILED ******************** Exception during script execution: Traceback (most recent call last): File "/Users/buildslave/jenkins/workspace/LNT_Tests/venv/lib/python2.7/site-packages/lit-0.10.0.dev0-py2.7.egg/lit/worker.py", line 63, in _execute_test File "/Users/buildslave/jenkins/workspace/LNT_Tests/venv/lib/python2.7/site-packages/lit-0.10.0.dev0-py2.7.egg/lit/formats/shtest.py", line 25, in execute File "/Users/buildslave/jenkins/workspace/LNT_Tests/venv/lib/python2.7/site-packages/lit-0.10.0.dev0-py2.7.egg/lit/TestRunner.py", line 1641, in executeShTest File "/Users/buildslave/jenkins/workspace/LNT_Tests/venv/lib/python2.7/site-packages/lit-0.10.0.dev0-py2.7.egg/lit/TestRunner.py", line 1547, in parseIntegratedTestScript File "/Users/buildslave/jenkins/workspace/LNT_Tests/venv/lib/python2.7/site-packages/lit-0.10.0.dev0-py2.7.egg/lit/TestRunner.py", line 1217, in parseIntegratedTestScriptCommands IOError: [Errno 2] No such file or directory: '/Users/buildslave/jenkins/workspace/LNT_Tests/llvm-lnt/tests/lnttool/UpdateDB.py'

Hide Details

Hide Details

******************** UNRESOLVED: LNT :: lnttool/admin.shtest (7 of 72) ******************** TEST 'LNT :: lnttool/admin.shtest' FAILED ******************** Exception during script execution: Traceback (most recent call last): File "/Users/buildslave/jenkins/workspace/LNT_Tests/venv/lib/python2.7/site-packages/lit-0.10.0.dev0-py2.7.egg/lit/worker.py", line 63, in _execute_test File "/Users/buildslave/jenkins/workspace/LNT_Tests/venv/lib/python2.7/site-packages/lit-0.10.0.dev0-py2.7.egg/lit/formats/shtest.py", line 25, in execute File "/Users/buildslave/jenkins/workspace/LNT_Tests/venv/lib/python2.7/site-packages/lit-0.10.0.dev0-py2.7.egg/lit/TestRunner.py", line 1641, in executeShTest File "/Users/buildslave/jenkins/workspace/LNT_Tests/venv/lib/python2.7/site-packages/lit-0.10.0.dev0-py2.7.egg/lit/TestRunner.py", line 1547, in parseIntegratedTestScript File "/Users/buildslave/jenkins/workspace/LNT_Tests/venv/lib/python2.7/site-packages/lit-0.10.0.dev0-py2.7.egg/lit/TestRunner.py", line 1217, in parseIntegratedTestScriptCommands IOError: [Errno 2] No such file or directory: '/Users/buildslave/jenkins/workspace/LNT_Tests/llvm-lnt/tests/lnttool/admin.shtest'

Hide Details

Hide Details

******************** UNRESOLVED: LNT :: lnttool/check_no_errors.shtest (8 of 72) ******************** TEST 'LNT :: lnttool/check_no_errors.shtest' FAILED ******************** Exception during script execution: Traceback (most recent call last): File "/Users/buildslave/jenkins/workspace/LNT_Tests/venv/lib/python2.7/site-packages/lit-0.10.0.dev0-py2.7.egg/lit/worker.py", line 63, in _execute_test File "/Users/buildslave/jenkins/workspace/LNT_Tests/venv/lib/python2.7/site-packages/lit-0.10.0.dev0-py2.7.egg/lit/formats/shtest.py", line 25, in execute File "/Users/buildslave/jenkins/workspace/LNT_Tests/venv/lib/python2.7/site-packages/lit-0.10.0.dev0-py2.7.egg/lit/TestRunner.py", line 1641, in executeShTest File "/Users/buildslave/jenkins/workspace/LNT_Tests/venv/lib/python2.7/site-packages/lit-0.10.0.dev0-py2.7.egg/lit/TestRunner.py", line 1547, in parseIntegratedTestScript File "/Users/buildslave/jenkins/workspace/LNT_Tests/venv/lib/python2.7/site-packages/lit-0.10.0.dev0-py2.7.egg/lit/TestRunner.py", line 1217, in parseIntegratedTestScriptCommands IOError: [Errno 2] No such file or directory: '/Users/buildslave/jenkins/workspace/LNT_Tests/llvm-lnt/tests/lnttool/check_no_errors.shtest'

Hide Details

Hide Details

******************** UNRESOLVED: LNT :: lnttool/checkformat.shtest (9 of 72) ******************** TEST 'LNT :: lnttool/checkformat.shtest' FAILED ******************** Exception during script execution: Traceback (most recent call last): File "/Users/buildslave/jenkins/workspace/LNT_Tests/venv/lib/python2.7/site-packages/lit-0.10.0.dev0-py2.7.egg/lit/worker.py", line 63, in _execute_test File "/Users/buildslave/jenkins/workspace/LNT_Tests/venv/lib/python2.7/site-packages/lit-0.10.0.dev0-py2.7.egg/lit/formats/shtest.py", line 25, in execute File "/Users/buildslave/jenkins/workspace/LNT_Tests/venv/lib/python2.7/site-packages/lit-0.10.0.dev0-py2.7.egg/lit/TestRunner.py", line 1641, in executeShTest File "/Users/buildslave/jenkins/workspace/LNT_Tests/venv/lib/python2.7/site-packages/lit-0.10.0.dev0-py2.7.egg/lit/TestRunner.py", line 1547, in parseIntegratedTestScript File "/Users/buildslave/jenkins/workspace/LNT_Tests/venv/lib/python2.7/site-packages/lit-0.10.0.dev0-py2.7.egg/lit/TestRunner.py", line 1217, in parseIntegratedTestScriptCommands IOError: [Errno 2] No such file or directory: '/Users/buildslave/jenkins/workspace/LNT_Tests/llvm-lnt/tests/lnttool/checkformat.shtest'

Hide Details

Hide Details

******************** UNRESOLVED: LNT :: lnttool/email_tools.py (10 of 72) ******************** TEST 'LNT :: lnttool/email_tools.py' FAILED ******************** Exception during script execution: Traceback (most recent call last): File "/Users/buildslave/jenkins/workspace/LNT_Tests/venv/lib/python2.7/site-packages/lit-0.10.0.dev0-py2.7.egg/lit/worker.py", line 63, in _execute_test File "/Users/buildslave/jenkins/workspace/LNT_Tests/venv/lib/python2.7/site-packages/lit-0.10.0.dev0-py2.7.egg/lit/formats/shtest.py", line 25, in execute File "/Users/buildslave/jenkins/workspace/LNT_Tests/venv/lib/python2.7/site-packages/lit-0.10.0.dev0-py2.7.egg/lit/TestRunner.py", line 1641, in executeShTest File "/Users/buildslave/jenkins/workspace/LNT_Tests/venv/lib/python2.7/site-packages/lit-0.10.0.dev0-py2.7.egg/lit/TestRunner.py", line 1547, in parseIntegratedTestScript File "/Users/buildslave/jenkins/workspace/LNT_Tests/venv/lib/python2.7/site-packages/lit-0.10.0.dev0-py2.7.egg/lit/TestRunner.py", line 1217, in parseIntegratedTestScriptCommands IOError: [Errno 2] No such file or directory: '/Users/buildslave/jenkins/workspace/LNT_Tests/llvm-lnt/tests/lnttool/email_tools.py'

Hide Details

Hide Details

******************** UNRESOLVED: LNT :: lnttool/showtests.shtest (11 of 72) ******************** TEST 'LNT :: lnttool/showtests.shtest' FAILED ******************** Exception during script execution: Traceback (most recent call last): File "/Users/buildslave/jenkins/workspace/LNT_Tests/venv/lib/python2.7/site-packages/lit-0.10.0.dev0-py2.7.egg/lit/worker.py", line 63, in _execute_test File "/Users/buildslave/jenkins/workspace/LNT_Tests/venv/lib/python2.7/site-packages/lit-0.10.0.dev0-py2.7.egg/lit/formats/shtest.py", line 25, in execute File "/Users/buildslave/jenkins/workspace/LNT_Tests/venv/lib/python2.7/site-packages/lit-0.10.0.dev0-py2.7.egg/lit/TestRunner.py", line 1641, in executeShTest File "/Users/buildslave/jenkins/workspace/LNT_Tests/venv/lib/python2.7/site-packages/lit-0.10.0.dev0-py2.7.egg/lit/TestRunner.py", line 1547, in parseIntegratedTestScript File "/Users/buildslave/jenkins/workspace/LNT_Tests/venv/lib/python2.7/site-packages/lit-0.10.0.dev0-py2.7.egg/lit/TestRunner.py", line 1217, in parseIntegratedTestScriptCommands IOError: [Errno 2] No such file or directory: '/Users/buildslave/jenkins/workspace/LNT_Tests/llvm-lnt/tests/lnttool/showtests.shtest'

Hide Details

Hide Details

******************** UNRESOLVED: LNT :: lnttool/submit.shtest (12 of 72) ******************** TEST 'LNT :: lnttool/submit.shtest' FAILED ******************** Exception during script execution: Traceback (most recent call last): File "/Users/buildslave/jenkins/workspace/LNT_Tests/venv/lib/python2.7/site-packages/lit-0.10.0.dev0-py2.7.egg/lit/worker.py", line 63, in _execute_test File "/Users/buildslave/jenkins/workspace/LNT_Tests/venv/lib/python2.7/site-packages/lit-0.10.0.dev0-py2.7.egg/lit/formats/shtest.py", line 25, in execute File "/Users/buildslave/jenkins/workspace/LNT_Tests/venv/lib/python2.7/site-packages/lit-0.10.0.dev0-py2.7.egg/lit/TestRunner.py", line 1641, in executeShTest File "/Users/buildslave/jenkins/workspace/LNT_Tests/venv/lib/python2.7/site-packages/lit-0.10.0.dev0-py2.7.egg/lit/TestRunner.py", line 1547, in parseIntegratedTestScript File "/Users/buildslave/jenkins/workspace/LNT_Tests/venv/lib/python2.7/site-packages/lit-0.10.0.dev0-py2.7.egg/lit/TestRunner.py", line 1217, in parseIntegratedTestScriptCommands IOError: [Errno 2] No such file or directory: '/Users/buildslave/jenkins/workspace/LNT_Tests/llvm-lnt/tests/lnttool/submit.shtest'

Hide Details

Hide Details

******************** UNRESOLVED: LNT :: lnttool/submit_badurl.shtest (13 of 72) ******************** TEST 'LNT :: lnttool/submit_badurl.shtest' FAILED ******************** Exception during script execution: Traceback (most recent call last): File "/Users/buildslave/jenkins/workspace/LNT_Tests/venv/lib/python2.7/site-packages/lit-0.10.0.dev0-py2.7.egg/lit/worker.py", line 63, in _execute_test File "/Users/buildslave/jenkins/workspace/LNT_Tests/venv/lib/python2.7/site-packages/lit-0.10.0.dev0-py2.7.egg/lit/formats/shtest.py", line 25, in execute File "/Users/buildslave/jenkins/workspace/LNT_Tests/venv/lib/python2.7/site-packages/lit-0.10.0.dev0-py2.7.egg/lit/TestRunner.py", line 1641, in executeShTest File "/Users/buildslave/jenkins/workspace/LNT_Tests/venv/lib/python2.7/site-packages/lit-0.10.0.dev0-py2.7.egg/lit/TestRunner.py", line 1547, in parseIntegratedTestScript File "/Users/buildslave/jenkins/workspace/LNT_Tests/venv/lib/python2.7/site-packages/lit-0.10.0.dev0-py2.7.egg/lit/TestRunner.py", line 1217, in parseIntegratedTestScriptCommands IOError: [Errno 2] No such file or directory: '/Users/buildslave/jenkins/workspace/LNT_Tests/llvm-lnt/tests/lnttool/submit_badurl.shtest'

Hide Details

Hide Details

******************** UNRESOLVED: LNT :: lnttool/test_importreport.py (14 of 72) ******************** TEST 'LNT :: lnttool/test_importreport.py' FAILED ******************** Exception during script execution: Traceback (most recent call last): File "/Users/buildslave/jenkins/workspace/LNT_Tests/venv/lib/python2.7/site-packages/lit-0.10.0.dev0-py2.7.egg/lit/worker.py", line 63, in _execute_test File "/Users/buildslave/jenkins/workspace/LNT_Tests/venv/lib/python2.7/site-packages/lit-0.10.0.dev0-py2.7.egg/lit/formats/shtest.py", line 25, in execute File "/Users/buildslave/jenkins/workspace/LNT_Tests/venv/lib/python2.7/site-packages/lit-0.10.0.dev0-py2.7.egg/lit/TestRunner.py", line 1641, in executeShTest File "/Users/buildslave/jenkins/workspace/LNT_Tests/venv/lib/python2.7/site-packages/lit-0.10.0.dev0-py2.7.egg/lit/TestRunner.py", line 1547, in parseIntegratedTestScript File "/Users/buildslave/jenkins/workspace/LNT_Tests/venv/lib/python2.7/site-packages/lit-0.10.0.dev0-py2.7.egg/lit/TestRunner.py", line 1217, in parseIntegratedTestScriptCommands IOError: [Errno 2] No such file or directory: '/Users/buildslave/jenkins/workspace/LNT_Tests/llvm-lnt/tests/lnttool/test_importreport.py'

Hide Details

Hide Details

******************** UNRESOLVED: LNT :: lnttool/view-comparison.shtest (15 of 72) ******************** TEST 'LNT :: lnttool/view-comparison.shtest' FAILED ******************** Exception during script execution: Traceback (most recent call last): File "/Users/buildslave/jenkins/workspace/LNT_Tests/venv/lib/python2.7/site-packages/lit-0.10.0.dev0-py2.7.egg/lit/worker.py", line 63, in _execute_test File "/Users/buildslave/jenkins/workspace/LNT_Tests/venv/lib/python2.7/site-packages/lit-0.10.0.dev0-py2.7.egg/lit/formats/shtest.py", line 25, in execute File "/Users/buildslave/jenkins/workspace/LNT_Tests/venv/lib/python2.7/site-packages/lit-0.10.0.dev0-py2.7.egg/lit/TestRunner.py", line 1641, in executeShTest File "/Users/buildslave/jenkins/workspace/LNT_Tests/venv/lib/python2.7/site-packages/lit-0.10.0.dev0-py2.7.egg/lit/TestRunner.py", line 1547, in parseIntegratedTestScript File "/Users/buildslave/jenkins/workspace/LNT_Tests/venv/lib/python2.7/site-packages/lit-0.10.0.dev0-py2.7.egg/lit/TestRunner.py", line 1217, in parseIntegratedTestScriptCommands IOError: [Errno 2] No such file or directory: '/Users/buildslave/jenkins/workspace/LNT_Tests/llvm-lnt/tests/lnttool/view-comparison.shtest'

Hide Details

Hide Details

******************** UNRESOLVED: LNT :: runtest/exclude_stat.py (16 of 72) ******************** TEST 'LNT :: runtest/exclude_stat.py' FAILED ******************** Exception during script execution: Traceback (most recent call last): File "/Users/buildslave/jenkins/workspace/LNT_Tests/venv/lib/python2.7/site-packages/lit-0.10.0.dev0-py2.7.egg/lit/worker.py", line 63, in _execute_test File "/Users/buildslave/jenkins/workspace/LNT_Tests/venv/lib/python2.7/site-packages/lit-0.10.0.dev0-py2.7.egg/lit/formats/shtest.py", line 25, in execute File "/Users/buildslave/jenkins/workspace/LNT_Tests/venv/lib/python2.7/site-packages/lit-0.10.0.dev0-py2.7.egg/lit/TestRunner.py", line 1641, in executeShTest File "/Users/buildslave/jenkins/workspace/LNT_Tests/venv/lib/python2.7/site-packages/lit-0.10.0.dev0-py2.7.egg/lit/TestRunner.py", line 1547, in parseIntegratedTestScript File "/Users/buildslave/jenkins/workspace/LNT_Tests/venv/lib/python2.7/site-packages/lit-0.10.0.dev0-py2.7.egg/lit/TestRunner.py", line 1217, in parseIntegratedTestScriptCommands IOError: [Errno 2] No such file or directory: '/Users/buildslave/jenkins/workspace/LNT_Tests/llvm-lnt/tests/runtest/exclude_stat.py'

Hide Details

Hide Details

******************** UNRESOLVED: LNT :: runtest/multisample.py (17 of 72) ******************** TEST 'LNT :: runtest/multisample.py' FAILED ******************** Exception during script execution: Traceback (most recent call last): File "/Users/buildslave/jenkins/workspace/LNT_Tests/venv/lib/python2.7/site-packages/lit-0.10.0.dev0-py2.7.egg/lit/worker.py", line 63, in _execute_test File "/Users/buildslave/jenkins/workspace/LNT_Tests/venv/lib/python2.7/site-packages/lit-0.10.0.dev0-py2.7.egg/lit/formats/shtest.py", line 25, in execute File "/Users/buildslave/jenkins/workspace/LNT_Tests/venv/lib/python2.7/site-packages/lit-0.10.0.dev0-py2.7.egg/lit/TestRunner.py", line 1641, in executeShTest File "/Users/buildslave/jenkins/workspace/LNT_Tests/venv/lib/python2.7/site-packages/lit-0.10.0.dev0-py2.7.egg/lit/TestRunner.py", line 1547, in parseIntegratedTestScript File "/Users/buildslave/jenkins/workspace/LNT_Tests/venv/lib/python2.7/site-packages/lit-0.10.0.dev0-py2.7.egg/lit/TestRunner.py", line 1217, in parseIntegratedTestScriptCommands IOError: [Errno 2] No such file or directory: '/Users/buildslave/jenkins/workspace/LNT_Tests/llvm-lnt/tests/runtest/multisample.py'

Hide Details

Hide Details

******************** UNRESOLVED: LNT :: runtest/nt-darwin.py (18 of 72) ******************** TEST 'LNT :: runtest/nt-darwin.py' FAILED ******************** Exception during script execution: Traceback (most recent call last): File "/Users/buildslave/jenkins/workspace/LNT_Tests/venv/lib/python2.7/site-packages/lit-0.10.0.dev0-py2.7.egg/lit/worker.py", line 63, in _execute_test File "/Users/buildslave/jenkins/workspace/LNT_Tests/venv/lib/python2.7/site-packages/lit-0.10.0.dev0-py2.7.egg/lit/formats/shtest.py", line 25, in execute File "/Users/buildslave/jenkins/workspace/LNT_Tests/venv/lib/python2.7/site-packages/lit-0.10.0.dev0-py2.7.egg/lit/TestRunner.py", line 1641, in executeShTest File "/Users/buildslave/jenkins/workspace/LNT_Tests/venv/lib/python2.7/site-packages/lit-0.10.0.dev0-py2.7.egg/lit/TestRunner.py", line 1547, in parseIntegratedTestScript File "/Users/buildslave/jenkins/workspace/LNT_Tests/venv/lib/python2.7/site-packages/lit-0.10.0.dev0-py2.7.egg/lit/TestRunner.py", line 1217, in parseIntegratedTestScriptCommands IOError: [Errno 2] No such file or directory: '/Users/buildslave/jenkins/workspace/LNT_Tests/llvm-lnt/tests/runtest/nt-darwin.py'

Hide Details

Hide Details

******************** UNRESOLVED: LNT :: runtest/nt.py (19 of 72) ******************** TEST 'LNT :: runtest/nt.py' FAILED ******************** Exception during script execution: Traceback (most recent call last): File "/Users/buildslave/jenkins/workspace/LNT_Tests/venv/lib/python2.7/site-packages/lit-0.10.0.dev0-py2.7.egg/lit/worker.py", line 63, in _execute_test File "/Users/buildslave/jenkins/workspace/LNT_Tests/venv/lib/python2.7/site-packages/lit-0.10.0.dev0-py2.7.egg/lit/formats/shtest.py", line 25, in execute File "/Users/buildslave/jenkins/workspace/LNT_Tests/venv/lib/python2.7/site-packages/lit-0.10.0.dev0-py2.7.egg/lit/TestRunner.py", line 1641, in executeShTest File "/Users/buildslave/jenkins/workspace/LNT_Tests/venv/lib/python2.7/site-packages/lit-0.10.0.dev0-py2.7.egg/lit/TestRunner.py", line 1547, in parseIntegratedTestScript File "/Users/buildslave/jenkins/workspace/LNT_Tests/venv/lib/python2.7/site-packages/lit-0.10.0.dev0-py2.7.egg/lit/TestRunner.py", line 1217, in parseIntegratedTestScriptCommands IOError: [Errno 2] No such file or directory: '/Users/buildslave/jenkins/workspace/LNT_Tests/llvm-lnt/tests/runtest/nt.py'

Hide Details

Hide Details

******************** UNRESOLVED: LNT :: runtest/only_test.py (20 of 72) ******************** TEST 'LNT :: runtest/only_test.py' FAILED ******************** Exception during script execution: Traceback (most recent call last): File "/Users/buildslave/jenkins/workspace/LNT_Tests/venv/lib/python2.7/site-packages/lit-0.10.0.dev0-py2.7.egg/lit/worker.py", line 63, in _execute_test File "/Users/buildslave/jenkins/workspace/LNT_Tests/venv/lib/python2.7/site-packages/lit-0.10.0.dev0-py2.7.egg/lit/formats/shtest.py", line 25, in execute File "/Users/buildslave/jenkins/workspace/LNT_Tests/venv/lib/python2.7/site-packages/lit-0.10.0.dev0-py2.7.egg/lit/TestRunner.py", line 1641, in executeShTest File "/Users/buildslave/jenkins/workspace/LNT_Tests/venv/lib/python2.7/site-packages/lit-0.10.0.dev0-py2.7.egg/lit/TestRunner.py", line 1547, in parseIntegratedTestScript File "/Users/buildslave/jenkins/workspace/LNT_Tests/venv/lib/python2.7/site-packages/lit-0.10.0.dev0-py2.7.egg/lit/TestRunner.py", line 1217, in parseIntegratedTestScriptCommands IOError: [Errno 2] No such file or directory: '/Users/buildslave/jenkins/workspace/LNT_Tests/llvm-lnt/tests/runtest/only_test.py'

Hide Details

Hide Details

******************** UNRESOLVED: LNT :: runtest/rerun.py (21 of 72) ******************** TEST 'LNT :: runtest/rerun.py' FAILED ******************** Exception during script execution: Traceback (most recent call last): File "/Users/buildslave/jenkins/workspace/LNT_Tests/venv/lib/python2.7/site-packages/lit-0.10.0.dev0-py2.7.egg/lit/worker.py", line 63, in _execute_test File "/Users/buildslave/jenkins/workspace/LNT_Tests/venv/lib/python2.7/site-packages/lit-0.10.0.dev0-py2.7.egg/lit/formats/shtest.py", line 25, in execute File "/Users/buildslave/jenkins/workspace/LNT_Tests/venv/lib/python2.7/site-packages/lit-0.10.0.dev0-py2.7.egg/lit/TestRunner.py", line 1641, in executeShTest File "/Users/buildslave/jenkins/workspace/LNT_Tests/venv/lib/python2.7/site-packages/lit-0.10.0.dev0-py2.7.egg/lit/TestRunner.py", line 1547, in parseIntegratedTestScript File "/Users/buildslave/jenkins/workspace/LNT_Tests/venv/lib/python2.7/site-packages/lit-0.10.0.dev0-py2.7.egg/lit/TestRunner.py", line 1217, in parseIntegratedTestScriptCommands IOError: [Errno 2] No such file or directory: '/Users/buildslave/jenkins/workspace/LNT_Tests/llvm-lnt/tests/runtest/rerun.py'

Hide Details

Hide Details

******************** UNRESOLVED: LNT :: runtest/test_suite-benchmarking-only.shtest (22 of 72) ******************** TEST 'LNT :: runtest/test_suite-benchmarking-only.shtest' FAILED ******************** Exception during script execution: Traceback (most recent call last): File "/Users/buildslave/jenkins/workspace/LNT_Tests/venv/lib/python2.7/site-packages/lit-0.10.0.dev0-py2.7.egg/lit/worker.py", line 63, in _execute_test File "/Users/buildslave/jenkins/workspace/LNT_Tests/venv/lib/python2.7/site-packages/lit-0.10.0.dev0-py2.7.egg/lit/formats/shtest.py", line 25, in execute File "/Users/buildslave/jenkins/workspace/LNT_Tests/venv/lib/python2.7/site-packages/lit-0.10.0.dev0-py2.7.egg/lit/TestRunner.py", line 1641, in executeShTest File "/Users/buildslave/jenkins/workspace/LNT_Tests/venv/lib/python2.7/site-packages/lit-0.10.0.dev0-py2.7.egg/lit/TestRunner.py", line 1547, in parseIntegratedTestScript File "/Users/buildslave/jenkins/workspace/LNT_Tests/venv/lib/python2.7/site-packages/lit-0.10.0.dev0-py2.7.egg/lit/TestRunner.py", line 1217, in parseIntegratedTestScriptCommands IOError: [Errno 2] No such file or directory: '/Users/buildslave/jenkins/workspace/LNT_Tests/llvm-lnt/tests/runtest/test_suite-benchmarking-only.shtest'

Hide Details

Hide Details

******************** UNRESOLVED: LNT :: runtest/test_suite-c-compiler.shtest (23 of 72) ******************** TEST 'LNT :: runtest/test_suite-c-compiler.shtest' FAILED ******************** Exception during script execution: Traceback (most recent call last): File "/Users/buildslave/jenkins/workspace/LNT_Tests/venv/lib/python2.7/site-packages/lit-0.10.0.dev0-py2.7.egg/lit/worker.py", line 63, in _execute_test File "/Users/buildslave/jenkins/workspace/LNT_Tests/venv/lib/python2.7/site-packages/lit-0.10.0.dev0-py2.7.egg/lit/formats/shtest.py", line 25, in execute File "/Users/buildslave/jenkins/workspace/LNT_Tests/venv/lib/python2.7/site-packages/lit-0.10.0.dev0-py2.7.egg/lit/TestRunner.py", line 1641, in executeShTest File "/Users/buildslave/jenkins/workspace/LNT_Tests/venv/lib/python2.7/site-packages/lit-0.10.0.dev0-py2.7.egg/lit/TestRunner.py", line 1547, in parseIntegratedTestScript File "/Users/buildslave/jenkins/workspace/LNT_Tests/venv/lib/python2.7/site-packages/lit-0.10.0.dev0-py2.7.egg/lit/TestRunner.py", line 1217, in parseIntegratedTestScriptCommands IOError: [Errno 2] No such file or directory: '/Users/buildslave/jenkins/workspace/LNT_Tests/llvm-lnt/tests/runtest/test_suite-c-compiler.shtest'

Hide Details

Hide Details

******************** UNRESOLVED: LNT :: runtest/test_suite-cache.shtest (24 of 72) ******************** TEST 'LNT :: runtest/test_suite-cache.shtest' FAILED ******************** Exception during script execution: Traceback (most recent call last): File "/Users/buildslave/jenkins/workspace/LNT_Tests/venv/lib/python2.7/site-packages/lit-0.10.0.dev0-py2.7.egg/lit/worker.py", line 63, in _execute_test File "/Users/buildslave/jenkins/workspace/LNT_Tests/venv/lib/python2.7/site-packages/lit-0.10.0.dev0-py2.7.egg/lit/formats/shtest.py", line 25, in execute File "/Users/buildslave/jenkins/workspace/LNT_Tests/venv/lib/python2.7/site-packages/lit-0.10.0.dev0-py2.7.egg/lit/TestRunner.py", line 1641, in executeShTest File "/Users/buildslave/jenkins/workspace/LNT_Tests/venv/lib/python2.7/site-packages/lit-0.10.0.dev0-py2.7.egg/lit/TestRunner.py", line 1547, in parseIntegratedTestScript File "/Users/buildslave/jenkins/workspace/LNT_Tests/venv/lib/python2.7/site-packages/lit-0.10.0.dev0-py2.7.egg/lit/TestRunner.py", line 1217, in parseIntegratedTestScriptCommands IOError: [Errno 2] No such file or directory: '/Users/buildslave/jenkins/workspace/LNT_Tests/llvm-lnt/tests/runtest/test_suite-cache.shtest'

Hide Details

Hide Details

******************** UNRESOLVED: LNT :: runtest/test_suite-cc.shtest (25 of 72) ******************** TEST 'LNT :: runtest/test_suite-cc.shtest' FAILED ******************** Exception during script execution: Traceback (most recent call last): File "/Users/buildslave/jenkins/workspace/LNT_Tests/venv/lib/python2.7/site-packages/lit-0.10.0.dev0-py2.7.egg/lit/worker.py", line 63, in _execute_test File "/Users/buildslave/jenkins/workspace/LNT_Tests/venv/lib/python2.7/site-packages/lit-0.10.0.dev0-py2.7.egg/lit/formats/shtest.py", line 25, in execute File "/Users/buildslave/jenkins/workspace/LNT_Tests/venv/lib/python2.7/site-packages/lit-0.10.0.dev0-py2.7.egg/lit/TestRunner.py", line 1641, in executeShTest File "/Users/buildslave/jenkins/workspace/LNT_Tests/venv/lib/python2.7/site-packages/lit-0.10.0.dev0-py2.7.egg/lit/TestRunner.py", line 1547, in parseIntegratedTestScript File "/Users/buildslave/jenkins/workspace/LNT_Tests/venv/lib/python2.7/site-packages/lit-0.10.0.dev0-py2.7.egg/lit/TestRunner.py", line 1217, in parseIntegratedTestScriptCommands IOError: [Errno 2] No such file or directory: '/Users/buildslave/jenkins/workspace/LNT_Tests/llvm-lnt/tests/runtest/test_suite-cc.shtest'

Hide Details

Hide Details

******************** UNRESOLVED: LNT :: runtest/test_suite-cflags0.shtest (26 of 72) ******************** TEST 'LNT :: runtest/test_suite-cflags0.shtest' FAILED ******************** Exception during script execution: Traceback (most recent call last): File "/Users/buildslave/jenkins/workspace/LNT_Tests/venv/lib/python2.7/site-packages/lit-0.10.0.dev0-py2.7.egg/lit/worker.py", line 63, in _execute_test File "/Users/buildslave/jenkins/workspace/LNT_Tests/venv/lib/python2.7/site-packages/lit-0.10.0.dev0-py2.7.egg/lit/formats/shtest.py", line 25, in execute File "/Users/buildslave/jenkins/workspace/LNT_Tests/venv/lib/python2.7/site-packages/lit-0.10.0.dev0-py2.7.egg/lit/TestRunner.py", line 1641, in executeShTest File "/Users/buildslave/jenkins/workspace/LNT_Tests/venv/lib/python2.7/site-packages/lit-0.10.0.dev0-py2.7.egg/lit/TestRunner.py", line 1547, in parseIntegratedTestScript File "/Users/buildslave/jenkins/workspace/LNT_Tests/venv/lib/python2.7/site-packages/lit-0.10.0.dev0-py2.7.egg/lit/TestRunner.py", line 1217, in parseIntegratedTestScriptCommands IOError: [Errno 2] No such file or directory: '/Users/buildslave/jenkins/workspace/LNT_Tests/llvm-lnt/tests/runtest/test_suite-cflags0.shtest'

Hide Details

Hide Details

******************** UNRESOLVED: LNT :: runtest/test_suite-cflags1.shtest (27 of 72) ******************** TEST 'LNT :: runtest/test_suite-cflags1.shtest' FAILED ******************** Exception during script execution: Traceback (most recent call last): File "/Users/buildslave/jenkins/workspace/LNT_Tests/venv/lib/python2.7/site-packages/lit-0.10.0.dev0-py2.7.egg/lit/worker.py", line 63, in _execute_test File "/Users/buildslave/jenkins/workspace/LNT_Tests/venv/lib/python2.7/site-packages/lit-0.10.0.dev0-py2.7.egg/lit/formats/shtest.py", line 25, in execute File "/Users/buildslave/jenkins/workspace/LNT_Tests/venv/lib/python2.7/site-packages/lit-0.10.0.dev0-py2.7.egg/lit/TestRunner.py", line 1641, in executeShTest File "/Users/buildslave/jenkins/workspace/LNT_Tests/venv/lib/python2.7/site-packages/lit-0.10.0.dev0-py2.7.egg/lit/TestRunner.py", line 1547, in parseIntegratedTestScript File "/Users/buildslave/jenkins/workspace/LNT_Tests/venv/lib/python2.7/site-packages/lit-0.10.0.dev0-py2.7.egg/lit/TestRunner.py", line 1217, in parseIntegratedTestScriptCommands IOError: [Errno 2] No such file or directory: '/Users/buildslave/jenkins/workspace/LNT_Tests/llvm-lnt/tests/runtest/test_suite-cflags1.shtest'

Hide Details

Hide Details

******************** UNRESOLVED: LNT :: runtest/test_suite-cflags2.shtest (28 of 72) ******************** TEST 'LNT :: runtest/test_suite-cflags2.shtest' FAILED ******************** Exception during script execution: Traceback (most recent call last): File "/Users/buildslave/jenkins/workspace/LNT_Tests/venv/lib/python2.7/site-packages/lit-0.10.0.dev0-py2.7.egg/lit/worker.py", line 63, in _execute_test File "/Users/buildslave/jenkins/workspace/LNT_Tests/venv/lib/python2.7/site-packages/lit-0.10.0.dev0-py2.7.egg/lit/formats/shtest.py", line 25, in execute File "/Users/buildslave/jenkins/workspace/LNT_Tests/venv/lib/python2.7/site-packages/lit-0.10.0.dev0-py2.7.egg/lit/TestRunner.py", line 1641, in executeShTest File "/Users/buildslave/jenkins/workspace/LNT_Tests/venv/lib/python2.7/site-packages/lit-0.10.0.dev0-py2.7.egg/lit/TestRunner.py", line 1547, in parseIntegratedTestScript File "/Users/buildslave/jenkins/workspace/LNT_Tests/venv/lib/python2.7/site-packages/lit-0.10.0.dev0-py2.7.egg/lit/TestRunner.py", line 1217, in parseIntegratedTestScriptCommands IOError: [Errno 2] No such file or directory: '/Users/buildslave/jenkins/workspace/LNT_Tests/llvm-lnt/tests/runtest/test_suite-cflags2.shtest'

Hide Details

Hide Details

******************** UNRESOLVED: LNT :: runtest/test_suite-cflags3.shtest (29 of 72) ******************** TEST 'LNT :: runtest/test_suite-cflags3.shtest' FAILED ******************** Exception during script execution: Traceback (most recent call last): File "/Users/buildslave/jenkins/workspace/LNT_Tests/venv/lib/python2.7/site-packages/lit-0.10.0.dev0-py2.7.egg/lit/worker.py", line 63, in _execute_test File "/Users/buildslave/jenkins/workspace/LNT_Tests/venv/lib/python2.7/site-packages/lit-0.10.0.dev0-py2.7.egg/lit/formats/shtest.py", line 25, in execute File "/Users/buildslave/jenkins/workspace/LNT_Tests/venv/lib/python2.7/site-packages/lit-0.10.0.dev0-py2.7.egg/lit/TestRunner.py", line 1641, in executeShTest File "/Users/buildslave/jenkins/workspace/LNT_Tests/venv/lib/python2.7/site-packages/lit-0.10.0.dev0-py2.7.egg/lit/TestRunner.py", line 1547, in parseIntegratedTestScript File "/Users/buildslave/jenkins/workspace/LNT_Tests/venv/lib/python2.7/site-packages/lit-0.10.0.dev0-py2.7.egg/lit/TestRunner.py", line 1217, in parseIntegratedTestScriptCommands IOError: [Errno 2] No such file or directory: '/Users/buildslave/jenkins/workspace/LNT_Tests/llvm-lnt/tests/runtest/test_suite-cflags3.shtest'

Hide Details

Hide Details

******************** UNRESOLVED: LNT :: runtest/test_suite-cflags4.shtest (30 of 72) ******************** TEST 'LNT :: runtest/test_suite-cflags4.shtest' FAILED ******************** Exception during script execution: Traceback (most recent call last): File "/Users/buildslave/jenkins/workspace/LNT_Tests/venv/lib/python2.7/site-packages/lit-0.10.0.dev0-py2.7.egg/lit/worker.py", line 63, in _execute_test File "/Users/buildslave/jenkins/workspace/LNT_Tests/venv/lib/python2.7/site-packages/lit-0.10.0.dev0-py2.7.egg/lit/formats/shtest.py", line 25, in execute File "/Users/buildslave/jenkins/workspace/LNT_Tests/venv/lib/python2.7/site-packages/lit-0.10.0.dev0-py2.7.egg/lit/TestRunner.py", line 1641, in executeShTest File "/Users/buildslave/jenkins/workspace/LNT_Tests/venv/lib/python2.7/site-packages/lit-0.10.0.dev0-py2.7.egg/lit/TestRunner.py", line 1547, in parseIntegratedTestScript File "/Users/buildslave/jenkins/workspace/LNT_Tests/venv/lib/python2.7/site-packages/lit-0.10.0.dev0-py2.7.egg/lit/TestRunner.py", line 1217, in parseIntegratedTestScriptCommands IOError: [Errno 2] No such file or directory: '/Users/buildslave/jenkins/workspace/LNT_Tests/llvm-lnt/tests/runtest/test_suite-cflags4.shtest'

Hide Details

Hide Details

******************** UNRESOLVED: LNT :: runtest/test_suite-compile-only.shtest (31 of 72) ******************** TEST 'LNT :: runtest/test_suite-compile-only.shtest' FAILED ******************** Exception during script execution: Traceback (most recent call last): File "/Users/buildslave/jenkins/workspace/LNT_Tests/venv/lib/python2.7/site-packages/lit-0.10.0.dev0-py2.7.egg/lit/worker.py", line 63, in _execute_test File "/Users/buildslave/jenkins/workspace/LNT_Tests/venv/lib/python2.7/site-packages/lit-0.10.0.dev0-py2.7.egg/lit/formats/shtest.py", line 25, in execute File "/Users/buildslave/jenkins/workspace/LNT_Tests/venv/lib/python2.7/site-packages/lit-0.10.0.dev0-py2.7.egg/lit/TestRunner.py", line 1641, in executeShTest File "/Users/buildslave/jenkins/workspace/LNT_Tests/venv/lib/python2.7/site-packages/lit-0.10.0.dev0-py2.7.egg/lit/TestRunner.py", line 1547, in parseIntegratedTestScript File "/Users/buildslave/jenkins/workspace/LNT_Tests/venv/lib/python2.7/site-packages/lit-0.10.0.dev0-py2.7.egg/lit/TestRunner.py", line 1217, in parseIntegratedTestScriptCommands IOError: [Errno 2] No such file or directory: '/Users/buildslave/jenkins/workspace/LNT_Tests/llvm-lnt/tests/runtest/test_suite-compile-only.shtest'

Hide Details

Hide Details

******************** UNRESOLVED: LNT :: runtest/test_suite-cross.shtest (32 of 72) ******************** TEST 'LNT :: runtest/test_suite-cross.shtest' FAILED ******************** Exception during script execution: Traceback (most recent call last): File "/Users/buildslave/jenkins/workspace/LNT_Tests/venv/lib/python2.7/site-packages/lit-0.10.0.dev0-py2.7.egg/lit/worker.py", line 63, in _execute_test File "/Users/buildslave/jenkins/workspace/LNT_Tests/venv/lib/python2.7/site-packages/lit-0.10.0.dev0-py2.7.egg/lit/formats/shtest.py", line 25, in execute File "/Users/buildslave/jenkins/workspace/LNT_Tests/venv/lib/python2.7/site-packages/lit-0.10.0.dev0-py2.7.egg/lit/TestRunner.py", line 1641, in executeShTest File "/Users/buildslave/jenkins/workspace/LNT_Tests/venv/lib/python2.7/site-packages/lit-0.10.0.dev0-py2.7.egg/lit/TestRunner.py", line 1547, in parseIntegratedTestScript File "/Users/buildslave/jenkins/workspace/LNT_Tests/venv/lib/python2.7/site-packages/lit-0.10.0.dev0-py2.7.egg/lit/TestRunner.py", line 1217, in parseIntegratedTestScriptCommands IOError: [Errno 2] No such file or directory: '/Users/buildslave/jenkins/workspace/LNT_Tests/llvm-lnt/tests/runtest/test_suite-cross.shtest'

Hide Details

Hide Details

******************** UNRESOLVED: LNT :: runtest/test_suite-fail-compile.shtest (33 of 72) ******************** TEST 'LNT :: runtest/test_suite-fail-compile.shtest' FAILED ******************** Exception during script execution: Traceback (most recent call last): File "/Users/buildslave/jenkins/workspace/LNT_Tests/venv/lib/python2.7/site-packages/lit-0.10.0.dev0-py2.7.egg/lit/worker.py", line 63, in _execute_test File "/Users/buildslave/jenkins/workspace/LNT_Tests/venv/lib/python2.7/site-packages/lit-0.10.0.dev0-py2.7.egg/lit/formats/shtest.py", line 25, in execute File "/Users/buildslave/jenkins/workspace/LNT_Tests/venv/lib/python2.7/site-packages/lit-0.10.0.dev0-py2.7.egg/lit/TestRunner.py", line 1641, in executeShTest File "/Users/buildslave/jenkins/workspace/LNT_Tests/venv/lib/python2.7/site-packages/lit-0.10.0.dev0-py2.7.egg/lit/TestRunner.py", line 1547, in parseIntegratedTestScript File "/Users/buildslave/jenkins/workspace/LNT_Tests/venv/lib/python2.7/site-packages/lit-0.10.0.dev0-py2.7.egg/lit/TestRunner.py", line 1217, in parseIntegratedTestScriptCommands IOError: [Errno 2] No such file or directory: '/Users/buildslave/jenkins/workspace/LNT_Tests/llvm-lnt/tests/runtest/test_suite-fail-compile.shtest'

Hide Details

Hide Details

******************** UNRESOLVED: LNT :: runtest/test_suite-fail-exec.shtest (34 of 72) ******************** TEST 'LNT :: runtest/test_suite-fail-exec.shtest' FAILED ******************** Exception during script execution: Traceback (most recent call last): File "/Users/buildslave/jenkins/workspace/LNT_Tests/venv/lib/python2.7/site-packages/lit-0.10.0.dev0-py2.7.egg/lit/worker.py", line 63, in _execute_test File "/Users/buildslave/jenkins/workspace/LNT_Tests/venv/lib/python2.7/site-packages/lit-0.10.0.dev0-py2.7.egg/lit/formats/shtest.py", line 25, in execute File "/Users/buildslave/jenkins/workspace/LNT_Tests/venv/lib/python2.7/site-packages/lit-0.10.0.dev0-py2.7.egg/lit/TestRunner.py", line 1641, in executeShTest File "/Users/buildslave/jenkins/workspace/LNT_Tests/venv/lib/python2.7/site-packages/lit-0.10.0.dev0-py2.7.egg/lit/TestRunner.py", line 1547, in parseIntegratedTestScript File "/Users/buildslave/jenkins/workspace/LNT_Tests/venv/lib/python2.7/site-packages/lit-0.10.0.dev0-py2.7.egg/lit/TestRunner.py", line 1217, in parseIntegratedTestScriptCommands IOError: [Errno 2] No such file or directory: '/Users/buildslave/jenkins/workspace/LNT_Tests/llvm-lnt/tests/runtest/test_suite-fail-exec.shtest'

Hide Details

Hide Details

******************** UNRESOLVED: LNT :: runtest/test_suite-machine-name.shtest (35 of 72) ******************** TEST 'LNT :: runtest/test_suite-machine-name.shtest' FAILED ******************** Exception during script execution: Traceback (most recent call last): File "/Users/buildslave/jenkins/workspace/LNT_Tests/venv/lib/python2.7/site-packages/lit-0.10.0.dev0-py2.7.egg/lit/worker.py", line 63, in _execute_test File "/Users/buildslave/jenkins/workspace/LNT_Tests/venv/lib/python2.7/site-packages/lit-0.10.0.dev0-py2.7.egg/lit/formats/shtest.py", line 25, in execute File "/Users/buildslave/jenkins/workspace/LNT_Tests/venv/lib/python2.7/site-packages/lit-0.10.0.dev0-py2.7.egg/lit/TestRunner.py", line 1641, in executeShTest File "/Users/buildslave/jenkins/workspace/LNT_Tests/venv/lib/python2.7/site-packages/lit-0.10.0.dev0-py2.7.egg/lit/TestRunner.py", line 1547, in parseIntegratedTestScript File "/Users/buildslave/jenkins/workspace/LNT_Tests/venv/lib/python2.7/site-packages/lit-0.10.0.dev0-py2.7.egg/lit/TestRunner.py", line 1217, in parseIntegratedTestScriptCommands IOError: [Errno 2] No such file or directory: '/Users/buildslave/jenkins/workspace/LNT_Tests/llvm-lnt/tests/runtest/test_suite-machine-name.shtest'

Hide Details

Hide Details

******************** UNRESOLVED: LNT :: runtest/test_suite-metrics.shtest (36 of 72) ******************** TEST 'LNT :: runtest/test_suite-metrics.shtest' FAILED ******************** Exception during script execution: Traceback (most recent call last): File "/Users/buildslave/jenkins/workspace/LNT_Tests/venv/lib/python2.7/site-packages/lit-0.10.0.dev0-py2.7.egg/lit/worker.py", line 63, in _execute_test File "/Users/buildslave/jenkins/workspace/LNT_Tests/venv/lib/python2.7/site-packages/lit-0.10.0.dev0-py2.7.egg/lit/formats/shtest.py", line 25, in execute File "/Users/buildslave/jenkins/workspace/LNT_Tests/venv/lib/python2.7/site-packages/lit-0.10.0.dev0-py2.7.egg/lit/TestRunner.py", line 1641, in executeShTest File "/Users/buildslave/jenkins/workspace/LNT_Tests/venv/lib/python2.7/site-packages/lit-0.10.0.dev0-py2.7.egg/lit/TestRunner.py", line 1547, in parseIntegratedTestScript File "/Users/buildslave/jenkins/workspace/LNT_Tests/venv/lib/python2.7/site-packages/lit-0.10.0.dev0-py2.7.egg/lit/TestRunner.py", line 1217, in parseIntegratedTestScriptCommands IOError: [Errno 2] No such file or directory: '/Users/buildslave/jenkins/workspace/LNT_Tests/llvm-lnt/tests/runtest/test_suite-metrics.shtest'

Hide Details

Hide Details

******************** UNRESOLVED: LNT :: runtest/test_suite-only-test.shtest (37 of 72) ******************** TEST 'LNT :: runtest/test_suite-only-test.shtest' FAILED ******************** Exception during script execution: Traceback (most recent call last): File "/Users/buildslave/jenkins/workspace/LNT_Tests/venv/lib/python2.7/site-packages/lit-0.10.0.dev0-py2.7.egg/lit/worker.py", line 63, in _execute_test File "/Users/buildslave/jenkins/workspace/LNT_Tests/venv/lib/python2.7/site-packages/lit-0.10.0.dev0-py2.7.egg/lit/formats/shtest.py", line 25, in execute File "/Users/buildslave/jenkins/workspace/LNT_Tests/venv/lib/python2.7/site-packages/lit-0.10.0.dev0-py2.7.egg/lit/TestRunner.py", line 1641, in executeShTest File "/Users/buildslave/jenkins/workspace/LNT_Tests/venv/lib/python2.7/site-packages/lit-0.10.0.dev0-py2.7.egg/lit/TestRunner.py", line 1547, in parseIntegratedTestScript File "/Users/buildslave/jenkins/workspace/LNT_Tests/venv/lib/python2.7/site-packages/lit-0.10.0.dev0-py2.7.egg/lit/TestRunner.py", line 1217, in parseIntegratedTestScriptCommands IOError: [Errno 2] No such file or directory: '/Users/buildslave/jenkins/workspace/LNT_Tests/llvm-lnt/tests/runtest/test_suite-only-test.shtest'

Hide Details

Hide Details

******************** UNRESOLVED: LNT :: runtest/test_suite-perf-events.shtest (38 of 72) ******************** TEST 'LNT :: runtest/test_suite-perf-events.shtest' FAILED ******************** Exception during script execution: Traceback (most recent call last): File "/Users/buildslave/jenkins/workspace/LNT_Tests/venv/lib/python2.7/site-packages/lit-0.10.0.dev0-py2.7.egg/lit/worker.py", line 63, in _execute_test File "/Users/buildslave/jenkins/workspace/LNT_Tests/venv/lib/python2.7/site-packages/lit-0.10.0.dev0-py2.7.egg/lit/formats/shtest.py", line 25, in execute File "/Users/buildslave/jenkins/workspace/LNT_Tests/venv/lib/python2.7/site-packages/lit-0.10.0.dev0-py2.7.egg/lit/TestRunner.py", line 1641, in executeShTest File "/Users/buildslave/jenkins/workspace/LNT_Tests/venv/lib/python2.7/site-packages/lit-0.10.0.dev0-py2.7.egg/lit/TestRunner.py", line 1547, in parseIntegratedTestScript File "/Users/buildslave/jenkins/workspace/LNT_Tests/venv/lib/python2.7/site-packages/lit-0.10.0.dev0-py2.7.egg/lit/TestRunner.py", line 1217, in parseIntegratedTestScriptCommands IOError: [Errno 2] No such file or directory: '/Users/buildslave/jenkins/workspace/LNT_Tests/llvm-lnt/tests/runtest/test_suite-perf-events.shtest'

Hide Details

Hide Details

******************** UNRESOLVED: LNT :: runtest/test_suite-pgo.shtest (39 of 72) ******************** TEST 'LNT :: runtest/test_suite-pgo.shtest' FAILED ******************** Exception during script execution: Traceback (most recent call last): File "/Users/buildslave/jenkins/workspace/LNT_Tests/venv/lib/python2.7/site-packages/lit-0.10.0.dev0-py2.7.egg/lit/worker.py", line 63, in _execute_test File "/Users/buildslave/jenkins/workspace/LNT_Tests/venv/lib/python2.7/site-packages/lit-0.10.0.dev0-py2.7.egg/lit/formats/shtest.py", line 25, in execute File "/Users/buildslave/jenkins/workspace/LNT_Tests/venv/lib/python2.7/site-packages/lit-0.10.0.dev0-py2.7.egg/lit/TestRunner.py", line 1641, in executeShTest File "/Users/buildslave/jenkins/workspace/LNT_Tests/venv/lib/python2.7/site-packages/lit-0.10.0.dev0-py2.7.egg/lit/TestRunner.py", line 1547, in parseIntegratedTestScript File "/Users/buildslave/jenkins/workspace/LNT_Tests/venv/lib/python2.7/site-packages/lit-0.10.0.dev0-py2.7.egg/lit/TestRunner.py", line 1217, in parseIntegratedTestScriptCommands IOError: [Errno 2] No such file or directory: '/Users/buildslave/jenkins/workspace/LNT_Tests/llvm-lnt/tests/runtest/test_suite-pgo.shtest'

Hide Details

Hide Details

******************** UNRESOLVED: LNT :: runtest/test_suite-profile.shtest (40 of 72) ******************** TEST 'LNT :: runtest/test_suite-profile.shtest' FAILED ******************** Exception during script execution: Traceback (most recent call last): File "/Users/buildslave/jenkins/workspace/LNT_Tests/venv/lib/python2.7/site-packages/lit-0.10.0.dev0-py2.7.egg/lit/worker.py", line 63, in _execute_test File "/Users/buildslave/jenkins/workspace/LNT_Tests/venv/lib/python2.7/site-packages/lit-0.10.0.dev0-py2.7.egg/lit/formats/shtest.py", line 25, in execute File "/Users/buildslave/jenkins/workspace/LNT_Tests/venv/lib/python2.7/site-packages/lit-0.10.0.dev0-py2.7.egg/lit/TestRunner.py", line 1641, in executeShTest File "/Users/buildslave/jenkins/workspace/LNT_Tests/venv/lib/python2.7/site-packages/lit-0.10.0.dev0-py2.7.egg/lit/TestRunner.py", line 1547, in parseIntegratedTestScript File "/Users/buildslave/jenkins/workspace/LNT_Tests/venv/lib/python2.7/site-packages/lit-0.10.0.dev0-py2.7.egg/lit/TestRunner.py", line 1217, in parseIntegratedTestScriptCommands IOError: [Errno 2] No such file or directory: '/Users/buildslave/jenkins/workspace/LNT_Tests/llvm-lnt/tests/runtest/test_suite-profile.shtest'

Hide Details

Hide Details

******************** UNRESOLVED: LNT :: runtest/test_suite-run-order.shtest (41 of 72) ******************** TEST 'LNT :: runtest/test_suite-run-order.shtest' FAILED ******************** Exception during script execution: Traceback (most recent call last): File "/Users/buildslave/jenkins/workspace/LNT_Tests/venv/lib/python2.7/site-packages/lit-0.10.0.dev0-py2.7.egg/lit/worker.py", line 63, in _execute_test File "/Users/buildslave/jenkins/workspace/LNT_Tests/venv/lib/python2.7/site-packages/lit-0.10.0.dev0-py2.7.egg/lit/formats/shtest.py", line 25, in execute File "/Users/buildslave/jenkins/workspace/LNT_Tests/venv/lib/python2.7/site-packages/lit-0.10.0.dev0-py2.7.egg/lit/TestRunner.py", line 1641, in executeShTest File "/Users/buildslave/jenkins/workspace/LNT_Tests/venv/lib/python2.7/site-packages/lit-0.10.0.dev0-py2.7.egg/lit/TestRunner.py", line 1547, in parseIntegratedTestScript File "/Users/buildslave/jenkins/workspace/LNT_Tests/venv/lib/python2.7/site-packages/lit-0.10.0.dev0-py2.7.egg/lit/TestRunner.py", line 1217, in parseIntegratedTestScriptCommands IOError: [Errno 2] No such file or directory: '/Users/buildslave/jenkins/workspace/LNT_Tests/llvm-lnt/tests/runtest/test_suite-run-order.shtest'

Hide Details

Hide Details

******************** UNRESOLVED: LNT :: runtest/test_suite-run-under.shtest (42 of 72) ******************** TEST 'LNT :: runtest/test_suite-run-under.shtest' FAILED ******************** Exception during script execution: Traceback (most recent call last): File "/Users/buildslave/jenkins/workspace/LNT_Tests/venv/lib/python2.7/site-packages/lit-0.10.0.dev0-py2.7.egg/lit/worker.py", line 63, in _execute_test File "/Users/buildslave/jenkins/workspace/LNT_Tests/venv/lib/python2.7/site-packages/lit-0.10.0.dev0-py2.7.egg/lit/formats/shtest.py", line 25, in execute File "/Users/buildslave/jenkins/workspace/LNT_Tests/venv/lib/python2.7/site-packages/lit-0.10.0.dev0-py2.7.egg/lit/TestRunner.py", line 1641, in executeShTest File "/Users/buildslave/jenkins/workspace/LNT_Tests/venv/lib/python2.7/site-packages/lit-0.10.0.dev0-py2.7.egg/lit/TestRunner.py", line 1547, in parseIntegratedTestScript File "/Users/buildslave/jenkins/workspace/LNT_Tests/venv/lib/python2.7/site-packages/lit-0.10.0.dev0-py2.7.egg/lit/TestRunner.py", line 1217, in parseIntegratedTestScriptCommands IOError: [Errno 2] No such file or directory: '/Users/buildslave/jenkins/workspace/LNT_Tests/llvm-lnt/tests/runtest/test_suite-run-under.shtest'

Hide Details

Hide Details

******************** UNRESOLVED: LNT :: runtest/test_suite-use-perf.shtest (43 of 72) ******************** TEST 'LNT :: runtest/test_suite-use-perf.shtest' FAILED ******************** Exception during script execution: Traceback (most recent call last): File "/Users/buildslave/jenkins/workspace/LNT_Tests/venv/lib/python2.7/site-packages/lit-0.10.0.dev0-py2.7.egg/lit/worker.py", line 63, in _execute_test File "/Users/buildslave/jenkins/workspace/LNT_Tests/venv/lib/python2.7/site-packages/lit-0.10.0.dev0-py2.7.egg/lit/formats/shtest.py", line 25, in execute File "/Users/buildslave/jenkins/workspace/LNT_Tests/venv/lib/python2.7/site-packages/lit-0.10.0.dev0-py2.7.egg/lit/TestRunner.py", line 1641, in executeShTest File "/Users/buildslave/jenkins/workspace/LNT_Tests/venv/lib/python2.7/site-packages/lit-0.10.0.dev0-py2.7.egg/lit/TestRunner.py", line 1547, in parseIntegratedTestScript File "/Users/buildslave/jenkins/workspace/LNT_Tests/venv/lib/python2.7/site-packages/lit-0.10.0.dev0-py2.7.egg/lit/TestRunner.py", line 1217, in parseIntegratedTestScriptCommands IOError: [Errno 2] No such file or directory: '/Users/buildslave/jenkins/workspace/LNT_Tests/llvm-lnt/tests/runtest/test_suite-use-perf.shtest'

Hide Details

Hide Details

******************** UNRESOLVED: LNT :: runtest/test_suite.shtest (44 of 72) ******************** TEST 'LNT :: runtest/test_suite.shtest' FAILED ******************** Exception during script execution: Traceback (most recent call last): File "/Users/buildslave/jenkins/workspace/LNT_Tests/venv/lib/python2.7/site-packages/lit-0.10.0.dev0-py2.7.egg/lit/worker.py", line 63, in _execute_test File "/Users/buildslave/jenkins/workspace/LNT_Tests/venv/lib/python2.7/site-packages/lit-0.10.0.dev0-py2.7.egg/lit/formats/shtest.py", line 25, in execute File "/Users/buildslave/jenkins/workspace/LNT_Tests/venv/lib/python2.7/site-packages/lit-0.10.0.dev0-py2.7.egg/lit/TestRunner.py", line 1641, in executeShTest File "/Users/buildslave/jenkins/workspace/LNT_Tests/venv/lib/python2.7/site-packages/lit-0.10.0.dev0-py2.7.egg/lit/TestRunner.py", line 1547, in parseIntegratedTestScript File "/Users/buildslave/jenkins/workspace/LNT_Tests/venv/lib/python2.7/site-packages/lit-0.10.0.dev0-py2.7.egg/lit/TestRunner.py", line 1217, in parseIntegratedTestScriptCommands IOError: [Errno 2] No such file or directory: '/Users/buildslave/jenkins/workspace/LNT_Tests/llvm-lnt/tests/runtest/test_suite.shtest'

Hide Details

Hide Details

******************** UNRESOLVED: LNT :: runtest/test_suite_diagnose.shtest (45 of 72) ******************** TEST 'LNT :: runtest/test_suite_diagnose.shtest' FAILED ******************** Exception during script execution: Traceback (most recent call last): File "/Users/buildslave/jenkins/workspace/LNT_Tests/venv/lib/python2.7/site-packages/lit-0.10.0.dev0-py2.7.egg/lit/worker.py", line 63, in _execute_test File "/Users/buildslave/jenkins/workspace/LNT_Tests/venv/lib/python2.7/site-packages/lit-0.10.0.dev0-py2.7.egg/lit/formats/shtest.py", line 25, in execute File "/Users/buildslave/jenkins/workspace/LNT_Tests/venv/lib/python2.7/site-packages/lit-0.10.0.dev0-py2.7.egg/lit/TestRunner.py", line 1641, in executeShTest File "/Users/buildslave/jenkins/workspace/LNT_Tests/venv/lib/python2.7/site-packages/lit-0.10.0.dev0-py2.7.egg/lit/TestRunner.py", line 1547, in parseIntegratedTestScript File "/Users/buildslave/jenkins/workspace/LNT_Tests/venv/lib/python2.7/site-packages/lit-0.10.0.dev0-py2.7.egg/lit/TestRunner.py", line 1217, in parseIntegratedTestScriptCommands IOError: [Errno 2] No such file or directory: '/Users/buildslave/jenkins/workspace/LNT_Tests/llvm-lnt/tests/runtest/test_suite_diagnose.shtest'

Hide Details

Hide Details

******************** UNRESOLVED: LNT :: server/db/CreateV4TestSuite.py (46 of 72) ******************** TEST 'LNT :: server/db/CreateV4TestSuite.py' FAILED ******************** Exception during script execution: Traceback (most recent call last): File "/Users/buildslave/jenkins/workspace/LNT_Tests/venv/lib/python2.7/site-packages/lit-0.10.0.dev0-py2.7.egg/lit/worker.py", line 63, in _execute_test File "/Users/buildslave/jenkins/workspace/LNT_Tests/venv/lib/python2.7/site-packages/lit-0.10.0.dev0-py2.7.egg/lit/formats/shtest.py", line 25, in execute File "/Users/buildslave/jenkins/workspace/LNT_Tests/venv/lib/python2.7/site-packages/lit-0.10.0.dev0-py2.7.egg/lit/TestRunner.py", line 1641, in executeShTest File "/Users/buildslave/jenkins/workspace/LNT_Tests/venv/lib/python2.7/site-packages/lit-0.10.0.dev0-py2.7.egg/lit/TestRunner.py", line 1547, in parseIntegratedTestScript File "/Users/buildslave/jenkins/workspace/LNT_Tests/venv/lib/python2.7/site-packages/lit-0.10.0.dev0-py2.7.egg/lit/TestRunner.py", line 1217, in parseIntegratedTestScriptCommands IOError: [Errno 2] No such file or directory: '/Users/buildslave/jenkins/workspace/LNT_Tests/llvm-lnt/tests/server/db/CreateV4TestSuite.py'

Hide Details

Hide Details

******************** UNRESOLVED: LNT :: server/db/CreateV4TestSuiteInstance.py (47 of 72) ******************** TEST 'LNT :: server/db/CreateV4TestSuiteInstance.py' FAILED ******************** Exception during script execution: Traceback (most recent call last): File "/Users/buildslave/jenkins/workspace/LNT_Tests/venv/lib/python2.7/site-packages/lit-0.10.0.dev0-py2.7.egg/lit/worker.py", line 63, in _execute_test File "/Users/buildslave/jenkins/workspace/LNT_Tests/venv/lib/python2.7/site-packages/lit-0.10.0.dev0-py2.7.egg/lit/formats/shtest.py", line 25, in execute File "/Users/buildslave/jenkins/workspace/LNT_Tests/venv/lib/python2.7/site-packages/lit-0.10.0.dev0-py2.7.egg/lit/TestRunner.py", line 1641, in executeShTest File "/Users/buildslave/jenkins/workspace/LNT_Tests/venv/lib/python2.7/site-packages/lit-0.10.0.dev0-py2.7.egg/lit/TestRunner.py", line 1547, in parseIntegratedTestScript File "/Users/buildslave/jenkins/workspace/LNT_Tests/venv/lib/python2.7/site-packages/lit-0.10.0.dev0-py2.7.egg/lit/TestRunner.py", line 1217, in parseIntegratedTestScriptCommands IOError: [Errno 2] No such file or directory: '/Users/buildslave/jenkins/workspace/LNT_Tests/llvm-lnt/tests/server/db/CreateV4TestSuiteInstance.py'

Hide Details

Hide Details

******************** UNRESOLVED: LNT :: server/db/ImportProfile.py (48 of 72) ******************** TEST 'LNT :: server/db/ImportProfile.py' FAILED ******************** Exception during script execution: Traceback (most recent call last): File "/Users/buildslave/jenkins/workspace/LNT_Tests/venv/lib/python2.7/site-packages/lit-0.10.0.dev0-py2.7.egg/lit/worker.py", line 63, in _execute_test File "/Users/buildslave/jenkins/workspace/LNT_Tests/venv/lib/python2.7/site-packages/lit-0.10.0.dev0-py2.7.egg/lit/formats/shtest.py", line 25, in execute File "/Users/buildslave/jenkins/workspace/LNT_Tests/venv/lib/python2.7/site-packages/lit-0.10.0.dev0-py2.7.egg/lit/TestRunner.py", line 1641, in executeShTest File "/Users/buildslave/jenkins/workspace/LNT_Tests/venv/lib/python2.7/site-packages/lit-0.10.0.dev0-py2.7.egg/lit/TestRunner.py", line 1547, in parseIntegratedTestScript File "/Users/buildslave/jenkins/workspace/LNT_Tests/venv/lib/python2.7/site-packages/lit-0.10.0.dev0-py2.7.egg/lit/TestRunner.py", line 1217, in parseIntegratedTestScriptCommands IOError: [Errno 2] No such file or directory: '/Users/buildslave/jenkins/workspace/LNT_Tests/llvm-lnt/tests/server/db/ImportProfile.py'

Hide Details

Hide Details

******************** UNRESOLVED: LNT :: server/db/ImportV4TestSuiteInstance.py (49 of 72) ******************** TEST 'LNT :: server/db/ImportV4TestSuiteInstance.py' FAILED ******************** Exception during script execution: Traceback (most recent call last): File "/Users/buildslave/jenkins/workspace/LNT_Tests/venv/lib/python2.7/site-packages/lit-0.10.0.dev0-py2.7.egg/lit/worker.py", line 63, in _execute_test File "/Users/buildslave/jenkins/workspace/LNT_Tests/venv/lib/python2.7/site-packages/lit-0.10.0.dev0-py2.7.egg/lit/formats/shtest.py", line 25, in execute File "/Users/buildslave/jenkins/workspace/LNT_Tests/venv/lib/python2.7/site-packages/lit-0.10.0.dev0-py2.7.egg/lit/TestRunner.py", line 1641, in executeShTest File "/Users/buildslave/jenkins/workspace/LNT_Tests/venv/lib/python2.7/site-packages/lit-0.10.0.dev0-py2.7.egg/lit/TestRunner.py", line 1547, in parseIntegratedTestScript File "/Users/buildslave/jenkins/workspace/LNT_Tests/venv/lib/python2.7/site-packages/lit-0.10.0.dev0-py2.7.egg/lit/TestRunner.py", line 1217, in parseIntegratedTestScriptCommands IOError: [Errno 2] No such file or directory: '/Users/buildslave/jenkins/workspace/LNT_Tests/llvm-lnt/tests/server/db/ImportV4TestSuiteInstance.py'

Hide Details

Hide Details

******************** UNRESOLVED: LNT :: server/db/Migrations.py (50 of 72) ******************** TEST 'LNT :: server/db/Migrations.py' FAILED ******************** Exception during script execution: Traceback (most recent call last): File "/Users/buildslave/jenkins/workspace/LNT_Tests/venv/lib/python2.7/site-packages/lit-0.10.0.dev0-py2.7.egg/lit/worker.py", line 63, in _execute_test File "/Users/buildslave/jenkins/workspace/LNT_Tests/venv/lib/python2.7/site-packages/lit-0.10.0.dev0-py2.7.egg/lit/formats/shtest.py", line 25, in execute File "/Users/buildslave/jenkins/workspace/LNT_Tests/venv/lib/python2.7/site-packages/lit-0.10.0.dev0-py2.7.egg/lit/TestRunner.py", line 1641, in executeShTest File "/Users/buildslave/jenkins/workspace/LNT_Tests/venv/lib/python2.7/site-packages/lit-0.10.0.dev0-py2.7.egg/lit/TestRunner.py", line 1547, in parseIntegratedTestScript File "/Users/buildslave/jenkins/workspace/LNT_Tests/venv/lib/python2.7/site-packages/lit-0.10.0.dev0-py2.7.egg/lit/TestRunner.py", line 1217, in parseIntegratedTestScriptCommands IOError: [Errno 2] No such file or directory: '/Users/buildslave/jenkins/workspace/LNT_Tests/llvm-lnt/tests/server/db/Migrations.py'

Hide Details

Hide Details

******************** UNRESOLVED: LNT :: server/db/rules.py (51 of 72) ******************** TEST 'LNT :: server/db/rules.py' FAILED ******************** Exception during script execution: Traceback (most recent call last): File "/Users/buildslave/jenkins/workspace/LNT_Tests/venv/lib/python2.7/site-packages/lit-0.10.0.dev0-py2.7.egg/lit/worker.py", line 63, in _execute_test File "/Users/buildslave/jenkins/workspace/LNT_Tests/venv/lib/python2.7/site-packages/lit-0.10.0.dev0-py2.7.egg/lit/formats/shtest.py", line 25, in execute File "/Users/buildslave/jenkins/workspace/LNT_Tests/venv/lib/python2.7/site-packages/lit-0.10.0.dev0-py2.7.egg/lit/TestRunner.py", line 1641, in executeShTest File "/Users/buildslave/jenkins/workspace/LNT_Tests/venv/lib/python2.7/site-packages/lit-0.10.0.dev0-py2.7.egg/lit/TestRunner.py", line 1547, in parseIntegratedTestScript File "/Users/buildslave/jenkins/workspace/LNT_Tests/venv/lib/python2.7/site-packages/lit-0.10.0.dev0-py2.7.egg/lit/TestRunner.py", line 1217, in parseIntegratedTestScriptCommands IOError: [Errno 2] No such file or directory: '/Users/buildslave/jenkins/workspace/LNT_Tests/llvm-lnt/tests/server/db/rules.py'

Hide Details

Hide Details

******************** UNRESOLVED: LNT :: server/db/search.py (52 of 72) ******************** TEST 'LNT :: server/db/search.py' FAILED ******************** Exception during script execution: Traceback (most recent call last): File "/Users/buildslave/jenkins/workspace/LNT_Tests/venv/lib/python2.7/site-packages/lit-0.10.0.dev0-py2.7.egg/lit/worker.py", line 63, in _execute_test File "/Users/buildslave/jenkins/workspace/LNT_Tests/venv/lib/python2.7/site-packages/lit-0.10.0.dev0-py2.7.egg/lit/formats/shtest.py", line 25, in execute File "/Users/buildslave/jenkins/workspace/LNT_Tests/venv/lib/python2.7/site-packages/lit-0.10.0.dev0-py2.7.egg/lit/TestRunner.py", line 1641, in executeShTest File "/Users/buildslave/jenkins/workspace/LNT_Tests/venv/lib/python2.7/site-packages/lit-0.10.0.dev0-py2.7.egg/lit/TestRunner.py", line 1547, in parseIntegratedTestScript File "/Users/buildslave/jenkins/workspace/LNT_Tests/venv/lib/python2.7/site-packages/lit-0.10.0.dev0-py2.7.egg/lit/TestRunner.py", line 1217, in parseIntegratedTestScriptCommands IOError: [Errno 2] No such file or directory: '/Users/buildslave/jenkins/workspace/LNT_Tests/llvm-lnt/tests/server/db/search.py'

Hide Details

Hide Details

******************** UNRESOLVED: LNT :: server/db/yamlschema.shtest (53 of 72) ******************** TEST 'LNT :: server/db/yamlschema.shtest' FAILED ******************** Exception during script execution: Traceback (most recent call last): File "/Users/buildslave/jenkins/workspace/LNT_Tests/venv/lib/python2.7/site-packages/lit-0.10.0.dev0-py2.7.egg/lit/worker.py", line 63, in _execute_test File "/Users/buildslave/jenkins/workspace/LNT_Tests/venv/lib/python2.7/site-packages/lit-0.10.0.dev0-py2.7.egg/lit/formats/shtest.py", line 25, in execute File "/Users/buildslave/jenkins/workspace/LNT_Tests/venv/lib/python2.7/site-packages/lit-0.10.0.dev0-py2.7.egg/lit/TestRunner.py", line 1641, in executeShTest File "/Users/buildslave/jenkins/workspace/LNT_Tests/venv/lib/python2.7/site-packages/lit-0.10.0.dev0-py2.7.egg/lit/TestRunner.py", line 1547, in parseIntegratedTestScript File "/Users/buildslave/jenkins/workspace/LNT_Tests/venv/lib/python2.7/site-packages/lit-0.10.0.dev0-py2.7.egg/lit/TestRunner.py", line 1217, in parseIntegratedTestScriptCommands IOError: [Errno 2] No such file or directory: '/Users/buildslave/jenkins/workspace/LNT_Tests/llvm-lnt/tests/server/db/yamlschema.shtest'

Hide Details

Hide Details

******************** UNRESOLVED: LNT :: server/reporting/analysis.py (54 of 72) ******************** TEST 'LNT :: server/reporting/analysis.py' FAILED ******************** Exception during script execution: Traceback (most recent call last): File "/Users/buildslave/jenkins/workspace/LNT_Tests/venv/lib/python2.7/site-packages/lit-0.10.0.dev0-py2.7.egg/lit/worker.py", line 63, in _execute_test File "/Users/buildslave/jenkins/workspace/LNT_Tests/venv/lib/python2.7/site-packages/lit-0.10.0.dev0-py2.7.egg/lit/formats/shtest.py", line 25, in execute File "/Users/buildslave/jenkins/workspace/LNT_Tests/venv/lib/python2.7/site-packages/lit-0.10.0.dev0-py2.7.egg/lit/TestRunner.py", line 1641, in executeShTest File "/Users/buildslave/jenkins/workspace/LNT_Tests/venv/lib/python2.7/site-packages/lit-0.10.0.dev0-py2.7.egg/lit/TestRunner.py", line 1547, in parseIntegratedTestScript File "/Users/buildslave/jenkins/workspace/LNT_Tests/venv/lib/python2.7/site-packages/lit-0.10.0.dev0-py2.7.egg/lit/TestRunner.py", line 1217, in parseIntegratedTestScriptCommands IOError: [Errno 2] No such file or directory: '/Users/buildslave/jenkins/workspace/LNT_Tests/llvm-lnt/tests/server/reporting/analysis.py'

Hide Details

Hide Details

******************** UNRESOLVED: LNT :: server/ui/V4Pages.py (55 of 72) ******************** TEST 'LNT :: server/ui/V4Pages.py' FAILED ******************** Exception during script execution: Traceback (most recent call last): File "/Users/buildslave/jenkins/workspace/LNT_Tests/venv/lib/python2.7/site-packages/lit-0.10.0.dev0-py2.7.egg/lit/worker.py", line 63, in _execute_test File "/Users/buildslave/jenkins/workspace/LNT_Tests/venv/lib/python2.7/site-packages/lit-0.10.0.dev0-py2.7.egg/lit/formats/shtest.py", line 25, in execute File "/Users/buildslave/jenkins/workspace/LNT_Tests/venv/lib/python2.7/site-packages/lit-0.10.0.dev0-py2.7.egg/lit/TestRunner.py", line 1641, in executeShTest File "/Users/buildslave/jenkins/workspace/LNT_Tests/venv/lib/python2.7/site-packages/lit-0.10.0.dev0-py2.7.egg/lit/TestRunner.py", line 1547, in parseIntegratedTestScript File "/Users/buildslave/jenkins/workspace/LNT_Tests/venv/lib/python2.7/site-packages/lit-0.10.0.dev0-py2.7.egg/lit/TestRunner.py", line 1217, in parseIntegratedTestScriptCommands IOError: [Errno 2] No such file or directory: '/Users/buildslave/jenkins/workspace/LNT_Tests/llvm-lnt/tests/server/ui/V4Pages.py'

Hide Details

Hide Details

******************** UNRESOLVED: LNT :: server/ui/change_processing.py (56 of 72) ******************** TEST 'LNT :: server/ui/change_processing.py' FAILED ******************** Exception during script execution: Traceback (most recent call last): File "/Users/buildslave/jenkins/workspace/LNT_Tests/venv/lib/python2.7/site-packages/lit-0.10.0.dev0-py2.7.egg/lit/worker.py", line 63, in _execute_test File "/Users/buildslave/jenkins/workspace/LNT_Tests/venv/lib/python2.7/site-packages/lit-0.10.0.dev0-py2.7.egg/lit/formats/shtest.py", line 25, in execute File "/Users/buildslave/jenkins/workspace/LNT_Tests/venv/lib/python2.7/site-packages/lit-0.10.0.dev0-py2.7.egg/lit/TestRunner.py", line 1641, in executeShTest File "/Users/buildslave/jenkins/workspace/LNT_Tests/venv/lib/python2.7/site-packages/lit-0.10.0.dev0-py2.7.egg/lit/TestRunner.py", line 1547, in parseIntegratedTestScript File "/Users/buildslave/jenkins/workspace/LNT_Tests/venv/lib/python2.7/site-packages/lit-0.10.0.dev0-py2.7.egg/lit/TestRunner.py", line 1217, in parseIntegratedTestScriptCommands IOError: [Errno 2] No such file or directory: '/Users/buildslave/jenkins/workspace/LNT_Tests/llvm-lnt/tests/server/ui/change_processing.py'

Hide Details

Hide Details

******************** UNRESOLVED: LNT :: server/ui/statsTester.py (57 of 72) ******************** TEST 'LNT :: server/ui/statsTester.py' FAILED ******************** Exception during script execution: Traceback (most recent call last): File "/Users/buildslave/jenkins/workspace/LNT_Tests/venv/lib/python2.7/site-packages/lit-0.10.0.dev0-py2.7.egg/lit/worker.py", line 63, in _execute_test File "/Users/buildslave/jenkins/workspace/LNT_Tests/venv/lib/python2.7/site-packages/lit-0.10.0.dev0-py2.7.egg/lit/formats/shtest.py", line 25, in execute File "/Users/buildslave/jenkins/workspace/LNT_Tests/venv/lib/python2.7/site-packages/lit-0.10.0.dev0-py2.7.egg/lit/TestRunner.py", line 1641, in executeShTest File "/Users/buildslave/jenkins/workspace/LNT_Tests/venv/lib/python2.7/site-packages/lit-0.10.0.dev0-py2.7.egg/lit/TestRunner.py", line 1547, in parseIntegratedTestScript File "/Users/buildslave/jenkins/workspace/LNT_Tests/venv/lib/python2.7/site-packages/lit-0.10.0.dev0-py2.7.egg/lit/TestRunner.py", line 1217, in parseIntegratedTestScriptCommands IOError: [Errno 2] No such file or directory: '/Users/buildslave/jenkins/workspace/LNT_Tests/llvm-lnt/tests/server/ui/statsTester.py'

Hide Details

Hide Details

******************** UNRESOLVED: LNT :: server/ui/test_api.py (58 of 72) ******************** TEST 'LNT :: server/ui/test_api.py' FAILED ******************** Exception during script execution: Traceback (most recent call last): File "/Users/buildslave/jenkins/workspace/LNT_Tests/venv/lib/python2.7/site-packages/lit-0.10.0.dev0-py2.7.egg/lit/worker.py", line 63, in _execute_test File "/Users/buildslave/jenkins/workspace/LNT_Tests/venv/lib/python2.7/site-packages/lit-0.10.0.dev0-py2.7.egg/lit/formats/shtest.py", line 25, in execute File "/Users/buildslave/jenkins/workspace/LNT_Tests/venv/lib/python2.7/site-packages/lit-0.10.0.dev0-py2.7.egg/lit/TestRunner.py", line 1641, in executeShTest File "/Users/buildslave/jenkins/workspace/LNT_Tests/venv/lib/python2.7/site-packages/lit-0.10.0.dev0-py2.7.egg/lit/TestRunner.py", line 1547, in parseIntegratedTestScript File "/Users/buildslave/jenkins/workspace/LNT_Tests/venv/lib/python2.7/site-packages/lit-0.10.0.dev0-py2.7.egg/lit/TestRunner.py", line 1217, in parseIntegratedTestScriptCommands IOError: [Errno 2] No such file or directory: '/Users/buildslave/jenkins/workspace/LNT_Tests/llvm-lnt/tests/server/ui/test_api.py'

Hide Details

Hide Details

******************** UNRESOLVED: LNT :: server/ui/test_api_modify.py (59 of 72) ******************** TEST 'LNT :: server/ui/test_api_modify.py' FAILED ******************** Exception during script execution: Traceback (most recent call last): File "/Users/buildslave/jenkins/workspace/LNT_Tests/venv/lib/python2.7/site-packages/lit-0.10.0.dev0-py2.7.egg/lit/worker.py", line 63, in _execute_test File "/Users/buildslave/jenkins/workspace/LNT_Tests/venv/lib/python2.7/site-packages/lit-0.10.0.dev0-py2.7.egg/lit/formats/shtest.py", line 25, in execute File "/Users/buildslave/jenkins/workspace/LNT_Tests/venv/lib/python2.7/site-packages/lit-0.10.0.dev0-py2.7.egg/lit/TestRunner.py", line 1641, in executeShTest File "/Users/buildslave/jenkins/workspace/LNT_Tests/venv/lib/python2.7/site-packages/lit-0.10.0.dev0-py2.7.egg/lit/TestRunner.py", line 1547, in parseIntegratedTestScript File "/Users/buildslave/jenkins/workspace/LNT_Tests/venv/lib/python2.7/site-packages/lit-0.10.0.dev0-py2.7.egg/lit/TestRunner.py", line 1217, in parseIntegratedTestScriptCommands IOError: [Errno 2] No such file or directory: '/Users/buildslave/jenkins/workspace/LNT_Tests/llvm-lnt/tests/server/ui/test_api_modify.py'

Hide Details

Hide Details

******************** UNRESOLVED: LNT :: server/ui/test_api_roundtrip.py (60 of 72) ******************** TEST 'LNT :: server/ui/test_api_roundtrip.py' FAILED ******************** Exception during script execution: Traceback (most recent call last): File "/Users/buildslave/jenkins/workspace/LNT_Tests/venv/lib/python2.7/site-packages/lit-0.10.0.dev0-py2.7.egg/lit/worker.py", line 63, in _execute_test File "/Users/buildslave/jenkins/workspace/LNT_Tests/venv/lib/python2.7/site-packages/lit-0.10.0.dev0-py2.7.egg/lit/formats/shtest.py", line 25, in execute File "/Users/buildslave/jenkins/workspace/LNT_Tests/venv/lib/python2.7/site-packages/lit-0.10.0.dev0-py2.7.egg/lit/TestRunner.py", line 1641, in executeShTest File "/Users/buildslave/jenkins/workspace/LNT_Tests/venv/lib/python2.7/site-packages/lit-0.10.0.dev0-py2.7.egg/lit/TestRunner.py", line 1547, in parseIntegratedTestScript File "/Users/buildslave/jenkins/workspace/LNT_Tests/venv/lib/python2.7/site-packages/lit-0.10.0.dev0-py2.7.egg/lit/TestRunner.py", line 1217, in parseIntegratedTestScriptCommands IOError: [Errno 2] No such file or directory: '/Users/buildslave/jenkins/workspace/LNT_Tests/llvm-lnt/tests/server/ui/test_api_roundtrip.py'

Hide Details

Hide Details

******************** UNRESOLVED: LNT :: server/ui/test_matrix_page.py (61 of 72) ******************** TEST 'LNT :: server/ui/test_matrix_page.py' FAILED ******************** Exception during script execution: Traceback (most recent call last): File "/Users/buildslave/jenkins/workspace/LNT_Tests/venv/lib/python2.7/site-packages/lit-0.10.0.dev0-py2.7.egg/lit/worker.py", line 63, in _execute_test File "/Users/buildslave/jenkins/workspace/LNT_Tests/venv/lib/python2.7/site-packages/lit-0.10.0.dev0-py2.7.egg/lit/formats/shtest.py", line 25, in execute File "/Users/buildslave/jenkins/workspace/LNT_Tests/venv/lib/python2.7/site-packages/lit-0.10.0.dev0-py2.7.egg/lit/TestRunner.py", line 1641, in executeShTest File "/Users/buildslave/jenkins/workspace/LNT_Tests/venv/lib/python2.7/site-packages/lit-0.10.0.dev0-py2.7.egg/lit/TestRunner.py", line 1547, in parseIntegratedTestScript File "/Users/buildslave/jenkins/workspace/LNT_Tests/venv/lib/python2.7/site-packages/lit-0.10.0.dev0-py2.7.egg/lit/TestRunner.py", line 1217, in parseIntegratedTestScriptCommands IOError: [Errno 2] No such file or directory: '/Users/buildslave/jenkins/workspace/LNT_Tests/llvm-lnt/tests/server/ui/test_matrix_page.py'

Hide Details

Hide Details

******************** UNRESOLVED: LNT :: server/ui/test_roundtrip.py (62 of 72) ******************** TEST 'LNT :: server/ui/test_roundtrip.py' FAILED ******************** Exception during script execution: Traceback (most recent call last): File "/Users/buildslave/jenkins/workspace/LNT_Tests/venv/lib/python2.7/site-packages/lit-0.10.0.dev0-py2.7.egg/lit/worker.py", line 63, in _execute_test File "/Users/buildslave/jenkins/workspace/LNT_Tests/venv/lib/python2.7/site-packages/lit-0.10.0.dev0-py2.7.egg/lit/formats/shtest.py", line 25, in execute File "/Users/buildslave/jenkins/workspace/LNT_Tests/venv/lib/python2.7/site-packages/lit-0.10.0.dev0-py2.7.egg/lit/TestRunner.py", line 1641, in executeShTest File "/Users/buildslave/jenkins/workspace/LNT_Tests/venv/lib/python2.7/site-packages/lit-0.10.0.dev0-py2.7.egg/lit/TestRunner.py", line 1547, in parseIntegratedTestScript File "/Users/buildslave/jenkins/workspace/LNT_Tests/venv/lib/python2.7/site-packages/lit-0.10.0.dev0-py2.7.egg/lit/TestRunner.py", line 1217, in parseIntegratedTestScriptCommands IOError: [Errno 2] No such file or directory: '/Users/buildslave/jenkins/workspace/LNT_Tests/llvm-lnt/tests/server/ui/test_roundtrip.py'

Hide Details

Hide Details

******************** UNRESOLVED: LNT :: server/ui/test_system_info.py (63 of 72) ******************** TEST 'LNT :: server/ui/test_system_info.py' FAILED ******************** Exception during script execution: Traceback (most recent call last): File "/Users/buildslave/jenkins/workspace/LNT_Tests/venv/lib/python2.7/site-packages/lit-0.10.0.dev0-py2.7.egg/lit/worker.py", line 63, in _execute_test File "/Users/buildslave/jenkins/workspace/LNT_Tests/venv/lib/python2.7/site-packages/lit-0.10.0.dev0-py2.7.egg/lit/formats/shtest.py", line 25, in execute File "/Users/buildslave/jenkins/workspace/LNT_Tests/venv/lib/python2.7/site-packages/lit-0.10.0.dev0-py2.7.egg/lit/TestRunner.py", line 1641, in executeShTest File "/Users/buildslave/jenkins/workspace/LNT_Tests/venv/lib/python2.7/site-packages/lit-0.10.0.dev0-py2.7.egg/lit/TestRunner.py", line 1547, in parseIntegratedTestScript File "/Users/buildslave/jenkins/workspace/LNT_Tests/venv/lib/python2.7/site-packages/lit-0.10.0.dev0-py2.7.egg/lit/TestRunner.py", line 1217, in parseIntegratedTestScriptCommands IOError: [Errno 2] No such file or directory: '/Users/buildslave/jenkins/workspace/LNT_Tests/llvm-lnt/tests/server/ui/test_system_info.py'

Hide Details

Hide Details

******************** UNRESOLVED: LNT :: testing/CalltreeDataLoading.py (64 of 72) ******************** TEST 'LNT :: testing/CalltreeDataLoading.py' FAILED ******************** Exception during script execution: Traceback (most recent call last): File "/Users/buildslave/jenkins/workspace/LNT_Tests/venv/lib/python2.7/site-packages/lit-0.10.0.dev0-py2.7.egg/lit/worker.py", line 63, in _execute_test File "/Users/buildslave/jenkins/workspace/LNT_Tests/venv/lib/python2.7/site-packages/lit-0.10.0.dev0-py2.7.egg/lit/formats/shtest.py", line 25, in execute File "/Users/buildslave/jenkins/workspace/LNT_Tests/venv/lib/python2.7/site-packages/lit-0.10.0.dev0-py2.7.egg/lit/TestRunner.py", line 1641, in executeShTest File "/Users/buildslave/jenkins/workspace/LNT_Tests/venv/lib/python2.7/site-packages/lit-0.10.0.dev0-py2.7.egg/lit/TestRunner.py", line 1547, in parseIntegratedTestScript File "/Users/buildslave/jenkins/workspace/LNT_Tests/venv/lib/python2.7/site-packages/lit-0.10.0.dev0-py2.7.egg/lit/TestRunner.py", line 1217, in parseIntegratedTestScriptCommands IOError: [Errno 2] No such file or directory: '/Users/buildslave/jenkins/workspace/LNT_Tests/llvm-lnt/tests/testing/CalltreeDataLoading.py'

Hide Details

Hide Details

******************** UNRESOLVED: LNT :: testing/Compilers.py (65 of 72) ******************** TEST 'LNT :: testing/Compilers.py' FAILED ******************** Exception during script execution: Traceback (most recent call last): File "/Users/buildslave/jenkins/workspace/LNT_Tests/venv/lib/python2.7/site-packages/lit-0.10.0.dev0-py2.7.egg/lit/worker.py", line 63, in _execute_test File "/Users/buildslave/jenkins/workspace/LNT_Tests/venv/lib/python2.7/site-packages/lit-0.10.0.dev0-py2.7.egg/lit/formats/shtest.py", line 25, in execute File "/Users/buildslave/jenkins/workspace/LNT_Tests/venv/lib/python2.7/site-packages/lit-0.10.0.dev0-py2.7.egg/lit/TestRunner.py", line 1641, in executeShTest File "/Users/buildslave/jenkins/workspace/LNT_Tests/venv/lib/python2.7/site-packages/lit-0.10.0.dev0-py2.7.egg/lit/TestRunner.py", line 1547, in parseIntegratedTestScript File "/Users/buildslave/jenkins/workspace/LNT_Tests/venv/lib/python2.7/site-packages/lit-0.10.0.dev0-py2.7.egg/lit/TestRunner.py", line 1217, in parseIntegratedTestScriptCommands IOError: [Errno 2] No such file or directory: '/Users/buildslave/jenkins/workspace/LNT_Tests/llvm-lnt/tests/testing/Compilers.py'

Hide Details

Hide Details

******************** UNRESOLVED: LNT :: testing/TestingTest.py (66 of 72) ******************** TEST 'LNT :: testing/TestingTest.py' FAILED ******************** Exception during script execution: Traceback (most recent call last): File "/Users/buildslave/jenkins/workspace/LNT_Tests/venv/lib/python2.7/site-packages/lit-0.10.0.dev0-py2.7.egg/lit/worker.py", line 63, in _execute_test File "/Users/buildslave/jenkins/workspace/LNT_Tests/venv/lib/python2.7/site-packages/lit-0.10.0.dev0-py2.7.egg/lit/formats/shtest.py", line 25, in execute File "/Users/buildslave/jenkins/workspace/LNT_Tests/venv/lib/python2.7/site-packages/lit-0.10.0.dev0-py2.7.egg/lit/TestRunner.py", line 1641, in executeShTest File "/Users/buildslave/jenkins/workspace/LNT_Tests/venv/lib/python2.7/site-packages/lit-0.10.0.dev0-py2.7.egg/lit/TestRunner.py", line 1547, in parseIntegratedTestScript File "/Users/buildslave/jenkins/workspace/LNT_Tests/venv/lib/python2.7/site-packages/lit-0.10.0.dev0-py2.7.egg/lit/TestRunner.py", line 1217, in parseIntegratedTestScriptCommands IOError: [Errno 2] No such file or directory: '/Users/buildslave/jenkins/workspace/LNT_Tests/llvm-lnt/tests/testing/TestingTest.py'

Hide Details

Hide Details

******************** UNRESOLVED: LNT :: testing/cPerf.py (67 of 72) ******************** TEST 'LNT :: testing/cPerf.py' FAILED ******************** Exception during script execution: Traceback (most recent call last): File "/Users/buildslave/jenkins/workspace/LNT_Tests/venv/lib/python2.7/site-packages/lit-0.10.0.dev0-py2.7.egg/lit/worker.py", line 63, in _execute_test File "/Users/buildslave/jenkins/workspace/LNT_Tests/venv/lib/python2.7/site-packages/lit-0.10.0.dev0-py2.7.egg/lit/formats/shtest.py", line 25, in execute File "/Users/buildslave/jenkins/workspace/LNT_Tests/venv/lib/python2.7/site-packages/lit-0.10.0.dev0-py2.7.egg/lit/TestRunner.py", line 1641, in executeShTest File "/Users/buildslave/jenkins/workspace/LNT_Tests/venv/lib/python2.7/site-packages/lit-0.10.0.dev0-py2.7.egg/lit/TestRunner.py", line 1547, in parseIntegratedTestScript File "/Users/buildslave/jenkins/workspace/LNT_Tests/venv/lib/python2.7/site-packages/lit-0.10.0.dev0-py2.7.egg/lit/TestRunner.py", line 1217, in parseIntegratedTestScriptCommands IOError: [Errno 2] No such file or directory: '/Users/buildslave/jenkins/workspace/LNT_Tests/llvm-lnt/tests/testing/cPerf.py'

Hide Details

Hide Details

******************** UNRESOLVED: LNT :: testing/profilev1impl.py (68 of 72) ******************** TEST 'LNT :: testing/profilev1impl.py' FAILED ******************** Exception during script execution: Traceback (most recent call last): File "/Users/buildslave/jenkins/workspace/LNT_Tests/venv/lib/python2.7/site-packages/lit-0.10.0.dev0-py2.7.egg/lit/worker.py", line 63, in _execute_test File "/Users/buildslave/jenkins/workspace/LNT_Tests/venv/lib/python2.7/site-packages/lit-0.10.0.dev0-py2.7.egg/lit/formats/shtest.py", line 25, in execute File "/Users/buildslave/jenkins/workspace/LNT_Tests/venv/lib/python2.7/site-packages/lit-0.10.0.dev0-py2.7.egg/lit/TestRunner.py", line 1641, in executeShTest File "/Users/buildslave/jenkins/workspace/LNT_Tests/venv/lib/python2.7/site-packages/lit-0.10.0.dev0-py2.7.egg/lit/TestRunner.py", line 1547, in parseIntegratedTestScript File "/Users/buildslave/jenkins/workspace/LNT_Tests/venv/lib/python2.7/site-packages/lit-0.10.0.dev0-py2.7.egg/lit/TestRunner.py", line 1217, in parseIntegratedTestScriptCommands IOError: [Errno 2] No such file or directory: '/Users/buildslave/jenkins/workspace/LNT_Tests/llvm-lnt/tests/testing/profilev1impl.py'

Hide Details

Hide Details

******************** UNRESOLVED: LNT :: testing/profilev2impl.py (69 of 72) ******************** TEST 'LNT :: testing/profilev2impl.py' FAILED ******************** Exception during script execution: Traceback (most recent call last): File "/Users/buildslave/jenkins/workspace/LNT_Tests/venv/lib/python2.7/site-packages/lit-0.10.0.dev0-py2.7.egg/lit/worker.py", line 63, in _execute_test File "/Users/buildslave/jenkins/workspace/LNT_Tests/venv/lib/python2.7/site-packages/lit-0.10.0.dev0-py2.7.egg/lit/formats/shtest.py", line 25, in execute File "/Users/buildslave/jenkins/workspace/LNT_Tests/venv/lib/python2.7/site-packages/lit-0.10.0.dev0-py2.7.egg/lit/TestRunner.py", line 1641, in executeShTest File "/Users/buildslave/jenkins/workspace/LNT_Tests/venv/lib/python2.7/site-packages/lit-0.10.0.dev0-py2.7.egg/lit/TestRunner.py", line 1547, in parseIntegratedTestScript File "/Users/buildslave/jenkins/workspace/LNT_Tests/venv/lib/python2.7/site-packages/lit-0.10.0.dev0-py2.7.egg/lit/TestRunner.py", line 1217, in parseIntegratedTestScriptCommands IOError: [Errno 2] No such file or directory: '/Users/buildslave/jenkins/workspace/LNT_Tests/llvm-lnt/tests/testing/profilev2impl.py'

Hide Details

Hide Details

******************** UNRESOLVED: LNT :: utils/Installation.py (70 of 72) ******************** TEST 'LNT :: utils/Installation.py' FAILED ******************** Exception during script execution: Traceback (most recent call last): File "/Users/buildslave/jenkins/workspace/LNT_Tests/venv/lib/python2.7/site-packages/lit-0.10.0.dev0-py2.7.egg/lit/worker.py", line 63, in _execute_test File "/Users/buildslave/jenkins/workspace/LNT_Tests/venv/lib/python2.7/site-packages/lit-0.10.0.dev0-py2.7.egg/lit/formats/shtest.py", line 25, in execute File "/Users/buildslave/jenkins/workspace/LNT_Tests/venv/lib/python2.7/site-packages/lit-0.10.0.dev0-py2.7.egg/lit/TestRunner.py", line 1641, in executeShTest File "/Users/buildslave/jenkins/workspace/LNT_Tests/venv/lib/python2.7/site-packages/lit-0.10.0.dev0-py2.7.egg/lit/TestRunner.py", line 1547, in parseIntegratedTestScript File "/Users/buildslave/jenkins/workspace/LNT_Tests/venv/lib/python2.7/site-packages/lit-0.10.0.dev0-py2.7.egg/lit/TestRunner.py", line 1217, in parseIntegratedTestScriptCommands IOError: [Errno 2] No such file or directory: '/Users/buildslave/jenkins/workspace/LNT_Tests/llvm-lnt/tests/utils/Installation.py'

Hide Details

Hide Details

******************** UNRESOLVED: LNT :: utils/SourceDistribution.py (71 of 72) ******************** TEST 'LNT :: utils/SourceDistribution.py' FAILED ******************** Exception during script execution: Traceback (most recent call last): File "/Users/buildslave/jenkins/workspace/LNT_Tests/venv/lib/python2.7/site-packages/lit-0.10.0.dev0-py2.7.egg/lit/worker.py", line 63, in _execute_test File "/Users/buildslave/jenkins/workspace/LNT_Tests/venv/lib/python2.7/site-packages/lit-0.10.0.dev0-py2.7.egg/lit/formats/shtest.py", line 25, in execute File "/Users/buildslave/jenkins/workspace/LNT_Tests/venv/lib/python2.7/site-packages/lit-0.10.0.dev0-py2.7.egg/lit/TestRunner.py", line 1641, in executeShTest File "/Users/buildslave/jenkins/workspace/LNT_Tests/venv/lib/python2.7/site-packages/lit-0.10.0.dev0-py2.7.egg/lit/TestRunner.py", line 1547, in parseIntegratedTestScript File "/Users/buildslave/jenkins/workspace/LNT_Tests/venv/lib/python2.7/site-packages/lit-0.10.0.dev0-py2.7.egg/lit/TestRunner.py", line 1217, in parseIntegratedTestScriptCommands IOError: [Errno 2] No such file or directory: '/Users/buildslave/jenkins/workspace/LNT_Tests/llvm-lnt/tests/utils/SourceDistribution.py'

Hide Details

Hide Details

******************** UNRESOLVED: LNT :: utils/blast.py (72 of 72) ******************** TEST 'LNT :: utils/blast.py' FAILED ******************** Exception during script execution: Traceback (most recent call last): File "/Users/buildslave/jenkins/workspace/LNT_Tests/venv/lib/python2.7/site-packages/lit-0.10.0.dev0-py2.7.egg/lit/worker.py", line 63, in _execute_test File "/Users/buildslave/jenkins/workspace/LNT_Tests/venv/lib/python2.7/site-packages/lit-0.10.0.dev0-py2.7.egg/lit/formats/shtest.py", line 25, in execute File "/Users/buildslave/jenkins/workspace/LNT_Tests/venv/lib/python2.7/site-packages/lit-0.10.0.dev0-py2.7.egg/lit/TestRunner.py", line 1641, in executeShTest File "/Users/buildslave/jenkins/workspace/LNT_Tests/venv/lib/python2.7/site-packages/lit-0.10.0.dev0-py2.7.egg/lit/TestRunner.py", line 1547, in parseIntegratedTestScript File "/Users/buildslave/jenkins/workspace/LNT_Tests/venv/lib/python2.7/site-packages/lit-0.10.0.dev0-py2.7.egg/lit/TestRunner.py", line 1217, in parseIntegratedTestScriptCommands IOError: [Errno 2] No such file or directory: '/Users/buildslave/jenkins/workspace/LNT_Tests/llvm-lnt/tests/utils/blast.py'

Hide Details

Hide Details

******************** Testing Time: 43376.46s ******************** Failing Tests (1): LNT :: lnttool/MySQLDB.shtest

Hide Details

******************** Unresolved Tests (69): LNT :: lnttool/PostgresDB.shtest LNT :: lnttool/Profile.py LNT :: lnttool/UpdateDB.py LNT :: lnttool/admin.shtest LNT :: lnttool/check_no_errors.shtest LNT :: lnttool/checkformat.shtest LNT :: lnttool/email_tools.py LNT :: lnttool/showtests.shtest LNT :: lnttool/submit.shtest LNT :: lnttool/submit_badurl.shtest LNT :: lnttool/test_importreport.py LNT :: lnttool/view-comparison.shtest LNT :: runtest/exclude_stat.py LNT :: runtest/multisample.py LNT :: runtest/nt-darwin.py LNT :: runtest/nt.py LNT :: runtest/only_test.py LNT :: runtest/rerun.py LNT :: runtest/test_suite-benchmarking-only.shtest LNT :: runtest/test_suite-c-compiler.shtest LNT :: runtest/test_suite-cache.shtest LNT :: runtest/test_suite-cc.shtest LNT :: runtest/test_suite-cflags0.shtest LNT :: runtest/test_suite-cflags1.shtest LNT :: runtest/test_suite-cflags2.shtest LNT :: runtest/test_suite-cflags3.shtest LNT :: runtest/test_suite-cflags4.shtest LNT :: runtest/test_suite-compile-only.shtest LNT :: runtest/test_suite-cross.shtest LNT :: runtest/test_suite-fail-compile.shtest LNT :: runtest/test_suite-fail-exec.shtest LNT :: runtest/test_suite-machine-name.shtest LNT :: runtest/test_suite-metrics.shtest LNT :: runtest/test_suite-only-test.shtest LNT :: runtest/test_suite-perf-events.shtest LNT :: runtest/test_suite-pgo.shtest LNT :: runtest/test_suite-profile.shtest LNT :: runtest/test_suite-run-order.shtest LNT :: runtest/test_suite-run-under.shtest LNT :: runtest/test_suite-use-perf.shtest LNT :: runtest/test_suite.shtest LNT :: runtest/test_suite_diagnose.shtest LNT :: server/db/CreateV4TestSuite.py LNT :: server/db/CreateV4TestSuiteInstance.py LNT :: server/db/ImportProfile.py LNT :: server/db/ImportV4TestSuiteInstance.py LNT :: server/db/Migrations.py LNT :: server/db/rules.py LNT :: server/db/search.py LNT :: server/db/yamlschema.shtest LNT :: server/reporting/analysis.py LNT :: server/ui/V4Pages.py LNT :: server/ui/change_processing.py LNT :: server/ui/statsTester.py LNT :: server/ui/test_api.py LNT :: server/ui/test_api_modify.py LNT :: server/ui/test_api_roundtrip.py LNT :: server/ui/test_matrix_page.py LNT :: server/ui/test_roundtrip.py LNT :: server/ui/test_system_info.py LNT :: testing/CalltreeDataLoading.py LNT :: testing/Compilers.py LNT :: testing/TestingTest.py LNT :: testing/cPerf.py LNT :: testing/profilev1impl.py LNT :: testing/profilev2impl.py LNT :: utils/Installation.py LNT :: utils/SourceDistribution.py LNT :: utils/blast.py

Hide Details

Expected Passes : 2 Unresolved Tests : 69 Unexpected Failures: 1 Traceback (most recent call last): File "/Users/buildslave/jenkins/workspace/LNT_Tests/venv/bin/lit", line 11, in <module> File "/Users/buildslave/jenkins/workspace/LNT_Tests/venv/lib/python2.7/site-packages/lit-0.10.0.dev0-py2.7.egg/lit/main.py", line 109, in main File "/Users/buildslave/jenkins/workspace/LNT_Tests/venv/lib/python2.7/site-packages/lit-0.10.0.dev0-py2.7.egg/lit/main.py", line 385, in write_test_results_xunit IOError: [Errno 2] No such file or directory: '/Users/buildslave/jenkins/workspace/LNT_Tests/lnt.xunit.xml' Build step 'Execute shell' marked build as failure [WARNINGS] Parsing warnings in console log with parser Pep8 Skipping warnings blame since Git is the only supported SCM up to now.%n [WARNINGS] Computing warning deltas based on reference build #3780 [WARNINGS] Ignore new warnings since this is the first valid build [WARNINGS] Plug-in Result: Success - no threshold has been exceeded Recording test results ERROR: Build step failed with exception Also: hudson.remoting.Channel$CallSiteStackTrace: Remote call to labmaster2 at hudson.remoting.Channel.attachCallSiteStackTrace(Channel.java:1743) at hudson.remoting.UserRequest$ExceptionResponse.retrieve(UserRequest.java:357) at hudson.remoting.Channel.call(Channel.java:957) at hudson.FilePath.act(FilePath.java:1070) at hudson.FilePath.act(FilePath.java:1059) at hudson.tasks.junit.JUnitParser.parseResult(JUnitParser.java:114) at hudson.tasks.junit.JUnitResultArchiver.parse(JUnitResultArchiver.java:137) at hudson.tasks.junit.JUnitResultArchiver.parseAndAttach(JUnitResultArchiver.java:167) at hudson.tasks.junit.JUnitResultArchiver.perform(JUnitResultArchiver.java:154) at hudson.tasks.BuildStepCompatibilityLayer.perform(BuildStepCompatibilityLayer.java:79) at hudson.tasks.BuildStepMonitor$1.perform(BuildStepMonitor.java:20) at hudson.model.AbstractBuild$AbstractBuildExecution.perform(AbstractBuild.java:741) at hudson.model.AbstractBuild$AbstractBuildExecution.performAllBuildSteps(AbstractBuild.java:690) at hudson.model.Build$BuildExecution.post2(Build.java:186) at hudson.model.AbstractBuild$AbstractBuildExecution.post(AbstractBuild.java:635) at hudson.model.Run.execute(Run.java:1843) at hudson.model.FreeStyleBuild.run(FreeStyleBuild.java:43) at hudson.model.ResourceController.execute(ResourceController.java:97) at hudson.model.Executor.run(Executor.java:429) /Users/buildslave/jenkins/workspace/LNT_Tests does not exist. at org.apache.tools.ant.types.AbstractFileSet.getDirectoryScanner(AbstractFileSet.java:484) at org.apache.tools.ant.types.AbstractFileSet.getDirectoryScanner(AbstractFileSet.java:461) at hudson.tasks.junit.JUnitParser$ParseResultCallable.invoke(JUnitParser.java:141) at hudson.tasks.junit.JUnitParser$ParseResultCallable.invoke(JUnitParser.java:118) at hudson.FilePath$FileCallableWrapper.call(FilePath.java:3050) at hudson.remoting.UserRequest.perform(UserRequest.java:212) at hudson.remoting.UserRequest.perform(UserRequest.java:54) at hudson.remoting.Request$2.run(Request.java:369) at hudson.remoting.InterceptingExecutorService$1.call(InterceptingExecutorService.java:72) at java.util.concurrent.FutureTask.run(FutureTask.java:266) at java.util.concurrent.ThreadPoolExecutor.runWorker(ThreadPoolExecutor.java:1142) at java.util.concurrent.ThreadPoolExecutor$Worker.run(ThreadPoolExecutor.java:617) at java.lang.Thread.run(Thread.java:745) Build step 'Publish JUnit test result report' marked build as failure [BFA] Scanning build for known causes... [BFA] Found failure cause(s): [BFA] Regression test failed from category Test [BFA] Done. 0s Email was triggered for: Failure - Any Sending email for trigger: Failure - Any

Hide Details

Begin Pre-Send Script... Sending email to: drew_maxwell@apple.com Michael Spencer <michael_spencer@apple.com> Azhar Mohammed <azhar@apple.com> Finished: FAILURE