UnstableConsole Output

Skipping 8,952 KB.. Full Log
0.0000 
exec_time: 0.0007 
hash: "6de769b30400d5215c1657f65508bffd" 
link_time: 0.0111 
**********
PASS: test-suite :: SingleSource/Regression/C/gcc-c-torture/execute/GCC-C-execute-pr66757.test (1621 of 2039)
********** TEST 'test-suite :: SingleSource/Regression/C/gcc-c-torture/execute/GCC-C-execute-pr66757.test' RESULTS **********
compile_time: 0.0000 
exec_time: 0.0006 
hash: "dc6b223a2feb50162226950e034d3ecb" 
link_time: 0.0086 
**********
PASS: test-suite :: SingleSource/Regression/C/gcc-c-torture/execute/GCC-C-execute-pr66940.test (1622 of 2039)
********** TEST 'test-suite :: SingleSource/Regression/C/gcc-c-torture/execute/GCC-C-execute-pr66940.test' RESULTS **********
compile_time: 0.0000 
exec_time: 0.0007 
hash: "56c70d875cca0d250ed35fd882dd1625" 
link_time: 0.0081 
**********
PASS: test-suite :: SingleSource/Regression/C/gcc-c-torture/execute/GCC-C-execute-pr67037.test (1623 of 2039)
********** TEST 'test-suite :: SingleSource/Regression/C/gcc-c-torture/execute/GCC-C-execute-pr67037.test' RESULTS **********
compile_time: 0.0000 
exec_time: 0.0007 
hash: "5b867cdae3996a06e8199c7265f22622" 
link_time: 0.0109 
**********
PASS: test-suite :: SingleSource/Regression/C/gcc-c-torture/execute/GCC-C-execute-pr67226.test (1624 of 2039)
********** TEST 'test-suite :: SingleSource/Regression/C/gcc-c-torture/execute/GCC-C-execute-pr67226.test' RESULTS **********
compile_time: 0.0000 
exec_time: 0.0007 
hash: "719c75eddcc08a6216ca4a787bb811b5" 
link_time: 0.0087 
**********
PASS: test-suite :: SingleSource/Regression/C/gcc-c-torture/execute/GCC-C-execute-pr67714.test (1625 of 2039)
********** TEST 'test-suite :: SingleSource/Regression/C/gcc-c-torture/execute/GCC-C-execute-pr67714.test' RESULTS **********
compile_time: 0.0000 
exec_time: 0.0008 
hash: "ea39245edccecaf46b63d60991c5f443" 
link_time: 0.0089 
**********
PASS: test-suite :: SingleSource/Regression/C/gcc-c-torture/execute/GCC-C-execute-pr67781.test (1626 of 2039)
********** TEST 'test-suite :: SingleSource/Regression/C/gcc-c-torture/execute/GCC-C-execute-pr67781.test' RESULTS **********
compile_time: 0.0000 
exec_time: 0.0006 
hash: "2cc7b6238c7970ca40fd865fafbb8b6b" 
link_time: 0.0102 
**********
PASS: test-suite :: SingleSource/Regression/C/gcc-c-torture/execute/GCC-C-execute-pr67929_1.test (1627 of 2039)
********** TEST 'test-suite :: SingleSource/Regression/C/gcc-c-torture/execute/GCC-C-execute-pr67929_1.test' RESULTS **********
compile_time: 0.0000 
exec_time: 0.0008 
hash: "3061537bef748e0533cb8a05ce9e3ab5" 
link_time: 0.0086 
**********
PASS: test-suite :: SingleSource/Regression/C/gcc-c-torture/execute/GCC-C-execute-pr68143_1.test (1628 of 2039)
********** TEST 'test-suite :: SingleSource/Regression/C/gcc-c-torture/execute/GCC-C-execute-pr68143_1.test' RESULTS **********
compile_time: 0.0000 
exec_time: 0.0008 
hash: "a52887abf8c22d6edf35cf5a6ebca379" 
link_time: 0.0114 
**********
PASS: test-suite :: SingleSource/Regression/C/gcc-c-torture/execute/GCC-C-execute-pr68185.test (1629 of 2039)
********** TEST 'test-suite :: SingleSource/Regression/C/gcc-c-torture/execute/GCC-C-execute-pr68185.test' RESULTS **********
compile_time: 0.0000 
exec_time: 0.0007 
hash: "710f815475ad07180acf1c19276dc40f" 
link_time: 0.0113 
**********
PASS: test-suite :: SingleSource/Regression/C/gcc-c-torture/execute/GCC-C-execute-pr68249.test (1630 of 2039)
********** TEST 'test-suite :: SingleSource/Regression/C/gcc-c-torture/execute/GCC-C-execute-pr68249.test' RESULTS **********
compile_time: 0.0000 
exec_time: 0.0007 
hash: "7ced4b7a06086c0d70f61b2df97edbbd" 
link_time: 0.0115 
**********
PASS: test-suite :: SingleSource/Regression/C/gcc-c-torture/execute/GCC-C-execute-pr68250.test (1631 of 2039)
********** TEST 'test-suite :: SingleSource/Regression/C/gcc-c-torture/execute/GCC-C-execute-pr68250.test' RESULTS **********
compile_time: 0.0000 
exec_time: 0.0007 
hash: "3eb49a8819abafa38e04d05120f7a839" 
link_time: 0.0091 
**********
PASS: test-suite :: SingleSource/Regression/C/gcc-c-torture/execute/GCC-C-execute-pr68321.test (1632 of 2039)
********** TEST 'test-suite :: SingleSource/Regression/C/gcc-c-torture/execute/GCC-C-execute-pr68321.test' RESULTS **********
compile_time: 0.0000 
exec_time: 0.0007 
hash: "3a49e14305f57160540c243b55512440" 
link_time: 0.0104 
**********
PASS: test-suite :: SingleSource/Regression/C/gcc-c-torture/execute/GCC-C-execute-pr68328.test (1633 of 2039)
********** TEST 'test-suite :: SingleSource/Regression/C/gcc-c-torture/execute/GCC-C-execute-pr68328.test' RESULTS **********
compile_time: 0.0000 
exec_time: 0.0007 
hash: "ad45b31f31a0e75e9765d1fb08f539b2" 
link_time: 0.0108 
**********
PASS: test-suite :: SingleSource/Regression/C/gcc-c-torture/execute/GCC-C-execute-pr68376-1.test (1634 of 2039)
********** TEST 'test-suite :: SingleSource/Regression/C/gcc-c-torture/execute/GCC-C-execute-pr68376-1.test' RESULTS **********
compile_time: 0.0000 
exec_time: 0.0007 
hash: "037a0f9e3620e58ec03e88a6196ab021" 
link_time: 0.0109 
**********
PASS: test-suite :: SingleSource/Regression/C/gcc-c-torture/execute/GCC-C-execute-pr68376-2.test (1635 of 2039)
********** TEST 'test-suite :: SingleSource/Regression/C/gcc-c-torture/execute/GCC-C-execute-pr68376-2.test' RESULTS **********
compile_time: 0.0000 
exec_time: 0.0007 
hash: "91037a470021743eb97d35627aba6d46" 
link_time: 0.0090 
**********
NOEXE: test-suite :: SingleSource/Regression/C/gcc-c-torture/execute/GCC-C-execute-pr68381.test (1636 of 2039)
******************** TEST 'test-suite :: SingleSource/Regression/C/gcc-c-torture/execute/GCC-C-execute-pr68381.test' FAILED ********************
Executable '/Users/buildslave/jenkins/workspace/Testsuite-Tester@4/sandbox/build/SingleSource/Regression/C/gcc-c-torture/execute/GCC-C-execute-pr68381' is missing
********************
PASS: test-suite :: SingleSource/Regression/C/gcc-c-torture/execute/GCC-C-execute-pr68390.test (1637 of 2039)
********** TEST 'test-suite :: SingleSource/Regression/C/gcc-c-torture/execute/GCC-C-execute-pr68390.test' RESULTS **********
compile_time: 0.0000 
exec_time: 0.0008 
hash: "690984568ac8d0a55922c4bf6377db51" 
link_time: 0.0101 
**********
PASS: test-suite :: SingleSource/Regression/C/gcc-c-torture/execute/GCC-C-execute-pr68506.test (1638 of 2039)
********** TEST 'test-suite :: SingleSource/Regression/C/gcc-c-torture/execute/GCC-C-execute-pr68506.test' RESULTS **********
compile_time: 0.0000 
exec_time: 0.0008 
hash: "fdaf9d3daef4fa199354193050c496a5" 
link_time: 0.0109 
**********
NOEXE: test-suite :: SingleSource/Regression/C/gcc-c-torture/execute/GCC-C-execute-pr68532.test (1639 of 2039)
******************** TEST 'test-suite :: SingleSource/Regression/C/gcc-c-torture/execute/GCC-C-execute-pr68532.test' FAILED ********************
Executable '/Users/buildslave/jenkins/workspace/Testsuite-Tester@4/sandbox/build/SingleSource/Regression/C/gcc-c-torture/execute/GCC-C-execute-pr68532' is missing
********************
PASS: test-suite :: SingleSource/Regression/C/gcc-c-torture/execute/GCC-C-execute-pr68624.test (1640 of 2039)
********** TEST 'test-suite :: SingleSource/Regression/C/gcc-c-torture/execute/GCC-C-execute-pr68624.test' RESULTS **********
compile_time: 0.0000 
exec_time: 0.0008 
hash: "a9b41d4db2ebc10bdfecc73d814320d7" 
link_time: 0.0108 
**********
PASS: test-suite :: SingleSource/Regression/C/gcc-c-torture/execute/GCC-C-execute-pr68648.test (1641 of 2039)
********** TEST 'test-suite :: SingleSource/Regression/C/gcc-c-torture/execute/GCC-C-execute-pr68648.test' RESULTS **********
compile_time: 0.0000 
exec_time: 0.0008 
hash: "693d7a1bbfab8c5a7786f06c600024ad" 
link_time: 0.0097 
**********
PASS: test-suite :: SingleSource/Regression/C/gcc-c-torture/execute/GCC-C-execute-pr68841.test (1642 of 2039)
********** TEST 'test-suite :: SingleSource/Regression/C/gcc-c-torture/execute/GCC-C-execute-pr68841.test' RESULTS **********
compile_time: 0.0000 
exec_time: 0.0007 
hash: "6736079d5a0a14d626f48b51ed2aa962" 
link_time: 0.0093 
**********
PASS: test-suite :: SingleSource/Regression/C/gcc-c-torture/execute/GCC-C-execute-pr68911.test (1643 of 2039)
********** TEST 'test-suite :: SingleSource/Regression/C/gcc-c-torture/execute/GCC-C-execute-pr68911.test' RESULTS **********
compile_time: 0.0000 
exec_time: 0.0007 
hash: "64bdcda9b36fbcab65058ac4ada32b35" 
link_time: 0.0092 
**********
PASS: test-suite :: SingleSource/Regression/C/gcc-c-torture/execute/GCC-C-execute-pr69097-1.test (1644 of 2039)
********** TEST 'test-suite :: SingleSource/Regression/C/gcc-c-torture/execute/GCC-C-execute-pr69097-1.test' RESULTS **********
compile_time: 0.0000 
exec_time: 0.0006 
hash: "d533d9a70b9d59e2bfb493012743739c" 
link_time: 0.0098 
**********
PASS: test-suite :: SingleSource/Regression/C/gcc-c-torture/execute/GCC-C-execute-pr69097-2.test (1645 of 2039)
********** TEST 'test-suite :: SingleSource/Regression/C/gcc-c-torture/execute/GCC-C-execute-pr69097-2.test' RESULTS **********
compile_time: 0.0000 
exec_time: 0.0008 
hash: "180d2d67733d1f3c758eefce8adbe385" 
link_time: 0.0082 
**********
PASS: test-suite :: SingleSource/Regression/C/gcc-c-torture/execute/GCC-C-execute-pr69320-1.test (1646 of 2039)
********** TEST 'test-suite :: SingleSource/Regression/C/gcc-c-torture/execute/GCC-C-execute-pr69320-1.test' RESULTS **********
compile_time: 0.0000 
exec_time: 0.0006 
hash: "24493149bc55eb31cb6e1738fdf0a2c8" 
link_time: 0.0110 
**********
PASS: test-suite :: SingleSource/Regression/C/gcc-c-torture/execute/GCC-C-execute-pr69320-2.test (1647 of 2039)
********** TEST 'test-suite :: SingleSource/Regression/C/gcc-c-torture/execute/GCC-C-execute-pr69320-2.test' RESULTS **********
compile_time: 0.0000 
exec_time: 0.0006 
hash: "6ad291015c77332ca1af479c3c4e0edc" 
link_time: 0.0108 
**********
PASS: test-suite :: SingleSource/Regression/C/gcc-c-torture/execute/GCC-C-execute-pr69320-3.test (1648 of 2039)
********** TEST 'test-suite :: SingleSource/Regression/C/gcc-c-torture/execute/GCC-C-execute-pr69320-3.test' RESULTS **********
compile_time: 0.0000 
exec_time: 0.0007 
hash: "b8a835c9942e418426f5fc9936181998" 
link_time: 0.0100 
**********
PASS: test-suite :: SingleSource/Regression/C/gcc-c-torture/execute/GCC-C-execute-pr69320-4.test (1649 of 2039)
********** TEST 'test-suite :: SingleSource/Regression/C/gcc-c-torture/execute/GCC-C-execute-pr69320-4.test' RESULTS **********
compile_time: 0.0000 
exec_time: 0.0007 
hash: "529511d0de1e6ff50b5fabb30865c175" 
link_time: 0.0088 
**********
PASS: test-suite :: SingleSource/Regression/C/gcc-c-torture/execute/GCC-C-execute-pr69403.test (1650 of 2039)
********** TEST 'test-suite :: SingleSource/Regression/C/gcc-c-torture/execute/GCC-C-execute-pr69403.test' RESULTS **********
compile_time: 0.0000 
exec_time: 0.0007 
hash: "1cb86e7d4ae07a886b1f26af14b2ed58" 
link_time: 0.0110 
**********
PASS: test-suite :: SingleSource/Regression/C/gcc-c-torture/execute/GCC-C-execute-pr69447.test (1651 of 2039)
********** TEST 'test-suite :: SingleSource/Regression/C/gcc-c-torture/execute/GCC-C-execute-pr69447.test' RESULTS **********
compile_time: 0.0000 
exec_time: 0.0008 
hash: "c15b8145d5dbe06b34562b48191abb43" 
link_time: 0.0083 
**********
PASS: test-suite :: SingleSource/Regression/C/gcc-c-torture/execute/GCC-C-execute-pr69691.test (1652 of 2039)
********** TEST 'test-suite :: SingleSource/Regression/C/gcc-c-torture/execute/GCC-C-execute-pr69691.test' RESULTS **********
compile_time: 0.0000 
exec_time: 0.0007 
hash: "da70a280cb48f44762862c942e06b9ac" 
link_time: 0.0099 
**********
PASS: test-suite :: SingleSource/Regression/C/gcc-c-torture/execute/GCC-C-execute-pr70005.test (1653 of 2039)
********** TEST 'test-suite :: SingleSource/Regression/C/gcc-c-torture/execute/GCC-C-execute-pr70005.test' RESULTS **********
compile_time: 0.0000 
exec_time: 0.0007 
hash: "074076902c277ef1272a2a052fa6c595" 
link_time: 0.0102 
**********
PASS: test-suite :: SingleSource/Regression/C/gcc-c-torture/execute/GCC-C-execute-pr70127.test (1654 of 2039)
********** TEST 'test-suite :: SingleSource/Regression/C/gcc-c-torture/execute/GCC-C-execute-pr70127.test' RESULTS **********
compile_time: 0.0000 
exec_time: 0.0006 
hash: "131772e3a151189eb9054473b432ee8d" 
link_time: 0.0084 
**********
PASS: test-suite :: SingleSource/Regression/C/gcc-c-torture/execute/GCC-C-execute-pr70222-1.test (1655 of 2039)
********** TEST 'test-suite :: SingleSource/Regression/C/gcc-c-torture/execute/GCC-C-execute-pr70222-1.test' RESULTS **********
compile_time: 0.0000 
exec_time: 0.0006 
hash: "b590c1fb52e3733697b8eb58bd52cbe8" 
link_time: 0.0117 
**********
PASS: test-suite :: SingleSource/Regression/C/gcc-c-torture/execute/GCC-C-execute-pr70222-2.test (1656 of 2039)
********** TEST 'test-suite :: SingleSource/Regression/C/gcc-c-torture/execute/GCC-C-execute-pr70222-2.test' RESULTS **********
compile_time: 0.0000 
exec_time: 0.0007 
hash: "64bf9897ed66a75d33a147ec5f00c9ce" 
link_time: 0.0101 
**********
PASS: test-suite :: SingleSource/Regression/C/gcc-c-torture/execute/GCC-C-execute-pr70429.test (1657 of 2039)
********** TEST 'test-suite :: SingleSource/Regression/C/gcc-c-torture/execute/GCC-C-execute-pr70429.test' RESULTS **********
compile_time: 0.0000 
exec_time: 0.0006 
hash: "5986e2c8076aba3654fe6065e1f54059" 
link_time: 0.0105 
**********
PASS: test-suite :: SingleSource/Regression/C/gcc-c-torture/execute/GCC-C-execute-pr70460.test (1658 of 2039)
********** TEST 'test-suite :: SingleSource/Regression/C/gcc-c-torture/execute/GCC-C-execute-pr70460.test' RESULTS **********
compile_time: 0.0000 
exec_time: 0.0007 
hash: "302faef9d80137014df892451ad34e06" 
link_time: 0.0093 
**********
PASS: test-suite :: SingleSource/Regression/C/gcc-c-torture/execute/GCC-C-execute-pr70566.test (1659 of 2039)
********** TEST 'test-suite :: SingleSource/Regression/C/gcc-c-torture/execute/GCC-C-execute-pr70566.test' RESULTS **********
compile_time: 0.0000 
exec_time: 0.0006 
hash: "a573e16da0d63c646651310373959262" 
link_time: 0.0105 
**********
PASS: test-suite :: SingleSource/Regression/C/gcc-c-torture/execute/GCC-C-execute-pr70586.test (1660 of 2039)
********** TEST 'test-suite :: SingleSource/Regression/C/gcc-c-torture/execute/GCC-C-execute-pr70586.test' RESULTS **********
compile_time: 0.0000 
exec_time: 0.0008 
hash: "859b59fb4674d48c4af309d7ccdbdfc4" 
link_time: 0.0109 
**********
PASS: test-suite :: SingleSource/Regression/C/gcc-c-torture/execute/GCC-C-execute-pr70602.test (1661 of 2039)
********** TEST 'test-suite :: SingleSource/Regression/C/gcc-c-torture/execute/GCC-C-execute-pr70602.test' RESULTS **********
compile_time: 0.0000 
exec_time: 0.0007 
hash: "4a318733fb1002fb2556503b19ef1d9e" 
link_time: 0.0106 
**********
PASS: test-suite :: SingleSource/Regression/C/gcc-c-torture/execute/GCC-C-execute-pr70903.test (1662 of 2039)
********** TEST 'test-suite :: SingleSource/Regression/C/gcc-c-torture/execute/GCC-C-execute-pr70903.test' RESULTS **********
compile_time: 0.0000 
exec_time: 0.0007 
hash: "439852fba67c94fbbbdc1665e5c7f2de" 
link_time: 0.0103 
**********
NOEXE: test-suite :: SingleSource/Regression/C/gcc-c-torture/execute/GCC-C-execute-pr71083.test (1663 of 2039)
******************** TEST 'test-suite :: SingleSource/Regression/C/gcc-c-torture/execute/GCC-C-execute-pr71083.test' FAILED ********************
Executable '/Users/buildslave/jenkins/workspace/Testsuite-Tester@4/sandbox/build/SingleSource/Regression/C/gcc-c-torture/execute/GCC-C-execute-pr71083' is missing
********************
PASS: test-suite :: SingleSource/Regression/C/gcc-c-torture/execute/GCC-C-execute-pr71335.test (1664 of 2039)
********** TEST 'test-suite :: SingleSource/Regression/C/gcc-c-torture/execute/GCC-C-execute-pr71335.test' RESULTS **********
compile_time: 0.0000 
exec_time: 0.0007 
hash: "2529f55aeea1e54eda8eddae010b8c68" 
link_time: 0.0101 
**********
PASS: test-suite :: SingleSource/Regression/C/gcc-c-torture/execute/GCC-C-execute-pr71550.test (1665 of 2039)
********** TEST 'test-suite :: SingleSource/Regression/C/gcc-c-torture/execute/GCC-C-execute-pr71550.test' RESULTS **********
compile_time: 0.0000 
exec_time: 0.0007 
hash: "4c57e5d6408c32171b19f7dc5cd8cae4" 
link_time: 0.0104 
**********
NOEXE: test-suite :: SingleSource/Regression/C/gcc-c-torture/execute/GCC-C-execute-pr71554.test (1666 of 2039)
******************** TEST 'test-suite :: SingleSource/Regression/C/gcc-c-torture/execute/GCC-C-execute-pr71554.test' FAILED ********************
Executable '/Users/buildslave/jenkins/workspace/Testsuite-Tester@4/sandbox/build/SingleSource/Regression/C/gcc-c-torture/execute/GCC-C-execute-pr71554' is missing
********************
PASS: test-suite :: SingleSource/Regression/C/gcc-c-torture/execute/GCC-C-execute-pr71626-1.test (1667 of 2039)
********** TEST 'test-suite :: SingleSource/Regression/C/gcc-c-torture/execute/GCC-C-execute-pr71626-1.test' RESULTS **********
compile_time: 0.0000 
exec_time: 0.0006 
hash: "fdbbc764686d89b37f9c6c51d39e62dd" 
link_time: 0.0088 
**********
PASS: test-suite :: SingleSource/Regression/C/gcc-c-torture/execute/GCC-C-execute-pr71626-2.test (1668 of 2039)
********** TEST 'test-suite :: SingleSource/Regression/C/gcc-c-torture/execute/GCC-C-execute-pr71626-2.test' RESULTS **********
compile_time: 0.0000 
exec_time: 0.0008 
hash: "9ed3006be9c4cf63abfdeff1dd323d9c" 
link_time: 0.0104 
**********
PASS: test-suite :: SingleSource/Regression/C/gcc-c-torture/execute/GCC-C-execute-pr71631.test (1669 of 2039)
********** TEST 'test-suite :: SingleSource/Regression/C/gcc-c-torture/execute/GCC-C-execute-pr71631.test' RESULTS **********
compile_time: 0.0000 
exec_time: 0.0006 
hash: "b1aaf6798b3a48c0dfd5d79ca1a9a82e" 
link_time: 0.0094 
**********
PASS: test-suite :: SingleSource/Regression/C/gcc-c-torture/execute/GCC-C-execute-pr71700.test (1670 of 2039)
********** TEST 'test-suite :: SingleSource/Regression/C/gcc-c-torture/execute/GCC-C-execute-pr71700.test' RESULTS **********
compile_time: 0.0000 
exec_time: 0.0007 
hash: "0974663b69746600b96888ab2e88a939" 
link_time: 0.0090 
**********
PASS: test-suite :: SingleSource/Regression/C/gcc-c-torture/execute/GCC-C-execute-pr7284-1.test (1671 of 2039)
********** TEST 'test-suite :: SingleSource/Regression/C/gcc-c-torture/execute/GCC-C-execute-pr7284-1.test' RESULTS **********
compile_time: 0.0000 
exec_time: 0.0008 
hash: "4fb55ea2d9b9c34fa6cf94f0d8996f9b" 
link_time: 0.0108 
**********
PASS: test-suite :: SingleSource/Regression/C/gcc-c-torture/execute/GCC-C-execute-pr77718.test (1672 of 2039)
********** TEST 'test-suite :: SingleSource/Regression/C/gcc-c-torture/execute/GCC-C-execute-pr77718.test' RESULTS **********
compile_time: 0.0000 
exec_time: 0.0006 
hash: "ba8386efa8ef69fc152614d15d1ab2f3" 
link_time: 0.0108 
**********
PASS: test-suite :: SingleSource/Regression/C/gcc-c-torture/execute/GCC-C-execute-pr77766.test (1673 of 2039)
********** TEST 'test-suite :: SingleSource/Regression/C/gcc-c-torture/execute/GCC-C-execute-pr77766.test' RESULTS **********
compile_time: 0.0000 
exec_time: 0.0006 
hash: "a8c9e838b7228fa9b165f1ed47ab31d7" 
link_time: 0.0102 
**********
PASS: test-suite :: SingleSource/Regression/C/gcc-c-torture/execute/GCC-C-execute-pr77767.test (1674 of 2039)
********** TEST 'test-suite :: SingleSource/Regression/C/gcc-c-torture/execute/GCC-C-execute-pr77767.test' RESULTS **********
compile_time: 0.0000 
exec_time: 0.0006 
hash: "34f3db83daa979281db904e0aee6c7d9" 
link_time: 0.0096 
**********
PASS: test-suite :: SingleSource/Regression/C/gcc-c-torture/execute/GCC-C-execute-pr78170.test (1675 of 2039)
********** TEST 'test-suite :: SingleSource/Regression/C/gcc-c-torture/execute/GCC-C-execute-pr78170.test' RESULTS **********
compile_time: 0.0000 
exec_time: 0.0007 
hash: "6732010f86ddd59b963408970abe408d" 
link_time: 0.0095 
**********
PASS: test-suite :: SingleSource/Regression/C/gcc-c-torture/execute/GCC-C-execute-pr78378.test (1676 of 2039)
********** TEST 'test-suite :: SingleSource/Regression/C/gcc-c-torture/execute/GCC-C-execute-pr78378.test' RESULTS **********
compile_time: 0.0000 
exec_time: 0.0006 
hash: "ad9e6f3e5d0236860891a22c7395bec7" 
link_time: 0.0102 
**********
PASS: test-suite :: SingleSource/Regression/C/gcc-c-torture/execute/GCC-C-execute-pr78436.test (1677 of 2039)
********** TEST 'test-suite :: SingleSource/Regression/C/gcc-c-torture/execute/GCC-C-execute-pr78436.test' RESULTS **********
compile_time: 0.0000 
exec_time: 0.0007 
hash: "f87fb3f4cb60e2399326d908bb85930b" 
link_time: 0.0091 
**********
PASS: test-suite :: SingleSource/Regression/C/gcc-c-torture/execute/GCC-C-execute-pr78438.test (1678 of 2039)
********** TEST 'test-suite :: SingleSource/Regression/C/gcc-c-torture/execute/GCC-C-execute-pr78438.test' RESULTS **********
compile_time: 0.0000 
exec_time: 0.0007 
hash: "24995698fa406a143af48657f3ba8d58" 
link_time: 0.0108 
**********
PASS: test-suite :: SingleSource/Regression/C/gcc-c-torture/execute/GCC-C-execute-pr78477.test (1679 of 2039)
********** TEST 'test-suite :: SingleSource/Regression/C/gcc-c-torture/execute/GCC-C-execute-pr78477.test' RESULTS **********
compile_time: 0.0000 
exec_time: 0.0006 
hash: "ee4341ec837f2787b8f3e370d1bbba42" 
link_time: 0.0095 
**********
PASS: test-suite :: SingleSource/Regression/C/gcc-c-torture/execute/GCC-C-execute-pr78559.test (1680 of 2039)
********** TEST 'test-suite :: SingleSource/Regression/C/gcc-c-torture/execute/GCC-C-execute-pr78559.test' RESULTS **********
compile_time: 0.0000 
exec_time: 0.0006 
hash: "8d239c2f4b298563a0626e72d6558ea7" 
link_time: 0.0097 
**********
PASS: test-suite :: SingleSource/Regression/C/gcc-c-torture/execute/GCC-C-execute-pr78617.test (1681 of 2039)
********** TEST 'test-suite :: SingleSource/Regression/C/gcc-c-torture/execute/GCC-C-execute-pr78617.test' RESULTS **********
compile_time: 0.0000 
exec_time: 0.0007 
hash: "415d1ff66414c5b55b31d2bcd2adc633" 
link_time: 0.0109 
**********
PASS: test-suite :: SingleSource/Regression/C/gcc-c-torture/execute/GCC-C-execute-pr78622.test (1682 of 2039)
********** TEST 'test-suite :: SingleSource/Regression/C/gcc-c-torture/execute/GCC-C-execute-pr78622.test' RESULTS **********
compile_time: 0.0000 
exec_time: 0.0008 
hash: "1e7be9d3b7b7fcf34a0d56fe14741468" 
link_time: 0.0093 
**********
PASS: test-suite :: SingleSource/Regression/C/gcc-c-torture/execute/GCC-C-execute-pr78675.test (1683 of 2039)
********** TEST 'test-suite :: SingleSource/Regression/C/gcc-c-torture/execute/GCC-C-execute-pr78675.test' RESULTS **********
compile_time: 0.0000 
exec_time: 0.0007 
hash: "44aaefd986f3101eb658930b39307a7f" 
link_time: 0.0103 
**********
PASS: test-suite :: SingleSource/Regression/C/gcc-c-torture/execute/GCC-C-execute-pr78720.test (1684 of 2039)
********** TEST 'test-suite :: SingleSource/Regression/C/gcc-c-torture/execute/GCC-C-execute-pr78720.test' RESULTS **********
compile_time: 0.0000 
exec_time: 0.0006 
hash: "1431572484cce3eadd47aedd48f7eda6" 
link_time: 0.0104 
**********
PASS: test-suite :: SingleSource/Regression/C/gcc-c-torture/execute/GCC-C-execute-pr78726.test (1685 of 2039)
********** TEST 'test-suite :: SingleSource/Regression/C/gcc-c-torture/execute/GCC-C-execute-pr78726.test' RESULTS **********
compile_time: 0.0000 
exec_time: 0.0007 
hash: "654e8bf4f63bf83e52eeb34dc832cfb6" 
link_time: 0.0097 
**********
PASS: test-suite :: SingleSource/Regression/C/gcc-c-torture/execute/GCC-C-execute-pr78791.test (1686 of 2039)
********** TEST 'test-suite :: SingleSource/Regression/C/gcc-c-torture/execute/GCC-C-execute-pr78791.test' RESULTS **********
compile_time: 0.0000 
exec_time: 0.0007 
hash: "931f6c77303ae6b1e56fe8196c8ffec6" 
link_time: 0.0098 
**********
PASS: test-suite :: SingleSource/Regression/C/gcc-c-torture/execute/GCC-C-execute-pr78856.test (1687 of 2039)
********** TEST 'test-suite :: SingleSource/Regression/C/gcc-c-torture/execute/GCC-C-execute-pr78856.test' RESULTS **********
compile_time: 0.0000 
exec_time: 0.0007 
hash: "5e39db15a49d97549823fbdc9255d371" 
link_time: 0.0107 
**********
PASS: test-suite :: SingleSource/Regression/C/gcc-c-torture/execute/GCC-C-execute-pr79121.test (1688 of 2039)
********** TEST 'test-suite :: SingleSource/Regression/C/gcc-c-torture/execute/GCC-C-execute-pr79121.test' RESULTS **********
compile_time: 0.0000 
exec_time: 0.0008 
hash: "b51ac12e5f27d29dcd2ccb5e0fdc7ca3" 
link_time: 0.0110 
**********
PASS: test-suite :: SingleSource/Regression/C/gcc-c-torture/execute/GCC-C-execute-pr79286.test (1689 of 2039)
********** TEST 'test-suite :: SingleSource/Regression/C/gcc-c-torture/execute/GCC-C-execute-pr79286.test' RESULTS **********
compile_time: 0.0000 
exec_time: 0.0007 
hash: "f62e303cb79f8c804ceb2d0448795ae3" 
link_time: 0.0098 
**********
PASS: test-suite :: SingleSource/Regression/C/gcc-c-torture/execute/GCC-C-execute-pr79354.test (1690 of 2039)
********** TEST 'test-suite :: SingleSource/Regression/C/gcc-c-torture/execute/GCC-C-execute-pr79354.test' RESULTS **********
compile_time: 0.0000 
exec_time: 0.0007 
hash: "870de0c4b59dea403a4f22c396d1a66d" 
link_time: 0.0095 
**********
PASS: test-suite :: SingleSource/Regression/C/gcc-c-torture/execute/GCC-C-execute-pr79388.test (1691 of 2039)
********** TEST 'test-suite :: SingleSource/Regression/C/gcc-c-torture/execute/GCC-C-execute-pr79388.test' RESULTS **********
compile_time: 0.0000 
exec_time: 0.0007 
hash: "ef0314f34ce66505340d5491fe76d3b9" 
link_time: 0.0105 
**********
PASS: test-suite :: SingleSource/Regression/C/gcc-c-torture/execute/GCC-C-execute-pr79450.test (1692 of 2039)
********** TEST 'test-suite :: SingleSource/Regression/C/gcc-c-torture/execute/GCC-C-execute-pr79450.test' RESULTS **********
compile_time: 0.0000 
exec_time: 0.0008 
hash: "c59c562181ff5482e24bb20d9af1dfab" 
link_time: 0.0087 
**********
PASS: test-suite :: SingleSource/Regression/C/gcc-c-torture/execute/GCC-C-execute-pr79737-1.test (1693 of 2039)
********** TEST 'test-suite :: SingleSource/Regression/C/gcc-c-torture/execute/GCC-C-execute-pr79737-1.test' RESULTS **********
compile_time: 0.0000 
exec_time: 0.0009 
hash: "0f1a1ece9ae944b33844899b1ac12a55" 
link_time: 0.0109 
**********
PASS: test-suite :: SingleSource/Regression/C/gcc-c-torture/execute/GCC-C-execute-pr79737-2.test (1694 of 2039)
********** TEST 'test-suite :: SingleSource/Regression/C/gcc-c-torture/execute/GCC-C-execute-pr79737-2.test' RESULTS **********
compile_time: 0.0000 
exec_time: 0.0008 
hash: "a2af1369e11f6282bc33b7f92c798f5b" 
link_time: 0.0106 
**********
PASS: test-suite :: SingleSource/Regression/C/gcc-c-torture/execute/GCC-C-execute-pr80153.test (1695 of 2039)
********** TEST 'test-suite :: SingleSource/Regression/C/gcc-c-torture/execute/GCC-C-execute-pr80153.test' RESULTS **********
compile_time: 0.0000 
exec_time: 0.0007 
hash: "78bd728a3e7def37e00fa3112ce0a2b4" 
link_time: 0.0114 
**********
PASS: test-suite :: SingleSource/Regression/C/gcc-c-torture/execute/GCC-C-execute-pr80421.test (1696 of 2039)
********** TEST 'test-suite :: SingleSource/Regression/C/gcc-c-torture/execute/GCC-C-execute-pr80421.test' RESULTS **********
compile_time: 0.0000 
exec_time: 0.0007 
hash: "8816226bbca491a8f1701f4a08386a1c" 
link_time: 0.0097 
**********
PASS: test-suite :: SingleSource/Regression/C/gcc-c-torture/execute/GCC-C-execute-pr80501.test (1697 of 2039)
********** TEST 'test-suite :: SingleSource/Regression/C/gcc-c-torture/execute/GCC-C-execute-pr80501.test' RESULTS **********
compile_time: 0.0000 
exec_time: 0.0008 
hash: "0ba3b8a3e07b0b2cf726016e745c4c11" 
link_time: 0.0107 
**********
PASS: test-suite :: SingleSource/Regression/C/gcc-c-torture/execute/GCC-C-execute-pr81281.test (1698 of 2039)
********** TEST 'test-suite :: SingleSource/Regression/C/gcc-c-torture/execute/GCC-C-execute-pr81281.test' RESULTS **********
compile_time: 0.0000 
exec_time: 0.0007 
hash: "24d18f6fb584c326aab2a32873c9a12a" 
link_time: 0.0114 
**********
PASS: test-suite :: SingleSource/Regression/C/gcc-c-torture/execute/GCC-C-execute-pr81423.test (1699 of 2039)
********** TEST 'test-suite :: SingleSource/Regression/C/gcc-c-torture/execute/GCC-C-execute-pr81423.test' RESULTS **********
compile_time: 0.0000 
exec_time: 0.0007 
hash: "b267323b6e4e42b85727e6ad9c51fed2" 
link_time: 0.0105 
**********
PASS: test-suite :: SingleSource/Regression/C/gcc-c-torture/execute/GCC-C-execute-pr81503.test (1700 of 2039)
********** TEST 'test-suite :: SingleSource/Regression/C/gcc-c-torture/execute/GCC-C-execute-pr81503.test' RESULTS **********
compile_time: 0.0000 
exec_time: 0.0007 
hash: "f2c550ca2bc9a1c90b9d257575e914da" 
link_time: 0.0118 
**********
PASS: test-suite :: SingleSource/Regression/C/gcc-c-torture/execute/GCC-C-execute-pr81555.test (1701 of 2039)
********** TEST 'test-suite :: SingleSource/Regression/C/gcc-c-torture/execute/GCC-C-execute-pr81555.test' RESULTS **********
compile_time: 0.0000 
exec_time: 0.0007 
hash: "32986e4659c3a556acd059d429d001f1" 
link_time: 0.0114 
**********
PASS: test-suite :: SingleSource/Regression/C/gcc-c-torture/execute/GCC-C-execute-pr81556.test (1702 of 2039)
********** TEST 'test-suite :: SingleSource/Regression/C/gcc-c-torture/execute/GCC-C-execute-pr81556.test' RESULTS **********
compile_time: 0.0000 
exec_time: 0.0007 
hash: "c641c266b1aa4bb177e4ca67a2b2e746" 
link_time: 0.0094 
**********
PASS: test-suite :: SingleSource/Regression/C/gcc-c-torture/execute/GCC-C-execute-pr81588.test (1703 of 2039)
********** TEST 'test-suite :: SingleSource/Regression/C/gcc-c-torture/execute/GCC-C-execute-pr81588.test' RESULTS **********
compile_time: 0.0000 
exec_time: 0.0006 
hash: "ce3ba79d26759a3a6f650f60fc36a14a" 
link_time: 0.0101 
**********
NOEXE: test-suite :: SingleSource/Regression/C/gcc-c-torture/execute/GCC-C-execute-pr81913.test (1704 of 2039)
******************** TEST 'test-suite :: SingleSource/Regression/C/gcc-c-torture/execute/GCC-C-execute-pr81913.test' FAILED ********************
Executable '/Users/buildslave/jenkins/workspace/Testsuite-Tester@4/sandbox/build/SingleSource/Regression/C/gcc-c-torture/execute/GCC-C-execute-pr81913' is missing
********************
PASS: test-suite :: SingleSource/Regression/C/gcc-c-torture/execute/GCC-C-execute-pr82192.test (1705 of 2039)
********** TEST 'test-suite :: SingleSource/Regression/C/gcc-c-torture/execute/GCC-C-execute-pr82192.test' RESULTS **********
compile_time: 0.0000 
exec_time: 0.0006 
hash: "6bf228a43222b5c89e8b9334366c9216" 
link_time: 0.0104 
**********
PASS: test-suite :: SingleSource/Regression/C/gcc-c-torture/execute/GCC-C-execute-pr82387.test (1706 of 2039)
********** TEST 'test-suite :: SingleSource/Regression/C/gcc-c-torture/execute/GCC-C-execute-pr82387.test' RESULTS **********
compile_time: 0.0000 
exec_time: 0.0007 
hash: "7e722c7668c9b1816d3d54fccf64397d" 
link_time: 0.0090 
**********
PASS: test-suite :: SingleSource/Regression/C/gcc-c-torture/execute/GCC-C-execute-pr82388.test (1707 of 2039)
********** TEST 'test-suite :: SingleSource/Regression/C/gcc-c-torture/execute/GCC-C-execute-pr82388.test' RESULTS **********
compile_time: 0.0000 
exec_time: 0.0007 
hash: "d5ed5c77718dd49b01e17f9190bc71d3" 
link_time: 0.0104 
**********
PASS: test-suite :: SingleSource/Regression/C/gcc-c-torture/execute/GCC-C-execute-pr82524.test (1708 of 2039)
********** TEST 'test-suite :: SingleSource/Regression/C/gcc-c-torture/execute/GCC-C-execute-pr82524.test' RESULTS **********
compile_time: 0.0000 
exec_time: 0.0008 
hash: "3c3df009e80bcd4bd79842fef4577388" 
link_time: 0.0109 
**********
PASS: test-suite :: SingleSource/Regression/C/gcc-c-torture/execute/GCC-C-execute-pr82954.test (1709 of 2039)
********** TEST 'test-suite :: SingleSource/Regression/C/gcc-c-torture/execute/GCC-C-execute-pr82954.test' RESULTS **********
compile_time: 0.0000 
exec_time: 0.0007 
hash: "e07494c1b99f97a103ae875caf9b904c" 
link_time: 0.0106 
**********
PASS: test-suite :: SingleSource/Regression/C/gcc-c-torture/execute/GCC-C-execute-pr83269.test (1710 of 2039)
********** TEST 'test-suite :: SingleSource/Regression/C/gcc-c-torture/execute/GCC-C-execute-pr83269.test' RESULTS **********
compile_time: 0.0000 
exec_time: 0.0006 
hash: "f339ee5cd0e161260407aa48ea4ea3db" 
link_time: 0.0085 
**********
PASS: test-suite :: SingleSource/Regression/C/gcc-c-torture/execute/GCC-C-execute-pr83298.test (1711 of 2039)
********** TEST 'test-suite :: SingleSource/Regression/C/gcc-c-torture/execute/GCC-C-execute-pr83298.test' RESULTS **********
compile_time: 0.0000 
exec_time: 0.0007 
hash: "db1f83011600c81b1636b2bd8c97d6f3" 
link_time: 0.0106 
**********
NOEXE: test-suite :: SingleSource/Regression/C/gcc-c-torture/execute/GCC-C-execute-pr83362.test (1712 of 2039)
******************** TEST 'test-suite :: SingleSource/Regression/C/gcc-c-torture/execute/GCC-C-execute-pr83362.test' FAILED ********************
Executable '/Users/buildslave/jenkins/workspace/Testsuite-Tester@4/sandbox/build/SingleSource/Regression/C/gcc-c-torture/execute/GCC-C-execute-pr83362' is missing
********************
PASS: test-suite :: SingleSource/Regression/C/gcc-c-torture/execute/GCC-C-execute-pr83383.test (1713 of 2039)
********** TEST 'test-suite :: SingleSource/Regression/C/gcc-c-torture/execute/GCC-C-execute-pr83383.test' RESULTS **********
compile_time: 0.0000 
exec_time: 0.0008 
hash: "aca2da56ea2db002802e0de5d87e6e3f" 
link_time: 0.0101 
**********
PASS: test-suite :: SingleSource/Regression/C/gcc-c-torture/execute/GCC-C-execute-pr83477.test (1714 of 2039)
********** TEST 'test-suite :: SingleSource/Regression/C/gcc-c-torture/execute/GCC-C-execute-pr83477.test' RESULTS **********
compile_time: 0.0000 
exec_time: 0.0006 
hash: "bb0be4e4c6c99e57f3c5d0955c53a9d9" 
link_time: 0.0086 
**********
PASS: test-suite :: SingleSource/Regression/C/gcc-c-torture/execute/GCC-C-execute-pr84521.test (1715 of 2039)
********** TEST 'test-suite :: SingleSource/Regression/C/gcc-c-torture/execute/GCC-C-execute-pr84521.test' RESULTS **********
compile_time: 0.0000 
exec_time: 0.0007 
hash: "6efb142aaa9e9e88e3bbe5643dc1dac9" 
link_time: 0.0109 
**********
PASS: test-suite :: SingleSource/Regression/C/gcc-c-torture/execute/GCC-C-execute-pr84524.test (1716 of 2039)
********** TEST 'test-suite :: SingleSource/Regression/C/gcc-c-torture/execute/GCC-C-execute-pr84524.test' RESULTS **********
compile_time: 0.0000 
exec_time: 0.0008 
hash: "16f1d14fb635a6a72b3a5ead5e837acf" 
link_time: 0.0091 
**********
PASS: test-suite :: SingleSource/Regression/C/gcc-c-torture/execute/GCC-C-execute-pr84748.test (1717 of 2039)
********** TEST 'test-suite :: SingleSource/Regression/C/gcc-c-torture/execute/GCC-C-execute-pr84748.test' RESULTS **********
compile_time: 0.0000 
exec_time: 0.0007 
hash: "45ef7e5b105c86a295000175c7247518" 
link_time: 0.0102 
**********
NOEXE: test-suite :: SingleSource/Regression/C/gcc-c-torture/execute/GCC-C-execute-pr85095.test (1718 of 2039)
******************** TEST 'test-suite :: SingleSource/Regression/C/gcc-c-torture/execute/GCC-C-execute-pr85095.test' FAILED ********************
Executable '/Users/buildslave/jenkins/workspace/Testsuite-Tester@4/sandbox/build/SingleSource/Regression/C/gcc-c-torture/execute/GCC-C-execute-pr85095' is missing
********************
PASS: test-suite :: SingleSource/Regression/C/gcc-c-torture/execute/GCC-C-execute-pr85156.test (1719 of 2039)
********** TEST 'test-suite :: SingleSource/Regression/C/gcc-c-torture/execute/GCC-C-execute-pr85156.test' RESULTS **********
compile_time: 0.0000 
exec_time: 0.0008 
hash: "3d9eaf43390736cbdf44e6d72c083af0" 
link_time: 0.0091 
**********
PASS: test-suite :: SingleSource/Regression/C/gcc-c-torture/execute/GCC-C-execute-pr85169.test (1720 of 2039)
********** TEST 'test-suite :: SingleSource/Regression/C/gcc-c-torture/execute/GCC-C-execute-pr85169.test' RESULTS **********
compile_time: 0.0000 
exec_time: 0.0008 
hash: "b77670b41c026ed2ddde8ef2f0529b35" 
link_time: 0.0086 
**********
PASS: test-suite :: SingleSource/Regression/C/gcc-c-torture/execute/GCC-C-execute-pr85529-1.test (1721 of 2039)
********** TEST 'test-suite :: SingleSource/Regression/C/gcc-c-torture/execute/GCC-C-execute-pr85529-1.test' RESULTS **********
compile_time: 0.0000 
exec_time: 0.0007 
hash: "49ffe6b76165549d1aac4e42214ea77e" 
link_time: 0.0098 
**********
PASS: test-suite :: SingleSource/Regression/C/gcc-c-torture/execute/GCC-C-execute-pr85529-2.test (1722 of 2039)
********** TEST 'test-suite :: SingleSource/Regression/C/gcc-c-torture/execute/GCC-C-execute-pr85529-2.test' RESULTS **********
compile_time: 0.0000 
exec_time: 0.0008 
hash: "75088083a93b7df1e3275229903c4522" 
link_time: 0.0102 
**********
PASS: test-suite :: SingleSource/Regression/C/gcc-c-torture/execute/GCC-C-execute-pr85582-1.test (1723 of 2039)
********** TEST 'test-suite :: SingleSource/Regression/C/gcc-c-torture/execute/GCC-C-execute-pr85582-1.test' RESULTS **********
compile_time: 0.0000 
exec_time: 0.0010 
hash: "b2a5a822a08c60fb6a87c31592429c1d" 
link_time: 0.0108 
**********
PASS: test-suite :: SingleSource/Regression/C/gcc-c-torture/execute/GCC-C-execute-pr85582-2.test (1724 of 2039)
********** TEST 'test-suite :: SingleSource/Regression/C/gcc-c-torture/execute/GCC-C-execute-pr85582-2.test' RESULTS **********
compile_time: 0.0000 
exec_time: 0.0008 
hash: "e2fa1525e31e24a3e6b136c667d33deb" 
link_time: 0.0088 
**********
PASS: test-suite :: SingleSource/Regression/C/gcc-c-torture/execute/GCC-C-execute-pr85582-3.test (1725 of 2039)
********** TEST 'test-suite :: SingleSource/Regression/C/gcc-c-torture/execute/GCC-C-execute-pr85582-3.test' RESULTS **********
compile_time: 0.0000 
exec_time: 0.0009 
hash: "21c79bb4cfa6d5cc012876f4734b2113" 
link_time: 0.0096 
**********
PASS: test-suite :: SingleSource/Regression/C/gcc-c-torture/execute/GCC-C-execute-pr85756.test (1726 of 2039)
********** TEST 'test-suite :: SingleSource/Regression/C/gcc-c-torture/execute/GCC-C-execute-pr85756.test' RESULTS **********
compile_time: 0.0000 
exec_time: 0.0007 
hash: "042ed773e2dc8ece9a47c7c4924f5198" 
link_time: 0.0108 
**********
PASS: test-suite :: SingleSource/Regression/C/gcc-c-torture/execute/GCC-C-execute-pr86231.test (1727 of 2039)
********** TEST 'test-suite :: SingleSource/Regression/C/gcc-c-torture/execute/GCC-C-execute-pr86231.test' RESULTS **********
compile_time: 0.0000 
exec_time: 0.0008 
hash: "0d3608300ddc2fc4be316127f33fc3da" 
link_time: 0.0105 
**********
PASS: test-suite :: SingleSource/Regression/C/gcc-c-torture/execute/GCC-C-execute-pr86492.test (1728 of 2039)
********** TEST 'test-suite :: SingleSource/Regression/C/gcc-c-torture/execute/GCC-C-execute-pr86492.test' RESULTS **********
compile_time: 0.0000 
exec_time: 0.0007 
hash: "01a9f64d46116d725a21b7ca40394d55" 
link_time: 0.0097 
**********
PASS: test-suite :: SingleSource/Regression/C/gcc-c-torture/execute/GCC-C-execute-pr86528.test (1729 of 2039)
********** TEST 'test-suite :: SingleSource/Regression/C/gcc-c-torture/execute/GCC-C-execute-pr86528.test' RESULTS **********
compile_time: 0.0000 
exec_time: 0.0008 
hash: "1acf12d7e0b93d97823a199d672e70d1" 
link_time: 0.0108 
**********
PASS: test-suite :: SingleSource/Regression/C/gcc-c-torture/execute/GCC-C-execute-pr86714.test (1730 of 2039)
********** TEST 'test-suite :: SingleSource/Regression/C/gcc-c-torture/execute/GCC-C-execute-pr86714.test' RESULTS **********
compile_time: 0.0000 
exec_time: 0.0008 
hash: "f88c956e5b6d560c3cece31c4ba56df4" 
link_time: 0.0099 
**********
PASS: test-suite :: SingleSource/Regression/C/gcc-c-torture/execute/GCC-C-execute-pr86844.test (1731 of 2039)
********** TEST 'test-suite :: SingleSource/Regression/C/gcc-c-torture/execute/GCC-C-execute-pr86844.test' RESULTS **********
compile_time: 0.0000 
exec_time: 0.0007 
hash: "8274df6dcc7f900eb55dc74f1c99bca3" 
link_time: 0.0111 
**********
PASS: test-suite :: SingleSource/Regression/C/gcc-c-torture/execute/GCC-C-execute-pr87053.test (1732 of 2039)
********** TEST 'test-suite :: SingleSource/Regression/C/gcc-c-torture/execute/GCC-C-execute-pr87053.test' RESULTS **********
compile_time: 0.0000 
exec_time: 0.0009 
hash: "f734ca4c2ad9c32ae80d86ad3d9a4bc5" 
link_time: 0.0103 
**********
PASS: test-suite :: SingleSource/Regression/C/gcc-c-torture/execute/GCC-C-execute-pr87290.test (1733 of 2039)
********** TEST 'test-suite :: SingleSource/Regression/C/gcc-c-torture/execute/GCC-C-execute-pr87290.test' RESULTS **********
compile_time: 0.0000 
exec_time: 0.0007 
hash: "04ede0265bf0d6bd8837dacb36e3954b" 
link_time: 0.0089 
**********
PASS: test-suite :: SingleSource/Regression/C/gcc-c-torture/execute/GCC-C-execute-pr87623.test (1734 of 2039)
********** TEST 'test-suite :: SingleSource/Regression/C/gcc-c-torture/execute/GCC-C-execute-pr87623.test' RESULTS **********
compile_time: 0.0000 
exec_time: 0.0008 
hash: "1323bb409abeed5b8991a907e07e8782" 
link_time: 0.0103 
**********
PASS: test-suite :: SingleSource/Regression/C/gcc-c-torture/execute/GCC-C-execute-pr88693.test (1735 of 2039)
********** TEST 'test-suite :: SingleSource/Regression/C/gcc-c-torture/execute/GCC-C-execute-pr88693.test' RESULTS **********
compile_time: 0.0000 
exec_time: 0.0008 
hash: "b659b585e897d310f6bd5dd407df6f7f" 
link_time: 0.0103 
**********
PASS: test-suite :: SingleSource/Regression/C/gcc-c-torture/execute/GCC-C-execute-pr88714.test (1736 of 2039)
********** TEST 'test-suite :: SingleSource/Regression/C/gcc-c-torture/execute/GCC-C-execute-pr88714.test' RESULTS **********
compile_time: 0.0000 
exec_time: 0.0007 
hash: "ff636d438c4a458f92fb0416a81a9b31" 
link_time: 0.0084 
**********
PASS: test-suite :: SingleSource/Regression/C/gcc-c-torture/execute/GCC-C-execute-pr88739.test (1737 of 2039)
********** TEST 'test-suite :: SingleSource/Regression/C/gcc-c-torture/execute/GCC-C-execute-pr88739.test' RESULTS **********
compile_time: 0.0000 
exec_time: 0.0009 
hash: "c2e1433cc9e44a25bd7d2a45efd2d866" 
link_time: 0.0094 
**********
PASS: test-suite :: SingleSource/Regression/C/gcc-c-torture/execute/GCC-C-execute-pr88904.test (1738 of 2039)
********** TEST 'test-suite :: SingleSource/Regression/C/gcc-c-torture/execute/GCC-C-execute-pr88904.test' RESULTS **********
compile_time: 0.0000 
exec_time: 0.0007 
hash: "caa89de1c4045039c0814324764a13da" 
link_time: 0.0108 
**********
PASS: test-suite :: SingleSource/Regression/C/gcc-c-torture/execute/GCC-C-execute-pr89195.test (1739 of 2039)
********** TEST 'test-suite :: SingleSource/Regression/C/gcc-c-torture/execute/GCC-C-execute-pr89195.test' RESULTS **********
compile_time: 0.0000 
exec_time: 0.0008 
hash: "0ed89a2589afb12ed80bf2ac64a4b3a5" 
link_time: 0.0099 
**********
PASS: test-suite :: SingleSource/Regression/C/gcc-c-torture/execute/GCC-C-execute-pr89369.test (1740 of 2039)
********** TEST 'test-suite :: SingleSource/Regression/C/gcc-c-torture/execute/GCC-C-execute-pr89369.test' RESULTS **********
compile_time: 0.0000 
exec_time: 0.0007 
hash: "dbb6fd5c89986a3a0a1259990b57e9da" 
link_time: 0.0104 
**********
NOEXE: test-suite :: SingleSource/Regression/C/gcc-c-torture/execute/GCC-C-execute-pr89434.test (1741 of 2039)
******************** TEST 'test-suite :: SingleSource/Regression/C/gcc-c-torture/execute/GCC-C-execute-pr89434.test' FAILED ********************
Executable '/Users/buildslave/jenkins/workspace/Testsuite-Tester@4/sandbox/build/SingleSource/Regression/C/gcc-c-torture/execute/GCC-C-execute-pr89434' is missing
********************
PASS: test-suite :: SingleSource/Regression/C/gcc-c-torture/execute/GCC-C-execute-pr89634.test (1742 of 2039)
********** TEST 'test-suite :: SingleSource/Regression/C/gcc-c-torture/execute/GCC-C-execute-pr89634.test' RESULTS **********
compile_time: 0.0000 
exec_time: 0.0008 
hash: "eafebd2f7d22c12a35dc3e0b9acef812" 
link_time: 0.0099 
**********
PASS: test-suite :: SingleSource/Regression/C/gcc-c-torture/execute/GCC-C-execute-pr89826.test (1743 of 2039)
********** TEST 'test-suite :: SingleSource/Regression/C/gcc-c-torture/execute/GCC-C-execute-pr89826.test' RESULTS **********
compile_time: 0.0000 
exec_time: 0.0008 
hash: "adc99e209d0e56fd98ba5fa4224c5dca" 
link_time: 0.0101 
**********
PASS: test-suite :: SingleSource/Regression/C/gcc-c-torture/execute/GCC-C-execute-pr90025.test (1744 of 2039)
********** TEST 'test-suite :: SingleSource/Regression/C/gcc-c-torture/execute/GCC-C-execute-pr90025.test' RESULTS **********
compile_time: 0.0000 
exec_time: 0.0008 
hash: "b9761339da7e30d6d21ff3e36e010633" 
link_time: 0.0102 
**********
PASS: test-suite :: SingleSource/Regression/C/gcc-c-torture/execute/GCC-C-execute-pr90949.test (1745 of 2039)
********** TEST 'test-suite :: SingleSource/Regression/C/gcc-c-torture/execute/GCC-C-execute-pr90949.test' RESULTS **********
compile_time: 0.0000 
exec_time: 0.0007 
hash: "dc7b9e469777aec5062714ab54f61a7f" 
link_time: 0.0077 
**********
PASS: test-suite :: SingleSource/Regression/C/gcc-c-torture/execute/GCC-C-execute-pr91137.test (1746 of 2039)
********** TEST 'test-suite :: SingleSource/Regression/C/gcc-c-torture/execute/GCC-C-execute-pr91137.test' RESULTS **********
compile_time: 0.0000 
exec_time: 0.0015 
hash: "46045f2cfaa79e9865aea2a6ed7b06f8" 
link_time: 0.0106 
**********
PASS: test-suite :: SingleSource/Regression/C/gcc-c-torture/execute/GCC-C-execute-printf-1.test (1747 of 2039)
********** TEST 'test-suite :: SingleSource/Regression/C/gcc-c-torture/execute/GCC-C-execute-printf-1.test' RESULTS **********
compile_time: 0.0000 
exec_time: 0.0008 
hash: "f969dff2188dcf4018b38f700da297a2" 
link_time: 0.0096 
**********
PASS: test-suite :: SingleSource/Regression/C/gcc-c-torture/execute/GCC-C-execute-printf-2.test (1748 of 2039)
********** TEST 'test-suite :: SingleSource/Regression/C/gcc-c-torture/execute/GCC-C-execute-printf-2.test' RESULTS **********
compile_time: 0.0000 
exec_time: 0.0007 
hash: "f16175aecf81923daad01a621b8aad08" 
link_time: 0.0106 
**********
PASS: test-suite :: SingleSource/Regression/C/gcc-c-torture/execute/GCC-C-execute-pta-field-1.test (1749 of 2039)
********** TEST 'test-suite :: SingleSource/Regression/C/gcc-c-torture/execute/GCC-C-execute-pta-field-1.test' RESULTS **********
compile_time: 0.0000 
exec_time: 0.0007 
hash: "201524d313e77e13386e50bb3bd513fa" 
link_time: 0.0103 
**********
PASS: test-suite :: SingleSource/Regression/C/gcc-c-torture/execute/GCC-C-execute-pta-field-2.test (1750 of 2039)
********** TEST 'test-suite :: SingleSource/Regression/C/gcc-c-torture/execute/GCC-C-execute-pta-field-2.test' RESULTS **********
compile_time: 0.0000 
exec_time: 0.0007 
hash: "dd523e208dde88c28cd9cc8c52bd054c" 
link_time: 0.0106 
**********
PASS: test-suite :: SingleSource/Regression/C/gcc-c-torture/execute/GCC-C-execute-ptr-arith-1.test (1751 of 2039)
********** TEST 'test-suite :: SingleSource/Regression/C/gcc-c-torture/execute/GCC-C-execute-ptr-arith-1.test' RESULTS **********
compile_time: 0.0000 
exec_time: 0.0008 
hash: "f19f2515938c097521d77efab437f413" 
link_time: 0.0102 
**********
PASS: test-suite :: SingleSource/Regression/C/gcc-c-torture/execute/GCC-C-execute-pure-1.test (1752 of 2039)
********** TEST 'test-suite :: SingleSource/Regression/C/gcc-c-torture/execute/GCC-C-execute-pure-1.test' RESULTS **********
compile_time: 0.0000 
exec_time: 0.0008 
hash: "0b5ad61074b471135821fe906ffa0424" 
link_time: 0.0079 
**********
PASS: test-suite :: SingleSource/Regression/C/gcc-c-torture/execute/GCC-C-execute-pushpop_macro.test (1753 of 2039)
********** TEST 'test-suite :: SingleSource/Regression/C/gcc-c-torture/execute/GCC-C-execute-pushpop_macro.test' RESULTS **********
compile_time: 0.0000 
exec_time: 0.0006 
hash: "a8b647ca4af029076c2c57fd8bc113d2" 
link_time: 0.0104 
**********
PASS: test-suite :: SingleSource/Regression/C/gcc-c-torture/execute/GCC-C-execute-regstack-1.test (1754 of 2039)
********** TEST 'test-suite :: SingleSource/Regression/C/gcc-c-torture/execute/GCC-C-execute-regstack-1.test' RESULTS **********
compile_time: 0.0000 
exec_time: 0.0008 
hash: "e382e2a7a0e499e944478381f4d176aa" 
link_time: 0.0105 
**********
NOEXE: test-suite :: SingleSource/Regression/C/gcc-c-torture/execute/GCC-C-execute-return-addr.test (1755 of 2039)
******************** TEST 'test-suite :: SingleSource/Regression/C/gcc-c-torture/execute/GCC-C-execute-return-addr.test' FAILED ********************
Executable '/Users/buildslave/jenkins/workspace/Testsuite-Tester@4/sandbox/build/SingleSource/Regression/C/gcc-c-torture/execute/GCC-C-execute-return-addr' is missing
********************
NOEXE: test-suite :: SingleSource/Regression/C/gcc-c-torture/execute/GCC-C-execute-scal-to-vec1.test (1756 of 2039)
******************** TEST 'test-suite :: SingleSource/Regression/C/gcc-c-torture/execute/GCC-C-execute-scal-to-vec1.test' FAILED ********************
Executable '/Users/buildslave/jenkins/workspace/Testsuite-Tester@4/sandbox/build/SingleSource/Regression/C/gcc-c-torture/execute/GCC-C-execute-scal-to-vec1' is missing
********************
NOEXE: test-suite :: SingleSource/Regression/C/gcc-c-torture/execute/GCC-C-execute-scal-to-vec2.test (1757 of 2039)
******************** TEST 'test-suite :: SingleSource/Regression/C/gcc-c-torture/execute/GCC-C-execute-scal-to-vec2.test' FAILED ********************
Executable '/Users/buildslave/jenkins/workspace/Testsuite-Tester@4/sandbox/build/SingleSource/Regression/C/gcc-c-torture/execute/GCC-C-execute-scal-to-vec2' is missing
********************
NOEXE: test-suite :: SingleSource/Regression/C/gcc-c-torture/execute/GCC-C-execute-scal-to-vec3.test (1758 of 2039)
******************** TEST 'test-suite :: SingleSource/Regression/C/gcc-c-torture/execute/GCC-C-execute-scal-to-vec3.test' FAILED ********************
Executable '/Users/buildslave/jenkins/workspace/Testsuite-Tester@4/sandbox/build/SingleSource/Regression/C/gcc-c-torture/execute/GCC-C-execute-scal-to-vec3' is missing
********************
PASS: test-suite :: SingleSource/Regression/C/gcc-c-torture/execute/GCC-C-execute-scope-1.test (1759 of 2039)
********** TEST 'test-suite :: SingleSource/Regression/C/gcc-c-torture/execute/GCC-C-execute-scope-1.test' RESULTS **********
compile_time: 0.0000 
exec_time: 0.0007 
hash: "8e0b6c556946f43da02892e86693b5de" 
link_time: 0.0102 
**********
PASS: test-suite :: SingleSource/Regression/C/gcc-c-torture/execute/GCC-C-execute-shiftdi-2.test (1760 of 2039)
********** TEST 'test-suite :: SingleSource/Regression/C/gcc-c-torture/execute/GCC-C-execute-shiftdi-2.test' RESULTS **********
compile_time: 0.0000 
exec_time: 0.0006 
hash: "7443b2aaea06e61f0c81faf6713c2554" 
link_time: 0.0105 
**********
PASS: test-suite :: SingleSource/Regression/C/gcc-c-torture/execute/GCC-C-execute-shiftdi.test (1761 of 2039)
********** TEST 'test-suite :: SingleSource/Regression/C/gcc-c-torture/execute/GCC-C-execute-shiftdi.test' RESULTS **********
compile_time: 0.0000 
exec_time: 0.0009 
hash: "896a1d5b91d4d6398b807a348897d714" 
link_time: 0.0105 
**********
PASS: test-suite :: SingleSource/Regression/C/gcc-c-torture/execute/GCC-C-execute-shiftopt-1.test (1762 of 2039)
********** TEST 'test-suite :: SingleSource/Regression/C/gcc-c-torture/execute/GCC-C-execute-shiftopt-1.test' RESULTS **********
compile_time: 0.0000 
exec_time: 0.0007 
hash: "1703084a73e8cb1a954a6191b0872a33" 
link_time: 0.0082 
**********
NOEXE: test-suite :: SingleSource/Regression/C/gcc-c-torture/execute/GCC-C-execute-simd-1.test (1763 of 2039)
******************** TEST 'test-suite :: SingleSource/Regression/C/gcc-c-torture/execute/GCC-C-execute-simd-1.test' FAILED ********************
Executable '/Users/buildslave/jenkins/workspace/Testsuite-Tester@4/sandbox/build/SingleSource/Regression/C/gcc-c-torture/execute/GCC-C-execute-simd-1' is missing
********************
PASS: test-suite :: SingleSource/Regression/C/gcc-c-torture/execute/GCC-C-execute-simd-2.test (1764 of 2039)
********** TEST 'test-suite :: SingleSource/Regression/C/gcc-c-torture/execute/GCC-C-execute-simd-2.test' RESULTS **********
compile_time: 0.0000 
exec_time: 0.0008 
hash: "e628fac0209775bec319f7e6bd562e82" 
link_time: 0.0079 
**********
PASS: test-suite :: SingleSource/Regression/C/gcc-c-torture/execute/GCC-C-execute-simd-4.test (1765 of 2039)
********** TEST 'test-suite :: SingleSource/Regression/C/gcc-c-torture/execute/GCC-C-execute-simd-4.test' RESULTS **********
compile_time: 0.0000 
exec_time: 0.0009 
hash: "8d9374490a7cff66df55ef9bf1937e28" 
link_time: 0.0077 
**********
PASS: test-suite :: SingleSource/Regression/C/gcc-c-torture/execute/GCC-C-execute-simd-5.test (1766 of 2039)
********** TEST 'test-suite :: SingleSource/Regression/C/gcc-c-torture/execute/GCC-C-execute-simd-5.test' RESULTS **********
compile_time: 0.0000 
exec_time: 0.0008 
hash: "2ec9425c9a44e41716106f67f7fef971" 
link_time: 0.0108 
**********
PASS: test-suite :: SingleSource/Regression/C/gcc-c-torture/execute/GCC-C-execute-simd-6.test (1767 of 2039)
********** TEST 'test-suite :: SingleSource/Regression/C/gcc-c-torture/execute/GCC-C-execute-simd-6.test' RESULTS **********
compile_time: 0.0000 
exec_time: 0.0006 
hash: "9a17c85341d95ed02c6c7a4da1fb97aa" 
link_time: 0.0099 
**********
PASS: test-suite :: SingleSource/Regression/C/gcc-c-torture/execute/GCC-C-execute-ssad-run.test (1768 of 2039)
********** TEST 'test-suite :: SingleSource/Regression/C/gcc-c-torture/execute/GCC-C-execute-ssad-run.test' RESULTS **********
compile_time: 0.0000 
exec_time: 0.0007 
hash: "9593fa1467a33864f845402aec10ac37" 
link_time: 0.0104 
**********
PASS: test-suite :: SingleSource/Regression/C/gcc-c-torture/execute/GCC-C-execute-stdarg-1.test (1769 of 2039)
********** TEST 'test-suite :: SingleSource/Regression/C/gcc-c-torture/execute/GCC-C-execute-stdarg-1.test' RESULTS **********
compile_time: 0.0000 
exec_time: 0.0008 
hash: "921b9c9e02b6ab33e1cccb0b6ddbbc02" 
link_time: 0.0101 
**********
PASS: test-suite :: SingleSource/Regression/C/gcc-c-torture/execute/GCC-C-execute-stdarg-2.test (1770 of 2039)
********** TEST 'test-suite :: SingleSource/Regression/C/gcc-c-torture/execute/GCC-C-execute-stdarg-2.test' RESULTS **********
compile_time: 0.0000 
exec_time: 0.0008 
hash: "a9bf28be7d7a8707050e3998b719b0ee" 
link_time: 0.0103 
**********
PASS: test-suite :: SingleSource/Regression/C/gcc-c-torture/execute/GCC-C-execute-stdarg-3.test (1771 of 2039)
********** TEST 'test-suite :: SingleSource/Regression/C/gcc-c-torture/execute/GCC-C-execute-stdarg-3.test' RESULTS **********
compile_time: 0.0000 
exec_time: 0.0008 
hash: "a3576f98af02a18af961daf3a03af50a" 
link_time: 0.0085 
**********
PASS: test-suite :: SingleSource/Regression/C/gcc-c-torture/execute/GCC-C-execute-stdarg-4.test (1772 of 2039)
********** TEST 'test-suite :: SingleSource/Regression/C/gcc-c-torture/execute/GCC-C-execute-stdarg-4.test' RESULTS **********
compile_time: 0.0000 
exec_time: 0.0007 
hash: "d734e38dd2a2635a3869f82acf54e200" 
link_time: 0.0108 
**********
PASS: test-suite :: SingleSource/Regression/C/gcc-c-torture/execute/GCC-C-execute-stkalign.test (1773 of 2039)
********** TEST 'test-suite :: SingleSource/Regression/C/gcc-c-torture/execute/GCC-C-execute-stkalign.test' RESULTS **********
compile_time: 0.0000 
exec_time: 0.0006 
hash: "03b788a2f72a3c1f232ee559a1584ee9" 
link_time: 0.0095 
**********
PASS: test-suite :: SingleSource/Regression/C/gcc-c-torture/execute/GCC-C-execute-strcmp-1.test (1774 of 2039)
********** TEST 'test-suite :: SingleSource/Regression/C/gcc-c-torture/execute/GCC-C-execute-strcmp-1.test' RESULTS **********
compile_time: 0.0000 
exec_time: 0.0028 
hash: "259a056d010e7afe2af2583904e4555e" 
link_time: 0.0110 
**********
PASS: test-suite :: SingleSource/Regression/C/gcc-c-torture/execute/GCC-C-execute-strcpy-1.test (1775 of 2039)
********** TEST 'test-suite :: SingleSource/Regression/C/gcc-c-torture/execute/GCC-C-execute-strcpy-1.test' RESULTS **********
compile_time: 0.0000 
exec_time: 0.0042 
hash: "7129b05509a803bbc9d4c82062d8e49f" 
link_time: 0.0108 
**********
PASS: test-suite :: SingleSource/Regression/C/gcc-c-torture/execute/GCC-C-execute-strcpy-2.test (1776 of 2039)
********** TEST 'test-suite :: SingleSource/Regression/C/gcc-c-torture/execute/GCC-C-execute-strcpy-2.test' RESULTS **********
compile_time: 0.0000 
exec_time: 0.0007 
hash: "2c8692dc1dc68b69d055e277a57f2c13" 
link_time: 0.0093 
**********
PASS: test-suite :: SingleSource/Regression/C/gcc-c-torture/execute/GCC-C-execute-strct-pack-1.test (1777 of 2039)
********** TEST 'test-suite :: SingleSource/Regression/C/gcc-c-torture/execute/GCC-C-execute-strct-pack-1.test' RESULTS **********
compile_time: 0.0000 
exec_time: 0.0006 
hash: "e04617375b0bed7ebf797e717be0f5d1" 
link_time: 0.0101 
**********
PASS: test-suite :: SingleSource/Regression/C/gcc-c-torture/execute/GCC-C-execute-strct-pack-2.test (1778 of 2039)
********** TEST 'test-suite :: SingleSource/Regression/C/gcc-c-torture/execute/GCC-C-execute-strct-pack-2.test' RESULTS **********
compile_time: 0.0000 
exec_time: 0.0007 
hash: "43ecd12e4c9c1ccf78f6166eef421f74" 
link_time: 0.0084 
**********
PASS: test-suite :: SingleSource/Regression/C/gcc-c-torture/execute/GCC-C-execute-strct-pack-3.test (1779 of 2039)
********** TEST 'test-suite :: SingleSource/Regression/C/gcc-c-torture/execute/GCC-C-execute-strct-pack-3.test' RESULTS **********
compile_time: 0.0000 
exec_time: 0.0006 
hash: "136f3e8965aae9d12fef99517b5d90c1" 
link_time: 0.0088 
**********
PASS: test-suite :: SingleSource/Regression/C/gcc-c-torture/execute/GCC-C-execute-strct-pack-4.test (1780 of 2039)
********** TEST 'test-suite :: SingleSource/Regression/C/gcc-c-torture/execute/GCC-C-execute-strct-pack-4.test' RESULTS **********
compile_time: 0.0000 
exec_time: 0.0008 
hash: "df0e2bc1392f2ff3435ee0657d0d102f" 
link_time: 0.0110 
**********
PASS: test-suite :: SingleSource/Regression/C/gcc-c-torture/execute/GCC-C-execute-strct-stdarg-1.test (1781 of 2039)
********** TEST 'test-suite :: SingleSource/Regression/C/gcc-c-torture/execute/GCC-C-execute-strct-stdarg-1.test' RESULTS **********
compile_time: 0.0000 
exec_time: 0.0008 
hash: "e042117529e54932a293eba6ca48b46f" 
link_time: 0.0104 
**********
PASS: test-suite :: SingleSource/Regression/C/gcc-c-torture/execute/GCC-C-execute-strct-varg-1.test (1782 of 2039)
********** TEST 'test-suite :: SingleSource/Regression/C/gcc-c-torture/execute/GCC-C-execute-strct-varg-1.test' RESULTS **********
compile_time: 0.0000 
exec_time: 0.0007 
hash: "c1f9944670d7d26ee9242e2049ead62d" 
link_time: 0.0092 
**********
PASS: test-suite :: SingleSource/Regression/C/gcc-c-torture/execute/GCC-C-execute-string-opt-17.test (1783 of 2039)
********** TEST 'test-suite :: SingleSource/Regression/C/gcc-c-torture/execute/GCC-C-execute-string-opt-17.test' RESULTS **********
compile_time: 0.0000 
exec_time: 0.0007 
hash: "bc8613e0d74f8c6407031506d3b319d8" 
link_time: 0.0112 
**********
NOEXE: test-suite :: SingleSource/Regression/C/gcc-c-torture/execute/GCC-C-execute-string-opt-18.test (1784 of 2039)
******************** TEST 'test-suite :: SingleSource/Regression/C/gcc-c-torture/execute/GCC-C-execute-string-opt-18.test' FAILED ********************
Executable '/Users/buildslave/jenkins/workspace/Testsuite-Tester@4/sandbox/build/SingleSource/Regression/C/gcc-c-torture/execute/GCC-C-execute-string-opt-18' is missing
********************
PASS: test-suite :: SingleSource/Regression/C/gcc-c-torture/execute/GCC-C-execute-string-opt-5.test (1785 of 2039)
********** TEST 'test-suite :: SingleSource/Regression/C/gcc-c-torture/execute/GCC-C-execute-string-opt-5.test' RESULTS **********
compile_time: 0.0000 
exec_time: 0.0007 
hash: "9c56c177fe8e3263837aeabbd455423a" 
link_time: 0.0094 
**********
PASS: test-suite :: SingleSource/Regression/C/gcc-c-torture/execute/GCC-C-execute-strlen-1.test (1786 of 2039)
********** TEST 'test-suite :: SingleSource/Regression/C/gcc-c-torture/execute/GCC-C-execute-strlen-1.test' RESULTS **********
compile_time: 0.0000 
exec_time: 0.0007 
hash: "6fad232cfe9e46d6a87addd0b036b4c3" 
link_time: 0.0097 
**********
PASS: test-suite :: SingleSource/Regression/C/gcc-c-torture/execute/GCC-C-execute-strlen-2.test (1787 of 2039)
********** TEST 'test-suite :: SingleSource/Regression/C/gcc-c-torture/execute/GCC-C-execute-strlen-2.test' RESULTS **********
compile_time: 0.0000 
exec_time: 0.0008 
hash: "6c8ca7553b35a0479736edd1ce9fd3a6" 
link_time: 0.0104 
**********
PASS: test-suite :: SingleSource/Regression/C/gcc-c-torture/execute/GCC-C-execute-strlen-3.test (1788 of 2039)
********** TEST 'test-suite :: SingleSource/Regression/C/gcc-c-torture/execute/GCC-C-execute-strlen-3.test' RESULTS **********
compile_time: 0.0000 
exec_time: 0.0007 
hash: "a30d176edcdf426ffb7b42598871f77a" 
link_time: 0.0100 
**********
PASS: test-suite :: SingleSource/Regression/C/gcc-c-torture/execute/GCC-C-execute-strlen-4.test (1789 of 2039)
********** TEST 'test-suite :: SingleSource/Regression/C/gcc-c-torture/execute/GCC-C-execute-strlen-4.test' RESULTS **********
compile_time: 0.0000 
exec_time: 0.0008 
hash: "cb39fa62b5ae076cc2979bc75c66c591" 
link_time: 0.0120 
**********
PASS: test-suite :: SingleSource/Regression/C/gcc-c-torture/execute/GCC-C-execute-strlen-5.test (1790 of 2039)
********** TEST 'test-suite :: SingleSource/Regression/C/gcc-c-torture/execute/GCC-C-execute-strlen-5.test' RESULTS **********
compile_time: 0.0000 
exec_time: 0.0007 
hash: "98198bb37c6abf0a0385d6e68418611e" 
link_time: 0.0114 
**********
PASS: test-suite :: SingleSource/Regression/C/gcc-c-torture/execute/GCC-C-execute-strlen-6.test (1791 of 2039)
********** TEST 'test-suite :: SingleSource/Regression/C/gcc-c-torture/execute/GCC-C-execute-strlen-6.test' RESULTS **********
compile_time: 0.0000 
exec_time: 0.0007 
hash: "33c350c6d1da60b1d3a9e00c41e31dd8" 
link_time: 0.0101 
**********
PASS: test-suite :: SingleSource/Regression/C/gcc-c-torture/execute/GCC-C-execute-strncmp-1.test (1792 of 2039)
********** TEST 'test-suite :: SingleSource/Regression/C/gcc-c-torture/execute/GCC-C-execute-strncmp-1.test' RESULTS **********
compile_time: 0.0000 
exec_time: 0.0035 
hash: "a483247bf6d0d6ad6b0804414271ff77" 
link_time: 0.0099 
**********
PASS: test-suite :: SingleSource/Regression/C/gcc-c-torture/execute/GCC-C-execute-struct-aliasing-1.test (1793 of 2039)
********** TEST 'test-suite :: SingleSource/Regression/C/gcc-c-torture/execute/GCC-C-execute-struct-aliasing-1.test' RESULTS **********
compile_time: 0.0000 
exec_time: 0.0007 
hash: "73174c1c03ea77f3d55d88c0156a2a34" 
link_time: 0.0084 
**********
PASS: test-suite :: SingleSource/Regression/C/gcc-c-torture/execute/GCC-C-execute-struct-cpy-1.test (1794 of 2039)
********** TEST 'test-suite :: SingleSource/Regression/C/gcc-c-torture/execute/GCC-C-execute-struct-cpy-1.test' RESULTS **********
compile_time: 0.0000 
exec_time: 0.0008 
hash: "6a839b91072e6857d026d95db838af52" 
link_time: 0.0083 
**********
PASS: test-suite :: SingleSource/Regression/C/gcc-c-torture/execute/GCC-C-execute-struct-ini-1.test (1795 of 2039)
********** TEST 'test-suite :: SingleSource/Regression/C/gcc-c-torture/execute/GCC-C-execute-struct-ini-1.test' RESULTS **********
compile_time: 0.0000 
exec_time: 0.0006 
hash: "58c8f3df313166e2ff997805395ba08d" 
link_time: 0.0100 
**********
PASS: test-suite :: SingleSource/Regression/C/gcc-c-torture/execute/GCC-C-execute-struct-ini-2.test (1796 of 2039)
********** TEST 'test-suite :: SingleSource/Regression/C/gcc-c-torture/execute/GCC-C-execute-struct-ini-2.test' RESULTS **********
compile_time: 0.0000 
exec_time: 0.0008 
hash: "c5f3ae67c0b49c555a0b25d47b584bec" 
link_time: 0.0099 
**********
PASS: test-suite :: SingleSource/Regression/C/gcc-c-torture/execute/GCC-C-execute-struct-ini-3.test (1797 of 2039)
********** TEST 'test-suite :: SingleSource/Regression/C/gcc-c-torture/execute/GCC-C-execute-struct-ini-3.test' RESULTS **********
compile_time: 0.0000 
exec_time: 0.0007 
hash: "fc6878ddd5673fb7b044036a977004b5" 
link_time: 0.0090 
**********
PASS: test-suite :: SingleSource/Regression/C/gcc-c-torture/execute/GCC-C-execute-struct-ini-4.test (1798 of 2039)
********** TEST 'test-suite :: SingleSource/Regression/C/gcc-c-torture/execute/GCC-C-execute-struct-ini-4.test' RESULTS **********
compile_time: 0.0000 
exec_time: 0.0007 
hash: "153e2761007cea21af73ba25c6d9a05a" 
link_time: 0.0096 
**********
PASS: test-suite :: SingleSource/Regression/C/gcc-c-torture/execute/GCC-C-execute-struct-ret-1.test (1799 of 2039)
********** TEST 'test-suite :: SingleSource/Regression/C/gcc-c-torture/execute/GCC-C-execute-struct-ret-1.test' RESULTS **********
compile_time: 0.0000 
exec_time: 0.0008 
hash: "be98ec86bbe888cbf4cad03a5268788c" 
link_time: 0.0108 
**********
PASS: test-suite :: SingleSource/Regression/C/gcc-c-torture/execute/GCC-C-execute-struct-ret-2.test (1800 of 2039)
********** TEST 'test-suite :: SingleSource/Regression/C/gcc-c-torture/execute/GCC-C-execute-struct-ret-2.test' RESULTS **********
compile_time: 0.0000 
exec_time: 0.0007 
hash: "fbe51244c17824ac48b05507d2bde79d" 
link_time: 0.0093 
**********
PASS: test-suite :: SingleSource/Regression/C/gcc-c-torture/execute/GCC-C-execute-switch-1.test (1801 of 2039)
********** TEST 'test-suite :: SingleSource/Regression/C/gcc-c-torture/execute/GCC-C-execute-switch-1.test' RESULTS **********
compile_time: 0.0000 
exec_time: 0.0008 
hash: "80b391346ed9d37879bdc2808458f7ff" 
link_time: 0.0102 
**********
PASS: test-suite :: SingleSource/Regression/C/gcc-c-torture/execute/GCC-C-execute-tstdi-1.test (1802 of 2039)
********** TEST 'test-suite :: SingleSource/Regression/C/gcc-c-torture/execute/GCC-C-execute-tstdi-1.test' RESULTS **********
compile_time: 0.0000 
exec_time: 0.0007 
hash: "b556a68205776cdb8de7117c1419f171" 
link_time: 0.0095 
**********
PASS: test-suite :: SingleSource/Regression/C/gcc-c-torture/execute/GCC-C-execute-usad-run.test (1803 of 2039)
********** TEST 'test-suite :: SingleSource/Regression/C/gcc-c-torture/execute/GCC-C-execute-usad-run.test' RESULTS **********
compile_time: 0.0000 
exec_time: 0.0007 
hash: "ba383cb6426ca20ec0953dcb407681f3" 
link_time: 0.0102 
**********
PASS: test-suite :: SingleSource/Regression/C/gcc-c-torture/execute/GCC-C-execute-user-printf.test (1804 of 2039)
********** TEST 'test-suite :: SingleSource/Regression/C/gcc-c-torture/execute/GCC-C-execute-user-printf.test' RESULTS **********
compile_time: 0.0000 
exec_time: 0.0006 
hash: "022a6953ee072c3e0d95239c8c8d6d5d" 
link_time: 0.0116 
**********
PASS: test-suite :: SingleSource/Regression/C/gcc-c-torture/execute/GCC-C-execute-usmul.test (1805 of 2039)
********** TEST 'test-suite :: SingleSource/Regression/C/gcc-c-torture/execute/GCC-C-execute-usmul.test' RESULTS **********
compile_time: 0.0000 
exec_time: 0.0008 
hash: "27b1bb3d10113ce80ac2157506004e23" 
link_time: 0.0099 
**********
PASS: test-suite :: SingleSource/Regression/C/gcc-c-torture/execute/GCC-C-execute-va-arg-1.test (1806 of 2039)
********** TEST 'test-suite :: SingleSource/Regression/C/gcc-c-torture/execute/GCC-C-execute-va-arg-1.test' RESULTS **********
compile_time: 0.0000 
exec_time: 0.0008 
hash: "2f0a0471610a5b7a8b31de969188418a" 
link_time: 0.0107 
**********
PASS: test-suite :: SingleSource/Regression/C/gcc-c-torture/execute/GCC-C-execute-va-arg-10.test (1807 of 2039)
********** TEST 'test-suite :: SingleSource/Regression/C/gcc-c-torture/execute/GCC-C-execute-va-arg-10.test' RESULTS **********
compile_time: 0.0000 
exec_time: 0.0007 
hash: "abf19474b1ea38b827d0632f6c384485" 
link_time: 0.0095 
**********
PASS: test-suite :: SingleSource/Regression/C/gcc-c-torture/execute/GCC-C-execute-va-arg-11.test (1808 of 2039)
********** TEST 'test-suite :: SingleSource/Regression/C/gcc-c-torture/execute/GCC-C-execute-va-arg-11.test' RESULTS **********
compile_time: 0.0000 
exec_time: 0.0007 
hash: "4fe6bb5451abaf891913865f02019829" 
link_time: 0.0109 
**********
PASS: test-suite :: SingleSource/Regression/C/gcc-c-torture/execute/GCC-C-execute-va-arg-12.test (1809 of 2039)
********** TEST 'test-suite :: SingleSource/Regression/C/gcc-c-torture/execute/GCC-C-execute-va-arg-12.test' RESULTS **********
compile_time: 0.0000 
exec_time: 0.0008 
hash: "46633d86865e61f671a6cab324831afe" 
link_time: 0.0074 
**********
PASS: test-suite :: SingleSource/Regression/C/gcc-c-torture/execute/GCC-C-execute-va-arg-13.test (1810 of 2039)
********** TEST 'test-suite :: SingleSource/Regression/C/gcc-c-torture/execute/GCC-C-execute-va-arg-13.test' RESULTS **********
compile_time: 0.0000 
exec_time: 0.0007 
hash: "97fcbef3e3b195553a7b364700efaefa" 
link_time: 0.0091 
**********
PASS: test-suite :: SingleSource/Regression/C/gcc-c-torture/execute/GCC-C-execute-va-arg-14.test (1811 of 2039)
********** TEST 'test-suite :: SingleSource/Regression/C/gcc-c-torture/execute/GCC-C-execute-va-arg-14.test' RESULTS **********
compile_time: 0.0000 
exec_time: 0.0008 
hash: "a6169df638a1f2db396d54eaacd83e63" 
link_time: 0.0085 
**********
PASS: test-suite :: SingleSource/Regression/C/gcc-c-torture/execute/GCC-C-execute-va-arg-15.test (1812 of 2039)
********** TEST 'test-suite :: SingleSource/Regression/C/gcc-c-torture/execute/GCC-C-execute-va-arg-15.test' RESULTS **********
compile_time: 0.0000 
exec_time: 0.0006 
hash: "f4477c431a8fa39af68cf59bc9a7b7da" 
link_time: 0.0103 
**********
PASS: test-suite :: SingleSource/Regression/C/gcc-c-torture/execute/GCC-C-execute-va-arg-16.test (1813 of 2039)
********** TEST 'test-suite :: SingleSource/Regression/C/gcc-c-torture/execute/GCC-C-execute-va-arg-16.test' RESULTS **********
compile_time: 0.0000 
exec_time: 0.0007 
hash: "1c674a77007f51a4874f35206291c174" 
link_time: 0.0092 
**********
PASS: test-suite :: SingleSource/Regression/C/gcc-c-torture/execute/GCC-C-execute-va-arg-17.test (1814 of 2039)
********** TEST 'test-suite :: SingleSource/Regression/C/gcc-c-torture/execute/GCC-C-execute-va-arg-17.test' RESULTS **********
compile_time: 0.0000 
exec_time: 0.0007 
hash: "510c420855d5a0ec2d7cc0d9454ec7fb" 
link_time: 0.0106 
**********
PASS: test-suite :: SingleSource/Regression/C/gcc-c-torture/execute/GCC-C-execute-va-arg-18.test (1815 of 2039)
********** TEST 'test-suite :: SingleSource/Regression/C/gcc-c-torture/execute/GCC-C-execute-va-arg-18.test' RESULTS **********
compile_time: 0.0000 
exec_time: 0.0007 
hash: "d77985370a7976eab795f9520d434182" 
link_time: 0.0095 
**********
PASS: test-suite :: SingleSource/Regression/C/gcc-c-torture/execute/GCC-C-execute-va-arg-19.test (1816 of 2039)
********** TEST 'test-suite :: SingleSource/Regression/C/gcc-c-torture/execute/GCC-C-execute-va-arg-19.test' RESULTS **********
compile_time: 0.0000 
exec_time: 0.0008 
hash: "c9ad0baa4708b991e9d5f8d1f23cb1e5" 
link_time: 0.0112 
**********
PASS: test-suite :: SingleSource/Regression/C/gcc-c-torture/execute/GCC-C-execute-va-arg-2.test (1817 of 2039)
********** TEST 'test-suite :: SingleSource/Regression/C/gcc-c-torture/execute/GCC-C-execute-va-arg-2.test' RESULTS **********
compile_time: 0.0000 
exec_time: 0.0007 
hash: "708029138cc3456ce59e54ebccb9ab73" 
link_time: 0.0094 
**********
PASS: test-suite :: SingleSource/Regression/C/gcc-c-torture/execute/GCC-C-execute-va-arg-20.test (1818 of 2039)
********** TEST 'test-suite :: SingleSource/Regression/C/gcc-c-torture/execute/GCC-C-execute-va-arg-20.test' RESULTS **********
compile_time: 0.0000 
exec_time: 0.0008 
hash: "bad1d6c357e6438b66a4ce8b915165ea" 
link_time: 0.0081 
**********
PASS: test-suite :: SingleSource/Regression/C/gcc-c-torture/execute/GCC-C-execute-va-arg-21.test (1819 of 2039)
********** TEST 'test-suite :: SingleSource/Regression/C/gcc-c-torture/execute/GCC-C-execute-va-arg-21.test' RESULTS **********
compile_time: 0.0000 
exec_time: 0.0007 
hash: "ea12fe3494c117b10e0ac5f962174ca6" 
link_time: 0.0105 
**********
PASS: test-suite :: SingleSource/Regression/C/gcc-c-torture/execute/GCC-C-execute-va-arg-22.test (1820 of 2039)
********** TEST 'test-suite :: SingleSource/Regression/C/gcc-c-torture/execute/GCC-C-execute-va-arg-22.test' RESULTS **********
compile_time: 0.0000 
exec_time: 0.0007 
hash: "4dcebf000eb1a699a21e7ffffa7605b2" 
link_time: 0.0096 
**********
PASS: test-suite :: SingleSource/Regression/C/gcc-c-torture/execute/GCC-C-execute-va-arg-23.test (1821 of 2039)
********** TEST 'test-suite :: SingleSource/Regression/C/gcc-c-torture/execute/GCC-C-execute-va-arg-23.test' RESULTS **********
compile_time: 0.0000 
exec_time: 0.0006 
hash: "27aa034ead655e6a9608b967424edbfe" 
link_time: 0.0089 
**********
PASS: test-suite :: SingleSource/Regression/C/gcc-c-torture/execute/GCC-C-execute-va-arg-24.test (1822 of 2039)
********** TEST 'test-suite :: SingleSource/Regression/C/gcc-c-torture/execute/GCC-C-execute-va-arg-24.test' RESULTS **********
compile_time: 0.0000 
exec_time: 0.0008 
hash: "994fc46319e0726ef2f1ed2e309241e5" 
link_time: 0.0098 
**********
PASS: test-suite :: SingleSource/Regression/C/gcc-c-torture/execute/GCC-C-execute-va-arg-26.test (1823 of 2039)
********** TEST 'test-suite :: SingleSource/Regression/C/gcc-c-torture/execute/GCC-C-execute-va-arg-26.test' RESULTS **********
compile_time: 0.0000 
exec_time: 0.0007 
hash: "88d3d62b34b379b3742a7ecbfb6217e7" 
link_time: 0.0094 
**********
PASS: test-suite :: SingleSource/Regression/C/gcc-c-torture/execute/GCC-C-execute-va-arg-4.test (1824 of 2039)
********** TEST 'test-suite :: SingleSource/Regression/C/gcc-c-torture/execute/GCC-C-execute-va-arg-4.test' RESULTS **********
compile_time: 0.0000 
exec_time: 0.0006 
hash: "e8dcfee88e21525c72f784211feee364" 
link_time: 0.0103 
**********
PASS: test-suite :: SingleSource/Regression/C/gcc-c-torture/execute/GCC-C-execute-va-arg-5.test (1825 of 2039)
********** TEST 'test-suite :: SingleSource/Regression/C/gcc-c-torture/execute/GCC-C-execute-va-arg-5.test' RESULTS **********
compile_time: 0.0000 
exec_time: 0.0007 
hash: "a2fc8e2651945bc5cb529ff28cb6c859" 
link_time: 0.0106 
**********
PASS: test-suite :: SingleSource/Regression/C/gcc-c-torture/execute/GCC-C-execute-va-arg-6.test (1826 of 2039)
********** TEST 'test-suite :: SingleSource/Regression/C/gcc-c-torture/execute/GCC-C-execute-va-arg-6.test' RESULTS **********
compile_time: 0.0000 
exec_time: 0.0007 
hash: "83222e9596e8df6a60b71a4c6b071f65" 
link_time: 0.0101 
**********
PASS: test-suite :: SingleSource/Regression/C/gcc-c-torture/execute/GCC-C-execute-va-arg-9.test (1827 of 2039)
********** TEST 'test-suite :: SingleSource/Regression/C/gcc-c-torture/execute/GCC-C-execute-va-arg-9.test' RESULTS **********
compile_time: 0.0000 
exec_time: 0.0007 
hash: "0e9043a44c285e1b488c8e8415a2048c" 
link_time: 0.0112 
**********
PASS: test-suite :: SingleSource/Regression/C/gcc-c-torture/execute/GCC-C-execute-va-arg-trap-1.test (1828 of 2039)
********** TEST 'test-suite :: SingleSource/Regression/C/gcc-c-torture/execute/GCC-C-execute-va-arg-trap-1.test' RESULTS **********
compile_time: 0.0000 
exec_time: 0.0006 
hash: "18bd856c7a172c74eaa925d8d857250a" 
link_time: 0.0092 
**********
PASS: test-suite :: SingleSource/Regression/C/gcc-c-torture/execute/GCC-C-execute-vfprintf-1.test (1829 of 2039)
********** TEST 'test-suite :: SingleSource/Regression/C/gcc-c-torture/execute/GCC-C-execute-vfprintf-1.test' RESULTS **********
compile_time: 0.0000 
exec_time: 0.0008 
hash: "9bd39316f1446a35630efd453c8a9cd0" 
link_time: 0.0099 
**********
PASS: test-suite :: SingleSource/Regression/C/gcc-c-torture/execute/GCC-C-execute-vla-dealloc-1.test (1830 of 2039)
********** TEST 'test-suite :: SingleSource/Regression/C/gcc-c-torture/execute/GCC-C-execute-vla-dealloc-1.test' RESULTS **********
compile_time: 0.0000 
exec_time: 0.0072 
hash: "37ef86b6e3577bf57357b15a2038ad43" 
link_time: 0.0106 
**********
PASS: test-suite :: SingleSource/Regression/C/gcc-c-torture/execute/GCC-C-execute-vprintf-1.test (1831 of 2039)
********** TEST 'test-suite :: SingleSource/Regression/C/gcc-c-torture/execute/GCC-C-execute-vprintf-1.test' RESULTS **********
compile_time: 0.0000 
exec_time: 0.0006 
hash: "27dd7d1622d00d46f0e7b29cd1f86916" 
link_time: 0.0109 
**********
PASS: test-suite :: SingleSource/Regression/C/gcc-c-torture/execute/GCC-C-execute-vrp-1.test (1832 of 2039)
********** TEST 'test-suite :: SingleSource/Regression/C/gcc-c-torture/execute/GCC-C-execute-vrp-1.test' RESULTS **********
compile_time: 0.0000 
exec_time: 0.0006 
hash: "55c32fce0c6c13d2077d25ec09fa66ae" 
link_time: 0.0096 
**********
PASS: test-suite :: SingleSource/Regression/C/gcc-c-torture/execute/GCC-C-execute-vrp-2.test (1833 of 2039)
********** TEST 'test-suite :: SingleSource/Regression/C/gcc-c-torture/execute/GCC-C-execute-vrp-2.test' RESULTS **********
compile_time: 0.0000 
exec_time: 0.0006 
hash: "d167c468b2a827a2568bc97bbd8bb549" 
link_time: 0.0096 
**********
PASS: test-suite :: SingleSource/Regression/C/gcc-c-torture/execute/GCC-C-execute-vrp-3.test (1834 of 2039)
********** TEST 'test-suite :: SingleSource/Regression/C/gcc-c-torture/execute/GCC-C-execute-vrp-3.test' RESULTS **********
compile_time: 0.0000 
exec_time: 0.0007 
hash: "c640783af8caffb353efcb38cbec85d2" 
link_time: 0.0082 
**********
PASS: test-suite :: SingleSource/Regression/C/gcc-c-torture/execute/GCC-C-execute-vrp-4.test (1835 of 2039)
********** TEST 'test-suite :: SingleSource/Regression/C/gcc-c-torture/execute/GCC-C-execute-vrp-4.test' RESULTS **********
compile_time: 0.0000 
exec_time: 0.0006 
hash: "bb45953dd352acd3b5ef74fa053da49b" 
link_time: 0.0108 
**********
PASS: test-suite :: SingleSource/Regression/C/gcc-c-torture/execute/GCC-C-execute-vrp-5.test (1836 of 2039)
********** TEST 'test-suite :: SingleSource/Regression/C/gcc-c-torture/execute/GCC-C-execute-vrp-5.test' RESULTS **********
compile_time: 0.0000 
exec_time: 0.0006 
hash: "ee4bd01150ea5bbad5f2488cf0dd5c70" 
link_time: 0.0103 
**********
PASS: test-suite :: SingleSource/Regression/C/gcc-c-torture/execute/GCC-C-execute-vrp-6.test (1837 of 2039)
********** TEST 'test-suite :: SingleSource/Regression/C/gcc-c-torture/execute/GCC-C-execute-vrp-6.test' RESULTS **********
compile_time: 0.0000 
exec_time: 0.0007 
hash: "90e2796e73d991fe7b745f4961a12073" 
link_time: 0.0091 
**********
PASS: test-suite :: SingleSource/Regression/C/gcc-c-torture/execute/GCC-C-execute-vrp-7.test (1838 of 2039)
********** TEST 'test-suite :: SingleSource/Regression/C/gcc-c-torture/execute/GCC-C-execute-vrp-7.test' RESULTS **********
compile_time: 0.0000 
exec_time: 0.0008 
hash: "a8456be9f915d65f45d5a7bfef409fe5" 
link_time: 0.0098 
**********
NOEXE: test-suite :: SingleSource/Regression/C/gcc-c-torture/execute/GCC-C-execute-wchar_t-1.test (1839 of 2039)
******************** TEST 'test-suite :: SingleSource/Regression/C/gcc-c-torture/execute/GCC-C-execute-wchar_t-1.test' FAILED ********************
Executable '/Users/buildslave/jenkins/workspace/Testsuite-Tester@4/sandbox/build/SingleSource/Regression/C/gcc-c-torture/execute/GCC-C-execute-wchar_t-1' is missing
********************
PASS: test-suite :: SingleSource/Regression/C/gcc-c-torture/execute/GCC-C-execute-widechar-1.test (1840 of 2039)
********** TEST 'test-suite :: SingleSource/Regression/C/gcc-c-torture/execute/GCC-C-execute-widechar-1.test' RESULTS **********
compile_time: 0.0000 
exec_time: 0.0007 
hash: "f840e35da9aed45405dc06babe4b5b73" 
link_time: 0.0083 
**********
PASS: test-suite :: SingleSource/Regression/C/gcc-c-torture/execute/GCC-C-execute-widechar-2.test (1841 of 2039)
********** TEST 'test-suite :: SingleSource/Regression/C/gcc-c-torture/execute/GCC-C-execute-widechar-2.test' RESULTS **********
compile_time: 0.0000 
exec_time: 0.0007 
hash: "b55caba2ddef825196a4cb60bbc46205" 
link_time: 0.0090 
**********
PASS: test-suite :: SingleSource/Regression/C/gcc-c-torture/execute/GCC-C-execute-widechar-3.test (1842 of 2039)
********** TEST 'test-suite :: SingleSource/Regression/C/gcc-c-torture/execute/GCC-C-execute-widechar-3.test' RESULTS **********
compile_time: 0.0000 
exec_time: 0.0006 
hash: "a979de94a663d3c823d9e481c3ba5885" 
link_time: 0.0106 
**********
PASS: test-suite :: SingleSource/Regression/C/gcc-c-torture/execute/GCC-C-execute-zero-struct-1.test (1843 of 2039)
********** TEST 'test-suite :: SingleSource/Regression/C/gcc-c-torture/execute/GCC-C-execute-zero-struct-1.test' RESULTS **********
compile_time: 0.0000 
exec_time: 0.0007 
hash: "d1efea05a02541c7fda34fd4f1bde8fc" 
link_time: 0.0095 
**********
PASS: test-suite :: SingleSource/Regression/C/gcc-c-torture/execute/GCC-C-execute-zero-struct-2.test (1844 of 2039)
********** TEST 'test-suite :: SingleSource/Regression/C/gcc-c-torture/execute/GCC-C-execute-zero-struct-2.test' RESULTS **********
compile_time: 0.0000 
exec_time: 0.0007 
hash: "95349c6f8d059cb469082fa233a7ae01" 
link_time: 0.0096 
**********
PASS: test-suite :: SingleSource/Regression/C/gcc-c-torture/execute/GCC-C-execute-zerolen-1.test (1845 of 2039)
********** TEST 'test-suite :: SingleSource/Regression/C/gcc-c-torture/execute/GCC-C-execute-zerolen-1.test' RESULTS **********
compile_time: 0.0000 
exec_time: 0.0006 
hash: "ee860507e0b3f088f995c79531708829" 
link_time: 0.0107 
**********
PASS: test-suite :: SingleSource/Regression/C/gcc-c-torture/execute/GCC-C-execute-zerolen-2.test (1846 of 2039)
********** TEST 'test-suite :: SingleSource/Regression/C/gcc-c-torture/execute/GCC-C-execute-zerolen-2.test' RESULTS **********
compile_time: 0.0000 
exec_time: 0.0006 
hash: "6f38ead69d3f1cb7d03f52c796a38cc2" 
link_time: 0.0101 
**********
PASS: test-suite :: SingleSource/Regression/C/gcc-c-torture/execute/ieee/GCC-C-execute-ieee-20000320-1.test (1847 of 2039)
********** TEST 'test-suite :: SingleSource/Regression/C/gcc-c-torture/execute/ieee/GCC-C-execute-ieee-20000320-1.test' RESULTS **********
compile_time: 0.0000 
exec_time: 0.0007 
hash: "850a182b1b4ddee65e8285b6eb7d798e" 
link_time: 0.0077 
**********
PASS: test-suite :: SingleSource/Regression/C/gcc-c-torture/execute/ieee/GCC-C-execute-ieee-20001122-1.test (1848 of 2039)
********** TEST 'test-suite :: SingleSource/Regression/C/gcc-c-torture/execute/ieee/GCC-C-execute-ieee-20001122-1.test' RESULTS **********
compile_time: 0.0000 
exec_time: 0.0008 
hash: "cf0d92b7a77fd8f5a056191cdf589c46" 
link_time: 0.0106 
**********
PASS: test-suite :: SingleSource/Regression/C/gcc-c-torture/execute/ieee/GCC-C-execute-ieee-20010114-2.test (1849 of 2039)
********** TEST 'test-suite :: SingleSource/Regression/C/gcc-c-torture/execute/ieee/GCC-C-execute-ieee-20010114-2.test' RESULTS **********
compile_time: 0.0000 
exec_time: 0.0006 
hash: "4fce151177a364095d0c2a419c1318c0" 
link_time: 0.0112 
**********
PASS: test-suite :: SingleSource/Regression/C/gcc-c-torture/execute/ieee/GCC-C-execute-ieee-20010226-1.test (1850 of 2039)
********** TEST 'test-suite :: SingleSource/Regression/C/gcc-c-torture/execute/ieee/GCC-C-execute-ieee-20010226-1.test' RESULTS **********
compile_time: 0.0000 
exec_time: 0.0006 
hash: "0c8ac964f1ba1b5117b87242b50564f6" 
link_time: 0.0095 
**********
PASS: test-suite :: SingleSource/Regression/C/gcc-c-torture/execute/ieee/GCC-C-execute-ieee-20011123-1.test (1851 of 2039)
********** TEST 'test-suite :: SingleSource/Regression/C/gcc-c-torture/execute/ieee/GCC-C-execute-ieee-20011123-1.test' RESULTS **********
compile_time: 0.0000 
exec_time: 0.0007 
hash: "e9bd4cdaa8c37e01efe9de8693bdfd0b" 
link_time: 0.0110 
**********
PASS: test-suite :: SingleSource/Regression/C/gcc-c-torture/execute/ieee/GCC-C-execute-ieee-20030331-1.test (1852 of 2039)
********** TEST 'test-suite :: SingleSource/Regression/C/gcc-c-torture/execute/ieee/GCC-C-execute-ieee-20030331-1.test' RESULTS **********
compile_time: 0.0000 
exec_time: 0.0006 
hash: "edc680bfa658522a4d787746cb66d22b" 
link_time: 0.0108 
**********
PASS: test-suite :: SingleSource/Regression/C/gcc-c-torture/execute/ieee/GCC-C-execute-ieee-20041213-1.test (1853 of 2039)
********** TEST 'test-suite :: SingleSource/Regression/C/gcc-c-torture/execute/ieee/GCC-C-execute-ieee-20041213-1.test' RESULTS **********
compile_time: 0.0000 
exec_time: 0.0008 
hash: "9b850e04087aaf8c9bd9c600518903ae" 
link_time: 0.0103 
**********
PASS: test-suite :: SingleSource/Regression/C/gcc-c-torture/execute/ieee/GCC-C-execute-ieee-920518-1.test (1854 of 2039)
********** TEST 'test-suite :: SingleSource/Regression/C/gcc-c-torture/execute/ieee/GCC-C-execute-ieee-920518-1.test' RESULTS **********
compile_time: 0.0000 
exec_time: 0.0006 
hash: "2da4417ae58151ff6a3298f145896f8d" 
link_time: 0.0105 
**********
PASS: test-suite :: SingleSource/Regression/C/gcc-c-torture/execute/ieee/GCC-C-execute-ieee-920810-1.test (1855 of 2039)
********** TEST 'test-suite :: SingleSource/Regression/C/gcc-c-torture/execute/ieee/GCC-C-execute-ieee-920810-1.test' RESULTS **********
compile_time: 0.0000 
exec_time: 0.0007 
hash: "45b838ee3857df5408bbb70fccdec0f4" 
link_time: 0.0105 
**********
PASS: test-suite :: SingleSource/Regression/C/gcc-c-torture/execute/ieee/GCC-C-execute-ieee-930529-1.test (1856 of 2039)
********** TEST 'test-suite :: SingleSource/Regression/C/gcc-c-torture/execute/ieee/GCC-C-execute-ieee-930529-1.test' RESULTS **********
compile_time: 0.0000 
exec_time: 0.0006 
hash: "a5fc6efcdc4b40e6309e26568bb3001d" 
link_time: 0.0105 
**********
PASS: test-suite :: SingleSource/Regression/C/gcc-c-torture/execute/ieee/GCC-C-execute-ieee-980619-1.test (1857 of 2039)
********** TEST 'test-suite :: SingleSource/Regression/C/gcc-c-torture/execute/ieee/GCC-C-execute-ieee-980619-1.test' RESULTS **********
compile_time: 0.0000 
exec_time: 0.0007 
hash: "7e4bf3d8b4bf7a6f03b49b4186da2217" 
link_time: 0.0100 
**********
PASS: test-suite :: SingleSource/Regression/C/gcc-c-torture/execute/ieee/GCC-C-execute-ieee-acc1.test (1858 of 2039)
********** TEST 'test-suite :: SingleSource/Regression/C/gcc-c-torture/execute/ieee/GCC-C-execute-ieee-acc1.test' RESULTS **********
compile_time: 0.0000 
exec_time: 0.0008 
hash: "6e4026ce333c99569e16d991c2a6f116" 
link_time: 0.0112 
**********
PASS: test-suite :: SingleSource/Regression/C/gcc-c-torture/execute/ieee/GCC-C-execute-ieee-acc2.test (1859 of 2039)
********** TEST 'test-suite :: SingleSource/Regression/C/gcc-c-torture/execute/ieee/GCC-C-execute-ieee-acc2.test' RESULTS **********
compile_time: 0.0000 
exec_time: 0.0007 
hash: "b02292b6a51be83347878a0d92704e83" 
link_time: 0.0091 
**********
NOEXE: test-suite :: SingleSource/Regression/C/gcc-c-torture/execute/ieee/GCC-C-execute-ieee-builtin-nan-1.test (1860 of 2039)
******************** TEST 'test-suite :: SingleSource/Regression/C/gcc-c-torture/execute/ieee/GCC-C-execute-ieee-builtin-nan-1.test' FAILED ********************
Executable '/Users/buildslave/jenkins/workspace/Testsuite-Tester@4/sandbox/build/SingleSource/Regression/C/gcc-c-torture/execute/ieee/GCC-C-execute-ieee-builtin-nan-1' is missing
********************
PASS: test-suite :: SingleSource/Regression/C/gcc-c-torture/execute/ieee/GCC-C-execute-ieee-compare-fp-1.test (1861 of 2039)
********** TEST 'test-suite :: SingleSource/Regression/C/gcc-c-torture/execute/ieee/GCC-C-execute-ieee-compare-fp-1.test' RESULTS **********
compile_time: 0.0000 
exec_time: 0.0007 
hash: "1fdd67d4196f57f00fca92e73d8a1e8c" 
link_time: 0.0103 
**********
PASS: test-suite :: SingleSource/Regression/C/gcc-c-torture/execute/ieee/GCC-C-execute-ieee-compare-fp-2.test (1862 of 2039)
********** TEST 'test-suite :: SingleSource/Regression/C/gcc-c-torture/execute/ieee/GCC-C-execute-ieee-compare-fp-2.test' RESULTS **********
compile_time: 0.0000 
exec_time: 0.0006 
hash: "5c8feb4931e43b2e114f1c28fce579bf" 
link_time: 0.0091 
**********
PASS: test-suite :: SingleSource/Regression/C/gcc-c-torture/execute/ieee/GCC-C-execute-ieee-compare-fp-3.test (1863 of 2039)
********** TEST 'test-suite :: SingleSource/Regression/C/gcc-c-torture/execute/ieee/GCC-C-execute-ieee-compare-fp-3.test' RESULTS **********
compile_time: 0.0000 
exec_time: 0.0006 
hash: "a63da7b4748848c389c2f242cd559931" 
link_time: 0.0105 
**********
PASS: test-suite :: SingleSource/Regression/C/gcc-c-torture/execute/ieee/GCC-C-execute-ieee-compare-fp-4.test (1864 of 2039)
********** TEST 'test-suite :: SingleSource/Regression/C/gcc-c-torture/execute/ieee/GCC-C-execute-ieee-compare-fp-4.test' RESULTS **********
compile_time: 0.0000 
exec_time: 0.0007 
hash: "96994e176f25d7a85cb1d12c89e32342" 
link_time: 0.0111 
**********
PASS: test-suite :: SingleSource/Regression/C/gcc-c-torture/execute/ieee/GCC-C-execute-ieee-copysign1.test (1865 of 2039)
********** TEST 'test-suite :: SingleSource/Regression/C/gcc-c-torture/execute/ieee/GCC-C-execute-ieee-copysign1.test' RESULTS **********
compile_time: 0.0000 
exec_time: 0.0007 
hash: "5c134e5c50970a5c38fb4156229682a8" 
link_time: 0.0108 
**********
PASS: test-suite :: SingleSource/Regression/C/gcc-c-torture/execute/ieee/GCC-C-execute-ieee-copysign2.test (1866 of 2039)
********** TEST 'test-suite :: SingleSource/Regression/C/gcc-c-torture/execute/ieee/GCC-C-execute-ieee-copysign2.test' RESULTS **********
compile_time: 0.0000 
exec_time: 0.0007 
hash: "f6aab89309ef802e392e17481066084d" 
link_time: 0.0104 
**********
PASS: test-suite :: SingleSource/Regression/C/gcc-c-torture/execute/ieee/GCC-C-execute-ieee-fp-cmp-1.test (1867 of 2039)
********** TEST 'test-suite :: SingleSource/Regression/C/gcc-c-torture/execute/ieee/GCC-C-execute-ieee-fp-cmp-1.test' RESULTS **********
compile_time: 0.0000 
exec_time: 0.0008 
hash: "a67ab598ac24aa9dc39def39da2df927" 
link_time: 0.0100 
**********
PASS: test-suite :: SingleSource/Regression/C/gcc-c-torture/execute/ieee/GCC-C-execute-ieee-fp-cmp-2.test (1868 of 2039)
********** TEST 'test-suite :: SingleSource/Regression/C/gcc-c-torture/execute/ieee/GCC-C-execute-ieee-fp-cmp-2.test' RESULTS **********
compile_time: 0.0000 
exec_time: 0.0007 
hash: "d69a44a0e46606523e30b8e5636e20d7" 
link_time: 0.0084 
**********
PASS: test-suite :: SingleSource/Regression/C/gcc-c-torture/execute/ieee/GCC-C-execute-ieee-fp-cmp-3.test (1869 of 2039)
********** TEST 'test-suite :: SingleSource/Regression/C/gcc-c-torture/execute/ieee/GCC-C-execute-ieee-fp-cmp-3.test' RESULTS **********
compile_time: 0.0000 
exec_time: 0.0006 
hash: "86bf12fa92d67f55fc837d3c036421e0" 
link_time: 0.0086 
**********
PASS: test-suite :: SingleSource/Regression/C/gcc-c-torture/execute/ieee/GCC-C-execute-ieee-fp-cmp-4.test (1870 of 2039)
********** TEST 'test-suite :: SingleSource/Regression/C/gcc-c-torture/execute/ieee/GCC-C-execute-ieee-fp-cmp-4.test' RESULTS **********
compile_time: 0.0000 
exec_time: 0.0007 
hash: "f34fe5bc760b52d894b66d6fe091b2d1" 
link_time: 0.0116 
**********
PASS: test-suite :: SingleSource/Regression/C/gcc-c-torture/execute/ieee/GCC-C-execute-ieee-fp-cmp-4e.test (1871 of 2039)
********** TEST 'test-suite :: SingleSource/Regression/C/gcc-c-torture/execute/ieee/GCC-C-execute-ieee-fp-cmp-4e.test' RESULTS **********
compile_time: 0.0000 
exec_time: 0.0008 
hash: "4705be37ddeae918513d9b130385a05a" 
link_time: 0.0107 
**********
PASS: test-suite :: SingleSource/Regression/C/gcc-c-torture/execute/ieee/GCC-C-execute-ieee-fp-cmp-4f.test (1872 of 2039)
********** TEST 'test-suite :: SingleSource/Regression/C/gcc-c-torture/execute/ieee/GCC-C-execute-ieee-fp-cmp-4f.test' RESULTS **********
compile_time: 0.0000 
exec_time: 0.0007 
hash: "3e435685db58bab4a4a55ac88e9a7f50" 
link_time: 0.0103 
**********
PASS: test-suite :: SingleSource/Regression/C/gcc-c-torture/execute/ieee/GCC-C-execute-ieee-fp-cmp-4l.test (1873 of 2039)
********** TEST 'test-suite :: SingleSource/Regression/C/gcc-c-torture/execute/ieee/GCC-C-execute-ieee-fp-cmp-4l.test' RESULTS **********
compile_time: 0.0000 
exec_time: 0.0007 
hash: "70af0ae43f3aa9490f3d7ab9a4d0f471" 
link_time: 0.0086 
**********
PASS: test-suite :: SingleSource/Regression/C/gcc-c-torture/execute/ieee/GCC-C-execute-ieee-fp-cmp-5.test (1874 of 2039)
********** TEST 'test-suite :: SingleSource/Regression/C/gcc-c-torture/execute/ieee/GCC-C-execute-ieee-fp-cmp-5.test' RESULTS **********
compile_time: 0.0000 
exec_time: 0.0006 
hash: "1e91263d8c411cb1f431fda564be2856" 
link_time: 0.0105 
**********
PASS: test-suite :: SingleSource/Regression/C/gcc-c-torture/execute/ieee/GCC-C-execute-ieee-fp-cmp-6.test (1875 of 2039)
********** TEST 'test-suite :: SingleSource/Regression/C/gcc-c-torture/execute/ieee/GCC-C-execute-ieee-fp-cmp-6.test' RESULTS **********
compile_time: 0.0000 
exec_time: 0.0007 
hash: "fe5510944b47bb305892ea843f24e796" 
link_time: 0.0096 
**********
PASS: test-suite :: SingleSource/Regression/C/gcc-c-torture/execute/ieee/GCC-C-execute-ieee-fp-cmp-8.test (1876 of 2039)
********** TEST 'test-suite :: SingleSource/Regression/C/gcc-c-torture/execute/ieee/GCC-C-execute-ieee-fp-cmp-8.test' RESULTS **********
compile_time: 0.0000 
exec_time: 0.0006 
hash: "6f4ad25a807db4d351c241db3e595360" 
link_time: 0.0083 
**********
PASS: test-suite :: SingleSource/Regression/C/gcc-c-torture/execute/ieee/GCC-C-execute-ieee-fp-cmp-8e.test (1877 of 2039)
********** TEST 'test-suite :: SingleSource/Regression/C/gcc-c-torture/execute/ieee/GCC-C-execute-ieee-fp-cmp-8e.test' RESULTS **********
compile_time: 0.0000 
exec_time: 0.0007 
hash: "6ca78c956439b49c909625e7da64edb0" 
link_time: 0.0106 
**********
PASS: test-suite :: SingleSource/Regression/C/gcc-c-torture/execute/ieee/GCC-C-execute-ieee-fp-cmp-8f.test (1878 of 2039)
********** TEST 'test-suite :: SingleSource/Regression/C/gcc-c-torture/execute/ieee/GCC-C-execute-ieee-fp-cmp-8f.test' RESULTS **********
compile_time: 0.0000 
exec_time: 0.0006 
hash: "2c330c164b4064f545c1d44442b8dbc7" 
link_time: 0.0098 
**********
PASS: test-suite :: SingleSource/Regression/C/gcc-c-torture/execute/ieee/GCC-C-execute-ieee-fp-cmp-8l.test (1879 of 2039)
********** TEST 'test-suite :: SingleSource/Regression/C/gcc-c-torture/execute/ieee/GCC-C-execute-ieee-fp-cmp-8l.test' RESULTS **********
compile_time: 0.0000 
exec_time: 0.0008 
hash: "536e315a546978108124b419f0cfcd56" 
link_time: 0.0075 
**********
PASS: test-suite :: SingleSource/Regression/C/gcc-c-torture/execute/ieee/GCC-C-execute-ieee-hugeval.test (1880 of 2039)
********** TEST 'test-suite :: SingleSource/Regression/C/gcc-c-torture/execute/ieee/GCC-C-execute-ieee-hugeval.test' RESULTS **********
compile_time: 0.0000 
exec_time: 0.0006 
hash: "b893e0e345e4bff52c06c6e4cfb57e75" 
link_time: 0.0108 
**********
PASS: test-suite :: SingleSource/Regression/C/gcc-c-torture/execute/ieee/GCC-C-execute-ieee-inf-1.test (1881 of 2039)
********** TEST 'test-suite :: SingleSource/Regression/C/gcc-c-torture/execute/ieee/GCC-C-execute-ieee-inf-1.test' RESULTS **********
compile_time: 0.0000 
exec_time: 0.0006 
hash: "46b9e3acdf2045250e35cf0ada8c2667" 
link_time: 0.0109 
**********
PASS: test-suite :: SingleSource/Regression/C/gcc-c-torture/execute/ieee/GCC-C-execute-ieee-inf-2.test (1882 of 2039)
********** TEST 'test-suite :: SingleSource/Regression/C/gcc-c-torture/execute/ieee/GCC-C-execute-ieee-inf-2.test' RESULTS **********
compile_time: 0.0000 
exec_time: 0.0008 
hash: "c4aa79836905c6f3f399ca664269744b" 
link_time: 0.0110 
**********
PASS: test-suite :: SingleSource/Regression/C/gcc-c-torture/execute/ieee/GCC-C-execute-ieee-inf-3.test (1883 of 2039)
********** TEST 'test-suite :: SingleSource/Regression/C/gcc-c-torture/execute/ieee/GCC-C-execute-ieee-inf-3.test' RESULTS **********
compile_time: 0.0000 
exec_time: 0.0006 
hash: "801427292155ffdfaa5b59bb73b1e670" 
link_time: 0.0106 
**********
PASS: test-suite :: SingleSource/Regression/C/gcc-c-torture/execute/ieee/GCC-C-execute-ieee-minuszero.test (1884 of 2039)
********** TEST 'test-suite :: SingleSource/Regression/C/gcc-c-torture/execute/ieee/GCC-C-execute-ieee-minuszero.test' RESULTS **********
compile_time: 0.0000 
exec_time: 0.0007 
hash: "7d597c5e0dc8578c253ce9db061835db" 
link_time: 0.0107 
**********
PASS: test-suite :: SingleSource/Regression/C/gcc-c-torture/execute/ieee/GCC-C-execute-ieee-mul-subnormal-single-1.test (1885 of 2039)
********** TEST 'test-suite :: SingleSource/Regression/C/gcc-c-torture/execute/ieee/GCC-C-execute-ieee-mul-subnormal-single-1.test' RESULTS **********
compile_time: 0.0000 
exec_time: 0.0008 
hash: "6536ac558e48187be322b18c1b077167" 
link_time: 0.0100 
**********
PASS: test-suite :: SingleSource/Regression/C/gcc-c-torture/execute/ieee/GCC-C-execute-ieee-mzero2.test (1886 of 2039)
********** TEST 'test-suite :: SingleSource/Regression/C/gcc-c-torture/execute/ieee/GCC-C-execute-ieee-mzero2.test' RESULTS **********
compile_time: 0.0000 
exec_time: 0.0007 
hash: "36c5c94929e2299227c77a5a9743634d" 
link_time: 0.0095 
**********
PASS: test-suite :: SingleSource/Regression/C/gcc-c-torture/execute/ieee/GCC-C-execute-ieee-mzero3.test (1887 of 2039)
********** TEST 'test-suite :: SingleSource/Regression/C/gcc-c-torture/execute/ieee/GCC-C-execute-ieee-mzero3.test' RESULTS **********
compile_time: 0.0000 
exec_time: 0.0008 
hash: "1ebdf27e3e9a2630a7438905fac6a1a2" 
link_time: 0.0113 
**********
PASS: test-suite :: SingleSource/Regression/C/gcc-c-torture/execute/ieee/GCC-C-execute-ieee-mzero4.test (1888 of 2039)
********** TEST 'test-suite :: SingleSource/Regression/C/gcc-c-torture/execute/ieee/GCC-C-execute-ieee-mzero4.test' RESULTS **********
compile_time: 0.0000 
exec_time: 0.0006 
hash: "2ee40b9ee42a724b656e31a7f73cf7ef" 
link_time: 0.0113 
**********
PASS: test-suite :: SingleSource/Regression/C/gcc-c-torture/execute/ieee/GCC-C-execute-ieee-mzero5.test (1889 of 2039)
********** TEST 'test-suite :: SingleSource/Regression/C/gcc-c-torture/execute/ieee/GCC-C-execute-ieee-mzero5.test' RESULTS **********
compile_time: 0.0000 
exec_time: 0.0006 
hash: "962762ecbc5652c9a02b0fcac1b523ee" 
link_time: 0.0117 
**********
PASS: test-suite :: SingleSource/Regression/C/gcc-c-torture/execute/ieee/GCC-C-execute-ieee-mzero6.test (1890 of 2039)
********** TEST 'test-suite :: SingleSource/Regression/C/gcc-c-torture/execute/ieee/GCC-C-execute-ieee-mzero6.test' RESULTS **********
compile_time: 0.0000 
exec_time: 0.0006 
hash: "b4d4d3a2cbcb22e5d5e5c5656192eae3" 
link_time: 0.0110 
**********
PASS: test-suite :: SingleSource/Regression/C/gcc-c-torture/execute/ieee/GCC-C-execute-ieee-pr28634.test (1891 of 2039)
********** TEST 'test-suite :: SingleSource/Regression/C/gcc-c-torture/execute/ieee/GCC-C-execute-ieee-pr28634.test' RESULTS **********
compile_time: 0.0000 
exec_time: 0.0006 
hash: "2bce443b7e0b5e5a18ce22016c393fb6" 
link_time: 0.0089 
**********
PASS: test-suite :: SingleSource/Regression/C/gcc-c-torture/execute/ieee/GCC-C-execute-ieee-pr29302-1.test (1892 of 2039)
********** TEST 'test-suite :: SingleSource/Regression/C/gcc-c-torture/execute/ieee/GCC-C-execute-ieee-pr29302-1.test' RESULTS **********
compile_time: 0.0000 
exec_time: 0.0006 
hash: "5dc64732698fbccefca0d8e492df2165" 
link_time: 0.0110 
**********
PASS: test-suite :: SingleSource/Regression/C/gcc-c-torture/execute/ieee/GCC-C-execute-ieee-pr30704.test (1893 of 2039)
********** TEST 'test-suite :: SingleSource/Regression/C/gcc-c-torture/execute/ieee/GCC-C-execute-ieee-pr30704.test' RESULTS **********
compile_time: 0.0000 
exec_time: 0.0006 
hash: "901d236aed9d60f4e4057c0c1cef1bc8" 
link_time: 0.0093 
**********
PASS: test-suite :: SingleSource/Regression/C/gcc-c-torture/execute/ieee/GCC-C-execute-ieee-pr36332.test (1894 of 2039)
********** TEST 'test-suite :: SingleSource/Regression/C/gcc-c-torture/execute/ieee/GCC-C-execute-ieee-pr36332.test' RESULTS **********
compile_time: 0.0000 
exec_time: 0.0006 
hash: "2ba8763d252dc2afe07b15b7656449c4" 
link_time: 0.0110 
**********
PASS: test-suite :: SingleSource/Regression/C/gcc-c-torture/execute/ieee/GCC-C-execute-ieee-pr38016.test (1895 of 2039)
********** TEST 'test-suite :: SingleSource/Regression/C/gcc-c-torture/execute/ieee/GCC-C-execute-ieee-pr38016.test' RESULTS **********
compile_time: 0.0000 
exec_time: 0.0006 
hash: "214b72cf7fac881fef1a4d03479ed8a6" 
link_time: 0.0074 
**********
PASS: test-suite :: SingleSource/Regression/C/gcc-c-torture/execute/ieee/GCC-C-execute-ieee-pr50310.test (1896 of 2039)
********** TEST 'test-suite :: SingleSource/Regression/C/gcc-c-torture/execute/ieee/GCC-C-execute-ieee-pr50310.test' RESULTS **********
compile_time: 0.0000 
exec_time: 0.0006 
hash: "399a4ea34730cb3a48f32bc413cfb63c" 
link_time: 0.0104 
**********
PASS: test-suite :: SingleSource/Regression/C/gcc-c-torture/execute/ieee/GCC-C-execute-ieee-pr67218.test (1897 of 2039)
********** TEST 'test-suite :: SingleSource/Regression/C/gcc-c-torture/execute/ieee/GCC-C-execute-ieee-pr67218.test' RESULTS **********
compile_time: 0.0000 
exec_time: 0.0007 
hash: "036dd83c8cb07c89e06612cde5381d34" 
link_time: 0.0081 
**********
PASS: test-suite :: SingleSource/Regression/C/gcc-c-torture/execute/ieee/GCC-C-execute-ieee-pr72824-2.test (1898 of 2039)
********** TEST 'test-suite :: SingleSource/Regression/C/gcc-c-torture/execute/ieee/GCC-C-execute-ieee-pr72824-2.test' RESULTS **********
compile_time: 0.0000 
exec_time: 0.0006 
hash: "e7f4d7c4a1e4cb832f073413b8ef6c04" 
link_time: 0.0111 
**********
PASS: test-suite :: SingleSource/Regression/C/gcc-c-torture/execute/ieee/GCC-C-execute-ieee-pr72824.test (1899 of 2039)
********** TEST 'test-suite :: SingleSource/Regression/C/gcc-c-torture/execute/ieee/GCC-C-execute-ieee-pr72824.test' RESULTS **********
compile_time: 0.0000 
exec_time: 0.0007 
hash: "577c1f8268aa5e5a172fb0bb31dc58c8" 
link_time: 0.0108 
**********
PASS: test-suite :: SingleSource/Regression/C/gcc-c-torture/execute/ieee/GCC-C-execute-ieee-pr84235.test (1900 of 2039)
********** TEST 'test-suite :: SingleSource/Regression/C/gcc-c-torture/execute/ieee/GCC-C-execute-ieee-pr84235.test' RESULTS **********
compile_time: 0.0000 
exec_time: 0.0007 
hash: "fef6767a318ca4e4c6e2bb5fa8fda6a3" 
link_time: 0.0095 
**********
PASS: test-suite :: SingleSource/Regression/C/gcc-c-torture/execute/ieee/GCC-C-execute-ieee-rbug.test (1901 of 2039)
********** TEST 'test-suite :: SingleSource/Regression/C/gcc-c-torture/execute/ieee/GCC-C-execute-ieee-rbug.test' RESULTS **********
compile_time: 0.0000 
exec_time: 0.0007 
hash: "48e7a956a4f3115694ca2570fec053d7" 
link_time: 0.0112 
**********
PASS: test-suite :: SingleSource/Regression/C/gcc-c-torture/execute/ieee/GCC-C-execute-ieee-unsafe-fp-assoc-1.test (1902 of 2039)
********** TEST 'test-suite :: SingleSource/Regression/C/gcc-c-torture/execute/ieee/GCC-C-execute-ieee-unsafe-fp-assoc-1.test' RESULTS **********
compile_time: 0.0000 
exec_time: 0.0006 
hash: "890329d999fa1bbb0fee26086c85f3c1" 
link_time: 0.0111 
**********
PASS: test-suite :: SingleSource/Regression/C/gcc-c-torture/execute/ieee/GCC-C-execute-ieee-unsafe-fp-assoc.test (1903 of 2039)
********** TEST 'test-suite :: SingleSource/Regression/C/gcc-c-torture/execute/ieee/GCC-C-execute-ieee-unsafe-fp-assoc.test' RESULTS **********
compile_time: 0.0000 
exec_time: 0.0007 
hash: "5750877edf3262688c33962cc75305e3" 
link_time: 0.0109 
**********
PASS: test-suite :: SingleSource/UnitTests/2002-04-17-PrintfChar.test (1904 of 2039)
********** TEST 'test-suite :: SingleSource/UnitTests/2002-04-17-PrintfChar.test' RESULTS **********
compile_time: 0.0067 
exec_time: 0.0006 
hash: "14f274648e83e3a79ee7a48f0c4903f0" 
link_time: 0.0121 
**********
PASS: test-suite :: SingleSource/UnitTests/2002-05-02-ArgumentTest.test (1905 of 2039)
********** TEST 'test-suite :: SingleSource/UnitTests/2002-05-02-ArgumentTest.test' RESULTS **********
compile_time: 0.0074 
exec_time: 0.0008 
hash: "1fc58edf7347ca06e9fd68123626aaaa" 
link_time: 0.0114 
**********
PASS: test-suite :: SingleSource/UnitTests/2002-05-02-CastTest.test (1906 of 2039)
********** TEST 'test-suite :: SingleSource/UnitTests/2002-05-02-CastTest.test' RESULTS **********
compile_time: 0.0196 
exec_time: 0.0007 
hash: "bb154450c217bf278a7df988977f539e" 
link_time: 0.0122 
**********
PASS: test-suite :: SingleSource/UnitTests/2002-05-02-CastTest1.test (1907 of 2039)
********** TEST 'test-suite :: SingleSource/UnitTests/2002-05-02-CastTest1.test' RESULTS **********
compile_time: 0.0059 
exec_time: 0.0007 
hash: "890499fd4cdb17a5061778631b8594ad" 
link_time: 0.0098 
**********
PASS: test-suite :: SingleSource/UnitTests/2002-05-02-CastTest2.test (1908 of 2039)
********** TEST 'test-suite :: SingleSource/UnitTests/2002-05-02-CastTest2.test' RESULTS **********
compile_time: 0.0162 
exec_time: 0.0007 
hash: "e785976326a94275f45ebc20ed2e825b" 
link_time: 0.0115 
**********
PASS: test-suite :: SingleSource/UnitTests/2002-05-02-CastTest3.test (1909 of 2039)
********** TEST 'test-suite :: SingleSource/UnitTests/2002-05-02-CastTest3.test' RESULTS **********
compile_time: 0.0069 
exec_time: 0.0007 
hash: "191faca33ea04dd1d5ff78023db14af5" 
link_time: 0.0120 
**********
PASS: test-suite :: SingleSource/UnitTests/2002-05-02-ManyArguments.test (1910 of 2039)
********** TEST 'test-suite :: SingleSource/UnitTests/2002-05-02-ManyArguments.test' RESULTS **********
compile_time: 0.0105 
exec_time: 0.0007 
hash: "4a5da9287f3fe91f96e5caa3a852bada" 
link_time: 0.0103 
**********
PASS: test-suite :: SingleSource/UnitTests/2002-05-03-NotTest.test (1911 of 2039)
********** TEST 'test-suite :: SingleSource/UnitTests/2002-05-03-NotTest.test' RESULTS **********
compile_time: 0.0134 
exec_time: 0.0006 
hash: "5364c9ebe9c8ae1e159b1fdfc4716390" 
link_time: 0.0097 
**********
PASS: test-suite :: SingleSource/UnitTests/2002-05-19-DivTest.test (1912 of 2039)
********** TEST 'test-suite :: SingleSource/UnitTests/2002-05-19-DivTest.test' RESULTS **********
compile_time: 0.0123 
exec_time: 0.0006 
hash: "5e2ebb88f1cb0a80884feadcd8e715ca" 
link_time: 0.0128 
**********
PASS: test-suite :: SingleSource/UnitTests/2002-08-02-CastTest.test (1913 of 2039)
********** TEST 'test-suite :: SingleSource/UnitTests/2002-08-02-CastTest.test' RESULTS **********
compile_time: 0.0125 
exec_time: 0.0006 
hash: "2151ebd1b0b8525ed2d7d62a5a1501b6" 
link_time: 0.0121 
**********
PASS: test-suite :: SingleSource/UnitTests/2002-08-02-CastTest2.test (1914 of 2039)
********** TEST 'test-suite :: SingleSource/UnitTests/2002-08-02-CastTest2.test' RESULTS **********
compile_time: 0.0075 
exec_time: 0.0008 
hash: "4c0fe34b6bb4dc8fe50641c52471fef2" 
link_time: 0.0112 
**********
PASS: test-suite :: SingleSource/UnitTests/2002-08-19-CodegenBug.test (1915 of 2039)
********** TEST 'test-suite :: SingleSource/UnitTests/2002-08-19-CodegenBug.test' RESULTS **********
compile_time: 0.0150 
exec_time: 0.0006 
hash: "e4e9ff9cd5c98b86b967efaa7bb337de" 
link_time: 0.0095 
**********
PASS: test-suite :: SingleSource/UnitTests/2002-10-09-ArrayResolution.test (1916 of 2039)
********** TEST 'test-suite :: SingleSource/UnitTests/2002-10-09-ArrayResolution.test' RESULTS **********
compile_time: 0.0120 
exec_time: 0.0006 
hash: "b769c64151fda0cd85ad716e0f2eacd6" 
link_time: 0.0117 
**********
PASS: test-suite :: SingleSource/UnitTests/2002-10-12-StructureArgs.test (1917 of 2039)
********** TEST 'test-suite :: SingleSource/UnitTests/2002-10-12-StructureArgs.test' RESULTS **********
compile_time: 0.0129 
exec_time: 0.0007 
hash: "a32ffc80b39d401042b7c3c8cdafcd56" 
link_time: 0.0109 
**********
PASS: test-suite :: SingleSource/UnitTests/2002-10-12-StructureArgsSimple.test (1918 of 2039)
********** TEST 'test-suite :: SingleSource/UnitTests/2002-10-12-StructureArgsSimple.test' RESULTS **********
compile_time: 0.0125 
exec_time: 0.0008 
hash: "b2c97449aa68aa28239d5cf4b43977af" 
link_time: 0.0102 
**********
PASS: test-suite :: SingleSource/UnitTests/2002-10-13-BadLoad.test (1919 of 2039)
********** TEST 'test-suite :: SingleSource/UnitTests/2002-10-13-BadLoad.test' RESULTS **********
compile_time: 0.0072 
exec_time: 0.0008 
hash: "0d5817155324013a790b3879db83aa47" 
link_time: 0.0117 
**********
PASS: test-suite :: SingleSource/UnitTests/2002-12-13-MishaTest.test (1920 of 2039)
********** TEST 'test-suite :: SingleSource/UnitTests/2002-12-13-MishaTest.test' RESULTS **********
compile_time: 0.0128 
exec_time: 0.0008 
hash: "2caf50dd4bab7b866dbf4bda96183b8e" 
link_time: 0.0111 
**********
PASS: test-suite :: SingleSource/UnitTests/2003-04-22-Switch.test (1921 of 2039)
********** TEST 'test-suite :: SingleSource/UnitTests/2003-04-22-Switch.test' RESULTS **********
compile_time: 0.0128 
exec_time: 0.0007 
hash: "644ad14850381904f4f974edfd1e533b" 
link_time: 0.0103 
**********
PASS: test-suite :: SingleSource/UnitTests/2003-05-02-DependentPHI.test (1922 of 2039)
********** TEST 'test-suite :: SingleSource/UnitTests/2003-05-02-DependentPHI.test' RESULTS **********
compile_time: 0.0123 
exec_time: 0.0008 
hash: "b6b0bbe72df051fe4ec62f0a43024304" 
link_time: 0.0115 
**********
PASS: test-suite :: SingleSource/UnitTests/2003-05-07-VarArgs.test (1923 of 2039)
********** TEST 'test-suite :: SingleSource/UnitTests/2003-05-07-VarArgs.test' RESULTS **********
compile_time: 0.0155 
exec_time: 0.0006 
hash: "3317925712433b6aca58c55d69e599a6" 
link_time: 0.0115 
**********
PASS: test-suite :: SingleSource/UnitTests/2003-05-12-MinIntProblem.test (1924 of 2039)
********** TEST 'test-suite :: SingleSource/UnitTests/2003-05-12-MinIntProblem.test' RESULTS **********
compile_time: 0.0124 
exec_time: 0.0007 
hash: "a50aa436337c072b5391599d9156a7ec" 
link_time: 0.0120 
**********
PASS: test-suite :: SingleSource/UnitTests/2003-05-14-AtExit.test (1925 of 2039)
********** TEST 'test-suite :: SingleSource/UnitTests/2003-05-14-AtExit.test' RESULTS **********
compile_time: 0.0160 
exec_time: 0.0007 
hash: "ab2a2be4e0fbc5f90e4b91dd7ae55dfd" 
link_time: 0.0121 
**********
PASS: test-suite :: SingleSource/UnitTests/2003-05-26-Shorts.test (1926 of 2039)
********** TEST 'test-suite :: SingleSource/UnitTests/2003-05-26-Shorts.test' RESULTS **********
compile_time: 0.0132 
exec_time: 0.0007 
hash: "75c342f461ef6c4e3466f21d7b2a86e5" 
link_time: 0.0123 
**********
PASS: test-suite :: SingleSource/UnitTests/2003-05-31-CastToBool.test (1927 of 2039)
********** TEST 'test-suite :: SingleSource/UnitTests/2003-05-31-CastToBool.test' RESULTS **********
compile_time: 0.0115 
exec_time: 0.0007 
hash: "670ba4f28946889947d912f8940326b3" 
link_time: 0.0119 
**********
PASS: test-suite :: SingleSource/UnitTests/2003-05-31-LongShifts.test (1928 of 2039)
********** TEST 'test-suite :: SingleSource/UnitTests/2003-05-31-LongShifts.test' RESULTS **********
compile_time: 0.0079 
exec_time: 0.0008 
hash: "afc6bd306c0f47748e9cc826b8c65799" 
link_time: 0.0113 
**********
PASS: test-suite :: SingleSource/UnitTests/2003-07-06-IntOverflow.test (1929 of 2039)
********** TEST 'test-suite :: SingleSource/UnitTests/2003-07-06-IntOverflow.test' RESULTS **********
compile_time: 0.0120 
exec_time: 0.0006 
hash: "6757dd9b6073dcb69a057e582d6e0c72" 
link_time: 0.0105 
**********
PASS: test-suite :: SingleSource/UnitTests/2003-07-08-BitOpsTest.test (1930 of 2039)
********** TEST 'test-suite :: SingleSource/UnitTests/2003-07-08-BitOpsTest.test' RESULTS **********
compile_time: 0.0128 
exec_time: 0.0008 
hash: "b689c78e2b14138a725c1091e9803197" 
link_time: 0.0117 
**********
PASS: test-suite :: SingleSource/UnitTests/2003-07-09-LoadShorts.test (1931 of 2039)
********** TEST 'test-suite :: SingleSource/UnitTests/2003-07-09-LoadShorts.test' RESULTS **********
compile_time: 0.0164 
exec_time: 0.0008 
hash: "17e91c1c1a690d143b832dc8271a291b" 
link_time: 0.0106 
**********
PASS: test-suite :: SingleSource/UnitTests/2003-07-09-SignedArgs.test (1932 of 2039)
********** TEST 'test-suite :: SingleSource/UnitTests/2003-07-09-SignedArgs.test' RESULTS **********
compile_time: 0.0171 
exec_time: 0.0007 
hash: "53f8fbd49d679088d14d24c45ef0361d" 
link_time: 0.0130 
**********
PASS: test-suite :: SingleSource/UnitTests/2003-07-10-SignConversions.test (1933 of 2039)
********** TEST 'test-suite :: SingleSource/UnitTests/2003-07-10-SignConversions.test' RESULTS **********
compile_time: 0.0134 
exec_time: 0.0006 
hash: "e77f1f4e85f55d3ddd30250732bddba0" 
link_time: 0.0110 
**********
PASS: test-suite :: SingleSource/UnitTests/2003-08-05-CastFPToUint.test (1934 of 2039)
********** TEST 'test-suite :: SingleSource/UnitTests/2003-08-05-CastFPToUint.test' RESULTS **********
compile_time: 0.0166 
exec_time: 0.0008 
hash: "881540cd5826d5782e95bdd2fdb32a3c" 
link_time: 0.0124 
**********
PASS: test-suite :: SingleSource/UnitTests/2003-08-11-VaListArg.test (1935 of 2039)
********** TEST 'test-suite :: SingleSource/UnitTests/2003-08-11-VaListArg.test' RESULTS **********
compile_time: 0.0180 
exec_time: 0.0008 
hash: "787f14be76d4b74b7ea31f8bcc12d1e9" 
link_time: 0.0117 
**********
PASS: test-suite :: SingleSource/UnitTests/2003-08-20-FoldBug.test (1936 of 2039)
********** TEST 'test-suite :: SingleSource/UnitTests/2003-08-20-FoldBug.test' RESULTS **********
compile_time: 0.0125 
exec_time: 0.0007 
hash: "2052fe150e38f2287b375f2d931393ba" 
link_time: 0.0128 
**********
PASS: test-suite :: SingleSource/UnitTests/2003-09-18-BitFieldTest.test (1937 of 2039)
********** TEST 'test-suite :: SingleSource/UnitTests/2003-09-18-BitFieldTest.test' RESULTS **********
compile_time: 0.0121 
exec_time: 0.0007 
hash: "c66cd48cad65930a1169fe0c1ed1b8fb" 
link_time: 0.0120 
**********
PASS: test-suite :: SingleSource/UnitTests/2003-10-13-SwitchTest.test (1938 of 2039)
********** TEST 'test-suite :: SingleSource/UnitTests/2003-10-13-SwitchTest.test' RESULTS **********
compile_time: 0.0111 
exec_time: 0.0007 
hash: "080d0b0932ea1c921b2cb1e669bb82e2" 
link_time: 0.0129 
**********
PASS: test-suite :: SingleSource/UnitTests/2003-10-29-ScalarReplBug.test (1939 of 2039)
********** TEST 'test-suite :: SingleSource/UnitTests/2003-10-29-ScalarReplBug.test' RESULTS **********
compile_time: 0.0130 
exec_time: 0.0008 
hash: "9b22d64c8a393ddae0b04a98e340ba58" 
link_time: 0.0124 
**********
PASS: test-suite :: SingleSource/UnitTests/2004-02-02-NegativeZero.test (1940 of 2039)
********** TEST 'test-suite :: SingleSource/UnitTests/2004-02-02-NegativeZero.test' RESULTS **********
compile_time: 0.0075 
exec_time: 0.0007 
hash: "5440ae8c52a1f094f37427aaade48c8a" 
link_time: 0.0123 
**********
PASS: test-suite :: SingleSource/UnitTests/2004-06-20-StaticBitfieldInit.test (1941 of 2039)
********** TEST 'test-suite :: SingleSource/UnitTests/2004-06-20-StaticBitfieldInit.test' RESULTS **********
compile_time: 0.0115 
exec_time: 0.0007 
hash: "4670a0fe95b5982b0813143a62553bee" 
link_time: 0.0115 
**********
PASS: test-suite :: SingleSource/UnitTests/2004-11-28-GlobalBoolLayout.test (1942 of 2039)
********** TEST 'test-suite :: SingleSource/UnitTests/2004-11-28-GlobalBoolLayout.test' RESULTS **********
compile_time: 0.0142 
exec_time: 0.0006 
hash: "e20ee8cfea407fc583f045dbc61a9814" 
link_time: 0.0103 
**********
PASS: test-suite :: SingleSource/UnitTests/2005-05-11-Popcount-ffs-fls.test (1943 of 2039)
********** TEST 'test-suite :: SingleSource/UnitTests/2005-05-11-Popcount-ffs-fls.test' RESULTS **********
compile_time: 0.0183 
exec_time: 0.0009 
hash: "00461281d09ec6cee60e1c3ac4bce1f5" 
link_time: 0.0120 
**********
PASS: test-suite :: SingleSource/UnitTests/2005-05-12-Int64ToFP.test (1944 of 2039)
********** TEST 'test-suite :: SingleSource/UnitTests/2005-05-12-Int64ToFP.test' RESULTS **********
compile_time: 0.0115 
exec_time: 0.0009 
hash: "53653fe0a90de4748ac9228b2bb833c1" 
link_time: 0.0117 
**********
PASS: test-suite :: SingleSource/UnitTests/2005-05-13-SDivTwo.test (1945 of 2039)
********** TEST 'test-suite :: SingleSource/UnitTests/2005-05-13-SDivTwo.test' RESULTS **********
compile_time: 0.0121 
exec_time: 0.0007 
hash: "bca613f0a64ccad5cceb83e17264f40d" 
link_time: 0.0123 
**********
PASS: test-suite :: SingleSource/UnitTests/2005-07-15-Bitfield-ABI.test (1946 of 2039)
********** TEST 'test-suite :: SingleSource/UnitTests/2005-07-15-Bitfield-ABI.test' RESULTS **********
compile_time: 0.0070 
exec_time: 0.0007 
hash: "13ba67f630af3820768db24e4db21291" 
link_time: 0.0118 
**********
PASS: test-suite :: SingleSource/UnitTests/2005-07-17-INT-To-FP.test (1947 of 2039)
********** TEST 'test-suite :: SingleSource/UnitTests/2005-07-17-INT-To-FP.test' RESULTS **********
compile_time: 0.0137 
exec_time: 0.0010 
hash: "00bacf0dd2d071066986ffcaddb0a2b4" 
link_time: 0.0111 
**********
PASS: test-suite :: SingleSource/UnitTests/2005-11-29-LongSwitch.test (1948 of 2039)
********** TEST 'test-suite :: SingleSource/UnitTests/2005-11-29-LongSwitch.test' RESULTS **********
compile_time: 0.0104 
exec_time: 0.0006 
hash: "e9d131fd348a8348544588d5e0c3d2b4" 
link_time: 0.0118 
**********
PASS: test-suite :: SingleSource/UnitTests/2006-01-23-UnionInit.test (1949 of 2039)
********** TEST 'test-suite :: SingleSource/UnitTests/2006-01-23-UnionInit.test' RESULTS **********
compile_time: 0.0178 
exec_time: 0.0008 
hash: "eed055c36c7e7902af0bc68d992bcde8" 
link_time: 0.0118 
**********
PASS: test-suite :: SingleSource/UnitTests/2006-01-29-SimpleIndirectCall.test (1950 of 2039)
********** TEST 'test-suite :: SingleSource/UnitTests/2006-01-29-SimpleIndirectCall.test' RESULTS **********
compile_time: 0.0121 
exec_time: 0.0007 
hash: "90f51e4441eed4b6ed59f5b782e2a899" 
link_time: 0.0125 
**********
PASS: test-suite :: SingleSource/UnitTests/2006-02-04-DivRem.test (1951 of 2039)
********** TEST 'test-suite :: SingleSource/UnitTests/2006-02-04-DivRem.test' RESULTS **********
compile_time: 0.0108 
exec_time: 0.0007 
hash: "7facf092b0ba616254aeb4cf444b2326" 
link_time: 0.0126 
**********
PASS: test-suite :: SingleSource/UnitTests/2006-12-01-float_varg.test (1952 of 2039)
********** TEST 'test-suite :: SingleSource/UnitTests/2006-12-01-float_varg.test' RESULTS **********
compile_time: 0.0119 
exec_time: 0.0007 
hash: "627e9920d69fb7ca41198e6cba9eaee3" 
link_time: 0.0123 
**********
PASS: test-suite :: SingleSource/UnitTests/2006-12-04-DynAllocAndRestore.test (1953 of 2039)
********** TEST 'test-suite :: SingleSource/UnitTests/2006-12-04-DynAllocAndRestore.test' RESULTS **********
compile_time: 0.0099 
exec_time: 0.0008 
hash: "3a42993077a9f80530b042b6e45bf6e0" 
link_time: 0.0126 
**********
PASS: test-suite :: SingleSource/UnitTests/2006-12-07-Compare64BitConstant.test (1954 of 2039)
********** TEST 'test-suite :: SingleSource/UnitTests/2006-12-07-Compare64BitConstant.test' RESULTS **********
compile_time: 0.0126 
exec_time: 0.0007 
hash: "13eb904be91fb70b233ab8057ccdca77" 
link_time: 0.0120 
**********
PASS: test-suite :: SingleSource/UnitTests/2006-12-11-LoadConstants.test (1955 of 2039)
********** TEST 'test-suite :: SingleSource/UnitTests/2006-12-11-LoadConstants.test' RESULTS **********
compile_time: 0.0363 
exec_time: 0.0008 
hash: "799cb4f13a248a578109d2d5fd6e2e0c" 
link_time: 0.0130 
**********
PASS: test-suite :: SingleSource/UnitTests/2007-01-04-KNR-Args.test (1956 of 2039)
********** TEST 'test-suite :: SingleSource/UnitTests/2007-01-04-KNR-Args.test' RESULTS **********
compile_time: 0.0123 
exec_time: 0.0008 
hash: "d1cff8e5a5f0a330380232738a2ff496" 
link_time: 0.0126 
**********
PASS: test-suite :: SingleSource/UnitTests/2007-03-02-VaCopy.test (1957 of 2039)
********** TEST 'test-suite :: SingleSource/UnitTests/2007-03-02-VaCopy.test' RESULTS **********
compile_time: 0.0129 
exec_time: 0.0007 
hash: "a9b11d437a0da50a4f01e0dd547796b7" 
link_time: 0.0112 
**********
PASS: test-suite :: SingleSource/UnitTests/2007-04-10-BitfieldTest.test (1958 of 2039)
********** TEST 'test-suite :: SingleSource/UnitTests/2007-04-10-BitfieldTest.test' RESULTS **********
compile_time: 0.0173 
exec_time: 0.0008 
hash: "b82a5a9eb91c20e09c9cb2fb10c460a3" 
link_time: 0.0117 
**********
PASS: test-suite :: SingleSource/UnitTests/2008-04-18-LoopBug.test (1959 of 2039)
********** TEST 'test-suite :: SingleSource/UnitTests/2008-04-18-LoopBug.test' RESULTS **********
compile_time: 0.0077 
exec_time: 0.0007 
hash: "3a68aee43e74b35708189c2a4c481459" 
link_time: 0.0125 
**********
PASS: test-suite :: SingleSource/UnitTests/2008-04-20-LoopBug2.test (1960 of 2039)
********** TEST 'test-suite :: SingleSource/UnitTests/2008-04-20-LoopBug2.test' RESULTS **********
compile_time: 0.0078 
exec_time: 0.0006 
hash: "cab4987704841e685fbe635dec9b2b01" 
link_time: 0.0117 
**********
PASS: test-suite :: SingleSource/UnitTests/2008-07-13-InlineSetjmp.test (1961 of 2039)
********** TEST 'test-suite :: SingleSource/UnitTests/2008-07-13-InlineSetjmp.test' RESULTS **********
compile_time: 0.0130 
exec_time: 0.0007 
hash: "18b7e55407edcc1976ff2779eef2382a" 
link_time: 0.0114 
**********
PASS: test-suite :: SingleSource/UnitTests/2009-04-16-BitfieldInitialization.test (1962 of 2039)
********** TEST 'test-suite :: SingleSource/UnitTests/2009-04-16-BitfieldInitialization.test' RESULTS **********
compile_time: 0.0149 
exec_time: 0.0007 
hash: "2801040a7870a5db70d8f30e27103b1d" 
link_time: 0.0124 
**********
PASS: test-suite :: SingleSource/UnitTests/2009-12-07-StructReturn.test (1963 of 2039)
********** TEST 'test-suite :: SingleSource/UnitTests/2009-12-07-StructReturn.test' RESULTS **********
compile_time: 0.0090 
exec_time: 0.0007 
hash: "b857f1aa1e3d1bbfb66619e2b589c57a" 
link_time: 0.0102 
**********
PASS: test-suite :: SingleSource/UnitTests/2010-05-24-BitfieldTest.test (1964 of 2039)
********** TEST 'test-suite :: SingleSource/UnitTests/2010-05-24-BitfieldTest.test' RESULTS **********
compile_time: 0.0078 
exec_time: 0.0006 
hash: "531d33c082b90cfcb631b90198390975" 
link_time: 0.0121 
**********
PASS: test-suite :: SingleSource/UnitTests/AtomicOps.test (1965 of 2039)
********** TEST 'test-suite :: SingleSource/UnitTests/AtomicOps.test' RESULTS **********
compile_time: 0.0104 
exec_time: 0.0006 
hash: "51473340ef2fa97bc03d3a93e3a17148" 
link_time: 0.0117 
**********
PASS: test-suite :: SingleSource/UnitTests/C++11/stdthreadbug.test (1966 of 2039)
********** TEST 'test-suite :: SingleSource/UnitTests/C++11/stdthreadbug.test' RESULTS **********
compile_time: 0.1651 
exec_time: 0.0008 
hash: "8b3f069baa262aa1b8656fba12165290" 
link_time: 0.0117 
**********
PASS: test-suite :: SingleSource/UnitTests/DefaultInitDynArrays.test (1967 of 2039)
********** TEST 'test-suite :: SingleSource/UnitTests/DefaultInitDynArrays.test' RESULTS **********
compile_time: 0.0171 
exec_time: 0.0008 
hash: "bc9312a26437535cf751d34ecd9ce325" 
link_time: 0.0117 
**********
PASS: test-suite :: SingleSource/UnitTests/FloatPrecision.test (1968 of 2039)
********** TEST 'test-suite :: SingleSource/UnitTests/FloatPrecision.test' RESULTS **********
compile_time: 0.0099 
exec_time: 0.0007 
hash: "9b3659a6311fa56b182e8c44ad09c323" 
link_time: 0.0114 
**********
PASS: test-suite :: SingleSource/UnitTests/ObjC++/Hello.test (1969 of 2039)
********** TEST 'test-suite :: SingleSource/UnitTests/ObjC++/Hello.test' RESULTS **********
compile_time: 0.5277 
exec_time: 0.0027 
hash: "fb0f47ca4288edf9715e7bde45fa6524" 
link_time: 0.0142 
**********
PASS: test-suite :: SingleSource/UnitTests/ObjC++/property-reference-object.test (1970 of 2039)
********** TEST 'test-suite :: SingleSource/UnitTests/ObjC++/property-reference-object.test' RESULTS **********
compile_time: 0.4942 
exec_time: 0.0025 
hash: "acfb7837b9e920bfba55ee158aab1c12" 
link_time: 0.0165 
**********
PASS: test-suite :: SingleSource/UnitTests/ObjC++/property-reference.test (1971 of 2039)
********** TEST 'test-suite :: SingleSource/UnitTests/ObjC++/property-reference.test' RESULTS **********
compile_time: 0.6126 
exec_time: 0.0026 
hash: "7b1c0537a157ccaef08090ca38f1ae26" 
link_time: 0.0164 
**********
PASS: test-suite :: SingleSource/UnitTests/ObjC++/reference-in-block-args.test (1972 of 2039)
********** TEST 'test-suite :: SingleSource/UnitTests/ObjC++/reference-in-block-args.test' RESULTS **********
compile_time: 0.0086 
exec_time: 0.0025 
hash: "f7a919f18701e729d9a49de9406f70a1" 
link_time: 0.0169 
**********
PASS: test-suite :: SingleSource/UnitTests/ObjC/BoolLiteralTest.test (1973 of 2039)
********** TEST 'test-suite :: SingleSource/UnitTests/ObjC/BoolLiteralTest.test' RESULTS **********
compile_time: 0.3217 
exec_time: 0.0025 
hash: "4b72e18974dff6754e7249be3188c610" 
link_time: 0.0139 
**********
PASS: test-suite :: SingleSource/UnitTests/ObjC/bitfield-access-2.test (1974 of 2039)
********** TEST 'test-suite :: SingleSource/UnitTests/ObjC/bitfield-access-2.test' RESULTS **********
compile_time: 0.0242 
exec_time: 0.0028 
hash: "591053e8141b63691b751e3ebb1c67b9" 
link_time: 0.0147 
**********
PASS: test-suite :: SingleSource/UnitTests/ObjC/bitfield-access.test (1975 of 2039)
********** TEST 'test-suite :: SingleSource/UnitTests/ObjC/bitfield-access.test' RESULTS **********
compile_time: 0.0174 
exec_time: 0.0025 
hash: "3b7124cd0092bbcc8f6ef21b813877c6" 
link_time: 0.0154 
**********
PASS: test-suite :: SingleSource/UnitTests/ObjC/block-byref-aggr.test (1976 of 2039)
********** TEST 'test-suite :: SingleSource/UnitTests/ObjC/block-byref-aggr.test' RESULTS **********
compile_time: 0.2526 
exec_time: 0.0024 
hash: "d3fec074367b6e84cded10d7c6875849" 
link_time: 0.0154 
**********
PASS: test-suite :: SingleSource/UnitTests/ObjC/constant-strings.test (1977 of 2039)
********** TEST 'test-suite :: SingleSource/UnitTests/ObjC/constant-strings.test' RESULTS **********
compile_time: 0.0124 
exec_time: 0.0026 
hash: "2c43a80d95754fcc413737708ff988f6" 
link_time: 0.0142 
**********
PASS: test-suite :: SingleSource/UnitTests/ObjC/dot-syntax-1.test (1978 of 2039)
********** TEST 'test-suite :: SingleSource/UnitTests/ObjC/dot-syntax-1.test' RESULTS **********
compile_time: 0.0286 
exec_time: 0.0024 
hash: "2967be5b04d77ea8faa975c3c016fde9" 
link_time: 0.0157 
**********
PASS: test-suite :: SingleSource/UnitTests/ObjC/dot-syntax-2.test (1979 of 2039)
********** TEST 'test-suite :: SingleSource/UnitTests/ObjC/dot-syntax-2.test' RESULTS **********
compile_time: 0.0168 
exec_time: 0.0026 
hash: "c0b572e72604e0d615f05a84329c8e1b" 
link_time: 0.0134 
**********
PASS: test-suite :: SingleSource/UnitTests/ObjC/dot-syntax.test (1980 of 2039)
********** TEST 'test-suite :: SingleSource/UnitTests/ObjC/dot-syntax.test' RESULTS **********
compile_time: 0.0226 
exec_time: 0.0027 
hash: "8edc22180588891dd886be48aeabef8e" 
link_time: 0.0150 
**********
PASS: test-suite :: SingleSource/UnitTests/ObjC/exceptions-2.test (1981 of 2039)
********** TEST 'test-suite :: SingleSource/UnitTests/ObjC/exceptions-2.test' RESULTS **********
compile_time: 0.3400 
exec_time: 0.0026 
hash: "842405721ef063d912df7cd07a4ded71" 
link_time: 0.0126 
**********
PASS: test-suite :: SingleSource/UnitTests/ObjC/exceptions-3.test (1982 of 2039)
********** TEST 'test-suite :: SingleSource/UnitTests/ObjC/exceptions-3.test' RESULTS **********
compile_time: 0.3287 
exec_time: 0.0022 
hash: "0c32c5ffb639fcae2c2642834db968d6" 
link_time: 0.0143 
**********
PASS: test-suite :: SingleSource/UnitTests/ObjC/exceptions-4.test (1983 of 2039)
********** TEST 'test-suite :: SingleSource/UnitTests/ObjC/exceptions-4.test' RESULTS **********
compile_time: 0.3274 
exec_time: 0.0040 
hash: "e8bd4bfed011326cef04c605fab0056c" 
link_time: 0.0133 
**********
PASS: test-suite :: SingleSource/UnitTests/ObjC/exceptions.test (1984 of 2039)
********** TEST 'test-suite :: SingleSource/UnitTests/ObjC/exceptions.test' RESULTS **********
compile_time: 0.2940 
exec_time: 0.0028 
hash: "d37d5bb15a81897cd429fcf6d2f10c77" 
link_time: 0.0151 
**********
PASS: test-suite :: SingleSource/UnitTests/ObjC/for-in.test (1985 of 2039)
********** TEST 'test-suite :: SingleSource/UnitTests/ObjC/for-in.test' RESULTS **********
compile_time: 0.3306 
exec_time: 0.0029 
hash: "59df41ab97fa7c64b78499b32732f2f8" 
link_time: 0.0140 
**********
PASS: test-suite :: SingleSource/UnitTests/ObjC/instance-method-metadata.test (1986 of 2039)
********** TEST 'test-suite :: SingleSource/UnitTests/ObjC/instance-method-metadata.test' RESULTS **********
compile_time: 0.3522 
exec_time: 0.0025 
hash: "6b015faf1e2a85bf08f48a8bdd60f3ba" 
link_time: 0.0111 
**********
PASS: test-suite :: SingleSource/UnitTests/ObjC/messages-2.test (1987 of 2039)
********** TEST 'test-suite :: SingleSource/UnitTests/ObjC/messages-2.test' RESULTS **********
compile_time: 0.0347 
exec_time: 0.0024 
hash: "3cfb77046ed1b3f6931c09b69f6eb2ac" 
link_time: 0.0146 
**********
PASS: test-suite :: SingleSource/UnitTests/ObjC/messages.test (1988 of 2039)
********** TEST 'test-suite :: SingleSource/UnitTests/ObjC/messages.test' RESULTS **********
compile_time: 0.0240 
exec_time: 0.0025 
hash: "89f536b1c7183c527f5a53d024a803ad" 
link_time: 0.0152 
**********
PASS: test-suite :: SingleSource/UnitTests/ObjC/parameter-passing.test (1989 of 2039)
********** TEST 'test-suite :: SingleSource/UnitTests/ObjC/parameter-passing.test' RESULTS **********
compile_time: 0.3485 
exec_time: 0.0027 
hash: "733b8aa14562416610349452d4e31adf" 
link_time: 0.0144 
**********
PASS: test-suite :: SingleSource/UnitTests/ObjC/predefined-expr-in-method.test (1990 of 2039)
********** TEST 'test-suite :: SingleSource/UnitTests/ObjC/predefined-expr-in-method.test' RESULTS **********
compile_time: 0.0167 
exec_time: 0.0023 
hash: "e602bc6bdbbdf311433faca2f028f6f8" 
link_time: 0.0140 
**********
PASS: test-suite :: SingleSource/UnitTests/ObjC/property.test (1991 of 2039)
********** TEST 'test-suite :: SingleSource/UnitTests/ObjC/property.test' RESULTS **********
compile_time: 0.3303 
exec_time: 0.0026 
hash: "9e4baca1a1020b20de3bdbd21c0b6438" 
link_time: 0.0135 
**********
PASS: test-suite :: SingleSource/UnitTests/ObjC/protocols.test (1992 of 2039)
********** TEST 'test-suite :: SingleSource/UnitTests/ObjC/protocols.test' RESULTS **********
compile_time: 0.0247 
exec_time: 0.0022 
hash: "c060d580bb04c54bb76140d152b77ae0" 
link_time: 0.0143 
**********
PASS: test-suite :: SingleSource/UnitTests/ObjC/synchronized.test (1993 of 2039)
********** TEST 'test-suite :: SingleSource/UnitTests/ObjC/synchronized.test' RESULTS **********
compile_time: 0.3302 
exec_time: 0.1459 
hash: "527c3bede50e9d23e199042a8ea64f83" 
link_time: 0.0140 
**********
PASS: test-suite :: SingleSource/UnitTests/ObjC/trivial-interface.test (1994 of 2039)
********** TEST 'test-suite :: SingleSource/UnitTests/ObjC/trivial-interface.test' RESULTS **********
compile_time: 0.3040 
exec_time: 0.0023 
hash: "a7279de305f264009402a954a338b43b" 
link_time: 0.0109 
**********
PASS: test-suite :: SingleSource/UnitTests/SignlessTypes/Large/cast.test (1995 of 2039)
********** TEST 'test-suite :: SingleSource/UnitTests/SignlessTypes/Large/cast.test' RESULTS **********
compile_time: 0.0312 
exec_time: 0.0133 
hash: "2682b0197fa1ded5c935023221b447ef" 
link_time: 0.0122 
**********
PASS: test-suite :: SingleSource/UnitTests/SignlessTypes/cast-bug.test (1996 of 2039)
********** TEST 'test-suite :: SingleSource/UnitTests/SignlessTypes/cast-bug.test' RESULTS **********
compile_time: 0.0067 
exec_time: 0.0006 
hash: "f1535b835cd28cdfbc23f732f9e4c004" 
link_time: 0.0109 
**********
PASS: test-suite :: SingleSource/UnitTests/SignlessTypes/cast2.test (1997 of 2039)
********** TEST 'test-suite :: SingleSource/UnitTests/SignlessTypes/cast2.test' RESULTS **********
compile_time: 0.0134 
exec_time: 0.0006 
hash: "7c1bdb8f462cdf6a415de40daa3360f4" 
link_time: 0.0122 
**********
PASS: test-suite :: SingleSource/UnitTests/SignlessTypes/ccc.test (1998 of 2039)
********** TEST 'test-suite :: SingleSource/UnitTests/SignlessTypes/ccc.test' RESULTS **********
compile_time: 0.0182 
exec_time: 0.0006 
hash: "aef254e0c3c3e65443ef9666d915fb62" 
link_time: 0.0127 
**********
PASS: test-suite :: SingleSource/UnitTests/SignlessTypes/div.test (1999 of 2039)
********** TEST 'test-suite :: SingleSource/UnitTests/SignlessTypes/div.test' RESULTS **********
compile_time: 0.0157 
exec_time: 0.0007 
hash: "4edb839849cfd03840f35d9883b6a739" 
link_time: 0.0120 
**********
PASS: test-suite :: SingleSource/UnitTests/SignlessTypes/factor.test (2000 of 2039)
********** TEST 'test-suite :: SingleSource/UnitTests/SignlessTypes/factor.test' RESULTS **********
compile_time: 0.0138 
exec_time: 0.0007 
hash: "72a56eabb5f061d18b184e62493a9405" 
link_time: 0.0105 
**********
PASS: test-suite :: SingleSource/UnitTests/SignlessTypes/rem.test (2001 of 2039)
********** TEST 'test-suite :: SingleSource/UnitTests/SignlessTypes/rem.test' RESULTS **********
compile_time: 0.0236 
exec_time: 0.0016 
hash: "dc92ca4563c3e15e4a75e6566a8ecd87" 
link_time: 0.0110 
**********
PASS: test-suite :: SingleSource/UnitTests/SignlessTypes/shr.test (2002 of 2039)
********** TEST 'test-suite :: SingleSource/UnitTests/SignlessTypes/shr.test' RESULTS **********
compile_time: 0.0124 
exec_time: 0.0007 
hash: "5d256d9d2d3c2e3bbb2041f699f5b546" 
link_time: 0.0098 
**********
PASS: test-suite :: SingleSource/UnitTests/StructModifyTest.test (2003 of 2039)
********** TEST 'test-suite :: SingleSource/UnitTests/StructModifyTest.test' RESULTS **********
compile_time: 0.0076 
exec_time: 0.0006 
hash: "37e42199995bb4a1951e6d75e7c5e3dc" 
link_time: 0.0125 
**********
PASS: test-suite :: SingleSource/UnitTests/TestLoop.test (2004 of 2039)
********** TEST 'test-suite :: SingleSource/UnitTests/TestLoop.test' RESULTS **********
compile_time: 0.0094 
exec_time: 0.0007 
hash: "16081cbc9b2e6f14dcf26a9cadf51b6c" 
link_time: 0.0114 
**********
PASS: test-suite :: SingleSource/UnitTests/Threads/2010-12-08-tls.test (2005 of 2039)
********** TEST 'test-suite :: SingleSource/UnitTests/Threads/2010-12-08-tls.test' RESULTS **********
compile_time: 0.0122 
exec_time: 0.0007 
hash: "f3cad1b1781750d3d73ef8ef4c1a938c" 
link_time: 0.0088 
**********
PASS: test-suite :: SingleSource/UnitTests/Threads/tls.test (2006 of 2039)
********** TEST 'test-suite :: SingleSource/UnitTests/Threads/tls.test' RESULTS **********
compile_time: 0.0127 
exec_time: 0.0007 
hash: "087d5d21ba1900ae30b9a9ac475edd5f" 
link_time: 0.0084 
**********
PASS: test-suite :: SingleSource/UnitTests/Vector/SSE/Vector-sse.expandfft.test (2007 of 2039)
********** TEST 'test-suite :: SingleSource/UnitTests/Vector/SSE/Vector-sse.expandfft.test' RESULTS **********
compile_time: 0.0000 
exec_time: 2.0005 
hash: "f2f53d455b16f33ca77d2b11611f205d" 
link_time: 0.0089 
**********
PASS: test-suite :: SingleSource/UnitTests/Vector/SSE/Vector-sse.isamax.test (2008 of 2039)
********** TEST 'test-suite :: SingleSource/UnitTests/Vector/SSE/Vector-sse.isamax.test' RESULTS **********
compile_time: 0.0000 
exec_time: 0.0007 
hash: "54df147086c6bc3e8881ac89accb81c1" 
link_time: 0.0106 
**********
PASS: test-suite :: SingleSource/UnitTests/Vector/SSE/Vector-sse.shift.test (2009 of 2039)
********** TEST 'test-suite :: SingleSource/UnitTests/Vector/SSE/Vector-sse.shift.test' RESULTS **********
compile_time: 0.0000 
exec_time: 0.0006 
hash: "1d68a6be77b7661a91d27c74e0ac5f94" 
link_time: 0.0091 
**********
PASS: test-suite :: SingleSource/UnitTests/Vector/SSE/Vector-sse.stepfft.test (2010 of 2039)
********** TEST 'test-suite :: SingleSource/UnitTests/Vector/SSE/Vector-sse.stepfft.test' RESULTS **********
compile_time: 0.0000 
exec_time: 2.2165 
hash: "560008c0cb319116bd65d4535286ee35" 
link_time: 0.0095 
**********
PASS: test-suite :: SingleSource/UnitTests/Vector/Vector-build.test (2011 of 2039)
********** TEST 'test-suite :: SingleSource/UnitTests/Vector/Vector-build.test' RESULTS **********
compile_time: 0.0000 
exec_time: 0.0007 
hash: "a8438ff97a485b84b89e61e747d3e5b6" 
link_time: 0.0085 
**********
PASS: test-suite :: SingleSource/UnitTests/Vector/Vector-build2.test (2012 of 2039)
********** TEST 'test-suite :: SingleSource/UnitTests/Vector/Vector-build2.test' RESULTS **********
compile_time: 0.0000 
exec_time: 9.1036 
hash: "908e220e27bacbec3894022bd392b85c" 
link_time: 0.0100 
**********
PASS: test-suite :: SingleSource/UnitTests/Vector/Vector-constpool.test (2013 of 2039)
********** TEST 'test-suite :: SingleSource/UnitTests/Vector/Vector-constpool.test' RESULTS **********
compile_time: 0.0000 
exec_time: 0.0008 
hash: "b97f208dfb1ed09a0d959838d38e3fd5" 
link_time: 0.0154 
**********
PASS: test-suite :: SingleSource/UnitTests/Vector/Vector-divides.test (2014 of 2039)
********** TEST 'test-suite :: SingleSource/UnitTests/Vector/Vector-divides.test' RESULTS **********
compile_time: 0.0000 
exec_time: 0.0006 
hash: "5239ee58016cd005f8a60a815af01d78" 
link_time: 0.0097 
**********
PASS: test-suite :: SingleSource/UnitTests/Vector/Vector-multiplies.test (2015 of 2039)
********** TEST 'test-suite :: SingleSource/UnitTests/Vector/Vector-multiplies.test' RESULTS **********
compile_time: 0.0000 
exec_time: 2.1995 
hash: "cd10932a493817fb501f62fd0a66ca53" 
link_time: 0.0103 
**********
PASS: test-suite :: SingleSource/UnitTests/Vector/Vector-simple.test (2016 of 2039)
********** TEST 'test-suite :: SingleSource/UnitTests/Vector/Vector-simple.test' RESULTS **********
compile_time: 0.0000 
exec_time: 0.0058 
hash: "ac3ad1849a5292b2dffbbebd2c0656fa" 
link_time: 0.0091 
**********
PASS: test-suite :: SingleSource/UnitTests/Vector/Vector-sumarray-dbl.test (2017 of 2039)
********** TEST 'test-suite :: SingleSource/UnitTests/Vector/Vector-sumarray-dbl.test' RESULTS **********
compile_time: 0.0000 
exec_time: 0.0008 
hash: "b29d73f088a9c347833d24a8f1f2666f" 
link_time: 0.0102 
**********
PASS: test-suite :: SingleSource/UnitTests/Vector/Vector-sumarray.test (2018 of 2039)
********** TEST 'test-suite :: SingleSource/UnitTests/Vector/Vector-sumarray.test' RESULTS **********
compile_time: 0.0000 
exec_time: 0.0006 
hash: "9acd6701825bca3feb161efa6897645d" 
link_time: 0.0104 
**********
PASS: test-suite :: SingleSource/UnitTests/Vectorizer/gcc-loops.test (2019 of 2039)
********** TEST 'test-suite :: SingleSource/UnitTests/Vectorizer/gcc-loops.test' RESULTS **********
compile_time: 0.4591 
exec_time: 37.1218 
hash: "cf0d3e523a511db5d9137e0d6c50bcc4" 
link_time: 0.0130 
**********
PASS: test-suite :: SingleSource/UnitTests/block-byref-cxxobj-test.test (2020 of 2039)
********** TEST 'test-suite :: SingleSource/UnitTests/block-byref-cxxobj-test.test' RESULTS **********
compile_time: 0.0121 
exec_time: 0.0008 
hash: "8afecbf27a6562014df41a698d8257eb" 
link_time: 0.0106 
**********
PASS: test-suite :: SingleSource/UnitTests/block-byref-test.test (2021 of 2039)
********** TEST 'test-suite :: SingleSource/UnitTests/block-byref-test.test' RESULTS **********
compile_time: 0.0072 
exec_time: 0.0008 
hash: "63cadb713a9043fff11c7964d3329a09" 
link_time: 0.0111 
**********
PASS: test-suite :: SingleSource/UnitTests/block-call-r7674133.test (2022 of 2039)
********** TEST 'test-suite :: SingleSource/UnitTests/block-call-r7674133.test' RESULTS **********
compile_time: 0.0105 
exec_time: 0.0007 
hash: "a25c9dabec9ed2002ba898b919af3fbf" 
link_time: 0.0117 
**********
PASS: test-suite :: SingleSource/UnitTests/block-copied-in-cxxobj-1.test (2023 of 2039)
********** TEST 'test-suite :: SingleSource/UnitTests/block-copied-in-cxxobj-1.test' RESULTS **********
compile_time: 0.0204 
exec_time: 0.0008 
hash: "d1db2ba369b28bbf7c4861a703e2be62" 
link_time: 0.0126 
**********
PASS: test-suite :: SingleSource/UnitTests/block-copied-in-cxxobj.test (2024 of 2039)
********** TEST 'test-suite :: SingleSource/UnitTests/block-copied-in-cxxobj.test' RESULTS **********
compile_time: 0.0183 
exec_time: 0.0009 
hash: "75e0dacf8f2eddeea7872c497c9b546c" 
link_time: 0.0125 
**********
PASS: test-suite :: SingleSource/UnitTests/blockstret.test (2025 of 2039)
********** TEST 'test-suite :: SingleSource/UnitTests/blockstret.test' RESULTS **********
compile_time: 0.0095 
exec_time: 0.0008 
hash: "30b9c06a522e410dc9befd55f7a14ae1" 
link_time: 0.0107 
**********
PASS: test-suite :: SingleSource/UnitTests/byval-alignment.test (2026 of 2039)
********** TEST 'test-suite :: SingleSource/UnitTests/byval-alignment.test' RESULTS **********
compile_time: 0.0135 
exec_time: 0.0007 
hash: "040278d13db474cf481f51bca1947b3b" 
link_time: 0.0111 
**********
PASS: test-suite :: SingleSource/UnitTests/conditional-gnu-ext-cxx.test (2027 of 2039)
********** TEST 'test-suite :: SingleSource/UnitTests/conditional-gnu-ext-cxx.test' RESULTS **********
compile_time: 0.0077 
exec_time: 0.0006 
hash: "83770fa574490861f45d7d16ff942605" 
link_time: 0.0102 
**********
PASS: test-suite :: SingleSource/UnitTests/conditional-gnu-ext.test (2028 of 2039)
********** TEST 'test-suite :: SingleSource/UnitTests/conditional-gnu-ext.test' RESULTS **********
compile_time: 0.0069 
exec_time: 0.0007 
hash: "e23f2c4167a811db8431e4fd1fa732e2" 
link_time: 0.0114 
**********
PASS: test-suite :: SingleSource/UnitTests/initp1.test (2029 of 2039)
********** TEST 'test-suite :: SingleSource/UnitTests/initp1.test' RESULTS **********
compile_time: 0.0231 
exec_time: 0.0008 
hash: "be6f9572a8420113fdbcf19ab0f686ba" 
link_time: 0.0118 
**********
PASS: test-suite :: SingleSource/UnitTests/member-function-pointers.test (2030 of 2039)
********** TEST 'test-suite :: SingleSource/UnitTests/member-function-pointers.test' RESULTS **********
compile_time: 0.0146 
exec_time: 0.0007 
hash: "b0682f3ae22f41711e93615170300fbf" 
link_time: 0.0123 
**********
PASS: test-suite :: SingleSource/UnitTests/ms_struct-bitfield-1.test (2031 of 2039)
********** TEST 'test-suite :: SingleSource/UnitTests/ms_struct-bitfield-1.test' RESULTS **********
compile_time: 0.0070 
exec_time: 0.0007 
hash: "d3def7cb5e70330474e2aca95da3d20a" 
link_time: 0.0104 
**********
PASS: test-suite :: SingleSource/UnitTests/ms_struct-bitfield-init-1.test (2032 of 2039)
********** TEST 'test-suite :: SingleSource/UnitTests/ms_struct-bitfield-init-1.test' RESULTS **********
compile_time: 0.0122 
exec_time: 0.0007 
hash: "c8f4079b170b090c12865349ceed8fa6" 
link_time: 0.0118 
**********
PASS: test-suite :: SingleSource/UnitTests/ms_struct-bitfield-init.test (2033 of 2039)
********** TEST 'test-suite :: SingleSource/UnitTests/ms_struct-bitfield-init.test' RESULTS **********
compile_time: 0.0158 
exec_time: 0.0007 
hash: "d37d5730eff7a715967ff9b2dc4ffa82" 
link_time: 0.0128 
**********
PASS: test-suite :: SingleSource/UnitTests/ms_struct-bitfield.test (2034 of 2039)
********** TEST 'test-suite :: SingleSource/UnitTests/ms_struct-bitfield.test' RESULTS **********
compile_time: 0.0088 
exec_time: 0.0009 
hash: "7a9a881a52eddef27bb31b628bac78b1" 
link_time: 0.0121 
**********
PASS: test-suite :: SingleSource/UnitTests/ms_struct_pack_layout-1.test (2035 of 2039)
********** TEST 'test-suite :: SingleSource/UnitTests/ms_struct_pack_layout-1.test' RESULTS **********
compile_time: 0.0067 
exec_time: 0.0006 
hash: "13c4e08bc0337b1c397ddbc0e5ba9e44" 
link_time: 0.0119 
**********
PASS: test-suite :: SingleSource/UnitTests/ms_struct_pack_layout.test (2036 of 2039)
********** TEST 'test-suite :: SingleSource/UnitTests/ms_struct_pack_layout.test' RESULTS **********
compile_time: 0.0121 
exec_time: 0.0008 
hash: "3e55426162d9cf1019e7b3b8cdad7cb9" 
link_time: 0.0116 
**********
PASS: test-suite :: SingleSource/UnitTests/printargs.test (2037 of 2039)
********** TEST 'test-suite :: SingleSource/UnitTests/printargs.test' RESULTS **********
compile_time: 0.0096 
exec_time: 0.0007 
hash: "61014162905ef1bd04c9a7f5d58d8d6c" 
link_time: 0.0119 
**********
PASS: test-suite :: SingleSource/UnitTests/stmtexpr.test (2038 of 2039)
********** TEST 'test-suite :: SingleSource/UnitTests/stmtexpr.test' RESULTS **********
compile_time: 0.0157 
exec_time: 0.0008 
hash: "2093f13dd071d2a09051ed46b6eebc43" 
link_time: 0.0120 
**********
PASS: test-suite :: SingleSource/UnitTests/vla.test (2039 of 2039)
********** TEST 'test-suite :: SingleSource/UnitTests/vla.test' RESULTS **********
compile_time: 0.0134 
exec_time: 0.0008 
hash: "325c18f464a384f32925b4c519d29fee" 
link_time: 0.0123 
**********
Testing Time: 4607.08s
********************
Failing Tests (3):
    test-suite :: SingleSource/Regression/C/gcc-c-torture/execute/GCC-C-execute-alloca-1.test
    test-suite :: SingleSource/Regression/C/gcc-c-torture/execute/GCC-C-execute-pr44575.test
    test-suite :: SingleSource/Regression/C/gcc-c-torture/execute/GCC-C-execute-pr60960.test

Hide Details

Expected Passes : 2003 Unexpected Failures: 3 -- Cache values // Build a 32 bit version of the library. BENCHMARK_BUILD_32_BITS:BOOL=OFF

Hide Details

// Flags used by the C++ compiler during coverage builds. BENCHMARK_CXX_FLAGS_COVERAGE:STRING=-O0 -g

Hide Details

// Enable the use of exceptions in the benchmark library. BENCHMARK_ENABLE_EXCEPTIONS:BOOL=ON

Hide Details

// Enable installation of benchmark. (Projects embedding benchmark may want to turn this OFF.) BENCHMARK_ENABLE_INSTALL:BOOL=ON

Hide Details

// Enable link time optimisation of the benchmark library. BENCHMARK_ENABLE_LTO:BOOL=OFF

Hide Details

// Enable testing of the benchmark library. BENCHMARK_ENABLE_TESTING:BOOL=ON

Hide Details

// Flags used for linking binaries during coverage builds. BENCHMARK_EXE_LINKER_FLAGS_COVERAGE:STRING=

Hide Details

// Flags used by the shared libraries linker during coverage builds. BENCHMARK_SHARED_LINKER_FLAGS_COVERAGE:STRING=

Hide Details

// Build and test using libc++ as the standard library. BENCHMARK_USE_LIBCXX:BOOL=OFF

Hide Details

// Path to a program. CMAKE_AR:FILEPATH=/usr/bin/ar

Hide Details

// CMAKE_BUILD_TYPE:STRING=Debug

Hide Details

// Enable/Disable color output during build. CMAKE_COLOR_MAKEFILE:BOOL=ON

Hide Details

// No help, variable specified on the command line. CMAKE_CXX_COMPILER:FILEPATH=/usr/bin/clang++

Hide Details

// Flags used by the compiler during all build types. CMAKE_CXX_FLAGS:STRING=

Hide Details

// CMAKE_CXX_FLAGS_DEBUG:STRING=-O0 -g

Hide Details

// Flags used by the compiler during release builds for minimum size. CMAKE_CXX_FLAGS_MINSIZEREL:STRING=-Os -DNDEBUG

Hide Details

// Flags used by the compiler during release builds. CMAKE_CXX_FLAGS_RELEASE:STRING=-O3 -DNDEBUG

Hide Details

// Flags used by the compiler during release builds with debug info. CMAKE_CXX_FLAGS_RELWITHDEBINFO:STRING=-O2 -g -DNDEBUG

Hide Details

// No help, variable specified on the command line. CMAKE_C_COMPILER:FILEPATH=/usr/bin/clang

Hide Details

// Flags used by the compiler during all build types. CMAKE_C_FLAGS:STRING=

Hide Details

// CMAKE_C_FLAGS_DEBUG:STRING=-O0 -g

Hide Details

// Flags used by the compiler during release builds for minimum size. CMAKE_C_FLAGS_MINSIZEREL:STRING=-Os -DNDEBUG

Hide Details

// Flags used by the compiler during release builds. CMAKE_C_FLAGS_RELEASE:STRING=-O3 -DNDEBUG

Hide Details

// Flags used by the compiler during release builds with debug info. CMAKE_C_FLAGS_RELWITHDEBINFO:STRING=-O2 -g -DNDEBUG

Hide Details

// Flags used by the linker. CMAKE_EXE_LINKER_FLAGS:STRING=

Hide Details

// Flags used by the linker during debug builds. CMAKE_EXE_LINKER_FLAGS_DEBUG:STRING=

Hide Details

// Flags used by the linker during release minsize builds. CMAKE_EXE_LINKER_FLAGS_MINSIZEREL:STRING=

Hide Details

// Flags used by the linker during release builds. CMAKE_EXE_LINKER_FLAGS_RELEASE:STRING=

Hide Details

// Flags used by the linker during Release with Debug Info builds. CMAKE_EXE_LINKER_FLAGS_RELWITHDEBINFO:STRING=

Hide Details

// Enable/Disable output of compile commands during generation. CMAKE_EXPORT_COMPILE_COMMANDS:BOOL=OFF

Hide Details

// Path to a program. CMAKE_INSTALL_NAME_TOOL:FILEPATH=/usr/bin/install_name_tool

Hide Details

// Install path prefix, prepended onto install directories. CMAKE_INSTALL_PREFIX:PATH=/usr/local

Hide Details

// Path to a program. CMAKE_LINKER:FILEPATH=/usr/bin/ld

Hide Details

// Path to a program. CMAKE_MAKE_PROGRAM:FILEPATH=/usr/bin/make

Hide Details

// Flags used by the linker during the creation of modules. CMAKE_MODULE_LINKER_FLAGS:STRING=

Hide Details

// Flags used by the linker during debug builds. CMAKE_MODULE_LINKER_FLAGS_DEBUG:STRING=

Hide Details

// Flags used by the linker during release minsize builds. CMAKE_MODULE_LINKER_FLAGS_MINSIZEREL:STRING=

Hide Details

// Flags used by the linker during release builds. CMAKE_MODULE_LINKER_FLAGS_RELEASE:STRING=

Hide Details

// Flags used by the linker during Release with Debug Info builds. CMAKE_MODULE_LINKER_FLAGS_RELWITHDEBINFO:STRING=

Hide Details

// Path to a program. CMAKE_NM:FILEPATH=/usr/bin/nm

Hide Details

// Path to a program. CMAKE_OBJCOPY:FILEPATH=CMAKE_OBJCOPY-NOTFOUND

Hide Details

// Path to a program. CMAKE_OBJDUMP:FILEPATH=CMAKE_OBJDUMP-NOTFOUND

Hide Details

// Build architectures for OSX CMAKE_OSX_ARCHITECTURES:STRING=

Hide Details

// Minimum OS X version to target for deployment (at runtime); newer APIs weak linked. Set to empty string for default value. CMAKE_OSX_DEPLOYMENT_TARGET:STRING=

Hide Details

// The product will be built against the headers and libraries located inside the indicated SDK. CMAKE_OSX_SYSROOT:STRING=

Hide Details

// Path to a program. CMAKE_RANLIB:FILEPATH=/usr/bin/ranlib

Hide Details

// Flags used by the linker during the creation of dll's. CMAKE_SHARED_LINKER_FLAGS:STRING=

Hide Details

// Flags used by the linker during debug builds. CMAKE_SHARED_LINKER_FLAGS_DEBUG:STRING=

Hide Details

// Flags used by the linker during release minsize builds. CMAKE_SHARED_LINKER_FLAGS_MINSIZEREL:STRING=

Hide Details

// Flags used by the linker during release builds. CMAKE_SHARED_LINKER_FLAGS_RELEASE:STRING=

Hide Details

// Flags used by the linker during Release with Debug Info builds. CMAKE_SHARED_LINKER_FLAGS_RELWITHDEBINFO:STRING=

Hide Details

// If set, runtime paths are not added when installing shared libraries, but are added when building. CMAKE_SKIP_INSTALL_RPATH:BOOL=NO

Hide Details

// If set, runtime paths are not added when using shared libraries. CMAKE_SKIP_RPATH:BOOL=NO

Hide Details

// Flags used by the linker during the creation of static libraries. CMAKE_STATIC_LINKER_FLAGS:STRING=

Hide Details

// Flags used by the linker during debug builds. CMAKE_STATIC_LINKER_FLAGS_DEBUG:STRING=

Hide Details

// Flags used by the linker during release minsize builds. CMAKE_STATIC_LINKER_FLAGS_MINSIZEREL:STRING=

Hide Details

// Flags used by the linker during release builds. CMAKE_STATIC_LINKER_FLAGS_RELEASE:STRING=

Hide Details

// Flags used by the linker during Release with Debug Info builds. CMAKE_STATIC_LINKER_FLAGS_RELWITHDEBINFO:STRING=

Hide Details

// Path to a program. CMAKE_STRIP:FILEPATH=/usr/bin/strip

Hide Details

// If this value is on, makefiles will be generated without the .SILENT directive, and all commands will be echoed to the console during the make. This is useful for debugging only. With Visual Studio IDE projects all commands are done without /nologo. CMAKE_VERBOSE_MAKEFILE:BOOL=FALSE

Hide Details

// Git command line client GIT_EXECUTABLE:FILEPATH=/usr/bin/git

Hide Details

// Path to a library. LIBRT:FILEPATH=LIBRT-NOTFOUND

Hide Details

// Sign executables and dylibs with the given identity or skip if empty (Darwin Only) LLVM_CODESIGNING_IDENTITY:STRING=

Hide Details

// Path to a file. TCL_INCLUDE_PATH:PATH=/System/Library/Frameworks/Tcl.framework/Headers

Hide Details

// Path to a library. TCL_LIBRARY:FILEPATH=/System/Library/Frameworks/tcl.framework

Hide Details

// Path to a program. TCL_TCLSH:FILEPATH=/usr/bin/tclsh

Hide Details

// Extra flags to select target architecture. TEST_SUITE_ARCH_FLAGS:STRING=

Hide Details

// Only run the benchmarking only subset TEST_SUITE_BENCHMARKING_ONLY:BOOL=OFF

Hide Details

// Measure code size of binaries TEST_SUITE_COLLECT_CODE_SIZE:BOOL=Off

Hide Details

// Measure compile time by wrapping compiler invocations in timeit TEST_SUITE_COLLECT_COMPILE_TIME:BOOL=ON

Hide Details

// Collect LLVM statistics TEST_SUITE_COLLECT_STATS:BOOL=OFF

Hide Details

// Always copy benchmark data to builddir TEST_SUITE_COPY_DATA:BOOL=OFF

Hide Details

// Directory containing CUDA prerequisites sourcecode TEST_SUITE_CUDA_ROOT:PATH=

Hide Details

// Specify C++ ABI library to use. TEST_SUITE_CXX_ABI:STRING=default

Hide Details

// Extra flags appended to CMAKE_C_FLAGS + CMAKE_CXX_FLAGS TEST_SUITE_DIAGNOSE_FLAGS:STRING=

Hide Details

// Extra flags appended to CMAKE_EXE_LINKER_FLAGS TEST_SUITE_DIAGNOSE_LINKER_FLAGS:STRING=

Hide Details

// Disable position independent executables and ASLR TEST_SUITE_DISABLE_PIE:BOOL=ON

Hide Details

// Enable bitcode tests TEST_SUITE_ENABLE_BITCODE_TESTS:BOOL=

Hide Details

// Directory containing test-suite external benchmark sources TEST_SUITE_EXTERNALS_DIR:PATH=

Hide Details

// Extra flags for CMAKE_CXX_FLAGS TEST_SUITE_EXTRA_CXX_FLAGS:STRING=

Hide Details

// Extra flags for CMAKE_C_FLAGS TEST_SUITE_EXTRA_C_FLAGS:STRING=

Hide Details

// Extra flags for CMAKE_EXE_LINKER_FLAGS TEST_SUITE_EXTRA_EXE_LINKER_FLAGS:STRING=

Hide Details

// Semicolon separated list of extra lit modules in use TEST_SUITE_EXTRA_LIT_MODULES:STRING=

Hide Details

// Directory containing HMMER 2.3.2 sourcecode TEST_SUITE_HMMER_ROOT:PATH=

Hide Details

// C compiler targetting the host TEST_SUITE_HOST_CC:STRING=cc

Hide Details

// Path to a program. TEST_SUITE_LIT:FILEPATH=/Users/buildslave/jenkins/workspace/Testsuite-Tester@4/venv/bin/lit

Hide Details

// Flags used when running lit TEST_SUITE_LIT_FLAGS:STRING=-sv

Hide Details

// Directory containing Nurbs sourcecode TEST_SUITE_NURBS_ROOT:PATH=

Hide Details

// Directory containing POV-Ray 3.1 sourcecode TEST_SUITE_POVRAY_ROOT:PATH=

Hide Details

// Enable lit profile generate mode TEST_SUITE_PROFILE_GENERATE:BOOL=OFF

Hide Details

// Add apropriate -fprofile-instr-use to CFLAGS/CXXFLAGS for each benchmark TEST_SUITE_PROFILE_USE:BOOL=OFF

Hide Details

// Remote execution client TEST_SUITE_REMOTE_CLIENT:STRING=ssh

Hide Details

// Remote execution host TEST_SUITE_REMOTE_HOST:STRING=

Hide Details

// Actually run the benchmarks in lit TEST_SUITE_RUN_BENCHMARKS:BOOL=ON

Hide Details

// Type of benchmark inputs (may be test,train or ref) TEST_SUITE_RUN_TYPE:STRING=train

Hide Details

// RunSafely.sh run-under (-u) parameter TEST_SUITE_RUN_UNDER:STRING=

Hide Details

// Directory containing Skidmarks 10 sourcecode TEST_SUITE_SKIDMARKS10_ROOT:PATH=

Hide Details

// Directory containing SPEC CPU2000 sourcecode TEST_SUITE_SPEC2000_ROOT:PATH=

Hide Details

// Directory containing SPEC CPU2006 sourcecode TEST_SUITE_SPEC2006_ROOT:PATH=

Hide Details

// Directory containing SPEC CPU2017 sourcecode TEST_SUITE_SPEC2017_ROOT:PATH=

Hide Details

// Directory containing SPEC CPU95 sourcecode TEST_SUITE_SPEC95_ROOT:PATH=

Hide Details

// Semicolon separated list of directories with CMakeLists.txt to include TEST_SUITE_SUBDIRS:STRING=Bitcode;External;MicroBenchmarks;MultiSource;SingleSource

Hide Details

// Suppress all warnings TEST_SUITE_SUPPRESS_WARNINGS:BOOL=ON

Hide Details

// RUN_UNDER is used to run tests under emulation. TEST_SUITE_USER_MODE_EMULATION:BOOL=NO

Hide Details

// Use IR PGO instrumentation (requires TEST_SUITE_PROFILE_GENERATE) TEST_SUITE_USE_IR_PGO:BOOL=OFF

Hide Details

// Use perf (timeit.sh) instead of timeit.c TEST_SUITE_USE_PERF:BOOL=OFF

Hide Details

// Path to a file. TK_INCLUDE_PATH:PATH=/System/Library/Frameworks/Tk.framework/Headers

Hide Details

// Path to a library. TK_LIBRARY:FILEPATH=/System/Library/Frameworks/tk.framework

Hide Details

// Path to a program. TK_WISH:FILEPATH=/usr/bin/wish

Hide Details

Import succeeded.

Hide Details

+ cp sandbox/build/test-results.xunit.xml . + echo @@@@@@ @@@@@@ [WARNINGS] Parsing warnings in console log with parser AcuCobol Compiler Skipping warnings blame since Git is the only supported SCM up to now.%n [WARNINGS] Computing warning deltas based on reference build #5344 [WARNINGS] Ignore new warnings since this is the first valid build [WARNINGS] Plug-in Result: Success - no threshold has been exceeded Recording test results Build step 'Publish JUnit test result report' changed build result to UNSTABLE [BFA] Scanning build for known causes... [BFA] Found failure cause(s): [BFA] Compile Error from category Compile [BFA] Link error [BFA] Regression test failed from category Test [BFA] Done. 2s Extended Email Publisher is currently disabled in project settings Finished: UNSTABLE