FailedConsole Output

Skipping 7,834 KB.. Full Log
anitizer-x86_64 :: sleep_sync2.cpp (3916 of 4806)
PASS: ThreadSanitizer-x86_64 :: simple_stack.c (3917 of 4806)
PASS: ThreadSanitizer-x86_64 :: stack_race.cpp (3918 of 4806)
PASS: ThreadSanitizer-x86_64 :: static_init1.cpp (3919 of 4806)
PASS: ThreadSanitizer-x86_64 :: stack_sync_reuse.cpp (3920 of 4806)
PASS: ThreadSanitizer-x86_64 :: stack_race2.cpp (3921 of 4806)
PASS: ThreadSanitizer-x86_64 :: static_init2.cpp (3922 of 4806)
PASS: ThreadSanitizer-x86_64 :: static_init4.cpp (3923 of 4806)
PASS: ThreadSanitizer-x86_64 :: static_init3.cpp (3924 of 4806)
UNSUPPORTED: ThreadSanitizer-x86_64 :: strerror_r.cpp (3925 of 4806)
UNSUPPORTED: ThreadSanitizer-x86_64 :: sunrpc.cpp (3926 of 4806)
PASS: ThreadSanitizer-x86_64 :: static_init5.cpp (3927 of 4806)
PASS: ThreadSanitizer-x86_64 :: static_init6.cpp (3928 of 4806)
PASS: ThreadSanitizer-x86_64 :: suppress_same_stacks.cpp (3929 of 4806)
PASS: ThreadSanitizer-x86_64 :: suppress_same_address.cpp (3930 of 4806)
PASS: ThreadSanitizer-x86_64 :: suppressions_global.cpp (3931 of 4806)
PASS: ThreadSanitizer-x86_64 :: suppressions_mutex.cpp (3932 of 4806)
PASS: ThreadSanitizer-x86_64 :: suppressions_race.cpp (3933 of 4806)
PASS: ThreadSanitizer-x86_64 :: suppressions_race2.cpp (3934 of 4806)
PASS: ThreadSanitizer-x86_64 :: thread_detach.c (3935 of 4806)
PASS: ThreadSanitizer-x86_64 :: thread_detach2.c (3936 of 4806)
PASS: ThreadSanitizer-x86_64 :: thread_end_with_ignore.cpp (3937 of 4806)
PASS: ThreadSanitizer-x86_64 :: thread_end_with_ignore2.cpp (3938 of 4806)
PASS: ThreadSanitizer-x86_64 :: thread_end_with_ignore3.cpp (3939 of 4806)
PASS: ThreadSanitizer-x86_64 :: thread_exit.c (3940 of 4806)
PASS: ThreadSanitizer-x86_64 :: thread_leak.c (3941 of 4806)
PASS: ThreadSanitizer-x86_64 :: thread_leak2.c (3942 of 4806)
PASS: ThreadSanitizer-x86_64 :: thread_leak4.c (3943 of 4806)
PASS: ThreadSanitizer-x86_64 :: thread_leak3.c (3944 of 4806)
UNSUPPORTED: ThreadSanitizer-x86_64 :: thread_name2.cpp (3945 of 4806)
PASS: ThreadSanitizer-x86_64 :: thread_leak5.c (3946 of 4806)
PASS: ThreadSanitizer-x86_64 :: thread_name.cpp (3947 of 4806)
PASS: ThreadSanitizer-x86_64 :: tiny_race.c (3948 of 4806)
PASS: ThreadSanitizer-x86_64 :: tls_race.cpp (3949 of 4806)
PASS: ThreadSanitizer-x86_64 :: tls_race2.cpp (3950 of 4806)
PASS: ThreadSanitizer-x86_64 :: unaligned_norace.cpp (3951 of 4806)
PASS: ThreadSanitizer-x86_64 :: tsan-vs-gvn.cpp (3952 of 4806)
PASS: ThreadSanitizer-x86_64 :: virtual_inheritance_compile_bug.cpp (3953 of 4806)
PASS: ThreadSanitizer-x86_64 :: vfork.cpp (3954 of 4806)
PASS: ThreadSanitizer-x86_64 :: vptr_benign_race.cpp (3955 of 4806)
PASS: ThreadSanitizer-x86_64 :: unaligned_race.cpp (3956 of 4806)
PASS: ThreadSanitizer-x86_64 :: vptr_harmful_race.cpp (3957 of 4806)
PASS: ThreadSanitizer-x86_64 :: vptr_harmful_race2.cpp (3958 of 4806)
PASS: ThreadSanitizer-x86_64 :: vptr_harmful_race3.cpp (3959 of 4806)
PASS: ThreadSanitizer-x86_64 :: vptr_harmful_race4.cpp (3960 of 4806)
PASS: ThreadSanitizer-x86_64 :: write_in_reader_lock.cpp (3961 of 4806)
PASS: UBSan-AddressSanitizer-i386 :: TestCases/Float/cast-overflow.cpp (3962 of 4806)
PASS: UBSan-AddressSanitizer-i386 :: TestCases/ImplicitConversion/integer-sign-change-blacklist.c (3963 of 4806)
PASS: UBSan-AddressSanitizer-i386 :: TestCases/ImplicitConversion/integer-sign-change-summary.cpp (3964 of 4806)
PASS: UBSan-AddressSanitizer-i386 :: TestCases/ImplicitConversion/integer-arithmetic-value-change.c (3965 of 4806)
PASS: UBSan-AddressSanitizer-i386 :: TestCases/ImplicitConversion/integer-conversion.c (3966 of 4806)
PASS: UBSan-AddressSanitizer-i386 :: TestCases/ImplicitConversion/integer-sign-change.c (3967 of 4806)
PASS: UBSan-AddressSanitizer-i386 :: TestCases/ImplicitConversion/integer-truncation.c (3968 of 4806)
PASS: UBSan-AddressSanitizer-i386 :: TestCases/ImplicitConversion/signed-integer-truncation-or-sign-change-summary.cpp (3969 of 4806)
PASS: UBSan-AddressSanitizer-i386 :: TestCases/ImplicitConversion/signed-integer-truncation-summary.cpp (3970 of 4806)
PASS: UBSan-AddressSanitizer-i386 :: TestCases/ImplicitConversion/signed-integer-truncation-blacklist.c (3971 of 4806)
PASS: UBSan-AddressSanitizer-i386 :: TestCases/ImplicitConversion/signed-integer-truncation-or-sign-change-blacklist.c (3972 of 4806)
PASS: UBSan-AddressSanitizer-i386 :: TestCases/ImplicitConversion/unsigned-integer-truncation-summary.cpp (3973 of 4806)
PASS: UBSan-AddressSanitizer-i386 :: TestCases/ImplicitConversion/signed-integer-truncation.c (3974 of 4806)
PASS: UBSan-AddressSanitizer-i386 :: TestCases/Integer/add-overflow.cpp (3975 of 4806)
PASS: UBSan-AddressSanitizer-i386 :: TestCases/Integer/div-overflow.cpp (3976 of 4806)
PASS: UBSan-AddressSanitizer-i386 :: TestCases/ImplicitConversion/unsigned-integer-truncation.c (3977 of 4806)
PASS: UBSan-AddressSanitizer-i386 :: TestCases/Integer/div-zero.cpp (3978 of 4806)
PASS: UBSan-AddressSanitizer-i386 :: TestCases/Integer/mul-overflow.cpp (3979 of 4806)
PASS: UBSan-AddressSanitizer-i386 :: TestCases/ImplicitConversion/unsigned-integer-truncation-blacklist.c (3980 of 4806)
PASS: UBSan-AddressSanitizer-i386 :: TestCases/Integer/incdec-overflow.cpp (3981 of 4806)
PASS: UBSan-AddressSanitizer-i386 :: TestCases/Integer/negate-overflow.cpp (3982 of 4806)
PASS: UBSan-AddressSanitizer-i386 :: TestCases/Integer/no-recover.cpp (3983 of 4806)
PASS: UBSan-AddressSanitizer-i386 :: TestCases/Integer/summary.cpp (3984 of 4806)
PASS: UBSan-AddressSanitizer-i386 :: TestCases/Integer/sub-overflow.cpp (3985 of 4806)
PASS: UBSan-AddressSanitizer-i386 :: TestCases/Integer/uadd-overflow.cpp (3986 of 4806)
PASS: UBSan-AddressSanitizer-i386 :: TestCases/Integer/suppressions.cpp (3987 of 4806)
PASS: UBSan-AddressSanitizer-i386 :: TestCases/Integer/umul-overflow.cpp (3988 of 4806)
PASS: UBSan-AddressSanitizer-i386 :: TestCases/Integer/uincdec-overflow.cpp (3989 of 4806)
UNSUPPORTED: UBSan-AddressSanitizer-i386 :: TestCases/Misc/Linux/print_stack_trace.cpp (3990 of 4806)
UNSUPPORTED: UBSan-AddressSanitizer-i386 :: TestCases/Misc/Linux/ubsan_options.cpp (3991 of 4806)
PASS: UBSan-AddressSanitizer-i386 :: TestCases/Misc/bool.cpp (3992 of 4806)
PASS: UBSan-AddressSanitizer-i386 :: TestCases/Integer/shift.cpp (3993 of 4806)
UNSUPPORTED: UBSan-AddressSanitizer-i386 :: TestCases/Misc/builtins.cpp (3994 of 4806)
PASS: UBSan-AddressSanitizer-i386 :: TestCases/Integer/usub-overflow.cpp (3995 of 4806)
PASS: UBSan-AddressSanitizer-i386 :: TestCases/Misc/deduplication.cpp (3996 of 4806)
PASS: UBSan-AddressSanitizer-i386 :: TestCases/Misc/bounds.cpp (3997 of 4806)
PASS: UBSan-AddressSanitizer-i386 :: TestCases/Misc/enum.cpp (3998 of 4806)
PASS: UBSan-AddressSanitizer-i386 :: TestCases/Misc/log-path_test.cpp (3999 of 4806)
PASS: UBSan-AddressSanitizer-i386 :: TestCases/Misc/coverage-levels.cpp (4000 of 4806)
UNSUPPORTED: UBSan-AddressSanitizer-i386 :: TestCases/Misc/no-interception.cpp (4001 of 4806)
PASS: UBSan-AddressSanitizer-i386 :: TestCases/Misc/monitor.cpp (4002 of 4806)
PASS: UBSan-AddressSanitizer-i386 :: TestCases/Misc/nonnull.cpp (4003 of 4806)
PASS: UBSan-AddressSanitizer-i386 :: TestCases/Misc/nonnull-arg.cpp (4004 of 4806)
PASS: UBSan-AddressSanitizer-i386 :: TestCases/Misc/missing_return.cpp (4005 of 4806)
PASS: UBSan-AddressSanitizer-i386 :: TestCases/Misc/print_summary.c (4006 of 4806)
PASS: UBSan-AddressSanitizer-i386 :: TestCases/Misc/nullability.c (4007 of 4806)
PASS: UBSan-AddressSanitizer-i386 :: TestCases/Misc/vla.c (4008 of 4806)
PASS: UBSan-AddressSanitizer-i386 :: TestCases/Misc/unreachable.cpp (4009 of 4806)
PASS: UBSan-AddressSanitizer-i386 :: TestCases/Pointer/alignment-assumption-attribute-align_value-on-paramvar.cpp (4010 of 4806)
PASS: UBSan-AddressSanitizer-i386 :: TestCases/Pointer/alignment-assumption-attribute-align_value-on-lvalue.cpp (4011 of 4806)
PASS: UBSan-AddressSanitizer-i386 :: TestCases/Pointer/alignment-assumption-attribute-alloc_align-on-function-variable.cpp (4012 of 4806)
PASS: UBSan-AddressSanitizer-i386 :: TestCases/Pointer/alignment-assumption-attribute-alloc_align-on-function.cpp (4013 of 4806)
PASS: UBSan-AddressSanitizer-i386 :: TestCases/Pointer/alignment-assumption-attribute-assume_aligned-on-function-two-params.cpp (4014 of 4806)
PASS: UBSan-AddressSanitizer-i386 :: TestCases/Pointer/alignment-assumption-attribute-assume_aligned-on-function.cpp (4015 of 4806)
PASS: UBSan-AddressSanitizer-i386 :: TestCases/Pointer/alignment-assumption-blacklist.cpp (4016 of 4806)
PASS: UBSan-AddressSanitizer-i386 :: TestCases/Pointer/alignment-assumption-builtin_assume_aligned-three-params.cpp (4017 of 4806)
PASS: UBSan-AddressSanitizer-i386 :: TestCases/Pointer/alignment-assumption-builtin_assume_aligned-three-params-variable.cpp (4018 of 4806)
PASS: UBSan-AddressSanitizer-i386 :: TestCases/Pointer/alignment-assumption-summary.cpp (4019 of 4806)
PASS: UBSan-AddressSanitizer-i386 :: TestCases/Pointer/alignment-assumption-builtin_assume_aligned-two-params.cpp (4020 of 4806)
PASS: UBSan-AddressSanitizer-i386 :: TestCases/Pointer/index-overflow.cpp (4021 of 4806)
PASS: UBSan-AddressSanitizer-i386 :: TestCases/Pointer/nullptr-and-nonzero-offset-summary.cpp (4022 of 4806)
PASS: UBSan-AddressSanitizer-i386 :: TestCases/Pointer/alignment-assumption-openmp.cpp (4023 of 4806)
PASS: UBSan-AddressSanitizer-i386 :: TestCases/Pointer/unsigned-index-expression.cpp (4024 of 4806)
UNSUPPORTED: UBSan-AddressSanitizer-i386 :: TestCases/TypeCheck/Function/function.cpp (4025 of 4806)
UNSUPPORTED: UBSan-AddressSanitizer-i386 :: TestCases/TypeCheck/Linux/PR33221.cpp (4026 of 4806)
PASS: UBSan-AddressSanitizer-i386 :: TestCases/TypeCheck/PR33221.cpp (4027 of 4806)
PASS: UBSan-AddressSanitizer-i386 :: TestCases/Pointer/nullptr-and-nonzero-offset-constants.cpp (4028 of 4806)
PASS: UBSan-AddressSanitizer-i386 :: TestCases/TypeCheck/null.cpp (4029 of 4806)
PASS: UBSan-AddressSanitizer-i386 :: TestCases/TypeCheck/vptr-corrupted-vtable-itanium.cpp (4030 of 4806)
PASS: UBSan-AddressSanitizer-i386 :: TestCases/Pointer/nullptr-and-nonzero-offset-variable.cpp (4031 of 4806)
PASS: UBSan-AddressSanitizer-i386 :: TestCases/TypeCheck/vptr-non-unique-typeinfo.cpp (4032 of 4806)
PASS: UBSan-AddressSanitizer-i386 :: TestCases/TypeCheck/vptr-virtual-base-construction.cpp (4033 of 4806)
PASS: UBSan-AddressSanitizer-i386 :: TestCases/TypeCheck/vptr-virtual-base.cpp (4034 of 4806)
PASS: UBSan-AddressSanitizer-i386 :: TestCases/TypeCheck/misaligned.cpp (4035 of 4806)
PASS: UBSan-AddressSanitizer-x86_64 :: TestCases/Float/cast-overflow.cpp (4036 of 4806)
PASS: UBSan-AddressSanitizer-x86_64 :: TestCases/ImplicitConversion/integer-arithmetic-value-change.c (4037 of 4806)
PASS: UBSan-AddressSanitizer-x86_64 :: TestCases/ImplicitConversion/integer-conversion.c (4038 of 4806)
PASS: UBSan-AddressSanitizer-x86_64 :: TestCases/ImplicitConversion/integer-sign-change-summary.cpp (4039 of 4806)
PASS: UBSan-AddressSanitizer-x86_64 :: TestCases/ImplicitConversion/integer-sign-change-blacklist.c (4040 of 4806)
PASS: UBSan-AddressSanitizer-i386 :: TestCases/TypeCheck/vptr.cpp (4041 of 4806)
PASS: UBSan-AddressSanitizer-x86_64 :: TestCases/ImplicitConversion/integer-sign-change.c (4042 of 4806)
PASS: UBSan-AddressSanitizer-x86_64 :: TestCases/ImplicitConversion/integer-truncation.c (4043 of 4806)
PASS: UBSan-AddressSanitizer-x86_64 :: TestCases/ImplicitConversion/signed-integer-truncation-or-sign-change-summary.cpp (4044 of 4806)
PASS: UBSan-AddressSanitizer-x86_64 :: TestCases/ImplicitConversion/signed-integer-truncation-summary.cpp (4045 of 4806)
PASS: UBSan-AddressSanitizer-x86_64 :: TestCases/ImplicitConversion/signed-integer-truncation-or-sign-change-blacklist.c (4046 of 4806)
PASS: UBSan-AddressSanitizer-x86_64 :: TestCases/ImplicitConversion/signed-integer-truncation-blacklist.c (4047 of 4806)
PASS: UBSan-AddressSanitizer-x86_64 :: TestCases/ImplicitConversion/unsigned-integer-truncation-summary.cpp (4048 of 4806)
PASS: UBSan-AddressSanitizer-x86_64 :: TestCases/ImplicitConversion/signed-integer-truncation.c (4049 of 4806)
PASS: UBSan-AddressSanitizer-x86_64 :: TestCases/Integer/add-overflow.cpp (4050 of 4806)
PASS: UBSan-AddressSanitizer-x86_64 :: TestCases/Integer/div-overflow.cpp (4051 of 4806)
PASS: UBSan-AddressSanitizer-x86_64 :: TestCases/Integer/div-zero.cpp (4052 of 4806)
PASS: UBSan-AddressSanitizer-x86_64 :: TestCases/Integer/incdec-overflow.cpp (4053 of 4806)
PASS: UBSan-AddressSanitizer-x86_64 :: TestCases/Integer/mul-overflow.cpp (4054 of 4806)
PASS: UBSan-AddressSanitizer-x86_64 :: TestCases/ImplicitConversion/unsigned-integer-truncation.c (4055 of 4806)
PASS: UBSan-AddressSanitizer-x86_64 :: TestCases/Integer/negate-overflow.cpp (4056 of 4806)
PASS: UBSan-AddressSanitizer-x86_64 :: TestCases/Integer/no-recover.cpp (4057 of 4806)
PASS: UBSan-AddressSanitizer-x86_64 :: TestCases/ImplicitConversion/unsigned-integer-truncation-blacklist.c (4058 of 4806)
PASS: UBSan-AddressSanitizer-x86_64 :: TestCases/Integer/sub-overflow.cpp (4059 of 4806)
PASS: UBSan-AddressSanitizer-x86_64 :: TestCases/Integer/summary.cpp (4060 of 4806)
PASS: UBSan-AddressSanitizer-x86_64 :: TestCases/Integer/uadd-overflow.cpp (4061 of 4806)
PASS: UBSan-AddressSanitizer-x86_64 :: TestCases/Integer/suppressions.cpp (4062 of 4806)
PASS: UBSan-AddressSanitizer-x86_64 :: TestCases/Integer/uincdec-overflow.cpp (4063 of 4806)
PASS: UBSan-AddressSanitizer-x86_64 :: TestCases/Integer/umul-overflow.cpp (4064 of 4806)
UNSUPPORTED: UBSan-AddressSanitizer-x86_64 :: TestCases/Misc/Linux/print_stack_trace.cpp (4065 of 4806)
UNSUPPORTED: UBSan-AddressSanitizer-x86_64 :: TestCases/Misc/Linux/ubsan_options.cpp (4066 of 4806)
PASS: UBSan-AddressSanitizer-x86_64 :: TestCases/Integer/shift.cpp (4067 of 4806)
PASS: UBSan-AddressSanitizer-x86_64 :: TestCases/Misc/bool.cpp (4068 of 4806)
PASS: UBSan-AddressSanitizer-x86_64 :: TestCases/Integer/usub-overflow.cpp (4069 of 4806)
PASS: UBSan-AddressSanitizer-x86_64 :: TestCases/Misc/builtins.cpp (4070 of 4806)
PASS: UBSan-AddressSanitizer-x86_64 :: TestCases/Misc/bounds.cpp (4071 of 4806)
PASS: UBSan-AddressSanitizer-x86_64 :: TestCases/Misc/deduplication.cpp (4072 of 4806)
PASS: UBSan-AddressSanitizer-x86_64 :: TestCases/Misc/enum.cpp (4073 of 4806)
PASS: UBSan-AddressSanitizer-x86_64 :: TestCases/Misc/log-path_test.cpp (4074 of 4806)
PASS: UBSan-AddressSanitizer-x86_64 :: TestCases/Misc/coverage-levels.cpp (4075 of 4806)
UNSUPPORTED: UBSan-AddressSanitizer-x86_64 :: TestCases/Misc/no-interception.cpp (4076 of 4806)
PASS: UBSan-AddressSanitizer-x86_64 :: TestCases/Misc/monitor.cpp (4077 of 4806)
PASS: UBSan-AddressSanitizer-x86_64 :: TestCases/Misc/nonnull.cpp (4078 of 4806)
PASS: UBSan-AddressSanitizer-x86_64 :: TestCases/Misc/missing_return.cpp (4079 of 4806)
PASS: UBSan-AddressSanitizer-x86_64 :: TestCases/Misc/print_summary.c (4080 of 4806)
PASS: UBSan-AddressSanitizer-x86_64 :: TestCases/Misc/nullability.c (4081 of 4806)
PASS: UBSan-AddressSanitizer-x86_64 :: TestCases/Misc/nonnull-arg.cpp (4082 of 4806)
PASS: UBSan-AddressSanitizer-x86_64 :: TestCases/Misc/vla.c (4083 of 4806)
PASS: UBSan-AddressSanitizer-x86_64 :: TestCases/Misc/unreachable.cpp (4084 of 4806)
PASS: UBSan-AddressSanitizer-x86_64 :: TestCases/Pointer/alignment-assumption-attribute-align_value-on-lvalue.cpp (4085 of 4806)
PASS: UBSan-AddressSanitizer-x86_64 :: TestCases/Pointer/alignment-assumption-attribute-align_value-on-paramvar.cpp (4086 of 4806)
PASS: UBSan-AddressSanitizer-x86_64 :: TestCases/Pointer/alignment-assumption-attribute-alloc_align-on-function-variable.cpp (4087 of 4806)
PASS: UBSan-AddressSanitizer-x86_64 :: TestCases/Pointer/alignment-assumption-attribute-alloc_align-on-function.cpp (4088 of 4806)
PASS: UBSan-AddressSanitizer-x86_64 :: TestCases/Pointer/alignment-assumption-attribute-assume_aligned-on-function-two-params.cpp (4089 of 4806)
PASS: UBSan-AddressSanitizer-x86_64 :: TestCases/Pointer/alignment-assumption-attribute-assume_aligned-on-function.cpp (4090 of 4806)
PASS: UBSan-AddressSanitizer-x86_64 :: TestCases/Pointer/alignment-assumption-blacklist.cpp (4091 of 4806)
PASS: UBSan-AddressSanitizer-x86_64 :: TestCases/Pointer/alignment-assumption-builtin_assume_aligned-three-params-variable.cpp (4092 of 4806)
PASS: UBSan-AddressSanitizer-x86_64 :: TestCases/Pointer/alignment-assumption-builtin_assume_aligned-three-params.cpp (4093 of 4806)
PASS: UBSan-AddressSanitizer-x86_64 :: TestCases/Pointer/alignment-assumption-summary.cpp (4094 of 4806)
PASS: UBSan-AddressSanitizer-x86_64 :: TestCases/Pointer/alignment-assumption-builtin_assume_aligned-two-params.cpp (4095 of 4806)
PASS: UBSan-AddressSanitizer-x86_64 :: TestCases/Pointer/index-overflow.cpp (4096 of 4806)
PASS: UBSan-AddressSanitizer-x86_64 :: TestCases/Pointer/nullptr-and-nonzero-offset-summary.cpp (4097 of 4806)
PASS: UBSan-AddressSanitizer-x86_64 :: TestCases/Pointer/alignment-assumption-openmp.cpp (4098 of 4806)
PASS: UBSan-AddressSanitizer-x86_64 :: TestCases/Pointer/unsigned-index-expression.cpp (4099 of 4806)
PASS: UBSan-AddressSanitizer-x86_64 :: TestCases/Pointer/nullptr-and-nonzero-offset-constants.cpp (4100 of 4806)
UNSUPPORTED: UBSan-AddressSanitizer-x86_64 :: TestCases/TypeCheck/Linux/PR33221.cpp (4101 of 4806)
PASS: UBSan-AddressSanitizer-x86_64 :: TestCases/TypeCheck/PR33221.cpp (4102 of 4806)
PASS: UBSan-AddressSanitizer-x86_64 :: TestCases/Pointer/nullptr-and-nonzero-offset-variable.cpp (4103 of 4806)
PASS: UBSan-AddressSanitizer-x86_64 :: TestCases/TypeCheck/Function/function.cpp (4104 of 4806)
PASS: UBSan-Minimal-x86_64 :: TestCases/alignment-assumption.c (4105 of 4806)
PASS: UBSan-Minimal-x86_64 :: TestCases/alignment-assumption.c (4106 of 4806)
PASS: UBSan-Minimal-x86_64 :: TestCases/implicit-integer-sign-change.c (4107 of 4806)
PASS: UBSan-AddressSanitizer-x86_64 :: TestCases/TypeCheck/null.cpp (4108 of 4806)
PASS: UBSan-Minimal-x86_64 :: TestCases/implicit-integer-sign-change.c (4109 of 4806)
PASS: UBSan-Minimal-x86_64 :: TestCases/implicit-signed-integer-truncation-or-sign-change.c (4110 of 4806)
PASS: UBSan-AddressSanitizer-x86_64 :: TestCases/TypeCheck/misaligned.cpp (4111 of 4806)
PASS: UBSan-Minimal-x86_64 :: TestCases/implicit-signed-integer-truncation-or-sign-change.c (4112 of 4806)
PASS: UBSan-AddressSanitizer-x86_64 :: TestCases/TypeCheck/vptr-corrupted-vtable-itanium.cpp (4113 of 4806)
PASS: UBSan-Minimal-x86_64 :: TestCases/implicit-signed-integer-truncation.c (4114 of 4806)
PASS: UBSan-Minimal-x86_64 :: TestCases/implicit-signed-integer-truncation.c (4115 of 4806)
PASS: UBSan-Minimal-x86_64 :: TestCases/implicit-unsigned-integer-truncation.c (4116 of 4806)
PASS: UBSan-Minimal-x86_64 :: TestCases/implicit-unsigned-integer-truncation.c (4117 of 4806)
PASS: UBSan-AddressSanitizer-x86_64 :: TestCases/TypeCheck/vptr-virtual-base-construction.cpp (4118 of 4806)
PASS: UBSan-AddressSanitizer-x86_64 :: TestCases/TypeCheck/vptr-non-unique-typeinfo.cpp (4119 of 4806)
PASS: UBSan-Minimal-x86_64 :: TestCases/recover-dedup-limit.cpp (4120 of 4806)
PASS: UBSan-Minimal-x86_64 :: TestCases/recover-dedup-limit.cpp (4121 of 4806)
PASS: UBSan-AddressSanitizer-x86_64 :: TestCases/TypeCheck/vptr-virtual-base.cpp (4122 of 4806)
PASS: UBSan-Minimal-x86_64 :: TestCases/test-darwin-interface.c (4123 of 4806)
PASS: UBSan-Minimal-x86_64 :: TestCases/test-darwin-interface.c (4124 of 4806)
PASS: UBSan-Minimal-x86_64 :: TestCases/recover-dedup.cpp (4125 of 4806)
PASS: UBSan-Minimal-x86_64 :: TestCases/recover-dedup.cpp (4126 of 4806)
PASS: UBSan-Minimal-x86_64 :: TestCases/uadd-overflow.cpp (4127 of 4806)
PASS: UBSan-Minimal-x86_64 :: TestCases/uadd-overflow.cpp (4128 of 4806)
UNSUPPORTED: UBSan-Standalone-i386 :: TestCases/ImplicitConversion/integer-sign-change-summary.cpp (4129 of 4806)
PASS: UBSan-Standalone-i386 :: TestCases/Float/cast-overflow.cpp (4130 of 4806)
PASS: UBSan-Minimal-x86_64 :: TestCases/nullptr-and-nonzero-offset.c (4131 of 4806)
PASS: UBSan-Minimal-x86_64 :: TestCases/nullptr-and-nonzero-offset.c (4132 of 4806)
PASS: UBSan-Standalone-i386 :: TestCases/ImplicitConversion/integer-sign-change-blacklist.c (4133 of 4806)
UNSUPPORTED: UBSan-Standalone-i386 :: TestCases/ImplicitConversion/signed-integer-truncation-or-sign-change-summary.cpp (4134 of 4806)
UNSUPPORTED: UBSan-Standalone-i386 :: TestCases/ImplicitConversion/signed-integer-truncation-summary.cpp (4135 of 4806)
PASS: UBSan-Standalone-i386 :: TestCases/ImplicitConversion/integer-truncation.c (4136 of 4806)
PASS: UBSan-Standalone-i386 :: TestCases/ImplicitConversion/signed-integer-truncation-or-sign-change-blacklist.c (4137 of 4806)
UNSUPPORTED: UBSan-Standalone-i386 :: TestCases/ImplicitConversion/unsigned-integer-truncation-summary.cpp (4138 of 4806)
PASS: UBSan-Standalone-i386 :: TestCases/ImplicitConversion/integer-sign-change.c (4139 of 4806)
PASS: UBSan-Standalone-i386 :: TestCases/ImplicitConversion/integer-arithmetic-value-change.c (4140 of 4806)
PASS: UBSan-Standalone-i386 :: TestCases/ImplicitConversion/integer-conversion.c (4141 of 4806)
PASS: UBSan-Standalone-i386 :: TestCases/ImplicitConversion/signed-integer-truncation-blacklist.c (4142 of 4806)
PASS: UBSan-Standalone-i386 :: TestCases/Integer/div-overflow.cpp (4143 of 4806)
PASS: UBSan-Standalone-i386 :: TestCases/Integer/mul-overflow.cpp (4144 of 4806)
PASS: UBSan-Standalone-i386 :: TestCases/Integer/add-overflow.cpp (4145 of 4806)
PASS: UBSan-Standalone-i386 :: TestCases/Integer/div-zero.cpp (4146 of 4806)
PASS: UBSan-Standalone-i386 :: TestCases/ImplicitConversion/signed-integer-truncation.c (4147 of 4806)
PASS: UBSan-Standalone-i386 :: TestCases/Integer/incdec-overflow.cpp (4148 of 4806)
UNSUPPORTED: UBSan-Standalone-i386 :: TestCases/Integer/summary.cpp (4149 of 4806)
PASS: UBSan-Standalone-i386 :: TestCases/Integer/negate-overflow.cpp (4150 of 4806)
PASS: UBSan-Standalone-i386 :: TestCases/Integer/no-recover.cpp (4151 of 4806)
PASS: UBSan-Standalone-i386 :: TestCases/Integer/sub-overflow.cpp (4152 of 4806)
PASS: UBSan-Standalone-i386 :: TestCases/Integer/uadd-overflow.cpp (4153 of 4806)
PASS: UBSan-Standalone-i386 :: TestCases/Integer/umul-overflow.cpp (4154 of 4806)
UNSUPPORTED: UBSan-Standalone-i386 :: TestCases/Misc/Linux/print_stack_trace.cpp (4155 of 4806)
UNSUPPORTED: UBSan-Standalone-i386 :: TestCases/Misc/Linux/ubsan_options.cpp (4156 of 4806)
PASS: UBSan-Standalone-i386 :: TestCases/Integer/uincdec-overflow.cpp (4157 of 4806)
PASS: UBSan-Standalone-i386 :: TestCases/Misc/bool.cpp (4158 of 4806)
UNSUPPORTED: UBSan-Standalone-i386 :: TestCases/Misc/builtins.cpp (4159 of 4806)
PASS: UBSan-Standalone-i386 :: TestCases/Misc/bounds.cpp (4160 of 4806)
PASS: UBSan-Standalone-i386 :: TestCases/Integer/usub-overflow.cpp (4161 of 4806)
PASS: UBSan-Standalone-i386 :: TestCases/Misc/deduplication.cpp (4162 of 4806)
PASS: UBSan-Standalone-i386 :: TestCases/Integer/suppressions.cpp (4163 of 4806)
PASS: UBSan-Standalone-i386 :: TestCases/Misc/enum.cpp (4164 of 4806)
PASS: UBSan-Standalone-i386 :: TestCases/ImplicitConversion/unsigned-integer-truncation.c (4165 of 4806)
UNSUPPORTED: UBSan-Standalone-i386 :: TestCases/Misc/no-interception.cpp (4166 of 4806)
PASS: UBSan-Standalone-i386 :: TestCases/Misc/monitor.cpp (4167 of 4806)
PASS: UBSan-Standalone-i386 :: TestCases/Misc/coverage-levels.cpp (4168 of 4806)
PASS: UBSan-Standalone-i386 :: TestCases/Misc/log-path_test.cpp (4169 of 4806)
PASS: UBSan-Standalone-i386 :: TestCases/Misc/nonnull-arg.cpp (4170 of 4806)
PASS: UBSan-Standalone-i386 :: TestCases/Integer/shift.cpp (4171 of 4806)
PASS: UBSan-Standalone-i386 :: TestCases/Misc/print_summary.c (4172 of 4806)
PASS: UBSan-Standalone-i386 :: TestCases/Misc/nullability.c (4173 of 4806)
PASS: UBSan-Standalone-i386 :: TestCases/Misc/nonnull.cpp (4174 of 4806)
PASS: UBSan-Standalone-i386 :: TestCases/Misc/vla.c (4175 of 4806)
PASS: UBSan-Standalone-i386 :: TestCases/Misc/unreachable.cpp (4176 of 4806)
PASS: UBSan-Standalone-i386 :: TestCases/ImplicitConversion/unsigned-integer-truncation-blacklist.c (4177 of 4806)
PASS: UBSan-Standalone-i386 :: TestCases/Misc/missing_return.cpp (4178 of 4806)
PASS: UBSan-Standalone-i386 :: TestCases/Pointer/alignment-assumption-blacklist.cpp (4179 of 4806)
PASS: UBSan-Standalone-i386 :: TestCases/Pointer/alignment-assumption-attribute-align_value-on-paramvar.cpp (4180 of 4806)
PASS: UBSan-Standalone-i386 :: TestCases/Pointer/alignment-assumption-attribute-alloc_align-on-function-variable.cpp (4181 of 4806)
PASS: UBSan-Standalone-i386 :: TestCases/Pointer/alignment-assumption-attribute-align_value-on-lvalue.cpp (4182 of 4806)
PASS: UBSan-Standalone-i386 :: TestCases/Pointer/alignment-assumption-attribute-alloc_align-on-function.cpp (4183 of 4806)
UNSUPPORTED: UBSan-Standalone-i386 :: TestCases/Pointer/alignment-assumption-summary.cpp (4184 of 4806)
PASS: UBSan-Standalone-i386 :: TestCases/Pointer/alignment-assumption-attribute-assume_aligned-on-function-two-params.cpp (4185 of 4806)
PASS: UBSan-Standalone-i386 :: TestCases/Pointer/alignment-assumption-attribute-assume_aligned-on-function.cpp (4186 of 4806)
UNSUPPORTED: UBSan-Standalone-i386 :: TestCases/Pointer/nullptr-and-nonzero-offset-summary.cpp (4187 of 4806)
PASS: UBSan-Standalone-i386 :: TestCases/Pointer/index-overflow.cpp (4188 of 4806)
PASS: UBSan-Standalone-i386 :: TestCases/Pointer/unsigned-index-expression.cpp (4189 of 4806)
UNSUPPORTED: UBSan-Standalone-i386 :: TestCases/TypeCheck/Function/function.cpp (4190 of 4806)
UNSUPPORTED: UBSan-Standalone-i386 :: TestCases/TypeCheck/Linux/PR33221.cpp (4191 of 4806)
PASS: UBSan-Standalone-i386 :: TestCases/TypeCheck/PR33221.cpp (4192 of 4806)
PASS: UBSan-Standalone-i386 :: TestCases/Pointer/alignment-assumption-builtin_assume_aligned-three-params-variable.cpp (4193 of 4806)
PASS: UBSan-Standalone-i386 :: TestCases/TypeCheck/null.cpp (4194 of 4806)
PASS: UBSan-Standalone-i386 :: TestCases/TypeCheck/vptr-corrupted-vtable-itanium.cpp (4195 of 4806)
PASS: UBSan-Standalone-i386 :: TestCases/TypeCheck/vptr-non-unique-typeinfo.cpp (4196 of 4806)
PASS: UBSan-Standalone-i386 :: TestCases/Pointer/alignment-assumption-builtin_assume_aligned-three-params.cpp (4197 of 4806)
PASS: UBSan-Standalone-i386 :: TestCases/Pointer/alignment-assumption-builtin_assume_aligned-two-params.cpp (4198 of 4806)
PASS: UBSan-Standalone-i386 :: TestCases/TypeCheck/vptr-virtual-base-construction.cpp (4199 of 4806)
PASS: UBSan-Standalone-i386 :: TestCases/Pointer/alignment-assumption-openmp.cpp (4200 of 4806)
PASS: UBSan-Standalone-i386 :: TestCases/Pointer/nullptr-and-nonzero-offset-constants.cpp (4201 of 4806)
PASS: UBSan-Standalone-i386 :: TestCases/TypeCheck/vptr-virtual-base.cpp (4202 of 4806)
PASS: UBSan-Standalone-x86_64 :: TestCases/Float/cast-overflow.cpp (4203 of 4806)
UNSUPPORTED: UBSan-Standalone-x86_64 :: TestCases/ImplicitConversion/integer-sign-change-summary.cpp (4204 of 4806)
PASS: UBSan-Standalone-i386 :: TestCases/Pointer/nullptr-and-nonzero-offset-variable.cpp (4205 of 4806)
PASS: UBSan-Standalone-i386 :: TestCases/TypeCheck/misaligned.cpp (4206 of 4806)
PASS: UBSan-Standalone-x86_64 :: TestCases/ImplicitConversion/integer-sign-change-blacklist.c (4207 of 4806)
PASS: UBSan-AddressSanitizer-x86_64 :: TestCases/TypeCheck/vptr.cpp (4208 of 4806)
UNSUPPORTED: UBSan-Standalone-x86_64 :: TestCases/ImplicitConversion/signed-integer-truncation-or-sign-change-summary.cpp (4209 of 4806)
UNSUPPORTED: UBSan-Standalone-x86_64 :: TestCases/ImplicitConversion/signed-integer-truncation-summary.cpp (4210 of 4806)
PASS: UBSan-Standalone-x86_64 :: TestCases/ImplicitConversion/integer-truncation.c (4211 of 4806)
PASS: UBSan-Standalone-x86_64 :: TestCases/ImplicitConversion/integer-sign-change.c (4212 of 4806)
UNSUPPORTED: UBSan-Standalone-x86_64 :: TestCases/ImplicitConversion/unsigned-integer-truncation-summary.cpp (4213 of 4806)
PASS: UBSan-Standalone-x86_64 :: TestCases/ImplicitConversion/integer-arithmetic-value-change.c (4214 of 4806)
PASS: UBSan-Standalone-x86_64 :: TestCases/ImplicitConversion/integer-conversion.c (4215 of 4806)
PASS: UBSan-Standalone-x86_64 :: TestCases/Integer/div-overflow.cpp (4216 of 4806)
PASS: UBSan-Standalone-x86_64 :: TestCases/ImplicitConversion/signed-integer-truncation-blacklist.c (4217 of 4806)
PASS: UBSan-Standalone-x86_64 :: TestCases/Integer/add-overflow.cpp (4218 of 4806)
PASS: UBSan-Standalone-x86_64 :: TestCases/Integer/mul-overflow.cpp (4219 of 4806)
PASS: UBSan-Standalone-x86_64 :: TestCases/ImplicitConversion/signed-integer-truncation-or-sign-change-blacklist.c (4220 of 4806)
PASS: UBSan-Standalone-x86_64 :: TestCases/Integer/div-zero.cpp (4221 of 4806)
PASS: UBSan-Standalone-x86_64 :: TestCases/Integer/incdec-overflow.cpp (4222 of 4806)
PASS: UBSan-Standalone-x86_64 :: TestCases/Integer/negate-overflow.cpp (4223 of 4806)
UNSUPPORTED: UBSan-Standalone-x86_64 :: TestCases/Integer/summary.cpp (4224 of 4806)
PASS: UBSan-Standalone-x86_64 :: TestCases/Integer/no-recover.cpp (4225 of 4806)
PASS: UBSan-Standalone-x86_64 :: TestCases/Integer/sub-overflow.cpp (4226 of 4806)
PASS: UBSan-Standalone-x86_64 :: TestCases/Integer/uadd-overflow.cpp (4227 of 4806)
PASS: UBSan-Standalone-x86_64 :: TestCases/Integer/umul-overflow.cpp (4228 of 4806)
PASS: UBSan-Standalone-x86_64 :: TestCases/Integer/uincdec-overflow.cpp (4229 of 4806)
UNSUPPORTED: UBSan-Standalone-x86_64 :: TestCases/Misc/Linux/print_stack_trace.cpp (4230 of 4806)
UNSUPPORTED: UBSan-Standalone-x86_64 :: TestCases/Misc/Linux/ubsan_options.cpp (4231 of 4806)
PASS: UBSan-Standalone-x86_64 :: TestCases/Misc/bool.cpp (4232 of 4806)
PASS: UBSan-Standalone-x86_64 :: TestCases/ImplicitConversion/unsigned-integer-truncation.c (4233 of 4806)
PASS: UBSan-Standalone-x86_64 :: TestCases/Integer/suppressions.cpp (4234 of 4806)
PASS: UBSan-Standalone-x86_64 :: TestCases/Integer/usub-overflow.cpp (4235 of 4806)
PASS: UBSan-Standalone-x86_64 :: TestCases/Misc/bounds.cpp (4236 of 4806)
PASS: UBSan-Standalone-x86_64 :: TestCases/ImplicitConversion/signed-integer-truncation.c (4237 of 4806)
PASS: UBSan-Standalone-x86_64 :: TestCases/Misc/deduplication.cpp (4238 of 4806)
PASS: UBSan-Standalone-x86_64 :: TestCases/Integer/shift.cpp (4239 of 4806)
PASS: UBSan-Standalone-x86_64 :: TestCases/Misc/builtins.cpp (4240 of 4806)
UNSUPPORTED: UBSan-Standalone-x86_64 :: TestCases/Misc/no-interception.cpp (4241 of 4806)
PASS: UBSan-Standalone-x86_64 :: TestCases/Misc/enum.cpp (4242 of 4806)
PASS: UBSan-Standalone-x86_64 :: TestCases/Misc/log-path_test.cpp (4243 of 4806)
PASS: UBSan-Standalone-x86_64 :: TestCases/ImplicitConversion/unsigned-integer-truncation-blacklist.c (4244 of 4806)
PASS: UBSan-Standalone-x86_64 :: TestCases/Misc/monitor.cpp (4245 of 4806)
PASS: UBSan-Standalone-x86_64 :: TestCases/Misc/nonnull-arg.cpp (4246 of 4806)
PASS: UBSan-Standalone-x86_64 :: TestCases/Misc/nullability.c (4247 of 4806)
PASS: UBSan-Standalone-x86_64 :: TestCases/Misc/print_summary.c (4248 of 4806)
PASS: UBSan-Standalone-x86_64 :: TestCases/Misc/nonnull.cpp (4249 of 4806)
PASS: UBSan-Standalone-x86_64 :: TestCases/Misc/coverage-levels.cpp (4250 of 4806)
PASS: UBSan-Standalone-x86_64 :: TestCases/Misc/vla.c (4251 of 4806)
PASS: UBSan-Standalone-x86_64 :: TestCases/Misc/unreachable.cpp (4252 of 4806)
PASS: UBSan-Standalone-x86_64 :: TestCases/Misc/missing_return.cpp (4253 of 4806)
PASS: UBSan-Standalone-x86_64 :: TestCases/Pointer/alignment-assumption-blacklist.cpp (4254 of 4806)
PASS: UBSan-Standalone-x86_64 :: TestCases/Pointer/alignment-assumption-attribute-align_value-on-paramvar.cpp (4255 of 4806)
PASS: UBSan-Standalone-x86_64 :: TestCases/Pointer/alignment-assumption-attribute-alloc_align-on-function-variable.cpp (4256 of 4806)
PASS: UBSan-Standalone-x86_64 :: TestCases/Pointer/alignment-assumption-attribute-align_value-on-lvalue.cpp (4257 of 4806)
PASS: UBSan-Standalone-x86_64 :: TestCases/Pointer/alignment-assumption-attribute-assume_aligned-on-function-two-params.cpp (4258 of 4806)
UNSUPPORTED: UBSan-Standalone-x86_64 :: TestCases/Pointer/alignment-assumption-summary.cpp (4259 of 4806)
PASS: UBSan-Standalone-x86_64 :: TestCases/Pointer/alignment-assumption-attribute-alloc_align-on-function.cpp (4260 of 4806)
PASS: UBSan-Standalone-x86_64 :: TestCases/Pointer/alignment-assumption-attribute-assume_aligned-on-function.cpp (4261 of 4806)
UNSUPPORTED: UBSan-Standalone-x86_64 :: TestCases/Pointer/nullptr-and-nonzero-offset-summary.cpp (4262 of 4806)
PASS: UBSan-Standalone-x86_64 :: TestCases/Pointer/index-overflow.cpp (4263 of 4806)
PASS: UBSan-Standalone-x86_64 :: TestCases/Pointer/unsigned-index-expression.cpp (4264 of 4806)
PASS: UBSan-Standalone-x86_64 :: TestCases/Pointer/alignment-assumption-builtin_assume_aligned-three-params-variable.cpp (4265 of 4806)
UNSUPPORTED: UBSan-Standalone-x86_64 :: TestCases/TypeCheck/Linux/PR33221.cpp (4266 of 4806)
PASS: UBSan-Standalone-x86_64 :: TestCases/TypeCheck/PR33221.cpp (4267 of 4806)
PASS: UBSan-Standalone-i386 :: TestCases/TypeCheck/vptr.cpp (4268 of 4806)
PASS: UBSan-Standalone-x86_64 :: TestCases/TypeCheck/null.cpp (4269 of 4806)
PASS: UBSan-Standalone-x86_64 :: TestCases/TypeCheck/vptr-corrupted-vtable-itanium.cpp (4270 of 4806)
PASS: UBSan-Standalone-x86_64 :: TestCases/Pointer/alignment-assumption-builtin_assume_aligned-two-params.cpp (4271 of 4806)
PASS: UBSan-Standalone-x86_64 :: TestCases/Pointer/nullptr-and-nonzero-offset-constants.cpp (4272 of 4806)
PASS: UBSan-Standalone-x86_64 :: TestCases/Pointer/alignment-assumption-builtin_assume_aligned-three-params.cpp (4273 of 4806)
PASS: UBSan-Standalone-x86_64 :: TestCases/Pointer/alignment-assumption-openmp.cpp (4274 of 4806)
PASS: UBSan-Standalone-x86_64 :: TestCases/TypeCheck/vptr-virtual-base-construction.cpp (4275 of 4806)
PASS: UBSan-Standalone-x86_64 :: TestCases/TypeCheck/vptr-non-unique-typeinfo.cpp (4276 of 4806)
PASS: UBSan-Standalone-x86_64 :: TestCases/TypeCheck/vptr-virtual-base.cpp (4277 of 4806)
PASS: UBSan-Standalone-x86_64 :: TestCases/Pointer/nullptr-and-nonzero-offset-variable.cpp (4278 of 4806)
UNSUPPORTED: UBSan-StandaloneStatic-i386 :: TestCases/ImplicitConversion/integer-sign-change-summary.cpp (4279 of 4806)
PASS: UBSan-StandaloneStatic-i386 :: TestCases/Float/cast-overflow.cpp (4280 of 4806)
PASS: UBSan-Standalone-x86_64 :: TestCases/TypeCheck/misaligned.cpp (4281 of 4806)
PASS: UBSan-StandaloneStatic-i386 :: TestCases/ImplicitConversion/integer-sign-change-blacklist.c (4282 of 4806)
PASS: UBSan-Standalone-x86_64 :: TestCases/TypeCheck/Function/function.cpp (4283 of 4806)
UNSUPPORTED: UBSan-StandaloneStatic-i386 :: TestCases/ImplicitConversion/signed-integer-truncation-or-sign-change-summary.cpp (4284 of 4806)
UNSUPPORTED: UBSan-StandaloneStatic-i386 :: TestCases/ImplicitConversion/signed-integer-truncation-summary.cpp (4285 of 4806)
PASS: UBSan-StandaloneStatic-i386 :: TestCases/ImplicitConversion/integer-truncation.c (4286 of 4806)
PASS: UBSan-StandaloneStatic-i386 :: TestCases/ImplicitConversion/integer-sign-change.c (4287 of 4806)
UNSUPPORTED: UBSan-StandaloneStatic-i386 :: TestCases/ImplicitConversion/unsigned-integer-truncation-summary.cpp (4288 of 4806)
PASS: UBSan-StandaloneStatic-i386 :: TestCases/ImplicitConversion/integer-arithmetic-value-change.c (4289 of 4806)
PASS: UBSan-StandaloneStatic-i386 :: TestCases/ImplicitConversion/integer-conversion.c (4290 of 4806)
PASS: UBSan-StandaloneStatic-i386 :: TestCases/Integer/div-overflow.cpp (4291 of 4806)
PASS: UBSan-StandaloneStatic-i386 :: TestCases/ImplicitConversion/signed-integer-truncation-blacklist.c (4292 of 4806)
PASS: UBSan-StandaloneStatic-i386 :: TestCases/Integer/add-overflow.cpp (4293 of 4806)
PASS: UBSan-StandaloneStatic-i386 :: TestCases/Integer/mul-overflow.cpp (4294 of 4806)
PASS: UBSan-StandaloneStatic-i386 :: TestCases/Integer/div-zero.cpp (4295 of 4806)
PASS: UBSan-StandaloneStatic-i386 :: TestCases/ImplicitConversion/signed-integer-truncation-or-sign-change-blacklist.c (4296 of 4806)
PASS: UBSan-StandaloneStatic-i386 :: TestCases/Integer/incdec-overflow.cpp (4297 of 4806)
PASS: UBSan-StandaloneStatic-i386 :: TestCases/Integer/negate-overflow.cpp (4298 of 4806)
UNSUPPORTED: UBSan-StandaloneStatic-i386 :: TestCases/Integer/summary.cpp (4299 of 4806)
PASS: UBSan-StandaloneStatic-i386 :: TestCases/Integer/no-recover.cpp (4300 of 4806)
PASS: UBSan-StandaloneStatic-i386 :: TestCases/Integer/sub-overflow.cpp (4301 of 4806)
PASS: UBSan-StandaloneStatic-i386 :: TestCases/ImplicitConversion/signed-integer-truncation.c (4302 of 4806)
PASS: UBSan-StandaloneStatic-i386 :: TestCases/Integer/umul-overflow.cpp (4303 of 4806)
PASS: UBSan-StandaloneStatic-i386 :: TestCases/Integer/uadd-overflow.cpp (4304 of 4806)
UNSUPPORTED: UBSan-StandaloneStatic-i386 :: TestCases/Misc/Linux/print_stack_trace.cpp (4305 of 4806)
UNSUPPORTED: UBSan-StandaloneStatic-i386 :: TestCases/Misc/Linux/ubsan_options.cpp (4306 of 4806)
PASS: UBSan-StandaloneStatic-i386 :: TestCases/Misc/bool.cpp (4307 of 4806)
PASS: UBSan-StandaloneStatic-i386 :: TestCases/Integer/uincdec-overflow.cpp (4308 of 4806)
UNSUPPORTED: UBSan-StandaloneStatic-i386 :: TestCases/Misc/builtins.cpp (4309 of 4806)
UNSUPPORTED: UBSan-StandaloneStatic-i386 :: TestCases/Misc/coverage-levels.cpp (4310 of 4806)
PASS: UBSan-StandaloneStatic-i386 :: TestCases/Misc/deduplication.cpp (4311 of 4806)
PASS: UBSan-StandaloneStatic-i386 :: TestCases/Integer/usub-overflow.cpp (4312 of 4806)
PASS: UBSan-StandaloneStatic-i386 :: TestCases/Misc/bounds.cpp (4313 of 4806)
PASS: UBSan-StandaloneStatic-i386 :: TestCases/ImplicitConversion/unsigned-integer-truncation.c (4314 of 4806)
PASS: UBSan-StandaloneStatic-i386 :: TestCases/Integer/suppressions.cpp (4315 of 4806)
UNSUPPORTED: UBSan-StandaloneStatic-i386 :: TestCases/Misc/no-interception.cpp (4316 of 4806)
PASS: UBSan-StandaloneStatic-i386 :: TestCases/Misc/monitor.cpp (4317 of 4806)
PASS: UBSan-StandaloneStatic-i386 :: TestCases/Misc/enum.cpp (4318 of 4806)
PASS: UBSan-StandaloneStatic-i386 :: TestCases/Misc/nonnull-arg.cpp (4319 of 4806)
PASS: UBSan-StandaloneStatic-i386 :: TestCases/Misc/log-path_test.cpp (4320 of 4806)
PASS: UBSan-StandaloneStatic-i386 :: TestCases/Misc/nullability.c (4321 of 4806)
PASS: UBSan-StandaloneStatic-i386 :: TestCases/Misc/nonnull.cpp (4322 of 4806)
PASS: UBSan-StandaloneStatic-i386 :: TestCases/ImplicitConversion/unsigned-integer-truncation-blacklist.c (4323 of 4806)
PASS: UBSan-StandaloneStatic-i386 :: TestCases/Misc/print_summary.c (4324 of 4806)
PASS: UBSan-StandaloneStatic-i386 :: TestCases/Integer/shift.cpp (4325 of 4806)
PASS: UBSan-StandaloneStatic-i386 :: TestCases/Misc/vla.c (4326 of 4806)
PASS: UBSan-StandaloneStatic-i386 :: TestCases/Misc/unreachable.cpp (4327 of 4806)
PASS: UBSan-StandaloneStatic-i386 :: TestCases/Misc/missing_return.cpp (4328 of 4806)
PASS: UBSan-StandaloneStatic-i386 :: TestCases/Pointer/alignment-assumption-blacklist.cpp (4329 of 4806)
PASS: UBSan-StandaloneStatic-i386 :: TestCases/Pointer/alignment-assumption-attribute-alloc_align-on-function-variable.cpp (4330 of 4806)
PASS: UBSan-StandaloneStatic-i386 :: TestCases/Pointer/alignment-assumption-attribute-align_value-on-paramvar.cpp (4331 of 4806)
PASS: UBSan-StandaloneStatic-i386 :: TestCases/Pointer/alignment-assumption-attribute-align_value-on-lvalue.cpp (4332 of 4806)
PASS: UBSan-StandaloneStatic-i386 :: TestCases/Pointer/alignment-assumption-attribute-alloc_align-on-function.cpp (4333 of 4806)
UNSUPPORTED: UBSan-StandaloneStatic-i386 :: TestCases/Pointer/alignment-assumption-summary.cpp (4334 of 4806)
PASS: UBSan-StandaloneStatic-i386 :: TestCases/Pointer/alignment-assumption-attribute-assume_aligned-on-function-two-params.cpp (4335 of 4806)
PASS: UBSan-StandaloneStatic-i386 :: TestCases/Pointer/alignment-assumption-attribute-assume_aligned-on-function.cpp (4336 of 4806)
UNSUPPORTED: UBSan-StandaloneStatic-i386 :: TestCases/Pointer/nullptr-and-nonzero-offset-summary.cpp (4337 of 4806)
PASS: UBSan-StandaloneStatic-i386 :: TestCases/Pointer/index-overflow.cpp (4338 of 4806)
PASS: UBSan-StandaloneStatic-i386 :: TestCases/Pointer/unsigned-index-expression.cpp (4339 of 4806)
UNSUPPORTED: UBSan-StandaloneStatic-i386 :: TestCases/TypeCheck/Function/function.cpp (4340 of 4806)
UNSUPPORTED: UBSan-StandaloneStatic-i386 :: TestCases/TypeCheck/Linux/PR33221.cpp (4341 of 4806)
PASS: UBSan-StandaloneStatic-i386 :: TestCases/TypeCheck/PR33221.cpp (4342 of 4806)
PASS: UBSan-Standalone-x86_64 :: TestCases/TypeCheck/vptr.cpp (4343 of 4806)
PASS: UBSan-StandaloneStatic-i386 :: TestCases/Pointer/alignment-assumption-builtin_assume_aligned-three-params-variable.cpp (4344 of 4806)
PASS: UBSan-StandaloneStatic-i386 :: TestCases/TypeCheck/null.cpp (4345 of 4806)
PASS: UBSan-StandaloneStatic-i386 :: TestCases/TypeCheck/vptr-non-unique-typeinfo.cpp (4346 of 4806)
PASS: UBSan-StandaloneStatic-i386 :: TestCases/TypeCheck/vptr-corrupted-vtable-itanium.cpp (4347 of 4806)
PASS: UBSan-StandaloneStatic-i386 :: TestCases/TypeCheck/vptr-virtual-base-construction.cpp (4348 of 4806)
PASS: UBSan-StandaloneStatic-i386 :: TestCases/TypeCheck/vptr-virtual-base.cpp (4349 of 4806)
PASS: UBSan-StandaloneStatic-x86_64 :: TestCases/Float/cast-overflow.cpp (4350 of 4806)
PASS: UBSan-StandaloneStatic-i386 :: TestCases/Pointer/alignment-assumption-builtin_assume_aligned-three-params.cpp (4351 of 4806)
PASS: UBSan-StandaloneStatic-i386 :: TestCases/Pointer/nullptr-and-nonzero-offset-constants.cpp (4352 of 4806)
PASS: UBSan-StandaloneStatic-i386 :: TestCases/Pointer/alignment-assumption-builtin_assume_aligned-two-params.cpp (4353 of 4806)
UNSUPPORTED: UBSan-StandaloneStatic-x86_64 :: TestCases/ImplicitConversion/integer-sign-change-summary.cpp (4354 of 4806)
PASS: UBSan-StandaloneStatic-i386 :: TestCases/Pointer/alignment-assumption-openmp.cpp (4355 of 4806)
PASS: UBSan-StandaloneStatic-i386 :: TestCases/Pointer/nullptr-and-nonzero-offset-variable.cpp (4356 of 4806)
PASS: UBSan-StandaloneStatic-i386 :: TestCases/TypeCheck/misaligned.cpp (4357 of 4806)
PASS: UBSan-StandaloneStatic-x86_64 :: TestCases/ImplicitConversion/integer-sign-change-blacklist.c (4358 of 4806)
UNSUPPORTED: UBSan-StandaloneStatic-x86_64 :: TestCases/ImplicitConversion/signed-integer-truncation-or-sign-change-summary.cpp (4359 of 4806)
UNSUPPORTED: UBSan-StandaloneStatic-x86_64 :: TestCases/ImplicitConversion/signed-integer-truncation-summary.cpp (4360 of 4806)
PASS: UBSan-StandaloneStatic-x86_64 :: TestCases/ImplicitConversion/integer-truncation.c (4361 of 4806)
PASS: UBSan-StandaloneStatic-x86_64 :: TestCases/ImplicitConversion/integer-sign-change.c (4362 of 4806)
UNSUPPORTED: UBSan-StandaloneStatic-x86_64 :: TestCases/ImplicitConversion/unsigned-integer-truncation-summary.cpp (4363 of 4806)
PASS: UBSan-StandaloneStatic-x86_64 :: TestCases/ImplicitConversion/integer-arithmetic-value-change.c (4364 of 4806)
PASS: UBSan-StandaloneStatic-x86_64 :: TestCases/ImplicitConversion/signed-integer-truncation-blacklist.c (4365 of 4806)
PASS: UBSan-StandaloneStatic-x86_64 :: TestCases/ImplicitConversion/integer-conversion.c (4366 of 4806)
PASS: UBSan-StandaloneStatic-x86_64 :: TestCases/ImplicitConversion/signed-integer-truncation-or-sign-change-blacklist.c (4367 of 4806)
PASS: UBSan-StandaloneStatic-x86_64 :: TestCases/Integer/div-overflow.cpp (4368 of 4806)
PASS: UBSan-StandaloneStatic-x86_64 :: TestCases/Integer/mul-overflow.cpp (4369 of 4806)
PASS: UBSan-StandaloneStatic-x86_64 :: TestCases/ImplicitConversion/signed-integer-truncation.c (4370 of 4806)
PASS: UBSan-StandaloneStatic-x86_64 :: TestCases/Integer/add-overflow.cpp (4371 of 4806)
PASS: UBSan-StandaloneStatic-x86_64 :: TestCases/Integer/div-zero.cpp (4372 of 4806)
PASS: UBSan-StandaloneStatic-x86_64 :: TestCases/Integer/incdec-overflow.cpp (4373 of 4806)
UNSUPPORTED: UBSan-StandaloneStatic-x86_64 :: TestCases/Integer/summary.cpp (4374 of 4806)
PASS: UBSan-StandaloneStatic-x86_64 :: TestCases/Integer/negate-overflow.cpp (4375 of 4806)
PASS: UBSan-StandaloneStatic-x86_64 :: TestCases/Integer/no-recover.cpp (4376 of 4806)
PASS: UBSan-StandaloneStatic-x86_64 :: TestCases/Integer/sub-overflow.cpp (4377 of 4806)
PASS: UBSan-StandaloneStatic-x86_64 :: TestCases/Integer/uadd-overflow.cpp (4378 of 4806)
PASS: UBSan-StandaloneStatic-x86_64 :: TestCases/Integer/umul-overflow.cpp (4379 of 4806)
UNSUPPORTED: UBSan-StandaloneStatic-x86_64 :: TestCases/Misc/Linux/print_stack_trace.cpp (4380 of 4806)
UNSUPPORTED: UBSan-StandaloneStatic-x86_64 :: TestCases/Misc/Linux/ubsan_options.cpp (4381 of 4806)
PASS: UBSan-StandaloneStatic-x86_64 :: TestCases/Integer/uincdec-overflow.cpp (4382 of 4806)
PASS: UBSan-StandaloneStatic-x86_64 :: TestCases/Misc/bool.cpp (4383 of 4806)
PASS: UBSan-StandaloneStatic-x86_64 :: TestCases/Misc/bounds.cpp (4384 of 4806)
UNSUPPORTED: UBSan-StandaloneStatic-x86_64 :: TestCases/Misc/coverage-levels.cpp (4385 of 4806)
PASS: UBSan-StandaloneStatic-x86_64 :: TestCases/Integer/usub-overflow.cpp (4386 of 4806)
PASS: UBSan-StandaloneStatic-x86_64 :: TestCases/Misc/deduplication.cpp (4387 of 4806)
PASS: UBSan-StandaloneStatic-x86_64 :: TestCases/Misc/builtins.cpp (4388 of 4806)
PASS: UBSan-StandaloneStatic-x86_64 :: TestCases/ImplicitConversion/unsigned-integer-truncation.c (4389 of 4806)
PASS: UBSan-StandaloneStatic-x86_64 :: TestCases/Integer/suppressions.cpp (4390 of 4806)
UNSUPPORTED: UBSan-StandaloneStatic-x86_64 :: TestCases/Misc/no-interception.cpp (4391 of 4806)
PASS: UBSan-StandaloneStatic-x86_64 :: TestCases/Misc/enum.cpp (4392 of 4806)
PASS: UBSan-StandaloneStatic-x86_64 :: TestCases/Misc/monitor.cpp (4393 of 4806)
PASS: UBSan-StandaloneStatic-x86_64 :: TestCases/Misc/log-path_test.cpp (4394 of 4806)
PASS: UBSan-StandaloneStatic-x86_64 :: TestCases/Misc/nonnull-arg.cpp (4395 of 4806)
PASS: UBSan-StandaloneStatic-x86_64 :: TestCases/Misc/nullability.c (4396 of 4806)
PASS: UBSan-StandaloneStatic-x86_64 :: TestCases/Misc/print_summary.c (4397 of 4806)
PASS: UBSan-StandaloneStatic-x86_64 :: TestCases/Integer/shift.cpp (4398 of 4806)
PASS: UBSan-StandaloneStatic-x86_64 :: TestCases/ImplicitConversion/unsigned-integer-truncation-blacklist.c (4399 of 4806)
PASS: UBSan-StandaloneStatic-x86_64 :: TestCases/Misc/nonnull.cpp (4400 of 4806)
PASS: UBSan-StandaloneStatic-x86_64 :: TestCases/Misc/vla.c (4401 of 4806)
PASS: UBSan-StandaloneStatic-x86_64 :: TestCases/Misc/unreachable.cpp (4402 of 4806)
PASS: UBSan-StandaloneStatic-x86_64 :: TestCases/Misc/missing_return.cpp (4403 of 4806)
PASS: UBSan-StandaloneStatic-x86_64 :: TestCases/Pointer/alignment-assumption-blacklist.cpp (4404 of 4806)
PASS: UBSan-StandaloneStatic-x86_64 :: TestCases/Pointer/alignment-assumption-attribute-align_value-on-paramvar.cpp (4405 of 4806)
PASS: UBSan-StandaloneStatic-x86_64 :: TestCases/Pointer/alignment-assumption-attribute-alloc_align-on-function-variable.cpp (4406 of 4806)
PASS: UBSan-StandaloneStatic-x86_64 :: TestCases/Pointer/alignment-assumption-attribute-alloc_align-on-function.cpp (4407 of 4806)
PASS: UBSan-StandaloneStatic-x86_64 :: TestCases/Pointer/alignment-assumption-attribute-align_value-on-lvalue.cpp (4408 of 4806)
UNSUPPORTED: UBSan-StandaloneStatic-x86_64 :: TestCases/Pointer/alignment-assumption-summary.cpp (4409 of 4806)
PASS: UBSan-StandaloneStatic-x86_64 :: TestCases/Pointer/alignment-assumption-attribute-assume_aligned-on-function-two-params.cpp (4410 of 4806)
PASS: UBSan-StandaloneStatic-x86_64 :: TestCases/Pointer/alignment-assumption-attribute-assume_aligned-on-function.cpp (4411 of 4806)
UNSUPPORTED: UBSan-StandaloneStatic-x86_64 :: TestCases/Pointer/nullptr-and-nonzero-offset-summary.cpp (4412 of 4806)
PASS: UBSan-StandaloneStatic-x86_64 :: TestCases/Pointer/index-overflow.cpp (4413 of 4806)
PASS: UBSan-StandaloneStatic-x86_64 :: TestCases/Pointer/unsigned-index-expression.cpp (4414 of 4806)
PASS: UBSan-StandaloneStatic-i386 :: TestCases/TypeCheck/vptr.cpp (4415 of 4806)
UNSUPPORTED: UBSan-StandaloneStatic-x86_64 :: TestCases/TypeCheck/Linux/PR33221.cpp (4416 of 4806)
PASS: UBSan-StandaloneStatic-x86_64 :: TestCases/Pointer/alignment-assumption-builtin_assume_aligned-three-params-variable.cpp (4417 of 4806)
PASS: UBSan-StandaloneStatic-x86_64 :: TestCases/TypeCheck/PR33221.cpp (4418 of 4806)
PASS: UBSan-StandaloneStatic-x86_64 :: TestCases/TypeCheck/null.cpp (4419 of 4806)
PASS: UBSan-StandaloneStatic-x86_64 :: TestCases/TypeCheck/vptr-corrupted-vtable-itanium.cpp (4420 of 4806)
PASS: UBSan-StandaloneStatic-x86_64 :: TestCases/Pointer/alignment-assumption-builtin_assume_aligned-three-params.cpp (4421 of 4806)
PASS: UBSan-StandaloneStatic-x86_64 :: TestCases/Pointer/alignment-assumption-builtin_assume_aligned-two-params.cpp (4422 of 4806)
PASS: UBSan-StandaloneStatic-x86_64 :: TestCases/Pointer/alignment-assumption-openmp.cpp (4423 of 4806)
PASS: UBSan-StandaloneStatic-x86_64 :: TestCases/TypeCheck/vptr-non-unique-typeinfo.cpp (4424 of 4806)
PASS: UBSan-StandaloneStatic-x86_64 :: TestCases/Pointer/nullptr-and-nonzero-offset-constants.cpp (4425 of 4806)
PASS: UBSan-StandaloneStatic-x86_64 :: TestCases/TypeCheck/vptr-virtual-base-construction.cpp (4426 of 4806)
PASS: UBSan-StandaloneStatic-x86_64 :: TestCases/TypeCheck/vptr-virtual-base.cpp (4427 of 4806)
PASS: UBSan-StandaloneStatic-x86_64 :: TestCases/Pointer/nullptr-and-nonzero-offset-variable.cpp (4428 of 4806)
PASS: UBSan-StandaloneStatic-x86_64 :: TestCases/TypeCheck/misaligned.cpp (4429 of 4806)
PASS: UBSan-StandaloneStatic-x86_64 :: TestCases/TypeCheck/Function/function.cpp (4430 of 4806)
PASS: UBSan-ThreadSanitizer-x86_64 :: TestCases/Float/cast-overflow.cpp (4431 of 4806)
PASS: UBSan-StandaloneStatic-x86_64 :: TestCases/TypeCheck/vptr.cpp (4432 of 4806)
PASS: UBSan-ThreadSanitizer-x86_64 :: TestCases/ImplicitConversion/integer-sign-change-blacklist.c (4433 of 4806)
PASS: UBSan-ThreadSanitizer-x86_64 :: TestCases/ImplicitConversion/integer-sign-change-summary.cpp (4434 of 4806)
PASS: UBSan-ThreadSanitizer-x86_64 :: TestCases/ImplicitConversion/integer-conversion.c (4435 of 4806)
PASS: UBSan-ThreadSanitizer-x86_64 :: TestCases/ImplicitConversion/integer-arithmetic-value-change.c (4436 of 4806)
PASS: UBSan-ThreadSanitizer-x86_64 :: TestCases/ImplicitConversion/integer-sign-change.c (4437 of 4806)
PASS: UBSan-ThreadSanitizer-x86_64 :: TestCases/ImplicitConversion/integer-truncation.c (4438 of 4806)
PASS: UBSan-ThreadSanitizer-x86_64 :: TestCases/ImplicitConversion/signed-integer-truncation-or-sign-change-summary.cpp (4439 of 4806)
PASS: UBSan-ThreadSanitizer-x86_64 :: TestCases/ImplicitConversion/signed-integer-truncation-summary.cpp (4440 of 4806)
PASS: UBSan-ThreadSanitizer-x86_64 :: TestCases/ImplicitConversion/signed-integer-truncation-blacklist.c (4441 of 4806)
PASS: UBSan-ThreadSanitizer-x86_64 :: TestCases/ImplicitConversion/signed-integer-truncation-or-sign-change-blacklist.c (4442 of 4806)
PASS: UBSan-ThreadSanitizer-x86_64 :: TestCases/ImplicitConversion/unsigned-integer-truncation-summary.cpp (4443 of 4806)
PASS: UBSan-ThreadSanitizer-x86_64 :: TestCases/ImplicitConversion/signed-integer-truncation.c (4444 of 4806)
PASS: UBSan-ThreadSanitizer-x86_64 :: TestCases/Integer/add-overflow.cpp (4445 of 4806)
PASS: UBSan-ThreadSanitizer-x86_64 :: TestCases/Integer/div-overflow.cpp (4446 of 4806)
PASS: UBSan-ThreadSanitizer-x86_64 :: TestCases/Integer/div-zero.cpp (4447 of 4806)
PASS: UBSan-ThreadSanitizer-x86_64 :: TestCases/Integer/incdec-overflow.cpp (4448 of 4806)
PASS: UBSan-ThreadSanitizer-x86_64 :: TestCases/ImplicitConversion/unsigned-integer-truncation-blacklist.c (4449 of 4806)
PASS: UBSan-ThreadSanitizer-x86_64 :: TestCases/Integer/mul-overflow.cpp (4450 of 4806)
PASS: UBSan-ThreadSanitizer-x86_64 :: TestCases/Integer/negate-overflow.cpp (4451 of 4806)
PASS: UBSan-ThreadSanitizer-x86_64 :: TestCases/ImplicitConversion/unsigned-integer-truncation.c (4452 of 4806)
PASS: UBSan-ThreadSanitizer-x86_64 :: TestCases/Integer/no-recover.cpp (4453 of 4806)
UNSUPPORTED: UBSan-ThreadSanitizer-x86_64 :: TestCases/Integer/summary.cpp (4454 of 4806)
PASS: UBSan-ThreadSanitizer-x86_64 :: TestCases/Integer/sub-overflow.cpp (4455 of 4806)
PASS: UBSan-ThreadSanitizer-x86_64 :: TestCases/Integer/uadd-overflow.cpp (4456 of 4806)
PASS: UBSan-ThreadSanitizer-x86_64 :: TestCases/Integer/suppressions.cpp (4457 of 4806)
PASS: UBSan-ThreadSanitizer-x86_64 :: TestCases/Integer/umul-overflow.cpp (4458 of 4806)
PASS: UBSan-ThreadSanitizer-x86_64 :: TestCases/Integer/uincdec-overflow.cpp (4459 of 4806)
UNSUPPORTED: UBSan-ThreadSanitizer-x86_64 :: TestCases/Misc/Linux/print_stack_trace.cpp (4460 of 4806)
UNSUPPORTED: UBSan-ThreadSanitizer-x86_64 :: TestCases/Misc/Linux/ubsan_options.cpp (4461 of 4806)
PASS: UBSan-ThreadSanitizer-x86_64 :: TestCases/Misc/bool.cpp (4462 of 4806)
PASS: UBSan-ThreadSanitizer-x86_64 :: TestCases/Integer/usub-overflow.cpp (4463 of 4806)
PASS: UBSan-ThreadSanitizer-x86_64 :: TestCases/Misc/builtins.cpp (4464 of 4806)
PASS: UBSan-ThreadSanitizer-x86_64 :: TestCases/Integer/shift.cpp (4465 of 4806)
XFAIL: UBSan-ThreadSanitizer-x86_64 :: TestCases/Misc/coverage-levels.cpp (4466 of 4806)
PASS: UBSan-ThreadSanitizer-x86_64 :: TestCases/Misc/deduplication.cpp (4467 of 4806)
PASS: UBSan-ThreadSanitizer-x86_64 :: TestCases/Misc/bounds.cpp (4468 of 4806)
PASS: UBSan-ThreadSanitizer-x86_64 :: TestCases/Misc/enum.cpp (4469 of 4806)
PASS: UBSan-ThreadSanitizer-x86_64 :: TestCases/Misc/missing_return.cpp (4470 of 4806)
UNSUPPORTED: UBSan-ThreadSanitizer-x86_64 :: TestCases/Misc/no-interception.cpp (4471 of 4806)
PASS: UBSan-ThreadSanitizer-x86_64 :: TestCases/Misc/log-path_test.cpp (4472 of 4806)
PASS: UBSan-ThreadSanitizer-x86_64 :: TestCases/Misc/monitor.cpp (4473 of 4806)
PASS: UBSan-ThreadSanitizer-x86_64 :: TestCases/Misc/nullability.c (4474 of 4806)
PASS: UBSan-ThreadSanitizer-x86_64 :: TestCases/Misc/nonnull.cpp (4475 of 4806)
PASS: UBSan-ThreadSanitizer-x86_64 :: TestCases/Misc/print_summary.c (4476 of 4806)
PASS: UBSan-ThreadSanitizer-x86_64 :: TestCases/Misc/unreachable.cpp (4477 of 4806)
PASS: UBSan-ThreadSanitizer-x86_64 :: TestCases/Misc/vla.c (4478 of 4806)
PASS: UBSan-ThreadSanitizer-x86_64 :: TestCases/Misc/nonnull-arg.cpp (4479 of 4806)
PASS: UBSan-ThreadSanitizer-x86_64 :: TestCases/Pointer/alignment-assumption-attribute-align_value-on-lvalue.cpp (4480 of 4806)
PASS: UBSan-ThreadSanitizer-x86_64 :: TestCases/Pointer/alignment-assumption-attribute-alloc_align-on-function-variable.cpp (4481 of 4806)
PASS: UBSan-ThreadSanitizer-x86_64 :: TestCases/Pointer/alignment-assumption-attribute-align_value-on-paramvar.cpp (4482 of 4806)
PASS: UBSan-ThreadSanitizer-x86_64 :: TestCases/Pointer/alignment-assumption-attribute-alloc_align-on-function.cpp (4483 of 4806)
PASS: UBSan-ThreadSanitizer-x86_64 :: TestCases/Pointer/alignment-assumption-attribute-assume_aligned-on-function-two-params.cpp (4484 of 4806)
PASS: UBSan-ThreadSanitizer-x86_64 :: TestCases/Pointer/alignment-assumption-attribute-assume_aligned-on-function.cpp (4485 of 4806)
PASS: UBSan-ThreadSanitizer-x86_64 :: TestCases/Pointer/alignment-assumption-blacklist.cpp (4486 of 4806)
PASS: UBSan-ThreadSanitizer-x86_64 :: TestCases/Pointer/alignment-assumption-builtin_assume_aligned-three-params.cpp (4487 of 4806)
PASS: UBSan-ThreadSanitizer-x86_64 :: TestCases/Pointer/alignment-assumption-builtin_assume_aligned-three-params-variable.cpp (4488 of 4806)
PASS: UBSan-ThreadSanitizer-x86_64 :: TestCases/Pointer/alignment-assumption-builtin_assume_aligned-two-params.cpp (4489 of 4806)
PASS: UBSan-ThreadSanitizer-x86_64 :: TestCases/Pointer/alignment-assumption-summary.cpp (4490 of 4806)
PASS: UBSan-ThreadSanitizer-x86_64 :: TestCases/Pointer/index-overflow.cpp (4491 of 4806)
PASS: UBSan-ThreadSanitizer-x86_64 :: TestCases/Pointer/alignment-assumption-openmp.cpp (4492 of 4806)
PASS: UBSan-ThreadSanitizer-x86_64 :: TestCases/Pointer/nullptr-and-nonzero-offset-summary.cpp (4493 of 4806)
PASS: UBSan-ThreadSanitizer-x86_64 :: TestCases/Pointer/unsigned-index-expression.cpp (4494 of 4806)
PASS: UBSan-ThreadSanitizer-x86_64 :: TestCases/Pointer/nullptr-and-nonzero-offset-constants.cpp (4495 of 4806)
UNSUPPORTED: UBSan-ThreadSanitizer-x86_64 :: TestCases/TypeCheck/Linux/PR33221.cpp (4496 of 4806)
PASS: UBSan-ThreadSanitizer-x86_64 :: TestCases/TypeCheck/PR33221.cpp (4497 of 4806)
PASS: UBSan-ThreadSanitizer-x86_64 :: TestCases/TypeCheck/Function/function.cpp (4498 of 4806)
PASS: UBSan-ThreadSanitizer-x86_64 :: TestCases/TypeCheck/null.cpp (4499 of 4806)
UNSUPPORTED: XRay-x86_64-darwin :: TestCases/Posix/always-never-instrument.cpp (4500 of 4806)
UNSUPPORTED: XRay-x86_64-darwin :: TestCases/Posix/arg1-arg0-logging.cpp (4501 of 4806)
UNSUPPORTED: XRay-x86_64-darwin :: TestCases/Posix/arg1-logger.cpp (4502 of 4806)
UNSUPPORTED: XRay-x86_64-darwin :: TestCases/Posix/arg1-logging-implicit-this.cpp (4503 of 4806)
UNSUPPORTED: XRay-x86_64-darwin :: TestCases/Posix/argv0-log-file-name.cpp (4504 of 4806)
UNSUPPORTED: XRay-x86_64-darwin :: TestCases/Posix/basic-filtering.cpp (4505 of 4806)
UNSUPPORTED: XRay-x86_64-darwin :: TestCases/Posix/c-test.cpp (4506 of 4806)
UNSUPPORTED: XRay-x86_64-darwin :: TestCases/Posix/clang-no-xray-instrument.cpp (4507 of 4806)
UNSUPPORTED: XRay-x86_64-darwin :: TestCases/Posix/common-trampoline-alignment.cpp (4508 of 4806)
UNSUPPORTED: XRay-x86_64-darwin :: TestCases/Posix/coverage-sample.cpp (4509 of 4806)
UNSUPPORTED: XRay-x86_64-darwin :: TestCases/Posix/custom-event-handler-alignment.cpp (4510 of 4806)
UNSUPPORTED: XRay-x86_64-darwin :: TestCases/Posix/custom-event-logging.cpp (4511 of 4806)
UNSUPPORTED: XRay-x86_64-darwin :: TestCases/Posix/fdr-mode-inmemory.cpp (4512 of 4806)
UNSUPPORTED: XRay-x86_64-darwin :: TestCases/Posix/fdr-mode-multiple.cpp (4513 of 4806)
UNSUPPORTED: XRay-x86_64-darwin :: TestCases/Posix/fdr-mode.cpp (4514 of 4806)
UNSUPPORTED: XRay-x86_64-darwin :: TestCases/Posix/fdr-reinit.cpp (4515 of 4806)
UNSUPPORTED: XRay-x86_64-darwin :: TestCases/Posix/fdr-single-thread.cpp (4516 of 4806)
UNSUPPORTED: XRay-x86_64-darwin :: TestCases/Posix/fdr-thread-order.cpp (4517 of 4806)
UNSUPPORTED: XRay-x86_64-darwin :: TestCases/Posix/fixedsize-logging.cpp (4518 of 4806)
UNSUPPORTED: XRay-x86_64-darwin :: TestCases/Posix/fork_basic_logging.cpp (4519 of 4806)
UNSUPPORTED: XRay-x86_64-darwin :: TestCases/Posix/func-id-utils.cpp (4520 of 4806)
UNSUPPORTED: XRay-x86_64-darwin :: TestCases/Posix/logging-modes.cpp (4521 of 4806)
UNSUPPORTED: XRay-x86_64-darwin :: TestCases/Posix/optional-inmemory-log.cpp (4522 of 4806)
UNSUPPORTED: XRay-x86_64-darwin :: TestCases/Posix/patching-unpatching.cpp (4523 of 4806)
UNSUPPORTED: XRay-x86_64-darwin :: TestCases/Posix/pic_test.cpp (4524 of 4806)
UNSUPPORTED: XRay-x86_64-darwin :: TestCases/Posix/profiling-multi-threaded.cpp (4525 of 4806)
UNSUPPORTED: XRay-x86_64-darwin :: TestCases/Posix/profiling-single-threaded.cpp (4526 of 4806)
UNSUPPORTED: XRay-x86_64-darwin :: TestCases/Posix/quiet-start.cpp (4527 of 4806)
UNSUPPORTED: XRay-x86_64h-darwin :: TestCases/Posix/always-never-instrument.cpp (4528 of 4806)
UNSUPPORTED: XRay-x86_64h-darwin :: TestCases/Posix/arg1-arg0-logging.cpp (4529 of 4806)
UNSUPPORTED: XRay-x86_64h-darwin :: TestCases/Posix/arg1-logger.cpp (4530 of 4806)
UNSUPPORTED: XRay-x86_64h-darwin :: TestCases/Posix/arg1-logging-implicit-this.cpp (4531 of 4806)
UNSUPPORTED: XRay-x86_64h-darwin :: TestCases/Posix/argv0-log-file-name.cpp (4532 of 4806)
UNSUPPORTED: XRay-x86_64h-darwin :: TestCases/Posix/basic-filtering.cpp (4533 of 4806)
UNSUPPORTED: XRay-x86_64h-darwin :: TestCases/Posix/c-test.cpp (4534 of 4806)
UNSUPPORTED: XRay-x86_64h-darwin :: TestCases/Posix/clang-no-xray-instrument.cpp (4535 of 4806)
UNSUPPORTED: XRay-x86_64h-darwin :: TestCases/Posix/common-trampoline-alignment.cpp (4536 of 4806)
UNSUPPORTED: XRay-x86_64h-darwin :: TestCases/Posix/coverage-sample.cpp (4537 of 4806)
UNSUPPORTED: XRay-x86_64h-darwin :: TestCases/Posix/custom-event-handler-alignment.cpp (4538 of 4806)
UNSUPPORTED: XRay-x86_64h-darwin :: TestCases/Posix/custom-event-logging.cpp (4539 of 4806)
UNSUPPORTED: XRay-x86_64h-darwin :: TestCases/Posix/fdr-mode-inmemory.cpp (4540 of 4806)
UNSUPPORTED: XRay-x86_64h-darwin :: TestCases/Posix/fdr-mode-multiple.cpp (4541 of 4806)
UNSUPPORTED: XRay-x86_64h-darwin :: TestCases/Posix/fdr-mode.cpp (4542 of 4806)
UNSUPPORTED: XRay-x86_64h-darwin :: TestCases/Posix/fdr-reinit.cpp (4543 of 4806)
UNSUPPORTED: XRay-x86_64h-darwin :: TestCases/Posix/fdr-single-thread.cpp (4544 of 4806)
UNSUPPORTED: XRay-x86_64h-darwin :: TestCases/Posix/fdr-thread-order.cpp (4545 of 4806)
UNSUPPORTED: XRay-x86_64h-darwin :: TestCases/Posix/fixedsize-logging.cpp (4546 of 4806)
UNSUPPORTED: XRay-x86_64h-darwin :: TestCases/Posix/fork_basic_logging.cpp (4547 of 4806)
UNSUPPORTED: XRay-x86_64h-darwin :: TestCases/Posix/func-id-utils.cpp (4548 of 4806)
UNSUPPORTED: XRay-x86_64h-darwin :: TestCases/Posix/logging-modes.cpp (4549 of 4806)
UNSUPPORTED: XRay-x86_64h-darwin :: TestCases/Posix/optional-inmemory-log.cpp (4550 of 4806)
UNSUPPORTED: XRay-x86_64h-darwin :: TestCases/Posix/patching-unpatching.cpp (4551 of 4806)
UNSUPPORTED: XRay-x86_64h-darwin :: TestCases/Posix/pic_test.cpp (4552 of 4806)
UNSUPPORTED: XRay-x86_64h-darwin :: TestCases/Posix/profiling-multi-threaded.cpp (4553 of 4806)
UNSUPPORTED: XRay-x86_64h-darwin :: TestCases/Posix/profiling-single-threaded.cpp (4554 of 4806)
UNSUPPORTED: XRay-x86_64h-darwin :: TestCases/Posix/quiet-start.cpp (4555 of 4806)
PASS: UBSan-ThreadSanitizer-x86_64 :: TestCases/TypeCheck/vptr-corrupted-vtable-itanium.cpp (4556 of 4806)
PASS: UBSan-ThreadSanitizer-x86_64 :: TestCases/TypeCheck/vptr-non-unique-typeinfo.cpp (4557 of 4806)
PASS: cfi-devirt-i386 :: bad-split.cpp (4558 of 4806)
PASS: UBSan-ThreadSanitizer-x86_64 :: TestCases/Pointer/nullptr-and-nonzero-offset-variable.cpp (4559 of 4806)
PASS: UBSan-ThreadSanitizer-x86_64 :: TestCases/TypeCheck/vptr-virtual-base-construction.cpp (4560 of 4806)
PASS: cfi-devirt-i386 :: anon-namespace.cpp (4561 of 4806)
UNSUPPORTED: cfi-devirt-i386 :: cross-dso/icall/diag.cpp (4562 of 4806)
UNSUPPORTED: cfi-devirt-i386 :: cross-dso/icall/dlopen.cpp (4563 of 4806)
UNSUPPORTED: cfi-devirt-i386 :: cross-dso/icall/icall-from-dso.cpp (4564 of 4806)
UNSUPPORTED: cfi-devirt-i386 :: cross-dso/icall/icall.cpp (4565 of 4806)
UNSUPPORTED: cfi-devirt-i386 :: cross-dso/shadow_is_read_only.cpp (4566 of 4806)
UNSUPPORTED: cfi-devirt-i386 :: cross-dso/simple-fail.cpp (4567 of 4806)
UNSUPPORTED: cfi-devirt-i386 :: cross-dso/simple-pass.cpp (4568 of 4806)
UNSUPPORTED: cfi-devirt-i386 :: cross-dso/stats.cpp (4569 of 4806)
UNSUPPORTED: cfi-devirt-i386 :: cross-dso/target_out_of_bounds.cpp (4570 of 4806)
PASS: UBSan-ThreadSanitizer-x86_64 :: TestCases/TypeCheck/vptr-virtual-base.cpp (4571 of 4806)
UNSUPPORTED: cfi-devirt-i386 :: icall/external-call.c (4572 of 4806)
XFAIL: cfi-devirt-i386 :: icall/weak.c (4573 of 4806)
UNSUPPORTED: cfi-devirt-i386 :: icall/wrong-signature-mixed-lto.c (4574 of 4806)
PASS: cfi-devirt-i386 :: create-derivers.test (4575 of 4806)
PASS: cfi-devirt-i386 :: cross-dso-diagnostic.cpp (4576 of 4806)
PASS: cfi-devirt-i386 :: bad-cast.cpp (4577 of 4806)
PASS: cfi-devirt-i386 :: icall/bad-signature.c (4578 of 4806)
PASS: cfi-devirt-i386 :: multiple-inheritance2.cpp (4579 of 4806)
PASS: UBSan-ThreadSanitizer-x86_64 :: TestCases/TypeCheck/misaligned.cpp (4580 of 4806)
XFAIL: cfi-devirt-i386 :: sibling.cpp (4581 of 4806)
XFAIL: cfi-devirt-i386 :: simple-pass.cpp (4582 of 4806)
UNSUPPORTED: cfi-devirt-i386 :: stats.cpp (4583 of 4806)
PASS: cfi-devirt-i386 :: target_uninstrumented.cpp (4584 of 4806)
PASS: cfi-devirt-i386 :: mfcall.cpp (4585 of 4806)
XFAIL: cfi-devirt-i386 :: two-vcalls.cpp (4586 of 4806)
PASS: cfi-devirt-i386 :: nvcall.cpp (4587 of 4806)
PASS: cfi-devirt-i386 :: vtable-may-alias.cpp (4588 of 4806)
PASS: cfi-devirt-i386 :: overwrite.cpp (4589 of 4806)
PASS: cfi-devirt-x86_64 :: bad-split.cpp (4590 of 4806)
PASS: cfi-devirt-i386 :: base-derived-destructor.cpp (4591 of 4806)
PASS: cfi-devirt-x86_64 :: create-derivers.test (4592 of 4806)
PASS: cfi-devirt-i386 :: multiple-inheritance.cpp (4593 of 4806)
UNSUPPORTED: cfi-devirt-x86_64 :: cross-dso/icall/diag.cpp (4594 of 4806)
UNSUPPORTED: cfi-devirt-x86_64 :: cross-dso/icall/dlopen.cpp (4595 of 4806)
UNSUPPORTED: cfi-devirt-x86_64 :: cross-dso/icall/icall-from-dso.cpp (4596 of 4806)
UNSUPPORTED: cfi-devirt-x86_64 :: cross-dso/icall/icall.cpp (4597 of 4806)
UNSUPPORTED: cfi-devirt-x86_64 :: cross-dso/shadow_is_read_only.cpp (4598 of 4806)
UNSUPPORTED: cfi-devirt-x86_64 :: cross-dso/simple-fail.cpp (4599 of 4806)
UNSUPPORTED: cfi-devirt-x86_64 :: cross-dso/simple-pass.cpp (4600 of 4806)
UNSUPPORTED: cfi-devirt-x86_64 :: cross-dso/stats.cpp (4601 of 4806)
UNSUPPORTED: cfi-devirt-x86_64 :: cross-dso/target_out_of_bounds.cpp (4602 of 4806)
PASS: cfi-devirt-x86_64 :: cross-dso-diagnostic.cpp (4603 of 4806)
UNSUPPORTED: cfi-devirt-x86_64 :: icall/external-call.c (4604 of 4806)
XFAIL: cfi-devirt-x86_64 :: icall/weak.c (4605 of 4806)
UNSUPPORTED: cfi-devirt-x86_64 :: icall/wrong-signature-mixed-lto.c (4606 of 4806)
PASS: cfi-devirt-x86_64 :: icall/bad-signature.c (4607 of 4806)
PASS: cfi-devirt-i386 :: vdtor.cpp (4608 of 4806)
PASS: cfi-devirt-x86_64 :: multiple-inheritance2.cpp (4609 of 4806)
PASS: cfi-devirt-x86_64 :: bad-cast.cpp (4610 of 4806)
PASS: cfi-devirt-x86_64 :: anon-namespace.cpp (4611 of 4806)
XFAIL: cfi-devirt-x86_64 :: sibling.cpp (4612 of 4806)
PASS: cfi-devirt-x86_64 :: base-derived-destructor.cpp (4613 of 4806)
PASS: cfi-devirt-x86_64 :: mfcall.cpp (4614 of 4806)
UNSUPPORTED: cfi-devirt-x86_64 :: stats.cpp (4615 of 4806)
PASS: cfi-devirt-x86_64 :: target_uninstrumented.cpp (4616 of 4806)
PASS: cfi-devirt-x86_64 :: nvcall.cpp (4617 of 4806)
XFAIL: cfi-devirt-x86_64 :: simple-pass.cpp (4618 of 4806)
PASS: cfi-devirt-x86_64 :: vtable-may-alias.cpp (4619 of 4806)
PASS: cfi-devirt-x86_64 :: overwrite.cpp (4620 of 4806)
XFAIL: cfi-devirt-x86_64 :: two-vcalls.cpp (4621 of 4806)
PASS: cfi-standalone-i386 :: bad-split.cpp (4622 of 4806)
PASS: cfi-devirt-x86_64 :: multiple-inheritance.cpp (4623 of 4806)
PASS: cfi-standalone-i386 :: create-derivers.test (4624 of 4806)
PASS: cfi-standalone-i386 :: cross-dso-diagnostic.cpp (4625 of 4806)
UNSUPPORTED: cfi-standalone-i386 :: cross-dso/icall/diag.cpp (4626 of 4806)
UNSUPPORTED: cfi-standalone-i386 :: cross-dso/icall/dlopen.cpp (4627 of 4806)
UNSUPPORTED: cfi-standalone-i386 :: cross-dso/icall/icall-from-dso.cpp (4628 of 4806)
UNSUPPORTED: cfi-standalone-i386 :: cross-dso/icall/icall.cpp (4629 of 4806)
UNSUPPORTED: cfi-standalone-i386 :: cross-dso/shadow_is_read_only.cpp (4630 of 4806)
UNSUPPORTED: cfi-standalone-i386 :: cross-dso/simple-fail.cpp (4631 of 4806)
UNSUPPORTED: cfi-standalone-i386 :: cross-dso/simple-pass.cpp (4632 of 4806)
UNSUPPORTED: cfi-standalone-i386 :: cross-dso/stats.cpp (4633 of 4806)
UNSUPPORTED: cfi-standalone-i386 :: cross-dso/target_out_of_bounds.cpp (4634 of 4806)
PASS: cfi-devirt-x86_64 :: vdtor.cpp (4635 of 4806)
UNSUPPORTED: cfi-standalone-i386 :: icall/external-call.c (4636 of 4806)
XFAIL: cfi-standalone-i386 :: icall/weak.c (4637 of 4806)
UNSUPPORTED: cfi-standalone-i386 :: icall/wrong-signature-mixed-lto.c (4638 of 4806)
PASS: cfi-standalone-i386 :: bad-cast.cpp (4639 of 4806)
PASS: cfi-standalone-i386 :: anon-namespace.cpp (4640 of 4806)
PASS: cfi-standalone-i386 :: multiple-inheritance2.cpp (4641 of 4806)
PASS: cfi-standalone-i386 :: icall/bad-signature.c (4642 of 4806)
PASS: cfi-standalone-i386 :: base-derived-destructor.cpp (4643 of 4806)
XFAIL: cfi-standalone-i386 :: sibling.cpp (4644 of 4806)
PASS: cfi-devirt-i386 :: simple-fail.cpp (4645 of 4806)
PASS: cfi-standalone-i386 :: mfcall.cpp (4646 of 4806)
PASS: cfi-standalone-i386 :: nvcall.cpp (4647 of 4806)
PASS: cfi-standalone-i386 :: stats.cpp (4648 of 4806)
XFAIL: cfi-standalone-i386 :: simple-pass.cpp (4649 of 4806)
PASS: cfi-standalone-i386 :: target_uninstrumented.cpp (4650 of 4806)
PASS: cfi-standalone-i386 :: vtable-may-alias.cpp (4651 of 4806)
PASS: cfi-standalone-i386 :: overwrite.cpp (4652 of 4806)
XFAIL: cfi-standalone-i386 :: two-vcalls.cpp (4653 of 4806)
PASS: cfi-standalone-i386 :: multiple-inheritance.cpp (4654 of 4806)
PASS: cfi-standalone-x86_64 :: bad-split.cpp (4655 of 4806)
PASS: cfi-standalone-x86_64 :: create-derivers.test (4656 of 4806)
PASS: cfi-standalone-x86_64 :: cross-dso-diagnostic.cpp (4657 of 4806)
UNSUPPORTED: cfi-standalone-x86_64 :: cross-dso/icall/diag.cpp (4658 of 4806)
UNSUPPORTED: cfi-standalone-x86_64 :: cross-dso/icall/dlopen.cpp (4659 of 4806)
UNSUPPORTED: cfi-standalone-x86_64 :: cross-dso/icall/icall-from-dso.cpp (4660 of 4806)
UNSUPPORTED: cfi-standalone-x86_64 :: cross-dso/icall/icall.cpp (4661 of 4806)
UNSUPPORTED: cfi-standalone-x86_64 :: cross-dso/shadow_is_read_only.cpp (4662 of 4806)
UNSUPPORTED: cfi-standalone-x86_64 :: cross-dso/simple-fail.cpp (4663 of 4806)
UNSUPPORTED: cfi-standalone-x86_64 :: cross-dso/simple-pass.cpp (4664 of 4806)
UNSUPPORTED: cfi-standalone-x86_64 :: cross-dso/stats.cpp (4665 of 4806)
UNSUPPORTED: cfi-standalone-x86_64 :: cross-dso/target_out_of_bounds.cpp (4666 of 4806)
PASS: cfi-standalone-i386 :: vdtor.cpp (4667 of 4806)
UNSUPPORTED: cfi-standalone-x86_64 :: icall/external-call.c (4668 of 4806)
XFAIL: cfi-standalone-x86_64 :: icall/weak.c (4669 of 4806)
UNSUPPORTED: cfi-standalone-x86_64 :: icall/wrong-signature-mixed-lto.c (4670 of 4806)
PASS: cfi-standalone-x86_64 :: anon-namespace.cpp (4671 of 4806)
PASS: cfi-standalone-x86_64 :: bad-cast.cpp (4672 of 4806)
PASS: cfi-standalone-x86_64 :: multiple-inheritance2.cpp (4673 of 4806)
PASS: cfi-standalone-x86_64 :: icall/bad-signature.c (4674 of 4806)
PASS: cfi-devirt-x86_64 :: simple-fail.cpp (4675 of 4806)
PASS: cfi-standalone-x86_64 :: base-derived-destructor.cpp (4676 of 4806)
XFAIL: cfi-standalone-x86_64 :: sibling.cpp (4677 of 4806)
PASS: cfi-standalone-x86_64 :: mfcall.cpp (4678 of 4806)
XFAIL: cfi-standalone-x86_64 :: simple-pass.cpp (4679 of 4806)
PASS: cfi-standalone-x86_64 :: stats.cpp (4680 of 4806)
PASS: cfi-standalone-x86_64 :: nvcall.cpp (4681 of 4806)
PASS: cfi-standalone-x86_64 :: target_uninstrumented.cpp (4682 of 4806)
PASS: cfi-standalone-x86_64 :: overwrite.cpp (4683 of 4806)
PASS: cfi-standalone-x86_64 :: vtable-may-alias.cpp (4684 of 4806)
UNSUPPORTED: libFuzzer :: afl-driver-close-fd-mask.test (4685 of 4806)
XFAIL: cfi-standalone-x86_64 :: two-vcalls.cpp (4686 of 4806)
PASS: libFuzzer :: acquire-crash-state.test (4687 of 4806)
UNSUPPORTED: libFuzzer :: afl-driver.test (4688 of 4806)
PASS: cfi-standalone-x86_64 :: multiple-inheritance.cpp (4689 of 4806)
PASS: libFuzzer :: bad-strcmp.test (4690 of 4806)
PASS: libFuzzer :: bogus-initialize.test (4691 of 4806)
PASS: UBSan-ThreadSanitizer-x86_64 :: TestCases/TypeCheck/vptr.cpp (4692 of 4806)
PASS: cfi-standalone-x86_64 :: vdtor.cpp (4693 of 4806)
PASS: libFuzzer :: buffer-overflow-on-input.test (4694 of 4806)
PASS: cfi-standalone-i386 :: simple-fail.cpp (4695 of 4806)
PASS: libFuzzer :: caller-callee.test (4696 of 4806)
UNSUPPORTED: libFuzzer :: compressed.test (4697 of 4806)
PASS: libFuzzer :: afl-driver-stderr.test (4698 of 4806)
PASS: libFuzzer :: counters.test (4699 of 4806)
PASS: libFuzzer :: coverage.test (4700 of 4806)
PASS: cfi-standalone-x86_64 :: simple-fail.cpp (4701 of 4806)
PASS: libFuzzer :: cxxstring.test (4702 of 4806)
UNSUPPORTED: libFuzzer :: dataflow.test (4703 of 4806)
PASS: libFuzzer :: dead-stripping.test (4704 of 4806)
UNSUPPORTED: libFuzzer :: deep-recursion.test (4705 of 4806)
PASS: libFuzzer :: cross_over.test (4706 of 4806)
UNSUPPORTED: libFuzzer :: disable-leaks.test (4707 of 4806)
PASS: libFuzzer :: deprecated-instrumentation.test (4708 of 4806)
UNSUPPORTED: libFuzzer :: equivalence-signals.test (4709 of 4806)
UNSUPPORTED: libFuzzer :: equivalence.test (4710 of 4806)
PASS: libFuzzer :: dso.test (4711 of 4806)
PASS: libFuzzer :: cleanse.test (4712 of 4806)
UNSUPPORTED: libFuzzer :: extra-counters.test (4713 of 4806)
UNSUPPORTED: libFuzzer :: features_dir.test (4714 of 4806)
UNSUPPORTED: libFuzzer :: fork-sigusr.test (4715 of 4806)
UNSUPPORTED: libFuzzer :: fork-ubsan.test (4716 of 4806)
UNSUPPORTED: libFuzzer :: fork.test (4717 of 4806)
PASS: libFuzzer :: full-coverage-set.test (4718 of 4806)
PASS: libFuzzer :: exit-report.test (4719 of 4806)
PASS: libFuzzer :: exit_on_src_pos.test (4720 of 4806)
PASS: libFuzzer :: fuzzer-alignment-assumption.test (4721 of 4806)
PASS: libFuzzer :: fuzzer-customcrossoverandmutate.test (4722 of 4806)
PASS: libFuzzer :: fuzzer-custommutator.test (4723 of 4806)
PASS: libFuzzer :: fuzzer-customcrossover.test (4724 of 4806)
PASS: libFuzzer :: fuzzer-dirs.test (4725 of 4806)
PASS: libFuzzer :: fuzzer-dict.test (4726 of 4806)
PASS: libFuzzer :: fuzzer-fdmask.test (4727 of 4806)
PASS: libFuzzer :: fuzzer-finalstats.test (4728 of 4806)
PASS: libFuzzer :: fuzzer-implicit-integer-sign-change.test (4729 of 4806)
PASS: libFuzzer :: fuzzer-flags.test (4730 of 4806)
PASS: libFuzzer :: fuzzer-implicit-signed-integer-truncation-or-sign-change.test (4731 of 4806)
UNSUPPORTED: libFuzzer :: fuzzer-leak.test (4732 of 4806)
UNSUPPORTED: libFuzzer :: fuzzer-oom-with-profile.test (4733 of 4806)
PASS: libFuzzer :: fuzzer-implicit-signed-integer-truncation.test (4734 of 4806)
PASS: libFuzzer :: fuzzer-implicit-unsigned-integer-truncation.test (4735 of 4806)
PASS: libFuzzer :: fuzzer-printcovpcs.test (4736 of 4806)
PASS: libFuzzer :: fuzzer-seed.test (4737 of 4806)
PASS: libFuzzer :: fuzzer-runs.test (4738 of 4806)
PASS: libFuzzer :: fuzzer-segv.test (4739 of 4806)
PASS: libFuzzer :: fuzzer-oom.test (4740 of 4806)
PASS: libFuzzer :: fuzzer-singleinputs.test (4741 of 4806)
PASS: libFuzzer :: fuzzer-ubsan.test (4742 of 4806)
UNSUPPORTED: libFuzzer :: gc-sections.test (4743 of 4806)
PASS: libFuzzer :: fuzzer-threaded.test (4744 of 4806)
PASS: libFuzzer :: initialize.test (4745 of 4806)
PASS: libFuzzer :: len_control.test (4746 of 4806)
UNSUPPORTED: libFuzzer :: libcxx.test (4747 of 4806)
UNSUPPORTED: libFuzzer :: magic-separator.test (4748 of 4806)
PASS: libFuzzer :: max-number-of-runs.test (4749 of 4806)
PASS: libFuzzer :: fuzzer-timeout.test (4750 of 4806)
PASS: libFuzzer :: memcmp.test (4751 of 4806)
PASS: libFuzzer :: memcmp64.test (4752 of 4806)
PASS: libFuzzer :: merge-posix.test (4753 of 4806)
UNSUPPORTED: libFuzzer :: merge-sigusr.test (4754 of 4806)
PASS: libFuzzer :: merge-control-file.test (4755 of 4806)
PASS: libFuzzer :: merge_two_step.test (4756 of 4806)
PASS: libFuzzer :: merge.test (4757 of 4806)
PASS: libFuzzer :: minimize_two_crashes.test (4758 of 4806)
UNSUPPORTED: libFuzzer :: msan-param-unpoison.test (4759 of 4806)
UNSUPPORTED: libFuzzer :: msan.test (4760 of 4806)
PASS: libFuzzer :: not-instrumented.test (4761 of 4806)
PASS: libFuzzer :: null-deref-on-empty.test (4762 of 4806)
PASS: libFuzzer :: null-deref.test (4763 of 4806)
UNSUPPORTED: libFuzzer :: only-some-bytes-fork.test (4764 of 4806)
UNSUPPORTED: libFuzzer :: only-some-bytes.test (4765 of 4806)
PASS: libFuzzer :: overwrite-input.test (4766 of 4806)
UNSUPPORTED: libFuzzer :: print-func.test (4767 of 4806)
PASS: libFuzzer :: read-binary.test (4768 of 4806)
PASS: libFuzzer :: recommended-dictionary.test (4769 of 4806)
PASS: libFuzzer :: reduce_inputs.test (4770 of 4806)
PASS: libFuzzer :: reload.test (4771 of 4806)
PASS: libFuzzer :: minimize_crash.test (4772 of 4806)
PASS: libFuzzer :: repeated-bytes.test (4773 of 4806)
PASS: libFuzzer :: seed_inputs.test (4774 of 4806)
UNSUPPORTED: libFuzzer :: sigint.test (4775 of 4806)
UNSUPPORTED: libFuzzer :: sigusr.test (4776 of 4806)
UNSUPPORTED: libFuzzer :: simple-cmp.test (4777 of 4806)
PASS: libFuzzer :: shrink.test (4778 of 4806)
PASS: libFuzzer :: standalone.test (4779 of 4806)
PASS: libFuzzer :: simple.test (4780 of 4806)
PASS: libFuzzer :: strcmp.test (4781 of 4806)
PASS: libFuzzer :: strncmp-oob.test (4782 of 4806)
PASS: libFuzzer :: strstr.test (4783 of 4806)
PASS: libFuzzer :: swap-cmp.test (4784 of 4806)
PASS: libFuzzer :: strncmp.test (4785 of 4806)
UNSUPPORTED: libFuzzer :: target-function.test (4786 of 4806)
PASS: libFuzzer :: symbolize-deadlock.test (4787 of 4806)
UNSUPPORTED: libFuzzer :: trace-malloc-2.test (4788 of 4806)
UNSUPPORTED: libFuzzer :: trace-malloc-threaded.test (4789 of 4806)
UNSUPPORTED: libFuzzer :: trace-malloc-unbalanced.test (4790 of 4806)
PASS: libFuzzer :: three-bytes.test (4791 of 4806)
PASS: libFuzzer :: trace-malloc.test (4792 of 4806)
PASS: libFuzzer :: ulimit.test (4793 of 4806)
PASS: libFuzzer :: value-profile-cmp2.test (4794 of 4806)
PASS: libFuzzer :: value-profile-cmp3.test (4795 of 4806)
PASS: libFuzzer :: value-profile-cmp4.test (4796 of 4806)
PASS: libFuzzer :: value-profile-cmp.test (4797 of 4806)
PASS: libFuzzer :: value-profile-div.test (4798 of 4806)
PASS: libFuzzer :: value-profile-mem.test (4799 of 4806)
PASS: libFuzzer :: value-profile-set.test (4800 of 4806)
PASS: libFuzzer :: value-profile-strcmp.test (4801 of 4806)
PASS: libFuzzer :: value-profile-strncmp.test (4802 of 4806)
PASS: libFuzzer :: value-profile-load.test (4803 of 4806)
UNSUPPORTED: libFuzzer :: windows-opt-ref.test (4804 of 4806)
PASS: libFuzzer :: value-profile-switch.test (4805 of 4806)
TIMEOUT: libFuzzer :: large.test (4806 of 4806)
******************** TEST 'libFuzzer :: large.test' FAILED ********************
Script:
--
: 'RUN: at line 1';     /Users/buildslave/jenkins/workspace/clang-stage1-cmake-RA-expensive/clang-build/./bin/clang  --driver-mode=g++ -O2 -gline-tables-only -fsanitize=address,fuzzer -I/Users/buildslave/jenkins/workspace/clang-stage1-cmake-RA-expensive/llvm-project/compiler-rt/lib/fuzzer -arch x86_64 -stdlib=libc++ -mmacosx-version-min=10.9 -isysroot /Applications/Xcode.app/Contents/Developer/Platforms/MacOSX.platform/Developer/SDKs/MacOSX10.13.sdk /Users/buildslave/jenkins/workspace/clang-stage1-cmake-RA-expensive/llvm-project/compiler-rt/test/fuzzer/LargeTest.cpp -o /Users/buildslave/jenkins/workspace/clang-stage1-cmake-RA-expensive/clang-build/tools/clang/runtime/compiler-rt-bins/test/fuzzer/X86_64DefaultDarwinConfig/Output/large.test.tmp-LargeTest
: 'RUN: at line 2';    /Users/buildslave/jenkins/workspace/clang-stage1-cmake-RA-expensive/clang-build/tools/clang/runtime/compiler-rt-bins/test/fuzzer/X86_64DefaultDarwinConfig/Output/large.test.tmp-LargeTest -runs=10000
--
Exit Code: -9
Timeout: Reached timeout of 600 seconds

Hide Details

Hide Details

********************

Hide Details

23 warning(s) in tests.

Hide Details

Testing Time: 2423.05s ******************** Timed Out Tests (1): libFuzzer :: large.test

Hide Details

Expected Passes : 3202 Expected Failures : 54 Unsupported Tests : 1549 Individual Timeouts: 1 FAILED: test/CMakeFiles/check-compiler-rt cd /Users/buildslave/jenkins/workspace/clang-stage1-cmake-RA-expensive/clang-build/tools/clang/runtime/compiler-rt-bins/test && /usr/local/bin/python /Users/buildslave/jenkins/workspace/clang-stage1-cmake-RA-expensive/clang-build/bin/llvm-lit --xunit-xml-output=testresults.xunit.xml -v --timeout=600 /Users/buildslave/jenkins/workspace/clang-stage1-cmake-RA-expensive/clang-build/tools/clang/runtime/compiler-rt-bins/test/builtins/TestCases /Users/buildslave/jenkins/workspace/clang-stage1-cmake-RA-expensive/clang-build/tools/clang/runtime/compiler-rt-bins/test/builtins/Unit/I386DarwinConfig /Users/buildslave/jenkins/workspace/clang-stage1-cmake-RA-expensive/clang-build/tools/clang/runtime/compiler-rt-bins/test/builtins/Unit/X86_64DarwinConfig /Users/buildslave/jenkins/workspace/clang-stage1-cmake-RA-expensive/clang-build/tools/clang/runtime/compiler-rt-bins/test/lsan/I386LsanConfig /Users/buildslave/jenkins/workspace/clang-stage1-cmake-RA-expensive/clang-build/tools/clang/runtime/compiler-rt-bins/test/lsan/I386AsanConfig /Users/buildslave/jenkins/workspace/clang-stage1-cmake-RA-expensive/clang-build/tools/clang/runtime/compiler-rt-bins/test/lsan/X86_64LsanConfig /Users/buildslave/jenkins/workspace/clang-stage1-cmake-RA-expensive/clang-build/tools/clang/runtime/compiler-rt-bins/test/lsan/X86_64AsanConfig /Users/buildslave/jenkins/workspace/clang-stage1-cmake-RA-expensive/clang-build/tools/clang/runtime/compiler-rt-bins/test/ubsan/Standalone-i386 /Users/buildslave/jenkins/workspace/clang-stage1-cmake-RA-expensive/clang-build/tools/clang/runtime/compiler-rt-bins/test/ubsan/AddressSanitizer-i386 /Users/buildslave/jenkins/workspace/clang-stage1-cmake-RA-expensive/clang-build/tools/clang/runtime/compiler-rt-bins/test/ubsan/Standalone-x86_64 /Users/buildslave/jenkins/workspace/clang-stage1-cmake-RA-expensive/clang-build/tools/clang/runtime/compiler-rt-bins/test/ubsan/AddressSanitizer-x86_64 /Users/buildslave/jenkins/workspace/clang-stage1-cmake-RA-expensive/clang-build/tools/clang/runtime/compiler-rt-bins/test/ubsan/ThreadSanitizer-x86_64 /Users/buildslave/jenkins/workspace/clang-stage1-cmake-RA-expensive/clang-build/tools/clang/runtime/compiler-rt-bins/test/ubsan/StandaloneStatic-i386 /Users/buildslave/jenkins/workspace/clang-stage1-cmake-RA-expensive/clang-build/tools/clang/runtime/compiler-rt-bins/test/ubsan/StandaloneStatic-x86_64 /Users/buildslave/jenkins/workspace/clang-stage1-cmake-RA-expensive/clang-build/tools/clang/runtime/compiler-rt-bins/test/cfi/Standalone-i386 /Users/buildslave/jenkins/workspace/clang-stage1-cmake-RA-expensive/clang-build/tools/clang/runtime/compiler-rt-bins/test/cfi/Devirt-i386 /Users/buildslave/jenkins/workspace/clang-stage1-cmake-RA-expensive/clang-build/tools/clang/runtime/compiler-rt-bins/test/cfi/Standalone-x86_64 /Users/buildslave/jenkins/workspace/clang-stage1-cmake-RA-expensive/clang-build/tools/clang/runtime/compiler-rt-bins/test/cfi/Devirt-x86_64 /Users/buildslave/jenkins/workspace/clang-stage1-cmake-RA-expensive/clang-build/tools/clang/runtime/compiler-rt-bins/test/sanitizer_common/asan-i386-Darwin /Users/buildslave/jenkins/workspace/clang-stage1-cmake-RA-expensive/clang-build/tools/clang/runtime/compiler-rt-bins/test/sanitizer_common/asan-x86_64-Darwin /Users/buildslave/jenkins/workspace/clang-stage1-cmake-RA-expensive/clang-build/tools/clang/runtime/compiler-rt-bins/test/sanitizer_common/lsan-x86_64-Darwin /Users/buildslave/jenkins/workspace/clang-stage1-cmake-RA-expensive/clang-build/tools/clang/runtime/compiler-rt-bins/test/sanitizer_common/tsan-x86_64-Darwin /Users/buildslave/jenkins/workspace/clang-stage1-cmake-RA-expensive/clang-build/tools/clang/runtime/compiler-rt-bins/test/sanitizer_common/ubsan-i386-Darwin /Users/buildslave/jenkins/workspace/clang-stage1-cmake-RA-expensive/clang-build/tools/clang/runtime/compiler-rt-bins/test/sanitizer_common/ubsan-x86_64-Darwin /Users/buildslave/jenkins/workspace/clang-stage1-cmake-RA-expensive/clang-build/tools/clang/runtime/compiler-rt-bins/test/sanitizer_common/Unit /Users/buildslave/jenkins/workspace/clang-stage1-cmake-RA-expensive/clang-build/tools/clang/runtime/compiler-rt-bins/test/fuzzer/unit /Users/buildslave/jenkins/workspace/clang-stage1-cmake-RA-expensive/clang-build/tools/clang/runtime/compiler-rt-bins/test/fuzzer/X86_64DefaultDarwinConfig/ /Users/buildslave/jenkins/workspace/clang-stage1-cmake-RA-expensive/clang-build/tools/clang/runtime/compiler-rt-bins/test/asan/I386DarwinConfig /Users/buildslave/jenkins/workspace/clang-stage1-cmake-RA-expensive/clang-build/tools/clang/runtime/compiler-rt-bins/test/asan/X86_64DarwinConfig /Users/buildslave/jenkins/workspace/clang-stage1-cmake-RA-expensive/clang-build/tools/clang/runtime/compiler-rt-bins/test/asan/Unit /Users/buildslave/jenkins/workspace/clang-stage1-cmake-RA-expensive/clang-build/tools/clang/runtime/compiler-rt-bins/test/tsan/X86_64Config /Users/buildslave/jenkins/workspace/clang-stage1-cmake-RA-expensive/clang-build/tools/clang/runtime/compiler-rt-bins/test/tsan/Unit /Users/buildslave/jenkins/workspace/clang-stage1-cmake-RA-expensive/clang-build/tools/clang/runtime/compiler-rt-bins/test/ubsan_minimal/i386 /Users/buildslave/jenkins/workspace/clang-stage1-cmake-RA-expensive/clang-build/tools/clang/runtime/compiler-rt-bins/test/ubsan_minimal/x86_64 /Users/buildslave/jenkins/workspace/clang-stage1-cmake-RA-expensive/clang-build/tools/clang/runtime/compiler-rt-bins/test/profile/Profile-i386 /Users/buildslave/jenkins/workspace/clang-stage1-cmake-RA-expensive/clang-build/tools/clang/runtime/compiler-rt-bins/test/profile/Profile-x86_64 /Users/buildslave/jenkins/workspace/clang-stage1-cmake-RA-expensive/clang-build/tools/clang/runtime/compiler-rt-bins/test/xray/X86_64DarwinConfig /Users/buildslave/jenkins/workspace/clang-stage1-cmake-RA-expensive/clang-build/tools/clang/runtime/compiler-rt-bins/test/xray/X86_64HDarwinConfig /Users/buildslave/jenkins/workspace/clang-stage1-cmake-RA-expensive/clang-build/tools/clang/runtime/compiler-rt-bins/test/shadowcallstack/arm64 ninja: build stopped: subcommand failed. [66/698] /Applications/Xcode.app/Contents/Developer/Toolchains/XcodeDefault.xctoolchain/usr/bin/c++ -DBUILD_EXAMPLES -DEXPENSIVE_CHECKS -DGTEST_HAS_RTTI=0 -DGTEST_HAS_TR1_TUPLE=0 -DGTEST_LANG_CXX11=1 -D_DEBUG -D_GLIBCXX_DEBUG -D__STDC_CONSTANT_MACROS -D__STDC_FORMAT_MACROS -D__STDC_LIMIT_MACROS -Iunittests/Analysis -I/Users/buildslave/jenkins/workspace/clang-stage1-cmake-RA-expensive/llvm-project/llvm/unittests/Analysis -I/Applications/Xcode.app/Contents/Developer/Platforms/MacOSX.platform/Developer/SDKs/MacOSX10.13.sdk/usr/include/libxml2 -Iinclude -I/Users/buildslave/jenkins/workspace/clang-stage1-cmake-RA-expensive/llvm-project/llvm/include -I/Users/buildslave/jenkins/workspace/clang-stage1-cmake-RA-expensive/llvm-project/llvm/utils/unittest/googletest/include -I/Users/buildslave/jenkins/workspace/clang-stage1-cmake-RA-expensive/llvm-project/llvm/utils/unittest/googlemock/include -fPIC -fvisibility-inlines-hidden -Werror=date-time -Werror=unguarded-availability-new -Wall -Wextra -Wno-unused-parameter -Wwrite-strings -Wcast-qual -Wmissing-field-initializers -pedantic -Wno-long-long -Wimplicit-fallthrough -Wcovered-switch-default -Wno-noexcept-type -Wnon-virtual-dtor -Wdelete-non-virtual-dtor -Wstring-conversion -fdiagnostics-color -O3 -isysroot /Applications/Xcode.app/Contents/Developer/Platforms/MacOSX.platform/Developer/SDKs/MacOSX10.13.sdk -mmacosx-version-min=10.9 -UNDEBUG -Wno-variadic-macros -Wno-gnu-zero-variadic-macro-arguments -fno-exceptions -fno-rtti -std=c++14 -MD -MT unittests/Analysis/CMakeFiles/AnalysisTests.dir/AliasAnalysisTest.cpp.o -MF unittests/Analysis/CMakeFiles/AnalysisTests.dir/AliasAnalysisTest.cpp.o.d -o unittests/Analysis/CMakeFiles/AnalysisTests.dir/AliasAnalysisTest.cpp.o -c /Users/buildslave/jenkins/workspace/clang-stage1-cmake-RA-expensive/llvm-project/llvm/unittests/Analysis/AliasAnalysisTest.cpp FAILED: unittests/Analysis/CMakeFiles/AnalysisTests.dir/AliasAnalysisTest.cpp.o /Applications/Xcode.app/Contents/Developer/Toolchains/XcodeDefault.xctoolchain/usr/bin/c++ -DBUILD_EXAMPLES -DEXPENSIVE_CHECKS -DGTEST_HAS_RTTI=0 -DGTEST_HAS_TR1_TUPLE=0 -DGTEST_LANG_CXX11=1 -D_DEBUG -D_GLIBCXX_DEBUG -D__STDC_CONSTANT_MACROS -D__STDC_FORMAT_MACROS -D__STDC_LIMIT_MACROS -Iunittests/Analysis -I/Users/buildslave/jenkins/workspace/clang-stage1-cmake-RA-expensive/llvm-project/llvm/unittests/Analysis -I/Applications/Xcode.app/Contents/Developer/Platforms/MacOSX.platform/Developer/SDKs/MacOSX10.13.sdk/usr/include/libxml2 -Iinclude -I/Users/buildslave/jenkins/workspace/clang-stage1-cmake-RA-expensive/llvm-project/llvm/include -I/Users/buildslave/jenkins/workspace/clang-stage1-cmake-RA-expensive/llvm-project/llvm/utils/unittest/googletest/include -I/Users/buildslave/jenkins/workspace/clang-stage1-cmake-RA-expensive/llvm-project/llvm/utils/unittest/googlemock/include -fPIC -fvisibility-inlines-hidden -Werror=date-time -Werror=unguarded-availability-new -Wall -Wextra -Wno-unused-parameter -Wwrite-strings -Wcast-qual -Wmissing-field-initializers -pedantic -Wno-long-long -Wimplicit-fallthrough -Wcovered-switch-default -Wno-noexcept-type -Wnon-virtual-dtor -Wdelete-non-virtual-dtor -Wstring-conversion -fdiagnostics-color -O3 -isysroot /Applications/Xcode.app/Contents/Developer/Platforms/MacOSX.platform/Developer/SDKs/MacOSX10.13.sdk -mmacosx-version-min=10.9 -UNDEBUG -Wno-variadic-macros -Wno-gnu-zero-variadic-macro-arguments -fno-exceptions -fno-rtti -std=c++14 -MD -MT unittests/Analysis/CMakeFiles/AnalysisTests.dir/AliasAnalysisTest.cpp.o -MF unittests/Analysis/CMakeFiles/AnalysisTests.dir/AliasAnalysisTest.cpp.o.d -o unittests/Analysis/CMakeFiles/AnalysisTests.dir/AliasAnalysisTest.cpp.o -c /Users/buildslave/jenkins/workspace/clang-stage1-cmake-RA-expensive/llvm-project/llvm/unittests/Analysis/AliasAnalysisTest.cpp /Users/buildslave/jenkins/workspace/clang-stage1-cmake-RA-expensive/llvm-project/llvm/unittests/Analysis/AliasAnalysisTest.cpp:68:1: error: use of undeclared identifier 'initializeAAResultsWrapperPassPass'; did you mean 'initializeTestCustomAAWrapperPassPass'? INITIALIZE_PASS_DEPENDENCY(AAResultsWrapperPass) ^ /Users/buildslave/jenkins/workspace/clang-stage1-cmake-RA-expensive/llvm-project/llvm/include/llvm/PassSupport.h:50:45: note: expanded from macro 'INITIALIZE_PASS_DEPENDENCY' #define INITIALIZE_PASS_DEPENDENCY(depName) initialize##depName##Pass(Registry); ^ <scratch space>:41:1: note: expanded from here initializeAAResultsWrapperPassPass ^ /Users/buildslave/jenkins/workspace/clang-stage1-cmake-RA-expensive/llvm-project/llvm/unittests/Analysis/AliasAnalysisTest.cpp:29:6: note: 'initializeTestCustomAAWrapperPassPass' declared here void initializeTestCustomAAWrapperPassPass(PassRegistry&); ^ /Users/buildslave/jenkins/workspace/clang-stage1-cmake-RA-expensive/llvm-project/llvm/unittests/Analysis/AliasAnalysisTest.cpp:135:1: error: use of undeclared identifier 'initializeTargetLibraryInfoWrapperPassPass' INITIALIZE_PASS_DEPENDENCY(TargetLibraryInfoWrapperPass) ^ /Users/buildslave/jenkins/workspace/clang-stage1-cmake-RA-expensive/llvm-project/llvm/include/llvm/PassSupport.h:50:45: note: expanded from macro 'INITIALIZE_PASS_DEPENDENCY' #define INITIALIZE_PASS_DEPENDENCY(depName) initialize##depName##Pass(Registry); ^ <scratch space>:53:1: note: expanded from here initializeTargetLibraryInfoWrapperPassPass ^ 2 errors generated. [327/698] cd /Users/buildslave/jenkins/workspace/clang-stage1-cmake-RA-expensive/llvm-project/clang/bindings/python && /usr/local/Cellar/cmake/3.13.1/bin/cmake -E env CLANG_LIBRARY_PATH=/Users/buildslave/jenkins/workspace/clang-stage1-cmake-RA-expensive/clang-build/lib /usr/local/bin/python -m unittest discover ..........s..s......................................................................s.s.......s...s........................... ---------------------------------------------------------------------- Ran 126 tests in 3.546s

Hide Details

OK (skipped=6) [335/698] /Applications/Xcode.app/Contents/Developer/Toolchains/XcodeDefault.xctoolchain/usr/bin/c++ -DBUILD_EXAMPLES -DEXPENSIVE_CHECKS -DGTEST_HAS_RTTI=0 -DGTEST_HAS_TR1_TUPLE=0 -DGTEST_LANG_CXX11=1 -D_DEBUG -D_GLIBCXX_DEBUG -D__STDC_CONSTANT_MACROS -D__STDC_FORMAT_MACROS -D__STDC_LIMIT_MACROS -Iunittests/Analysis -I/Users/buildslave/jenkins/workspace/clang-stage1-cmake-RA-expensive/llvm-project/llvm/unittests/Analysis -I/Applications/Xcode.app/Contents/Developer/Platforms/MacOSX.platform/Developer/SDKs/MacOSX10.13.sdk/usr/include/libxml2 -Iinclude -I/Users/buildslave/jenkins/workspace/clang-stage1-cmake-RA-expensive/llvm-project/llvm/include -I/Users/buildslave/jenkins/workspace/clang-stage1-cmake-RA-expensive/llvm-project/llvm/utils/unittest/googletest/include -I/Users/buildslave/jenkins/workspace/clang-stage1-cmake-RA-expensive/llvm-project/llvm/utils/unittest/googlemock/include -fPIC -fvisibility-inlines-hidden -Werror=date-time -Werror=unguarded-availability-new -Wall -Wextra -Wno-unused-parameter -Wwrite-strings -Wcast-qual -Wmissing-field-initializers -pedantic -Wno-long-long -Wimplicit-fallthrough -Wcovered-switch-default -Wno-noexcept-type -Wnon-virtual-dtor -Wdelete-non-virtual-dtor -Wstring-conversion -fdiagnostics-color -O3 -isysroot /Applications/Xcode.app/Contents/Developer/Platforms/MacOSX.platform/Developer/SDKs/MacOSX10.13.sdk -mmacosx-version-min=10.9 -UNDEBUG -Wno-variadic-macros -Wno-gnu-zero-variadic-macro-arguments -fno-exceptions -fno-rtti -std=c++14 -MD -MT unittests/Analysis/CMakeFiles/AnalysisTests.dir/CFGTest.cpp.o -MF unittests/Analysis/CMakeFiles/AnalysisTests.dir/CFGTest.cpp.o.d -o unittests/Analysis/CMakeFiles/AnalysisTests.dir/CFGTest.cpp.o -c /Users/buildslave/jenkins/workspace/clang-stage1-cmake-RA-expensive/llvm-project/llvm/unittests/Analysis/CFGTest.cpp FAILED: unittests/Analysis/CMakeFiles/AnalysisTests.dir/CFGTest.cpp.o /Applications/Xcode.app/Contents/Developer/Toolchains/XcodeDefault.xctoolchain/usr/bin/c++ -DBUILD_EXAMPLES -DEXPENSIVE_CHECKS -DGTEST_HAS_RTTI=0 -DGTEST_HAS_TR1_TUPLE=0 -DGTEST_LANG_CXX11=1 -D_DEBUG -D_GLIBCXX_DEBUG -D__STDC_CONSTANT_MACROS -D__STDC_FORMAT_MACROS -D__STDC_LIMIT_MACROS -Iunittests/Analysis -I/Users/buildslave/jenkins/workspace/clang-stage1-cmake-RA-expensive/llvm-project/llvm/unittests/Analysis -I/Applications/Xcode.app/Contents/Developer/Platforms/MacOSX.platform/Developer/SDKs/MacOSX10.13.sdk/usr/include/libxml2 -Iinclude -I/Users/buildslave/jenkins/workspace/clang-stage1-cmake-RA-expensive/llvm-project/llvm/include -I/Users/buildslave/jenkins/workspace/clang-stage1-cmake-RA-expensive/llvm-project/llvm/utils/unittest/googletest/include -I/Users/buildslave/jenkins/workspace/clang-stage1-cmake-RA-expensive/llvm-project/llvm/utils/unittest/googlemock/include -fPIC -fvisibility-inlines-hidden -Werror=date-time -Werror=unguarded-availability-new -Wall -Wextra -Wno-unused-parameter -Wwrite-strings -Wcast-qual -Wmissing-field-initializers -pedantic -Wno-long-long -Wimplicit-fallthrough -Wcovered-switch-default -Wno-noexcept-type -Wnon-virtual-dtor -Wdelete-non-virtual-dtor -Wstring-conversion -fdiagnostics-color -O3 -isysroot /Applications/Xcode.app/Contents/Developer/Platforms/MacOSX.platform/Developer/SDKs/MacOSX10.13.sdk -mmacosx-version-min=10.9 -UNDEBUG -Wno-variadic-macros -Wno-gnu-zero-variadic-macro-arguments -fno-exceptions -fno-rtti -std=c++14 -MD -MT unittests/Analysis/CMakeFiles/AnalysisTests.dir/CFGTest.cpp.o -MF unittests/Analysis/CMakeFiles/AnalysisTests.dir/CFGTest.cpp.o.d -o unittests/Analysis/CMakeFiles/AnalysisTests.dir/CFGTest.cpp.o -c /Users/buildslave/jenkins/workspace/clang-stage1-cmake-RA-expensive/llvm-project/llvm/unittests/Analysis/CFGTest.cpp /Users/buildslave/jenkins/workspace/clang-stage1-cmake-RA-expensive/llvm-project/llvm/unittests/Analysis/CFGTest.cpp:83:10: error: use of undeclared identifier 'initializeLoopInfoWrapperPassPass' initializeLoopInfoWrapperPassPass(*PassRegistry::getPassRegistry()); ^ /Users/buildslave/jenkins/workspace/clang-stage1-cmake-RA-expensive/llvm-project/llvm/unittests/Analysis/CFGTest.cpp:84:10: error: use of undeclared identifier 'initializeDominatorTreeWrapperPassPass' initializeDominatorTreeWrapperPassPass( ^ 2 errors generated. [359/698] /Applications/Xcode.app/Contents/Developer/Toolchains/XcodeDefault.xctoolchain/usr/bin/c++ -DBUILD_EXAMPLES -DEXPENSIVE_CHECKS -DGTEST_HAS_RTTI=0 -DGTEST_HAS_TR1_TUPLE=0 -DGTEST_LANG_CXX11=1 -D_DEBUG -D_GLIBCXX_DEBUG -D__STDC_CONSTANT_MACROS -D__STDC_FORMAT_MACROS -D__STDC_LIMIT_MACROS -Iunittests/Analysis -I/Users/buildslave/jenkins/workspace/clang-stage1-cmake-RA-expensive/llvm-project/llvm/unittests/Analysis -I/Applications/Xcode.app/Contents/Developer/Platforms/MacOSX.platform/Developer/SDKs/MacOSX10.13.sdk/usr/include/libxml2 -Iinclude -I/Users/buildslave/jenkins/workspace/clang-stage1-cmake-RA-expensive/llvm-project/llvm/include -I/Users/buildslave/jenkins/workspace/clang-stage1-cmake-RA-expensive/llvm-project/llvm/utils/unittest/googletest/include -I/Users/buildslave/jenkins/workspace/clang-stage1-cmake-RA-expensive/llvm-project/llvm/utils/unittest/googlemock/include -fPIC -fvisibility-inlines-hidden -Werror=date-time -Werror=unguarded-availability-new -Wall -Wextra -Wno-unused-parameter -Wwrite-strings -Wcast-qual -Wmissing-field-initializers -pedantic -Wno-long-long -Wimplicit-fallthrough -Wcovered-switch-default -Wno-noexcept-type -Wnon-virtual-dtor -Wdelete-non-virtual-dtor -Wstring-conversion -fdiagnostics-color -O3 -isysroot /Applications/Xcode.app/Contents/Developer/Platforms/MacOSX.platform/Developer/SDKs/MacOSX10.13.sdk -mmacosx-version-min=10.9 -UNDEBUG -Wno-variadic-macros -Wno-gnu-zero-variadic-macro-arguments -fno-exceptions -fno-rtti -std=c++14 -MD -MT unittests/Analysis/CMakeFiles/AnalysisTests.dir/UnrollAnalyzerTest.cpp.o -MF unittests/Analysis/CMakeFiles/AnalysisTests.dir/UnrollAnalyzerTest.cpp.o.d -o unittests/Analysis/CMakeFiles/AnalysisTests.dir/UnrollAnalyzerTest.cpp.o -c /Users/buildslave/jenkins/workspace/clang-stage1-cmake-RA-expensive/llvm-project/llvm/unittests/Analysis/UnrollAnalyzerTest.cpp FAILED: unittests/Analysis/CMakeFiles/AnalysisTests.dir/UnrollAnalyzerTest.cpp.o /Applications/Xcode.app/Contents/Developer/Toolchains/XcodeDefault.xctoolchain/usr/bin/c++ -DBUILD_EXAMPLES -DEXPENSIVE_CHECKS -DGTEST_HAS_RTTI=0 -DGTEST_HAS_TR1_TUPLE=0 -DGTEST_LANG_CXX11=1 -D_DEBUG -D_GLIBCXX_DEBUG -D__STDC_CONSTANT_MACROS -D__STDC_FORMAT_MACROS -D__STDC_LIMIT_MACROS -Iunittests/Analysis -I/Users/buildslave/jenkins/workspace/clang-stage1-cmake-RA-expensive/llvm-project/llvm/unittests/Analysis -I/Applications/Xcode.app/Contents/Developer/Platforms/MacOSX.platform/Developer/SDKs/MacOSX10.13.sdk/usr/include/libxml2 -Iinclude -I/Users/buildslave/jenkins/workspace/clang-stage1-cmake-RA-expensive/llvm-project/llvm/include -I/Users/buildslave/jenkins/workspace/clang-stage1-cmake-RA-expensive/llvm-project/llvm/utils/unittest/googletest/include -I/Users/buildslave/jenkins/workspace/clang-stage1-cmake-RA-expensive/llvm-project/llvm/utils/unittest/googlemock/include -fPIC -fvisibility-inlines-hidden -Werror=date-time -Werror=unguarded-availability-new -Wall -Wextra -Wno-unused-parameter -Wwrite-strings -Wcast-qual -Wmissing-field-initializers -pedantic -Wno-long-long -Wimplicit-fallthrough -Wcovered-switch-default -Wno-noexcept-type -Wnon-virtual-dtor -Wdelete-non-virtual-dtor -Wstring-conversion -fdiagnostics-color -O3 -isysroot /Applications/Xcode.app/Contents/Developer/Platforms/MacOSX.platform/Developer/SDKs/MacOSX10.13.sdk -mmacosx-version-min=10.9 -UNDEBUG -Wno-variadic-macros -Wno-gnu-zero-variadic-macro-arguments -fno-exceptions -fno-rtti -std=c++14 -MD -MT unittests/Analysis/CMakeFiles/AnalysisTests.dir/UnrollAnalyzerTest.cpp.o -MF unittests/Analysis/CMakeFiles/AnalysisTests.dir/UnrollAnalyzerTest.cpp.o.d -o unittests/Analysis/CMakeFiles/AnalysisTests.dir/UnrollAnalyzerTest.cpp.o -c /Users/buildslave/jenkins/workspace/clang-stage1-cmake-RA-expensive/llvm-project/llvm/unittests/Analysis/UnrollAnalyzerTest.cpp /Users/buildslave/jenkins/workspace/clang-stage1-cmake-RA-expensive/llvm-project/llvm/unittests/Analysis/UnrollAnalyzerTest.cpp:325:1: error: use of undeclared identifier 'initializeDominatorTreeWrapperPassPass' INITIALIZE_PASS_DEPENDENCY(DominatorTreeWrapperPass) ^ /Users/buildslave/jenkins/workspace/clang-stage1-cmake-RA-expensive/llvm-project/llvm/include/llvm/PassSupport.h:50:45: note: expanded from macro 'INITIALIZE_PASS_DEPENDENCY' #define INITIALIZE_PASS_DEPENDENCY(depName) initialize##depName##Pass(Registry); ^ <scratch space>:98:1: note: expanded from here initializeDominatorTreeWrapperPassPass ^ /Users/buildslave/jenkins/workspace/clang-stage1-cmake-RA-expensive/llvm-project/llvm/unittests/Analysis/UnrollAnalyzerTest.cpp:326:1: error: use of undeclared identifier 'initializeLoopInfoWrapperPassPass' INITIALIZE_PASS_DEPENDENCY(LoopInfoWrapperPass) ^ /Users/buildslave/jenkins/workspace/clang-stage1-cmake-RA-expensive/llvm-project/llvm/include/llvm/PassSupport.h:50:45: note: expanded from macro 'INITIALIZE_PASS_DEPENDENCY' #define INITIALIZE_PASS_DEPENDENCY(depName) initialize##depName##Pass(Registry); ^ <scratch space>:100:1: note: expanded from here initializeLoopInfoWrapperPassPass ^ /Users/buildslave/jenkins/workspace/clang-stage1-cmake-RA-expensive/llvm-project/llvm/unittests/Analysis/UnrollAnalyzerTest.cpp:327:1: error: use of undeclared identifier 'initializeScalarEvolutionWrapperPassPass' INITIALIZE_PASS_DEPENDENCY(ScalarEvolutionWrapperPass) ^ /Users/buildslave/jenkins/workspace/clang-stage1-cmake-RA-expensive/llvm-project/llvm/include/llvm/PassSupport.h:50:45: note: expanded from macro 'INITIALIZE_PASS_DEPENDENCY' #define INITIALIZE_PASS_DEPENDENCY(depName) initialize##depName##Pass(Registry); ^ <scratch space>:2:1: note: expanded from here initializeScalarEvolutionWrapperPassPass ^ 3 errors generated. [384/698] /Applications/Xcode.app/Contents/Developer/Toolchains/XcodeDefault.xctoolchain/usr/bin/c++ -DBUILD_EXAMPLES -DEXPENSIVE_CHECKS -DGTEST_HAS_RTTI=0 -DGTEST_HAS_TR1_TUPLE=0 -DGTEST_LANG_CXX11=1 -D_DEBUG -D_GLIBCXX_DEBUG -D__STDC_CONSTANT_MACROS -D__STDC_FORMAT_MACROS -D__STDC_LIMIT_MACROS -Iunittests/CodeGen -I/Users/buildslave/jenkins/workspace/clang-stage1-cmake-RA-expensive/llvm-project/llvm/unittests/CodeGen -I/Applications/Xcode.app/Contents/Developer/Platforms/MacOSX.platform/Developer/SDKs/MacOSX10.13.sdk/usr/include/libxml2 -Iinclude -I/Users/buildslave/jenkins/workspace/clang-stage1-cmake-RA-expensive/llvm-project/llvm/include -I/Users/buildslave/jenkins/workspace/clang-stage1-cmake-RA-expensive/llvm-project/llvm/utils/unittest/googletest/include -I/Users/buildslave/jenkins/workspace/clang-stage1-cmake-RA-expensive/llvm-project/llvm/utils/unittest/googlemock/include -fPIC -fvisibility-inlines-hidden -Werror=date-time -Werror=unguarded-availability-new -Wall -Wextra -Wno-unused-parameter -Wwrite-strings -Wcast-qual -Wmissing-field-initializers -pedantic -Wno-long-long -Wimplicit-fallthrough -Wcovered-switch-default -Wno-noexcept-type -Wnon-virtual-dtor -Wdelete-non-virtual-dtor -Wstring-conversion -fdiagnostics-color -O3 -isysroot /Applications/Xcode.app/Contents/Developer/Platforms/MacOSX.platform/Developer/SDKs/MacOSX10.13.sdk -mmacosx-version-min=10.9 -UNDEBUG -Wno-variadic-macros -Wno-gnu-zero-variadic-macro-arguments -fno-exceptions -fno-rtti -std=c++14 -MD -MT unittests/CodeGen/CMakeFiles/CodeGenTests.dir/TargetOptionsTest.cpp.o -MF unittests/CodeGen/CMakeFiles/CodeGenTests.dir/TargetOptionsTest.cpp.o.d -o unittests/CodeGen/CMakeFiles/CodeGenTests.dir/TargetOptionsTest.cpp.o -c /Users/buildslave/jenkins/workspace/clang-stage1-cmake-RA-expensive/llvm-project/llvm/unittests/CodeGen/TargetOptionsTest.cpp FAILED: unittests/CodeGen/CMakeFiles/CodeGenTests.dir/TargetOptionsTest.cpp.o /Applications/Xcode.app/Contents/Developer/Toolchains/XcodeDefault.xctoolchain/usr/bin/c++ -DBUILD_EXAMPLES -DEXPENSIVE_CHECKS -DGTEST_HAS_RTTI=0 -DGTEST_HAS_TR1_TUPLE=0 -DGTEST_LANG_CXX11=1 -D_DEBUG -D_GLIBCXX_DEBUG -D__STDC_CONSTANT_MACROS -D__STDC_FORMAT_MACROS -D__STDC_LIMIT_MACROS -Iunittests/CodeGen -I/Users/buildslave/jenkins/workspace/clang-stage1-cmake-RA-expensive/llvm-project/llvm/unittests/CodeGen -I/Applications/Xcode.app/Contents/Developer/Platforms/MacOSX.platform/Developer/SDKs/MacOSX10.13.sdk/usr/include/libxml2 -Iinclude -I/Users/buildslave/jenkins/workspace/clang-stage1-cmake-RA-expensive/llvm-project/llvm/include -I/Users/buildslave/jenkins/workspace/clang-stage1-cmake-RA-expensive/llvm-project/llvm/utils/unittest/googletest/include -I/Users/buildslave/jenkins/workspace/clang-stage1-cmake-RA-expensive/llvm-project/llvm/utils/unittest/googlemock/include -fPIC -fvisibility-inlines-hidden -Werror=date-time -Werror=unguarded-availability-new -Wall -Wextra -Wno-unused-parameter -Wwrite-strings -Wcast-qual -Wmissing-field-initializers -pedantic -Wno-long-long -Wimplicit-fallthrough -Wcovered-switch-default -Wno-noexcept-type -Wnon-virtual-dtor -Wdelete-non-virtual-dtor -Wstring-conversion -fdiagnostics-color -O3 -isysroot /Applications/Xcode.app/Contents/Developer/Platforms/MacOSX.platform/Developer/SDKs/MacOSX10.13.sdk -mmacosx-version-min=10.9 -UNDEBUG -Wno-variadic-macros -Wno-gnu-zero-variadic-macro-arguments -fno-exceptions -fno-rtti -std=c++14 -MD -MT unittests/CodeGen/CMakeFiles/CodeGenTests.dir/TargetOptionsTest.cpp.o -MF unittests/CodeGen/CMakeFiles/CodeGenTests.dir/TargetOptionsTest.cpp.o.d -o unittests/CodeGen/CMakeFiles/CodeGenTests.dir/TargetOptionsTest.cpp.o -c /Users/buildslave/jenkins/workspace/clang-stage1-cmake-RA-expensive/llvm-project/llvm/unittests/CodeGen/TargetOptionsTest.cpp /Users/buildslave/jenkins/workspace/clang-stage1-cmake-RA-expensive/llvm-project/llvm/unittests/CodeGen/TargetOptionsTest.cpp:25:3: error: use of undeclared identifier 'initializeCore' initializeCore(*Registry); ^ /Users/buildslave/jenkins/workspace/clang-stage1-cmake-RA-expensive/llvm-project/llvm/unittests/CodeGen/TargetOptionsTest.cpp:26:3: error: use of undeclared identifier 'initializeCodeGen' initializeCodeGen(*Registry); ^ 2 errors generated. [390/698] /Applications/Xcode.app/Contents/Developer/Toolchains/XcodeDefault.xctoolchain/usr/bin/c++ -DBUILD_EXAMPLES -DEXPENSIVE_CHECKS -DGTEST_HAS_RTTI=0 -DGTEST_HAS_TR1_TUPLE=0 -DGTEST_LANG_CXX11=1 -D_DEBUG -D_GLIBCXX_DEBUG -D__STDC_CONSTANT_MACROS -D__STDC_FORMAT_MACROS -D__STDC_LIMIT_MACROS -Iunittests/CodeGen/GlobalISel -I/Users/buildslave/jenkins/workspace/clang-stage1-cmake-RA-expensive/llvm-project/llvm/unittests/CodeGen/GlobalISel -I/Applications/Xcode.app/Contents/Developer/Platforms/MacOSX.platform/Developer/SDKs/MacOSX10.13.sdk/usr/include/libxml2 -Iinclude -I/Users/buildslave/jenkins/workspace/clang-stage1-cmake-RA-expensive/llvm-project/llvm/include -I/Users/buildslave/jenkins/workspace/clang-stage1-cmake-RA-expensive/llvm-project/llvm/utils/unittest/googletest/include -I/Users/buildslave/jenkins/workspace/clang-stage1-cmake-RA-expensive/llvm-project/llvm/utils/unittest/googlemock/include -fPIC -fvisibility-inlines-hidden -Werror=date-time -Werror=unguarded-availability-new -Wall -Wextra -Wno-unused-parameter -Wwrite-strings -Wcast-qual -Wmissing-field-initializers -pedantic -Wno-long-long -Wimplicit-fallthrough -Wcovered-switch-default -Wno-noexcept-type -Wnon-virtual-dtor -Wdelete-non-virtual-dtor -Wstring-conversion -fdiagnostics-color -O3 -isysroot /Applications/Xcode.app/Contents/Developer/Platforms/MacOSX.platform/Developer/SDKs/MacOSX10.13.sdk -mmacosx-version-min=10.9 -UNDEBUG -Wno-variadic-macros -Wno-gnu-zero-variadic-macro-arguments -fno-exceptions -fno-rtti -std=c++14 -MD -MT unittests/CodeGen/GlobalISel/CMakeFiles/GlobalISelTests.dir/CSETest.cpp.o -MF unittests/CodeGen/GlobalISel/CMakeFiles/GlobalISelTests.dir/CSETest.cpp.o.d -o unittests/CodeGen/GlobalISel/CMakeFiles/GlobalISelTests.dir/CSETest.cpp.o -c /Users/buildslave/jenkins/workspace/clang-stage1-cmake-RA-expensive/llvm-project/llvm/unittests/CodeGen/GlobalISel/CSETest.cpp FAILED: unittests/CodeGen/GlobalISel/CMakeFiles/GlobalISelTests.dir/CSETest.cpp.o /Applications/Xcode.app/Contents/Developer/Toolchains/XcodeDefault.xctoolchain/usr/bin/c++ -DBUILD_EXAMPLES -DEXPENSIVE_CHECKS -DGTEST_HAS_RTTI=0 -DGTEST_HAS_TR1_TUPLE=0 -DGTEST_LANG_CXX11=1 -D_DEBUG -D_GLIBCXX_DEBUG -D__STDC_CONSTANT_MACROS -D__STDC_FORMAT_MACROS -D__STDC_LIMIT_MACROS -Iunittests/CodeGen/GlobalISel -I/Users/buildslave/jenkins/workspace/clang-stage1-cmake-RA-expensive/llvm-project/llvm/unittests/CodeGen/GlobalISel -I/Applications/Xcode.app/Contents/Developer/Platforms/MacOSX.platform/Developer/SDKs/MacOSX10.13.sdk/usr/include/libxml2 -Iinclude -I/Users/buildslave/jenkins/workspace/clang-stage1-cmake-RA-expensive/llvm-project/llvm/include -I/Users/buildslave/jenkins/workspace/clang-stage1-cmake-RA-expensive/llvm-project/llvm/utils/unittest/googletest/include -I/Users/buildslave/jenkins/workspace/clang-stage1-cmake-RA-expensive/llvm-project/llvm/utils/unittest/googlemock/include -fPIC -fvisibility-inlines-hidden -Werror=date-time -Werror=unguarded-availability-new -Wall -Wextra -Wno-unused-parameter -Wwrite-strings -Wcast-qual -Wmissing-field-initializers -pedantic -Wno-long-long -Wimplicit-fallthrough -Wcovered-switch-default -Wno-noexcept-type -Wnon-virtual-dtor -Wdelete-non-virtual-dtor -Wstring-conversion -fdiagnostics-color -O3 -isysroot /Applications/Xcode.app/Contents/Developer/Platforms/MacOSX.platform/Developer/SDKs/MacOSX10.13.sdk -mmacosx-version-min=10.9 -UNDEBUG -Wno-variadic-macros -Wno-gnu-zero-variadic-macro-arguments -fno-exceptions -fno-rtti -std=c++14 -MD -MT unittests/CodeGen/GlobalISel/CMakeFiles/GlobalISelTests.dir/CSETest.cpp.o -MF unittests/CodeGen/GlobalISel/CMakeFiles/GlobalISelTests.dir/CSETest.cpp.o.d -o unittests/CodeGen/GlobalISel/CMakeFiles/GlobalISelTests.dir/CSETest.cpp.o -c /Users/buildslave/jenkins/workspace/clang-stage1-cmake-RA-expensive/llvm-project/llvm/unittests/CodeGen/GlobalISel/CSETest.cpp In file included from /Users/buildslave/jenkins/workspace/clang-stage1-cmake-RA-expensive/llvm-project/llvm/unittests/CodeGen/GlobalISel/CSETest.cpp:9: /Users/buildslave/jenkins/workspace/clang-stage1-cmake-RA-expensive/llvm-project/llvm/unittests/CodeGen/GlobalISel/GISelMITest.h:42:3: error: use of undeclared identifier 'initializeCore' initializeCore(*Registry); ^ /Users/buildslave/jenkins/workspace/clang-stage1-cmake-RA-expensive/llvm-project/llvm/unittests/CodeGen/GlobalISel/GISelMITest.h:43:3: error: use of undeclared identifier 'initializeCodeGen' initializeCodeGen(*Registry); ^ 2 errors generated. [391/698] /Applications/Xcode.app/Contents/Developer/Toolchains/XcodeDefault.xctoolchain/usr/bin/c++ -DBUILD_EXAMPLES -DEXPENSIVE_CHECKS -DGTEST_HAS_RTTI=0 -DGTEST_HAS_TR1_TUPLE=0 -DGTEST_LANG_CXX11=1 -D_DEBUG -D_GLIBCXX_DEBUG -D__STDC_CONSTANT_MACROS -D__STDC_FORMAT_MACROS -D__STDC_LIMIT_MACROS -Iunittests/CodeGen/GlobalISel -I/Users/buildslave/jenkins/workspace/clang-stage1-cmake-RA-expensive/llvm-project/llvm/unittests/CodeGen/GlobalISel -I/Applications/Xcode.app/Contents/Developer/Platforms/MacOSX.platform/Developer/SDKs/MacOSX10.13.sdk/usr/include/libxml2 -Iinclude -I/Users/buildslave/jenkins/workspace/clang-stage1-cmake-RA-expensive/llvm-project/llvm/include -I/Users/buildslave/jenkins/workspace/clang-stage1-cmake-RA-expensive/llvm-project/llvm/utils/unittest/googletest/include -I/Users/buildslave/jenkins/workspace/clang-stage1-cmake-RA-expensive/llvm-project/llvm/utils/unittest/googlemock/include -fPIC -fvisibility-inlines-hidden -Werror=date-time -Werror=unguarded-availability-new -Wall -Wextra -Wno-unused-parameter -Wwrite-strings -Wcast-qual -Wmissing-field-initializers -pedantic -Wno-long-long -Wimplicit-fallthrough -Wcovered-switch-default -Wno-noexcept-type -Wnon-virtual-dtor -Wdelete-non-virtual-dtor -Wstring-conversion -fdiagnostics-color -O3 -isysroot /Applications/Xcode.app/Contents/Developer/Platforms/MacOSX.platform/Developer/SDKs/MacOSX10.13.sdk -mmacosx-version-min=10.9 -UNDEBUG -Wno-variadic-macros -Wno-gnu-zero-variadic-macro-arguments -fno-exceptions -fno-rtti -std=c++14 -MD -MT unittests/CodeGen/GlobalISel/CMakeFiles/GlobalISelTests.dir/ConstantFoldingTest.cpp.o -MF unittests/CodeGen/GlobalISel/CMakeFiles/GlobalISelTests.dir/ConstantFoldingTest.cpp.o.d -o unittests/CodeGen/GlobalISel/CMakeFiles/GlobalISelTests.dir/ConstantFoldingTest.cpp.o -c /Users/buildslave/jenkins/workspace/clang-stage1-cmake-RA-expensive/llvm-project/llvm/unittests/CodeGen/GlobalISel/ConstantFoldingTest.cpp FAILED: unittests/CodeGen/GlobalISel/CMakeFiles/GlobalISelTests.dir/ConstantFoldingTest.cpp.o /Applications/Xcode.app/Contents/Developer/Toolchains/XcodeDefault.xctoolchain/usr/bin/c++ -DBUILD_EXAMPLES -DEXPENSIVE_CHECKS -DGTEST_HAS_RTTI=0 -DGTEST_HAS_TR1_TUPLE=0 -DGTEST_LANG_CXX11=1 -D_DEBUG -D_GLIBCXX_DEBUG -D__STDC_CONSTANT_MACROS -D__STDC_FORMAT_MACROS -D__STDC_LIMIT_MACROS -Iunittests/CodeGen/GlobalISel -I/Users/buildslave/jenkins/workspace/clang-stage1-cmake-RA-expensive/llvm-project/llvm/unittests/CodeGen/GlobalISel -I/Applications/Xcode.app/Contents/Developer/Platforms/MacOSX.platform/Developer/SDKs/MacOSX10.13.sdk/usr/include/libxml2 -Iinclude -I/Users/buildslave/jenkins/workspace/clang-stage1-cmake-RA-expensive/llvm-project/llvm/include -I/Users/buildslave/jenkins/workspace/clang-stage1-cmake-RA-expensive/llvm-project/llvm/utils/unittest/googletest/include -I/Users/buildslave/jenkins/workspace/clang-stage1-cmake-RA-expensive/llvm-project/llvm/utils/unittest/googlemock/include -fPIC -fvisibility-inlines-hidden -Werror=date-time -Werror=unguarded-availability-new -Wall -Wextra -Wno-unused-parameter -Wwrite-strings -Wcast-qual -Wmissing-field-initializers -pedantic -Wno-long-long -Wimplicit-fallthrough -Wcovered-switch-default -Wno-noexcept-type -Wnon-virtual-dtor -Wdelete-non-virtual-dtor -Wstring-conversion -fdiagnostics-color -O3 -isysroot /Applications/Xcode.app/Contents/Developer/Platforms/MacOSX.platform/Developer/SDKs/MacOSX10.13.sdk -mmacosx-version-min=10.9 -UNDEBUG -Wno-variadic-macros -Wno-gnu-zero-variadic-macro-arguments -fno-exceptions -fno-rtti -std=c++14 -MD -MT unittests/CodeGen/GlobalISel/CMakeFiles/GlobalISelTests.dir/ConstantFoldingTest.cpp.o -MF unittests/CodeGen/GlobalISel/CMakeFiles/GlobalISelTests.dir/ConstantFoldingTest.cpp.o.d -o unittests/CodeGen/GlobalISel/CMakeFiles/GlobalISelTests.dir/ConstantFoldingTest.cpp.o -c /Users/buildslave/jenkins/workspace/clang-stage1-cmake-RA-expensive/llvm-project/llvm/unittests/CodeGen/GlobalISel/ConstantFoldingTest.cpp In file included from /Users/buildslave/jenkins/workspace/clang-stage1-cmake-RA-expensive/llvm-project/llvm/unittests/CodeGen/GlobalISel/ConstantFoldingTest.cpp:9: /Users/buildslave/jenkins/workspace/clang-stage1-cmake-RA-expensive/llvm-project/llvm/unittests/CodeGen/GlobalISel/GISelMITest.h:42:3: error: use of undeclared identifier 'initializeCore' initializeCore(*Registry); ^ /Users/buildslave/jenkins/workspace/clang-stage1-cmake-RA-expensive/llvm-project/llvm/unittests/CodeGen/GlobalISel/GISelMITest.h:43:3: error: use of undeclared identifier 'initializeCodeGen' initializeCodeGen(*Registry); ^ 2 errors generated. [392/698] /Applications/Xcode.app/Contents/Developer/Toolchains/XcodeDefault.xctoolchain/usr/bin/c++ -DBUILD_EXAMPLES -DEXPENSIVE_CHECKS -DGTEST_HAS_RTTI=0 -DGTEST_HAS_TR1_TUPLE=0 -DGTEST_LANG_CXX11=1 -D_DEBUG -D_GLIBCXX_DEBUG -D__STDC_CONSTANT_MACROS -D__STDC_FORMAT_MACROS -D__STDC_LIMIT_MACROS -Iunittests/CodeGen/GlobalISel -I/Users/buildslave/jenkins/workspace/clang-stage1-cmake-RA-expensive/llvm-project/llvm/unittests/CodeGen/GlobalISel -I/Applications/Xcode.app/Contents/Developer/Platforms/MacOSX.platform/Developer/SDKs/MacOSX10.13.sdk/usr/include/libxml2 -Iinclude -I/Users/buildslave/jenkins/workspace/clang-stage1-cmake-RA-expensive/llvm-project/llvm/include -I/Users/buildslave/jenkins/workspace/clang-stage1-cmake-RA-expensive/llvm-project/llvm/utils/unittest/googletest/include -I/Users/buildslave/jenkins/workspace/clang-stage1-cmake-RA-expensive/llvm-project/llvm/utils/unittest/googlemock/include -fPIC -fvisibility-inlines-hidden -Werror=date-time -Werror=unguarded-availability-new -Wall -Wextra -Wno-unused-parameter -Wwrite-strings -Wcast-qual -Wmissing-field-initializers -pedantic -Wno-long-long -Wimplicit-fallthrough -Wcovered-switch-default -Wno-noexcept-type -Wnon-virtual-dtor -Wdelete-non-virtual-dtor -Wstring-conversion -fdiagnostics-color -O3 -isysroot /Applications/Xcode.app/Contents/Developer/Platforms/MacOSX.platform/Developer/SDKs/MacOSX10.13.sdk -mmacosx-version-min=10.9 -UNDEBUG -Wno-variadic-macros -Wno-gnu-zero-variadic-macro-arguments -fno-exceptions -fno-rtti -std=c++14 -MD -MT unittests/CodeGen/GlobalISel/CMakeFiles/GlobalISelTests.dir/LegalizerHelperTest.cpp.o -MF unittests/CodeGen/GlobalISel/CMakeFiles/GlobalISelTests.dir/LegalizerHelperTest.cpp.o.d -o unittests/CodeGen/GlobalISel/CMakeFiles/GlobalISelTests.dir/LegalizerHelperTest.cpp.o -c /Users/buildslave/jenkins/workspace/clang-stage1-cmake-RA-expensive/llvm-project/llvm/unittests/CodeGen/GlobalISel/LegalizerHelperTest.cpp FAILED: unittests/CodeGen/GlobalISel/CMakeFiles/GlobalISelTests.dir/LegalizerHelperTest.cpp.o /Applications/Xcode.app/Contents/Developer/Toolchains/XcodeDefault.xctoolchain/usr/bin/c++ -DBUILD_EXAMPLES -DEXPENSIVE_CHECKS -DGTEST_HAS_RTTI=0 -DGTEST_HAS_TR1_TUPLE=0 -DGTEST_LANG_CXX11=1 -D_DEBUG -D_GLIBCXX_DEBUG -D__STDC_CONSTANT_MACROS -D__STDC_FORMAT_MACROS -D__STDC_LIMIT_MACROS -Iunittests/CodeGen/GlobalISel -I/Users/buildslave/jenkins/workspace/clang-stage1-cmake-RA-expensive/llvm-project/llvm/unittests/CodeGen/GlobalISel -I/Applications/Xcode.app/Contents/Developer/Platforms/MacOSX.platform/Developer/SDKs/MacOSX10.13.sdk/usr/include/libxml2 -Iinclude -I/Users/buildslave/jenkins/workspace/clang-stage1-cmake-RA-expensive/llvm-project/llvm/include -I/Users/buildslave/jenkins/workspace/clang-stage1-cmake-RA-expensive/llvm-project/llvm/utils/unittest/googletest/include -I/Users/buildslave/jenkins/workspace/clang-stage1-cmake-RA-expensive/llvm-project/llvm/utils/unittest/googlemock/include -fPIC -fvisibility-inlines-hidden -Werror=date-time -Werror=unguarded-availability-new -Wall -Wextra -Wno-unused-parameter -Wwrite-strings -Wcast-qual -Wmissing-field-initializers -pedantic -Wno-long-long -Wimplicit-fallthrough -Wcovered-switch-default -Wno-noexcept-type -Wnon-virtual-dtor -Wdelete-non-virtual-dtor -Wstring-conversion -fdiagnostics-color -O3 -isysroot /Applications/Xcode.app/Contents/Developer/Platforms/MacOSX.platform/Developer/SDKs/MacOSX10.13.sdk -mmacosx-version-min=10.9 -UNDEBUG -Wno-variadic-macros -Wno-gnu-zero-variadic-macro-arguments -fno-exceptions -fno-rtti -std=c++14 -MD -MT unittests/CodeGen/GlobalISel/CMakeFiles/GlobalISelTests.dir/LegalizerHelperTest.cpp.o -MF unittests/CodeGen/GlobalISel/CMakeFiles/GlobalISelTests.dir/LegalizerHelperTest.cpp.o.d -o unittests/CodeGen/GlobalISel/CMakeFiles/GlobalISelTests.dir/LegalizerHelperTest.cpp.o -c /Users/buildslave/jenkins/workspace/clang-stage1-cmake-RA-expensive/llvm-project/llvm/unittests/CodeGen/GlobalISel/LegalizerHelperTest.cpp In file included from /Users/buildslave/jenkins/workspace/clang-stage1-cmake-RA-expensive/llvm-project/llvm/unittests/CodeGen/GlobalISel/LegalizerHelperTest.cpp:10: /Users/buildslave/jenkins/workspace/clang-stage1-cmake-RA-expensive/llvm-project/llvm/unittests/CodeGen/GlobalISel/GISelMITest.h:42:3: error: use of undeclared identifier 'initializeCore' initializeCore(*Registry); ^ /Users/buildslave/jenkins/workspace/clang-stage1-cmake-RA-expensive/llvm-project/llvm/unittests/CodeGen/GlobalISel/GISelMITest.h:43:3: error: use of undeclared identifier 'initializeCodeGen' initializeCodeGen(*Registry); ^ 2 errors generated. [394/698] /Applications/Xcode.app/Contents/Developer/Toolchains/XcodeDefault.xctoolchain/usr/bin/c++ -DBUILD_EXAMPLES -DEXPENSIVE_CHECKS -DGTEST_HAS_RTTI=0 -DGTEST_HAS_TR1_TUPLE=0 -DGTEST_LANG_CXX11=1 -D_DEBUG -D_GLIBCXX_DEBUG -D__STDC_CONSTANT_MACROS -D__STDC_FORMAT_MACROS -D__STDC_LIMIT_MACROS -Iunittests/CodeGen/GlobalISel -I/Users/buildslave/jenkins/workspace/clang-stage1-cmake-RA-expensive/llvm-project/llvm/unittests/CodeGen/GlobalISel -I/Applications/Xcode.app/Contents/Developer/Platforms/MacOSX.platform/Developer/SDKs/MacOSX10.13.sdk/usr/include/libxml2 -Iinclude -I/Users/buildslave/jenkins/workspace/clang-stage1-cmake-RA-expensive/llvm-project/llvm/include -I/Users/buildslave/jenkins/workspace/clang-stage1-cmake-RA-expensive/llvm-project/llvm/utils/unittest/googletest/include -I/Users/buildslave/jenkins/workspace/clang-stage1-cmake-RA-expensive/llvm-project/llvm/utils/unittest/googlemock/include -fPIC -fvisibility-inlines-hidden -Werror=date-time -Werror=unguarded-availability-new -Wall -Wextra -Wno-unused-parameter -Wwrite-strings -Wcast-qual -Wmissing-field-initializers -pedantic -Wno-long-long -Wimplicit-fallthrough -Wcovered-switch-default -Wno-noexcept-type -Wnon-virtual-dtor -Wdelete-non-virtual-dtor -Wstring-conversion -fdiagnostics-color -O3 -isysroot /Applications/Xcode.app/Contents/Developer/Platforms/MacOSX.platform/Developer/SDKs/MacOSX10.13.sdk -mmacosx-version-min=10.9 -UNDEBUG -Wno-variadic-macros -Wno-gnu-zero-variadic-macro-arguments -fno-exceptions -fno-rtti -std=c++14 -MD -MT unittests/CodeGen/GlobalISel/CMakeFiles/GlobalISelTests.dir/LegalizerInfoTest.cpp.o -MF unittests/CodeGen/GlobalISel/CMakeFiles/GlobalISelTests.dir/LegalizerInfoTest.cpp.o.d -o unittests/CodeGen/GlobalISel/CMakeFiles/GlobalISelTests.dir/LegalizerInfoTest.cpp.o -c /Users/buildslave/jenkins/workspace/clang-stage1-cmake-RA-expensive/llvm-project/llvm/unittests/CodeGen/GlobalISel/LegalizerInfoTest.cpp FAILED: unittests/CodeGen/GlobalISel/CMakeFiles/GlobalISelTests.dir/LegalizerInfoTest.cpp.o /Applications/Xcode.app/Contents/Developer/Toolchains/XcodeDefault.xctoolchain/usr/bin/c++ -DBUILD_EXAMPLES -DEXPENSIVE_CHECKS -DGTEST_HAS_RTTI=0 -DGTEST_HAS_TR1_TUPLE=0 -DGTEST_LANG_CXX11=1 -D_DEBUG -D_GLIBCXX_DEBUG -D__STDC_CONSTANT_MACROS -D__STDC_FORMAT_MACROS -D__STDC_LIMIT_MACROS -Iunittests/CodeGen/GlobalISel -I/Users/buildslave/jenkins/workspace/clang-stage1-cmake-RA-expensive/llvm-project/llvm/unittests/CodeGen/GlobalISel -I/Applications/Xcode.app/Contents/Developer/Platforms/MacOSX.platform/Developer/SDKs/MacOSX10.13.sdk/usr/include/libxml2 -Iinclude -I/Users/buildslave/jenkins/workspace/clang-stage1-cmake-RA-expensive/llvm-project/llvm/include -I/Users/buildslave/jenkins/workspace/clang-stage1-cmake-RA-expensive/llvm-project/llvm/utils/unittest/googletest/include -I/Users/buildslave/jenkins/workspace/clang-stage1-cmake-RA-expensive/llvm-project/llvm/utils/unittest/googlemock/include -fPIC -fvisibility-inlines-hidden -Werror=date-time -Werror=unguarded-availability-new -Wall -Wextra -Wno-unused-parameter -Wwrite-strings -Wcast-qual -Wmissing-field-initializers -pedantic -Wno-long-long -Wimplicit-fallthrough -Wcovered-switch-default -Wno-noexcept-type -Wnon-virtual-dtor -Wdelete-non-virtual-dtor -Wstring-conversion -fdiagnostics-color -O3 -isysroot /Applications/Xcode.app/Contents/Developer/Platforms/MacOSX.platform/Developer/SDKs/MacOSX10.13.sdk -mmacosx-version-min=10.9 -UNDEBUG -Wno-variadic-macros -Wno-gnu-zero-variadic-macro-arguments -fno-exceptions -fno-rtti -std=c++14 -MD -MT unittests/CodeGen/GlobalISel/CMakeFiles/GlobalISelTests.dir/LegalizerInfoTest.cpp.o -MF unittests/CodeGen/GlobalISel/CMakeFiles/GlobalISelTests.dir/LegalizerInfoTest.cpp.o.d -o unittests/CodeGen/GlobalISel/CMakeFiles/GlobalISelTests.dir/LegalizerInfoTest.cpp.o -c /Users/buildslave/jenkins/workspace/clang-stage1-cmake-RA-expensive/llvm-project/llvm/unittests/CodeGen/GlobalISel/LegalizerInfoTest.cpp In file included from /Users/buildslave/jenkins/workspace/clang-stage1-cmake-RA-expensive/llvm-project/llvm/unittests/CodeGen/GlobalISel/LegalizerInfoTest.cpp:11: /Users/buildslave/jenkins/workspace/clang-stage1-cmake-RA-expensive/llvm-project/llvm/unittests/CodeGen/GlobalISel/GISelMITest.h:42:3: error: use of undeclared identifier 'initializeCore' initializeCore(*Registry); ^ /Users/buildslave/jenkins/workspace/clang-stage1-cmake-RA-expensive/llvm-project/llvm/unittests/CodeGen/GlobalISel/GISelMITest.h:43:3: error: use of undeclared identifier 'initializeCodeGen' initializeCodeGen(*Registry); ^ 2 errors generated. [395/698] /Applications/Xcode.app/Contents/Developer/Toolchains/XcodeDefault.xctoolchain/usr/bin/c++ -DBUILD_EXAMPLES -DEXPENSIVE_CHECKS -DGTEST_HAS_RTTI=0 -DGTEST_HAS_TR1_TUPLE=0 -DGTEST_LANG_CXX11=1 -D_DEBUG -D_GLIBCXX_DEBUG -D__STDC_CONSTANT_MACROS -D__STDC_FORMAT_MACROS -D__STDC_LIMIT_MACROS -Iunittests/CodeGen/GlobalISel -I/Users/buildslave/jenkins/workspace/clang-stage1-cmake-RA-expensive/llvm-project/llvm/unittests/CodeGen/GlobalISel -I/Applications/Xcode.app/Contents/Developer/Platforms/MacOSX.platform/Developer/SDKs/MacOSX10.13.sdk/usr/include/libxml2 -Iinclude -I/Users/buildslave/jenkins/workspace/clang-stage1-cmake-RA-expensive/llvm-project/llvm/include -I/Users/buildslave/jenkins/workspace/clang-stage1-cmake-RA-expensive/llvm-project/llvm/utils/unittest/googletest/include -I/Users/buildslave/jenkins/workspace/clang-stage1-cmake-RA-expensive/llvm-project/llvm/utils/unittest/googlemock/include -fPIC -fvisibility-inlines-hidden -Werror=date-time -Werror=unguarded-availability-new -Wall -Wextra -Wno-unused-parameter -Wwrite-strings -Wcast-qual -Wmissing-field-initializers -pedantic -Wno-long-long -Wimplicit-fallthrough -Wcovered-switch-default -Wno-noexcept-type -Wnon-virtual-dtor -Wdelete-non-virtual-dtor -Wstring-conversion -fdiagnostics-color -O3 -isysroot /Applications/Xcode.app/Contents/Developer/Platforms/MacOSX.platform/Developer/SDKs/MacOSX10.13.sdk -mmacosx-version-min=10.9 -UNDEBUG -Wno-variadic-macros -Wno-gnu-zero-variadic-macro-arguments -fno-exceptions -fno-rtti -std=c++14 -MD -MT unittests/CodeGen/GlobalISel/CMakeFiles/GlobalISelTests.dir/MachineIRBuilderTest.cpp.o -MF unittests/CodeGen/GlobalISel/CMakeFiles/GlobalISelTests.dir/MachineIRBuilderTest.cpp.o.d -o unittests/CodeGen/GlobalISel/CMakeFiles/GlobalISelTests.dir/MachineIRBuilderTest.cpp.o -c /Users/buildslave/jenkins/workspace/clang-stage1-cmake-RA-expensive/llvm-project/llvm/unittests/CodeGen/GlobalISel/MachineIRBuilderTest.cpp FAILED: unittests/CodeGen/GlobalISel/CMakeFiles/GlobalISelTests.dir/MachineIRBuilderTest.cpp.o /Applications/Xcode.app/Contents/Developer/Toolchains/XcodeDefault.xctoolchain/usr/bin/c++ -DBUILD_EXAMPLES -DEXPENSIVE_CHECKS -DGTEST_HAS_RTTI=0 -DGTEST_HAS_TR1_TUPLE=0 -DGTEST_LANG_CXX11=1 -D_DEBUG -D_GLIBCXX_DEBUG -D__STDC_CONSTANT_MACROS -D__STDC_FORMAT_MACROS -D__STDC_LIMIT_MACROS -Iunittests/CodeGen/GlobalISel -I/Users/buildslave/jenkins/workspace/clang-stage1-cmake-RA-expensive/llvm-project/llvm/unittests/CodeGen/GlobalISel -I/Applications/Xcode.app/Contents/Developer/Platforms/MacOSX.platform/Developer/SDKs/MacOSX10.13.sdk/usr/include/libxml2 -Iinclude -I/Users/buildslave/jenkins/workspace/clang-stage1-cmake-RA-expensive/llvm-project/llvm/include -I/Users/buildslave/jenkins/workspace/clang-stage1-cmake-RA-expensive/llvm-project/llvm/utils/unittest/googletest/include -I/Users/buildslave/jenkins/workspace/clang-stage1-cmake-RA-expensive/llvm-project/llvm/utils/unittest/googlemock/include -fPIC -fvisibility-inlines-hidden -Werror=date-time -Werror=unguarded-availability-new -Wall -Wextra -Wno-unused-parameter -Wwrite-strings -Wcast-qual -Wmissing-field-initializers -pedantic -Wno-long-long -Wimplicit-fallthrough -Wcovered-switch-default -Wno-noexcept-type -Wnon-virtual-dtor -Wdelete-non-virtual-dtor -Wstring-conversion -fdiagnostics-color -O3 -isysroot /Applications/Xcode.app/Contents/Developer/Platforms/MacOSX.platform/Developer/SDKs/MacOSX10.13.sdk -mmacosx-version-min=10.9 -UNDEBUG -Wno-variadic-macros -Wno-gnu-zero-variadic-macro-arguments -fno-exceptions -fno-rtti -std=c++14 -MD -MT unittests/CodeGen/GlobalISel/CMakeFiles/GlobalISelTests.dir/MachineIRBuilderTest.cpp.o -MF unittests/CodeGen/GlobalISel/CMakeFiles/GlobalISelTests.dir/MachineIRBuilderTest.cpp.o.d -o unittests/CodeGen/GlobalISel/CMakeFiles/GlobalISelTests.dir/MachineIRBuilderTest.cpp.o -c /Users/buildslave/jenkins/workspace/clang-stage1-cmake-RA-expensive/llvm-project/llvm/unittests/CodeGen/GlobalISel/MachineIRBuilderTest.cpp In file included from /Users/buildslave/jenkins/workspace/clang-stage1-cmake-RA-expensive/llvm-project/llvm/unittests/CodeGen/GlobalISel/MachineIRBuilderTest.cpp:9: /Users/buildslave/jenkins/workspace/clang-stage1-cmake-RA-expensive/llvm-project/llvm/unittests/CodeGen/GlobalISel/GISelMITest.h:42:3: error: use of undeclared identifier 'initializeCore' initializeCore(*Registry); ^ /Users/buildslave/jenkins/workspace/clang-stage1-cmake-RA-expensive/llvm-project/llvm/unittests/CodeGen/GlobalISel/GISelMITest.h:43:3: error: use of undeclared identifier 'initializeCodeGen' initializeCodeGen(*Registry); ^ 2 errors generated. [396/698] /Applications/Xcode.app/Contents/Developer/Toolchains/XcodeDefault.xctoolchain/usr/bin/c++ -DBUILD_EXAMPLES -DEXPENSIVE_CHECKS -DGTEST_HAS_RTTI=0 -DGTEST_HAS_TR1_TUPLE=0 -DGTEST_LANG_CXX11=1 -D_DEBUG -D_GLIBCXX_DEBUG -D__STDC_CONSTANT_MACROS -D__STDC_FORMAT_MACROS -D__STDC_LIMIT_MACROS -Iunittests/CodeGen/GlobalISel -I/Users/buildslave/jenkins/workspace/clang-stage1-cmake-RA-expensive/llvm-project/llvm/unittests/CodeGen/GlobalISel -I/Applications/Xcode.app/Contents/Developer/Platforms/MacOSX.platform/Developer/SDKs/MacOSX10.13.sdk/usr/include/libxml2 -Iinclude -I/Users/buildslave/jenkins/workspace/clang-stage1-cmake-RA-expensive/llvm-project/llvm/include -I/Users/buildslave/jenkins/workspace/clang-stage1-cmake-RA-expensive/llvm-project/llvm/utils/unittest/googletest/include -I/Users/buildslave/jenkins/workspace/clang-stage1-cmake-RA-expensive/llvm-project/llvm/utils/unittest/googlemock/include -fPIC -fvisibility-inlines-hidden -Werror=date-time -Werror=unguarded-availability-new -Wall -Wextra -Wno-unused-parameter -Wwrite-strings -Wcast-qual -Wmissing-field-initializers -pedantic -Wno-long-long -Wimplicit-fallthrough -Wcovered-switch-default -Wno-noexcept-type -Wnon-virtual-dtor -Wdelete-non-virtual-dtor -Wstring-conversion -fdiagnostics-color -O3 -isysroot /Applications/Xcode.app/Contents/Developer/Platforms/MacOSX.platform/Developer/SDKs/MacOSX10.13.sdk -mmacosx-version-min=10.9 -UNDEBUG -Wno-variadic-macros -Wno-gnu-zero-variadic-macro-arguments -fno-exceptions -fno-rtti -std=c++14 -MD -MT unittests/CodeGen/GlobalISel/CMakeFiles/GlobalISelTests.dir/GISelMITest.cpp.o -MF unittests/CodeGen/GlobalISel/CMakeFiles/GlobalISelTests.dir/GISelMITest.cpp.o.d -o unittests/CodeGen/GlobalISel/CMakeFiles/GlobalISelTests.dir/GISelMITest.cpp.o -c /Users/buildslave/jenkins/workspace/clang-stage1-cmake-RA-expensive/llvm-project/llvm/unittests/CodeGen/GlobalISel/GISelMITest.cpp FAILED: unittests/CodeGen/GlobalISel/CMakeFiles/GlobalISelTests.dir/GISelMITest.cpp.o /Applications/Xcode.app/Contents/Developer/Toolchains/XcodeDefault.xctoolchain/usr/bin/c++ -DBUILD_EXAMPLES -DEXPENSIVE_CHECKS -DGTEST_HAS_RTTI=0 -DGTEST_HAS_TR1_TUPLE=0 -DGTEST_LANG_CXX11=1 -D_DEBUG -D_GLIBCXX_DEBUG -D__STDC_CONSTANT_MACROS -D__STDC_FORMAT_MACROS -D__STDC_LIMIT_MACROS -Iunittests/CodeGen/GlobalISel -I/Users/buildslave/jenkins/workspace/clang-stage1-cmake-RA-expensive/llvm-project/llvm/unittests/CodeGen/GlobalISel -I/Applications/Xcode.app/Contents/Developer/Platforms/MacOSX.platform/Developer/SDKs/MacOSX10.13.sdk/usr/include/libxml2 -Iinclude -I/Users/buildslave/jenkins/workspace/clang-stage1-cmake-RA-expensive/llvm-project/llvm/include -I/Users/buildslave/jenkins/workspace/clang-stage1-cmake-RA-expensive/llvm-project/llvm/utils/unittest/googletest/include -I/Users/buildslave/jenkins/workspace/clang-stage1-cmake-RA-expensive/llvm-project/llvm/utils/unittest/googlemock/include -fPIC -fvisibility-inlines-hidden -Werror=date-time -Werror=unguarded-availability-new -Wall -Wextra -Wno-unused-parameter -Wwrite-strings -Wcast-qual -Wmissing-field-initializers -pedantic -Wno-long-long -Wimplicit-fallthrough -Wcovered-switch-default -Wno-noexcept-type -Wnon-virtual-dtor -Wdelete-non-virtual-dtor -Wstring-conversion -fdiagnostics-color -O3 -isysroot /Applications/Xcode.app/Contents/Developer/Platforms/MacOSX.platform/Developer/SDKs/MacOSX10.13.sdk -mmacosx-version-min=10.9 -UNDEBUG -Wno-variadic-macros -Wno-gnu-zero-variadic-macro-arguments -fno-exceptions -fno-rtti -std=c++14 -MD -MT unittests/CodeGen/GlobalISel/CMakeFiles/GlobalISelTests.dir/GISelMITest.cpp.o -MF unittests/CodeGen/GlobalISel/CMakeFiles/GlobalISelTests.dir/GISelMITest.cpp.o.d -o unittests/CodeGen/GlobalISel/CMakeFiles/GlobalISelTests.dir/GISelMITest.cpp.o -c /Users/buildslave/jenkins/workspace/clang-stage1-cmake-RA-expensive/llvm-project/llvm/unittests/CodeGen/GlobalISel/GISelMITest.cpp In file included from /Users/buildslave/jenkins/workspace/clang-stage1-cmake-RA-expensive/llvm-project/llvm/unittests/CodeGen/GlobalISel/GISelMITest.cpp:9: /Users/buildslave/jenkins/workspace/clang-stage1-cmake-RA-expensive/llvm-project/llvm/unittests/CodeGen/GlobalISel/GISelMITest.h:42:3: error: use of undeclared identifier 'initializeCore' initializeCore(*Registry); ^ /Users/buildslave/jenkins/workspace/clang-stage1-cmake-RA-expensive/llvm-project/llvm/unittests/CodeGen/GlobalISel/GISelMITest.h:43:3: error: use of undeclared identifier 'initializeCodeGen' initializeCodeGen(*Registry); ^ 2 errors generated. [398/698] /Applications/Xcode.app/Contents/Developer/Toolchains/XcodeDefault.xctoolchain/usr/bin/c++ -DBUILD_EXAMPLES -DEXPENSIVE_CHECKS -DGTEST_HAS_RTTI=0 -DGTEST_HAS_TR1_TUPLE=0 -DGTEST_LANG_CXX11=1 -D_DEBUG -D_GLIBCXX_DEBUG -D__STDC_CONSTANT_MACROS -D__STDC_FORMAT_MACROS -D__STDC_LIMIT_MACROS -Iunittests/CodeGen/GlobalISel -I/Users/buildslave/jenkins/workspace/clang-stage1-cmake-RA-expensive/llvm-project/llvm/unittests/CodeGen/GlobalISel -I/Applications/Xcode.app/Contents/Developer/Platforms/MacOSX.platform/Developer/SDKs/MacOSX10.13.sdk/usr/include/libxml2 -Iinclude -I/Users/buildslave/jenkins/workspace/clang-stage1-cmake-RA-expensive/llvm-project/llvm/include -I/Users/buildslave/jenkins/workspace/clang-stage1-cmake-RA-expensive/llvm-project/llvm/utils/unittest/googletest/include -I/Users/buildslave/jenkins/workspace/clang-stage1-cmake-RA-expensive/llvm-project/llvm/utils/unittest/googlemock/include -fPIC -fvisibility-inlines-hidden -Werror=date-time -Werror=unguarded-availability-new -Wall -Wextra -Wno-unused-parameter -Wwrite-strings -Wcast-qual -Wmissing-field-initializers -pedantic -Wno-long-long -Wimplicit-fallthrough -Wcovered-switch-default -Wno-noexcept-type -Wnon-virtual-dtor -Wdelete-non-virtual-dtor -Wstring-conversion -fdiagnostics-color -O3 -isysroot /Applications/Xcode.app/Contents/Developer/Platforms/MacOSX.platform/Developer/SDKs/MacOSX10.13.sdk -mmacosx-version-min=10.9 -UNDEBUG -Wno-variadic-macros -Wno-gnu-zero-variadic-macro-arguments -fno-exceptions -fno-rtti -std=c++14 -MD -MT unittests/CodeGen/GlobalISel/CMakeFiles/GlobalISelTests.dir/PatternMatchTest.cpp.o -MF unittests/CodeGen/GlobalISel/CMakeFiles/GlobalISelTests.dir/PatternMatchTest.cpp.o.d -o unittests/CodeGen/GlobalISel/CMakeFiles/GlobalISelTests.dir/PatternMatchTest.cpp.o -c /Users/buildslave/jenkins/workspace/clang-stage1-cmake-RA-expensive/llvm-project/llvm/unittests/CodeGen/GlobalISel/PatternMatchTest.cpp FAILED: unittests/CodeGen/GlobalISel/CMakeFiles/GlobalISelTests.dir/PatternMatchTest.cpp.o /Applications/Xcode.app/Contents/Developer/Toolchains/XcodeDefault.xctoolchain/usr/bin/c++ -DBUILD_EXAMPLES -DEXPENSIVE_CHECKS -DGTEST_HAS_RTTI=0 -DGTEST_HAS_TR1_TUPLE=0 -DGTEST_LANG_CXX11=1 -D_DEBUG -D_GLIBCXX_DEBUG -D__STDC_CONSTANT_MACROS -D__STDC_FORMAT_MACROS -D__STDC_LIMIT_MACROS -Iunittests/CodeGen/GlobalISel -I/Users/buildslave/jenkins/workspace/clang-stage1-cmake-RA-expensive/llvm-project/llvm/unittests/CodeGen/GlobalISel -I/Applications/Xcode.app/Contents/Developer/Platforms/MacOSX.platform/Developer/SDKs/MacOSX10.13.sdk/usr/include/libxml2 -Iinclude -I/Users/buildslave/jenkins/workspace/clang-stage1-cmake-RA-expensive/llvm-project/llvm/include -I/Users/buildslave/jenkins/workspace/clang-stage1-cmake-RA-expensive/llvm-project/llvm/utils/unittest/googletest/include -I/Users/buildslave/jenkins/workspace/clang-stage1-cmake-RA-expensive/llvm-project/llvm/utils/unittest/googlemock/include -fPIC -fvisibility-inlines-hidden -Werror=date-time -Werror=unguarded-availability-new -Wall -Wextra -Wno-unused-parameter -Wwrite-strings -Wcast-qual -Wmissing-field-initializers -pedantic -Wno-long-long -Wimplicit-fallthrough -Wcovered-switch-default -Wno-noexcept-type -Wnon-virtual-dtor -Wdelete-non-virtual-dtor -Wstring-conversion -fdiagnostics-color -O3 -isysroot /Applications/Xcode.app/Contents/Developer/Platforms/MacOSX.platform/Developer/SDKs/MacOSX10.13.sdk -mmacosx-version-min=10.9 -UNDEBUG -Wno-variadic-macros -Wno-gnu-zero-variadic-macro-arguments -fno-exceptions -fno-rtti -std=c++14 -MD -MT unittests/CodeGen/GlobalISel/CMakeFiles/GlobalISelTests.dir/PatternMatchTest.cpp.o -MF unittests/CodeGen/GlobalISel/CMakeFiles/GlobalISelTests.dir/PatternMatchTest.cpp.o.d -o unittests/CodeGen/GlobalISel/CMakeFiles/GlobalISelTests.dir/PatternMatchTest.cpp.o -c /Users/buildslave/jenkins/workspace/clang-stage1-cmake-RA-expensive/llvm-project/llvm/unittests/CodeGen/GlobalISel/PatternMatchTest.cpp In file included from /Users/buildslave/jenkins/workspace/clang-stage1-cmake-RA-expensive/llvm-project/llvm/unittests/CodeGen/GlobalISel/PatternMatchTest.cpp:9: /Users/buildslave/jenkins/workspace/clang-stage1-cmake-RA-expensive/llvm-project/llvm/unittests/CodeGen/GlobalISel/GISelMITest.h:42:3: error: use of undeclared identifier 'initializeCore' initializeCore(*Registry); ^ /Users/buildslave/jenkins/workspace/clang-stage1-cmake-RA-expensive/llvm-project/llvm/unittests/CodeGen/GlobalISel/GISelMITest.h:43:3: error: use of undeclared identifier 'initializeCodeGen' initializeCodeGen(*Registry); ^ 2 errors generated. [400/698] /Applications/Xcode.app/Contents/Developer/Toolchains/XcodeDefault.xctoolchain/usr/bin/c++ -DBUILD_EXAMPLES -DEXPENSIVE_CHECKS -DGTEST_HAS_RTTI=0 -DGTEST_HAS_TR1_TUPLE=0 -DGTEST_LANG_CXX11=1 -D_DEBUG -D_GLIBCXX_DEBUG -D__STDC_CONSTANT_MACROS -D__STDC_FORMAT_MACROS -D__STDC_LIMIT_MACROS -Iunittests/CodeGen/GlobalISel -I/Users/buildslave/jenkins/workspace/clang-stage1-cmake-RA-expensive/llvm-project/llvm/unittests/CodeGen/GlobalISel -I/Applications/Xcode.app/Contents/Developer/Platforms/MacOSX.platform/Developer/SDKs/MacOSX10.13.sdk/usr/include/libxml2 -Iinclude -I/Users/buildslave/jenkins/workspace/clang-stage1-cmake-RA-expensive/llvm-project/llvm/include -I/Users/buildslave/jenkins/workspace/clang-stage1-cmake-RA-expensive/llvm-project/llvm/utils/unittest/googletest/include -I/Users/buildslave/jenkins/workspace/clang-stage1-cmake-RA-expensive/llvm-project/llvm/utils/unittest/googlemock/include -fPIC -fvisibility-inlines-hidden -Werror=date-time -Werror=unguarded-availability-new -Wall -Wextra -Wno-unused-parameter -Wwrite-strings -Wcast-qual -Wmissing-field-initializers -pedantic -Wno-long-long -Wimplicit-fallthrough -Wcovered-switch-default -Wno-noexcept-type -Wnon-virtual-dtor -Wdelete-non-virtual-dtor -Wstring-conversion -fdiagnostics-color -O3 -isysroot /Applications/Xcode.app/Contents/Developer/Platforms/MacOSX.platform/Developer/SDKs/MacOSX10.13.sdk -mmacosx-version-min=10.9 -UNDEBUG -Wno-variadic-macros -Wno-gnu-zero-variadic-macro-arguments -fno-exceptions -fno-rtti -std=c++14 -MD -MT unittests/CodeGen/GlobalISel/CMakeFiles/GlobalISelTests.dir/KnownBitsTest.cpp.o -MF unittests/CodeGen/GlobalISel/CMakeFiles/GlobalISelTests.dir/KnownBitsTest.cpp.o.d -o unittests/CodeGen/GlobalISel/CMakeFiles/GlobalISelTests.dir/KnownBitsTest.cpp.o -c /Users/buildslave/jenkins/workspace/clang-stage1-cmake-RA-expensive/llvm-project/llvm/unittests/CodeGen/GlobalISel/KnownBitsTest.cpp FAILED: unittests/CodeGen/GlobalISel/CMakeFiles/GlobalISelTests.dir/KnownBitsTest.cpp.o /Applications/Xcode.app/Contents/Developer/Toolchains/XcodeDefault.xctoolchain/usr/bin/c++ -DBUILD_EXAMPLES -DEXPENSIVE_CHECKS -DGTEST_HAS_RTTI=0 -DGTEST_HAS_TR1_TUPLE=0 -DGTEST_LANG_CXX11=1 -D_DEBUG -D_GLIBCXX_DEBUG -D__STDC_CONSTANT_MACROS -D__STDC_FORMAT_MACROS -D__STDC_LIMIT_MACROS -Iunittests/CodeGen/GlobalISel -I/Users/buildslave/jenkins/workspace/clang-stage1-cmake-RA-expensive/llvm-project/llvm/unittests/CodeGen/GlobalISel -I/Applications/Xcode.app/Contents/Developer/Platforms/MacOSX.platform/Developer/SDKs/MacOSX10.13.sdk/usr/include/libxml2 -Iinclude -I/Users/buildslave/jenkins/workspace/clang-stage1-cmake-RA-expensive/llvm-project/llvm/include -I/Users/buildslave/jenkins/workspace/clang-stage1-cmake-RA-expensive/llvm-project/llvm/utils/unittest/googletest/include -I/Users/buildslave/jenkins/workspace/clang-stage1-cmake-RA-expensive/llvm-project/llvm/utils/unittest/googlemock/include -fPIC -fvisibility-inlines-hidden -Werror=date-time -Werror=unguarded-availability-new -Wall -Wextra -Wno-unused-parameter -Wwrite-strings -Wcast-qual -Wmissing-field-initializers -pedantic -Wno-long-long -Wimplicit-fallthrough -Wcovered-switch-default -Wno-noexcept-type -Wnon-virtual-dtor -Wdelete-non-virtual-dtor -Wstring-conversion -fdiagnostics-color -O3 -isysroot /Applications/Xcode.app/Contents/Developer/Platforms/MacOSX.platform/Developer/SDKs/MacOSX10.13.sdk -mmacosx-version-min=10.9 -UNDEBUG -Wno-variadic-macros -Wno-gnu-zero-variadic-macro-arguments -fno-exceptions -fno-rtti -std=c++14 -MD -MT unittests/CodeGen/GlobalISel/CMakeFiles/GlobalISelTests.dir/KnownBitsTest.cpp.o -MF unittests/CodeGen/GlobalISel/CMakeFiles/GlobalISelTests.dir/KnownBitsTest.cpp.o.d -o unittests/CodeGen/GlobalISel/CMakeFiles/GlobalISelTests.dir/KnownBitsTest.cpp.o -c /Users/buildslave/jenkins/workspace/clang-stage1-cmake-RA-expensive/llvm-project/llvm/unittests/CodeGen/GlobalISel/KnownBitsTest.cpp In file included from /Users/buildslave/jenkins/workspace/clang-stage1-cmake-RA-expensive/llvm-project/llvm/unittests/CodeGen/GlobalISel/KnownBitsTest.cpp:9: /Users/buildslave/jenkins/workspace/clang-stage1-cmake-RA-expensive/llvm-project/llvm/unittests/CodeGen/GlobalISel/GISelMITest.h:42:3: error: use of undeclared identifier 'initializeCore' initializeCore(*Registry); ^ /Users/buildslave/jenkins/workspace/clang-stage1-cmake-RA-expensive/llvm-project/llvm/unittests/CodeGen/GlobalISel/GISelMITest.h:43:3: error: use of undeclared identifier 'initializeCodeGen' initializeCodeGen(*Registry); ^ 2 errors generated. [468/698] /Applications/Xcode.app/Contents/Developer/Toolchains/XcodeDefault.xctoolchain/usr/bin/c++ -DBUILD_EXAMPLES -DEXPENSIVE_CHECKS -DGTEST_HAS_RTTI=0 -DGTEST_HAS_TR1_TUPLE=0 -DGTEST_LANG_CXX11=1 -D_DEBUG -D_GLIBCXX_DEBUG -D__STDC_CONSTANT_MACROS -D__STDC_FORMAT_MACROS -D__STDC_LIMIT_MACROS -Iunittests/IR -I/Users/buildslave/jenkins/workspace/clang-stage1-cmake-RA-expensive/llvm-project/llvm/unittests/IR -I/Applications/Xcode.app/Contents/Developer/Platforms/MacOSX.platform/Developer/SDKs/MacOSX10.13.sdk/usr/include/libxml2 -Iinclude -I/Users/buildslave/jenkins/workspace/clang-stage1-cmake-RA-expensive/llvm-project/llvm/include -I/Users/buildslave/jenkins/workspace/clang-stage1-cmake-RA-expensive/llvm-project/llvm/utils/unittest/googletest/include -I/Users/buildslave/jenkins/workspace/clang-stage1-cmake-RA-expensive/llvm-project/llvm/utils/unittest/googlemock/include -fPIC -fvisibility-inlines-hidden -Werror=date-time -Werror=unguarded-availability-new -Wall -Wextra -Wno-unused-parameter -Wwrite-strings -Wcast-qual -Wmissing-field-initializers -pedantic -Wno-long-long -Wimplicit-fallthrough -Wcovered-switch-default -Wno-noexcept-type -Wnon-virtual-dtor -Wdelete-non-virtual-dtor -Wstring-conversion -fdiagnostics-color -O3 -isysroot /Applications/Xcode.app/Contents/Developer/Platforms/MacOSX.platform/Developer/SDKs/MacOSX10.13.sdk -mmacosx-version-min=10.9 -UNDEBUG -Wno-variadic-macros -Wno-gnu-zero-variadic-macro-arguments -fno-exceptions -fno-rtti -std=c++14 -MD -MT unittests/IR/CMakeFiles/IRTests.dir/LegacyPassManagerTest.cpp.o -MF unittests/IR/CMakeFiles/IRTests.dir/LegacyPassManagerTest.cpp.o.d -o unittests/IR/CMakeFiles/IRTests.dir/LegacyPassManagerTest.cpp.o -c /Users/buildslave/jenkins/workspace/clang-stage1-cmake-RA-expensive/llvm-project/llvm/unittests/IR/LegacyPassManagerTest.cpp FAILED: unittests/IR/CMakeFiles/IRTests.dir/LegacyPassManagerTest.cpp.o /Applications/Xcode.app/Contents/Developer/Toolchains/XcodeDefault.xctoolchain/usr/bin/c++ -DBUILD_EXAMPLES -DEXPENSIVE_CHECKS -DGTEST_HAS_RTTI=0 -DGTEST_HAS_TR1_TUPLE=0 -DGTEST_LANG_CXX11=1 -D_DEBUG -D_GLIBCXX_DEBUG -D__STDC_CONSTANT_MACROS -D__STDC_FORMAT_MACROS -D__STDC_LIMIT_MACROS -Iunittests/IR -I/Users/buildslave/jenkins/workspace/clang-stage1-cmake-RA-expensive/llvm-project/llvm/unittests/IR -I/Applications/Xcode.app/Contents/Developer/Platforms/MacOSX.platform/Developer/SDKs/MacOSX10.13.sdk/usr/include/libxml2 -Iinclude -I/Users/buildslave/jenkins/workspace/clang-stage1-cmake-RA-expensive/llvm-project/llvm/include -I/Users/buildslave/jenkins/workspace/clang-stage1-cmake-RA-expensive/llvm-project/llvm/utils/unittest/googletest/include -I/Users/buildslave/jenkins/workspace/clang-stage1-cmake-RA-expensive/llvm-project/llvm/utils/unittest/googlemock/include -fPIC -fvisibility-inlines-hidden -Werror=date-time -Werror=unguarded-availability-new -Wall -Wextra -Wno-unused-parameter -Wwrite-strings -Wcast-qual -Wmissing-field-initializers -pedantic -Wno-long-long -Wimplicit-fallthrough -Wcovered-switch-default -Wno-noexcept-type -Wnon-virtual-dtor -Wdelete-non-virtual-dtor -Wstring-conversion -fdiagnostics-color -O3 -isysroot /Applications/Xcode.app/Contents/Developer/Platforms/MacOSX.platform/Developer/SDKs/MacOSX10.13.sdk -mmacosx-version-min=10.9 -UNDEBUG -Wno-variadic-macros -Wno-gnu-zero-variadic-macro-arguments -fno-exceptions -fno-rtti -std=c++14 -MD -MT unittests/IR/CMakeFiles/IRTests.dir/LegacyPassManagerTest.cpp.o -MF unittests/IR/CMakeFiles/IRTests.dir/LegacyPassManagerTest.cpp.o.d -o unittests/IR/CMakeFiles/IRTests.dir/LegacyPassManagerTest.cpp.o -c /Users/buildslave/jenkins/workspace/clang-stage1-cmake-RA-expensive/llvm-project/llvm/unittests/IR/LegacyPassManagerTest.cpp /Users/buildslave/jenkins/workspace/clang-stage1-cmake-RA-expensive/llvm-project/llvm/unittests/IR/LegacyPassManagerTest.cpp:567:1: error: use of undeclared identifier 'initializeCallGraphWrapperPassPass' INITIALIZE_PASS_DEPENDENCY(CallGraphWrapperPass) ^ /Users/buildslave/jenkins/workspace/clang-stage1-cmake-RA-expensive/llvm-project/llvm/include/llvm/PassSupport.h:50:45: note: expanded from macro 'INITIALIZE_PASS_DEPENDENCY' #define INITIALIZE_PASS_DEPENDENCY(depName) initialize##depName##Pass(Registry); ^ <scratch space>:77:1: note: expanded from here initializeCallGraphWrapperPassPass ^ /Users/buildslave/jenkins/workspace/clang-stage1-cmake-RA-expensive/llvm-project/llvm/unittests/IR/LegacyPassManagerTest.cpp:571:1: error: use of undeclared identifier 'initializeLoopInfoWrapperPassPass' INITIALIZE_PASS_DEPENDENCY(LoopInfoWrapperPass) ^ /Users/buildslave/jenkins/workspace/clang-stage1-cmake-RA-expensive/llvm-project/llvm/include/llvm/PassSupport.h:50:45: note: expanded from macro 'INITIALIZE_PASS_DEPENDENCY' #define INITIALIZE_PASS_DEPENDENCY(depName) initialize##depName##Pass(Registry); ^ <scratch space>:99:1: note: expanded from here initializeLoopInfoWrapperPassPass ^ 2 errors generated. [512/698] /Applications/Xcode.app/Contents/Developer/Toolchains/XcodeDefault.xctoolchain/usr/bin/c++ -DBUILD_EXAMPLES -DEXPENSIVE_CHECKS -DGTEST_HAS_RTTI=0 -DGTEST_HAS_TR1_TUPLE=0 -DGTEST_LANG_CXX11=1 -D_DEBUG -D_GLIBCXX_DEBUG -D__STDC_CONSTANT_MACROS -D__STDC_FORMAT_MACROS -D__STDC_LIMIT_MACROS -Iunittests/MI -I/Users/buildslave/jenkins/workspace/clang-stage1-cmake-RA-expensive/llvm-project/llvm/unittests/MI -I/Applications/Xcode.app/Contents/Developer/Platforms/MacOSX.platform/Developer/SDKs/MacOSX10.13.sdk/usr/include/libxml2 -Iinclude -I/Users/buildslave/jenkins/workspace/clang-stage1-cmake-RA-expensive/llvm-project/llvm/include -I/Users/buildslave/jenkins/workspace/clang-stage1-cmake-RA-expensive/llvm-project/llvm/utils/unittest/googletest/include -I/Users/buildslave/jenkins/workspace/clang-stage1-cmake-RA-expensive/llvm-project/llvm/utils/unittest/googlemock/include -fPIC -fvisibility-inlines-hidden -Werror=date-time -Werror=unguarded-availability-new -Wall -Wextra -Wno-unused-parameter -Wwrite-strings -Wcast-qual -Wmissing-field-initializers -pedantic -Wno-long-long -Wimplicit-fallthrough -Wcovered-switch-default -Wno-noexcept-type -Wnon-virtual-dtor -Wdelete-non-virtual-dtor -Wstring-conversion -fdiagnostics-color -O3 -isysroot /Applications/Xcode.app/Contents/Developer/Platforms/MacOSX.platform/Developer/SDKs/MacOSX10.13.sdk -mmacosx-version-min=10.9 -UNDEBUG -Wno-variadic-macros -Wno-gnu-zero-variadic-macro-arguments -fno-exceptions -fno-rtti -std=c++14 -MD -MT unittests/MI/CMakeFiles/MITests.dir/LiveIntervalTest.cpp.o -MF unittests/MI/CMakeFiles/MITests.dir/LiveIntervalTest.cpp.o.d -o unittests/MI/CMakeFiles/MITests.dir/LiveIntervalTest.cpp.o -c /Users/buildslave/jenkins/workspace/clang-stage1-cmake-RA-expensive/llvm-project/llvm/unittests/MI/LiveIntervalTest.cpp FAILED: unittests/MI/CMakeFiles/MITests.dir/LiveIntervalTest.cpp.o /Applications/Xcode.app/Contents/Developer/Toolchains/XcodeDefault.xctoolchain/usr/bin/c++ -DBUILD_EXAMPLES -DEXPENSIVE_CHECKS -DGTEST_HAS_RTTI=0 -DGTEST_HAS_TR1_TUPLE=0 -DGTEST_LANG_CXX11=1 -D_DEBUG -D_GLIBCXX_DEBUG -D__STDC_CONSTANT_MACROS -D__STDC_FORMAT_MACROS -D__STDC_LIMIT_MACROS -Iunittests/MI -I/Users/buildslave/jenkins/workspace/clang-stage1-cmake-RA-expensive/llvm-project/llvm/unittests/MI -I/Applications/Xcode.app/Contents/Developer/Platforms/MacOSX.platform/Developer/SDKs/MacOSX10.13.sdk/usr/include/libxml2 -Iinclude -I/Users/buildslave/jenkins/workspace/clang-stage1-cmake-RA-expensive/llvm-project/llvm/include -I/Users/buildslave/jenkins/workspace/clang-stage1-cmake-RA-expensive/llvm-project/llvm/utils/unittest/googletest/include -I/Users/buildslave/jenkins/workspace/clang-stage1-cmake-RA-expensive/llvm-project/llvm/utils/unittest/googlemock/include -fPIC -fvisibility-inlines-hidden -Werror=date-time -Werror=unguarded-availability-new -Wall -Wextra -Wno-unused-parameter -Wwrite-strings -Wcast-qual -Wmissing-field-initializers -pedantic -Wno-long-long -Wimplicit-fallthrough -Wcovered-switch-default -Wno-noexcept-type -Wnon-virtual-dtor -Wdelete-non-virtual-dtor -Wstring-conversion -fdiagnostics-color -O3 -isysroot /Applications/Xcode.app/Contents/Developer/Platforms/MacOSX.platform/Developer/SDKs/MacOSX10.13.sdk -mmacosx-version-min=10.9 -UNDEBUG -Wno-variadic-macros -Wno-gnu-zero-variadic-macro-arguments -fno-exceptions -fno-rtti -std=c++14 -MD -MT unittests/MI/CMakeFiles/MITests.dir/LiveIntervalTest.cpp.o -MF unittests/MI/CMakeFiles/MITests.dir/LiveIntervalTest.cpp.o.d -o unittests/MI/CMakeFiles/MITests.dir/LiveIntervalTest.cpp.o -c /Users/buildslave/jenkins/workspace/clang-stage1-cmake-RA-expensive/llvm-project/llvm/unittests/MI/LiveIntervalTest.cpp /Users/buildslave/jenkins/workspace/clang-stage1-cmake-RA-expensive/llvm-project/llvm/unittests/MI/LiveIntervalTest.cpp:31:3: error: use of undeclared identifier 'initializeCore' initializeCore(*Registry); ^ /Users/buildslave/jenkins/workspace/clang-stage1-cmake-RA-expensive/llvm-project/llvm/unittests/MI/LiveIntervalTest.cpp:32:3: error: use of undeclared identifier 'initializeCodeGen' initializeCodeGen(*Registry); ^ 2 errors generated. [691/698] : && /Applications/Xcode.app/Contents/Developer/Toolchains/XcodeDefault.xctoolchain/usr/bin/c++ -fPIC -fvisibility-inlines-hidden -Werror=date-time -Werror=unguarded-availability-new -Wall -Wextra -Wno-unused-parameter -Wwrite-strings -Wcast-qual -Wmissing-field-initializers -pedantic -Wno-long-long -Wimplicit-fallthrough -Wcovered-switch-default -Wno-noexcept-type -Wnon-virtual-dtor -Wdelete-non-virtual-dtor -Wstring-conversion -fdiagnostics-color -O3 -isysroot /Applications/Xcode.app/Contents/Developer/Platforms/MacOSX.platform/Developer/SDKs/MacOSX10.13.sdk -mmacosx-version-min=10.9 -Wl,-search_paths_first -Wl,-headerpad_max_install_names -Wl,-dead_strip unittests/tools/llvm-exegesis/Mips/CMakeFiles/LLVMExegesisMipsTests.dir/TargetTest.cpp.o -o unittests/tools/llvm-exegesis/Mips/LLVMExegesisMipsTests lib/libLLVMMC.a lib/libLLVMMCParser.a lib/libLLVMObject.a lib/libLLVMSupport.a lib/libLLVMSymbolize.a lib/libLLVMMipsCodeGen.a lib/libLLVMMipsAsmParser.a lib/libLLVMMipsDesc.a lib/libLLVMMipsDisassembler.a lib/libLLVMMipsInfo.a lib/libLLVMSupport.a lib/libgtest_main.a lib/libgtest.a lib/libLLVMExegesis.a lib/libLLVMExegesisMips.a lib/libLLVMDebugInfoPDB.a -lpthread lib/libLLVMMipsCodeGen.a lib/libLLVMAsmPrinter.a lib/libLLVMDebugInfoDWARF.a lib/libLLVMMipsAsmParser.a lib/libLLVMMipsDesc.a lib/libLLVMMipsDisassembler.a lib/libLLVMMipsInfo.a lib/libLLVMExegesis.a lib/libLLVMGlobalISel.a lib/libLLVMSelectionDAG.a lib/libLLVMCodeGen.a lib/libLLVMBitWriter.a lib/libLLVMScalarOpts.a lib/libLLVMAggressiveInstCombine.a lib/libLLVMInstCombine.a lib/libLLVMTransformUtils.a lib/libLLVMMCDisassembler.a lib/libLLVMMCJIT.a lib/libLLVMExecutionEngine.a lib/libLLVMTarget.a lib/libLLVMAnalysis.a lib/libLLVMProfileData.a lib/libLLVMRuntimeDyld.a lib/libLLVMObjectYAML.a lib/libLLVMObject.a lib/libLLVMMCParser.a lib/libLLVMMC.a lib/libLLVMBitReader.a lib/libLLVMCore.a lib/libLLVMRemarks.a lib/libLLVMBitstreamReader.a lib/libLLVMTextAPI.a lib/libLLVMBinaryFormat.a lib/libLLVMDebugInfoCodeView.a lib/libLLVMDebugInfoMSF.a lib/libLLVMSupport.a -lz -lcurses -lm lib/libLLVMDemangle.a && : FAILED: tools/clang/runtime/CMakeFiles/check-compiler-rt cd /Users/buildslave/jenkins/workspace/clang-stage1-cmake-RA-expensive/clang-build/tools/clang/runtime/compiler-rt-bins && /usr/local/Cellar/cmake/3.13.1/bin/cmake --build . --target check-all --config Release ninja: build stopped: cannot make progress due to previous errors. Command failed: Command '['/usr/local/bin/ninja', '-v', '-k', '0', 'check-all']' returned non-zero exit status 1 ('Command:', ['/usr/local/bin/ninja', '-v', '-k', '0', 'check-all']) Build step 'Execute shell' marked build as failure Recording test results ERROR: Step ‘Publish JUnit test result report’ failed: No test report files were found. Configuration error? [BFA] Scanning build for known causes... [BFA] Found failure cause(s): [BFA] Compile Error from category Compile [BFA] Missing test results from category Infrastructure [BFA] Regression test failed from category Test [BFA] Ninja target failed from category Compile [BFA] Done. 1s No emails were triggered. Finished: FAILURE