FailedConsole Output

Skipping 10,054 KB.. Full Log
x/pthread_create_from_constructor.cc (953 of 2306)
UNSUPPORTED: AddressSanitizer-x86_64-darwin :: TestCases/Linux/pthread_create_version.cc (954 of 2306)
UNSUPPORTED: AddressSanitizer-x86_64-darwin :: TestCases/Linux/ptrace.cc (955 of 2306)
UNSUPPORTED: AddressSanitizer-x86_64-darwin :: TestCases/Linux/quarantine_size_mb.cc (956 of 2306)
UNSUPPORTED: AddressSanitizer-x86_64-darwin :: TestCases/Linux/read_binary_name_regtest.c (957 of 2306)
UNSUPPORTED: AddressSanitizer-x86_64-darwin :: TestCases/Linux/recvfrom.cc (958 of 2306)
UNSUPPORTED: AddressSanitizer-x86_64-darwin :: TestCases/Linux/release_to_os_test.cc (959 of 2306)
UNSUPPORTED: AddressSanitizer-x86_64-darwin :: TestCases/Linux/rlimit_mmap_test.cc (960 of 2306)
UNSUPPORTED: AddressSanitizer-x86_64-darwin :: TestCases/Linux/segv_read_write.c (961 of 2306)
UNSUPPORTED: AddressSanitizer-x86_64-darwin :: TestCases/Linux/shmctl.cc (962 of 2306)
UNSUPPORTED: AddressSanitizer-x86_64-darwin :: TestCases/Linux/signal_during_stop_the_world.cc (963 of 2306)
UNSUPPORTED: AddressSanitizer-x86_64-darwin :: TestCases/Linux/sized_delete_test.cc (964 of 2306)
UNSUPPORTED: AddressSanitizer-x86_64-darwin :: TestCases/Linux/stack-overflow-recovery-mode.cc (965 of 2306)
UNSUPPORTED: AddressSanitizer-x86_64-darwin :: TestCases/Linux/stack-overflow-sigbus.cc (966 of 2306)
UNSUPPORTED: AddressSanitizer-x86_64-darwin :: TestCases/Linux/stack-trace-dlclose.cc (967 of 2306)
UNSUPPORTED: AddressSanitizer-x86_64-darwin :: TestCases/Linux/static_tls.cc (968 of 2306)
UNSUPPORTED: AddressSanitizer-x86_64-darwin :: TestCases/Linux/stress_dtls.c (969 of 2306)
UNSUPPORTED: AddressSanitizer-x86_64-darwin :: TestCases/Linux/swapcontext_annotation.cc (970 of 2306)
UNSUPPORTED: AddressSanitizer-x86_64-darwin :: TestCases/Linux/swapcontext_test.cc (971 of 2306)
UNSUPPORTED: AddressSanitizer-x86_64-darwin :: TestCases/Linux/syscalls.cc (972 of 2306)
UNSUPPORTED: AddressSanitizer-x86_64-darwin :: TestCases/Linux/thread_local_quarantine_size_kb.cc (973 of 2306)
UNSUPPORTED: AddressSanitizer-x86_64-darwin :: TestCases/Linux/uar_signals.cc (974 of 2306)
UNSUPPORTED: AddressSanitizer-x86_64-darwin :: TestCases/Linux/unpoison_tls.cc (975 of 2306)
PASS: AddressSanitizer-x86_64-darwin :: TestCases/Darwin/suppressions-sandbox.cc (976 of 2306)
PASS: AddressSanitizer-x86_64-darwin :: TestCases/Darwin/malloc_size_crash.mm (977 of 2306)
PASS: AddressSanitizer-x86_64-darwin :: TestCases/Darwin/uuid.cc (978 of 2306)
PASS: AddressSanitizer-x86_64-darwin :: TestCases/Darwin/objc-odr.mm (979 of 2306)
PASS: AddressSanitizer-x86_64-darwin :: TestCases/Posix/allow_user_segv.cc (980 of 2306)
PASS: AddressSanitizer-i386-darwin :: TestCases/Posix/coverage-direct-large.cc (981 of 2306)
PASS: AddressSanitizer-x86_64-darwin :: TestCases/Posix/asan-symbolize-bad-path.cc (982 of 2306)
PASS: AddressSanitizer-x86_64-darwin :: TestCases/Posix/assign_large_valloc_to_global.cc (983 of 2306)
PASS: AddressSanitizer-x86_64-darwin :: TestCases/Darwin/suppressions-darwin.cc (984 of 2306)
PASS: AddressSanitizer-x86_64-darwin :: TestCases/Posix/closed-fds.cc (985 of 2306)
PASS: AddressSanitizer-x86_64-darwin :: TestCases/Posix/asprintf.cc (986 of 2306)
PASS: AddressSanitizer-x86_64-darwin :: TestCases/Posix/coverage-fork.cc (987 of 2306)
PASS: AddressSanitizer-x86_64-darwin :: TestCases/Posix/asan-symbolize-sanity-test.cc (988 of 2306)
PASS: AddressSanitizer-x86_64-darwin :: TestCases/Posix/coverage-fork-direct.cc (989 of 2306)
PASS: AddressSanitizer-x86_64-darwin :: TestCases/Posix/coverage-direct-activation.cc (990 of 2306)
PASS: AddressSanitizer-x86_64-darwin :: TestCases/Posix/coverage-maybe-open-file.cc (991 of 2306)
PASS: AddressSanitizer-x86_64-darwin :: TestCases/Posix/coverage-caller-callee.cc (992 of 2306)
PASS: AddressSanitizer-x86_64-darwin :: TestCases/Posix/coverage-module-unloaded.cc (993 of 2306)
PASS: AddressSanitizer-x86_64-darwin :: TestCases/Posix/deep_call_stack.cc (994 of 2306)
PASS: AddressSanitizer-x86_64-darwin :: TestCases/Darwin/address-range-limit.mm (995 of 2306)
PASS: AddressSanitizer-x86_64-darwin :: TestCases/Posix/coverage-sandboxing.cc (996 of 2306)
PASS: AddressSanitizer-x86_64-darwin :: TestCases/Posix/dump_instruction_bytes.cc (997 of 2306)
PASS: AddressSanitizer-x86_64-darwin :: TestCases/Posix/free_hook_realloc.cc (998 of 2306)
PASS: AddressSanitizer-x86_64-darwin :: TestCases/Posix/coverage-direct.cc (999 of 2306)
PASS: AddressSanitizer-x86_64-darwin :: TestCases/Posix/freopen.cc (1000 of 2306)
PASS: AddressSanitizer-x86_64-darwin :: TestCases/Posix/coverage.cc (1001 of 2306)
PASS: AddressSanitizer-x86_64-darwin :: TestCases/Posix/deep_thread_stack.cc (1002 of 2306)
PASS: AddressSanitizer-x86_64-darwin :: TestCases/Posix/halt_on_error-signals.c (1003 of 2306)
PASS: AddressSanitizer-x86_64-darwin :: TestCases/Posix/gc-test.cc (1004 of 2306)
PASS: AddressSanitizer-x86_64-darwin :: TestCases/Posix/global-registration.c (1005 of 2306)
PASS: AddressSanitizer-x86_64-darwin :: TestCases/Posix/handle_abort_on_error.cc (1006 of 2306)
PASS: AddressSanitizer-x86_64-darwin :: TestCases/Posix/init-order-pthread-create.cc (1007 of 2306)
PASS: AddressSanitizer-x86_64-darwin :: TestCases/Posix/interception-in-shared-lib-test.cc (1008 of 2306)
PASS: AddressSanitizer-x86_64-darwin :: TestCases/Posix/halt_on_error-torture.cc (1009 of 2306)
PASS: AddressSanitizer-x86_64-darwin :: TestCases/Posix/glob.cc (1010 of 2306)
PASS: AddressSanitizer-x86_64-darwin :: TestCases/Posix/halt_on_error_suppress_equal_pcs.cc (1011 of 2306)
PASS: AddressSanitizer-x86_64-darwin :: TestCases/Posix/large_allocator_unpoisons_on_free.cc (1012 of 2306)
PASS: AddressSanitizer-x86_64-darwin :: TestCases/Posix/new_array_cookie_with_new_from_class.cc (1013 of 2306)
PASS: AddressSanitizer-x86_64-darwin :: TestCases/Posix/no_asan_gen_globals.c (1014 of 2306)
PASS: AddressSanitizer-x86_64-darwin :: TestCases/Posix/new_array_cookie_test.cc (1015 of 2306)
PASS: AddressSanitizer-x86_64-darwin :: TestCases/Posix/new_array_cookie_uaf_test.cc (1016 of 2306)
PASS: AddressSanitizer-x86_64-darwin :: TestCases/Posix/ioctl.cc (1017 of 2306)
PASS: AddressSanitizer-x86_64-darwin :: TestCases/Posix/print_cmdline.cc (1018 of 2306)
PASS: AddressSanitizer-x86_64-darwin :: TestCases/Posix/readv.cc (1019 of 2306)
PASS: AddressSanitizer-x86_64-darwin :: TestCases/Posix/dlclose-test.cc (1020 of 2306)
PASS: AddressSanitizer-x86_64-darwin :: TestCases/Posix/strerror_r_test.cc (1021 of 2306)
PASS: AddressSanitizer-x86_64-darwin :: TestCases/Posix/tsd_dtor_leak.cc (1022 of 2306)
PASS: AddressSanitizer-x86_64-darwin :: TestCases/Posix/start-deactivated.cc (1023 of 2306)
PASS: AddressSanitizer-x86_64-darwin :: TestCases/Posix/wait.cc (1024 of 2306)
PASS: AddressSanitizer-x86_64-darwin :: TestCases/Posix/stack-use-after-return.cc (1025 of 2306)
PASS: AddressSanitizer-x86_64-darwin :: TestCases/Posix/mmap_limit_mb.cc (1026 of 2306)
UNSUPPORTED: AddressSanitizer-x86_64-darwin :: TestCases/Windows/aligned_mallocs.cc (1027 of 2306)
UNSUPPORTED: AddressSanitizer-x86_64-darwin :: TestCases/Windows/allocators_sanity.cc (1028 of 2306)
UNSUPPORTED: AddressSanitizer-x86_64-darwin :: TestCases/Windows/beginthreadex.cc (1029 of 2306)
UNSUPPORTED: AddressSanitizer-x86_64-darwin :: TestCases/Windows/bind_io_completion_callback.cc (1030 of 2306)
UNSUPPORTED: AddressSanitizer-x86_64-darwin :: TestCases/Windows/bitfield.cc (1031 of 2306)
UNSUPPORTED: AddressSanitizer-x86_64-darwin :: TestCases/Windows/bitfield_uaf.cc (1032 of 2306)
UNSUPPORTED: AddressSanitizer-x86_64-darwin :: TestCases/Windows/calloc_left_oob.cc (1033 of 2306)
UNSUPPORTED: AddressSanitizer-x86_64-darwin :: TestCases/Windows/calloc_right_oob.cc (1034 of 2306)
UNSUPPORTED: AddressSanitizer-x86_64-darwin :: TestCases/Windows/calloc_uaf.cc (1035 of 2306)
UNSUPPORTED: AddressSanitizer-x86_64-darwin :: TestCases/Windows/coverage-basic.cc (1036 of 2306)
UNSUPPORTED: AddressSanitizer-x86_64-darwin :: TestCases/Windows/coverage-dll-stdio.cc (1037 of 2306)
UNSUPPORTED: AddressSanitizer-x86_64-darwin :: TestCases/Windows/crash_read_write.cc (1038 of 2306)
UNSUPPORTED: AddressSanitizer-x86_64-darwin :: TestCases/Windows/crt_initializers.cc (1039 of 2306)
UNSUPPORTED: AddressSanitizer-x86_64-darwin :: TestCases/Windows/delay_dbghelp.cc (1040 of 2306)
UNSUPPORTED: AddressSanitizer-x86_64-darwin :: TestCases/Windows/demangled_names.cc (1041 of 2306)
UNSUPPORTED: AddressSanitizer-x86_64-darwin :: TestCases/Windows/dll_aligned_mallocs.cc (1042 of 2306)
UNSUPPORTED: AddressSanitizer-x86_64-darwin :: TestCases/Windows/dll_allocators_sanity.cc (1043 of 2306)
UNSUPPORTED: AddressSanitizer-x86_64-darwin :: TestCases/Windows/dll_and_lib.cc (1044 of 2306)
UNSUPPORTED: AddressSanitizer-x86_64-darwin :: TestCases/Windows/dll_cerr.cc (1045 of 2306)
UNSUPPORTED: AddressSanitizer-x86_64-darwin :: TestCases/Windows/dll_control_c.cc (1046 of 2306)
UNSUPPORTED: AddressSanitizer-x86_64-darwin :: TestCases/Windows/dll_global_dead_strip.c (1047 of 2306)
UNSUPPORTED: AddressSanitizer-x86_64-darwin :: TestCases/Windows/dll_host.cc (1048 of 2306)
UNSUPPORTED: AddressSanitizer-x86_64-darwin :: TestCases/Windows/dll_intercept_memchr.cc (1049 of 2306)
UNSUPPORTED: AddressSanitizer-x86_64-darwin :: TestCases/Windows/dll_intercept_memcpy.cc (1050 of 2306)
UNSUPPORTED: AddressSanitizer-x86_64-darwin :: TestCases/Windows/dll_intercept_memcpy_indirect.cc (1051 of 2306)
UNSUPPORTED: AddressSanitizer-x86_64-darwin :: TestCases/Windows/dll_intercept_memset.cc (1052 of 2306)
UNSUPPORTED: AddressSanitizer-x86_64-darwin :: TestCases/Windows/dll_intercept_strlen.cc (1053 of 2306)
UNSUPPORTED: AddressSanitizer-x86_64-darwin :: TestCases/Windows/dll_large_function.cc (1054 of 2306)
UNSUPPORTED: AddressSanitizer-x86_64-darwin :: TestCases/Windows/dll_malloc_left_oob.cc (1055 of 2306)
UNSUPPORTED: AddressSanitizer-x86_64-darwin :: TestCases/Windows/dll_malloc_uaf.cc (1056 of 2306)
UNSUPPORTED: AddressSanitizer-x86_64-darwin :: TestCases/Windows/dll_noreturn.cc (1057 of 2306)
UNSUPPORTED: AddressSanitizer-x86_64-darwin :: TestCases/Windows/dll_null_deref.cc (1058 of 2306)
UNSUPPORTED: AddressSanitizer-x86_64-darwin :: TestCases/Windows/dll_operator_array_new_left_oob.cc (1059 of 2306)
UNSUPPORTED: AddressSanitizer-x86_64-darwin :: TestCases/Windows/dll_operator_array_new_with_dtor_left_oob.cc (1060 of 2306)
UNSUPPORTED: AddressSanitizer-x86_64-darwin :: TestCases/Windows/dll_poison_unpoison.cc (1061 of 2306)
UNSUPPORTED: AddressSanitizer-x86_64-darwin :: TestCases/Windows/dll_report_globals_symbolization_at_startup.cc (1062 of 2306)
UNSUPPORTED: AddressSanitizer-x86_64-darwin :: TestCases/Windows/dll_seh.cc (1063 of 2306)
UNSUPPORTED: AddressSanitizer-x86_64-darwin :: TestCases/Windows/dll_stack_use_after_return.cc (1064 of 2306)
UNSUPPORTED: AddressSanitizer-x86_64-darwin :: TestCases/Windows/dll_thread_stack_array_left_oob.cc (1065 of 2306)
UNSUPPORTED: AddressSanitizer-x86_64-darwin :: TestCases/Windows/double_free.cc (1066 of 2306)
UNSUPPORTED: AddressSanitizer-x86_64-darwin :: TestCases/Windows/double_operator_delete.cc (1067 of 2306)
UNSUPPORTED: AddressSanitizer-x86_64-darwin :: TestCases/Windows/free_hook_realloc.cc (1068 of 2306)
UNSUPPORTED: AddressSanitizer-x86_64-darwin :: TestCases/Windows/fuse-lld.cc (1069 of 2306)
UNSUPPORTED: AddressSanitizer-x86_64-darwin :: TestCases/Windows/global_const_string.cc (1070 of 2306)
UNSUPPORTED: AddressSanitizer-x86_64-darwin :: TestCases/Windows/global_const_string_oob.cc (1071 of 2306)
UNSUPPORTED: AddressSanitizer-x86_64-darwin :: TestCases/Windows/global_dead_strip.c (1072 of 2306)
UNSUPPORTED: AddressSanitizer-x86_64-darwin :: TestCases/Windows/hello_world.cc (1073 of 2306)
UNSUPPORTED: AddressSanitizer-x86_64-darwin :: TestCases/Windows/intercept_memcpy.cc (1074 of 2306)
UNSUPPORTED: AddressSanitizer-x86_64-darwin :: TestCases/Windows/intercept_strdup.cc (1075 of 2306)
UNSUPPORTED: AddressSanitizer-x86_64-darwin :: TestCases/Windows/intercept_strlen.cc (1076 of 2306)
UNSUPPORTED: AddressSanitizer-x86_64-darwin :: TestCases/Windows/iostream_sbo.cc (1077 of 2306)
UNSUPPORTED: AddressSanitizer-x86_64-darwin :: TestCases/Windows/longjmp.cc (1078 of 2306)
UNSUPPORTED: AddressSanitizer-x86_64-darwin :: TestCases/Windows/malloc_left_oob.cc (1079 of 2306)
UNSUPPORTED: AddressSanitizer-x86_64-darwin :: TestCases/Windows/malloc_right_oob.cc (1080 of 2306)
UNSUPPORTED: AddressSanitizer-x86_64-darwin :: TestCases/Windows/malloc_uaf.cc (1081 of 2306)
UNSUPPORTED: AddressSanitizer-x86_64-darwin :: TestCases/Windows/null_deref.cc (1082 of 2306)
UNSUPPORTED: AddressSanitizer-x86_64-darwin :: TestCases/Windows/null_deref_multiple_dlls.cc (1083 of 2306)
UNSUPPORTED: AddressSanitizer-x86_64-darwin :: TestCases/Windows/oom.cc (1084 of 2306)
UNSUPPORTED: AddressSanitizer-x86_64-darwin :: TestCases/Windows/operator_array_new_left_oob.cc (1085 of 2306)
UNSUPPORTED: AddressSanitizer-x86_64-darwin :: TestCases/Windows/operator_array_new_right_oob.cc (1086 of 2306)
UNSUPPORTED: AddressSanitizer-x86_64-darwin :: TestCases/Windows/operator_array_new_uaf.cc (1087 of 2306)
UNSUPPORTED: AddressSanitizer-x86_64-darwin :: TestCases/Windows/operator_array_new_with_dtor_left_oob.cc (1088 of 2306)
UNSUPPORTED: AddressSanitizer-x86_64-darwin :: TestCases/Windows/operator_delete_wrong_argument.cc (1089 of 2306)
UNSUPPORTED: AddressSanitizer-x86_64-darwin :: TestCases/Windows/operator_new_left_oob.cc (1090 of 2306)
UNSUPPORTED: AddressSanitizer-x86_64-darwin :: TestCases/Windows/operator_new_right_oob.cc (1091 of 2306)
UNSUPPORTED: AddressSanitizer-x86_64-darwin :: TestCases/Windows/operator_new_uaf.cc (1092 of 2306)
UNSUPPORTED: AddressSanitizer-x86_64-darwin :: TestCases/Windows/queue_user_work_item.cc (1093 of 2306)
UNSUPPORTED: AddressSanitizer-x86_64-darwin :: TestCases/Windows/queue_user_work_item_report.cc (1094 of 2306)
UNSUPPORTED: AddressSanitizer-x86_64-darwin :: TestCases/Windows/realloc_left_oob.cc (1095 of 2306)
UNSUPPORTED: AddressSanitizer-x86_64-darwin :: TestCases/Windows/realloc_right_oob.cc (1096 of 2306)
UNSUPPORTED: AddressSanitizer-x86_64-darwin :: TestCases/Windows/realloc_uaf.cc (1097 of 2306)
UNSUPPORTED: AddressSanitizer-x86_64-darwin :: TestCases/Windows/report_after_syminitialize.cc (1098 of 2306)
UNSUPPORTED: AddressSanitizer-x86_64-darwin :: TestCases/Windows/report_globals_reload_dll.cc (1099 of 2306)
UNSUPPORTED: AddressSanitizer-x86_64-darwin :: TestCases/Windows/report_globals_vs_freelibrary.cc (1100 of 2306)
UNSUPPORTED: AddressSanitizer-x86_64-darwin :: TestCases/Windows/seh.cc (1101 of 2306)
UNSUPPORTED: AddressSanitizer-x86_64-darwin :: TestCases/Windows/shadow_conflict_32.cc (1102 of 2306)
UNSUPPORTED: AddressSanitizer-x86_64-darwin :: TestCases/Windows/shadow_mapping_failure.cc (1103 of 2306)
UNSUPPORTED: AddressSanitizer-x86_64-darwin :: TestCases/Windows/stack_array_left_oob.cc (1104 of 2306)
UNSUPPORTED: AddressSanitizer-x86_64-darwin :: TestCases/Windows/stack_array_right_oob.cc (1105 of 2306)
UNSUPPORTED: AddressSanitizer-x86_64-darwin :: TestCases/Windows/stack_array_sanity.cc (1106 of 2306)
UNSUPPORTED: AddressSanitizer-x86_64-darwin :: TestCases/Windows/stack_use_after_return.cc (1107 of 2306)
UNSUPPORTED: AddressSanitizer-x86_64-darwin :: TestCases/Windows/symbols_path.cc (1108 of 2306)
UNSUPPORTED: AddressSanitizer-x86_64-darwin :: TestCases/Windows/thread_simple.cc (1109 of 2306)
UNSUPPORTED: AddressSanitizer-x86_64-darwin :: TestCases/Windows/thread_stack_array_left_oob.cc (1110 of 2306)
UNSUPPORTED: AddressSanitizer-x86_64-darwin :: TestCases/Windows/thread_stack_array_right_oob.cc (1111 of 2306)
UNSUPPORTED: AddressSanitizer-x86_64-darwin :: TestCases/Windows/thread_stack_reuse.cc (1112 of 2306)
UNSUPPORTED: AddressSanitizer-x86_64-darwin :: TestCases/Windows/thread_stress.cc (1113 of 2306)
UNSUPPORTED: AddressSanitizer-x86_64-darwin :: TestCases/Windows/thread_suspended.cc (1114 of 2306)
UNSUPPORTED: AddressSanitizer-x86_64-darwin :: TestCases/Windows/tls_init.cc (1115 of 2306)
UNSUPPORTED: AddressSanitizer-x86_64-darwin :: TestCases/Windows/unsymbolized.cc (1116 of 2306)
UNSUPPORTED: AddressSanitizer-x86_64-darwin :: TestCases/Windows/use_after_realloc.cc (1117 of 2306)
UNSUPPORTED: AddressSanitizer-x86_64-darwin :: TestCases/Windows/use_after_return_linkage.cc (1118 of 2306)
UNSUPPORTED: AddressSanitizer-x86_64-darwin :: TestCases/Windows/windows_h.cc (1119 of 2306)
UNSUPPORTED: AddressSanitizer-x86_64-darwin :: TestCases/Windows/wrong_downcast_on_heap.cc (1120 of 2306)
UNSUPPORTED: AddressSanitizer-x86_64-darwin :: TestCases/Windows/wrong_downcast_on_stack.cc (1121 of 2306)
PASS: AddressSanitizer-x86_64-darwin :: TestCases/alloca_big_alignment.cc (1122 of 2306)
PASS: AddressSanitizer-x86_64-darwin :: TestCases/Posix/shared-lib-test.cc (1123 of 2306)
PASS: AddressSanitizer-x86_64-darwin :: TestCases/alloca_constant_size.cc (1124 of 2306)
PASS: AddressSanitizer-x86_64-darwin :: TestCases/Posix/waitid.cc (1125 of 2306)
PASS: AddressSanitizer-x86_64-darwin :: TestCases/alloca_detect_custom_size_.cc (1126 of 2306)
PASS: AddressSanitizer-x86_64-darwin :: TestCases/Posix/wait3.cc (1127 of 2306)
PASS: AddressSanitizer-x86_64-darwin :: TestCases/alloca_loop_unpoisoning.cc (1128 of 2306)
PASS: AddressSanitizer-x86_64-darwin :: TestCases/alloca_instruments_all_paddings.cc (1129 of 2306)
PASS: AddressSanitizer-x86_64-darwin :: TestCases/alloca_overflow_partial.cc (1130 of 2306)
PASS: AddressSanitizer-x86_64-darwin :: TestCases/alloca_safe_access.cc (1131 of 2306)
PASS: AddressSanitizer-x86_64-darwin :: TestCases/alloca_overflow_right.cc (1132 of 2306)
PASS: AddressSanitizer-x86_64-darwin :: TestCases/alloca_vla_interact.cc (1133 of 2306)
PASS: AddressSanitizer-x86_64-darwin :: TestCases/alloca_underflow_left.cc (1134 of 2306)
PASS: AddressSanitizer-x86_64-darwin :: TestCases/Posix/wait4.cc (1135 of 2306)
PASS: AddressSanitizer-x86_64-darwin :: TestCases/asan_options-help.cc (1136 of 2306)
PASS: AddressSanitizer-x86_64-darwin :: TestCases/asan_and_llvm_coverage_test.cc (1137 of 2306)
PASS: AddressSanitizer-x86_64-darwin :: TestCases/atexit_stats.cc (1138 of 2306)
PASS: AddressSanitizer-x86_64-darwin :: TestCases/Posix/current_allocated_bytes.cc (1139 of 2306)
PASS: AddressSanitizer-x86_64-darwin :: TestCases/Posix/stack-overflow.cc (1140 of 2306)
PASS: AddressSanitizer-x86_64-darwin :: TestCases/blacklist.cc (1141 of 2306)
UNSUPPORTED: AddressSanitizer-x86_64-darwin :: TestCases/coverage-and-lsan.cc (1142 of 2306)
PASS: AddressSanitizer-x86_64-darwin :: TestCases/contiguous_container.cc (1143 of 2306)
PASS: AddressSanitizer-x86_64-darwin :: TestCases/coverage-caller-callee-total-count.cc (1144 of 2306)
PASS: AddressSanitizer-x86_64-darwin :: TestCases/atoi_strict.c (1145 of 2306)
PASS: AddressSanitizer-x86_64-darwin :: TestCases/coverage-disabled.cc (1146 of 2306)
PASS: AddressSanitizer-x86_64-darwin :: TestCases/contiguous_container_crash.cc (1147 of 2306)
PASS: AddressSanitizer-x86_64-darwin :: TestCases/atol_strict.c (1148 of 2306)
PASS: AddressSanitizer-x86_64-darwin :: TestCases/atoll_strict.c (1149 of 2306)
PASS: AddressSanitizer-x86_64-darwin :: TestCases/coverage-reset.cc (1150 of 2306)
PASS: AddressSanitizer-x86_64-darwin :: TestCases/allocator_returns_null.cc (1151 of 2306)
PASS: AddressSanitizer-x86_64-darwin :: TestCases/coverage-trace-pc.cc (1152 of 2306)
UNSUPPORTED: AddressSanitizer-x86_64-darwin :: TestCases/debug_ppc64_mapping.cc (1153 of 2306)
PASS: AddressSanitizer-x86_64-darwin :: TestCases/debug_double_free.cc (1154 of 2306)
PASS: AddressSanitizer-x86_64-darwin :: TestCases/debug_locate.cc (1155 of 2306)
PASS: AddressSanitizer-x86_64-darwin :: TestCases/debug_mapping.cc (1156 of 2306)
PASS: AddressSanitizer-x86_64-darwin :: TestCases/debug_report.cc (1157 of 2306)
PASS: AddressSanitizer-x86_64-darwin :: TestCases/default_blacklist.cc (1158 of 2306)
PASS: AddressSanitizer-x86_64-darwin :: TestCases/coverage-order-pcs.cc (1159 of 2306)
PASS: AddressSanitizer-x86_64-darwin :: TestCases/debug_stacks.cc (1160 of 2306)
PASS: AddressSanitizer-x86_64-darwin :: TestCases/default_options.cc (1161 of 2306)
PASS: AddressSanitizer-x86_64-darwin :: TestCases/deep_stack_uaf.cc (1162 of 2306)
PASS: AddressSanitizer-x86_64-darwin :: TestCases/describe_address.cc (1163 of 2306)
PASS: AddressSanitizer-x86_64-darwin :: TestCases/coverage-levels.cc (1164 of 2306)
PASS: AddressSanitizer-x86_64-darwin :: TestCases/Posix/coverage-direct-large.cc (1165 of 2306)
PASS: AddressSanitizer-x86_64-darwin :: TestCases/force_inline_opt0.cc (1166 of 2306)
PASS: AddressSanitizer-x86_64-darwin :: TestCases/coverage-tracing.cc (1167 of 2306)
PASS: AddressSanitizer-x86_64-darwin :: TestCases/exitcode.cc (1168 of 2306)
PASS: AddressSanitizer-x86_64-darwin :: TestCases/frexp_interceptor.cc (1169 of 2306)
PASS: AddressSanitizer-x86_64-darwin :: TestCases/global-address.cpp (1170 of 2306)
PASS: AddressSanitizer-x86_64-darwin :: TestCases/global-demangle.cc (1171 of 2306)
PASS: AddressSanitizer-x86_64-darwin :: TestCases/deep_tail_call.cc (1172 of 2306)
PASS: AddressSanitizer-x86_64-darwin :: TestCases/double-free.cc (1173 of 2306)
PASS: AddressSanitizer-x86_64-darwin :: TestCases/heap-overflow-large.cc (1174 of 2306)
PASS: AddressSanitizer-x86_64-darwin :: TestCases/halt_on_error-1.c (1175 of 2306)
PASS: AddressSanitizer-x86_64-darwin :: TestCases/ill.cc (1176 of 2306)
PASS: AddressSanitizer-x86_64-darwin :: TestCases/huge_negative_hea_oob.cc (1177 of 2306)
PASS: AddressSanitizer-x86_64-darwin :: TestCases/global-location.cc (1178 of 2306)
PASS: AddressSanitizer-x86_64-darwin :: TestCases/init-order-atexit.cc (1179 of 2306)
PASS: AddressSanitizer-x86_64-darwin :: TestCases/global-overflow.cc (1180 of 2306)
PASS: AddressSanitizer-x86_64-darwin :: TestCases/initialization-bug.cc (1181 of 2306)
PASS: AddressSanitizer-x86_64-darwin :: TestCases/inline.cc (1182 of 2306)
PASS: AddressSanitizer-x86_64-darwin :: TestCases/heavy_uar_test.cc (1183 of 2306)
PASS: AddressSanitizer-x86_64-darwin :: TestCases/heap-overflow.cc (1184 of 2306)
PASS: AddressSanitizer-x86_64-darwin :: TestCases/initialization-blacklist.cc (1185 of 2306)
PASS: AddressSanitizer-x86_64-darwin :: TestCases/interface_test.cc (1186 of 2306)
PASS: AddressSanitizer-x86_64-darwin :: TestCases/intra-object-overflow.cc (1187 of 2306)
PASS: AddressSanitizer-x86_64-darwin :: TestCases/initialization-constexpr.cc (1188 of 2306)
PASS: AddressSanitizer-x86_64-darwin :: TestCases/initialization-nobug.cc (1189 of 2306)
PASS: AddressSanitizer-x86_64-darwin :: TestCases/longjmp.cc (1190 of 2306)
PASS: AddressSanitizer-x86_64-darwin :: TestCases/interception_failure_test.cc (1191 of 2306)
PASS: AddressSanitizer-x86_64-darwin :: TestCases/malloc-no-intercept.c (1192 of 2306)
PASS: AddressSanitizer-x86_64-darwin :: TestCases/invalid-free.cc (1193 of 2306)
PASS: AddressSanitizer-x86_64-darwin :: TestCases/lsan_annotations.cc (1194 of 2306)
PASS: AddressSanitizer-x86_64-darwin :: TestCases/invalid-pointer-pairs.cc (1195 of 2306)
PASS: AddressSanitizer-x86_64-darwin :: TestCases/malloc_fill.cc (1196 of 2306)
PASS: AddressSanitizer-x86_64-darwin :: TestCases/log-path_test.cc (1197 of 2306)
PASS: AddressSanitizer-x86_64-darwin :: TestCases/large_func_test.cc (1198 of 2306)
PASS: AddressSanitizer-x86_64-darwin :: TestCases/on_error_callback.cc (1199 of 2306)
PASS: AddressSanitizer-x86_64-darwin :: TestCases/memcmp_strict_test.cc (1200 of 2306)
PASS: AddressSanitizer-x86_64-darwin :: TestCases/malloc_context_size.cc (1201 of 2306)
PASS: AddressSanitizer-x86_64-darwin :: TestCases/max_redzone.cc (1202 of 2306)
PASS: AddressSanitizer-x86_64-darwin :: TestCases/printf-1.c (1203 of 2306)
PASS: AddressSanitizer-x86_64-darwin :: TestCases/memcmp_test.cc (1204 of 2306)
PASS: AddressSanitizer-x86_64-darwin :: TestCases/null_deref.cc (1205 of 2306)
PASS: AddressSanitizer-x86_64-darwin :: TestCases/print_summary.cc (1206 of 2306)
PASS: AddressSanitizer-x86_64-darwin :: TestCases/printf-2.c (1207 of 2306)
PASS: AddressSanitizer-x86_64-darwin :: TestCases/poison_partial.cc (1208 of 2306)
PASS: AddressSanitizer-x86_64-darwin :: TestCases/printf-m.c (1209 of 2306)
PASS: AddressSanitizer-x86_64-darwin :: TestCases/printf-4.c (1210 of 2306)
PASS: AddressSanitizer-x86_64-darwin :: TestCases/printf-3.c (1211 of 2306)
PASS: AddressSanitizer-x86_64-darwin :: TestCases/partial_right.cc (1212 of 2306)
PASS: AddressSanitizer-x86_64-darwin :: TestCases/printf-5.c (1213 of 2306)
PASS: AddressSanitizer-x86_64-darwin :: TestCases/sanity_check_pure_c.c (1214 of 2306)
PASS: AddressSanitizer-x86_64-darwin :: TestCases/sleep_before_dying.c (1215 of 2306)
PASS: AddressSanitizer-x86_64-darwin :: TestCases/speculative_load.cc (1216 of 2306)
PASS: AddressSanitizer-x86_64-darwin :: TestCases/stack-frame-demangle.cc (1217 of 2306)
PASS: AddressSanitizer-x86_64-darwin :: TestCases/speculative_load2.cc (1218 of 2306)
PASS: AddressSanitizer-x86_64-darwin :: TestCases/set_shadow_test.c (1219 of 2306)
PASS: AddressSanitizer-x86_64-darwin :: TestCases/strcasestr-1.c (1220 of 2306)
PASS: AddressSanitizer-x86_64-darwin :: TestCases/strcasestr-2.c (1221 of 2306)
PASS: AddressSanitizer-x86_64-darwin :: TestCases/stack-buffer-overflow.cc (1222 of 2306)
PASS: AddressSanitizer-x86_64-darwin :: TestCases/strcasestr_strict.c (1223 of 2306)
PASS: AddressSanitizer-x86_64-darwin :: TestCases/stack-oob-frames.cc (1224 of 2306)
PASS: AddressSanitizer-x86_64-darwin :: TestCases/strchr_strict.c (1225 of 2306)
PASS: AddressSanitizer-x86_64-darwin :: TestCases/strcmp_strict.c (1226 of 2306)
PASS: AddressSanitizer-x86_64-darwin :: TestCases/strcspn-1.c (1227 of 2306)
PASS: AddressSanitizer-x86_64-darwin :: TestCases/memset_test.cc (1228 of 2306)
PASS: AddressSanitizer-x86_64-darwin :: TestCases/strcspn-2.c (1229 of 2306)
PASS: AddressSanitizer-x86_64-darwin :: TestCases/strcspn_strict.c (1230 of 2306)
PASS: AddressSanitizer-x86_64-darwin :: TestCases/strip_path_prefix.c (1231 of 2306)
PASS: AddressSanitizer-x86_64-darwin :: TestCases/strcat_strict.c (1232 of 2306)
PASS: AddressSanitizer-x86_64-darwin :: TestCases/strpbrk-1.c (1233 of 2306)
PASS: AddressSanitizer-x86_64-darwin :: TestCases/stack-buffer-overflow-with-position.cc (1234 of 2306)
PASS: AddressSanitizer-x86_64-darwin :: TestCases/strdup_oob_test.cc (1235 of 2306)
PASS: AddressSanitizer-x86_64-darwin :: TestCases/strpbrk-2.c (1236 of 2306)
PASS: AddressSanitizer-x86_64-darwin :: TestCases/strncpy-overflow.cc (1237 of 2306)
PASS: AddressSanitizer-x86_64-darwin :: TestCases/strncat_strict.c (1238 of 2306)
PASS: AddressSanitizer-x86_64-darwin :: TestCases/strspn-1.c (1239 of 2306)
PASS: AddressSanitizer-x86_64-darwin :: TestCases/strpbrk_strict.c (1240 of 2306)
PASS: AddressSanitizer-x86_64-darwin :: TestCases/strspn-2.c (1241 of 2306)
PASS: AddressSanitizer-x86_64-darwin :: TestCases/strstr-1.c (1242 of 2306)
PASS: AddressSanitizer-x86_64-darwin :: TestCases/strspn_strict.c (1243 of 2306)
PASS: AddressSanitizer-x86_64-darwin :: TestCases/strstr-2.c (1244 of 2306)
PASS: AddressSanitizer-x86_64-darwin :: TestCases/strstr_strict.c (1245 of 2306)
PASS: AddressSanitizer-x86_64-darwin :: TestCases/strncasecmp_strict.c (1246 of 2306)
PASS: AddressSanitizer-x86_64-darwin :: TestCases/strncmp_strict.c (1247 of 2306)
PASS: AddressSanitizer-x86_64-darwin :: TestCases/suppressions-interceptor.cc (1248 of 2306)
PASS: AddressSanitizer-x86_64-darwin :: TestCases/throw_call_test.cc (1249 of 2306)
PASS: AddressSanitizer-x86_64-darwin :: TestCases/suppressions-exec-relative-location.cc (1250 of 2306)
PASS: AddressSanitizer-x86_64-darwin :: TestCases/suppressions-library.cc (1251 of 2306)
PASS: AddressSanitizer-x86_64-darwin :: TestCases/throw_catch.cc (1252 of 2306)
PASS: AddressSanitizer-x86_64-darwin :: TestCases/suppressions-function.cc (1253 of 2306)
PASS: AddressSanitizer-x86_64-darwin :: TestCases/time_interceptor.cc (1254 of 2306)
PASS: AddressSanitizer-x86_64-darwin :: TestCases/uar_and_exceptions.cc (1255 of 2306)
PASS: AddressSanitizer-x86_64-darwin :: TestCases/throw_invoke_test.cc (1256 of 2306)
PASS: AddressSanitizer-x86_64-darwin :: TestCases/use-after-poison.cc (1257 of 2306)
PASS: AddressSanitizer-x86_64-darwin :: TestCases/scariness_score_test.cc (1258 of 2306)
PASS: AddressSanitizer-x86_64-darwin :: TestCases/use-after-scope-capture.cc (1259 of 2306)
PASS: AddressSanitizer-x86_64-darwin :: TestCases/use-after-delete.cc (1260 of 2306)
PASS: AddressSanitizer-x86_64-darwin :: TestCases/use-after-scope-goto.cc (1261 of 2306)
PASS: AddressSanitizer-x86_64-darwin :: TestCases/use-after-free-right.cc (1262 of 2306)
PASS: AddressSanitizer-x86_64-darwin :: TestCases/use-after-scope-dtor-order.cc (1263 of 2306)
PASS: AddressSanitizer-x86_64-darwin :: TestCases/use-after-free.cc (1264 of 2306)
PASS: AddressSanitizer-x86_64-darwin :: TestCases/use-after-scope-if.cc (1265 of 2306)
PASS: AddressSanitizer-x86_64-darwin :: TestCases/use-after-scope-inlined.cc (1266 of 2306)
PASS: AddressSanitizer-x86_64-darwin :: TestCases/use-after-scope-nobug.cc (1267 of 2306)
PASS: AddressSanitizer-x86_64-darwin :: TestCases/use-after-scope-loop-bug.cc (1268 of 2306)
PASS: AddressSanitizer-x86_64-darwin :: TestCases/use-after-scope-loop-removed.cc (1269 of 2306)
PASS: AddressSanitizer-x86_64-darwin :: TestCases/use-after-scope-loop.cc (1270 of 2306)
PASS: AddressSanitizer-x86_64-darwin :: TestCases/use-after-scope-temp.cc (1271 of 2306)
PASS: AddressSanitizer-x86_64-darwin :: TestCases/use-after-scope-temp2.cc (1272 of 2306)
PASS: AddressSanitizer-x86_64-darwin :: TestCases/use-after-scope.cc (1273 of 2306)
PASS: AddressSanitizer-x86_64-darwin :: TestCases/verbose-log-path_test.cc (1274 of 2306)
PASS: AddressSanitizer-x86_64-darwin :: TestCases/vla_chrome_testcase.cc (1275 of 2306)
UNSUPPORTED: Profile-i386 :: Linux/comdat_rename.test (1276 of 2306)
UNSUPPORTED: Profile-i386 :: Linux/coverage_ctors.cpp (1277 of 2306)
UNSUPPORTED: Profile-i386 :: Linux/coverage_dtor.cpp (1278 of 2306)
UNSUPPORTED: Profile-i386 :: Linux/coverage_shared.test (1279 of 2306)
UNSUPPORTED: Profile-i386 :: Linux/coverage_test.cpp (1280 of 2306)
UNSUPPORTED: Profile-i386 :: Linux/extern_template.test (1281 of 2306)
UNSUPPORTED: Profile-i386 :: Linux/instrprof-alloc.test (1282 of 2306)
UNSUPPORTED: Profile-i386 :: Linux/instrprof-basic.c (1283 of 2306)
UNSUPPORTED: Profile-i386 :: Linux/instrprof-comdat.test (1284 of 2306)
UNSUPPORTED: Profile-i386 :: Linux/instrprof-cs.c (1285 of 2306)
UNSUPPORTED: Profile-i386 :: Linux/instrprof-dlopen.test (1286 of 2306)
UNSUPPORTED: Profile-i386 :: Linux/instrprof-dynamic-one-shared.test (1287 of 2306)
UNSUPPORTED: Profile-i386 :: Linux/instrprof-dynamic-two-shared.test (1288 of 2306)
UNSUPPORTED: Profile-i386 :: Linux/instrprof-file_ex.test (1289 of 2306)
UNSUPPORTED: Profile-i386 :: Linux/instrprof-merge-vp.c (1290 of 2306)
UNSUPPORTED: Profile-i386 :: Linux/instrprof-value-prof-warn.test (1291 of 2306)
PASS: AddressSanitizer-x86_64-darwin :: TestCases/strtol_strict.c (1292 of 2306)
PASS: AddressSanitizer-x86_64-darwin :: TestCases/strtoll_strict.c (1293 of 2306)
PASS: AddressSanitizer-x86_64-darwin :: TestCases/vla_condition_overflow.cc (1294 of 2306)
PASS: AddressSanitizer-x86_64-darwin :: TestCases/unaligned_loads_and_stores.cc (1295 of 2306)
PASS: AddressSanitizer-x86_64-darwin :: TestCases/vla_loop_overfow.cc (1296 of 2306)
PASS: AddressSanitizer-x86_64-darwin :: TestCases/zero_page_pc.cc (1297 of 2306)
PASS: Profile-i386 :: gcc-flag-compatibility.test (1298 of 2306)
PASS: Profile-i386 :: instrprof-bufferio.c (1299 of 2306)
PASS: Profile-i386 :: instrprof-dump.c (1300 of 2306)
PASS: Profile-i386 :: instrprof-error.c (1301 of 2306)
PASS: Profile-i386 :: instrprof-darwin-dead-strip.c (1302 of 2306)
PASS: Profile-i386 :: instrprof-hostname.c (1303 of 2306)
PASS: Profile-i386 :: instrprof-merge-match.test (1304 of 2306)
PASS: Profile-i386 :: instrprof-merge.c (1305 of 2306)
PASS: Profile-i386 :: instrprof-icall-promo.test (1306 of 2306)
PASS: Profile-i386 :: instrprof-basic.c (1307 of 2306)
PASS: Profile-i386 :: instrprof-dynamic-one-shared.test (1308 of 2306)
PASS: Profile-i386 :: instrprof-override-filename-with-env.c (1309 of 2306)
PASS: Profile-i386 :: instrprof-override-filename-then-reset-default.c (1310 of 2306)
PASS: Profile-i386 :: instrprof-dynamic-two-shared.test (1311 of 2306)
PASS: Profile-i386 :: instrprof-override-filename.c (1312 of 2306)
PASS: Profile-i386 :: instrprof-reset-counters.c (1313 of 2306)
PASS: Profile-i386 :: instrprof-set-filename-then-reset-default.c (1314 of 2306)
PASS: Profile-i386 :: instrprof-set-filename-shared.test (1315 of 2306)
PASS: Profile-i386 :: instrprof-path.c (1316 of 2306)
PASS: Profile-i386 :: instrprof-value-prof-2.c (1317 of 2306)
PASS: Profile-i386 :: instrprof-dlopen.test (1318 of 2306)
PASS: Profile-i386 :: instrprof-value-prof-reset.c (1319 of 2306)
PASS: Profile-i386 :: instrprof-set-filename.c (1320 of 2306)
PASS: Profile-i386 :: instrprof-version-mismatch.c (1321 of 2306)
PASS: Profile-i386 :: instrprof-visibility.cpp (1322 of 2306)
PASS: Profile-i386 :: instrprof-value-prof-evict.test (1323 of 2306)
PASS: Profile-i386 :: instrprof-write-file-atexit-explicitly.c (1324 of 2306)
PASS: Profile-i386 :: instrprof-without-libc.c (1325 of 2306)
UNSUPPORTED: Profile-x86_64 :: Linux/comdat_rename.test (1326 of 2306)
UNSUPPORTED: Profile-x86_64 :: Linux/coverage_ctors.cpp (1327 of 2306)
UNSUPPORTED: Profile-x86_64 :: Linux/coverage_dtor.cpp (1328 of 2306)
UNSUPPORTED: Profile-x86_64 :: Linux/coverage_shared.test (1329 of 2306)
UNSUPPORTED: Profile-x86_64 :: Linux/coverage_test.cpp (1330 of 2306)
UNSUPPORTED: Profile-x86_64 :: Linux/extern_template.test (1331 of 2306)
UNSUPPORTED: Profile-x86_64 :: Linux/instrprof-alloc.test (1332 of 2306)
UNSUPPORTED: Profile-x86_64 :: Linux/instrprof-basic.c (1333 of 2306)
UNSUPPORTED: Profile-x86_64 :: Linux/instrprof-comdat.test (1334 of 2306)
UNSUPPORTED: Profile-x86_64 :: Linux/instrprof-cs.c (1335 of 2306)
UNSUPPORTED: Profile-x86_64 :: Linux/instrprof-dlopen.test (1336 of 2306)
UNSUPPORTED: Profile-x86_64 :: Linux/instrprof-dynamic-one-shared.test (1337 of 2306)
UNSUPPORTED: Profile-x86_64 :: Linux/instrprof-dynamic-two-shared.test (1338 of 2306)
UNSUPPORTED: Profile-x86_64 :: Linux/instrprof-file_ex.test (1339 of 2306)
UNSUPPORTED: Profile-x86_64 :: Linux/instrprof-merge-vp.c (1340 of 2306)
UNSUPPORTED: Profile-x86_64 :: Linux/instrprof-value-prof-warn.test (1341 of 2306)
PASS: AddressSanitizer-x86_64-darwin :: TestCases/use-after-scope-types.cc (1342 of 2306)
PASS: Profile-i386 :: instrprof-write-file-only.c (1343 of 2306)
PASS: Profile-i386 :: instrprof-value-prof.c (1344 of 2306)
PASS: Profile-i386 :: instrprof-write-file.c (1345 of 2306)
PASS: Profile-x86_64 :: instrprof-bufferio.c (1346 of 2306)
PASS: Profile-x86_64 :: gcc-flag-compatibility.test (1347 of 2306)
PASS: Profile-x86_64 :: instrprof-dump.c (1348 of 2306)
PASS: Profile-x86_64 :: instrprof-darwin-dead-strip.c (1349 of 2306)
PASS: Profile-i386 :: instrprof-shared.test (1350 of 2306)
PASS: Profile-x86_64 :: instrprof-error.c (1351 of 2306)
PASS: Profile-x86_64 :: instrprof-hostname.c (1352 of 2306)
PASS: Profile-x86_64 :: instrprof-basic.c (1353 of 2306)
PASS: Profile-x86_64 :: instrprof-dynamic-one-shared.test (1354 of 2306)
PASS: Profile-x86_64 :: instrprof-merge.c (1355 of 2306)
PASS: Profile-x86_64 :: instrprof-merge-match.test (1356 of 2306)
PASS: Profile-x86_64 :: instrprof-icall-promo.test (1357 of 2306)
PASS: Profile-x86_64 :: instrprof-override-filename-then-reset-default.c (1358 of 2306)
PASS: Profile-x86_64 :: instrprof-dynamic-two-shared.test (1359 of 2306)
PASS: Profile-x86_64 :: instrprof-override-filename-with-env.c (1360 of 2306)
PASS: Profile-x86_64 :: instrprof-override-filename.c (1361 of 2306)
PASS: Profile-x86_64 :: instrprof-dlopen.test (1362 of 2306)
PASS: Profile-x86_64 :: instrprof-reset-counters.c (1363 of 2306)
PASS: Profile-x86_64 :: instrprof-set-filename-then-reset-default.c (1364 of 2306)
PASS: Profile-x86_64 :: instrprof-set-filename-shared.test (1365 of 2306)
PASS: Profile-x86_64 :: instrprof-path.c (1366 of 2306)
PASS: Profile-x86_64 :: instrprof-value-prof-2.c (1367 of 2306)
PASS: Profile-x86_64 :: instrprof-value-prof-reset.c (1368 of 2306)
PASS: Profile-x86_64 :: instrprof-set-filename.c (1369 of 2306)
PASS: Profile-x86_64 :: instrprof-version-mismatch.c (1370 of 2306)
PASS: Profile-x86_64 :: instrprof-value-prof-evict.test (1371 of 2306)
PASS: Profile-x86_64 :: instrprof-visibility.cpp (1372 of 2306)
PASS: Profile-x86_64 :: instrprof-write-file-atexit-explicitly.c (1373 of 2306)
PASS: Profile-x86_64 :: instrprof-value-prof.c (1374 of 2306)
PASS: Profile-x86_64 :: instrprof-without-libc.c (1375 of 2306)
PASS: Profile-x86_64 :: instrprof-write-file-only.c (1376 of 2306)
PASS: SafeStack :: buffer-copy.c (1377 of 2306)
PASS: SafeStack :: buffer-copy-vla.c (1378 of 2306)
PASS: Profile-x86_64 :: instrprof-write-file.c (1379 of 2306)
PASS: SafeStack :: init.c (1380 of 2306)
PASS: SafeStack :: lto.c (1381 of 2306)
PASS: Profile-x86_64 :: instrprof-shared.test (1382 of 2306)
PASS: SafeStack :: overflow.c (1383 of 2306)
PASS: SanitizerCommon-Unit :: Sanitizer-i386-Test/Allocator.Basic (1384 of 2306)
PASS: SafeStack :: canary.c (1385 of 2306)
PASS: SanitizerCommon-Unit :: Sanitizer-i386-Test/Allocator.LargeAlloc (1386 of 2306)
PASS: SanitizerCommon-Unit :: Sanitizer-i386-Test/Allocator.ScopedBuffer (1387 of 2306)
PASS: SafeStack :: pthread-cleanup.c (1388 of 2306)
PASS: SanitizerCommon-Unit :: Sanitizer-i386-Test/BVGraph.AddEdgesTest (1389 of 2306)
PASS: SanitizerCommon-Unit :: Sanitizer-i386-Test/Allocator.Stress (1390 of 2306)
PASS: SanitizerCommon-Unit :: Sanitizer-i386-Test/BVGraph.LongCycle (1391 of 2306)
PASS: SanitizerCommon-Unit :: Sanitizer-i386-Test/BVGraph.ShortestPath (1392 of 2306)
PASS: SanitizerCommon-Unit :: Sanitizer-i386-Test/BVGraph.isReachable (1393 of 2306)
PASS: SanitizerCommon-Unit :: Sanitizer-i386-Test/DeadlockDetector.BasicTest (1394 of 2306)
XFAIL: SafeStack :: pthread.c (1395 of 2306)
PASS: SanitizerCommon-Unit :: Sanitizer-i386-Test/DeadlockDetector.CorrectEpochFlush (1396 of 2306)
PASS: SanitizerCommon-Unit :: Sanitizer-i386-Test/DeadlockDetector.LockContextTest (1397 of 2306)
PASS: SanitizerCommon-Unit :: Sanitizer-i386-Test/DeadlockDetector.RecusriveLockTest (1398 of 2306)
PASS: SanitizerCommon-Unit :: Sanitizer-i386-Test/BVGraph.RemoveEdges (1399 of 2306)
PASS: SanitizerCommon-Unit :: Sanitizer-i386-Test/DeadlockDetector.RemoveEdgesTest (1400 of 2306)
PASS: SanitizerCommon-Unit :: Sanitizer-i386-Test/BVGraph.BasicTest (1401 of 2306)
PASS: SanitizerCommon-Unit :: Sanitizer-i386-Test/DeadlockDetector.RemoveNodeTest (1402 of 2306)
PASS: SanitizerCommon-Unit :: Sanitizer-i386-Test/DeadlockDetector.TryLockTest (1403 of 2306)
PASS: SanitizerCommon-Unit :: Sanitizer-i386-Test/DeadlockDetector.MultipleEpochsTest (1404 of 2306)
PASS: SanitizerCommon-Unit :: Sanitizer-i386-Test/DeadlockDetector.onFirstLockTest (1405 of 2306)
PASS: SanitizerCommon-Unit :: Sanitizer-i386-Test/FastUnwindTest.Basic (1406 of 2306)
PASS: SanitizerCommon-Unit :: Sanitizer-i386-Test/FastUnwindTest.CloseToZeroFrame (1407 of 2306)
PASS: SanitizerCommon-Unit :: Sanitizer-i386-Test/FastUnwindTest.FPBelowPrevFP (1408 of 2306)
PASS: SanitizerCommon-Unit :: Sanitizer-i386-Test/FastUnwindTest.FramePointerLoop (1409 of 2306)
PASS: SanitizerCommon-Unit :: Sanitizer-i386-Test/FastUnwindTest.MisalignedFramePointer (1410 of 2306)
PASS: SanitizerCommon-Unit :: Sanitizer-i386-Test/FastUnwindTest.OneFrameStackTrace (1411 of 2306)
PASS: SanitizerCommon-Unit :: Sanitizer-i386-Test/FastUnwindTest.ZeroFramesStackTrace (1412 of 2306)
PASS: SanitizerCommon-Unit :: Sanitizer-i386-Test/MemoryMapping.LoadedModuleArchAndUUID (1413 of 2306)
PASS: SanitizerCommon-Unit :: Sanitizer-i386-Test/MemoryMappingLayout.DumpListOfModules (1414 of 2306)
PASS: SanitizerCommon-Unit :: Sanitizer-i386-Test/Printf.Basic (1415 of 2306)
PASS: SanitizerCommon-Unit :: Sanitizer-i386-Test/Printf.MinMax (1416 of 2306)
PASS: SanitizerCommon-Unit :: Sanitizer-i386-Test/Printf.OverflowInt (1417 of 2306)
PASS: SanitizerCommon-Unit :: Sanitizer-i386-Test/Printf.OverflowPtr (1418 of 2306)
PASS: SanitizerCommon-Unit :: Sanitizer-i386-Test/Printf.OverflowStr (1419 of 2306)
PASS: SanitizerCommon-Unit :: Sanitizer-i386-Test/Printf.OverflowUint (1420 of 2306)
PASS: SanitizerCommon-Unit :: Sanitizer-i386-Test/Printf.Padding (1421 of 2306)
PASS: SanitizerCommon-Unit :: Sanitizer-i386-Test/Printf.Precision (1422 of 2306)
PASS: SanitizerCommon-Unit :: Sanitizer-i386-Test/SanitizerCommon.AtomicCompareExchangeTest (1423 of 2306)
PASS: SanitizerCommon-Unit :: Sanitizer-i386-Test/SanitizerCommon.AtomicStoreLoad (1424 of 2306)
PASS: SanitizerCommon-Unit :: Sanitizer-i386-Test/SanitizerCommon.BasicBitVector (1425 of 2306)
PASS: SanitizerCommon-Unit :: Sanitizer-i386-Test/SanitizerCommon.BooleanFlags (1426 of 2306)
PASS: SanitizerCommon-Unit :: Sanitizer-i386-Test/SanitizerCommon.CommonFlags (1427 of 2306)
PASS: SanitizerCommon-Unit :: Sanitizer-i386-Test/SanitizerCommon.CommonSuffixFlags (1428 of 2306)
PASS: SanitizerCommon-Unit :: Sanitizer-i386-Test/SanitizerCommon.CompactSizeClassMap (1429 of 2306)
PASS: SanitizerCommon-Unit :: Sanitizer-i386-Test/SanitizerCommon.DefaultSizeClassMap (1430 of 2306)
PASS: SanitizerCommon-Unit :: Sanitizer-i386-Test/SanitizerCommon.FileOps (1431 of 2306)
PASS: SanitizerCommon-Unit :: Sanitizer-i386-Test/SanitizerCommon.InternalLowerBound (1432 of 2306)
PASS: SanitizerCommon-Unit :: Sanitizer-i386-Test/SanitizerCommon.IntFlags (1433 of 2306)
PASS: SanitizerCommon-Unit :: Sanitizer-i386-Test/SanitizerCommon.InternalMemmoveRegression (1434 of 2306)
PASS: SanitizerCommon-Unit :: Sanitizer-i386-Test/SanitizerCommon.InternalMmapVector (1435 of 2306)
PASS: SanitizerCommon-Unit :: Sanitizer-i386-Test/SanitizerCommon.BlockingMutex (1436 of 2306)
PASS: SanitizerCommon-Unit :: Sanitizer-i386-Test/SanitizerCommon.InternalScopedString (1437 of 2306)
PASS: SanitizerCommon-Unit :: Sanitizer-i386-Test/SanitizerCommon.InternalSizeClassMap (1438 of 2306)
PASS: SanitizerCommon-Unit :: Sanitizer-i386-Test/SanitizerCommon.InternalStrFunctions (1439 of 2306)
PASS: SanitizerCommon-Unit :: Sanitizer-i386-Test/SanitizerCommon.IntrusiveList (1440 of 2306)
PASS: SanitizerCommon-Unit :: Sanitizer-i386-Test/SanitizerCommon.IntrusiveListAppendEmpty (1441 of 2306)
PASS: SanitizerCommon-Unit :: Sanitizer-i386-Test/SanitizerCommon.IsAccessibleMemoryRange (1442 of 2306)
PASS: SanitizerCommon-Unit :: Sanitizer-i386-Test/SanitizerCommon.InternalLowerBoundVsStdLowerBound (1443 of 2306)
PASS: SanitizerCommon-Unit :: Sanitizer-i386-Test/SanitizerCommon.LargeMmapAllocatorIteration (1444 of 2306)
PASS: SanitizerCommon-Unit :: Sanitizer-i386-Test/SanitizerCommon.LargeMmapAllocatorMapUnmapCallback (1445 of 2306)
PASS: SanitizerCommon-Unit :: Sanitizer-i386-Test/SanitizerCommon.MmapAlignedOrDie (1446 of 2306)
PASS: SanitizerCommon-Unit :: Sanitizer-i386-Test/SanitizerCommon.MultipleFlags (1447 of 2306)
PASS: SanitizerCommon-Unit :: Sanitizer-i386-Test/SanitizerCommon.PthreadDestructorIterations (1448 of 2306)
PASS: SanitizerCommon-Unit :: Sanitizer-i386-Test/SanitizerCommon.RemoveANSIEscapeSequencesFromString (1449 of 2306)
PASS: SanitizerCommon-Unit :: Sanitizer-i386-Test/SanitizerCommon.CombinedAllocator32Compact (1450 of 2306)
PASS: SanitizerCommon-Unit :: Sanitizer-i386-Test/SanitizerCommon.LargeMmapAllocatorBlockBegin (1451 of 2306)
PASS: SanitizerCommon-Unit :: Sanitizer-i386-Test/SanitizerCommon.SizeClassAllocator32CompactLocalCache (1452 of 2306)
PASS: SanitizerCommon-Unit :: Sanitizer-i386-Test/SanitizerCommon.SizeClassAllocator32Iteration (1453 of 2306)
PASS: SanitizerCommon-Unit :: Sanitizer-i386-Test/SanitizerCommon.SizeClassAllocator32MapUnmapCallback (1454 of 2306)
PASS: SanitizerCommon-Unit :: Sanitizer-i386-Test/SanitizerCommon.SortTest (1455 of 2306)
PASS: SanitizerCommon-Unit :: Sanitizer-i386-Test/SanitizerCommon.SpinMutex (1456 of 2306)
PASS: SanitizerCommon-Unit :: Sanitizer-i386-Test/SanitizerCommon.SpinMutexTry (1457 of 2306)
PASS: SanitizerCommon-Unit :: Sanitizer-i386-Test/SanitizerCommon.StackDepotAbsent (1458 of 2306)
PASS: SanitizerCommon-Unit :: Sanitizer-i386-Test/SanitizerCommon.StackDepotBasic (1459 of 2306)
PASS: SanitizerCommon-Unit :: Sanitizer-i386-Test/SanitizerCommon.StackDepotEmptyStack (1460 of 2306)
PASS: SanitizerCommon-Unit :: Sanitizer-i386-Test/SanitizerCommon.StackDepotReverseMap (1461 of 2306)
PASS: SanitizerCommon-Unit :: Sanitizer-i386-Test/SanitizerCommon.StackDepotSame (1462 of 2306)
PASS: SanitizerCommon-Unit :: Sanitizer-i386-Test/SanitizerCommon.StackDepotSeveral (1463 of 2306)
PASS: SanitizerCommon-Unit :: Sanitizer-i386-Test/SanitizerCommon.StackDepotZeroId (1464 of 2306)
PASS: SanitizerCommon-Unit :: Sanitizer-i386-Test/SanitizerCommon.StrFlags (1465 of 2306)
PASS: SanitizerCommon-Unit :: Sanitizer-i386-Test/SanitizerCommon.StripPathPrefix (1466 of 2306)
PASS: SanitizerCommon-Unit :: Sanitizer-i386-Test/SanitizerCommon.ThreadRegistryTest (1467 of 2306)
PASS: SanitizerCommon-Unit :: Sanitizer-i386-Test/SanitizerCommon.ThreadRegistryThreadedTest (1468 of 2306)
PASS: SanitizerCommon-Unit :: Sanitizer-i386-Test/SanitizerCommon.ThreadStackTlsMain (1469 of 2306)
PASS: SanitizerCommon-Unit :: Sanitizer-i386-Test/SanitizerCommon.ThreadStackTlsWorker (1470 of 2306)
PASS: SanitizerCommon-Unit :: Sanitizer-i386-Test/SanitizerCommon.SizeClassAllocator32Compact (1471 of 2306)
PASS: SanitizerCommon-Unit :: Sanitizer-i386-Test/SanitizerCommon.ThreadedTwoLevelByteMap (1472 of 2306)
PASS: SanitizerCommon-Unit :: Sanitizer-i386-Test/SanitizerCommon.TwoLevelByteMap (1473 of 2306)
PASS: SanitizerCommon-Unit :: Sanitizer-i386-Test/SanitizerCommon.VeryCompactSizeClassMap (1474 of 2306)
PASS: SanitizerCommon-Unit :: Sanitizer-i386-Test/SanitizerCommon.mem_is_zero (1475 of 2306)
PASS: SanitizerCommon-Unit :: Sanitizer-i386-Test/SanitizerCommonInterceptors.Printf (1476 of 2306)
PASS: SanitizerCommon-Unit :: Sanitizer-i386-Test/SanitizerCommonInterceptors.Scanf (1477 of 2306)
PASS: SanitizerCommon-Unit :: Sanitizer-i386-Test/SanitizerStacktracePrinter.RenderFrame (1478 of 2306)
PASS: SanitizerCommon-Unit :: Sanitizer-i386-Test/SanitizerStacktracePrinter.RenderModuleLocation (1479 of 2306)
PASS: SanitizerCommon-Unit :: Sanitizer-i386-Test/SanitizerStacktracePrinter.RenderSourceLocation (1480 of 2306)
PASS: SanitizerCommon-Unit :: Sanitizer-i386-Test/SanitizerCommon.SizeClassAllocator32CompactMetadataStress (1481 of 2306)
PASS: SanitizerCommon-Unit :: Sanitizer-i386-Test/SlowUnwindTest.ShortStackTrace (1482 of 2306)
PASS: SanitizerCommon-Unit :: Sanitizer-i386-Test/SuppressionContextTest.HasSuppressionType (1483 of 2306)
PASS: SanitizerCommon-Unit :: Sanitizer-i386-Test/SuppressionContextTest.Parse (1484 of 2306)
PASS: SanitizerCommon-Unit :: Sanitizer-i386-Test/SuppressionContextTest.Parse2 (1485 of 2306)
PASS: SanitizerCommon-Unit :: Sanitizer-i386-Test/SuppressionContextTest.Parse3 (1486 of 2306)
PASS: SanitizerCommon-Unit :: Sanitizer-i386-Test/SanitizerCommon.TwoLevelBitVector (1487 of 2306)
PASS: SanitizerCommon-Unit :: Sanitizer-i386-Test/SuppressionContextTest.ParseType (1488 of 2306)
PASS: SanitizerCommon-Unit :: Sanitizer-i386-Test/Suppressions.Match (1489 of 2306)
PASS: SanitizerCommon-Unit :: Sanitizer-i386-Test/Symbolizer.DemangleSwiftAndCXX (1490 of 2306)
PASS: SanitizerCommon-Unit :: Sanitizer-i386-Test/Symbolizer.ExtractInt (1491 of 2306)
PASS: SanitizerCommon-Unit :: Sanitizer-i386-Test/Symbolizer.ExtractToken (1492 of 2306)
PASS: SanitizerCommon-Unit :: Sanitizer-i386-Test/Symbolizer.ExtractTokenUpToDelimiter (1493 of 2306)
PASS: SanitizerCommon-Unit :: Sanitizer-i386-Test/Symbolizer.ExtractUptr (1494 of 2306)
PASS: SanitizerCommon-Unit :: Sanitizer-x86_64-Test/Allocator.AllocatorCacheDeallocNewThread (1495 of 2306)
PASS: SanitizerCommon-Unit :: Sanitizer-x86_64-Test/Allocator.Basic (1496 of 2306)
PASS: SanitizerCommon-Unit :: Sanitizer-x86_64-Test/Allocator.LargeAlloc (1497 of 2306)
PASS: SanitizerCommon-Unit :: Sanitizer-x86_64-Test/Allocator.ScopedBuffer (1498 of 2306)
PASS: SanitizerCommon-Unit :: Sanitizer-x86_64-Test/BVGraph.AddEdgesTest (1499 of 2306)
PASS: SanitizerCommon-Unit :: Sanitizer-x86_64-Test/Allocator.Stress (1500 of 2306)
PASS: SanitizerCommon-Unit :: Sanitizer-x86_64-Test/BVGraph.BasicTest (1501 of 2306)
PASS: SanitizerCommon-Unit :: Sanitizer-x86_64-Test/BVGraph.ShortestPath (1502 of 2306)
PASS: SanitizerCommon-Unit :: Sanitizer-x86_64-Test/BVGraph.LongCycle (1503 of 2306)
PASS: SanitizerCommon-Unit :: Sanitizer-x86_64-Test/BVGraph.isReachable (1504 of 2306)
PASS: SanitizerCommon-Unit :: Sanitizer-x86_64-Test/DeadlockDetector.BasicTest (1505 of 2306)
PASS: SanitizerCommon-Unit :: Sanitizer-x86_64-Test/DeadlockDetector.CorrectEpochFlush (1506 of 2306)
PASS: SanitizerCommon-Unit :: Sanitizer-x86_64-Test/DeadlockDetector.LockContextTest (1507 of 2306)
PASS: SanitizerCommon-Unit :: Sanitizer-x86_64-Test/DeadlockDetector.RecusriveLockTest (1508 of 2306)
PASS: SanitizerCommon-Unit :: Sanitizer-x86_64-Test/DeadlockDetector.RemoveEdgesTest (1509 of 2306)
PASS: SanitizerCommon-Unit :: Sanitizer-x86_64-Test/DeadlockDetector.MultipleEpochsTest (1510 of 2306)
PASS: SanitizerCommon-Unit :: Sanitizer-x86_64-Test/DeadlockDetector.TryLockTest (1511 of 2306)
PASS: SanitizerCommon-Unit :: Sanitizer-x86_64-Test/DeadlockDetector.onFirstLockTest (1512 of 2306)
PASS: SanitizerCommon-Unit :: Sanitizer-x86_64-Test/FastUnwindTest.Basic (1513 of 2306)
PASS: SanitizerCommon-Unit :: Sanitizer-x86_64-Test/FastUnwindTest.CloseToZeroFrame (1514 of 2306)
PASS: SanitizerCommon-Unit :: Sanitizer-x86_64-Test/FastUnwindTest.FPBelowPrevFP (1515 of 2306)
PASS: SanitizerCommon-Unit :: Sanitizer-x86_64-Test/FastUnwindTest.FramePointerLoop (1516 of 2306)
PASS: SanitizerCommon-Unit :: Sanitizer-x86_64-Test/FastUnwindTest.MisalignedFramePointer (1517 of 2306)
PASS: SanitizerCommon-Unit :: Sanitizer-x86_64-Test/FastUnwindTest.OneFrameStackTrace (1518 of 2306)
PASS: SanitizerCommon-Unit :: Sanitizer-x86_64-Test/FastUnwindTest.ZeroFramesStackTrace (1519 of 2306)
PASS: SanitizerCommon-Unit :: Sanitizer-x86_64-Test/DeadlockDetector.RemoveNodeTest (1520 of 2306)
PASS: SanitizerCommon-Unit :: Sanitizer-x86_64-Test/BVGraph.RemoveEdges (1521 of 2306)
PASS: SanitizerCommon-Unit :: Sanitizer-x86_64-Test/MemoryMapping.LoadedModuleArchAndUUID (1522 of 2306)
PASS: SanitizerCommon-Unit :: Sanitizer-x86_64-Test/MemoryMappingLayout.DumpListOfModules (1523 of 2306)
PASS: SanitizerCommon-Unit :: Sanitizer-x86_64-Test/Printf.Basic (1524 of 2306)
PASS: SanitizerCommon-Unit :: Sanitizer-x86_64-Test/Printf.MinMax (1525 of 2306)
PASS: SanitizerCommon-Unit :: Sanitizer-x86_64-Test/Printf.OverflowInt (1526 of 2306)
PASS: SanitizerCommon-Unit :: Sanitizer-x86_64-Test/Printf.OverflowPtr (1527 of 2306)
PASS: SanitizerCommon-Unit :: Sanitizer-x86_64-Test/Printf.OverflowStr (1528 of 2306)
PASS: SanitizerCommon-Unit :: Sanitizer-x86_64-Test/Printf.OverflowUint (1529 of 2306)
PASS: SanitizerCommon-Unit :: Sanitizer-x86_64-Test/Printf.Padding (1530 of 2306)
PASS: SanitizerCommon-Unit :: Sanitizer-x86_64-Test/Printf.Precision (1531 of 2306)
PASS: SanitizerCommon-Unit :: Sanitizer-x86_64-Test/SanitizerCommon.AllocatorLeakTest (1532 of 2306)
PASS: SanitizerCommon-Unit :: Sanitizer-x86_64-Test/SanitizerCommon.AtomicCompareExchangeTest (1533 of 2306)
PASS: SanitizerCommon-Unit :: Sanitizer-x86_64-Test/SanitizerCommon.AtomicStoreLoad (1534 of 2306)
PASS: SanitizerCommon-Unit :: Sanitizer-x86_64-Test/SanitizerCommon.BasicBitVector (1535 of 2306)
PASS: SanitizerCommon-Unit :: Sanitizer-x86_64-Test/SanitizerCommon.BooleanFlags (1536 of 2306)
PASS: SanitizerCommon-Unit :: Sanitizer-x86_64-Test/SanitizerCommon.BlockingMutex (1537 of 2306)
PASS: SanitizerCommon-Unit :: Sanitizer-i386-Test/SanitizerCommon.LargeMmapAllocator (1538 of 2306)
PASS: SanitizerCommon-Unit :: Sanitizer-x86_64-Test/SanitizerCommon.CombinedAllocator64 (1539 of 2306)
PASS: SanitizerCommon-Unit :: Sanitizer-x86_64-Test/SanitizerCommon.CombinedAllocator64Compact (1540 of 2306)
PASS: SanitizerCommon-Unit :: Sanitizer-x86_64-Test/SanitizerCommon.CommonFlags (1541 of 2306)
PASS: SanitizerCommon-Unit :: Sanitizer-x86_64-Test/SanitizerCommon.CombinedAllocator64Dynamic (1542 of 2306)
PASS: SanitizerCommon-Unit :: Sanitizer-x86_64-Test/SanitizerCommon.CommonSuffixFlags (1543 of 2306)
PASS: SanitizerCommon-Unit :: Sanitizer-x86_64-Test/SanitizerCommon.CompactSizeClassMap (1544 of 2306)
PASS: SanitizerCommon-Unit :: Sanitizer-x86_64-Test/SanitizerCommon.DefaultSizeClassMap (1545 of 2306)
PASS: SanitizerCommon-Unit :: Sanitizer-x86_64-Test/SanitizerCommon.FileOps (1546 of 2306)
PASS: SanitizerCommon-Unit :: Sanitizer-x86_64-Test/SanitizerCommon.InternalLowerBound (1547 of 2306)
PASS: SanitizerCommon-Unit :: Sanitizer-x86_64-Test/SanitizerCommon.IntFlags (1548 of 2306)
PASS: Profile-i386 :: instrprof-value-prof.test (1549 of 2306)
PASS: SanitizerCommon-Unit :: Sanitizer-x86_64-Test/SanitizerCommon.InternalMemmoveRegression (1550 of 2306)
PASS: SanitizerCommon-Unit :: Sanitizer-x86_64-Test/SanitizerCommon.InternalMmapVector (1551 of 2306)
PASS: SanitizerCommon-Unit :: Sanitizer-x86_64-Test/SanitizerCommon.InternalScopedString (1552 of 2306)
PASS: SanitizerCommon-Unit :: Sanitizer-x86_64-Test/SanitizerCommon.InternalStrFunctions (1553 of 2306)
PASS: SanitizerCommon-Unit :: Sanitizer-x86_64-Test/SanitizerCommon.InternalSizeClassMap (1554 of 2306)
PASS: SanitizerCommon-Unit :: Sanitizer-x86_64-Test/SanitizerCommon.IntrusiveList (1555 of 2306)
PASS: SanitizerCommon-Unit :: Sanitizer-x86_64-Test/SanitizerCommon.IntrusiveListAppendEmpty (1556 of 2306)
PASS: SanitizerCommon-Unit :: Sanitizer-x86_64-Test/SanitizerCommon.IsAccessibleMemoryRange (1557 of 2306)
PASS: SanitizerCommon-Unit :: Sanitizer-x86_64-Test/SanitizerCommon.InternalLowerBoundVsStdLowerBound (1558 of 2306)
PASS: SanitizerCommon-Unit :: Sanitizer-x86_64-Test/SanitizerCommon.CombinedAllocator64VeryCompact (1559 of 2306)
PASS: SanitizerCommon-Unit :: Sanitizer-x86_64-Test/SanitizerCommon.LargeMmapAllocatorMapUnmapCallback (1560 of 2306)
PASS: SanitizerCommon-Unit :: Sanitizer-x86_64-Test/SanitizerCommon.LargeMmapAllocatorIteration (1561 of 2306)
PASS: SanitizerCommon-Unit :: Sanitizer-x86_64-Test/SanitizerCommon.CombinedAllocator32Compact (1562 of 2306)
PASS: Profile-x86_64 :: instrprof-value-prof.test (1563 of 2306)
PASS: SanitizerCommon-Unit :: Sanitizer-x86_64-Test/SanitizerCommon.PthreadDestructorIterations (1564 of 2306)
PASS: SanitizerCommon-Unit :: Sanitizer-x86_64-Test/SanitizerCommon.MultipleFlags (1565 of 2306)
PASS: SanitizerCommon-Unit :: Sanitizer-x86_64-Test/SanitizerCommon.RemoveANSIEscapeSequencesFromString (1566 of 2306)
PASS: SanitizerCommon-Unit :: Sanitizer-x86_64-Test/SanitizerCommon.MmapAlignedOrDie (1567 of 2306)
PASS: SanitizerCommon-Unit :: Sanitizer-x86_64-Test/SanitizerCommon.SizeClassAllocator32CompactGetBlockBegin (1568 of 2306)
PASS: SanitizerCommon-Unit :: Sanitizer-x86_64-Test/SanitizerCommon.LargeMmapAllocatorBlockBegin (1569 of 2306)
PASS: SanitizerCommon-Unit :: Sanitizer-x86_64-Test/SanitizerCommon.SizeClassAllocator32MapUnmapCallback (1570 of 2306)
PASS: SanitizerCommon-Unit :: Sanitizer-x86_64-Test/SanitizerCommon.SizeClassAllocator32Iteration (1571 of 2306)
PASS: SanitizerCommon-Unit :: Sanitizer-x86_64-Test/SanitizerCommon.SizeClassAllocator32Compact (1572 of 2306)
PASS: SanitizerCommon-Unit :: Sanitizer-x86_64-Test/SanitizerCommon.SizeClassAllocator32CompactMetadataStress (1573 of 2306)
PASS: SanitizerCommon-Unit :: Sanitizer-x86_64-Test/SanitizerCommon.SizeClassAllocator64CompactLocalCache (1574 of 2306)
PASS: SanitizerCommon-Unit :: Sanitizer-x86_64-Test/SanitizerCommon.SizeClassAllocator64CompactGetBlockBegin (1575 of 2306)
PASS: SanitizerCommon-Unit :: Sanitizer-x86_64-Test/SanitizerCommon.SizeClassAllocator64 (1576 of 2306)
PASS: SanitizerCommon-Unit :: Sanitizer-x86_64-Test/SanitizerCommon.SizeClassAllocator64DynamicGetBlockBegin (1577 of 2306)
PASS: SanitizerCommon-Unit :: Sanitizer-x86_64-Test/SanitizerCommon.SizeClassAllocator64DynamicIteration (1578 of 2306)
PASS: SanitizerCommon-Unit :: Sanitizer-x86_64-Test/SanitizerCommon.SizeClassAllocator64DynamicLocalCache (1579 of 2306)
PASS: SanitizerCommon-Unit :: Sanitizer-x86_64-Test/SanitizerCommon.SizeClassAllocator64Compact (1580 of 2306)
PASS: SanitizerCommon-Unit :: Sanitizer-x86_64-Test/SanitizerCommon.SizeClassAllocator64CompactMetadataStress (1581 of 2306)
PASS: SanitizerCommon-Unit :: Sanitizer-x86_64-Test/SanitizerCommon.LargeMmapAllocator (1582 of 2306)
PASS: SanitizerCommon-Unit :: Sanitizer-x86_64-Test/SanitizerCommon.SizeClassAllocator64Iteration (1583 of 2306)
PASS: SanitizerCommon-Unit :: Sanitizer-x86_64-Test/SanitizerCommon.SizeClassAllocator64MapUnmapCallback (1584 of 2306)
PASS: SanitizerCommon-Unit :: Sanitizer-x86_64-Test/SanitizerCommon.SizeClassAllocator64GetBlockBegin (1585 of 2306)
PASS: SanitizerCommon-Unit :: Sanitizer-x86_64-Test/SanitizerCommon.SizeClassAllocator64Overflow (1586 of 2306)
PASS: SanitizerCommon-Unit :: Sanitizer-x86_64-Test/SanitizerCommon.SizeClassAllocator64LocalCache (1587 of 2306)
PASS: SanitizerCommon-Unit :: Sanitizer-x86_64-Test/SanitizerCommon.SizeClassAllocator64PopulateFreeListOOM (1588 of 2306)
PASS: SanitizerCommon-Unit :: Sanitizer-x86_64-Test/SanitizerCommon.SizeClassAllocator64Dynamic (1589 of 2306)
PASS: SanitizerCommon-Unit :: Sanitizer-x86_64-Test/SanitizerCommon.SizeClassAllocator64VeryCompactLocalCache (1590 of 2306)
PASS: SanitizerCommon-Unit :: Sanitizer-x86_64-Test/SanitizerCommon.SizeClassAllocator64VeryCompactGetBlockBegin (1591 of 2306)
PASS: SanitizerCommon-Unit :: Sanitizer-x86_64-Test/SanitizerCommon.SortTest (1592 of 2306)
PASS: SanitizerCommon-Unit :: Sanitizer-x86_64-Test/SanitizerCommon.SpinMutexTry (1593 of 2306)
PASS: SanitizerCommon-Unit :: Sanitizer-x86_64-Test/SanitizerCommon.StackDepotAbsent (1594 of 2306)
PASS: SanitizerCommon-Unit :: Sanitizer-x86_64-Test/SanitizerCommon.StackDepotBasic (1595 of 2306)
PASS: SanitizerCommon-Unit :: Sanitizer-x86_64-Test/SanitizerCommon.SpinMutex (1596 of 2306)
PASS: SanitizerCommon-Unit :: Sanitizer-x86_64-Test/SanitizerCommon.StackDepotEmptyStack (1597 of 2306)
PASS: SanitizerCommon-Unit :: Sanitizer-x86_64-Test/SanitizerCommon.StackDepotSame (1598 of 2306)
PASS: SanitizerCommon-Unit :: Sanitizer-x86_64-Test/SanitizerCommon.StackDepotReverseMap (1599 of 2306)
PASS: SanitizerCommon-Unit :: Sanitizer-x86_64-Test/SanitizerCommon.StackDepotSeveral (1600 of 2306)
PASS: SanitizerCommon-Unit :: Sanitizer-x86_64-Test/SanitizerCommon.StackDepotZeroId (1601 of 2306)
PASS: SanitizerCommon-Unit :: Sanitizer-x86_64-Test/SanitizerCommon.StripPathPrefix (1602 of 2306)
PASS: SanitizerCommon-Unit :: Sanitizer-x86_64-Test/SanitizerCommon.StrFlags (1603 of 2306)
PASS: SanitizerCommon-Unit :: Sanitizer-x86_64-Test/SanitizerCommon.ThreadRegistryTest (1604 of 2306)
PASS: SanitizerCommon-Unit :: Sanitizer-x86_64-Test/SanitizerCommon.ThreadRegistryThreadedTest (1605 of 2306)
PASS: SanitizerCommon-Unit :: Sanitizer-x86_64-Test/SanitizerCommon.ThreadStackTlsMain (1606 of 2306)
PASS: SanitizerCommon-Unit :: Sanitizer-x86_64-Test/SanitizerCommon.ThreadStackTlsWorker (1607 of 2306)
PASS: SanitizerCommon-Unit :: Sanitizer-x86_64-Test/SanitizerCommon.SizeClassAllocator64DynamicMetadataStress (1608 of 2306)
PASS: SanitizerCommon-Unit :: Sanitizer-x86_64-Test/SanitizerCommon.TwoLevelByteMap (1609 of 2306)
PASS: SanitizerCommon-Unit :: Sanitizer-x86_64-Test/SanitizerCommon.VeryCompactSizeClassMap (1610 of 2306)
PASS: SanitizerCommon-Unit :: Sanitizer-x86_64-Test/SanitizerCommon.mem_is_zero (1611 of 2306)
PASS: SanitizerCommon-Unit :: Sanitizer-x86_64-Test/SanitizerCommonInterceptors.Printf (1612 of 2306)
PASS: SanitizerCommon-Unit :: Sanitizer-x86_64-Test/SanitizerCommon.ThreadedTwoLevelByteMap (1613 of 2306)
PASS: SanitizerCommon-Unit :: Sanitizer-x86_64-Test/SanitizerCommonInterceptors.Scanf (1614 of 2306)
PASS: SanitizerCommon-Unit :: Sanitizer-x86_64-Test/SanitizerStacktracePrinter.RenderFrame (1615 of 2306)
PASS: SanitizerCommon-Unit :: Sanitizer-x86_64-Test/SanitizerStacktracePrinter.RenderModuleLocation (1616 of 2306)
PASS: SanitizerCommon-Unit :: Sanitizer-x86_64-Test/SanitizerStacktracePrinter.RenderSourceLocation (1617 of 2306)
PASS: SanitizerCommon-Unit :: Sanitizer-x86_64-Test/SlowUnwindTest.ShortStackTrace (1618 of 2306)
PASS: SanitizerCommon-Unit :: Sanitizer-x86_64-Test/SuppressionContextTest.HasSuppressionType (1619 of 2306)
PASS: SanitizerCommon-Unit :: Sanitizer-x86_64-Test/SuppressionContextTest.Parse (1620 of 2306)
PASS: SanitizerCommon-Unit :: Sanitizer-x86_64-Test/SuppressionContextTest.Parse2 (1621 of 2306)
PASS: SanitizerCommon-Unit :: Sanitizer-x86_64-Test/SuppressionContextTest.Parse3 (1622 of 2306)
PASS: SanitizerCommon-Unit :: Sanitizer-x86_64-Test/SuppressionContextTest.ParseType (1623 of 2306)
PASS: SanitizerCommon-Unit :: Sanitizer-x86_64-Test/Suppressions.Match (1624 of 2306)
PASS: SanitizerCommon-Unit :: Sanitizer-x86_64-Test/Symbolizer.DemangleSwiftAndCXX (1625 of 2306)
PASS: SanitizerCommon-Unit :: Sanitizer-x86_64-Test/Symbolizer.ExtractInt (1626 of 2306)
PASS: SanitizerCommon-Unit :: Sanitizer-x86_64-Test/Symbolizer.ExtractToken (1627 of 2306)
PASS: SanitizerCommon-Unit :: Sanitizer-x86_64-Test/Symbolizer.ExtractTokenUpToDelimiter (1628 of 2306)
PASS: SanitizerCommon-Unit :: Sanitizer-x86_64-Test/Symbolizer.ExtractUptr (1629 of 2306)
UNSUPPORTED: SanitizerCommon-asan-i386-Darwin :: Linux/abort_on_error.cc (1630 of 2306)
UNSUPPORTED: SanitizerCommon-asan-i386-Darwin :: Linux/aligned_alloc.c (1631 of 2306)
UNSUPPORTED: SanitizerCommon-asan-i386-Darwin :: Linux/assert.cc (1632 of 2306)
UNSUPPORTED: SanitizerCommon-asan-i386-Darwin :: Linux/clock_gettime.c (1633 of 2306)
UNSUPPORTED: SanitizerCommon-asan-i386-Darwin :: Linux/closedir.c (1634 of 2306)
UNSUPPORTED: SanitizerCommon-asan-i386-Darwin :: Linux/decorate_proc_maps.cc (1635 of 2306)
UNSUPPORTED: SanitizerCommon-asan-i386-Darwin :: Linux/fpe.cc (1636 of 2306)
UNSUPPORTED: SanitizerCommon-asan-i386-Darwin :: Linux/getpwnam_r_invalid_user.cc (1637 of 2306)
UNSUPPORTED: SanitizerCommon-asan-i386-Darwin :: Linux/hard_rss_limit_mb_test.cc (1638 of 2306)
UNSUPPORTED: SanitizerCommon-asan-i386-Darwin :: Linux/ill.cc (1639 of 2306)
UNSUPPORTED: SanitizerCommon-asan-i386-Darwin :: Linux/mlock_test.cc (1640 of 2306)
UNSUPPORTED: SanitizerCommon-asan-i386-Darwin :: Linux/open_memstream.cc (1641 of 2306)
UNSUPPORTED: SanitizerCommon-asan-i386-Darwin :: Linux/ptrace.cc (1642 of 2306)
UNSUPPORTED: SanitizerCommon-asan-i386-Darwin :: Linux/recv_msg_trunc.cc (1643 of 2306)
UNSUPPORTED: SanitizerCommon-asan-i386-Darwin :: Linux/sched_getparam.cc (1644 of 2306)
UNSUPPORTED: SanitizerCommon-asan-i386-Darwin :: Linux/sem_init_glibc.cc (1645 of 2306)
UNSUPPORTED: SanitizerCommon-asan-i386-Darwin :: Linux/signal_segv_handler.cc (1646 of 2306)
UNSUPPORTED: SanitizerCommon-asan-i386-Darwin :: Linux/soft_rss_limit_mb_test.cc (1647 of 2306)
UNSUPPORTED: SanitizerCommon-asan-i386-Darwin :: Linux/timerfd.cc (1648 of 2306)
UNSUPPORTED: SanitizerCommon-asan-i386-Darwin :: Linux/weak_hook_test.cc (1649 of 2306)
PASS: SanitizerCommon-Unit :: Sanitizer-x86_64-Test/SanitizerCommon.SizeClassAllocator64MetadataStress (1650 of 2306)
PASS: SanitizerCommon-asan-i386-Darwin :: Darwin/abort_on_error.cc (1651 of 2306)
PASS: SanitizerCommon-asan-i386-Darwin :: Posix/getpass.cc (1652 of 2306)
PASS: SanitizerCommon-Unit :: Sanitizer-x86_64-Test/SanitizerCommon.SizeClassAllocator64VeryCompact (1653 of 2306)
PASS: SanitizerCommon-asan-i386-Darwin :: Posix/dedup_token_length_test.cc (1654 of 2306)
PASS: SanitizerCommon-asan-i386-Darwin :: Posix/sanitizer_set_death_callback_test.cc (1655 of 2306)
UNSUPPORTED: SanitizerCommon-asan-i386-Darwin :: get_module_and_offset_for_pc.cc (1656 of 2306)
PASS: SanitizerCommon-asan-i386-Darwin :: corelimit.cc (1657 of 2306)
PASS: SanitizerCommon-asan-i386-Darwin :: fopen_nullptr.c (1658 of 2306)
PASS: SanitizerCommon-asan-i386-Darwin :: Posix/sanitizer_set_report_fd_test.cc (1659 of 2306)
PASS: SanitizerCommon-asan-i386-Darwin :: malloc_hook.cc (1660 of 2306)
PASS: SanitizerCommon-asan-i386-Darwin :: options-help.cc (1661 of 2306)
PASS: SanitizerCommon-Unit :: Sanitizer-x86_64-Test/SanitizerCommon.SizeClassAllocator32CompactLocalCache (1662 of 2306)
PASS: SanitizerCommon-asan-i386-Darwin :: options-invalid.cc (1663 of 2306)
UNSUPPORTED: SanitizerCommon-asan-i386-Darwin :: sanitizer_coverage_symbolize.cc (1664 of 2306)
PASS: SanitizerCommon-asan-i386-Darwin :: printf-ldbl.c (1665 of 2306)
PASS: SanitizerCommon-Unit :: Sanitizer-x86_64-Test/SanitizerCommon.TwoLevelBitVector (1666 of 2306)
PASS: SanitizerCommon-asan-i386-Darwin :: pthread_mutexattr_get.cc (1667 of 2306)
PASS: SanitizerCommon-asan-i386-Darwin :: options-include.cc (1668 of 2306)
XFAIL: SanitizerCommon-asan-i386-Darwin :: sanitizer_coverage_trace_pc_guard-dso.cc (1669 of 2306)
XFAIL: SanitizerCommon-asan-i386-Darwin :: sanitizer_coverage_trace_pc_guard.cc (1670 of 2306)
PASS: SanitizerCommon-asan-i386-Darwin :: scanf-ldbl.c (1671 of 2306)
PASS: SanitizerCommon-asan-i386-Darwin :: print-stack-trace.cc (1672 of 2306)
PASS: SanitizerCommon-asan-i386-Darwin :: strcasestr.c (1673 of 2306)
UNSUPPORTED: SanitizerCommon-asan-i386-Darwin :: symbolize_pc.cc (1674 of 2306)
PASS: SanitizerCommon-asan-i386-Darwin :: strcspn.c (1675 of 2306)
UNSUPPORTED: SanitizerCommon-asan-x86_64-Darwin :: Linux/abort_on_error.cc (1676 of 2306)
UNSUPPORTED: SanitizerCommon-asan-x86_64-Darwin :: Linux/aligned_alloc.c (1677 of 2306)
UNSUPPORTED: SanitizerCommon-asan-x86_64-Darwin :: Linux/assert.cc (1678 of 2306)
UNSUPPORTED: SanitizerCommon-asan-x86_64-Darwin :: Linux/clock_gettime.c (1679 of 2306)
UNSUPPORTED: SanitizerCommon-asan-x86_64-Darwin :: Linux/closedir.c (1680 of 2306)
UNSUPPORTED: SanitizerCommon-asan-x86_64-Darwin :: Linux/decorate_proc_maps.cc (1681 of 2306)
UNSUPPORTED: SanitizerCommon-asan-x86_64-Darwin :: Linux/fpe.cc (1682 of 2306)
UNSUPPORTED: SanitizerCommon-asan-x86_64-Darwin :: Linux/getpwnam_r_invalid_user.cc (1683 of 2306)
UNSUPPORTED: SanitizerCommon-asan-x86_64-Darwin :: Linux/hard_rss_limit_mb_test.cc (1684 of 2306)
UNSUPPORTED: SanitizerCommon-asan-x86_64-Darwin :: Linux/ill.cc (1685 of 2306)
UNSUPPORTED: SanitizerCommon-asan-x86_64-Darwin :: Linux/mlock_test.cc (1686 of 2306)
UNSUPPORTED: SanitizerCommon-asan-x86_64-Darwin :: Linux/open_memstream.cc (1687 of 2306)
UNSUPPORTED: SanitizerCommon-asan-x86_64-Darwin :: Linux/ptrace.cc (1688 of 2306)
UNSUPPORTED: SanitizerCommon-asan-x86_64-Darwin :: Linux/recv_msg_trunc.cc (1689 of 2306)
UNSUPPORTED: SanitizerCommon-asan-x86_64-Darwin :: Linux/sched_getparam.cc (1690 of 2306)
UNSUPPORTED: SanitizerCommon-asan-x86_64-Darwin :: Linux/sem_init_glibc.cc (1691 of 2306)
UNSUPPORTED: SanitizerCommon-asan-x86_64-Darwin :: Linux/signal_segv_handler.cc (1692 of 2306)
UNSUPPORTED: SanitizerCommon-asan-x86_64-Darwin :: Linux/soft_rss_limit_mb_test.cc (1693 of 2306)
UNSUPPORTED: SanitizerCommon-asan-x86_64-Darwin :: Linux/timerfd.cc (1694 of 2306)
UNSUPPORTED: SanitizerCommon-asan-x86_64-Darwin :: Linux/weak_hook_test.cc (1695 of 2306)
PASS: SanitizerCommon-asan-i386-Darwin :: strnlen.c (1696 of 2306)
PASS: SanitizerCommon-asan-i386-Darwin :: strpbrk.c (1697 of 2306)
PASS: SanitizerCommon-asan-i386-Darwin :: strspn.c (1698 of 2306)
PASS: SanitizerCommon-asan-i386-Darwin :: strstr.c (1699 of 2306)
PASS: SanitizerCommon-asan-x86_64-Darwin :: corelimit.cc (1700 of 2306)
PASS: SanitizerCommon-asan-x86_64-Darwin :: Posix/getpass.cc (1701 of 2306)
PASS: SanitizerCommon-asan-x86_64-Darwin :: Posix/sanitizer_set_death_callback_test.cc (1702 of 2306)
PASS: SanitizerCommon-asan-x86_64-Darwin :: Darwin/abort_on_error.cc (1703 of 2306)
PASS: SanitizerCommon-asan-x86_64-Darwin :: fopen_nullptr.c (1704 of 2306)
PASS: SanitizerCommon-asan-x86_64-Darwin :: options-help.cc (1705 of 2306)
PASS: SanitizerCommon-asan-x86_64-Darwin :: malloc_hook.cc (1706 of 2306)
PASS: SanitizerCommon-asan-x86_64-Darwin :: Posix/sanitizer_set_report_fd_test.cc (1707 of 2306)
PASS: SanitizerCommon-asan-x86_64-Darwin :: options-invalid.cc (1708 of 2306)
PASS: SanitizerCommon-asan-x86_64-Darwin :: printf-ldbl.c (1709 of 2306)
UNSUPPORTED: SanitizerCommon-asan-x86_64-Darwin :: sanitizer_coverage_symbolize.cc (1710 of 2306)
PASS: SanitizerCommon-asan-x86_64-Darwin :: Posix/dedup_token_length_test.cc (1711 of 2306)
XFAIL: SanitizerCommon-asan-x86_64-Darwin :: sanitizer_coverage_trace_pc_guard-dso.cc (1712 of 2306)
PASS: SanitizerCommon-asan-x86_64-Darwin :: pthread_mutexattr_get.cc (1713 of 2306)
XFAIL: SanitizerCommon-asan-x86_64-Darwin :: sanitizer_coverage_trace_pc_guard.cc (1714 of 2306)
PASS: SanitizerCommon-asan-x86_64-Darwin :: options-include.cc (1715 of 2306)
PASS: SanitizerCommon-asan-x86_64-Darwin :: scanf-ldbl.c (1716 of 2306)
PASS: SanitizerCommon-asan-x86_64-Darwin :: strcasestr.c (1717 of 2306)
PASS: SanitizerCommon-asan-x86_64-Darwin :: get_module_and_offset_for_pc.cc (1718 of 2306)
PASS: SanitizerCommon-asan-x86_64-Darwin :: strcspn.c (1719 of 2306)
PASS: SanitizerCommon-asan-x86_64-Darwin :: strnlen.c (1720 of 2306)
PASS: SanitizerCommon-asan-x86_64-Darwin :: strpbrk.c (1721 of 2306)
PASS: SanitizerCommon-asan-x86_64-Darwin :: strspn.c (1722 of 2306)
PASS: SanitizerCommon-asan-x86_64-Darwin :: strstr.c (1723 of 2306)
PASS: SanitizerCommon-asan-x86_64-Darwin :: print-stack-trace.cc (1724 of 2306)
PASS: SanitizerCommon-asan-x86_64-Darwin :: symbolize_pc.cc (1725 of 2306)
PASS: ThreadSanitizer-Unit :: rtl/TsanRtlTest-x86_64-Test/Posix.CondBasic (1726 of 2306)
PASS: ThreadSanitizer-Unit :: rtl/TsanRtlTest-x86_64-Test/Posix.ThreadLocalAccesses (1727 of 2306)
PASS: ThreadSanitizer-Unit :: rtl/TsanRtlTest-x86_64-Test/Posix.ThreadSpecificDtors (1728 of 2306)
PASS: ThreadSanitizer-Unit :: rtl/TsanRtlTest-x86_64-Test/ThreadSanitizer.BasicMutex (1729 of 2306)
PASS: ThreadSanitizer-Unit :: rtl/TsanRtlTest-x86_64-Test/ThreadSanitizer.BasicRwMutex (1730 of 2306)
PASS: Profile-x86_64 :: instrprof-value-prof-shared.test (1731 of 2306)
PASS: ThreadSanitizer-Unit :: rtl/TsanRtlTest-x86_64-Test/ThreadSanitizer.BasicSpinMutex (1732 of 2306)
PASS: ThreadSanitizer-Unit :: rtl/TsanRtlTest-x86_64-Test/ThreadSanitizer.BenignRaceOnVptr (1733 of 2306)
PASS: ThreadSanitizer-Unit :: rtl/TsanRtlTest-x86_64-Test/ThreadSanitizer.FuncCall (1734 of 2306)
PASS: ThreadSanitizer-Unit :: rtl/TsanRtlTest-x86_64-Test/ThreadSanitizer.HarmfulRaceOnVptr (1735 of 2306)
PASS: ThreadSanitizer-Unit :: rtl/TsanRtlTest-x86_64-Test/ThreadSanitizer.LockedWriteThenRead (1736 of 2306)
PASS: ThreadSanitizer-Unit :: rtl/TsanRtlTest-x86_64-Test/ThreadSanitizer.MemcpyRace1 (1737 of 2306)
PASS: ThreadSanitizer-Unit :: rtl/TsanRtlTest-x86_64-Test/ThreadSanitizer.Memcpy (1738 of 2306)
PASS: ThreadSanitizer-Unit :: rtl/TsanRtlTest-x86_64-Test/ThreadSanitizer.MemcpyRace2 (1739 of 2306)
PASS: ThreadSanitizer-Unit :: rtl/TsanRtlTest-x86_64-Test/ThreadSanitizer.MemcpyRace3 (1740 of 2306)
PASS: ThreadSanitizer-Unit :: rtl/TsanRtlTest-x86_64-Test/ThreadSanitizer.MemcpyStack (1741 of 2306)
PASS: ThreadSanitizer-Unit :: rtl/TsanRtlTest-x86_64-Test/ThreadSanitizer.Mutex (1742 of 2306)
PASS: ThreadSanitizer-Unit :: rtl/TsanRtlTest-x86_64-Test/ThreadSanitizer.MemsetRace1 (1743 of 2306)
PASS: ThreadSanitizer-Unit :: rtl/TsanRtlTest-x86_64-Test/ThreadSanitizer.NoRaceWithOffset (1744 of 2306)
PASS: Profile-i386 :: instrprof-value-prof-shared.test (1745 of 2306)
PASS: ThreadSanitizer-Unit :: rtl/TsanRtlTest-x86_64-Test/ThreadSanitizer.RaceWithOffset (1746 of 2306)
PASS: ThreadSanitizer-Unit :: rtl/TsanRtlTest-x86_64-Test/ThreadSanitizer.RaceWithDeadThread (1747 of 2306)
PASS: ThreadSanitizer-Unit :: rtl/TsanRtlTest-x86_64-Test/ThreadSanitizer.RaceWithOffset2 (1748 of 2306)
PASS: ThreadSanitizer-Unit :: rtl/TsanRtlTest-x86_64-Test/ThreadSanitizer.ReadReadNoRace (1749 of 2306)
PASS: ThreadSanitizer-Unit :: rtl/TsanRtlTest-x86_64-Test/ThreadSanitizer.ReadWriteRace (1750 of 2306)
PASS: ThreadSanitizer-Unit :: rtl/TsanRtlTest-x86_64-Test/ThreadSanitizer.ReportDeadThread (1751 of 2306)
PASS: ThreadSanitizer-Unit :: rtl/TsanRtlTest-x86_64-Test/ThreadSanitizer.SimpleWrite (1752 of 2306)
PASS: ThreadSanitizer-Unit :: rtl/TsanRtlTest-x86_64-Test/ThreadSanitizer.ReportRace (1753 of 2306)
PASS: ThreadSanitizer-Unit :: rtl/TsanRtlTest-x86_64-Test/ThreadSanitizer.SimpleWriteWrite (1754 of 2306)
PASS: ThreadSanitizer-Unit :: rtl/TsanRtlTest-x86_64-Test/ThreadSanitizer.RwMutex (1755 of 2306)
PASS: ThreadSanitizer-Unit :: rtl/TsanRtlTest-x86_64-Test/ThreadSanitizer.SpinMutex (1756 of 2306)
PASS: ThreadSanitizer-Unit :: rtl/TsanRtlTest-x86_64-Test/ThreadSanitizer.StaticMutex (1757 of 2306)
PASS: ThreadSanitizer-Unit :: rtl/TsanRtlTest-x86_64-Test/ThreadSanitizer.ThreadDetach1 (1758 of 2306)
PASS: ThreadSanitizer-Unit :: rtl/TsanRtlTest-x86_64-Test/ThreadSanitizer.WriteReadRace (1759 of 2306)
PASS: ThreadSanitizer-Unit :: rtl/TsanRtlTest-x86_64-Test/ThreadSanitizer.ThreadDetach2 (1760 of 2306)
PASS: ThreadSanitizer-Unit :: rtl/TsanRtlTest-x86_64-Test/ThreadSanitizer.ThreadSync (1761 of 2306)
PASS: ThreadSanitizer-Unit :: rtl/TsanRtlTest-x86_64-Test/ThreadSanitizer.WriteThenLockedRead (1762 of 2306)
PASS: ThreadSanitizer-Unit :: rtl/TsanRtlTest-x86_64-Test/ThreadSanitizer.WriteThenRead (1763 of 2306)
PASS: ThreadSanitizer-Unit :: unit/TsanUnitTest-x86_64-Test/Clock.AcquireRelease (1764 of 2306)
PASS: ThreadSanitizer-Unit :: rtl/TsanRtlTest-x86_64-Test/ThreadSanitizer.WriteWriteRace (1765 of 2306)
PASS: ThreadSanitizer-Unit :: unit/TsanUnitTest-x86_64-Test/Clock.ChunkedBasic (1766 of 2306)
PASS: ThreadSanitizer-Unit :: unit/TsanUnitTest-x86_64-Test/Clock.DifferentSizes (1767 of 2306)
PASS: ThreadSanitizer-Unit :: unit/TsanUnitTest-x86_64-Test/Clock.Growth (1768 of 2306)
PASS: ThreadSanitizer-Unit :: unit/TsanUnitTest-x86_64-Test/Clock.Fuzzer (1769 of 2306)
PASS: ThreadSanitizer-Unit :: unit/TsanUnitTest-x86_64-Test/Clock.ManyThreads (1770 of 2306)
PASS: ThreadSanitizer-Unit :: unit/TsanUnitTest-x86_64-Test/Clock.VectorBasic (1771 of 2306)
PASS: ThreadSanitizer-Unit :: unit/TsanUnitTest-x86_64-Test/Clock.RepeatedAcquire (1772 of 2306)
PASS: ThreadSanitizer-Unit :: unit/TsanUnitTest-x86_64-Test/Flags.Basic (1773 of 2306)
PASS: ThreadSanitizer-Unit :: unit/TsanUnitTest-x86_64-Test/Flags.DefaultValues (1774 of 2306)
PASS: ThreadSanitizer-Unit :: unit/TsanUnitTest-x86_64-Test/Flags.ParseEnvOptions (1775 of 2306)
PASS: ThreadSanitizer-Unit :: unit/TsanUnitTest-x86_64-Test/Flags.ParseDefaultOptions (1776 of 2306)
PASS: ThreadSanitizer-Unit :: unit/TsanUnitTest-x86_64-Test/Flags.ParsePriority (1777 of 2306)
PASS: ThreadSanitizer-Unit :: unit/TsanUnitTest-x86_64-Test/MetaMap.MoveMemory (1778 of 2306)
PASS: ThreadSanitizer-Unit :: unit/TsanUnitTest-x86_64-Test/MetaMap.Basic (1779 of 2306)
PASS: ThreadSanitizer-Unit :: unit/TsanUnitTest-x86_64-Test/MetaMap.FreeRange (1780 of 2306)
PASS: ThreadSanitizer-Unit :: unit/TsanUnitTest-x86_64-Test/MetaMap.ResetSync (1781 of 2306)
PASS: ThreadSanitizer-Unit :: unit/TsanUnitTest-x86_64-Test/MetaMap.Sync (1782 of 2306)
PASS: ThreadSanitizer-Unit :: unit/TsanUnitTest-x86_64-Test/Mman.Internal (1783 of 2306)
PASS: ThreadSanitizer-Unit :: unit/TsanUnitTest-x86_64-Test/Mman.Stats (1784 of 2306)
PASS: ThreadSanitizer-Unit :: unit/TsanUnitTest-x86_64-Test/Mman.User (1785 of 2306)
PASS: ThreadSanitizer-Unit :: unit/TsanUnitTest-x86_64-Test/Mman.UsableSize (1786 of 2306)
PASS: ThreadSanitizer-Unit :: unit/TsanUnitTest-x86_64-Test/Mman.UserRealloc (1787 of 2306)
PASS: ThreadSanitizer-Unit :: unit/TsanUnitTest-x86_64-Test/Mutex.ReadWrite (1788 of 2306)
PASS: ThreadSanitizer-Unit :: unit/TsanUnitTest-x86_64-Test/Mutex.SpinWrite (1789 of 2306)
PASS: ThreadSanitizer-Unit :: unit/TsanUnitTest-x86_64-Test/Mutex.Write (1790 of 2306)
PASS: ThreadSanitizer-Unit :: unit/TsanUnitTest-x86_64-Test/Shadow.Celling (1791 of 2306)
PASS: ThreadSanitizer-Unit :: unit/TsanUnitTest-x86_64-Test/Shadow.FastState (1792 of 2306)
PASS: ThreadSanitizer-Unit :: unit/TsanUnitTest-x86_64-Test/Shadow.Mapping (1793 of 2306)
PASS: ThreadSanitizer-Unit :: unit/TsanUnitTest-x86_64-Test/StackTrace.BasicBuffered (1794 of 2306)
PASS: ThreadSanitizer-Unit :: unit/TsanUnitTest-x86_64-Test/StackTrace.BasicVarSize (1795 of 2306)
PASS: ThreadSanitizer-Unit :: unit/TsanUnitTest-x86_64-Test/StackTrace.TrimBuffered (1796 of 2306)
PASS: ThreadSanitizer-Unit :: unit/TsanUnitTest-x86_64-Test/StackTrace.TrimVarSize (1797 of 2306)
PASS: ThreadSanitizer-Unit :: unit/TsanUnitTest-x86_64-Test/Vector.Basic (1798 of 2306)
PASS: ThreadSanitizer-Unit :: unit/TsanUnitTest-x86_64-Test/Vector.Stride (1799 of 2306)
PASS: ThreadSanitizer-Unit :: unit/TsanUnitTest-x86_64-Test/Mman.CallocOverflow (1800 of 2306)
PASS: ThreadSanitizer-x86_64 :: Darwin/dlopen.cc (1801 of 2306)
PASS: ThreadSanitizer-x86_64 :: Darwin/dispatch_main.mm (1802 of 2306)
PASS: ThreadSanitizer-x86_64 :: Darwin/dispatch_once_deadlock.mm (1803 of 2306)
PASS: ThreadSanitizer-x86_64 :: Darwin/gcd-apply.mm (1804 of 2306)
FAIL: ThreadSanitizer-x86_64 :: Darwin/gcd-after.mm (1805 of 2306)
******************** TEST 'ThreadSanitizer-x86_64 :: Darwin/gcd-after.mm' FAILED ********************
Script:
--
/Users/buildslave/jenkins/workspace/clang-stage1-configure-RA-release-4/clang-build/./bin/clang -fsanitize=thread -Wall -arch x86_64 -stdlib=libc++ -mmacosx-version-min=10.9 -isysroot /Applications/Xcode.app/Contents/Developer/Platforms/MacOSX.platform/Developer/SDKs/MacOSX10.13.sdk -gline-tables-only -I/Users/buildslave/jenkins/workspace/clang-stage1-configure-RA-release-4/llvm/projects/compiler-rt/test/tsan/../ /Users/buildslave/jenkins/workspace/clang-stage1-configure-RA-release-4/llvm/projects/compiler-rt/test/tsan/Darwin/gcd-after.mm -o /Users/buildslave/jenkins/workspace/clang-stage1-configure-RA-release-4/clang-build/tools/clang/runtime/compiler-rt-bins/test/tsan/X86_64Config/Darwin/Output/gcd-after.mm.tmp -framework Foundation
env TSAN_OPTIONS=atexit_sleep_ms=0:abort_on_error=0:ignore_interceptors_accesses=1  /Users/buildslave/jenkins/workspace/clang-stage1-configure-RA-release-4/clang-build/tools/clang/runtime/compiler-rt-bins/test/tsan/X86_64Config/Darwin/Output/gcd-after.mm.tmp 2>&1 | FileCheck /Users/buildslave/jenkins/workspace/clang-stage1-configure-RA-release-4/llvm/projects/compiler-rt/test/tsan/Darwin/gcd-after.mm
--
Exit Code: 66

Hide Details

Hide Details

******************** PASS: ThreadSanitizer-x86_64 :: Darwin/gcd-apply-race.mm (1806 of 2306) FAIL: ThreadSanitizer-x86_64 :: Darwin/gcd-async-norace.mm (1807 of 2306) ******************** TEST 'ThreadSanitizer-x86_64 :: Darwin/gcd-async-norace.mm' FAILED ******************** Script: -- /Users/buildslave/jenkins/workspace/clang-stage1-configure-RA-release-4/clang-build/./bin/clang -fsanitize=thread -Wall -arch x86_64 -stdlib=libc++ -mmacosx-version-min=10.9 -isysroot /Applications/Xcode.app/Contents/Developer/Platforms/MacOSX.platform/Developer/SDKs/MacOSX10.13.sdk -gline-tables-only -I/Users/buildslave/jenkins/workspace/clang-stage1-configure-RA-release-4/llvm/projects/compiler-rt/test/tsan/../ /Users/buildslave/jenkins/workspace/clang-stage1-configure-RA-release-4/llvm/projects/compiler-rt/test/tsan/Darwin/gcd-async-norace.mm -o /Users/buildslave/jenkins/workspace/clang-stage1-configure-RA-release-4/clang-build/tools/clang/runtime/compiler-rt-bins/test/tsan/X86_64Config/Darwin/Output/gcd-async-norace.mm.tmp -framework Foundation env TSAN_OPTIONS=atexit_sleep_ms=0:abort_on_error=0:ignore_interceptors_accesses=1 /Users/buildslave/jenkins/workspace/clang-stage1-configure-RA-release-4/clang-build/tools/clang/runtime/compiler-rt-bins/test/tsan/X86_64Config/Darwin/Output/gcd-async-norace.mm.tmp 2>&1 | FileCheck /Users/buildslave/jenkins/workspace/clang-stage1-configure-RA-release-4/llvm/projects/compiler-rt/test/tsan/Darwin/gcd-async-norace.mm -- Exit Code: 66

Hide Details

Hide Details

******************** PASS: ThreadSanitizer-x86_64 :: Darwin/gcd-barrier-race.mm (1808 of 2306) PASS: ThreadSanitizer-x86_64 :: Darwin/gcd-async-race.mm (1809 of 2306) PASS: ThreadSanitizer-x86_64 :: Darwin/gcd-data.mm (1810 of 2306) FAIL: ThreadSanitizer-x86_64 :: Darwin/gcd-barrier.mm (1811 of 2306) ******************** TEST 'ThreadSanitizer-x86_64 :: Darwin/gcd-barrier.mm' FAILED ******************** Script: -- /Users/buildslave/jenkins/workspace/clang-stage1-configure-RA-release-4/clang-build/./bin/clang -fsanitize=thread -Wall -arch x86_64 -stdlib=libc++ -mmacosx-version-min=10.9 -isysroot /Applications/Xcode.app/Contents/Developer/Platforms/MacOSX.platform/Developer/SDKs/MacOSX10.13.sdk -gline-tables-only -I/Users/buildslave/jenkins/workspace/clang-stage1-configure-RA-release-4/llvm/projects/compiler-rt/test/tsan/../ /Users/buildslave/jenkins/workspace/clang-stage1-configure-RA-release-4/llvm/projects/compiler-rt/test/tsan/Darwin/gcd-barrier.mm -o /Users/buildslave/jenkins/workspace/clang-stage1-configure-RA-release-4/clang-build/tools/clang/runtime/compiler-rt-bins/test/tsan/X86_64Config/Darwin/Output/gcd-barrier.mm.tmp -framework Foundation env TSAN_OPTIONS=atexit_sleep_ms=0:abort_on_error=0:ignore_interceptors_accesses=1 /Users/buildslave/jenkins/workspace/clang-stage1-configure-RA-release-4/clang-build/tools/clang/runtime/compiler-rt-bins/test/tsan/X86_64Config/Darwin/Output/gcd-barrier.mm.tmp 2>&1 | FileCheck /Users/buildslave/jenkins/workspace/clang-stage1-configure-RA-release-4/llvm/projects/compiler-rt/test/tsan/Darwin/gcd-barrier.mm -- Exit Code: 66

Hide Details

Hide Details

******************** PASS: ThreadSanitizer-x86_64 :: Darwin/gcd-fd.mm (1812 of 2306) FAIL: ThreadSanitizer-x86_64 :: Darwin/gcd-blocks.mm (1813 of 2306) ******************** TEST 'ThreadSanitizer-x86_64 :: Darwin/gcd-blocks.mm' FAILED ******************** Script: -- /Users/buildslave/jenkins/workspace/clang-stage1-configure-RA-release-4/clang-build/./bin/clang --driver-mode=g++ -fsanitize=thread -Wall -arch x86_64 -stdlib=libc++ -mmacosx-version-min=10.9 -isysroot /Applications/Xcode.app/Contents/Developer/Platforms/MacOSX.platform/Developer/SDKs/MacOSX10.13.sdk -gline-tables-only -I/Users/buildslave/jenkins/workspace/clang-stage1-configure-RA-release-4/llvm/projects/compiler-rt/test/tsan/../ -std=c++11 -I/Users/buildslave/jenkins/workspace/clang-stage1-configure-RA-release-4/llvm/projects/compiler-rt/test/tsan/../ /Users/buildslave/jenkins/workspace/clang-stage1-configure-RA-release-4/llvm/projects/compiler-rt/test/tsan/Darwin/gcd-blocks.mm -o /Users/buildslave/jenkins/workspace/clang-stage1-configure-RA-release-4/clang-build/tools/clang/runtime/compiler-rt-bins/test/tsan/X86_64Config/Darwin/Output/gcd-blocks.mm.tmp -framework Foundation env TSAN_OPTIONS=atexit_sleep_ms=0:abort_on_error=0:ignore_interceptors_accesses=1 /Users/buildslave/jenkins/workspace/clang-stage1-configure-RA-release-4/clang-build/tools/clang/runtime/compiler-rt-bins/test/tsan/X86_64Config/Darwin/Output/gcd-blocks.mm.tmp 2>&1 | FileCheck /Users/buildslave/jenkins/workspace/clang-stage1-configure-RA-release-4/llvm/projects/compiler-rt/test/tsan/Darwin/gcd-blocks.mm -- Exit Code: 66

Hide Details

Hide Details

******************** UNSUPPORTED: ThreadSanitizer-x86_64 :: Darwin/gcd-io-race.mm (1814 of 2306) PASS: ThreadSanitizer-x86_64 :: Darwin/gcd-groups-destructor.mm (1815 of 2306) PASS: ThreadSanitizer-x86_64 :: Darwin/gcd-groups-leave.mm (1816 of 2306) PASS: ThreadSanitizer-x86_64 :: Darwin/gcd-io-barrier.mm (1817 of 2306) FAIL: ThreadSanitizer-x86_64 :: Darwin/gcd-groups-norace.mm (1818 of 2306) ******************** TEST 'ThreadSanitizer-x86_64 :: Darwin/gcd-groups-norace.mm' FAILED ******************** Script: -- /Users/buildslave/jenkins/workspace/clang-stage1-configure-RA-release-4/clang-build/./bin/clang -fsanitize=thread -Wall -arch x86_64 -stdlib=libc++ -mmacosx-version-min=10.9 -isysroot /Applications/Xcode.app/Contents/Developer/Platforms/MacOSX.platform/Developer/SDKs/MacOSX10.13.sdk -gline-tables-only -I/Users/buildslave/jenkins/workspace/clang-stage1-configure-RA-release-4/llvm/projects/compiler-rt/test/tsan/../ /Users/buildslave/jenkins/workspace/clang-stage1-configure-RA-release-4/llvm/projects/compiler-rt/test/tsan/Darwin/gcd-groups-norace.mm -o /Users/buildslave/jenkins/workspace/clang-stage1-configure-RA-release-4/clang-build/tools/clang/runtime/compiler-rt-bins/test/tsan/X86_64Config/Darwin/Output/gcd-groups-norace.mm.tmp -framework Foundation env TSAN_OPTIONS=atexit_sleep_ms=0:abort_on_error=0:ignore_interceptors_accesses=1 /Users/buildslave/jenkins/workspace/clang-stage1-configure-RA-release-4/clang-build/tools/clang/runtime/compiler-rt-bins/test/tsan/X86_64Config/Darwin/Output/gcd-groups-norace.mm.tmp 2>&1 | FileCheck /Users/buildslave/jenkins/workspace/clang-stage1-configure-RA-release-4/llvm/projects/compiler-rt/test/tsan/Darwin/gcd-groups-norace.mm -- Exit Code: 66

Hide Details

Hide Details

******************** PASS: ThreadSanitizer-x86_64 :: Darwin/gcd-io-cleanup.mm (1819 of 2306) PASS: ThreadSanitizer-x86_64 :: Darwin/gcd-io.mm (1820 of 2306) PASS: ThreadSanitizer-x86_64 :: Darwin/gcd-io-barrier-race.mm (1821 of 2306) PASS: ThreadSanitizer-x86_64 :: Darwin/gcd-once.mm (1822 of 2306) PASS: ThreadSanitizer-x86_64 :: Darwin/gcd-groups-stress.mm (1823 of 2306) PASS: ThreadSanitizer-x86_64 :: Darwin/gcd-semaphore-norace.mm (1824 of 2306) FAIL: ThreadSanitizer-x86_64 :: Darwin/gcd-source-cancel.mm (1825 of 2306) ******************** TEST 'ThreadSanitizer-x86_64 :: Darwin/gcd-source-cancel.mm' FAILED ******************** Script: -- /Users/buildslave/jenkins/workspace/clang-stage1-configure-RA-release-4/clang-build/./bin/clang -fsanitize=thread -Wall -arch x86_64 -stdlib=libc++ -mmacosx-version-min=10.9 -isysroot /Applications/Xcode.app/Contents/Developer/Platforms/MacOSX.platform/Developer/SDKs/MacOSX10.13.sdk -gline-tables-only -I/Users/buildslave/jenkins/workspace/clang-stage1-configure-RA-release-4/llvm/projects/compiler-rt/test/tsan/../ /Users/buildslave/jenkins/workspace/clang-stage1-configure-RA-release-4/llvm/projects/compiler-rt/test/tsan/Darwin/gcd-source-cancel.mm -o /Users/buildslave/jenkins/workspace/clang-stage1-configure-RA-release-4/clang-build/tools/clang/runtime/compiler-rt-bins/test/tsan/X86_64Config/Darwin/Output/gcd-source-cancel.mm.tmp -framework Foundation env TSAN_OPTIONS=atexit_sleep_ms=0:abort_on_error=0:ignore_interceptors_accesses=1 /Users/buildslave/jenkins/workspace/clang-stage1-configure-RA-release-4/clang-build/tools/clang/runtime/compiler-rt-bins/test/tsan/X86_64Config/Darwin/Output/gcd-source-cancel.mm.tmp 2>&1 | FileCheck /Users/buildslave/jenkins/workspace/clang-stage1-configure-RA-release-4/llvm/projects/compiler-rt/test/tsan/Darwin/gcd-source-cancel.mm -- Exit Code: 66

Hide Details

Hide Details

******************** FAIL: ThreadSanitizer-x86_64 :: Darwin/gcd-serial-queue-norace.mm (1826 of 2306) ******************** TEST 'ThreadSanitizer-x86_64 :: Darwin/gcd-serial-queue-norace.mm' FAILED ******************** Script: -- /Users/buildslave/jenkins/workspace/clang-stage1-configure-RA-release-4/clang-build/./bin/clang -fsanitize=thread -Wall -arch x86_64 -stdlib=libc++ -mmacosx-version-min=10.9 -isysroot /Applications/Xcode.app/Contents/Developer/Platforms/MacOSX.platform/Developer/SDKs/MacOSX10.13.sdk -gline-tables-only -I/Users/buildslave/jenkins/workspace/clang-stage1-configure-RA-release-4/llvm/projects/compiler-rt/test/tsan/../ /Users/buildslave/jenkins/workspace/clang-stage1-configure-RA-release-4/llvm/projects/compiler-rt/test/tsan/Darwin/gcd-serial-queue-norace.mm -o /Users/buildslave/jenkins/workspace/clang-stage1-configure-RA-release-4/clang-build/tools/clang/runtime/compiler-rt-bins/test/tsan/X86_64Config/Darwin/Output/gcd-serial-queue-norace.mm.tmp -framework Foundation env TSAN_OPTIONS=atexit_sleep_ms=0:abort_on_error=0:ignore_interceptors_accesses=1 /Users/buildslave/jenkins/workspace/clang-stage1-configure-RA-release-4/clang-build/tools/clang/runtime/compiler-rt-bins/test/tsan/X86_64Config/Darwin/Output/gcd-serial-queue-norace.mm.tmp 2>&1 | FileCheck /Users/buildslave/jenkins/workspace/clang-stage1-configure-RA-release-4/llvm/projects/compiler-rt/test/tsan/Darwin/gcd-serial-queue-norace.mm -- Exit Code: 66

Hide Details

Hide Details

******************** FAIL: ThreadSanitizer-x86_64 :: Darwin/gcd-source-event2.mm (1827 of 2306) ******************** TEST 'ThreadSanitizer-x86_64 :: Darwin/gcd-source-event2.mm' FAILED ******************** Script: -- /Users/buildslave/jenkins/workspace/clang-stage1-configure-RA-release-4/clang-build/./bin/clang -fsanitize=thread -Wall -arch x86_64 -stdlib=libc++ -mmacosx-version-min=10.9 -isysroot /Applications/Xcode.app/Contents/Developer/Platforms/MacOSX.platform/Developer/SDKs/MacOSX10.13.sdk -gline-tables-only -I/Users/buildslave/jenkins/workspace/clang-stage1-configure-RA-release-4/llvm/projects/compiler-rt/test/tsan/../ /Users/buildslave/jenkins/workspace/clang-stage1-configure-RA-release-4/llvm/projects/compiler-rt/test/tsan/Darwin/gcd-source-event2.mm -o /Users/buildslave/jenkins/workspace/clang-stage1-configure-RA-release-4/clang-build/tools/clang/runtime/compiler-rt-bins/test/tsan/X86_64Config/Darwin/Output/gcd-source-event2.mm.tmp -framework Foundation env TSAN_OPTIONS=atexit_sleep_ms=0:abort_on_error=0:ignore_interceptors_accesses=1 /Users/buildslave/jenkins/workspace/clang-stage1-configure-RA-release-4/clang-build/tools/clang/runtime/compiler-rt-bins/test/tsan/X86_64Config/Darwin/Output/gcd-source-event2.mm.tmp 2>&1 | FileCheck /Users/buildslave/jenkins/workspace/clang-stage1-configure-RA-release-4/llvm/projects/compiler-rt/test/tsan/Darwin/gcd-source-event2.mm -- Exit Code: 1

Hide Details

Command Output (stderr): -- <stdin>:3:1: error: CHECK-NOT: string occurred! WARNING: ThreadSanitizer: lock-order-inversion (potential deadlock) (pid=81844) ^ /Users/buildslave/jenkins/workspace/clang-stage1-configure-RA-release-4/llvm/projects/compiler-rt/test/tsan/Darwin/gcd-source-event2.mm:37:15: note: CHECK-NOT: pattern specified here // CHECK-NOT: WARNING: ThreadSanitizer ^

Hide Details

--

Hide Details

******************** PASS: ThreadSanitizer-x86_64 :: Darwin/gcd-source-serial.mm (1828 of 2306) FAIL: ThreadSanitizer-x86_64 :: Darwin/gcd-source-event.mm (1829 of 2306) ******************** TEST 'ThreadSanitizer-x86_64 :: Darwin/gcd-source-event.mm' FAILED ******************** Script: -- /Users/buildslave/jenkins/workspace/clang-stage1-configure-RA-release-4/clang-build/./bin/clang -fsanitize=thread -Wall -arch x86_64 -stdlib=libc++ -mmacosx-version-min=10.9 -isysroot /Applications/Xcode.app/Contents/Developer/Platforms/MacOSX.platform/Developer/SDKs/MacOSX10.13.sdk -gline-tables-only -I/Users/buildslave/jenkins/workspace/clang-stage1-configure-RA-release-4/llvm/projects/compiler-rt/test/tsan/../ /Users/buildslave/jenkins/workspace/clang-stage1-configure-RA-release-4/llvm/projects/compiler-rt/test/tsan/Darwin/gcd-source-event.mm -o /Users/buildslave/jenkins/workspace/clang-stage1-configure-RA-release-4/clang-build/tools/clang/runtime/compiler-rt-bins/test/tsan/X86_64Config/Darwin/Output/gcd-source-event.mm.tmp -framework Foundation env TSAN_OPTIONS=atexit_sleep_ms=0:abort_on_error=0:ignore_interceptors_accesses=1 /Users/buildslave/jenkins/workspace/clang-stage1-configure-RA-release-4/clang-build/tools/clang/runtime/compiler-rt-bins/test/tsan/X86_64Config/Darwin/Output/gcd-source-event.mm.tmp 2>&1 | FileCheck /Users/buildslave/jenkins/workspace/clang-stage1-configure-RA-release-4/llvm/projects/compiler-rt/test/tsan/Darwin/gcd-source-event.mm -- Exit Code: 66

Hide Details

Hide Details

******************** FAIL: ThreadSanitizer-x86_64 :: Darwin/gcd-source-cancel2.mm (1830 of 2306) ******************** TEST 'ThreadSanitizer-x86_64 :: Darwin/gcd-source-cancel2.mm' FAILED ******************** Script: -- /Users/buildslave/jenkins/workspace/clang-stage1-configure-RA-release-4/clang-build/./bin/clang -fsanitize=thread -Wall -arch x86_64 -stdlib=libc++ -mmacosx-version-min=10.9 -isysroot /Applications/Xcode.app/Contents/Developer/Platforms/MacOSX.platform/Developer/SDKs/MacOSX10.13.sdk -gline-tables-only -I/Users/buildslave/jenkins/workspace/clang-stage1-configure-RA-release-4/llvm/projects/compiler-rt/test/tsan/../ /Users/buildslave/jenkins/workspace/clang-stage1-configure-RA-release-4/llvm/projects/compiler-rt/test/tsan/Darwin/gcd-source-cancel2.mm -o /Users/buildslave/jenkins/workspace/clang-stage1-configure-RA-release-4/clang-build/tools/clang/runtime/compiler-rt-bins/test/tsan/X86_64Config/Darwin/Output/gcd-source-cancel2.mm.tmp -framework Foundation env TSAN_OPTIONS=atexit_sleep_ms=0:abort_on_error=0:ignore_interceptors_accesses=1 /Users/buildslave/jenkins/workspace/clang-stage1-configure-RA-release-4/clang-build/tools/clang/runtime/compiler-rt-bins/test/tsan/X86_64Config/Darwin/Output/gcd-source-cancel2.mm.tmp 2>&1 | FileCheck /Users/buildslave/jenkins/workspace/clang-stage1-configure-RA-release-4/llvm/projects/compiler-rt/test/tsan/Darwin/gcd-source-cancel2.mm -- Exit Code: 66

Hide Details

Hide Details

******************** FAIL: ThreadSanitizer-x86_64 :: Darwin/gcd-source-registration.mm (1831 of 2306) ******************** TEST 'ThreadSanitizer-x86_64 :: Darwin/gcd-source-registration.mm' FAILED ******************** Script: -- /Users/buildslave/jenkins/workspace/clang-stage1-configure-RA-release-4/clang-build/./bin/clang -fsanitize=thread -Wall -arch x86_64 -stdlib=libc++ -mmacosx-version-min=10.9 -isysroot /Applications/Xcode.app/Contents/Developer/Platforms/MacOSX.platform/Developer/SDKs/MacOSX10.13.sdk -gline-tables-only -I/Users/buildslave/jenkins/workspace/clang-stage1-configure-RA-release-4/llvm/projects/compiler-rt/test/tsan/../ /Users/buildslave/jenkins/workspace/clang-stage1-configure-RA-release-4/llvm/projects/compiler-rt/test/tsan/Darwin/gcd-source-registration.mm -o /Users/buildslave/jenkins/workspace/clang-stage1-configure-RA-release-4/clang-build/tools/clang/runtime/compiler-rt-bins/test/tsan/X86_64Config/Darwin/Output/gcd-source-registration.mm.tmp -framework Foundation env TSAN_OPTIONS=atexit_sleep_ms=0:abort_on_error=0:ignore_interceptors_accesses=1 /Users/buildslave/jenkins/workspace/clang-stage1-configure-RA-release-4/clang-build/tools/clang/runtime/compiler-rt-bins/test/tsan/X86_64Config/Darwin/Output/gcd-source-registration.mm.tmp 2>&1 | FileCheck /Users/buildslave/jenkins/workspace/clang-stage1-configure-RA-release-4/llvm/projects/compiler-rt/test/tsan/Darwin/gcd-source-registration.mm -- Exit Code: 1

Hide Details

Command Output (stderr): -- <stdin>:3:1: error: CHECK-NOT: string occurred! WARNING: ThreadSanitizer: lock-order-inversion (potential deadlock) (pid=81848) ^ /Users/buildslave/jenkins/workspace/clang-stage1-configure-RA-release-4/llvm/projects/compiler-rt/test/tsan/Darwin/gcd-source-registration.mm:33:15: note: CHECK-NOT: pattern specified here // CHECK-NOT: WARNING: ThreadSanitizer ^

Hide Details

--

Hide Details

******************** FAIL: ThreadSanitizer-x86_64 :: Darwin/gcd-source-registration2.mm (1832 of 2306) ******************** TEST 'ThreadSanitizer-x86_64 :: Darwin/gcd-source-registration2.mm' FAILED ******************** Script: -- /Users/buildslave/jenkins/workspace/clang-stage1-configure-RA-release-4/clang-build/./bin/clang -fsanitize=thread -Wall -arch x86_64 -stdlib=libc++ -mmacosx-version-min=10.9 -isysroot /Applications/Xcode.app/Contents/Developer/Platforms/MacOSX.platform/Developer/SDKs/MacOSX10.13.sdk -gline-tables-only -I/Users/buildslave/jenkins/workspace/clang-stage1-configure-RA-release-4/llvm/projects/compiler-rt/test/tsan/../ /Users/buildslave/jenkins/workspace/clang-stage1-configure-RA-release-4/llvm/projects/compiler-rt/test/tsan/Darwin/gcd-source-registration2.mm -o /Users/buildslave/jenkins/workspace/clang-stage1-configure-RA-release-4/clang-build/tools/clang/runtime/compiler-rt-bins/test/tsan/X86_64Config/Darwin/Output/gcd-source-registration2.mm.tmp -framework Foundation env TSAN_OPTIONS=atexit_sleep_ms=0:abort_on_error=0:ignore_interceptors_accesses=1 /Users/buildslave/jenkins/workspace/clang-stage1-configure-RA-release-4/clang-build/tools/clang/runtime/compiler-rt-bins/test/tsan/X86_64Config/Darwin/Output/gcd-source-registration2.mm.tmp 2>&1 | FileCheck /Users/buildslave/jenkins/workspace/clang-stage1-configure-RA-release-4/llvm/projects/compiler-rt/test/tsan/Darwin/gcd-source-registration2.mm -- Exit Code: 66

Hide Details

Hide Details

******************** PASS: ThreadSanitizer-x86_64 :: Darwin/gcd-suspend.mm (1833 of 2306) PASS: ThreadSanitizer-x86_64 :: Darwin/libcxx-future.mm (1834 of 2306) FAIL: ThreadSanitizer-x86_64 :: Darwin/gcd-sync-norace.mm (1835 of 2306) ******************** TEST 'ThreadSanitizer-x86_64 :: Darwin/gcd-sync-norace.mm' FAILED ******************** Script: -- /Users/buildslave/jenkins/workspace/clang-stage1-configure-RA-release-4/clang-build/./bin/clang -fsanitize=thread -Wall -arch x86_64 -stdlib=libc++ -mmacosx-version-min=10.9 -isysroot /Applications/Xcode.app/Contents/Developer/Platforms/MacOSX.platform/Developer/SDKs/MacOSX10.13.sdk -gline-tables-only -I/Users/buildslave/jenkins/workspace/clang-stage1-configure-RA-release-4/llvm/projects/compiler-rt/test/tsan/../ /Users/buildslave/jenkins/workspace/clang-stage1-configure-RA-release-4/llvm/projects/compiler-rt/test/tsan/Darwin/gcd-sync-norace.mm -o /Users/buildslave/jenkins/workspace/clang-stage1-configure-RA-release-4/clang-build/tools/clang/runtime/compiler-rt-bins/test/tsan/X86_64Config/Darwin/Output/gcd-sync-norace.mm.tmp -framework Foundation env TSAN_OPTIONS=atexit_sleep_ms=0:abort_on_error=0:ignore_interceptors_accesses=1 /Users/buildslave/jenkins/workspace/clang-stage1-configure-RA-release-4/clang-build/tools/clang/runtime/compiler-rt-bins/test/tsan/X86_64Config/Darwin/Output/gcd-sync-norace.mm.tmp 2>&1 | FileCheck /Users/buildslave/jenkins/workspace/clang-stage1-configure-RA-release-4/llvm/projects/compiler-rt/test/tsan/Darwin/gcd-sync-norace.mm -- Exit Code: 66

Hide Details

Hide Details

******************** PASS: ThreadSanitizer-x86_64 :: Darwin/libcxx-call-once.mm (1836 of 2306) PASS: ThreadSanitizer-x86_64 :: Darwin/gcd-sync-race.mm (1837 of 2306) FAIL: ThreadSanitizer-x86_64 :: Darwin/gcd-target-queue-norace.mm (1838 of 2306) ******************** TEST 'ThreadSanitizer-x86_64 :: Darwin/gcd-target-queue-norace.mm' FAILED ******************** Script: -- /Users/buildslave/jenkins/workspace/clang-stage1-configure-RA-release-4/clang-build/./bin/clang -fsanitize=thread -Wall -arch x86_64 -stdlib=libc++ -mmacosx-version-min=10.9 -isysroot /Applications/Xcode.app/Contents/Developer/Platforms/MacOSX.platform/Developer/SDKs/MacOSX10.13.sdk -gline-tables-only -I/Users/buildslave/jenkins/workspace/clang-stage1-configure-RA-release-4/llvm/projects/compiler-rt/test/tsan/../ /Users/buildslave/jenkins/workspace/clang-stage1-configure-RA-release-4/llvm/projects/compiler-rt/test/tsan/Darwin/gcd-target-queue-norace.mm -o /Users/buildslave/jenkins/workspace/clang-stage1-configure-RA-release-4/clang-build/tools/clang/runtime/compiler-rt-bins/test/tsan/X86_64Config/Darwin/Output/gcd-target-queue-norace.mm.tmp -framework Foundation env TSAN_OPTIONS=atexit_sleep_ms=0:abort_on_error=0:ignore_interceptors_accesses=1 /Users/buildslave/jenkins/workspace/clang-stage1-configure-RA-release-4/clang-build/tools/clang/runtime/compiler-rt-bins/test/tsan/X86_64Config/Darwin/Output/gcd-target-queue-norace.mm.tmp 2>&1 | FileCheck /Users/buildslave/jenkins/workspace/clang-stage1-configure-RA-release-4/llvm/projects/compiler-rt/test/tsan/Darwin/gcd-target-queue-norace.mm -- Exit Code: 1

Hide Details

Command Output (stderr): -- <stdin>:2:1: error: CHECK-NOT: string occurred! WARNING: ThreadSanitizer: lock-order-inversion (potential deadlock) (pid=81904) ^ /Users/buildslave/jenkins/workspace/clang-stage1-configure-RA-release-4/llvm/projects/compiler-rt/test/tsan/Darwin/gcd-target-queue-norace.mm:41:15: note: CHECK-NOT: pattern specified here // CHECK-NOT: WARNING: ThreadSanitizer ^

Hide Details

--

Hide Details

******************** PASS: ThreadSanitizer-x86_64 :: Darwin/libcxx-shared-ptr-recursive.mm (1839 of 2306) PASS: ThreadSanitizer-x86_64 :: Darwin/malloc-stack-logging.cc (1840 of 2306) PASS: ThreadSanitizer-x86_64 :: Darwin/libcxx-shared-ptr.mm (1841 of 2306) PASS: ThreadSanitizer-x86_64 :: Darwin/libcxx-shared-ptr-stress.mm (1842 of 2306) PASS: ThreadSanitizer-x86_64 :: Darwin/norace-objcxx-run-time.mm (1843 of 2306) FAIL: ThreadSanitizer-x86_64 :: Darwin/malloc_size.mm (1844 of 2306) ******************** TEST 'ThreadSanitizer-x86_64 :: Darwin/malloc_size.mm' FAILED ******************** Script: -- /Users/buildslave/jenkins/workspace/clang-stage1-configure-RA-release-4/clang-build/./bin/clang -fsanitize=thread -Wall -arch x86_64 -stdlib=libc++ -mmacosx-version-min=10.9 -isysroot /Applications/Xcode.app/Contents/Developer/Platforms/MacOSX.platform/Developer/SDKs/MacOSX10.13.sdk -gline-tables-only -I/Users/buildslave/jenkins/workspace/clang-stage1-configure-RA-release-4/llvm/projects/compiler-rt/test/tsan/../ /Users/buildslave/jenkins/workspace/clang-stage1-configure-RA-release-4/llvm/projects/compiler-rt/test/tsan/Darwin/malloc_size.mm -o /Users/buildslave/jenkins/workspace/clang-stage1-configure-RA-release-4/clang-build/tools/clang/runtime/compiler-rt-bins/test/tsan/X86_64Config/Darwin/Output/malloc_size.mm.tmp -framework Foundation /Users/buildslave/jenkins/workspace/clang-stage1-configure-RA-release-4/clang-build/tools/clang/runtime/compiler-rt-bins/test/tsan/X86_64Config/Darwin/Output/malloc_size.mm.tmp 2>&1 | FileCheck /Users/buildslave/jenkins/workspace/clang-stage1-configure-RA-release-4/llvm/projects/compiler-rt/test/tsan/Darwin/malloc_size.mm -- Exit Code: 66

Hide Details

Hide Details

******************** PASS: ThreadSanitizer-x86_64 :: Darwin/ignored-interceptors.mm (1845 of 2306) PASS: ThreadSanitizer-x86_64 :: Darwin/objc-simple.mm (1846 of 2306) PASS: ThreadSanitizer-x86_64 :: Darwin/ignore-noninstrumented.mm (1847 of 2306) PASS: ThreadSanitizer-x86_64 :: Darwin/objc-race.mm (1848 of 2306) PASS: ThreadSanitizer-x86_64 :: Darwin/osspinlock-norace.cc (1849 of 2306) PASS: ThreadSanitizer-x86_64 :: Darwin/realloc-zero.cc (1850 of 2306) FAIL: ThreadSanitizer-x86_64 :: Darwin/osatomics-add.mm (1851 of 2306) ******************** TEST 'ThreadSanitizer-x86_64 :: Darwin/osatomics-add.mm' FAILED ******************** Script: -- /Users/buildslave/jenkins/workspace/clang-stage1-configure-RA-release-4/clang-build/./bin/clang --driver-mode=g++ -fsanitize=thread -Wall -arch x86_64 -stdlib=libc++ -mmacosx-version-min=10.9 -isysroot /Applications/Xcode.app/Contents/Developer/Platforms/MacOSX.platform/Developer/SDKs/MacOSX10.13.sdk -gline-tables-only -I/Users/buildslave/jenkins/workspace/clang-stage1-configure-RA-release-4/llvm/projects/compiler-rt/test/tsan/../ -std=c++11 -I/Users/buildslave/jenkins/workspace/clang-stage1-configure-RA-release-4/llvm/projects/compiler-rt/test/tsan/../ /Users/buildslave/jenkins/workspace/clang-stage1-configure-RA-release-4/llvm/projects/compiler-rt/test/tsan/Darwin/osatomics-add.mm -o /Users/buildslave/jenkins/workspace/clang-stage1-configure-RA-release-4/clang-build/tools/clang/runtime/compiler-rt-bins/test/tsan/X86_64Config/Darwin/Output/osatomics-add.mm.tmp -framework Foundation -std=c++11 /Users/buildslave/jenkins/workspace/clang-stage1-configure-RA-release-4/clang-build/tools/clang/runtime/compiler-rt-bins/test/tsan/X86_64Config/Darwin/Output/osatomics-add.mm.tmp 2>&1 | FileCheck /Users/buildslave/jenkins/workspace/clang-stage1-configure-RA-release-4/llvm/projects/compiler-rt/test/tsan/Darwin/osatomics-add.mm -- Exit Code: 66

Hide Details

Hide Details

******************** UNSUPPORTED: ThreadSanitizer-x86_64 :: Linux/check_memcpy.cc (1852 of 2306) UNSUPPORTED: ThreadSanitizer-x86_64 :: Linux/check_preinit.cc (1853 of 2306) UNSUPPORTED: ThreadSanitizer-x86_64 :: Linux/mutex_robust.cc (1854 of 2306) UNSUPPORTED: ThreadSanitizer-x86_64 :: Linux/mutex_robust2.cc (1855 of 2306) UNSUPPORTED: ThreadSanitizer-x86_64 :: Linux/user_fopen.cc (1856 of 2306) UNSUPPORTED: ThreadSanitizer-x86_64 :: Linux/user_malloc.cc (1857 of 2306) PASS: ThreadSanitizer-x86_64 :: Darwin/symbolizer-dladdr.cc (1858 of 2306) FAIL: ThreadSanitizer-x86_64 :: Darwin/osatomics-bitops.mm (1859 of 2306) ******************** TEST 'ThreadSanitizer-x86_64 :: Darwin/osatomics-bitops.mm' FAILED ******************** Script: -- /Users/buildslave/jenkins/workspace/clang-stage1-configure-RA-release-4/clang-build/./bin/clang --driver-mode=g++ -fsanitize=thread -Wall -arch x86_64 -stdlib=libc++ -mmacosx-version-min=10.9 -isysroot /Applications/Xcode.app/Contents/Developer/Platforms/MacOSX.platform/Developer/SDKs/MacOSX10.13.sdk -gline-tables-only -I/Users/buildslave/jenkins/workspace/clang-stage1-configure-RA-release-4/llvm/projects/compiler-rt/test/tsan/../ -std=c++11 -I/Users/buildslave/jenkins/workspace/clang-stage1-configure-RA-release-4/llvm/projects/compiler-rt/test/tsan/../ /Users/buildslave/jenkins/workspace/clang-stage1-configure-RA-release-4/llvm/projects/compiler-rt/test/tsan/Darwin/osatomics-bitops.mm -o /Users/buildslave/jenkins/workspace/clang-stage1-configure-RA-release-4/clang-build/tools/clang/runtime/compiler-rt-bins/test/tsan/X86_64Config/Darwin/Output/osatomics-bitops.mm.tmp -framework Foundation -std=c++11 /Users/buildslave/jenkins/workspace/clang-stage1-configure-RA-release-4/clang-build/tools/clang/runtime/compiler-rt-bins/test/tsan/X86_64Config/Darwin/Output/osatomics-bitops.mm.tmp 2>&1 | FileCheck /Users/buildslave/jenkins/workspace/clang-stage1-configure-RA-release-4/llvm/projects/compiler-rt/test/tsan/Darwin/osatomics-bitops.mm -- Exit Code: 66

Hide Details

Hide Details

******************** FAIL: ThreadSanitizer-x86_64 :: Darwin/osatomics-list.mm (1860 of 2306) ******************** TEST 'ThreadSanitizer-x86_64 :: Darwin/osatomics-list.mm' FAILED ******************** Script: -- /Users/buildslave/jenkins/workspace/clang-stage1-configure-RA-release-4/clang-build/./bin/clang --driver-mode=g++ -fsanitize=thread -Wall -arch x86_64 -stdlib=libc++ -mmacosx-version-min=10.9 -isysroot /Applications/Xcode.app/Contents/Developer/Platforms/MacOSX.platform/Developer/SDKs/MacOSX10.13.sdk -gline-tables-only -I/Users/buildslave/jenkins/workspace/clang-stage1-configure-RA-release-4/llvm/projects/compiler-rt/test/tsan/../ -std=c++11 -I/Users/buildslave/jenkins/workspace/clang-stage1-configure-RA-release-4/llvm/projects/compiler-rt/test/tsan/../ /Users/buildslave/jenkins/workspace/clang-stage1-configure-RA-release-4/llvm/projects/compiler-rt/test/tsan/Darwin/osatomics-list.mm -o /Users/buildslave/jenkins/workspace/clang-stage1-configure-RA-release-4/clang-build/tools/clang/runtime/compiler-rt-bins/test/tsan/X86_64Config/Darwin/Output/osatomics-list.mm.tmp -framework Foundation -std=c++11 /Users/buildslave/jenkins/workspace/clang-stage1-configure-RA-release-4/clang-build/tools/clang/runtime/compiler-rt-bins/test/tsan/X86_64Config/Darwin/Output/osatomics-list.mm.tmp 2>&1 | FileCheck /Users/buildslave/jenkins/workspace/clang-stage1-configure-RA-release-4/llvm/projects/compiler-rt/test/tsan/Darwin/osatomics-list.mm -- Exit Code: 66

Hide Details

Hide Details

******************** PASS: ThreadSanitizer-x86_64 :: Darwin/symbolizer-atos.cc (1861 of 2306) PASS: ThreadSanitizer-x86_64 :: annotate_happens_before.cc (1862 of 2306) PASS: ThreadSanitizer-x86_64 :: atexit.cc (1863 of 2306) PASS: ThreadSanitizer-x86_64 :: aligned_vs_unaligned_race.cc (1864 of 2306) PASS: ThreadSanitizer-x86_64 :: atexit2.cc (1865 of 2306) PASS: ThreadSanitizer-x86_64 :: Darwin/xpc-race.mm (1866 of 2306) FAIL: ThreadSanitizer-x86_64 :: Darwin/xpc.mm (1867 of 2306) ******************** TEST 'ThreadSanitizer-x86_64 :: Darwin/xpc.mm' FAILED ******************** Script: -- /Users/buildslave/jenkins/workspace/clang-stage1-configure-RA-release-4/clang-build/./bin/clang -fsanitize=thread -Wall -arch x86_64 -stdlib=libc++ -mmacosx-version-min=10.9 -isysroot /Applications/Xcode.app/Contents/Developer/Platforms/MacOSX.platform/Developer/SDKs/MacOSX10.13.sdk -gline-tables-only -I/Users/buildslave/jenkins/workspace/clang-stage1-configure-RA-release-4/llvm/projects/compiler-rt/test/tsan/../ /Users/buildslave/jenkins/workspace/clang-stage1-configure-RA-release-4/llvm/projects/compiler-rt/test/tsan/Darwin/xpc.mm -o /Users/buildslave/jenkins/workspace/clang-stage1-configure-RA-release-4/clang-build/tools/clang/runtime/compiler-rt-bins/test/tsan/X86_64Config/Darwin/Output/xpc.mm.tmp -framework Foundation env TSAN_OPTIONS=atexit_sleep_ms=0:abort_on_error=0:ignore_interceptors_accesses=1 /Users/buildslave/jenkins/workspace/clang-stage1-configure-RA-release-4/clang-build/tools/clang/runtime/compiler-rt-bins/test/tsan/X86_64Config/Darwin/Output/xpc.mm.tmp 2>&1 | FileCheck /Users/buildslave/jenkins/workspace/clang-stage1-configure-RA-release-4/llvm/projects/compiler-rt/test/tsan/Darwin/xpc.mm -- Exit Code: 66

Hide Details

Hide Details

******************** PASS: ThreadSanitizer-x86_64 :: Darwin/objc-double-property.mm (1868 of 2306) PASS: ThreadSanitizer-x86_64 :: atomic_norace.cc (1869 of 2306) UNSUPPORTED: ThreadSanitizer-x86_64 :: barrier.cc (1870 of 2306) UNSUPPORTED: ThreadSanitizer-x86_64 :: bench_acquire_only.cc (1871 of 2306) UNSUPPORTED: ThreadSanitizer-x86_64 :: bench_acquire_release.cc (1872 of 2306) UNSUPPORTED: ThreadSanitizer-x86_64 :: bench_local_mutex.cc (1873 of 2306) UNSUPPORTED: ThreadSanitizer-x86_64 :: bench_mutex.cc (1874 of 2306) UNSUPPORTED: ThreadSanitizer-x86_64 :: bench_release_only.cc (1875 of 2306) UNSUPPORTED: ThreadSanitizer-x86_64 :: bench_rwmutex.cc (1876 of 2306) PASS: ThreadSanitizer-x86_64 :: atomic_free2.cc (1877 of 2306) UNSUPPORTED: ThreadSanitizer-x86_64 :: bench_single_writer.cc (1878 of 2306) UNSUPPORTED: ThreadSanitizer-x86_64 :: bench_ten_mutexes.cc (1879 of 2306) PASS: ThreadSanitizer-x86_64 :: atomic_free3.cc (1880 of 2306) PASS: ThreadSanitizer-x86_64 :: bench_shadow_flush.cc (1881 of 2306) PASS: ThreadSanitizer-x86_64 :: atomic_race.cc (1882 of 2306) PASS: ThreadSanitizer-x86_64 :: benign_race.cc (1883 of 2306) PASS: ThreadSanitizer-x86_64 :: atomic_stack.cc (1884 of 2306) PASS: ThreadSanitizer-x86_64 :: blacklist.cc (1885 of 2306) PASS: ThreadSanitizer-x86_64 :: atomic_store.cc (1886 of 2306) UNSUPPORTED: ThreadSanitizer-x86_64 :: cond_version.c (1887 of 2306) PASS: ThreadSanitizer-x86_64 :: cond.c (1888 of 2306) UNSUPPORTED: ThreadSanitizer-x86_64 :: debug_alloc_stack.cc (1889 of 2306) PASS: ThreadSanitizer-x86_64 :: cond_cancel.c (1890 of 2306) PASS: ThreadSanitizer-x86_64 :: blacklist2.cc (1891 of 2306) PASS: ThreadSanitizer-x86_64 :: cond_race.cc (1892 of 2306) PASS: ThreadSanitizer-x86_64 :: debug_locate.cc (1893 of 2306) UNSUPPORTED: ThreadSanitizer-x86_64 :: dl_iterate_phdr.cc (1894 of 2306) PASS: ThreadSanitizer-x86_64 :: cond_destruction.cc (1895 of 2306) PASS: ThreadSanitizer-x86_64 :: debugging.cc (1896 of 2306) PASS: ThreadSanitizer-x86_64 :: default_options.cc (1897 of 2306) PASS: ThreadSanitizer-x86_64 :: dtls.c (1898 of 2306) PASS: ThreadSanitizer-x86_64 :: dlclose.cc (1899 of 2306) PASS: ThreadSanitizer-x86_64 :: fd_close_norace.cc (1900 of 2306) PASS: ThreadSanitizer-x86_64 :: exceptions.cc (1901 of 2306) PASS: ThreadSanitizer-x86_64 :: fd_close_norace2.cc (1902 of 2306) PASS: ThreadSanitizer-x86_64 :: fd_dup_norace.cc (1903 of 2306) PASS: ThreadSanitizer-x86_64 :: fd_dup_norace2.cc (1904 of 2306) PASS: ThreadSanitizer-x86_64 :: deep_stack1.cc (1905 of 2306) PASS: ThreadSanitizer-x86_64 :: fd_pipe_norace.cc (1906 of 2306) PASS: ThreadSanitizer-x86_64 :: fd_socket_connect_norace.cc (1907 of 2306) PASS: ThreadSanitizer-x86_64 :: allocator_returns_null.cc (1908 of 2306) PASS: ThreadSanitizer-x86_64 :: fd_dup_race.cc (1909 of 2306) PASS: ThreadSanitizer-x86_64 :: fd_location.cc (1910 of 2306) PASS: ThreadSanitizer-x86_64 :: fd_socket_norace.cc (1911 of 2306) PASS: ThreadSanitizer-x86_64 :: fd_pipe_race.cc (1912 of 2306) PASS: ThreadSanitizer-x86_64 :: fd_socketpair_norace.cc (1913 of 2306) PASS: ThreadSanitizer-x86_64 :: fd_stdout_race.cc (1914 of 2306) PASS: ThreadSanitizer-x86_64 :: fd_tid_recycled.cc (1915 of 2306) PASS: ThreadSanitizer-x86_64 :: fork_atexit.cc (1916 of 2306) PASS: ThreadSanitizer-x86_64 :: fork_multithreaded3.cc (1917 of 2306) PASS: ThreadSanitizer-x86_64 :: free_race2.c (1918 of 2306) PASS: ThreadSanitizer-x86_64 :: getline_nohang.cc (1919 of 2306) PASS: ThreadSanitizer-x86_64 :: fork_multithreaded.cc (1920 of 2306) PASS: ThreadSanitizer-x86_64 :: free_race.c (1921 of 2306) PASS: ThreadSanitizer-x86_64 :: global_race2.cc (1922 of 2306) PASS: ThreadSanitizer-x86_64 :: global_race3.cc (1923 of 2306) PASS: ThreadSanitizer-x86_64 :: ignore_free.cc (1924 of 2306) PASS: ThreadSanitizer-x86_64 :: halt_on_error.cc (1925 of 2306) PASS: ThreadSanitizer-x86_64 :: heap_race.cc (1926 of 2306) PASS: ThreadSanitizer-x86_64 :: ignore_lib2.cc (1927 of 2306) PASS: ThreadSanitizer-x86_64 :: ignore_lib3.cc (1928 of 2306) PASS: ThreadSanitizer-x86_64 :: ignore_lib0.cc (1929 of 2306) PASS: ThreadSanitizer-x86_64 :: deadlock_detector_stress_test.cc (1930 of 2306) PASS: ThreadSanitizer-x86_64 :: ignore_lib1.cc (1931 of 2306) PASS: ThreadSanitizer-x86_64 :: fork_deadlock.cc (1932 of 2306) PASS: ThreadSanitizer-x86_64 :: ignore_malloc.cc (1933 of 2306) PASS: ThreadSanitizer-x86_64 :: atomic_free.cc (1934 of 2306) PASS: ThreadSanitizer-x86_64 :: ignore_race.cc (1935 of 2306) PASS: ThreadSanitizer-x86_64 :: interface_atomic_test.c (1936 of 2306) PASS: ThreadSanitizer-x86_64 :: ignore_sync.cc (1937 of 2306) PASS: ThreadSanitizer-x86_64 :: ignore_lib4.cc (1938 of 2306) PASS: ThreadSanitizer-x86_64 :: ignore_lib5.cc (1939 of 2306) PASS: ThreadSanitizer-x86_64 :: inlined_memcpy_race.cc (1940 of 2306) PASS: ThreadSanitizer-x86_64 :: inlined_memcpy_race2.cc (1941 of 2306) PASS: ThreadSanitizer-x86_64 :: java_alloc.cc (1942 of 2306) PASS: ThreadSanitizer-x86_64 :: ignored-interceptors-mmap.cc (1943 of 2306) PASS: ThreadSanitizer-x86_64 :: java_finalizer.cc (1944 of 2306) PASS: ThreadSanitizer-x86_64 :: java_heap_init.cc (1945 of 2306) PASS: ThreadSanitizer-x86_64 :: java_lock.cc (1946 of 2306) PASS: ThreadSanitizer-x86_64 :: java_lock_move.cc (1947 of 2306) PASS: ThreadSanitizer-x86_64 :: java_lock_rec.cc (1948 of 2306) PASS: ThreadSanitizer-x86_64 :: java_rwlock.cc (1949 of 2306) PASS: ThreadSanitizer-x86_64 :: java_lock_rec_race.cc (1950 of 2306) PASS: ThreadSanitizer-x86_64 :: java_move_overlap.cc (1951 of 2306) PASS: ThreadSanitizer-x86_64 :: java_race.cc (1952 of 2306) PASS: ThreadSanitizer-x86_64 :: java_race_move.cc (1953 of 2306) PASS: ThreadSanitizer-x86_64 :: java_race_pc.cc (1954 of 2306) PASS: ThreadSanitizer-x86_64 :: java_volatile.cc (1955 of 2306) PASS: ThreadSanitizer-x86_64 :: libcxx/std_shared_ptr.cc (1956 of 2306) PASS: ThreadSanitizer-x86_64 :: java_symbolization.cc (1957 of 2306) PASS: ThreadSanitizer-x86_64 :: longjmp.cc (1958 of 2306) PASS: ThreadSanitizer-x86_64 :: longjmp2.cc (1959 of 2306) PASS: ThreadSanitizer-x86_64 :: large_malloc_meta.cc (1960 of 2306) PASS: ThreadSanitizer-x86_64 :: java_move_overlap_race.cc (1961 of 2306) UNSUPPORTED: ThreadSanitizer-x86_64 :: map32bit.cc (1962 of 2306) PASS: ThreadSanitizer-x86_64 :: load_shared_lib.cc (1963 of 2306) PASS: ThreadSanitizer-x86_64 :: malloc_overflow.cc (1964 of 2306) PASS: ThreadSanitizer-x86_64 :: lots_of_threads.c (1965 of 2306) PASS: ThreadSanitizer-x86_64 :: longjmp3.cc (1966 of 2306) PASS: ThreadSanitizer-x86_64 :: longjmp4.cc (1967 of 2306) PASS: ThreadSanitizer-x86_64 :: malloc_stack.cc (1968 of 2306) PASS: ThreadSanitizer-x86_64 :: mmap_stress.cc (1969 of 2306) PASS: ThreadSanitizer-x86_64 :: mmap_large.cc (1970 of 2306) XFAIL: ThreadSanitizer-x86_64 :: must_deadlock.cc (1971 of 2306) PASS: ThreadSanitizer-x86_64 :: memcmp_race.cc (1972 of 2306) PASS: ThreadSanitizer-x86_64 :: memcpy_race.cc (1973 of 2306) PASS: ThreadSanitizer-x86_64 :: mutex_annotations.cc (1974 of 2306) PASS: ThreadSanitizer-x86_64 :: mop1.c (1975 of 2306) PASS: ThreadSanitizer-x86_64 :: mop_with_offset.cc (1976 of 2306) PASS: ThreadSanitizer-x86_64 :: mutex_bad_read_unlock.cc (1977 of 2306) PASS: ThreadSanitizer-x86_64 :: mutex_bad_read_lock.cc (1978 of 2306) PASS: ThreadSanitizer-x86_64 :: mop_with_offset2.cc (1979 of 2306) PASS: ThreadSanitizer-x86_64 :: mutex_bad_unlock.cc (1980 of 2306) PASS: ThreadSanitizer-x86_64 :: mutex_destroy_locked.cc (1981 of 2306) PASS: ThreadSanitizer-x86_64 :: mutex_double_lock.cc (1982 of 2306) PASS: ThreadSanitizer-x86_64 :: mutexset1.cc (1983 of 2306) PASS: ThreadSanitizer-x86_64 :: mutexset2.cc (1984 of 2306) PASS: ThreadSanitizer-x86_64 :: global_race.cc (1985 of 2306) PASS: ThreadSanitizer-x86_64 :: mutexset3.cc (1986 of 2306) PASS: ThreadSanitizer-x86_64 :: mutex_lock_destroyed.cc (1987 of 2306) PASS: ThreadSanitizer-x86_64 :: mutexset5.cc (1988 of 2306) PASS: ThreadSanitizer-x86_64 :: mutexset4.cc (1989 of 2306) PASS: ThreadSanitizer-x86_64 :: mutexset6.cc (1990 of 2306) PASS: ThreadSanitizer-x86_64 :: pie_test.cc (1991 of 2306) UNSUPPORTED: ThreadSanitizer-x86_64 :: race_on_barrier.c (1992 of 2306) UNSUPPORTED: ThreadSanitizer-x86_64 :: race_on_barrier2.c (1993 of 2306) PASS: ThreadSanitizer-x86_64 :: mutexset7.cc (1994 of 2306) PASS: ThreadSanitizer-x86_64 :: mutexset8.cc (1995 of 2306) PASS: ThreadSanitizer-x86_64 :: pthread_key.cc (1996 of 2306) PASS: ThreadSanitizer-x86_64 :: pthread_atfork_deadlock.c (1997 of 2306) PASS: ThreadSanitizer-x86_64 :: printf-1.c (1998 of 2306) PASS: ThreadSanitizer-x86_64 :: race_on_heap.cc (1999 of 2306) PASS: ThreadSanitizer-x86_64 :: race_on_mutex.c (2000 of 2306) PASS: ThreadSanitizer-x86_64 :: race_on_mutex2.c (2001 of 2306) PASS: ThreadSanitizer-x86_64 :: mutex_cycle2.c (2002 of 2306) PASS: ThreadSanitizer-x86_64 :: race_on_puts.cc (2003 of 2306) PASS: ThreadSanitizer-x86_64 :: mutex_cycle_long.c (2004 of 2306) PASS: ThreadSanitizer-x86_64 :: race_on_speculative_load.cc (2005 of 2306) PASS: ThreadSanitizer-x86_64 :: race_on_read.cc (2006 of 2306) PASS: ThreadSanitizer-x86_64 :: race_on_write.cc (2007 of 2306) PASS: ThreadSanitizer-x86_64 :: race_stress.cc (2008 of 2306) PASS: ThreadSanitizer-x86_64 :: setuid.c (2009 of 2306) PASS: ThreadSanitizer-x86_64 :: race_top_suppression.cc (2010 of 2306) PASS: ThreadSanitizer-x86_64 :: race_top_suppression1.cc (2011 of 2306) PASS: ThreadSanitizer-x86_64 :: real_deadlock_detector_stress_test.cc (2012 of 2306) PASS: ThreadSanitizer-x86_64 :: race_with_finished_thread.cc (2013 of 2306) UNSUPPORTED: ThreadSanitizer-x86_64 :: signal_recursive.cc (2014 of 2306) UNSUPPORTED: ThreadSanitizer-x86_64 :: signal_reset.cc (2015 of 2306) UNSUPPORTED: ThreadSanitizer-x86_64 :: signal_sync.cc (2016 of 2306) UNSUPPORTED: ThreadSanitizer-x86_64 :: signal_sync2.cc (2017 of 2306) UNSUPPORTED: ThreadSanitizer-x86_64 :: signal_thread.cc (2018 of 2306) PASS: ThreadSanitizer-x86_64 :: signal_block.cc (2019 of 2306) PASS: ThreadSanitizer-x86_64 :: signal_longjmp.cc (2020 of 2306) PASS: ThreadSanitizer-x86_64 :: signal_cond.cc (2021 of 2306) PASS: ThreadSanitizer-x86_64 :: setuid2.c (2022 of 2306) PASS: ThreadSanitizer-x86_64 :: signal_write.cc (2023 of 2306) PASS: ThreadSanitizer-x86_64 :: sigsuspend.cc (2024 of 2306) PASS: ThreadSanitizer-x86_64 :: signal_errno.cc (2025 of 2306) PASS: ThreadSanitizer-x86_64 :: restore_stack.cc (2026 of 2306) PASS: ThreadSanitizer-x86_64 :: signal_malloc.cc (2027 of 2306) PASS: ThreadSanitizer-x86_64 :: simple_race.c (2028 of 2306) PASS: ThreadSanitizer-x86_64 :: simple_race.cc (2029 of 2306) PASS: ThreadSanitizer-x86_64 :: simple_stack2.cc (2030 of 2306) PASS: ThreadSanitizer-x86_64 :: stack_sync_reuse.cc (2031 of 2306) PASS: ThreadSanitizer-x86_64 :: sleep_sync2.cc (2032 of 2306) PASS: ThreadSanitizer-x86_64 :: static_init1.cc (2033 of 2306) PASS: ThreadSanitizer-x86_64 :: sleep_sync.cc (2034 of 2306) PASS: ThreadSanitizer-x86_64 :: stack_race.cc (2035 of 2306) PASS: ThreadSanitizer-x86_64 :: stack_race2.cc (2036 of 2306) PASS: ThreadSanitizer-x86_64 :: static_init2.cc (2037 of 2306) PASS: ThreadSanitizer-x86_64 :: static_init6.cc (2038 of 2306) PASS: ThreadSanitizer-x86_64 :: static_init4.cc (2039 of 2306) PASS: ThreadSanitizer-x86_64 :: static_init5.cc (2040 of 2306) PASS: ThreadSanitizer-x86_64 :: sunrpc.cc (2041 of 2306) PASS: ThreadSanitizer-x86_64 :: static_init3.cc (2042 of 2306) PASS: ThreadSanitizer-x86_64 :: thread_detach.c (2043 of 2306) PASS: ThreadSanitizer-x86_64 :: suppress_same_address.cc (2044 of 2306) PASS: ThreadSanitizer-x86_64 :: suppress_same_stacks.cc (2045 of 2306) PASS: ThreadSanitizer-x86_64 :: thread_detach2.c (2046 of 2306) PASS: ThreadSanitizer-x86_64 :: simple_stack.c (2047 of 2306) PASS: ThreadSanitizer-x86_64 :: suppressions_global.cc (2048 of 2306) PASS: ThreadSanitizer-x86_64 :: suppressions_race.cc (2049 of 2306) PASS: ThreadSanitizer-x86_64 :: suppressions_race2.cc (2050 of 2306) PASS: ThreadSanitizer-x86_64 :: thread_leak.c (2051 of 2306) PASS: ThreadSanitizer-x86_64 :: thread_leak2.c (2052 of 2306) UNSUPPORTED: ThreadSanitizer-x86_64 :: thread_name2.cc (2053 of 2306) PASS: ThreadSanitizer-x86_64 :: thread_leak4.c (2054 of 2306) PASS: ThreadSanitizer-x86_64 :: thread_end_with_ignore.cc (2055 of 2306) PASS: ThreadSanitizer-x86_64 :: thread_end_with_ignore2.cc (2056 of 2306) PASS: ThreadSanitizer-x86_64 :: thread_end_with_ignore3.cc (2057 of 2306) PASS: ThreadSanitizer-x86_64 :: thread_leak3.c (2058 of 2306) PASS: ThreadSanitizer-x86_64 :: unaligned_norace.cc (2059 of 2306) PASS: ThreadSanitizer-x86_64 :: thread_leak5.c (2060 of 2306) PASS: ThreadSanitizer-x86_64 :: thread_name.cc (2061 of 2306) PASS: ThreadSanitizer-x86_64 :: tiny_race.c (2062 of 2306) PASS: ThreadSanitizer-x86_64 :: tls_race.cc (2063 of 2306) PASS: ThreadSanitizer-x86_64 :: tls_race2.cc (2064 of 2306) PASS: ThreadSanitizer-x86_64 :: virtual_inheritance_compile_bug.cc (2065 of 2306) PASS: ThreadSanitizer-x86_64 :: vptr_benign_race.cc (2066 of 2306) PASS: ThreadSanitizer-x86_64 :: vfork.cc (2067 of 2306) PASS: UBSan-ASan-i386 :: TestCases/Float/cast-overflow.cpp (2068 of 2306) PASS: UBSan-ASan-i386 :: TestCases/Integer/add-overflow.cpp (2069 of 2306) PASS: UBSan-ASan-i386 :: TestCases/Integer/div-overflow.cpp (2070 of 2306) PASS: ThreadSanitizer-x86_64 :: tsan-vs-gvn.cc (2071 of 2306) PASS: UBSan-ASan-i386 :: TestCases/Integer/div-zero.cpp (2072 of 2306) PASS: UBSan-ASan-i386 :: TestCases/Integer/incdec-overflow.cpp (2073 of 2306) PASS: ThreadSanitizer-x86_64 :: unaligned_race.cc (2074 of 2306) PASS: UBSan-ASan-i386 :: TestCases/Integer/mul-overflow.cpp (2075 of 2306) PASS: UBSan-ASan-i386 :: TestCases/Integer/negate-overflow.cpp (2076 of 2306) PASS: UBSan-ASan-i386 :: TestCases/Integer/no-recover.cpp (2077 of 2306) PASS: UBSan-ASan-i386 :: TestCases/Integer/summary.cpp (2078 of 2306) PASS: UBSan-ASan-i386 :: TestCases/Integer/sub-overflow.cpp (2079 of 2306) PASS: ThreadSanitizer-x86_64 :: vptr_harmful_race.cc (2080 of 2306) PASS: ThreadSanitizer-x86_64 :: vptr_harmful_race2.cc (2081 of 2306) PASS: ThreadSanitizer-x86_64 :: vptr_harmful_race3.cc (2082 of 2306) PASS: UBSan-ASan-i386 :: TestCases/Integer/umul-overflow.cpp (2083 of 2306) UNSUPPORTED: UBSan-ASan-i386 :: TestCases/Misc/Linux/ubsan_options.cc (2084 of 2306) PASS: UBSan-ASan-i386 :: TestCases/Integer/suppressions.cpp (2085 of 2306) PASS: UBSan-ASan-i386 :: TestCases/Integer/uadd-overflow.cpp (2086 of 2306) PASS: UBSan-ASan-i386 :: TestCases/Misc/bool.cpp (2087 of 2306) PASS: ThreadSanitizer-x86_64 :: vptr_harmful_race4.cc (2088 of 2306) PASS: UBSan-ASan-i386 :: TestCases/Integer/uincdec-overflow.cpp (2089 of 2306) PASS: UBSan-ASan-i386 :: TestCases/Misc/bounds.cpp (2090 of 2306) PASS: ThreadSanitizer-x86_64 :: write_in_reader_lock.cc (2091 of 2306) PASS: UBSan-ASan-i386 :: TestCases/Misc/deduplication.cpp (2092 of 2306) PASS: UBSan-ASan-i386 :: TestCases/Integer/usub-overflow.cpp (2093 of 2306) PASS: UBSan-ASan-i386 :: TestCases/Misc/missing_return.cpp (2094 of 2306) PASS: UBSan-ASan-i386 :: TestCases/Misc/nonnull.cpp (2095 of 2306) PASS: UBSan-ASan-i386 :: TestCases/Misc/log-path_test.cc (2096 of 2306) XFAIL: UBSan-ASan-i386 :: TestCases/TypeCheck/Function/function.cpp (2097 of 2306) PASS: UBSan-ASan-i386 :: TestCases/Misc/unreachable.cpp (2098 of 2306) PASS: UBSan-ASan-i386 :: TestCases/Misc/enum.cpp (2099 of 2306) PASS: UBSan-ASan-i386 :: TestCases/Misc/nonnull-arg.cpp (2100 of 2306) PASS: UBSan-ASan-i386 :: TestCases/Misc/vla.c (2101 of 2306) PASS: UBSan-ASan-i386 :: TestCases/TypeCheck/vptr-virtual-base-construction.cpp (2102 of 2306) PASS: UBSan-ASan-i386 :: TestCases/TypeCheck/vptr-corrupted-vtable-itanium.cpp (2103 of 2306) PASS: UBSan-ASan-i386 :: TestCases/TypeCheck/null.cpp (2104 of 2306) PASS: UBSan-ASan-i386 :: TestCases/TypeCheck/vptr-virtual-base.cpp (2105 of 2306) PASS: UBSan-ASan-i386 :: TestCases/TypeCheck/vptr-non-unique-typeinfo.cpp (2106 of 2306) PASS: UBSan-ASan-i386 :: TestCases/Misc/coverage-levels.cc (2107 of 2306) PASS: UBSan-ASan-i386 :: TestCases/Integer/shift.cpp (2108 of 2306) PASS: UBSan-ASan-x86_64 :: TestCases/Integer/div-overflow.cpp (2109 of 2306) PASS: UBSan-ASan-i386 :: TestCases/TypeCheck/misaligned.cpp (2110 of 2306) PASS: UBSan-ASan-x86_64 :: TestCases/Integer/mul-overflow.cpp (2111 of 2306) PASS: UBSan-ASan-x86_64 :: TestCases/Integer/negate-overflow.cpp (2112 of 2306) PASS: UBSan-ASan-i386 :: TestCases/TypeCheck/vptr.cpp (2113 of 2306) PASS: UBSan-ASan-x86_64 :: TestCases/Integer/add-overflow.cpp (2114 of 2306) PASS: UBSan-ASan-x86_64 :: TestCases/Integer/div-zero.cpp (2115 of 2306) PASS: UBSan-ASan-x86_64 :: TestCases/Integer/incdec-overflow.cpp (2116 of 2306) PASS: UBSan-ASan-x86_64 :: TestCases/Integer/no-recover.cpp (2117 of 2306) PASS: UBSan-ASan-x86_64 :: TestCases/Integer/summary.cpp (2118 of 2306) PASS: UBSan-ASan-x86_64 :: TestCases/Integer/umul-overflow.cpp (2119 of 2306) UNSUPPORTED: UBSan-ASan-x86_64 :: TestCases/Misc/Linux/ubsan_options.cc (2120 of 2306) PASS: UBSan-ASan-x86_64 :: TestCases/Integer/sub-overflow.cpp (2121 of 2306) PASS: UBSan-ASan-x86_64 :: TestCases/Float/cast-overflow.cpp (2122 of 2306) PASS: UBSan-ASan-x86_64 :: TestCases/Integer/uadd-overflow.cpp (2123 of 2306) PASS: UBSan-ASan-x86_64 :: TestCases/Misc/bool.cpp (2124 of 2306) PASS: UBSan-ASan-x86_64 :: TestCases/Misc/deduplication.cpp (2125 of 2306) PASS: UBSan-ASan-x86_64 :: TestCases/Integer/usub-overflow.cpp (2126 of 2306) PASS: UBSan-ASan-x86_64 :: TestCases/Integer/uincdec-overflow.cpp (2127 of 2306) PASS: UBSan-ASan-x86_64 :: TestCases/Integer/suppressions.cpp (2128 of 2306) PASS: UBSan-ASan-x86_64 :: TestCases/Misc/bounds.cpp (2129 of 2306) PASS: UBSan-ASan-x86_64 :: TestCases/Misc/missing_return.cpp (2130 of 2306) PASS: UBSan-ASan-x86_64 :: TestCases/Misc/log-path_test.cc (2131 of 2306) PASS: UBSan-ASan-x86_64 :: TestCases/Misc/unreachable.cpp (2132 of 2306) XFAIL: UBSan-ASan-x86_64 :: TestCases/TypeCheck/Function/function.cpp (2133 of 2306) PASS: UBSan-ASan-x86_64 :: TestCases/Misc/nonnull.cpp (2134 of 2306) PASS: UBSan-ASan-x86_64 :: TestCases/Misc/enum.cpp (2135 of 2306) PASS: UBSan-ASan-x86_64 :: TestCases/TypeCheck/vptr-non-unique-typeinfo.cpp (2136 of 2306) PASS: UBSan-ASan-x86_64 :: TestCases/TypeCheck/vptr-corrupted-vtable-itanium.cpp (2137 of 2306) PASS: UBSan-ASan-x86_64 :: TestCases/Misc/vla.c (2138 of 2306) PASS: UBSan-ASan-x86_64 :: TestCases/Misc/coverage-levels.cc (2139 of 2306) PASS: UBSan-ASan-x86_64 :: TestCases/TypeCheck/vptr-virtual-base-construction.cpp (2140 of 2306) PASS: UBSan-ASan-x86_64 :: TestCases/TypeCheck/vptr-virtual-base.cpp (2141 of 2306) PASS: UBSan-Standalone-i386 :: TestCases/Float/cast-overflow.cpp (2142 of 2306) PASS: UBSan-Standalone-i386 :: TestCases/Integer/div-overflow.cpp (2143 of 2306) PASS: UBSan-ASan-x86_64 :: TestCases/Misc/nonnull-arg.cpp (2144 of 2306) PASS: UBSan-Standalone-i386 :: TestCases/Integer/add-overflow.cpp (2145 of 2306) PASS: UBSan-Standalone-i386 :: TestCases/Integer/mul-overflow.cpp (2146 of 2306) PASS: UBSan-Standalone-i386 :: TestCases/Integer/div-zero.cpp (2147 of 2306) PASS: UBSan-Standalone-i386 :: TestCases/Integer/negate-overflow.cpp (2148 of 2306) PASS: UBSan-Standalone-i386 :: TestCases/Integer/incdec-overflow.cpp (2149 of 2306) UNSUPPORTED: UBSan-Standalone-i386 :: TestCases/Integer/summary.cpp (2150 of 2306) PASS: UBSan-ASan-x86_64 :: TestCases/TypeCheck/null.cpp (2151 of 2306) PASS: UBSan-Standalone-i386 :: TestCases/Integer/no-recover.cpp (2152 of 2306) PASS: UBSan-Standalone-i386 :: TestCases/Integer/suppressions.cpp (2153 of 2306) PASS: UBSan-Standalone-i386 :: TestCases/Integer/sub-overflow.cpp (2154 of 2306) PASS: UBSan-Standalone-i386 :: TestCases/Integer/uadd-overflow.cpp (2155 of 2306) UNSUPPORTED: UBSan-Standalone-i386 :: TestCases/Misc/Linux/ubsan_options.cc (2156 of 2306) PASS: UBSan-Standalone-i386 :: TestCases/Integer/umul-overflow.cpp (2157 of 2306) PASS: UBSan-ASan-x86_64 :: TestCases/Integer/shift.cpp (2158 of 2306) PASS: UBSan-Standalone-i386 :: TestCases/Integer/uincdec-overflow.cpp (2159 of 2306) PASS: UBSan-Standalone-i386 :: TestCases/Misc/bool.cpp (2160 of 2306) PASS: UBSan-Standalone-i386 :: TestCases/Misc/bounds.cpp (2161 of 2306) PASS: UBSan-Standalone-i386 :: TestCases/Misc/deduplication.cpp (2162 of 2306) PASS: UBSan-Standalone-i386 :: TestCases/Integer/usub-overflow.cpp (2163 of 2306) PASS: UBSan-Standalone-i386 :: TestCases/Misc/log-path_test.cc (2164 of 2306) PASS: UBSan-Standalone-i386 :: TestCases/Misc/missing_return.cpp (2165 of 2306) PASS: UBSan-Standalone-i386 :: TestCases/Misc/enum.cpp (2166 of 2306) PASS: UBSan-Standalone-i386 :: TestCases/Misc/nonnull-arg.cpp (2167 of 2306) PASS: UBSan-Standalone-i386 :: TestCases/Misc/nonnull.cpp (2168 of 2306) PASS: UBSan-Standalone-i386 :: TestCases/Misc/unreachable.cpp (2169 of 2306) XFAIL: UBSan-Standalone-i386 :: TestCases/TypeCheck/Function/function.cpp (2170 of 2306) PASS: UBSan-Standalone-i386 :: TestCases/Misc/vla.c (2171 of 2306) PASS: UBSan-Standalone-i386 :: TestCases/Misc/coverage-levels.cc (2172 of 2306) PASS: UBSan-Standalone-i386 :: TestCases/TypeCheck/null.cpp (2173 of 2306) PASS: UBSan-Standalone-i386 :: TestCases/TypeCheck/vptr-corrupted-vtable-itanium.cpp (2174 of 2306) PASS: UBSan-Standalone-i386 :: TestCases/TypeCheck/vptr-non-unique-typeinfo.cpp (2175 of 2306) PASS: UBSan-Standalone-i386 :: TestCases/TypeCheck/vptr-virtual-base-construction.cpp (2176 of 2306) PASS: UBSan-ASan-x86_64 :: TestCases/TypeCheck/misaligned.cpp (2177 of 2306) PASS: UBSan-Standalone-i386 :: TestCases/TypeCheck/vptr-virtual-base.cpp (2178 of 2306) PASS: UBSan-Standalone-i386 :: TestCases/Integer/shift.cpp (2179 of 2306) PASS: UBSan-Standalone-x86_64 :: TestCases/Integer/div-overflow.cpp (2180 of 2306) PASS: UBSan-Standalone-x86_64 :: TestCases/Float/cast-overflow.cpp (2181 of 2306) PASS: UBSan-Standalone-i386 :: TestCases/TypeCheck/misaligned.cpp (2182 of 2306) PASS: UBSan-Standalone-x86_64 :: TestCases/Integer/mul-overflow.cpp (2183 of 2306) PASS: UBSan-Standalone-x86_64 :: TestCases/Integer/add-overflow.cpp (2184 of 2306) PASS: UBSan-Standalone-x86_64 :: TestCases/Integer/negate-overflow.cpp (2185 of 2306) UNSUPPORTED: UBSan-Standalone-x86_64 :: TestCases/Integer/summary.cpp (2186 of 2306) PASS: UBSan-Standalone-x86_64 :: TestCases/Integer/div-zero.cpp (2187 of 2306) PASS: UBSan-Standalone-x86_64 :: TestCases/Integer/no-recover.cpp (2188 of 2306) PASS: UBSan-Standalone-x86_64 :: TestCases/Integer/incdec-overflow.cpp (2189 of 2306) PASS: UBSan-Standalone-i386 :: TestCases/TypeCheck/vptr.cpp (2190 of 2306) PASS: UBSan-Standalone-x86_64 :: TestCases/Integer/umul-overflow.cpp (2191 of 2306) UNSUPPORTED: UBSan-Standalone-x86_64 :: TestCases/Misc/Linux/ubsan_options.cc (2192 of 2306) PASS: UBSan-Standalone-x86_64 :: TestCases/Integer/sub-overflow.cpp (2193 of 2306) PASS: UBSan-Standalone-x86_64 :: TestCases/Integer/suppressions.cpp (2194 of 2306) PASS: UBSan-Standalone-x86_64 :: TestCases/Integer/uadd-overflow.cpp (2195 of 2306) PASS: UBSan-Standalone-x86_64 :: TestCases/Misc/bool.cpp (2196 of 2306) PASS: UBSan-Standalone-x86_64 :: TestCases/Misc/bounds.cpp (2197 of 2306) PASS: UBSan-Standalone-x86_64 :: TestCases/Integer/uincdec-overflow.cpp (2198 of 2306) PASS: UBSan-Standalone-x86_64 :: TestCases/Misc/deduplication.cpp (2199 of 2306) PASS: UBSan-Standalone-x86_64 :: TestCases/Integer/usub-overflow.cpp (2200 of 2306) PASS: UBSan-Standalone-x86_64 :: TestCases/Misc/missing_return.cpp (2201 of 2306) PASS: UBSan-Standalone-x86_64 :: TestCases/Misc/enum.cpp (2202 of 2306) PASS: UBSan-Standalone-x86_64 :: TestCases/Misc/log-path_test.cc (2203 of 2306) PASS: UBSan-Standalone-x86_64 :: TestCases/Misc/nonnull.cpp (2204 of 2306) XFAIL: UBSan-Standalone-x86_64 :: TestCases/TypeCheck/Function/function.cpp (2205 of 2306) PASS: UBSan-ASan-x86_64 :: TestCases/TypeCheck/vptr.cpp (2206 of 2306) PASS: UBSan-Standalone-x86_64 :: TestCases/Misc/nonnull-arg.cpp (2207 of 2306) PASS: UBSan-Standalone-x86_64 :: TestCases/Misc/unreachable.cpp (2208 of 2306) PASS: UBSan-Standalone-x86_64 :: TestCases/Misc/vla.c (2209 of 2306) PASS: UBSan-Standalone-x86_64 :: TestCases/TypeCheck/vptr-virtual-base-construction.cpp (2210 of 2306) PASS: UBSan-Standalone-x86_64 :: TestCases/TypeCheck/null.cpp (2211 of 2306) PASS: UBSan-Standalone-x86_64 :: TestCases/Misc/coverage-levels.cc (2212 of 2306) PASS: UBSan-Standalone-x86_64 :: TestCases/TypeCheck/vptr-virtual-base.cpp (2213 of 2306) PASS: UBSan-Standalone-x86_64 :: TestCases/TypeCheck/vptr-corrupted-vtable-itanium.cpp (2214 of 2306) PASS: UBSan-Standalone-x86_64 :: TestCases/TypeCheck/vptr-non-unique-typeinfo.cpp (2215 of 2306) PASS: UBSan-Standalone-x86_64 :: TestCases/TypeCheck/misaligned.cpp (2216 of 2306) PASS: UBSan-Standalone-x86_64 :: TestCases/Integer/shift.cpp (2217 of 2306) PASS: UBSan-Standalone-x86_64 :: TestCases/TypeCheck/vptr.cpp (2218 of 2306) PASS: UBSan-TSan-x86_64 :: TestCases/Integer/div-overflow.cpp (2219 of 2306) PASS: UBSan-TSan-x86_64 :: TestCases/Integer/mul-overflow.cpp (2220 of 2306) PASS: UBSan-TSan-x86_64 :: TestCases/Integer/negate-overflow.cpp (2221 of 2306) UNSUPPORTED: UBSan-TSan-x86_64 :: TestCases/Integer/summary.cpp (2222 of 2306) PASS: UBSan-TSan-x86_64 :: TestCases/Integer/add-overflow.cpp (2223 of 2306) PASS: UBSan-TSan-x86_64 :: TestCases/Integer/no-recover.cpp (2224 of 2306) PASS: UBSan-TSan-x86_64 :: TestCases/Integer/div-zero.cpp (2225 of 2306) PASS: UBSan-TSan-x86_64 :: TestCases/Integer/incdec-overflow.cpp (2226 of 2306) PASS: UBSan-TSan-x86_64 :: TestCases/Integer/sub-overflow.cpp (2227 of 2306) UNSUPPORTED: UBSan-TSan-x86_64 :: TestCases/Misc/Linux/ubsan_options.cc (2228 of 2306) PASS: UBSan-TSan-x86_64 :: TestCases/Integer/umul-overflow.cpp (2229 of 2306) PASS: UBSan-TSan-x86_64 :: TestCases/Integer/uadd-overflow.cpp (2230 of 2306) PASS: UBSan-TSan-x86_64 :: TestCases/Misc/bool.cpp (2231 of 2306) XFAIL: UBSan-TSan-x86_64 :: TestCases/Misc/coverage-levels.cc (2232 of 2306) PASS: UBSan-TSan-x86_64 :: TestCases/Integer/usub-overflow.cpp (2233 of 2306) PASS: UBSan-TSan-x86_64 :: TestCases/Misc/deduplication.cpp (2234 of 2306) PASS: UBSan-TSan-x86_64 :: TestCases/Integer/uincdec-overflow.cpp (2235 of 2306) PASS: UBSan-TSan-x86_64 :: TestCases/Float/cast-overflow.cpp (2236 of 2306) PASS: UBSan-TSan-x86_64 :: TestCases/Integer/suppressions.cpp (2237 of 2306) PASS: UBSan-TSan-x86_64 :: TestCases/Misc/missing_return.cpp (2238 of 2306) PASS: UBSan-TSan-x86_64 :: TestCases/Misc/bounds.cpp (2239 of 2306) XFAIL: UBSan-TSan-x86_64 :: TestCases/TypeCheck/Function/function.cpp (2240 of 2306) PASS: UBSan-TSan-x86_64 :: TestCases/Misc/enum.cpp (2241 of 2306) PASS: UBSan-TSan-x86_64 :: TestCases/Misc/unreachable.cpp (2242 of 2306) PASS: UBSan-TSan-x86_64 :: TestCases/Misc/log-path_test.cc (2243 of 2306) PASS: UBSan-TSan-x86_64 :: TestCases/Misc/nonnull.cpp (2244 of 2306) PASS: UBSan-TSan-x86_64 :: TestCases/TypeCheck/vptr-corrupted-vtable-itanium.cpp (2245 of 2306) PASS: UBSan-TSan-x86_64 :: TestCases/TypeCheck/vptr-non-unique-typeinfo.cpp (2246 of 2306) PASS: UBSan-TSan-x86_64 :: TestCases/TypeCheck/vptr-virtual-base-construction.cpp (2247 of 2306) PASS: UBSan-TSan-x86_64 :: TestCases/Misc/vla.c (2248 of 2306) PASS: UBSan-TSan-x86_64 :: TestCases/TypeCheck/vptr-virtual-base.cpp (2249 of 2306) PASS: cfi :: anon-namespace.cpp (2250 of 2306) PASS: cfi :: anon-namespace.cpp (2251 of 2306) PASS: cfi :: bad-cast.cpp (2252 of 2306) PASS: cfi :: bad-cast.cpp (2253 of 2306) PASS: cfi :: create-derivers.test (2254 of 2306) PASS: UBSan-TSan-x86_64 :: TestCases/Misc/nonnull-arg.cpp (2255 of 2306) UNSUPPORTED: cfi :: cross-dso/dlopen.cpp (2256 of 2306) UNSUPPORTED: cfi :: cross-dso/dlopen.cpp (2257 of 2306) UNSUPPORTED: cfi :: cross-dso/icall/diag.cpp (2258 of 2306) UNSUPPORTED: cfi :: cross-dso/icall/diag.cpp (2259 of 2306) UNSUPPORTED: cfi :: cross-dso/icall/icall-from-dso.cpp (2260 of 2306) UNSUPPORTED: cfi :: cross-dso/icall/icall-from-dso.cpp (2261 of 2306) UNSUPPORTED: cfi :: cross-dso/icall/icall.cpp (2262 of 2306) UNSUPPORTED: cfi :: cross-dso/icall/icall.cpp (2263 of 2306) UNSUPPORTED: cfi :: cross-dso/shadow_is_read_only.cpp (2264 of 2306) UNSUPPORTED: cfi :: cross-dso/shadow_is_read_only.cpp (2265 of 2306) UNSUPPORTED: cfi :: cross-dso/simple-fail.cpp (2266 of 2306) UNSUPPORTED: cfi :: cross-dso/simple-fail.cpp (2267 of 2306) UNSUPPORTED: cfi :: cross-dso/simple-pass.cpp (2268 of 2306) UNSUPPORTED: cfi :: cross-dso/simple-pass.cpp (2269 of 2306) UNSUPPORTED: cfi :: cross-dso/stats.cpp (2270 of 2306) UNSUPPORTED: cfi :: cross-dso/stats.cpp (2271 of 2306) UNSUPPORTED: cfi :: cross-dso/target_out_of_bounds.cpp (2272 of 2306) UNSUPPORTED: cfi :: cross-dso/target_out_of_bounds.cpp (2273 of 2306) PASS: cfi :: create-derivers.test (2274 of 2306) PASS: cfi :: icall/bad-signature.c (2275 of 2306) PASS: cfi :: icall/bad-signature.c (2276 of 2306) XFAIL: cfi :: icall/external-call.c (2277 of 2306) XFAIL: cfi :: icall/external-call.c (2278 of 2306) XFAIL: cfi :: icall/weak.c (2279 of 2306) PASS: cfi :: base-derived-destructor.cpp (2280 of 2306) XFAIL: cfi :: icall/weak.c (2281 of 2306) PASS: UBSan-TSan-x86_64 :: TestCases/TypeCheck/null.cpp (2282 of 2306) PASS: cfi :: base-derived-destructor.cpp (2283 of 2306) PASS: UBSan-TSan-x86_64 :: TestCases/Integer/shift.cpp (2284 of 2306) PASS: cfi :: nvcall.cpp (2285 of 2306) XFAIL: cfi :: sibling.cpp (2286 of 2306) XFAIL: cfi :: sibling.cpp (2287 of 2306) PASS: cfi :: multiple-inheritance.cpp (2288 of 2306) PASS: cfi :: nvcall.cpp (2289 of 2306) PASS: cfi :: multiple-inheritance.cpp (2290 of 2306) PASS: cfi :: overwrite.cpp (2291 of 2306) PASS: cfi :: simple-pass.cpp (2292 of 2306) UNSUPPORTED: cfi :: stats.cpp (2293 of 2306) PASS: cfi :: simple-pass.cpp (2294 of 2306) PASS: cfi :: stats.cpp (2295 of 2306) XFAIL: cfi :: two-vcalls.cpp (2296 of 2306) PASS: cfi :: target_uninstrumented.cpp (2297 of 2306) PASS: cfi :: target_uninstrumented.cpp (2298 of 2306) XFAIL: cfi :: two-vcalls.cpp (2299 of 2306) PASS: cfi :: overwrite.cpp (2300 of 2306) PASS: cfi :: vdtor.cpp (2301 of 2306) PASS: cfi :: vdtor.cpp (2302 of 2306) PASS: cfi :: simple-fail.cpp (2303 of 2306) PASS: cfi :: simple-fail.cpp (2304 of 2306) PASS: UBSan-TSan-x86_64 :: TestCases/TypeCheck/misaligned.cpp (2305 of 2306) PASS: UBSan-TSan-x86_64 :: TestCases/TypeCheck/vptr.cpp (2306 of 2306) Testing Time: 1130.70s ******************** Failing Tests (19): ThreadSanitizer-x86_64 :: Darwin/gcd-after.mm ThreadSanitizer-x86_64 :: Darwin/gcd-async-norace.mm ThreadSanitizer-x86_64 :: Darwin/gcd-barrier.mm ThreadSanitizer-x86_64 :: Darwin/gcd-blocks.mm ThreadSanitizer-x86_64 :: Darwin/gcd-groups-norace.mm ThreadSanitizer-x86_64 :: Darwin/gcd-serial-queue-norace.mm ThreadSanitizer-x86_64 :: Darwin/gcd-source-cancel.mm ThreadSanitizer-x86_64 :: Darwin/gcd-source-cancel2.mm ThreadSanitizer-x86_64 :: Darwin/gcd-source-event.mm ThreadSanitizer-x86_64 :: Darwin/gcd-source-event2.mm ThreadSanitizer-x86_64 :: Darwin/gcd-source-registration.mm ThreadSanitizer-x86_64 :: Darwin/gcd-source-registration2.mm ThreadSanitizer-x86_64 :: Darwin/gcd-sync-norace.mm ThreadSanitizer-x86_64 :: Darwin/gcd-target-queue-norace.mm ThreadSanitizer-x86_64 :: Darwin/malloc_size.mm ThreadSanitizer-x86_64 :: Darwin/osatomics-add.mm ThreadSanitizer-x86_64 :: Darwin/osatomics-bitops.mm ThreadSanitizer-x86_64 :: Darwin/osatomics-list.mm ThreadSanitizer-x86_64 :: Darwin/xpc.mm

Hide Details

Expected Passes : 1799 Expected Failures : 20 Unsupported Tests : 468 Unexpected Failures: 19 FAILED: test/CMakeFiles/check-compiler-rt cd /Users/buildslave/jenkins/workspace/clang-stage1-configure-RA-release-4/clang-build/tools/clang/runtime/compiler-rt-bins/test && /usr/local/bin/python2.7 /Users/buildslave/jenkins/workspace/clang-stage1-configure-RA-release-4/llvm/utils/lit/lit.py --xunit-xml-output=testresults.xunit.xml -v --timeout=600 /Users/buildslave/jenkins/workspace/clang-stage1-configure-RA-release-4/clang-build/tools/clang/runtime/compiler-rt-bins/test/asan/I386DarwinConfig /Users/buildslave/jenkins/workspace/clang-stage1-configure-RA-release-4/clang-build/tools/clang/runtime/compiler-rt-bins/test/asan/X86_64DarwinConfig /Users/buildslave/jenkins/workspace/clang-stage1-configure-RA-release-4/clang-build/tools/clang/runtime/compiler-rt-bins/test/asan/Unit /Users/buildslave/jenkins/workspace/clang-stage1-configure-RA-release-4/clang-build/tools/clang/runtime/compiler-rt-bins/test/profile/Profile-i386 /Users/buildslave/jenkins/workspace/clang-stage1-configure-RA-release-4/clang-build/tools/clang/runtime/compiler-rt-bins/test/profile/Profile-x86_64 /Users/buildslave/jenkins/workspace/clang-stage1-configure-RA-release-4/clang-build/tools/clang/runtime/compiler-rt-bins/test/sanitizer_common/asan-i386-Darwin /Users/buildslave/jenkins/workspace/clang-stage1-configure-RA-release-4/clang-build/tools/clang/runtime/compiler-rt-bins/test/sanitizer_common/asan-x86_64-Darwin /Users/buildslave/jenkins/workspace/clang-stage1-configure-RA-release-4/clang-build/tools/clang/runtime/compiler-rt-bins/test/sanitizer_common/Unit /Users/buildslave/jenkins/workspace/clang-stage1-configure-RA-release-4/clang-build/tools/clang/runtime/compiler-rt-bins/test/tsan/X86_64Config /Users/buildslave/jenkins/workspace/clang-stage1-configure-RA-release-4/clang-build/tools/clang/runtime/compiler-rt-bins/test/tsan/Unit /Users/buildslave/jenkins/workspace/clang-stage1-configure-RA-release-4/clang-build/tools/clang/runtime/compiler-rt-bins/test/ubsan/Standalone-i386 /Users/buildslave/jenkins/workspace/clang-stage1-configure-RA-release-4/clang-build/tools/clang/runtime/compiler-rt-bins/test/ubsan/AddressSanitizer-i386 /Users/buildslave/jenkins/workspace/clang-stage1-configure-RA-release-4/clang-build/tools/clang/runtime/compiler-rt-bins/test/ubsan/Standalone-x86_64 /Users/buildslave/jenkins/workspace/clang-stage1-configure-RA-release-4/clang-build/tools/clang/runtime/compiler-rt-bins/test/ubsan/AddressSanitizer-x86_64 /Users/buildslave/jenkins/workspace/clang-stage1-configure-RA-release-4/clang-build/tools/clang/runtime/compiler-rt-bins/test/ubsan/ThreadSanitizer-x86_64 /Users/buildslave/jenkins/workspace/clang-stage1-configure-RA-release-4/clang-build/tools/clang/runtime/compiler-rt-bins/test/cfi/Standalone /Users/buildslave/jenkins/workspace/clang-stage1-configure-RA-release-4/clang-build/tools/clang/runtime/compiler-rt-bins/test/cfi/Devirt /Users/buildslave/jenkins/workspace/clang-stage1-configure-RA-release-4/clang-build/tools/clang/runtime/compiler-rt-bins/test/safestack ninja: build stopped: subcommand failed. [112/338] /Applications/Xcode.app/Contents/Developer/Toolchains/XcodeDefault.xctoolchain/usr/bin/c++ -DCLANG_ENABLE_ARCMT -DCLANG_ENABLE_OBJC_REWRITER -DCLANG_ENABLE_STATIC_ANALYZER -DGTEST_HAS_RTTI=0 -D_DEBUG -D_GNU_SOURCE -D__STDC_CONSTANT_MACROS -D__STDC_FORMAT_MACROS -D__STDC_LIMIT_MACROS -Itools/clang/tools/extra/unittests/clang-move -I/Users/buildslave/jenkins/workspace/clang-stage1-configure-RA-release-4/llvm/tools/clang/tools/extra/unittests/clang-move -I/Users/buildslave/jenkins/workspace/clang-stage1-configure-RA-release-4/llvm/tools/clang/include -Itools/clang/include -Iinclude -I/Users/buildslave/jenkins/workspace/clang-stage1-configure-RA-release-4/llvm/include -I/Users/buildslave/jenkins/workspace/clang-stage1-configure-RA-release-4/llvm/tools/clang/tools/extra/clang-move -I/Users/buildslave/jenkins/workspace/clang-stage1-configure-RA-release-4/llvm/tools/clang -I/Users/buildslave/jenkins/workspace/clang-stage1-configure-RA-release-4/llvm/utils/unittest/googletest/include -I/Users/buildslave/jenkins/workspace/clang-stage1-configure-RA-release-4/llvm/utils/unittest/googlemock/include -fPIC -fvisibility-inlines-hidden -Wall -W -Wno-unused-parameter -Wwrite-strings -Wcast-qual -Wmissing-field-initializers -pedantic -Wno-long-long -Wcovered-switch-default -Wnon-virtual-dtor -Wdelete-non-virtual-dtor -Wstring-conversion -Werror=date-time -std=c++11 -fcolor-diagnostics -fno-common -Woverloaded-virtual -Wno-nested-anon-types -O3 -UNDEBUG -Wno-variadic-macros -Wno-gnu-zero-variadic-macro-arguments -fno-exceptions -fno-rtti -MD -MT tools/clang/tools/extra/unittests/clang-move/CMakeFiles/ClangMoveTests.dir/ClangMoveTests.cpp.o -MF tools/clang/tools/extra/unittests/clang-move/CMakeFiles/ClangMoveTests.dir/ClangMoveTests.cpp.o.d -o tools/clang/tools/extra/unittests/clang-move/CMakeFiles/ClangMoveTests.dir/ClangMoveTests.cpp.o -c /Users/buildslave/jenkins/workspace/clang-stage1-configure-RA-release-4/llvm/tools/clang/tools/extra/unittests/clang-move/ClangMoveTests.cpp /Users/buildslave/jenkins/workspace/clang-stage1-configure-RA-release-4/llvm/tools/clang/tools/extra/unittests/clang-move/ClangMoveTests.cpp:210:24: warning: lambda capture 'FileToSourceText' is not used [-Wunused-lambda-capture] auto CreateFiles = [&FileToSourceText, &Context, &FileToFileID]( ^ 1 warning generated. [220/338] /Applications/Xcode.app/Contents/Developer/Toolchains/XcodeDefault.xctoolchain/usr/bin/c++ -DGTEST_HAS_RTTI=0 -D_DEBUG -D__STDC_CONSTANT_MACROS -D__STDC_FORMAT_MACROS -D__STDC_LIMIT_MACROS -Iunittests/IR -I/Users/buildslave/jenkins/workspace/clang-stage1-configure-RA-release-4/llvm/unittests/IR -Iinclude -I/Users/buildslave/jenkins/workspace/clang-stage1-configure-RA-release-4/llvm/include -I/Users/buildslave/jenkins/workspace/clang-stage1-configure-RA-release-4/llvm/utils/unittest/googletest/include -I/Users/buildslave/jenkins/workspace/clang-stage1-configure-RA-release-4/llvm/utils/unittest/googlemock/include -fPIC -fvisibility-inlines-hidden -Wall -W -Wno-unused-parameter -Wwrite-strings -Wcast-qual -Wmissing-field-initializers -pedantic -Wno-long-long -Wcovered-switch-default -Wnon-virtual-dtor -Wdelete-non-virtual-dtor -Wstring-conversion -Werror=date-time -std=c++11 -fcolor-diagnostics -O3 -UNDEBUG -Wno-variadic-macros -Wno-gnu-zero-variadic-macro-arguments -fno-exceptions -fno-rtti -MD -MT unittests/IR/CMakeFiles/IRTests.dir/ConstantRangeTest.cpp.o -MF unittests/IR/CMakeFiles/IRTests.dir/ConstantRangeTest.cpp.o.d -o unittests/IR/CMakeFiles/IRTests.dir/ConstantRangeTest.cpp.o -c /Users/buildslave/jenkins/workspace/clang-stage1-configure-RA-release-4/llvm/unittests/IR/ConstantRangeTest.cpp /Users/buildslave/jenkins/workspace/clang-stage1-configure-RA-release-4/llvm/unittests/IR/ConstantRangeTest.cpp:673:7: warning: ignoring return value of function declared with 'warn_unused_result' attribute [-Wunused-result] I.uadd_ov(C, Overflow); ^~~~~~~~~ ~~~~~~~~~~~ /Users/buildslave/jenkins/workspace/clang-stage1-configure-RA-release-4/llvm/unittests/IR/ConstantRangeTest.cpp:680:7: warning: ignoring return value of function declared with 'warn_unused_result' attribute [-Wunused-result] I.sadd_ov(C, Overflow); ^~~~~~~~~ ~~~~~~~~~~~ /Users/buildslave/jenkins/workspace/clang-stage1-configure-RA-release-4/llvm/unittests/IR/ConstantRangeTest.cpp:688:7: warning: ignoring return value of function declared with 'warn_unused_result' attribute [-Wunused-result] I.sadd_ov(C, Overflow); ^~~~~~~~~ ~~~~~~~~~~~ /Users/buildslave/jenkins/workspace/clang-stage1-configure-RA-release-4/llvm/unittests/IR/ConstantRangeTest.cpp:691:7: warning: ignoring return value of function declared with 'warn_unused_result' attribute [-Wunused-result] I.uadd_ov(C, Overflow); ^~~~~~~~~ ~~~~~~~~~~~ 4 warnings generated. [292/338] /Applications/Xcode.app/Contents/Developer/Toolchains/XcodeDefault.xctoolchain/usr/bin/c++ -DGTEST_HAS_RTTI=0 -D_DEBUG -D__STDC_CONSTANT_MACROS -D__STDC_FORMAT_MACROS -D__STDC_LIMIT_MACROS -Iunittests/Support -I/Users/buildslave/jenkins/workspace/clang-stage1-configure-RA-release-4/llvm/unittests/Support -Iinclude -I/Users/buildslave/jenkins/workspace/clang-stage1-configure-RA-release-4/llvm/include -I/Users/buildslave/jenkins/workspace/clang-stage1-configure-RA-release-4/llvm/utils/unittest/googletest/include -I/Users/buildslave/jenkins/workspace/clang-stage1-configure-RA-release-4/llvm/utils/unittest/googlemock/include -fPIC -fvisibility-inlines-hidden -Wall -W -Wno-unused-parameter -Wwrite-strings -Wcast-qual -Wmissing-field-initializers -pedantic -Wno-long-long -Wcovered-switch-default -Wnon-virtual-dtor -Wdelete-non-virtual-dtor -Wstring-conversion -Werror=date-time -std=c++11 -fcolor-diagnostics -O3 -UNDEBUG -Wno-variadic-macros -Wno-gnu-zero-variadic-macro-arguments -fno-exceptions -fno-rtti -MD -MT unittests/Support/CMakeFiles/SupportTests.dir/ProgramTest.cpp.o -MF unittests/Support/CMakeFiles/SupportTests.dir/ProgramTest.cpp.o.d -o unittests/Support/CMakeFiles/SupportTests.dir/ProgramTest.cpp.o -c /Users/buildslave/jenkins/workspace/clang-stage1-configure-RA-release-4/llvm/unittests/Support/ProgramTest.cpp /Users/buildslave/jenkins/workspace/clang-stage1-configure-RA-release-4/llvm/unittests/Support/ProgramTest.cpp:79:27: warning: lambda capture 'this' is not used [-Wunused-lambda-capture] auto prepareEnvVar = [this](decltype(*EnvP) Var) { ^ 1 warning generated. [311/338] /Applications/Xcode.app/Contents/Developer/Toolchains/XcodeDefault.xctoolchain/usr/bin/c++ -DGTEST_HAS_RTTI=0 -D_DEBUG -D__STDC_CONSTANT_MACROS -D__STDC_FORMAT_MACROS -D__STDC_LIMIT_MACROS -Iunittests/Support -I/Users/buildslave/jenkins/workspace/clang-stage1-configure-RA-release-4/llvm/unittests/Support -Iinclude -I/Users/buildslave/jenkins/workspace/clang-stage1-configure-RA-release-4/llvm/include -I/Users/buildslave/jenkins/workspace/clang-stage1-configure-RA-release-4/llvm/utils/unittest/googletest/include -I/Users/buildslave/jenkins/workspace/clang-stage1-configure-RA-release-4/llvm/utils/unittest/googlemock/include -fPIC -fvisibility-inlines-hidden -Wall -W -Wno-unused-parameter -Wwrite-strings -Wcast-qual -Wmissing-field-initializers -pedantic -Wno-long-long -Wcovered-switch-default -Wnon-virtual-dtor -Wdelete-non-virtual-dtor -Wstring-conversion -Werror=date-time -std=c++11 -fcolor-diagnostics -O3 -UNDEBUG -Wno-variadic-macros -Wno-gnu-zero-variadic-macro-arguments -fno-exceptions -fno-rtti -MD -MT unittests/Support/CMakeFiles/SupportTests.dir/ThreadPool.cpp.o -MF unittests/Support/CMakeFiles/SupportTests.dir/ThreadPool.cpp.o.d -o unittests/Support/CMakeFiles/SupportTests.dir/ThreadPool.cpp.o -c /Users/buildslave/jenkins/workspace/clang-stage1-configure-RA-release-4/llvm/unittests/Support/ThreadPool.cpp /Users/buildslave/jenkins/workspace/clang-stage1-configure-RA-release-4/llvm/unittests/Support/ThreadPool.cpp:93:36: warning: lambda capture 'i' is not used [-Wunused-lambda-capture] Pool.async([this, &checked_in, i] { ^ /Users/buildslave/jenkins/workspace/clang-stage1-configure-RA-release-4/llvm/unittests/Support/ThreadPool.cpp:157:38: warning: lambda capture 'i' is not used [-Wunused-lambda-capture] Pool.async([this, &checked_in, i] { ^ 2 warnings generated. [336/338] : && /Applications/Xcode.app/Contents/Developer/Toolchains/XcodeDefault.xctoolchain/usr/bin/c++ -fPIC -fvisibility-inlines-hidden -Wall -W -Wno-unused-parameter -Wwrite-strings -Wcast-qual -Wmissing-field-initializers -pedantic -Wno-long-long -Wcovered-switch-default -Wnon-virtual-dtor -Wdelete-non-virtual-dtor -Wstring-conversion -Werror=date-time -std=c++11 -fcolor-diagnostics -O3 -Wl,-search_paths_first -Wl,-headerpad_max_install_names -Wl,-dead_strip unittests/Transforms/Scalar/CMakeFiles/ScalarTests.dir/LoopPassManagerTest.cpp.o -o unittests/Transforms/Scalar/ScalarTests lib/libLLVMAnalysis.a lib/libLLVMAsmParser.a lib/libLLVMCore.a lib/libLLVMSupport.a lib/libLLVMScalarOpts.a lib/libLLVMTransformUtils.a lib/libLLVMSupport.a lib/libgtest_main.a lib/libgtest.a lib/libLLVMInstCombine.a lib/libLLVMTransformUtils.a lib/libLLVMAnalysis.a lib/libLLVMObject.a lib/libLLVMBitReader.a lib/libLLVMMCParser.a lib/libLLVMMC.a lib/libLLVMProfileData.a lib/libLLVMCore.a lib/libLLVMSupport.a -lcurses -lz -lm lib/libLLVMDemangle.a -lpthread && : FAILED: tools/clang/runtime/CMakeFiles/check-compiler-rt cd /Users/buildslave/jenkins/workspace/clang-stage1-configure-RA-release-4/clang-build/tools/clang/runtime/compiler-rt-bins && /usr/local/Cellar/cmake/3.13.1/bin/cmake --build . --target check-all --config Release ninja: build stopped: cannot make progress due to previous errors. Command failed Command: ['/usr/local/bin/ninja', '-v', '-k', '0', 'check-all'] Build step 'Execute shell' marked build as failure Recording test results ERROR: Step ‘Publish JUnit test result report’ failed: No test report files were found. Configuration error? [BFA] Scanning build for known causes... [BFA] Found failure cause(s): [BFA] Ninja target failed from category Compile [BFA] Missing test results from category Infrastructure [BFA] Compile Error from category Compile [BFA] Regression test failed from category Test [BFA] Done. 2s No emails were triggered. Finished: FAILURE