FailedConsole Output

Skipping 10,962 KB.. Full Log
ORMAT_MACROS -D__STDC_LIMIT_MACROS -Itools/llvm-xray -I/Users/buildslave/jenkins/workspace/clang-stage2-Rthinlto-release_70/llvm/tools/llvm-xray -I/Applications/Xcode.app/Contents/Developer/Platforms/MacOSX.platform/Developer/SDKs/MacOSX10.14.sdk/usr/include/libxml2 -Iinclude -I/Users/buildslave/jenkins/workspace/clang-stage2-Rthinlto-release_70/llvm/include -fno-stack-protector -fno-common -Wno-profile-instr-unprofiled -fPIC -fvisibility-inlines-hidden -Werror=date-time -Werror=unguarded-availability-new -std=c++11 -fmodules -fmodules-cache-path=/Users/buildslave/jenkins/workspace/clang-stage2-Rthinlto-release_70/clang-build/Build/module.cache -fcxx-modules -gmodules -Wall -Wextra -Wno-unused-parameter -Wwrite-strings -Wcast-qual -Wmissing-field-initializers -pedantic -Wno-long-long -Wcovered-switch-default -Wnon-virtual-dtor -Wdelete-non-virtual-dtor -Wstring-conversion -fdiagnostics-color -flto=thin -O2 -g -DNDEBUG -isysroot /Applications/Xcode.app/Contents/Developer/Platforms/MacOSX.platform/Developer/SDKs/MacOSX10.14.sdk    -fno-exceptions -fno-rtti -MD -MT tools/llvm-xray/CMakeFiles/llvm-xray.dir/xray-stacks.cpp.o -MF tools/llvm-xray/CMakeFiles/llvm-xray.dir/xray-stacks.cpp.o.d -o tools/llvm-xray/CMakeFiles/llvm-xray.dir/xray-stacks.cpp.o -c /Users/buildslave/jenkins/workspace/clang-stage2-Rthinlto-release_70/llvm/tools/llvm-xray/xray-stacks.cpp
[2984/3408] /Users/buildslave/jenkins/workspace/clang-stage2-Rthinlto-release_70/host-compiler/bin/clang++  -DGTEST_HAS_RTTI=0 -D__STDC_CONSTANT_MACROS -D__STDC_FORMAT_MACROS -D__STDC_LIMIT_MACROS -Itools/obj2yaml -I/Users/buildslave/jenkins/workspace/clang-stage2-Rthinlto-release_70/llvm/tools/obj2yaml -I/Applications/Xcode.app/Contents/Developer/Platforms/MacOSX.platform/Developer/SDKs/MacOSX10.14.sdk/usr/include/libxml2 -Iinclude -I/Users/buildslave/jenkins/workspace/clang-stage2-Rthinlto-release_70/llvm/include -fno-stack-protector -fno-common -Wno-profile-instr-unprofiled -fPIC -fvisibility-inlines-hidden -Werror=date-time -Werror=unguarded-availability-new -std=c++11 -fmodules -fmodules-cache-path=/Users/buildslave/jenkins/workspace/clang-stage2-Rthinlto-release_70/clang-build/Build/module.cache -fcxx-modules -gmodules -Wall -Wextra -Wno-unused-parameter -Wwrite-strings -Wcast-qual -Wmissing-field-initializers -pedantic -Wno-long-long -Wcovered-switch-default -Wnon-virtual-dtor -Wdelete-non-virtual-dtor -Wstring-conversion -fdiagnostics-color -flto=thin -O2 -g -DNDEBUG -isysroot /Applications/Xcode.app/Contents/Developer/Platforms/MacOSX.platform/Developer/SDKs/MacOSX10.14.sdk    -fno-exceptions -fno-rtti -MD -MT tools/obj2yaml/CMakeFiles/obj2yaml.dir/Error.cpp.o -MF tools/obj2yaml/CMakeFiles/obj2yaml.dir/Error.cpp.o.d -o tools/obj2yaml/CMakeFiles/obj2yaml.dir/Error.cpp.o -c /Users/buildslave/jenkins/workspace/clang-stage2-Rthinlto-release_70/llvm/tools/obj2yaml/Error.cpp
[2985/3408] /Users/buildslave/jenkins/workspace/clang-stage2-Rthinlto-release_70/host-compiler/bin/clang++  -DGTEST_HAS_RTTI=0 -D__STDC_CONSTANT_MACROS -D__STDC_FORMAT_MACROS -D__STDC_LIMIT_MACROS -Itools/opt -I/Users/buildslave/jenkins/workspace/clang-stage2-Rthinlto-release_70/llvm/tools/opt -I/Applications/Xcode.app/Contents/Developer/Platforms/MacOSX.platform/Developer/SDKs/MacOSX10.14.sdk/usr/include/libxml2 -Iinclude -I/Users/buildslave/jenkins/workspace/clang-stage2-Rthinlto-release_70/llvm/include -fno-stack-protector -fno-common -Wno-profile-instr-unprofiled -fPIC -fvisibility-inlines-hidden -Werror=date-time -Werror=unguarded-availability-new -std=c++11 -fmodules -fmodules-cache-path=/Users/buildslave/jenkins/workspace/clang-stage2-Rthinlto-release_70/clang-build/Build/module.cache -fcxx-modules -gmodules -Wall -Wextra -Wno-unused-parameter -Wwrite-strings -Wcast-qual -Wmissing-field-initializers -pedantic -Wno-long-long -Wcovered-switch-default -Wnon-virtual-dtor -Wdelete-non-virtual-dtor -Wstring-conversion -fdiagnostics-color -flto=thin -O2 -g -DNDEBUG -isysroot /Applications/Xcode.app/Contents/Developer/Platforms/MacOSX.platform/Developer/SDKs/MacOSX10.14.sdk    -fno-exceptions -fno-rtti -MD -MT tools/opt/CMakeFiles/opt.dir/Debugify.cpp.o -MF tools/opt/CMakeFiles/opt.dir/Debugify.cpp.o.d -o tools/opt/CMakeFiles/opt.dir/Debugify.cpp.o -c /Users/buildslave/jenkins/workspace/clang-stage2-Rthinlto-release_70/llvm/tools/opt/Debugify.cpp
[2986/3408] /Users/buildslave/jenkins/workspace/clang-stage2-Rthinlto-release_70/host-compiler/bin/clang++  -DGTEST_HAS_RTTI=0 -D__STDC_CONSTANT_MACROS -D__STDC_FORMAT_MACROS -D__STDC_LIMIT_MACROS -Itools/obj2yaml -I/Users/buildslave/jenkins/workspace/clang-stage2-Rthinlto-release_70/llvm/tools/obj2yaml -I/Applications/Xcode.app/Contents/Developer/Platforms/MacOSX.platform/Developer/SDKs/MacOSX10.14.sdk/usr/include/libxml2 -Iinclude -I/Users/buildslave/jenkins/workspace/clang-stage2-Rthinlto-release_70/llvm/include -fno-stack-protector -fno-common -Wno-profile-instr-unprofiled -fPIC -fvisibility-inlines-hidden -Werror=date-time -Werror=unguarded-availability-new -std=c++11 -fmodules -fmodules-cache-path=/Users/buildslave/jenkins/workspace/clang-stage2-Rthinlto-release_70/clang-build/Build/module.cache -fcxx-modules -gmodules -Wall -Wextra -Wno-unused-parameter -Wwrite-strings -Wcast-qual -Wmissing-field-initializers -pedantic -Wno-long-long -Wcovered-switch-default -Wnon-virtual-dtor -Wdelete-non-virtual-dtor -Wstring-conversion -fdiagnostics-color -flto=thin -O2 -g -DNDEBUG -isysroot /Applications/Xcode.app/Contents/Developer/Platforms/MacOSX.platform/Developer/SDKs/MacOSX10.14.sdk    -fno-exceptions -fno-rtti -MD -MT tools/obj2yaml/CMakeFiles/obj2yaml.dir/macho2yaml.cpp.o -MF tools/obj2yaml/CMakeFiles/obj2yaml.dir/macho2yaml.cpp.o.d -o tools/obj2yaml/CMakeFiles/obj2yaml.dir/macho2yaml.cpp.o -c /Users/buildslave/jenkins/workspace/clang-stage2-Rthinlto-release_70/llvm/tools/obj2yaml/macho2yaml.cpp
[2987/3408] /Users/buildslave/jenkins/workspace/clang-stage2-Rthinlto-release_70/host-compiler/bin/clang++  -DGTEST_HAS_RTTI=0 -D__STDC_CONSTANT_MACROS -D__STDC_FORMAT_MACROS -D__STDC_LIMIT_MACROS -Itools/opt -I/Users/buildslave/jenkins/workspace/clang-stage2-Rthinlto-release_70/llvm/tools/opt -I/Applications/Xcode.app/Contents/Developer/Platforms/MacOSX.platform/Developer/SDKs/MacOSX10.14.sdk/usr/include/libxml2 -Iinclude -I/Users/buildslave/jenkins/workspace/clang-stage2-Rthinlto-release_70/llvm/include -fno-stack-protector -fno-common -Wno-profile-instr-unprofiled -fPIC -fvisibility-inlines-hidden -Werror=date-time -Werror=unguarded-availability-new -std=c++11 -fmodules -fmodules-cache-path=/Users/buildslave/jenkins/workspace/clang-stage2-Rthinlto-release_70/clang-build/Build/module.cache -fcxx-modules -gmodules -Wall -Wextra -Wno-unused-parameter -Wwrite-strings -Wcast-qual -Wmissing-field-initializers -pedantic -Wno-long-long -Wcovered-switch-default -Wnon-virtual-dtor -Wdelete-non-virtual-dtor -Wstring-conversion -fdiagnostics-color -flto=thin -O2 -g -DNDEBUG -isysroot /Applications/Xcode.app/Contents/Developer/Platforms/MacOSX.platform/Developer/SDKs/MacOSX10.14.sdk    -fno-exceptions -fno-rtti -MD -MT tools/opt/CMakeFiles/opt.dir/AnalysisWrappers.cpp.o -MF tools/opt/CMakeFiles/opt.dir/AnalysisWrappers.cpp.o.d -o tools/opt/CMakeFiles/opt.dir/AnalysisWrappers.cpp.o -c /Users/buildslave/jenkins/workspace/clang-stage2-Rthinlto-release_70/llvm/tools/opt/AnalysisWrappers.cpp
[2988/3408] /Users/buildslave/jenkins/workspace/clang-stage2-Rthinlto-release_70/host-compiler/bin/clang++  -DGTEST_HAS_RTTI=0 -D__STDC_CONSTANT_MACROS -D__STDC_FORMAT_MACROS -D__STDC_LIMIT_MACROS -Itools/opt -I/Users/buildslave/jenkins/workspace/clang-stage2-Rthinlto-release_70/llvm/tools/opt -I/Applications/Xcode.app/Contents/Developer/Platforms/MacOSX.platform/Developer/SDKs/MacOSX10.14.sdk/usr/include/libxml2 -Iinclude -I/Users/buildslave/jenkins/workspace/clang-stage2-Rthinlto-release_70/llvm/include -fno-stack-protector -fno-common -Wno-profile-instr-unprofiled -fPIC -fvisibility-inlines-hidden -Werror=date-time -Werror=unguarded-availability-new -std=c++11 -fmodules -fmodules-cache-path=/Users/buildslave/jenkins/workspace/clang-stage2-Rthinlto-release_70/clang-build/Build/module.cache -fcxx-modules -gmodules -Wall -Wextra -Wno-unused-parameter -Wwrite-strings -Wcast-qual -Wmissing-field-initializers -pedantic -Wno-long-long -Wcovered-switch-default -Wnon-virtual-dtor -Wdelete-non-virtual-dtor -Wstring-conversion -fdiagnostics-color -flto=thin -O2 -g -DNDEBUG -isysroot /Applications/Xcode.app/Contents/Developer/Platforms/MacOSX.platform/Developer/SDKs/MacOSX10.14.sdk    -fno-exceptions -fno-rtti -MD -MT tools/opt/CMakeFiles/opt.dir/GraphPrinters.cpp.o -MF tools/opt/CMakeFiles/opt.dir/GraphPrinters.cpp.o.d -o tools/opt/CMakeFiles/opt.dir/GraphPrinters.cpp.o -c /Users/buildslave/jenkins/workspace/clang-stage2-Rthinlto-release_70/llvm/tools/opt/GraphPrinters.cpp
[2989/3408] /Users/buildslave/jenkins/workspace/clang-stage2-Rthinlto-release_70/host-compiler/bin/clang++  -DGTEST_HAS_RTTI=0 -D__STDC_CONSTANT_MACROS -D__STDC_FORMAT_MACROS -D__STDC_LIMIT_MACROS -Itools/opt -I/Users/buildslave/jenkins/workspace/clang-stage2-Rthinlto-release_70/llvm/tools/opt -I/Applications/Xcode.app/Contents/Developer/Platforms/MacOSX.platform/Developer/SDKs/MacOSX10.14.sdk/usr/include/libxml2 -Iinclude -I/Users/buildslave/jenkins/workspace/clang-stage2-Rthinlto-release_70/llvm/include -fno-stack-protector -fno-common -Wno-profile-instr-unprofiled -fPIC -fvisibility-inlines-hidden -Werror=date-time -Werror=unguarded-availability-new -std=c++11 -fmodules -fmodules-cache-path=/Users/buildslave/jenkins/workspace/clang-stage2-Rthinlto-release_70/clang-build/Build/module.cache -fcxx-modules -gmodules -Wall -Wextra -Wno-unused-parameter -Wwrite-strings -Wcast-qual -Wmissing-field-initializers -pedantic -Wno-long-long -Wcovered-switch-default -Wnon-virtual-dtor -Wdelete-non-virtual-dtor -Wstring-conversion -fdiagnostics-color -flto=thin -O2 -g -DNDEBUG -isysroot /Applications/Xcode.app/Contents/Developer/Platforms/MacOSX.platform/Developer/SDKs/MacOSX10.14.sdk    -fno-exceptions -fno-rtti -MD -MT tools/opt/CMakeFiles/opt.dir/BreakpointPrinter.cpp.o -MF tools/opt/CMakeFiles/opt.dir/BreakpointPrinter.cpp.o.d -o tools/opt/CMakeFiles/opt.dir/BreakpointPrinter.cpp.o -c /Users/buildslave/jenkins/workspace/clang-stage2-Rthinlto-release_70/llvm/tools/opt/BreakpointPrinter.cpp
[2990/3408] /Users/buildslave/jenkins/workspace/clang-stage2-Rthinlto-release_70/host-compiler/bin/clang++  -DGTEST_HAS_RTTI=0 -D__STDC_CONSTANT_MACROS -D__STDC_FORMAT_MACROS -D__STDC_LIMIT_MACROS -Itools/obj2yaml -I/Users/buildslave/jenkins/workspace/clang-stage2-Rthinlto-release_70/llvm/tools/obj2yaml -I/Applications/Xcode.app/Contents/Developer/Platforms/MacOSX.platform/Developer/SDKs/MacOSX10.14.sdk/usr/include/libxml2 -Iinclude -I/Users/buildslave/jenkins/workspace/clang-stage2-Rthinlto-release_70/llvm/include -fno-stack-protector -fno-common -Wno-profile-instr-unprofiled -fPIC -fvisibility-inlines-hidden -Werror=date-time -Werror=unguarded-availability-new -std=c++11 -fmodules -fmodules-cache-path=/Users/buildslave/jenkins/workspace/clang-stage2-Rthinlto-release_70/clang-build/Build/module.cache -fcxx-modules -gmodules -Wall -Wextra -Wno-unused-parameter -Wwrite-strings -Wcast-qual -Wmissing-field-initializers -pedantic -Wno-long-long -Wcovered-switch-default -Wnon-virtual-dtor -Wdelete-non-virtual-dtor -Wstring-conversion -fdiagnostics-color -flto=thin -O2 -g -DNDEBUG -isysroot /Applications/Xcode.app/Contents/Developer/Platforms/MacOSX.platform/Developer/SDKs/MacOSX10.14.sdk    -fno-exceptions -fno-rtti -MD -MT tools/obj2yaml/CMakeFiles/obj2yaml.dir/wasm2yaml.cpp.o -MF tools/obj2yaml/CMakeFiles/obj2yaml.dir/wasm2yaml.cpp.o.d -o tools/obj2yaml/CMakeFiles/obj2yaml.dir/wasm2yaml.cpp.o -c /Users/buildslave/jenkins/workspace/clang-stage2-Rthinlto-release_70/llvm/tools/obj2yaml/wasm2yaml.cpp
[2991/3408] /Users/buildslave/jenkins/workspace/clang-stage2-Rthinlto-release_70/host-compiler/bin/clang++  -DGTEST_HAS_RTTI=0 -D__STDC_CONSTANT_MACROS -D__STDC_FORMAT_MACROS -D__STDC_LIMIT_MACROS -Itools/opt -I/Users/buildslave/jenkins/workspace/clang-stage2-Rthinlto-release_70/llvm/tools/opt -I/Applications/Xcode.app/Contents/Developer/Platforms/MacOSX.platform/Developer/SDKs/MacOSX10.14.sdk/usr/include/libxml2 -Iinclude -I/Users/buildslave/jenkins/workspace/clang-stage2-Rthinlto-release_70/llvm/include -fno-stack-protector -fno-common -Wno-profile-instr-unprofiled -fPIC -fvisibility-inlines-hidden -Werror=date-time -Werror=unguarded-availability-new -std=c++11 -fmodules -fmodules-cache-path=/Users/buildslave/jenkins/workspace/clang-stage2-Rthinlto-release_70/clang-build/Build/module.cache -fcxx-modules -gmodules -Wall -Wextra -Wno-unused-parameter -Wwrite-strings -Wcast-qual -Wmissing-field-initializers -pedantic -Wno-long-long -Wcovered-switch-default -Wnon-virtual-dtor -Wdelete-non-virtual-dtor -Wstring-conversion -fdiagnostics-color -flto=thin -O2 -g -DNDEBUG -isysroot /Applications/Xcode.app/Contents/Developer/Platforms/MacOSX.platform/Developer/SDKs/MacOSX10.14.sdk    -fno-exceptions -fno-rtti -MD -MT tools/opt/CMakeFiles/opt.dir/PassPrinters.cpp.o -MF tools/opt/CMakeFiles/opt.dir/PassPrinters.cpp.o.d -o tools/opt/CMakeFiles/opt.dir/PassPrinters.cpp.o -c /Users/buildslave/jenkins/workspace/clang-stage2-Rthinlto-release_70/llvm/tools/opt/PassPrinters.cpp
[2992/3408] /Users/buildslave/jenkins/workspace/clang-stage2-Rthinlto-release_70/host-compiler/bin/clang++  -DGTEST_HAS_RTTI=0 -D__STDC_CONSTANT_MACROS -D__STDC_FORMAT_MACROS -D__STDC_LIMIT_MACROS -Itools/opt -I/Users/buildslave/jenkins/workspace/clang-stage2-Rthinlto-release_70/llvm/tools/opt -I/Applications/Xcode.app/Contents/Developer/Platforms/MacOSX.platform/Developer/SDKs/MacOSX10.14.sdk/usr/include/libxml2 -Iinclude -I/Users/buildslave/jenkins/workspace/clang-stage2-Rthinlto-release_70/llvm/include -fno-stack-protector -fno-common -Wno-profile-instr-unprofiled -fPIC -fvisibility-inlines-hidden -Werror=date-time -Werror=unguarded-availability-new -std=c++11 -fmodules -fmodules-cache-path=/Users/buildslave/jenkins/workspace/clang-stage2-Rthinlto-release_70/clang-build/Build/module.cache -fcxx-modules -gmodules -Wall -Wextra -Wno-unused-parameter -Wwrite-strings -Wcast-qual -Wmissing-field-initializers -pedantic -Wno-long-long -Wcovered-switch-default -Wnon-virtual-dtor -Wdelete-non-virtual-dtor -Wstring-conversion -fdiagnostics-color -flto=thin -O2 -g -DNDEBUG -isysroot /Applications/Xcode.app/Contents/Developer/Platforms/MacOSX.platform/Developer/SDKs/MacOSX10.14.sdk    -fno-exceptions -fno-rtti -MD -MT tools/opt/CMakeFiles/opt.dir/PrintSCC.cpp.o -MF tools/opt/CMakeFiles/opt.dir/PrintSCC.cpp.o.d -o tools/opt/CMakeFiles/opt.dir/PrintSCC.cpp.o -c /Users/buildslave/jenkins/workspace/clang-stage2-Rthinlto-release_70/llvm/tools/opt/PrintSCC.cpp
[2993/3408] /Users/buildslave/jenkins/workspace/clang-stage2-Rthinlto-release_70/host-compiler/bin/clang++  -DGTEST_HAS_RTTI=0 -D__STDC_CONSTANT_MACROS -D__STDC_FORMAT_MACROS -D__STDC_LIMIT_MACROS -Itools/llvm-readobj -I/Users/buildslave/jenkins/workspace/clang-stage2-Rthinlto-release_70/llvm/tools/llvm-readobj -I/Applications/Xcode.app/Contents/Developer/Platforms/MacOSX.platform/Developer/SDKs/MacOSX10.14.sdk/usr/include/libxml2 -Iinclude -I/Users/buildslave/jenkins/workspace/clang-stage2-Rthinlto-release_70/llvm/include -fno-stack-protector -fno-common -Wno-profile-instr-unprofiled -fPIC -fvisibility-inlines-hidden -Werror=date-time -Werror=unguarded-availability-new -std=c++11 -fmodules -fmodules-cache-path=/Users/buildslave/jenkins/workspace/clang-stage2-Rthinlto-release_70/clang-build/Build/module.cache -fcxx-modules -gmodules -Wall -Wextra -Wno-unused-parameter -Wwrite-strings -Wcast-qual -Wmissing-field-initializers -pedantic -Wno-long-long -Wcovered-switch-default -Wnon-virtual-dtor -Wdelete-non-virtual-dtor -Wstring-conversion -fdiagnostics-color -flto=thin -O2 -g -DNDEBUG -isysroot /Applications/Xcode.app/Contents/Developer/Platforms/MacOSX.platform/Developer/SDKs/MacOSX10.14.sdk    -fno-exceptions -fno-rtti -MD -MT tools/llvm-readobj/CMakeFiles/llvm-readobj.dir/ELFDumper.cpp.o -MF tools/llvm-readobj/CMakeFiles/llvm-readobj.dir/ELFDumper.cpp.o.d -o tools/llvm-readobj/CMakeFiles/llvm-readobj.dir/ELFDumper.cpp.o -c /Users/buildslave/jenkins/workspace/clang-stage2-Rthinlto-release_70/llvm/tools/llvm-readobj/ELFDumper.cpp
[2994/3408] /Users/buildslave/jenkins/workspace/clang-stage2-Rthinlto-release_70/host-compiler/bin/clang++  -DGTEST_HAS_RTTI=0 -D__STDC_CONSTANT_MACROS -D__STDC_FORMAT_MACROS -D__STDC_LIMIT_MACROS -Itools/opt -I/Users/buildslave/jenkins/workspace/clang-stage2-Rthinlto-release_70/llvm/tools/opt -I/Applications/Xcode.app/Contents/Developer/Platforms/MacOSX.platform/Developer/SDKs/MacOSX10.14.sdk/usr/include/libxml2 -Iinclude -I/Users/buildslave/jenkins/workspace/clang-stage2-Rthinlto-release_70/llvm/include -fno-stack-protector -fno-common -Wno-profile-instr-unprofiled -fPIC -fvisibility-inlines-hidden -Werror=date-time -Werror=unguarded-availability-new -std=c++11 -fmodules -fmodules-cache-path=/Users/buildslave/jenkins/workspace/clang-stage2-Rthinlto-release_70/clang-build/Build/module.cache -fcxx-modules -gmodules -Wall -Wextra -Wno-unused-parameter -Wwrite-strings -Wcast-qual -Wmissing-field-initializers -pedantic -Wno-long-long -Wcovered-switch-default -Wnon-virtual-dtor -Wdelete-non-virtual-dtor -Wstring-conversion -fdiagnostics-color -flto=thin -O2 -g -DNDEBUG -isysroot /Applications/Xcode.app/Contents/Developer/Platforms/MacOSX.platform/Developer/SDKs/MacOSX10.14.sdk    -fno-exceptions -fno-rtti -MD -MT tools/opt/CMakeFiles/opt.dir/opt.cpp.o -MF tools/opt/CMakeFiles/opt.dir/opt.cpp.o.d -o tools/opt/CMakeFiles/opt.dir/opt.cpp.o -c /Users/buildslave/jenkins/workspace/clang-stage2-Rthinlto-release_70/llvm/tools/opt/opt.cpp
[2995/3408] /Users/buildslave/jenkins/workspace/clang-stage2-Rthinlto-release_70/host-compiler/bin/clang++  -DGTEST_HAS_RTTI=0 -D__STDC_CONSTANT_MACROS -D__STDC_FORMAT_MACROS -D__STDC_LIMIT_MACROS -Itools/sanstats -I/Users/buildslave/jenkins/workspace/clang-stage2-Rthinlto-release_70/llvm/tools/sanstats -I/Applications/Xcode.app/Contents/Developer/Platforms/MacOSX.platform/Developer/SDKs/MacOSX10.14.sdk/usr/include/libxml2 -Iinclude -I/Users/buildslave/jenkins/workspace/clang-stage2-Rthinlto-release_70/llvm/include -fno-stack-protector -fno-common -Wno-profile-instr-unprofiled -fPIC -fvisibility-inlines-hidden -Werror=date-time -Werror=unguarded-availability-new -std=c++11 -fmodules -fmodules-cache-path=/Users/buildslave/jenkins/workspace/clang-stage2-Rthinlto-release_70/clang-build/Build/module.cache -fcxx-modules -gmodules -Wall -Wextra -Wno-unused-parameter -Wwrite-strings -Wcast-qual -Wmissing-field-initializers -pedantic -Wno-long-long -Wcovered-switch-default -Wnon-virtual-dtor -Wdelete-non-virtual-dtor -Wstring-conversion -fdiagnostics-color -flto=thin -O2 -g -DNDEBUG -isysroot /Applications/Xcode.app/Contents/Developer/Platforms/MacOSX.platform/Developer/SDKs/MacOSX10.14.sdk    -fno-exceptions -fno-rtti -MD -MT tools/sanstats/CMakeFiles/sanstats.dir/sanstats.cpp.o -MF tools/sanstats/CMakeFiles/sanstats.dir/sanstats.cpp.o.d -o tools/sanstats/CMakeFiles/sanstats.dir/sanstats.cpp.o -c /Users/buildslave/jenkins/workspace/clang-stage2-Rthinlto-release_70/llvm/tools/sanstats/sanstats.cpp
[2996/3408] /Users/buildslave/jenkins/workspace/clang-stage2-Rthinlto-release_70/host-compiler/bin/clang++  -DGTEST_HAS_RTTI=0 -D__STDC_CONSTANT_MACROS -D__STDC_FORMAT_MACROS -D__STDC_LIMIT_MACROS -Itools/opt -I/Users/buildslave/jenkins/workspace/clang-stage2-Rthinlto-release_70/llvm/tools/opt -I/Applications/Xcode.app/Contents/Developer/Platforms/MacOSX.platform/Developer/SDKs/MacOSX10.14.sdk/usr/include/libxml2 -Iinclude -I/Users/buildslave/jenkins/workspace/clang-stage2-Rthinlto-release_70/llvm/include -fno-stack-protector -fno-common -Wno-profile-instr-unprofiled -fPIC -fvisibility-inlines-hidden -Werror=date-time -Werror=unguarded-availability-new -std=c++11 -fmodules -fmodules-cache-path=/Users/buildslave/jenkins/workspace/clang-stage2-Rthinlto-release_70/clang-build/Build/module.cache -fcxx-modules -gmodules -Wall -Wextra -Wno-unused-parameter -Wwrite-strings -Wcast-qual -Wmissing-field-initializers -pedantic -Wno-long-long -Wcovered-switch-default -Wnon-virtual-dtor -Wdelete-non-virtual-dtor -Wstring-conversion -fdiagnostics-color -flto=thin -O2 -g -DNDEBUG -isysroot /Applications/Xcode.app/Contents/Developer/Platforms/MacOSX.platform/Developer/SDKs/MacOSX10.14.sdk    -fno-exceptions -fno-rtti -MD -MT tools/opt/CMakeFiles/opt.dir/NewPMDriver.cpp.o -MF tools/opt/CMakeFiles/opt.dir/NewPMDriver.cpp.o.d -o tools/opt/CMakeFiles/opt.dir/NewPMDriver.cpp.o -c /Users/buildslave/jenkins/workspace/clang-stage2-Rthinlto-release_70/llvm/tools/opt/NewPMDriver.cpp
[2997/3408] /Users/buildslave/jenkins/workspace/clang-stage2-Rthinlto-release_70/host-compiler/bin/clang++  -DGTEST_HAS_RTTI=0 -D__STDC_CONSTANT_MACROS -D__STDC_FORMAT_MACROS -D__STDC_LIMIT_MACROS -Itools/yaml2obj -I/Users/buildslave/jenkins/workspace/clang-stage2-Rthinlto-release_70/llvm/tools/yaml2obj -I/Applications/Xcode.app/Contents/Developer/Platforms/MacOSX.platform/Developer/SDKs/MacOSX10.14.sdk/usr/include/libxml2 -Iinclude -I/Users/buildslave/jenkins/workspace/clang-stage2-Rthinlto-release_70/llvm/include -fno-stack-protector -fno-common -Wno-profile-instr-unprofiled -fPIC -fvisibility-inlines-hidden -Werror=date-time -Werror=unguarded-availability-new -std=c++11 -fmodules -fmodules-cache-path=/Users/buildslave/jenkins/workspace/clang-stage2-Rthinlto-release_70/clang-build/Build/module.cache -fcxx-modules -gmodules -Wall -Wextra -Wno-unused-parameter -Wwrite-strings -Wcast-qual -Wmissing-field-initializers -pedantic -Wno-long-long -Wcovered-switch-default -Wnon-virtual-dtor -Wdelete-non-virtual-dtor -Wstring-conversion -fdiagnostics-color -flto=thin -O2 -g -DNDEBUG -isysroot /Applications/Xcode.app/Contents/Developer/Platforms/MacOSX.platform/Developer/SDKs/MacOSX10.14.sdk    -fno-exceptions -fno-rtti -MD -MT tools/yaml2obj/CMakeFiles/yaml2obj.dir/yaml2obj.cpp.o -MF tools/yaml2obj/CMakeFiles/yaml2obj.dir/yaml2obj.cpp.o.d -o tools/yaml2obj/CMakeFiles/yaml2obj.dir/yaml2obj.cpp.o -c /Users/buildslave/jenkins/workspace/clang-stage2-Rthinlto-release_70/llvm/tools/yaml2obj/yaml2obj.cpp
[2998/3408] /Users/buildslave/jenkins/workspace/clang-stage2-Rthinlto-release_70/host-compiler/bin/clang++  -DGTEST_HAS_RTTI=0 -D__STDC_CONSTANT_MACROS -D__STDC_FORMAT_MACROS -D__STDC_LIMIT_MACROS -Itools/verify-uselistorder -I/Users/buildslave/jenkins/workspace/clang-stage2-Rthinlto-release_70/llvm/tools/verify-uselistorder -I/Applications/Xcode.app/Contents/Developer/Platforms/MacOSX.platform/Developer/SDKs/MacOSX10.14.sdk/usr/include/libxml2 -Iinclude -I/Users/buildslave/jenkins/workspace/clang-stage2-Rthinlto-release_70/llvm/include -fno-stack-protector -fno-common -Wno-profile-instr-unprofiled -fPIC -fvisibility-inlines-hidden -Werror=date-time -Werror=unguarded-availability-new -std=c++11 -fmodules -fmodules-cache-path=/Users/buildslave/jenkins/workspace/clang-stage2-Rthinlto-release_70/clang-build/Build/module.cache -fcxx-modules -gmodules -Wall -Wextra -Wno-unused-parameter -Wwrite-strings -Wcast-qual -Wmissing-field-initializers -pedantic -Wno-long-long -Wcovered-switch-default -Wnon-virtual-dtor -Wdelete-non-virtual-dtor -Wstring-conversion -fdiagnostics-color -flto=thin -O2 -g -DNDEBUG -isysroot /Applications/Xcode.app/Contents/Developer/Platforms/MacOSX.platform/Developer/SDKs/MacOSX10.14.sdk    -fno-exceptions -fno-rtti -MD -MT tools/verify-uselistorder/CMakeFiles/verify-uselistorder.dir/verify-uselistorder.cpp.o -MF tools/verify-uselistorder/CMakeFiles/verify-uselistorder.dir/verify-uselistorder.cpp.o.d -o tools/verify-uselistorder/CMakeFiles/verify-uselistorder.dir/verify-uselistorder.cpp.o -c /Users/buildslave/jenkins/workspace/clang-stage2-Rthinlto-release_70/llvm/tools/verify-uselistorder/verify-uselistorder.cpp
[2999/3408] /Users/buildslave/jenkins/workspace/clang-stage2-Rthinlto-release_70/host-compiler/bin/clang++  -DGTEST_HAS_RTTI=0 -D__STDC_CONSTANT_MACROS -D__STDC_FORMAT_MACROS -D__STDC_LIMIT_MACROS -Itools/yaml2obj -I/Users/buildslave/jenkins/workspace/clang-stage2-Rthinlto-release_70/llvm/tools/yaml2obj -I/Applications/Xcode.app/Contents/Developer/Platforms/MacOSX.platform/Developer/SDKs/MacOSX10.14.sdk/usr/include/libxml2 -Iinclude -I/Users/buildslave/jenkins/workspace/clang-stage2-Rthinlto-release_70/llvm/include -fno-stack-protector -fno-common -Wno-profile-instr-unprofiled -fPIC -fvisibility-inlines-hidden -Werror=date-time -Werror=unguarded-availability-new -std=c++11 -fmodules -fmodules-cache-path=/Users/buildslave/jenkins/workspace/clang-stage2-Rthinlto-release_70/clang-build/Build/module.cache -fcxx-modules -gmodules -Wall -Wextra -Wno-unused-parameter -Wwrite-strings -Wcast-qual -Wmissing-field-initializers -pedantic -Wno-long-long -Wcovered-switch-default -Wnon-virtual-dtor -Wdelete-non-virtual-dtor -Wstring-conversion -fdiagnostics-color -flto=thin -O2 -g -DNDEBUG -isysroot /Applications/Xcode.app/Contents/Developer/Platforms/MacOSX.platform/Developer/SDKs/MacOSX10.14.sdk    -fno-exceptions -fno-rtti -MD -MT tools/yaml2obj/CMakeFiles/yaml2obj.dir/yaml2coff.cpp.o -MF tools/yaml2obj/CMakeFiles/yaml2obj.dir/yaml2coff.cpp.o.d -o tools/yaml2obj/CMakeFiles/yaml2obj.dir/yaml2coff.cpp.o -c /Users/buildslave/jenkins/workspace/clang-stage2-Rthinlto-release_70/llvm/tools/yaml2obj/yaml2coff.cpp
[3000/3408] /Users/buildslave/jenkins/workspace/clang-stage2-Rthinlto-release_70/host-compiler/bin/clang++  -DGTEST_HAS_RTTI=0 -D__STDC_CONSTANT_MACROS -D__STDC_FORMAT_MACROS -D__STDC_LIMIT_MACROS -Itools/yaml2obj -I/Users/buildslave/jenkins/workspace/clang-stage2-Rthinlto-release_70/llvm/tools/yaml2obj -I/Applications/Xcode.app/Contents/Developer/Platforms/MacOSX.platform/Developer/SDKs/MacOSX10.14.sdk/usr/include/libxml2 -Iinclude -I/Users/buildslave/jenkins/workspace/clang-stage2-Rthinlto-release_70/llvm/include -fno-stack-protector -fno-common -Wno-profile-instr-unprofiled -fPIC -fvisibility-inlines-hidden -Werror=date-time -Werror=unguarded-availability-new -std=c++11 -fmodules -fmodules-cache-path=/Users/buildslave/jenkins/workspace/clang-stage2-Rthinlto-release_70/clang-build/Build/module.cache -fcxx-modules -gmodules -Wall -Wextra -Wno-unused-parameter -Wwrite-strings -Wcast-qual -Wmissing-field-initializers -pedantic -Wno-long-long -Wcovered-switch-default -Wnon-virtual-dtor -Wdelete-non-virtual-dtor -Wstring-conversion -fdiagnostics-color -flto=thin -O2 -g -DNDEBUG -isysroot /Applications/Xcode.app/Contents/Developer/Platforms/MacOSX.platform/Developer/SDKs/MacOSX10.14.sdk    -fno-exceptions -fno-rtti -MD -MT tools/yaml2obj/CMakeFiles/yaml2obj.dir/yaml2wasm.cpp.o -MF tools/yaml2obj/CMakeFiles/yaml2obj.dir/yaml2wasm.cpp.o.d -o tools/yaml2obj/CMakeFiles/yaml2obj.dir/yaml2wasm.cpp.o -c /Users/buildslave/jenkins/workspace/clang-stage2-Rthinlto-release_70/llvm/tools/yaml2obj/yaml2wasm.cpp
[3001/3408] /Users/buildslave/jenkins/workspace/clang-stage2-Rthinlto-release_70/host-compiler/bin/clang++  -DGTEST_HAS_RTTI=0 -D__STDC_CONSTANT_MACROS -D__STDC_FORMAT_MACROS -D__STDC_LIMIT_MACROS -Itools/yaml2obj -I/Users/buildslave/jenkins/workspace/clang-stage2-Rthinlto-release_70/llvm/tools/yaml2obj -I/Applications/Xcode.app/Contents/Developer/Platforms/MacOSX.platform/Developer/SDKs/MacOSX10.14.sdk/usr/include/libxml2 -Iinclude -I/Users/buildslave/jenkins/workspace/clang-stage2-Rthinlto-release_70/llvm/include -fno-stack-protector -fno-common -Wno-profile-instr-unprofiled -fPIC -fvisibility-inlines-hidden -Werror=date-time -Werror=unguarded-availability-new -std=c++11 -fmodules -fmodules-cache-path=/Users/buildslave/jenkins/workspace/clang-stage2-Rthinlto-release_70/clang-build/Build/module.cache -fcxx-modules -gmodules -Wall -Wextra -Wno-unused-parameter -Wwrite-strings -Wcast-qual -Wmissing-field-initializers -pedantic -Wno-long-long -Wcovered-switch-default -Wnon-virtual-dtor -Wdelete-non-virtual-dtor -Wstring-conversion -fdiagnostics-color -flto=thin -O2 -g -DNDEBUG -isysroot /Applications/Xcode.app/Contents/Developer/Platforms/MacOSX.platform/Developer/SDKs/MacOSX10.14.sdk    -fno-exceptions -fno-rtti -MD -MT tools/yaml2obj/CMakeFiles/yaml2obj.dir/yaml2macho.cpp.o -MF tools/yaml2obj/CMakeFiles/yaml2obj.dir/yaml2macho.cpp.o.d -o tools/yaml2obj/CMakeFiles/yaml2obj.dir/yaml2macho.cpp.o -c /Users/buildslave/jenkins/workspace/clang-stage2-Rthinlto-release_70/llvm/tools/yaml2obj/yaml2macho.cpp
[3002/3408] /Users/buildslave/jenkins/workspace/clang-stage2-Rthinlto-release_70/host-compiler/bin/clang++  -DGTEST_HAS_RTTI=0 -DGTEST_HAS_TR1_TUPLE=0 -DGTEST_LANG_CXX11=1 -D__STDC_CONSTANT_MACROS -D__STDC_FORMAT_MACROS -D__STDC_LIMIT_MACROS -Iunittests/ADT -I/Users/buildslave/jenkins/workspace/clang-stage2-Rthinlto-release_70/llvm/unittests/ADT -I/Applications/Xcode.app/Contents/Developer/Platforms/MacOSX.platform/Developer/SDKs/MacOSX10.14.sdk/usr/include/libxml2 -Iinclude -I/Users/buildslave/jenkins/workspace/clang-stage2-Rthinlto-release_70/llvm/include -I/Users/buildslave/jenkins/workspace/clang-stage2-Rthinlto-release_70/llvm/utils/unittest/googletest/include -I/Users/buildslave/jenkins/workspace/clang-stage2-Rthinlto-release_70/llvm/utils/unittest/googlemock/include -fno-stack-protector -fno-common -Wno-profile-instr-unprofiled -fPIC -fvisibility-inlines-hidden -Werror=date-time -Werror=unguarded-availability-new -std=c++11 -fmodules -fmodules-cache-path=/Users/buildslave/jenkins/workspace/clang-stage2-Rthinlto-release_70/clang-build/Build/module.cache -fcxx-modules -gmodules -Wall -Wextra -Wno-unused-parameter -Wwrite-strings -Wcast-qual -Wmissing-field-initializers -pedantic -Wno-long-long -Wcovered-switch-default -Wnon-virtual-dtor -Wdelete-non-virtual-dtor -Wstring-conversion -fdiagnostics-color -flto=thin -O2 -g -DNDEBUG -isysroot /Applications/Xcode.app/Contents/Developer/Platforms/MacOSX.platform/Developer/SDKs/MacOSX10.14.sdk    -Wno-variadic-macros -Wno-gnu-zero-variadic-macro-arguments -fno-exceptions -fno-rtti -MD -MT unittests/ADT/CMakeFiles/ADTTests.dir/AnyTest.cpp.o -MF unittests/ADT/CMakeFiles/ADTTests.dir/AnyTest.cpp.o.d -o unittests/ADT/CMakeFiles/ADTTests.dir/AnyTest.cpp.o -c /Users/buildslave/jenkins/workspace/clang-stage2-Rthinlto-release_70/llvm/unittests/ADT/AnyTest.cpp
[3003/3408] /Users/buildslave/jenkins/workspace/clang-stage2-Rthinlto-release_70/host-compiler/bin/clang++  -DGTEST_HAS_RTTI=0 -D__STDC_CONSTANT_MACROS -D__STDC_FORMAT_MACROS -D__STDC_LIMIT_MACROS -Itools/obj2yaml -I/Users/buildslave/jenkins/workspace/clang-stage2-Rthinlto-release_70/llvm/tools/obj2yaml -I/Applications/Xcode.app/Contents/Developer/Platforms/MacOSX.platform/Developer/SDKs/MacOSX10.14.sdk/usr/include/libxml2 -Iinclude -I/Users/buildslave/jenkins/workspace/clang-stage2-Rthinlto-release_70/llvm/include -fno-stack-protector -fno-common -Wno-profile-instr-unprofiled -fPIC -fvisibility-inlines-hidden -Werror=date-time -Werror=unguarded-availability-new -std=c++11 -fmodules -fmodules-cache-path=/Users/buildslave/jenkins/workspace/clang-stage2-Rthinlto-release_70/clang-build/Build/module.cache -fcxx-modules -gmodules -Wall -Wextra -Wno-unused-parameter -Wwrite-strings -Wcast-qual -Wmissing-field-initializers -pedantic -Wno-long-long -Wcovered-switch-default -Wnon-virtual-dtor -Wdelete-non-virtual-dtor -Wstring-conversion -fdiagnostics-color -flto=thin -O2 -g -DNDEBUG -isysroot /Applications/Xcode.app/Contents/Developer/Platforms/MacOSX.platform/Developer/SDKs/MacOSX10.14.sdk    -fno-exceptions -fno-rtti -MD -MT tools/obj2yaml/CMakeFiles/obj2yaml.dir/elf2yaml.cpp.o -MF tools/obj2yaml/CMakeFiles/obj2yaml.dir/elf2yaml.cpp.o.d -o tools/obj2yaml/CMakeFiles/obj2yaml.dir/elf2yaml.cpp.o -c /Users/buildslave/jenkins/workspace/clang-stage2-Rthinlto-release_70/llvm/tools/obj2yaml/elf2yaml.cpp
[3004/3408] /Users/buildslave/jenkins/workspace/clang-stage2-Rthinlto-release_70/host-compiler/bin/clang++  -DGTEST_HAS_RTTI=0 -DGTEST_HAS_TR1_TUPLE=0 -DGTEST_LANG_CXX11=1 -D__STDC_CONSTANT_MACROS -D__STDC_FORMAT_MACROS -D__STDC_LIMIT_MACROS -Iunittests/ADT -I/Users/buildslave/jenkins/workspace/clang-stage2-Rthinlto-release_70/llvm/unittests/ADT -I/Applications/Xcode.app/Contents/Developer/Platforms/MacOSX.platform/Developer/SDKs/MacOSX10.14.sdk/usr/include/libxml2 -Iinclude -I/Users/buildslave/jenkins/workspace/clang-stage2-Rthinlto-release_70/llvm/include -I/Users/buildslave/jenkins/workspace/clang-stage2-Rthinlto-release_70/llvm/utils/unittest/googletest/include -I/Users/buildslave/jenkins/workspace/clang-stage2-Rthinlto-release_70/llvm/utils/unittest/googlemock/include -fno-stack-protector -fno-common -Wno-profile-instr-unprofiled -fPIC -fvisibility-inlines-hidden -Werror=date-time -Werror=unguarded-availability-new -std=c++11 -fmodules -fmodules-cache-path=/Users/buildslave/jenkins/workspace/clang-stage2-Rthinlto-release_70/clang-build/Build/module.cache -fcxx-modules -gmodules -Wall -Wextra -Wno-unused-parameter -Wwrite-strings -Wcast-qual -Wmissing-field-initializers -pedantic -Wno-long-long -Wcovered-switch-default -Wnon-virtual-dtor -Wdelete-non-virtual-dtor -Wstring-conversion -fdiagnostics-color -flto=thin -O2 -g -DNDEBUG -isysroot /Applications/Xcode.app/Contents/Developer/Platforms/MacOSX.platform/Developer/SDKs/MacOSX10.14.sdk    -Wno-variadic-macros -Wno-gnu-zero-variadic-macro-arguments -fno-exceptions -fno-rtti -MD -MT unittests/ADT/CMakeFiles/ADTTests.dir/APSIntTest.cpp.o -MF unittests/ADT/CMakeFiles/ADTTests.dir/APSIntTest.cpp.o.d -o unittests/ADT/CMakeFiles/ADTTests.dir/APSIntTest.cpp.o -c /Users/buildslave/jenkins/workspace/clang-stage2-Rthinlto-release_70/llvm/unittests/ADT/APSIntTest.cpp
[3005/3408] /Users/buildslave/jenkins/workspace/clang-stage2-Rthinlto-release_70/host-compiler/bin/clang++  -DGTEST_HAS_RTTI=0 -DGTEST_HAS_TR1_TUPLE=0 -DGTEST_LANG_CXX11=1 -D__STDC_CONSTANT_MACROS -D__STDC_FORMAT_MACROS -D__STDC_LIMIT_MACROS -Iunittests/ADT -I/Users/buildslave/jenkins/workspace/clang-stage2-Rthinlto-release_70/llvm/unittests/ADT -I/Applications/Xcode.app/Contents/Developer/Platforms/MacOSX.platform/Developer/SDKs/MacOSX10.14.sdk/usr/include/libxml2 -Iinclude -I/Users/buildslave/jenkins/workspace/clang-stage2-Rthinlto-release_70/llvm/include -I/Users/buildslave/jenkins/workspace/clang-stage2-Rthinlto-release_70/llvm/utils/unittest/googletest/include -I/Users/buildslave/jenkins/workspace/clang-stage2-Rthinlto-release_70/llvm/utils/unittest/googlemock/include -fno-stack-protector -fno-common -Wno-profile-instr-unprofiled -fPIC -fvisibility-inlines-hidden -Werror=date-time -Werror=unguarded-availability-new -std=c++11 -fmodules -fmodules-cache-path=/Users/buildslave/jenkins/workspace/clang-stage2-Rthinlto-release_70/clang-build/Build/module.cache -fcxx-modules -gmodules -Wall -Wextra -Wno-unused-parameter -Wwrite-strings -Wcast-qual -Wmissing-field-initializers -pedantic -Wno-long-long -Wcovered-switch-default -Wnon-virtual-dtor -Wdelete-non-virtual-dtor -Wstring-conversion -fdiagnostics-color -flto=thin -O2 -g -DNDEBUG -isysroot /Applications/Xcode.app/Contents/Developer/Platforms/MacOSX.platform/Developer/SDKs/MacOSX10.14.sdk    -Wno-variadic-macros -Wno-gnu-zero-variadic-macro-arguments -fno-exceptions -fno-rtti -MD -MT unittests/ADT/CMakeFiles/ADTTests.dir/ArrayRefTest.cpp.o -MF unittests/ADT/CMakeFiles/ADTTests.dir/ArrayRefTest.cpp.o.d -o unittests/ADT/CMakeFiles/ADTTests.dir/ArrayRefTest.cpp.o -c /Users/buildslave/jenkins/workspace/clang-stage2-Rthinlto-release_70/llvm/unittests/ADT/ArrayRefTest.cpp
[3006/3408] /Users/buildslave/jenkins/workspace/clang-stage2-Rthinlto-release_70/host-compiler/bin/clang++  -DGTEST_HAS_RTTI=0 -DGTEST_HAS_TR1_TUPLE=0 -DGTEST_LANG_CXX11=1 -D__STDC_CONSTANT_MACROS -D__STDC_FORMAT_MACROS -D__STDC_LIMIT_MACROS -Iunittests/ADT -I/Users/buildslave/jenkins/workspace/clang-stage2-Rthinlto-release_70/llvm/unittests/ADT -I/Applications/Xcode.app/Contents/Developer/Platforms/MacOSX.platform/Developer/SDKs/MacOSX10.14.sdk/usr/include/libxml2 -Iinclude -I/Users/buildslave/jenkins/workspace/clang-stage2-Rthinlto-release_70/llvm/include -I/Users/buildslave/jenkins/workspace/clang-stage2-Rthinlto-release_70/llvm/utils/unittest/googletest/include -I/Users/buildslave/jenkins/workspace/clang-stage2-Rthinlto-release_70/llvm/utils/unittest/googlemock/include -fno-stack-protector -fno-common -Wno-profile-instr-unprofiled -fPIC -fvisibility-inlines-hidden -Werror=date-time -Werror=unguarded-availability-new -std=c++11 -fmodules -fmodules-cache-path=/Users/buildslave/jenkins/workspace/clang-stage2-Rthinlto-release_70/clang-build/Build/module.cache -fcxx-modules -gmodules -Wall -Wextra -Wno-unused-parameter -Wwrite-strings -Wcast-qual -Wmissing-field-initializers -pedantic -Wno-long-long -Wcovered-switch-default -Wnon-virtual-dtor -Wdelete-non-virtual-dtor -Wstring-conversion -fdiagnostics-color -flto=thin -O2 -g -DNDEBUG -isysroot /Applications/Xcode.app/Contents/Developer/Platforms/MacOSX.platform/Developer/SDKs/MacOSX10.14.sdk    -Wno-variadic-macros -Wno-gnu-zero-variadic-macro-arguments -fno-exceptions -fno-rtti -MD -MT unittests/ADT/CMakeFiles/ADTTests.dir/BitmaskEnumTest.cpp.o -MF unittests/ADT/CMakeFiles/ADTTests.dir/BitmaskEnumTest.cpp.o.d -o unittests/ADT/CMakeFiles/ADTTests.dir/BitmaskEnumTest.cpp.o -c /Users/buildslave/jenkins/workspace/clang-stage2-Rthinlto-release_70/llvm/unittests/ADT/BitmaskEnumTest.cpp
[3007/3408] /Users/buildslave/jenkins/workspace/clang-stage2-Rthinlto-release_70/host-compiler/bin/clang++  -DGTEST_HAS_RTTI=0 -DGTEST_HAS_TR1_TUPLE=0 -DGTEST_LANG_CXX11=1 -D__STDC_CONSTANT_MACROS -D__STDC_FORMAT_MACROS -D__STDC_LIMIT_MACROS -Iunittests/ADT -I/Users/buildslave/jenkins/workspace/clang-stage2-Rthinlto-release_70/llvm/unittests/ADT -I/Applications/Xcode.app/Contents/Developer/Platforms/MacOSX.platform/Developer/SDKs/MacOSX10.14.sdk/usr/include/libxml2 -Iinclude -I/Users/buildslave/jenkins/workspace/clang-stage2-Rthinlto-release_70/llvm/include -I/Users/buildslave/jenkins/workspace/clang-stage2-Rthinlto-release_70/llvm/utils/unittest/googletest/include -I/Users/buildslave/jenkins/workspace/clang-stage2-Rthinlto-release_70/llvm/utils/unittest/googlemock/include -fno-stack-protector -fno-common -Wno-profile-instr-unprofiled -fPIC -fvisibility-inlines-hidden -Werror=date-time -Werror=unguarded-availability-new -std=c++11 -fmodules -fmodules-cache-path=/Users/buildslave/jenkins/workspace/clang-stage2-Rthinlto-release_70/clang-build/Build/module.cache -fcxx-modules -gmodules -Wall -Wextra -Wno-unused-parameter -Wwrite-strings -Wcast-qual -Wmissing-field-initializers -pedantic -Wno-long-long -Wcovered-switch-default -Wnon-virtual-dtor -Wdelete-non-virtual-dtor -Wstring-conversion -fdiagnostics-color -flto=thin -O2 -g -DNDEBUG -isysroot /Applications/Xcode.app/Contents/Developer/Platforms/MacOSX.platform/Developer/SDKs/MacOSX10.14.sdk    -Wno-variadic-macros -Wno-gnu-zero-variadic-macro-arguments -fno-exceptions -fno-rtti -MD -MT unittests/ADT/CMakeFiles/ADTTests.dir/BumpPtrListTest.cpp.o -MF unittests/ADT/CMakeFiles/ADTTests.dir/BumpPtrListTest.cpp.o.d -o unittests/ADT/CMakeFiles/ADTTests.dir/BumpPtrListTest.cpp.o -c /Users/buildslave/jenkins/workspace/clang-stage2-Rthinlto-release_70/llvm/unittests/ADT/BumpPtrListTest.cpp
[3008/3408] /Users/buildslave/jenkins/workspace/clang-stage2-Rthinlto-release_70/host-compiler/bin/clang++  -DGTEST_HAS_RTTI=0 -D__STDC_CONSTANT_MACROS -D__STDC_FORMAT_MACROS -D__STDC_LIMIT_MACROS -Itools/sancov -I/Users/buildslave/jenkins/workspace/clang-stage2-Rthinlto-release_70/llvm/tools/sancov -I/Applications/Xcode.app/Contents/Developer/Platforms/MacOSX.platform/Developer/SDKs/MacOSX10.14.sdk/usr/include/libxml2 -Iinclude -I/Users/buildslave/jenkins/workspace/clang-stage2-Rthinlto-release_70/llvm/include -fno-stack-protector -fno-common -Wno-profile-instr-unprofiled -fPIC -fvisibility-inlines-hidden -Werror=date-time -Werror=unguarded-availability-new -std=c++11 -fmodules -fmodules-cache-path=/Users/buildslave/jenkins/workspace/clang-stage2-Rthinlto-release_70/clang-build/Build/module.cache -fcxx-modules -gmodules -Wall -Wextra -Wno-unused-parameter -Wwrite-strings -Wcast-qual -Wmissing-field-initializers -pedantic -Wno-long-long -Wcovered-switch-default -Wnon-virtual-dtor -Wdelete-non-virtual-dtor -Wstring-conversion -fdiagnostics-color -flto=thin -O2 -g -DNDEBUG -isysroot /Applications/Xcode.app/Contents/Developer/Platforms/MacOSX.platform/Developer/SDKs/MacOSX10.14.sdk    -fno-exceptions -fno-rtti -MD -MT tools/sancov/CMakeFiles/sancov.dir/sancov.cpp.o -MF tools/sancov/CMakeFiles/sancov.dir/sancov.cpp.o.d -o tools/sancov/CMakeFiles/sancov.dir/sancov.cpp.o -c /Users/buildslave/jenkins/workspace/clang-stage2-Rthinlto-release_70/llvm/tools/sancov/sancov.cpp
[3009/3408] /Users/buildslave/jenkins/workspace/clang-stage2-Rthinlto-release_70/host-compiler/bin/clang++  -DGTEST_HAS_RTTI=0 -DGTEST_HAS_TR1_TUPLE=0 -DGTEST_LANG_CXX11=1 -D__STDC_CONSTANT_MACROS -D__STDC_FORMAT_MACROS -D__STDC_LIMIT_MACROS -Iunittests/ADT -I/Users/buildslave/jenkins/workspace/clang-stage2-Rthinlto-release_70/llvm/unittests/ADT -I/Applications/Xcode.app/Contents/Developer/Platforms/MacOSX.platform/Developer/SDKs/MacOSX10.14.sdk/usr/include/libxml2 -Iinclude -I/Users/buildslave/jenkins/workspace/clang-stage2-Rthinlto-release_70/llvm/include -I/Users/buildslave/jenkins/workspace/clang-stage2-Rthinlto-release_70/llvm/utils/unittest/googletest/include -I/Users/buildslave/jenkins/workspace/clang-stage2-Rthinlto-release_70/llvm/utils/unittest/googlemock/include -fno-stack-protector -fno-common -Wno-profile-instr-unprofiled -fPIC -fvisibility-inlines-hidden -Werror=date-time -Werror=unguarded-availability-new -std=c++11 -fmodules -fmodules-cache-path=/Users/buildslave/jenkins/workspace/clang-stage2-Rthinlto-release_70/clang-build/Build/module.cache -fcxx-modules -gmodules -Wall -Wextra -Wno-unused-parameter -Wwrite-strings -Wcast-qual -Wmissing-field-initializers -pedantic -Wno-long-long -Wcovered-switch-default -Wnon-virtual-dtor -Wdelete-non-virtual-dtor -Wstring-conversion -fdiagnostics-color -flto=thin -O2 -g -DNDEBUG -isysroot /Applications/Xcode.app/Contents/Developer/Platforms/MacOSX.platform/Developer/SDKs/MacOSX10.14.sdk    -Wno-variadic-macros -Wno-gnu-zero-variadic-macro-arguments -fno-exceptions -fno-rtti -MD -MT unittests/ADT/CMakeFiles/ADTTests.dir/BreadthFirstIteratorTest.cpp.o -MF unittests/ADT/CMakeFiles/ADTTests.dir/BreadthFirstIteratorTest.cpp.o.d -o unittests/ADT/CMakeFiles/ADTTests.dir/BreadthFirstIteratorTest.cpp.o -c /Users/buildslave/jenkins/workspace/clang-stage2-Rthinlto-release_70/llvm/unittests/ADT/BreadthFirstIteratorTest.cpp
[3010/3408] /Users/buildslave/jenkins/workspace/clang-stage2-Rthinlto-release_70/host-compiler/bin/clang++  -DGTEST_HAS_RTTI=0 -DGTEST_HAS_TR1_TUPLE=0 -DGTEST_LANG_CXX11=1 -D__STDC_CONSTANT_MACROS -D__STDC_FORMAT_MACROS -D__STDC_LIMIT_MACROS -Iunittests/ADT -I/Users/buildslave/jenkins/workspace/clang-stage2-Rthinlto-release_70/llvm/unittests/ADT -I/Applications/Xcode.app/Contents/Developer/Platforms/MacOSX.platform/Developer/SDKs/MacOSX10.14.sdk/usr/include/libxml2 -Iinclude -I/Users/buildslave/jenkins/workspace/clang-stage2-Rthinlto-release_70/llvm/include -I/Users/buildslave/jenkins/workspace/clang-stage2-Rthinlto-release_70/llvm/utils/unittest/googletest/include -I/Users/buildslave/jenkins/workspace/clang-stage2-Rthinlto-release_70/llvm/utils/unittest/googlemock/include -fno-stack-protector -fno-common -Wno-profile-instr-unprofiled -fPIC -fvisibility-inlines-hidden -Werror=date-time -Werror=unguarded-availability-new -std=c++11 -fmodules -fmodules-cache-path=/Users/buildslave/jenkins/workspace/clang-stage2-Rthinlto-release_70/clang-build/Build/module.cache -fcxx-modules -gmodules -Wall -Wextra -Wno-unused-parameter -Wwrite-strings -Wcast-qual -Wmissing-field-initializers -pedantic -Wno-long-long -Wcovered-switch-default -Wnon-virtual-dtor -Wdelete-non-virtual-dtor -Wstring-conversion -fdiagnostics-color -flto=thin -O2 -g -DNDEBUG -isysroot /Applications/Xcode.app/Contents/Developer/Platforms/MacOSX.platform/Developer/SDKs/MacOSX10.14.sdk    -Wno-variadic-macros -Wno-gnu-zero-variadic-macro-arguments -fno-exceptions -fno-rtti -MD -MT unittests/ADT/CMakeFiles/ADTTests.dir/DeltaAlgorithmTest.cpp.o -MF unittests/ADT/CMakeFiles/ADTTests.dir/DeltaAlgorithmTest.cpp.o.d -o unittests/ADT/CMakeFiles/ADTTests.dir/DeltaAlgorithmTest.cpp.o -c /Users/buildslave/jenkins/workspace/clang-stage2-Rthinlto-release_70/llvm/unittests/ADT/DeltaAlgorithmTest.cpp
[3011/3408] /Users/buildslave/jenkins/workspace/clang-stage2-Rthinlto-release_70/host-compiler/bin/clang++  -DGTEST_HAS_RTTI=0 -DGTEST_HAS_TR1_TUPLE=0 -DGTEST_LANG_CXX11=1 -D__STDC_CONSTANT_MACROS -D__STDC_FORMAT_MACROS -D__STDC_LIMIT_MACROS -Iunittests/ADT -I/Users/buildslave/jenkins/workspace/clang-stage2-Rthinlto-release_70/llvm/unittests/ADT -I/Applications/Xcode.app/Contents/Developer/Platforms/MacOSX.platform/Developer/SDKs/MacOSX10.14.sdk/usr/include/libxml2 -Iinclude -I/Users/buildslave/jenkins/workspace/clang-stage2-Rthinlto-release_70/llvm/include -I/Users/buildslave/jenkins/workspace/clang-stage2-Rthinlto-release_70/llvm/utils/unittest/googletest/include -I/Users/buildslave/jenkins/workspace/clang-stage2-Rthinlto-release_70/llvm/utils/unittest/googlemock/include -fno-stack-protector -fno-common -Wno-profile-instr-unprofiled -fPIC -fvisibility-inlines-hidden -Werror=date-time -Werror=unguarded-availability-new -std=c++11 -fmodules -fmodules-cache-path=/Users/buildslave/jenkins/workspace/clang-stage2-Rthinlto-release_70/clang-build/Build/module.cache -fcxx-modules -gmodules -Wall -Wextra -Wno-unused-parameter -Wwrite-strings -Wcast-qual -Wmissing-field-initializers -pedantic -Wno-long-long -Wcovered-switch-default -Wnon-virtual-dtor -Wdelete-non-virtual-dtor -Wstring-conversion -fdiagnostics-color -flto=thin -O2 -g -DNDEBUG -isysroot /Applications/Xcode.app/Contents/Developer/Platforms/MacOSX.platform/Developer/SDKs/MacOSX10.14.sdk    -Wno-variadic-macros -Wno-gnu-zero-variadic-macro-arguments -fno-exceptions -fno-rtti -MD -MT unittests/ADT/CMakeFiles/ADTTests.dir/APIntTest.cpp.o -MF unittests/ADT/CMakeFiles/ADTTests.dir/APIntTest.cpp.o.d -o unittests/ADT/CMakeFiles/ADTTests.dir/APIntTest.cpp.o -c /Users/buildslave/jenkins/workspace/clang-stage2-Rthinlto-release_70/llvm/unittests/ADT/APIntTest.cpp
[3012/3408] /Users/buildslave/jenkins/workspace/clang-stage2-Rthinlto-release_70/host-compiler/bin/clang++  -DGTEST_HAS_RTTI=0 -DGTEST_HAS_TR1_TUPLE=0 -DGTEST_LANG_CXX11=1 -D__STDC_CONSTANT_MACROS -D__STDC_FORMAT_MACROS -D__STDC_LIMIT_MACROS -Iunittests/ADT -I/Users/buildslave/jenkins/workspace/clang-stage2-Rthinlto-release_70/llvm/unittests/ADT -I/Applications/Xcode.app/Contents/Developer/Platforms/MacOSX.platform/Developer/SDKs/MacOSX10.14.sdk/usr/include/libxml2 -Iinclude -I/Users/buildslave/jenkins/workspace/clang-stage2-Rthinlto-release_70/llvm/include -I/Users/buildslave/jenkins/workspace/clang-stage2-Rthinlto-release_70/llvm/utils/unittest/googletest/include -I/Users/buildslave/jenkins/workspace/clang-stage2-Rthinlto-release_70/llvm/utils/unittest/googlemock/include -fno-stack-protector -fno-common -Wno-profile-instr-unprofiled -fPIC -fvisibility-inlines-hidden -Werror=date-time -Werror=unguarded-availability-new -std=c++11 -fmodules -fmodules-cache-path=/Users/buildslave/jenkins/workspace/clang-stage2-Rthinlto-release_70/clang-build/Build/module.cache -fcxx-modules -gmodules -Wall -Wextra -Wno-unused-parameter -Wwrite-strings -Wcast-qual -Wmissing-field-initializers -pedantic -Wno-long-long -Wcovered-switch-default -Wnon-virtual-dtor -Wdelete-non-virtual-dtor -Wstring-conversion -fdiagnostics-color -flto=thin -O2 -g -DNDEBUG -isysroot /Applications/Xcode.app/Contents/Developer/Platforms/MacOSX.platform/Developer/SDKs/MacOSX10.14.sdk    -Wno-variadic-macros -Wno-gnu-zero-variadic-macro-arguments -fno-exceptions -fno-rtti -MD -MT unittests/ADT/CMakeFiles/ADTTests.dir/DepthFirstIteratorTest.cpp.o -MF unittests/ADT/CMakeFiles/ADTTests.dir/DepthFirstIteratorTest.cpp.o.d -o unittests/ADT/CMakeFiles/ADTTests.dir/DepthFirstIteratorTest.cpp.o -c /Users/buildslave/jenkins/workspace/clang-stage2-Rthinlto-release_70/llvm/unittests/ADT/DepthFirstIteratorTest.cpp
[3013/3408] /Users/buildslave/jenkins/workspace/clang-stage2-Rthinlto-release_70/host-compiler/bin/clang++  -DGTEST_HAS_RTTI=0 -DGTEST_HAS_TR1_TUPLE=0 -DGTEST_LANG_CXX11=1 -D__STDC_CONSTANT_MACROS -D__STDC_FORMAT_MACROS -D__STDC_LIMIT_MACROS -Iunittests/ADT -I/Users/buildslave/jenkins/workspace/clang-stage2-Rthinlto-release_70/llvm/unittests/ADT -I/Applications/Xcode.app/Contents/Developer/Platforms/MacOSX.platform/Developer/SDKs/MacOSX10.14.sdk/usr/include/libxml2 -Iinclude -I/Users/buildslave/jenkins/workspace/clang-stage2-Rthinlto-release_70/llvm/include -I/Users/buildslave/jenkins/workspace/clang-stage2-Rthinlto-release_70/llvm/utils/unittest/googletest/include -I/Users/buildslave/jenkins/workspace/clang-stage2-Rthinlto-release_70/llvm/utils/unittest/googlemock/include -fno-stack-protector -fno-common -Wno-profile-instr-unprofiled -fPIC -fvisibility-inlines-hidden -Werror=date-time -Werror=unguarded-availability-new -std=c++11 -fmodules -fmodules-cache-path=/Users/buildslave/jenkins/workspace/clang-stage2-Rthinlto-release_70/clang-build/Build/module.cache -fcxx-modules -gmodules -Wall -Wextra -Wno-unused-parameter -Wwrite-strings -Wcast-qual -Wmissing-field-initializers -pedantic -Wno-long-long -Wcovered-switch-default -Wnon-virtual-dtor -Wdelete-non-virtual-dtor -Wstring-conversion -fdiagnostics-color -flto=thin -O2 -g -DNDEBUG -isysroot /Applications/Xcode.app/Contents/Developer/Platforms/MacOSX.platform/Developer/SDKs/MacOSX10.14.sdk    -Wno-variadic-macros -Wno-gnu-zero-variadic-macro-arguments -fno-exceptions -fno-rtti -MD -MT unittests/ADT/CMakeFiles/ADTTests.dir/DAGDeltaAlgorithmTest.cpp.o -MF unittests/ADT/CMakeFiles/ADTTests.dir/DAGDeltaAlgorithmTest.cpp.o.d -o unittests/ADT/CMakeFiles/ADTTests.dir/DAGDeltaAlgorithmTest.cpp.o -c /Users/buildslave/jenkins/workspace/clang-stage2-Rthinlto-release_70/llvm/unittests/ADT/DAGDeltaAlgorithmTest.cpp
[3014/3408] /Users/buildslave/jenkins/workspace/clang-stage2-Rthinlto-release_70/host-compiler/bin/clang++  -DGTEST_HAS_RTTI=0 -DGTEST_HAS_TR1_TUPLE=0 -DGTEST_LANG_CXX11=1 -D__STDC_CONSTANT_MACROS -D__STDC_FORMAT_MACROS -D__STDC_LIMIT_MACROS -Iunittests/ADT -I/Users/buildslave/jenkins/workspace/clang-stage2-Rthinlto-release_70/llvm/unittests/ADT -I/Applications/Xcode.app/Contents/Developer/Platforms/MacOSX.platform/Developer/SDKs/MacOSX10.14.sdk/usr/include/libxml2 -Iinclude -I/Users/buildslave/jenkins/workspace/clang-stage2-Rthinlto-release_70/llvm/include -I/Users/buildslave/jenkins/workspace/clang-stage2-Rthinlto-release_70/llvm/utils/unittest/googletest/include -I/Users/buildslave/jenkins/workspace/clang-stage2-Rthinlto-release_70/llvm/utils/unittest/googlemock/include -fno-stack-protector -fno-common -Wno-profile-instr-unprofiled -fPIC -fvisibility-inlines-hidden -Werror=date-time -Werror=unguarded-availability-new -std=c++11 -fmodules -fmodules-cache-path=/Users/buildslave/jenkins/workspace/clang-stage2-Rthinlto-release_70/clang-build/Build/module.cache -fcxx-modules -gmodules -Wall -Wextra -Wno-unused-parameter -Wwrite-strings -Wcast-qual -Wmissing-field-initializers -pedantic -Wno-long-long -Wcovered-switch-default -Wnon-virtual-dtor -Wdelete-non-virtual-dtor -Wstring-conversion -fdiagnostics-color -flto=thin -O2 -g -DNDEBUG -isysroot /Applications/Xcode.app/Contents/Developer/Platforms/MacOSX.platform/Developer/SDKs/MacOSX10.14.sdk    -Wno-variadic-macros -Wno-gnu-zero-variadic-macro-arguments -fno-exceptions -fno-rtti -MD -MT unittests/ADT/CMakeFiles/ADTTests.dir/APFloatTest.cpp.o -MF unittests/ADT/CMakeFiles/ADTTests.dir/APFloatTest.cpp.o.d -o unittests/ADT/CMakeFiles/ADTTests.dir/APFloatTest.cpp.o -c /Users/buildslave/jenkins/workspace/clang-stage2-Rthinlto-release_70/llvm/unittests/ADT/APFloatTest.cpp
[3015/3408] /Users/buildslave/jenkins/workspace/clang-stage2-Rthinlto-release_70/host-compiler/bin/clang++  -DGTEST_HAS_RTTI=0 -DGTEST_HAS_TR1_TUPLE=0 -DGTEST_LANG_CXX11=1 -D__STDC_CONSTANT_MACROS -D__STDC_FORMAT_MACROS -D__STDC_LIMIT_MACROS -Iunittests/ADT -I/Users/buildslave/jenkins/workspace/clang-stage2-Rthinlto-release_70/llvm/unittests/ADT -I/Applications/Xcode.app/Contents/Developer/Platforms/MacOSX.platform/Developer/SDKs/MacOSX10.14.sdk/usr/include/libxml2 -Iinclude -I/Users/buildslave/jenkins/workspace/clang-stage2-Rthinlto-release_70/llvm/include -I/Users/buildslave/jenkins/workspace/clang-stage2-Rthinlto-release_70/llvm/utils/unittest/googletest/include -I/Users/buildslave/jenkins/workspace/clang-stage2-Rthinlto-release_70/llvm/utils/unittest/googlemock/include -fno-stack-protector -fno-common -Wno-profile-instr-unprofiled -fPIC -fvisibility-inlines-hidden -Werror=date-time -Werror=unguarded-availability-new -std=c++11 -fmodules -fmodules-cache-path=/Users/buildslave/jenkins/workspace/clang-stage2-Rthinlto-release_70/clang-build/Build/module.cache -fcxx-modules -gmodules -Wall -Wextra -Wno-unused-parameter -Wwrite-strings -Wcast-qual -Wmissing-field-initializers -pedantic -Wno-long-long -Wcovered-switch-default -Wnon-virtual-dtor -Wdelete-non-virtual-dtor -Wstring-conversion -fdiagnostics-color -flto=thin -O2 -g -DNDEBUG -isysroot /Applications/Xcode.app/Contents/Developer/Platforms/MacOSX.platform/Developer/SDKs/MacOSX10.14.sdk    -Wno-variadic-macros -Wno-gnu-zero-variadic-macro-arguments -fno-exceptions -fno-rtti -MD -MT unittests/ADT/CMakeFiles/ADTTests.dir/FoldingSet.cpp.o -MF unittests/ADT/CMakeFiles/ADTTests.dir/FoldingSet.cpp.o.d -o unittests/ADT/CMakeFiles/ADTTests.dir/FoldingSet.cpp.o -c /Users/buildslave/jenkins/workspace/clang-stage2-Rthinlto-release_70/llvm/unittests/ADT/FoldingSet.cpp
[3016/3408] /Users/buildslave/jenkins/workspace/clang-stage2-Rthinlto-release_70/host-compiler/bin/clang++  -DGTEST_HAS_RTTI=0 -DGTEST_HAS_TR1_TUPLE=0 -DGTEST_LANG_CXX11=1 -D__STDC_CONSTANT_MACROS -D__STDC_FORMAT_MACROS -D__STDC_LIMIT_MACROS -Iunittests/ADT -I/Users/buildslave/jenkins/workspace/clang-stage2-Rthinlto-release_70/llvm/unittests/ADT -I/Applications/Xcode.app/Contents/Developer/Platforms/MacOSX.platform/Developer/SDKs/MacOSX10.14.sdk/usr/include/libxml2 -Iinclude -I/Users/buildslave/jenkins/workspace/clang-stage2-Rthinlto-release_70/llvm/include -I/Users/buildslave/jenkins/workspace/clang-stage2-Rthinlto-release_70/llvm/utils/unittest/googletest/include -I/Users/buildslave/jenkins/workspace/clang-stage2-Rthinlto-release_70/llvm/utils/unittest/googlemock/include -fno-stack-protector -fno-common -Wno-profile-instr-unprofiled -fPIC -fvisibility-inlines-hidden -Werror=date-time -Werror=unguarded-availability-new -std=c++11 -fmodules -fmodules-cache-path=/Users/buildslave/jenkins/workspace/clang-stage2-Rthinlto-release_70/clang-build/Build/module.cache -fcxx-modules -gmodules -Wall -Wextra -Wno-unused-parameter -Wwrite-strings -Wcast-qual -Wmissing-field-initializers -pedantic -Wno-long-long -Wcovered-switch-default -Wnon-virtual-dtor -Wdelete-non-virtual-dtor -Wstring-conversion -fdiagnostics-color -flto=thin -O2 -g -DNDEBUG -isysroot /Applications/Xcode.app/Contents/Developer/Platforms/MacOSX.platform/Developer/SDKs/MacOSX10.14.sdk    -Wno-variadic-macros -Wno-gnu-zero-variadic-macro-arguments -fno-exceptions -fno-rtti -MD -MT unittests/ADT/CMakeFiles/ADTTests.dir/EquivalenceClassesTest.cpp.o -MF unittests/ADT/CMakeFiles/ADTTests.dir/EquivalenceClassesTest.cpp.o.d -o unittests/ADT/CMakeFiles/ADTTests.dir/EquivalenceClassesTest.cpp.o -c /Users/buildslave/jenkins/workspace/clang-stage2-Rthinlto-release_70/llvm/unittests/ADT/EquivalenceClassesTest.cpp
[3017/3408] /Users/buildslave/jenkins/workspace/clang-stage2-Rthinlto-release_70/host-compiler/bin/clang++  -DGTEST_HAS_RTTI=0 -DGTEST_HAS_TR1_TUPLE=0 -DGTEST_LANG_CXX11=1 -D__STDC_CONSTANT_MACROS -D__STDC_FORMAT_MACROS -D__STDC_LIMIT_MACROS -Iunittests/ADT -I/Users/buildslave/jenkins/workspace/clang-stage2-Rthinlto-release_70/llvm/unittests/ADT -I/Applications/Xcode.app/Contents/Developer/Platforms/MacOSX.platform/Developer/SDKs/MacOSX10.14.sdk/usr/include/libxml2 -Iinclude -I/Users/buildslave/jenkins/workspace/clang-stage2-Rthinlto-release_70/llvm/include -I/Users/buildslave/jenkins/workspace/clang-stage2-Rthinlto-release_70/llvm/utils/unittest/googletest/include -I/Users/buildslave/jenkins/workspace/clang-stage2-Rthinlto-release_70/llvm/utils/unittest/googlemock/include -fno-stack-protector -fno-common -Wno-profile-instr-unprofiled -fPIC -fvisibility-inlines-hidden -Werror=date-time -Werror=unguarded-availability-new -std=c++11 -fmodules -fmodules-cache-path=/Users/buildslave/jenkins/workspace/clang-stage2-Rthinlto-release_70/clang-build/Build/module.cache -fcxx-modules -gmodules -Wall -Wextra -Wno-unused-parameter -Wwrite-strings -Wcast-qual -Wmissing-field-initializers -pedantic -Wno-long-long -Wcovered-switch-default -Wnon-virtual-dtor -Wdelete-non-virtual-dtor -Wstring-conversion -fdiagnostics-color -flto=thin -O2 -g -DNDEBUG -isysroot /Applications/Xcode.app/Contents/Developer/Platforms/MacOSX.platform/Developer/SDKs/MacOSX10.14.sdk    -Wno-variadic-macros -Wno-gnu-zero-variadic-macro-arguments -fno-exceptions -fno-rtti -MD -MT unittests/ADT/CMakeFiles/ADTTests.dir/FunctionExtrasTest.cpp.o -MF unittests/ADT/CMakeFiles/ADTTests.dir/FunctionExtrasTest.cpp.o.d -o unittests/ADT/CMakeFiles/ADTTests.dir/FunctionExtrasTest.cpp.o -c /Users/buildslave/jenkins/workspace/clang-stage2-Rthinlto-release_70/llvm/unittests/ADT/FunctionExtrasTest.cpp
[3018/3408] /Users/buildslave/jenkins/workspace/clang-stage2-Rthinlto-release_70/host-compiler/bin/clang++  -DGTEST_HAS_RTTI=0 -DGTEST_HAS_TR1_TUPLE=0 -DGTEST_LANG_CXX11=1 -D__STDC_CONSTANT_MACROS -D__STDC_FORMAT_MACROS -D__STDC_LIMIT_MACROS -Iunittests/ADT -I/Users/buildslave/jenkins/workspace/clang-stage2-Rthinlto-release_70/llvm/unittests/ADT -I/Applications/Xcode.app/Contents/Developer/Platforms/MacOSX.platform/Developer/SDKs/MacOSX10.14.sdk/usr/include/libxml2 -Iinclude -I/Users/buildslave/jenkins/workspace/clang-stage2-Rthinlto-release_70/llvm/include -I/Users/buildslave/jenkins/workspace/clang-stage2-Rthinlto-release_70/llvm/utils/unittest/googletest/include -I/Users/buildslave/jenkins/workspace/clang-stage2-Rthinlto-release_70/llvm/utils/unittest/googlemock/include -fno-stack-protector -fno-common -Wno-profile-instr-unprofiled -fPIC -fvisibility-inlines-hidden -Werror=date-time -Werror=unguarded-availability-new -std=c++11 -fmodules -fmodules-cache-path=/Users/buildslave/jenkins/workspace/clang-stage2-Rthinlto-release_70/clang-build/Build/module.cache -fcxx-modules -gmodules -Wall -Wextra -Wno-unused-parameter -Wwrite-strings -Wcast-qual -Wmissing-field-initializers -pedantic -Wno-long-long -Wcovered-switch-default -Wnon-virtual-dtor -Wdelete-non-virtual-dtor -Wstring-conversion -fdiagnostics-color -flto=thin -O2 -g -DNDEBUG -isysroot /Applications/Xcode.app/Contents/Developer/Platforms/MacOSX.platform/Developer/SDKs/MacOSX10.14.sdk    -Wno-variadic-macros -Wno-gnu-zero-variadic-macro-arguments -fno-exceptions -fno-rtti -MD -MT unittests/ADT/CMakeFiles/ADTTests.dir/HashingTest.cpp.o -MF unittests/ADT/CMakeFiles/ADTTests.dir/HashingTest.cpp.o.d -o unittests/ADT/CMakeFiles/ADTTests.dir/HashingTest.cpp.o -c /Users/buildslave/jenkins/workspace/clang-stage2-Rthinlto-release_70/llvm/unittests/ADT/HashingTest.cpp
[3019/3408] /Users/buildslave/jenkins/workspace/clang-stage2-Rthinlto-release_70/host-compiler/bin/clang++  -DGTEST_HAS_RTTI=0 -DGTEST_HAS_TR1_TUPLE=0 -DGTEST_LANG_CXX11=1 -D__STDC_CONSTANT_MACROS -D__STDC_FORMAT_MACROS -D__STDC_LIMIT_MACROS -Iunittests/ADT -I/Users/buildslave/jenkins/workspace/clang-stage2-Rthinlto-release_70/llvm/unittests/ADT -I/Applications/Xcode.app/Contents/Developer/Platforms/MacOSX.platform/Developer/SDKs/MacOSX10.14.sdk/usr/include/libxml2 -Iinclude -I/Users/buildslave/jenkins/workspace/clang-stage2-Rthinlto-release_70/llvm/include -I/Users/buildslave/jenkins/workspace/clang-stage2-Rthinlto-release_70/llvm/utils/unittest/googletest/include -I/Users/buildslave/jenkins/workspace/clang-stage2-Rthinlto-release_70/llvm/utils/unittest/googlemock/include -fno-stack-protector -fno-common -Wno-profile-instr-unprofiled -fPIC -fvisibility-inlines-hidden -Werror=date-time -Werror=unguarded-availability-new -std=c++11 -fmodules -fmodules-cache-path=/Users/buildslave/jenkins/workspace/clang-stage2-Rthinlto-release_70/clang-build/Build/module.cache -fcxx-modules -gmodules -Wall -Wextra -Wno-unused-parameter -Wwrite-strings -Wcast-qual -Wmissing-field-initializers -pedantic -Wno-long-long -Wcovered-switch-default -Wnon-virtual-dtor -Wdelete-non-virtual-dtor -Wstring-conversion -fdiagnostics-color -flto=thin -O2 -g -DNDEBUG -isysroot /Applications/Xcode.app/Contents/Developer/Platforms/MacOSX.platform/Developer/SDKs/MacOSX10.14.sdk    -Wno-variadic-macros -Wno-gnu-zero-variadic-macro-arguments -fno-exceptions -fno-rtti -MD -MT unittests/ADT/CMakeFiles/ADTTests.dir/FunctionRefTest.cpp.o -MF unittests/ADT/CMakeFiles/ADTTests.dir/FunctionRefTest.cpp.o.d -o unittests/ADT/CMakeFiles/ADTTests.dir/FunctionRefTest.cpp.o -c /Users/buildslave/jenkins/workspace/clang-stage2-Rthinlto-release_70/llvm/unittests/ADT/FunctionRefTest.cpp
[3020/3408] /Users/buildslave/jenkins/workspace/clang-stage2-Rthinlto-release_70/host-compiler/bin/clang++  -DGTEST_HAS_RTTI=0 -DGTEST_HAS_TR1_TUPLE=0 -DGTEST_LANG_CXX11=1 -D__STDC_CONSTANT_MACROS -D__STDC_FORMAT_MACROS -D__STDC_LIMIT_MACROS -Iunittests/ADT -I/Users/buildslave/jenkins/workspace/clang-stage2-Rthinlto-release_70/llvm/unittests/ADT -I/Applications/Xcode.app/Contents/Developer/Platforms/MacOSX.platform/Developer/SDKs/MacOSX10.14.sdk/usr/include/libxml2 -Iinclude -I/Users/buildslave/jenkins/workspace/clang-stage2-Rthinlto-release_70/llvm/include -I/Users/buildslave/jenkins/workspace/clang-stage2-Rthinlto-release_70/llvm/utils/unittest/googletest/include -I/Users/buildslave/jenkins/workspace/clang-stage2-Rthinlto-release_70/llvm/utils/unittest/googlemock/include -fno-stack-protector -fno-common -Wno-profile-instr-unprofiled -fPIC -fvisibility-inlines-hidden -Werror=date-time -Werror=unguarded-availability-new -std=c++11 -fmodules -fmodules-cache-path=/Users/buildslave/jenkins/workspace/clang-stage2-Rthinlto-release_70/clang-build/Build/module.cache -fcxx-modules -gmodules -Wall -Wextra -Wno-unused-parameter -Wwrite-strings -Wcast-qual -Wmissing-field-initializers -pedantic -Wno-long-long -Wcovered-switch-default -Wnon-virtual-dtor -Wdelete-non-virtual-dtor -Wstring-conversion -fdiagnostics-color -flto=thin -O2 -g -DNDEBUG -isysroot /Applications/Xcode.app/Contents/Developer/Platforms/MacOSX.platform/Developer/SDKs/MacOSX10.14.sdk    -Wno-variadic-macros -Wno-gnu-zero-variadic-macro-arguments -fno-exceptions -fno-rtti -MD -MT unittests/ADT/CMakeFiles/ADTTests.dir/IListBaseTest.cpp.o -MF unittests/ADT/CMakeFiles/ADTTests.dir/IListBaseTest.cpp.o.d -o unittests/ADT/CMakeFiles/ADTTests.dir/IListBaseTest.cpp.o -c /Users/buildslave/jenkins/workspace/clang-stage2-Rthinlto-release_70/llvm/unittests/ADT/IListBaseTest.cpp
[3021/3408] /Users/buildslave/jenkins/workspace/clang-stage2-Rthinlto-release_70/host-compiler/bin/clang++  -DGTEST_HAS_RTTI=0 -DGTEST_HAS_TR1_TUPLE=0 -DGTEST_LANG_CXX11=1 -D__STDC_CONSTANT_MACROS -D__STDC_FORMAT_MACROS -D__STDC_LIMIT_MACROS -Iunittests/ADT -I/Users/buildslave/jenkins/workspace/clang-stage2-Rthinlto-release_70/llvm/unittests/ADT -I/Applications/Xcode.app/Contents/Developer/Platforms/MacOSX.platform/Developer/SDKs/MacOSX10.14.sdk/usr/include/libxml2 -Iinclude -I/Users/buildslave/jenkins/workspace/clang-stage2-Rthinlto-release_70/llvm/include -I/Users/buildslave/jenkins/workspace/clang-stage2-Rthinlto-release_70/llvm/utils/unittest/googletest/include -I/Users/buildslave/jenkins/workspace/clang-stage2-Rthinlto-release_70/llvm/utils/unittest/googlemock/include -fno-stack-protector -fno-common -Wno-profile-instr-unprofiled -fPIC -fvisibility-inlines-hidden -Werror=date-time -Werror=unguarded-availability-new -std=c++11 -fmodules -fmodules-cache-path=/Users/buildslave/jenkins/workspace/clang-stage2-Rthinlto-release_70/clang-build/Build/module.cache -fcxx-modules -gmodules -Wall -Wextra -Wno-unused-parameter -Wwrite-strings -Wcast-qual -Wmissing-field-initializers -pedantic -Wno-long-long -Wcovered-switch-default -Wnon-virtual-dtor -Wdelete-non-virtual-dtor -Wstring-conversion -fdiagnostics-color -flto=thin -O2 -g -DNDEBUG -isysroot /Applications/Xcode.app/Contents/Developer/Platforms/MacOSX.platform/Developer/SDKs/MacOSX10.14.sdk    -Wno-variadic-macros -Wno-gnu-zero-variadic-macro-arguments -fno-exceptions -fno-rtti -MD -MT unittests/ADT/CMakeFiles/ADTTests.dir/IListIteratorTest.cpp.o -MF unittests/ADT/CMakeFiles/ADTTests.dir/IListIteratorTest.cpp.o.d -o unittests/ADT/CMakeFiles/ADTTests.dir/IListIteratorTest.cpp.o -c /Users/buildslave/jenkins/workspace/clang-stage2-Rthinlto-release_70/llvm/unittests/ADT/IListIteratorTest.cpp
[3022/3408] /Users/buildslave/jenkins/workspace/clang-stage2-Rthinlto-release_70/host-compiler/bin/clang++  -DGTEST_HAS_RTTI=0 -DGTEST_HAS_TR1_TUPLE=0 -DGTEST_LANG_CXX11=1 -D__STDC_CONSTANT_MACROS -D__STDC_FORMAT_MACROS -D__STDC_LIMIT_MACROS -Iunittests/ADT -I/Users/buildslave/jenkins/workspace/clang-stage2-Rthinlto-release_70/llvm/unittests/ADT -I/Applications/Xcode.app/Contents/Developer/Platforms/MacOSX.platform/Developer/SDKs/MacOSX10.14.sdk/usr/include/libxml2 -Iinclude -I/Users/buildslave/jenkins/workspace/clang-stage2-Rthinlto-release_70/llvm/include -I/Users/buildslave/jenkins/workspace/clang-stage2-Rthinlto-release_70/llvm/utils/unittest/googletest/include -I/Users/buildslave/jenkins/workspace/clang-stage2-Rthinlto-release_70/llvm/utils/unittest/googlemock/include -fno-stack-protector -fno-common -Wno-profile-instr-unprofiled -fPIC -fvisibility-inlines-hidden -Werror=date-time -Werror=unguarded-availability-new -std=c++11 -fmodules -fmodules-cache-path=/Users/buildslave/jenkins/workspace/clang-stage2-Rthinlto-release_70/clang-build/Build/module.cache -fcxx-modules -gmodules -Wall -Wextra -Wno-unused-parameter -Wwrite-strings -Wcast-qual -Wmissing-field-initializers -pedantic -Wno-long-long -Wcovered-switch-default -Wnon-virtual-dtor -Wdelete-non-virtual-dtor -Wstring-conversion -fdiagnostics-color -flto=thin -O2 -g -DNDEBUG -isysroot /Applications/Xcode.app/Contents/Developer/Platforms/MacOSX.platform/Developer/SDKs/MacOSX10.14.sdk    -Wno-variadic-macros -Wno-gnu-zero-variadic-macro-arguments -fno-exceptions -fno-rtti -MD -MT unittests/ADT/CMakeFiles/ADTTests.dir/IListNodeTest.cpp.o -MF unittests/ADT/CMakeFiles/ADTTests.dir/IListNodeTest.cpp.o.d -o unittests/ADT/CMakeFiles/ADTTests.dir/IListNodeTest.cpp.o -c /Users/buildslave/jenkins/workspace/clang-stage2-Rthinlto-release_70/llvm/unittests/ADT/IListNodeTest.cpp
[3023/3408] /Users/buildslave/jenkins/workspace/clang-stage2-Rthinlto-release_70/host-compiler/bin/clang++  -DGTEST_HAS_RTTI=0 -DGTEST_HAS_TR1_TUPLE=0 -DGTEST_LANG_CXX11=1 -D__STDC_CONSTANT_MACROS -D__STDC_FORMAT_MACROS -D__STDC_LIMIT_MACROS -Iunittests/ADT -I/Users/buildslave/jenkins/workspace/clang-stage2-Rthinlto-release_70/llvm/unittests/ADT -I/Applications/Xcode.app/Contents/Developer/Platforms/MacOSX.platform/Developer/SDKs/MacOSX10.14.sdk/usr/include/libxml2 -Iinclude -I/Users/buildslave/jenkins/workspace/clang-stage2-Rthinlto-release_70/llvm/include -I/Users/buildslave/jenkins/workspace/clang-stage2-Rthinlto-release_70/llvm/utils/unittest/googletest/include -I/Users/buildslave/jenkins/workspace/clang-stage2-Rthinlto-release_70/llvm/utils/unittest/googlemock/include -fno-stack-protector -fno-common -Wno-profile-instr-unprofiled -fPIC -fvisibility-inlines-hidden -Werror=date-time -Werror=unguarded-availability-new -std=c++11 -fmodules -fmodules-cache-path=/Users/buildslave/jenkins/workspace/clang-stage2-Rthinlto-release_70/clang-build/Build/module.cache -fcxx-modules -gmodules -Wall -Wextra -Wno-unused-parameter -Wwrite-strings -Wcast-qual -Wmissing-field-initializers -pedantic -Wno-long-long -Wcovered-switch-default -Wnon-virtual-dtor -Wdelete-non-virtual-dtor -Wstring-conversion -fdiagnostics-color -flto=thin -O2 -g -DNDEBUG -isysroot /Applications/Xcode.app/Contents/Developer/Platforms/MacOSX.platform/Developer/SDKs/MacOSX10.14.sdk    -Wno-variadic-macros -Wno-gnu-zero-variadic-macro-arguments -fno-exceptions -fno-rtti -MD -MT unittests/ADT/CMakeFiles/ADTTests.dir/IListNodeBaseTest.cpp.o -MF unittests/ADT/CMakeFiles/ADTTests.dir/IListNodeBaseTest.cpp.o.d -o unittests/ADT/CMakeFiles/ADTTests.dir/IListNodeBaseTest.cpp.o -c /Users/buildslave/jenkins/workspace/clang-stage2-Rthinlto-release_70/llvm/unittests/ADT/IListNodeBaseTest.cpp
[3024/3408] /Users/buildslave/jenkins/workspace/clang-stage2-Rthinlto-release_70/host-compiler/bin/clang++  -DGTEST_HAS_RTTI=0 -DGTEST_HAS_TR1_TUPLE=0 -DGTEST_LANG_CXX11=1 -D__STDC_CONSTANT_MACROS -D__STDC_FORMAT_MACROS -D__STDC_LIMIT_MACROS -Iunittests/ADT -I/Users/buildslave/jenkins/workspace/clang-stage2-Rthinlto-release_70/llvm/unittests/ADT -I/Applications/Xcode.app/Contents/Developer/Platforms/MacOSX.platform/Developer/SDKs/MacOSX10.14.sdk/usr/include/libxml2 -Iinclude -I/Users/buildslave/jenkins/workspace/clang-stage2-Rthinlto-release_70/llvm/include -I/Users/buildslave/jenkins/workspace/clang-stage2-Rthinlto-release_70/llvm/utils/unittest/googletest/include -I/Users/buildslave/jenkins/workspace/clang-stage2-Rthinlto-release_70/llvm/utils/unittest/googlemock/include -fno-stack-protector -fno-common -Wno-profile-instr-unprofiled -fPIC -fvisibility-inlines-hidden -Werror=date-time -Werror=unguarded-availability-new -std=c++11 -fmodules -fmodules-cache-path=/Users/buildslave/jenkins/workspace/clang-stage2-Rthinlto-release_70/clang-build/Build/module.cache -fcxx-modules -gmodules -Wall -Wextra -Wno-unused-parameter -Wwrite-strings -Wcast-qual -Wmissing-field-initializers -pedantic -Wno-long-long -Wcovered-switch-default -Wnon-virtual-dtor -Wdelete-non-virtual-dtor -Wstring-conversion -fdiagnostics-color -flto=thin -O2 -g -DNDEBUG -isysroot /Applications/Xcode.app/Contents/Developer/Platforms/MacOSX.platform/Developer/SDKs/MacOSX10.14.sdk    -Wno-variadic-macros -Wno-gnu-zero-variadic-macro-arguments -fno-exceptions -fno-rtti -MD -MT unittests/ADT/CMakeFiles/ADTTests.dir/IListSentinelTest.cpp.o -MF unittests/ADT/CMakeFiles/ADTTests.dir/IListSentinelTest.cpp.o.d -o unittests/ADT/CMakeFiles/ADTTests.dir/IListSentinelTest.cpp.o -c /Users/buildslave/jenkins/workspace/clang-stage2-Rthinlto-release_70/llvm/unittests/ADT/IListSentinelTest.cpp
[3025/3408] /Users/buildslave/jenkins/workspace/clang-stage2-Rthinlto-release_70/host-compiler/bin/clang++  -DGTEST_HAS_RTTI=0 -DGTEST_HAS_TR1_TUPLE=0 -DGTEST_LANG_CXX11=1 -D__STDC_CONSTANT_MACROS -D__STDC_FORMAT_MACROS -D__STDC_LIMIT_MACROS -Iunittests/ADT -I/Users/buildslave/jenkins/workspace/clang-stage2-Rthinlto-release_70/llvm/unittests/ADT -I/Applications/Xcode.app/Contents/Developer/Platforms/MacOSX.platform/Developer/SDKs/MacOSX10.14.sdk/usr/include/libxml2 -Iinclude -I/Users/buildslave/jenkins/workspace/clang-stage2-Rthinlto-release_70/llvm/include -I/Users/buildslave/jenkins/workspace/clang-stage2-Rthinlto-release_70/llvm/utils/unittest/googletest/include -I/Users/buildslave/jenkins/workspace/clang-stage2-Rthinlto-release_70/llvm/utils/unittest/googlemock/include -fno-stack-protector -fno-common -Wno-profile-instr-unprofiled -fPIC -fvisibility-inlines-hidden -Werror=date-time -Werror=unguarded-availability-new -std=c++11 -fmodules -fmodules-cache-path=/Users/buildslave/jenkins/workspace/clang-stage2-Rthinlto-release_70/clang-build/Build/module.cache -fcxx-modules -gmodules -Wall -Wextra -Wno-unused-parameter -Wwrite-strings -Wcast-qual -Wmissing-field-initializers -pedantic -Wno-long-long -Wcovered-switch-default -Wnon-virtual-dtor -Wdelete-non-virtual-dtor -Wstring-conversion -fdiagnostics-color -flto=thin -O2 -g -DNDEBUG -isysroot /Applications/Xcode.app/Contents/Developer/Platforms/MacOSX.platform/Developer/SDKs/MacOSX10.14.sdk    -Wno-variadic-macros -Wno-gnu-zero-variadic-macro-arguments -fno-exceptions -fno-rtti -MD -MT unittests/ADT/CMakeFiles/ADTTests.dir/DenseSetTest.cpp.o -MF unittests/ADT/CMakeFiles/ADTTests.dir/DenseSetTest.cpp.o.d -o unittests/ADT/CMakeFiles/ADTTests.dir/DenseSetTest.cpp.o -c /Users/buildslave/jenkins/workspace/clang-stage2-Rthinlto-release_70/llvm/unittests/ADT/DenseSetTest.cpp
[3026/3408] /Users/buildslave/jenkins/workspace/clang-stage2-Rthinlto-release_70/host-compiler/bin/clang++  -DGTEST_HAS_RTTI=0 -DGTEST_HAS_TR1_TUPLE=0 -DGTEST_LANG_CXX11=1 -D__STDC_CONSTANT_MACROS -D__STDC_FORMAT_MACROS -D__STDC_LIMIT_MACROS -Iunittests/ADT -I/Users/buildslave/jenkins/workspace/clang-stage2-Rthinlto-release_70/llvm/unittests/ADT -I/Applications/Xcode.app/Contents/Developer/Platforms/MacOSX.platform/Developer/SDKs/MacOSX10.14.sdk/usr/include/libxml2 -Iinclude -I/Users/buildslave/jenkins/workspace/clang-stage2-Rthinlto-release_70/llvm/include -I/Users/buildslave/jenkins/workspace/clang-stage2-Rthinlto-release_70/llvm/utils/unittest/googletest/include -I/Users/buildslave/jenkins/workspace/clang-stage2-Rthinlto-release_70/llvm/utils/unittest/googlemock/include -fno-stack-protector -fno-common -Wno-profile-instr-unprofiled -fPIC -fvisibility-inlines-hidden -Werror=date-time -Werror=unguarded-availability-new -std=c++11 -fmodules -fmodules-cache-path=/Users/buildslave/jenkins/workspace/clang-stage2-Rthinlto-release_70/clang-build/Build/module.cache -fcxx-modules -gmodules -Wall -Wextra -Wno-unused-parameter -Wwrite-strings -Wcast-qual -Wmissing-field-initializers -pedantic -Wno-long-long -Wcovered-switch-default -Wnon-virtual-dtor -Wdelete-non-virtual-dtor -Wstring-conversion -fdiagnostics-color -flto=thin -O2 -g -DNDEBUG -isysroot /Applications/Xcode.app/Contents/Developer/Platforms/MacOSX.platform/Developer/SDKs/MacOSX10.14.sdk    -Wno-variadic-macros -Wno-gnu-zero-variadic-macro-arguments -fno-exceptions -fno-rtti -MD -MT unittests/ADT/CMakeFiles/ADTTests.dir/ImmutableMapTest.cpp.o -MF unittests/ADT/CMakeFiles/ADTTests.dir/ImmutableMapTest.cpp.o.d -o unittests/ADT/CMakeFiles/ADTTests.dir/ImmutableMapTest.cpp.o -c /Users/buildslave/jenkins/workspace/clang-stage2-Rthinlto-release_70/llvm/unittests/ADT/ImmutableMapTest.cpp
[3027/3408] /Users/buildslave/jenkins/workspace/clang-stage2-Rthinlto-release_70/host-compiler/bin/clang++  -DGTEST_HAS_RTTI=0 -DGTEST_HAS_TR1_TUPLE=0 -DGTEST_LANG_CXX11=1 -D__STDC_CONSTANT_MACROS -D__STDC_FORMAT_MACROS -D__STDC_LIMIT_MACROS -Iunittests/ADT -I/Users/buildslave/jenkins/workspace/clang-stage2-Rthinlto-release_70/llvm/unittests/ADT -I/Applications/Xcode.app/Contents/Developer/Platforms/MacOSX.platform/Developer/SDKs/MacOSX10.14.sdk/usr/include/libxml2 -Iinclude -I/Users/buildslave/jenkins/workspace/clang-stage2-Rthinlto-release_70/llvm/include -I/Users/buildslave/jenkins/workspace/clang-stage2-Rthinlto-release_70/llvm/utils/unittest/googletest/include -I/Users/buildslave/jenkins/workspace/clang-stage2-Rthinlto-release_70/llvm/utils/unittest/googlemock/include -fno-stack-protector -fno-common -Wno-profile-instr-unprofiled -fPIC -fvisibility-inlines-hidden -Werror=date-time -Werror=unguarded-availability-new -std=c++11 -fmodules -fmodules-cache-path=/Users/buildslave/jenkins/workspace/clang-stage2-Rthinlto-release_70/clang-build/Build/module.cache -fcxx-modules -gmodules -Wall -Wextra -Wno-unused-parameter -Wwrite-strings -Wcast-qual -Wmissing-field-initializers -pedantic -Wno-long-long -Wcovered-switch-default -Wnon-virtual-dtor -Wdelete-non-virtual-dtor -Wstring-conversion -fdiagnostics-color -flto=thin -O2 -g -DNDEBUG -isysroot /Applications/Xcode.app/Contents/Developer/Platforms/MacOSX.platform/Developer/SDKs/MacOSX10.14.sdk    -Wno-variadic-macros -Wno-gnu-zero-variadic-macro-arguments -fno-exceptions -fno-rtti -MD -MT unittests/ADT/CMakeFiles/ADTTests.dir/IListTest.cpp.o -MF unittests/ADT/CMakeFiles/ADTTests.dir/IListTest.cpp.o.d -o unittests/ADT/CMakeFiles/ADTTests.dir/IListTest.cpp.o -c /Users/buildslave/jenkins/workspace/clang-stage2-Rthinlto-release_70/llvm/unittests/ADT/IListTest.cpp
[3028/3408] /Users/buildslave/jenkins/workspace/clang-stage2-Rthinlto-release_70/host-compiler/bin/clang++  -DGTEST_HAS_RTTI=0 -D__STDC_CONSTANT_MACROS -D__STDC_FORMAT_MACROS -D__STDC_LIMIT_MACROS -Itools/yaml2obj -I/Users/buildslave/jenkins/workspace/clang-stage2-Rthinlto-release_70/llvm/tools/yaml2obj -I/Applications/Xcode.app/Contents/Developer/Platforms/MacOSX.platform/Developer/SDKs/MacOSX10.14.sdk/usr/include/libxml2 -Iinclude -I/Users/buildslave/jenkins/workspace/clang-stage2-Rthinlto-release_70/llvm/include -fno-stack-protector -fno-common -Wno-profile-instr-unprofiled -fPIC -fvisibility-inlines-hidden -Werror=date-time -Werror=unguarded-availability-new -std=c++11 -fmodules -fmodules-cache-path=/Users/buildslave/jenkins/workspace/clang-stage2-Rthinlto-release_70/clang-build/Build/module.cache -fcxx-modules -gmodules -Wall -Wextra -Wno-unused-parameter -Wwrite-strings -Wcast-qual -Wmissing-field-initializers -pedantic -Wno-long-long -Wcovered-switch-default -Wnon-virtual-dtor -Wdelete-non-virtual-dtor -Wstring-conversion -fdiagnostics-color -flto=thin -O2 -g -DNDEBUG -isysroot /Applications/Xcode.app/Contents/Developer/Platforms/MacOSX.platform/Developer/SDKs/MacOSX10.14.sdk    -fno-exceptions -fno-rtti -MD -MT tools/yaml2obj/CMakeFiles/yaml2obj.dir/yaml2elf.cpp.o -MF tools/yaml2obj/CMakeFiles/yaml2obj.dir/yaml2elf.cpp.o.d -o tools/yaml2obj/CMakeFiles/yaml2obj.dir/yaml2elf.cpp.o -c /Users/buildslave/jenkins/workspace/clang-stage2-Rthinlto-release_70/llvm/tools/yaml2obj/yaml2elf.cpp
[3029/3408] /Users/buildslave/jenkins/workspace/clang-stage2-Rthinlto-release_70/host-compiler/bin/clang++  -DGTEST_HAS_RTTI=0 -DGTEST_HAS_TR1_TUPLE=0 -DGTEST_LANG_CXX11=1 -D__STDC_CONSTANT_MACROS -D__STDC_FORMAT_MACROS -D__STDC_LIMIT_MACROS -Iunittests/ADT -I/Users/buildslave/jenkins/workspace/clang-stage2-Rthinlto-release_70/llvm/unittests/ADT -I/Applications/Xcode.app/Contents/Developer/Platforms/MacOSX.platform/Developer/SDKs/MacOSX10.14.sdk/usr/include/libxml2 -Iinclude -I/Users/buildslave/jenkins/workspace/clang-stage2-Rthinlto-release_70/llvm/include -I/Users/buildslave/jenkins/workspace/clang-stage2-Rthinlto-release_70/llvm/utils/unittest/googletest/include -I/Users/buildslave/jenkins/workspace/clang-stage2-Rthinlto-release_70/llvm/utils/unittest/googlemock/include -fno-stack-protector -fno-common -Wno-profile-instr-unprofiled -fPIC -fvisibility-inlines-hidden -Werror=date-time -Werror=unguarded-availability-new -std=c++11 -fmodules -fmodules-cache-path=/Users/buildslave/jenkins/workspace/clang-stage2-Rthinlto-release_70/clang-build/Build/module.cache -fcxx-modules -gmodules -Wall -Wextra -Wno-unused-parameter -Wwrite-strings -Wcast-qual -Wmissing-field-initializers -pedantic -Wno-long-long -Wcovered-switch-default -Wnon-virtual-dtor -Wdelete-non-virtual-dtor -Wstring-conversion -fdiagnostics-color -flto=thin -O2 -g -DNDEBUG -isysroot /Applications/Xcode.app/Contents/Developer/Platforms/MacOSX.platform/Developer/SDKs/MacOSX10.14.sdk    -Wno-variadic-macros -Wno-gnu-zero-variadic-macro-arguments -fno-exceptions -fno-rtti -MD -MT unittests/ADT/CMakeFiles/ADTTests.dir/IntEqClassesTest.cpp.o -MF unittests/ADT/CMakeFiles/ADTTests.dir/IntEqClassesTest.cpp.o.d -o unittests/ADT/CMakeFiles/ADTTests.dir/IntEqClassesTest.cpp.o -c /Users/buildslave/jenkins/workspace/clang-stage2-Rthinlto-release_70/llvm/unittests/ADT/IntEqClassesTest.cpp
[3030/3408] /Users/buildslave/jenkins/workspace/clang-stage2-Rthinlto-release_70/host-compiler/bin/clang++  -DGTEST_HAS_RTTI=0 -DGTEST_HAS_TR1_TUPLE=0 -DGTEST_LANG_CXX11=1 -D__STDC_CONSTANT_MACROS -D__STDC_FORMAT_MACROS -D__STDC_LIMIT_MACROS -Iunittests/ADT -I/Users/buildslave/jenkins/workspace/clang-stage2-Rthinlto-release_70/llvm/unittests/ADT -I/Applications/Xcode.app/Contents/Developer/Platforms/MacOSX.platform/Developer/SDKs/MacOSX10.14.sdk/usr/include/libxml2 -Iinclude -I/Users/buildslave/jenkins/workspace/clang-stage2-Rthinlto-release_70/llvm/include -I/Users/buildslave/jenkins/workspace/clang-stage2-Rthinlto-release_70/llvm/utils/unittest/googletest/include -I/Users/buildslave/jenkins/workspace/clang-stage2-Rthinlto-release_70/llvm/utils/unittest/googlemock/include -fno-stack-protector -fno-common -Wno-profile-instr-unprofiled -fPIC -fvisibility-inlines-hidden -Werror=date-time -Werror=unguarded-availability-new -std=c++11 -fmodules -fmodules-cache-path=/Users/buildslave/jenkins/workspace/clang-stage2-Rthinlto-release_70/clang-build/Build/module.cache -fcxx-modules -gmodules -Wall -Wextra -Wno-unused-parameter -Wwrite-strings -Wcast-qual -Wmissing-field-initializers -pedantic -Wno-long-long -Wcovered-switch-default -Wnon-virtual-dtor -Wdelete-non-virtual-dtor -Wstring-conversion -fdiagnostics-color -flto=thin -O2 -g -DNDEBUG -isysroot /Applications/Xcode.app/Contents/Developer/Platforms/MacOSX.platform/Developer/SDKs/MacOSX10.14.sdk    -Wno-variadic-macros -Wno-gnu-zero-variadic-macro-arguments -fno-exceptions -fno-rtti -MD -MT unittests/ADT/CMakeFiles/ADTTests.dir/IntrusiveRefCntPtrTest.cpp.o -MF unittests/ADT/CMakeFiles/ADTTests.dir/IntrusiveRefCntPtrTest.cpp.o.d -o unittests/ADT/CMakeFiles/ADTTests.dir/IntrusiveRefCntPtrTest.cpp.o -c /Users/buildslave/jenkins/workspace/clang-stage2-Rthinlto-release_70/llvm/unittests/ADT/IntrusiveRefCntPtrTest.cpp
[3031/3408] /Users/buildslave/jenkins/workspace/clang-stage2-Rthinlto-release_70/host-compiler/bin/clang++  -DGTEST_HAS_RTTI=0 -DGTEST_HAS_TR1_TUPLE=0 -DGTEST_LANG_CXX11=1 -D__STDC_CONSTANT_MACROS -D__STDC_FORMAT_MACROS -D__STDC_LIMIT_MACROS -Iunittests/ADT -I/Users/buildslave/jenkins/workspace/clang-stage2-Rthinlto-release_70/llvm/unittests/ADT -I/Applications/Xcode.app/Contents/Developer/Platforms/MacOSX.platform/Developer/SDKs/MacOSX10.14.sdk/usr/include/libxml2 -Iinclude -I/Users/buildslave/jenkins/workspace/clang-stage2-Rthinlto-release_70/llvm/include -I/Users/buildslave/jenkins/workspace/clang-stage2-Rthinlto-release_70/llvm/utils/unittest/googletest/include -I/Users/buildslave/jenkins/workspace/clang-stage2-Rthinlto-release_70/llvm/utils/unittest/googlemock/include -fno-stack-protector -fno-common -Wno-profile-instr-unprofiled -fPIC -fvisibility-inlines-hidden -Werror=date-time -Werror=unguarded-availability-new -std=c++11 -fmodules -fmodules-cache-path=/Users/buildslave/jenkins/workspace/clang-stage2-Rthinlto-release_70/clang-build/Build/module.cache -fcxx-modules -gmodules -Wall -Wextra -Wno-unused-parameter -Wwrite-strings -Wcast-qual -Wmissing-field-initializers -pedantic -Wno-long-long -Wcovered-switch-default -Wnon-virtual-dtor -Wdelete-non-virtual-dtor -Wstring-conversion -fdiagnostics-color -flto=thin -O2 -g -DNDEBUG -isysroot /Applications/Xcode.app/Contents/Developer/Platforms/MacOSX.platform/Developer/SDKs/MacOSX10.14.sdk    -Wno-variadic-macros -Wno-gnu-zero-variadic-macro-arguments -fno-exceptions -fno-rtti -MD -MT unittests/ADT/CMakeFiles/ADTTests.dir/ImmutableSetTest.cpp.o -MF unittests/ADT/CMakeFiles/ADTTests.dir/ImmutableSetTest.cpp.o.d -o unittests/ADT/CMakeFiles/ADTTests.dir/ImmutableSetTest.cpp.o -c /Users/buildslave/jenkins/workspace/clang-stage2-Rthinlto-release_70/llvm/unittests/ADT/ImmutableSetTest.cpp
[3032/3408] /Users/buildslave/jenkins/workspace/clang-stage2-Rthinlto-release_70/host-compiler/bin/clang++  -DGTEST_HAS_RTTI=0 -DGTEST_HAS_TR1_TUPLE=0 -DGTEST_LANG_CXX11=1 -D__STDC_CONSTANT_MACROS -D__STDC_FORMAT_MACROS -D__STDC_LIMIT_MACROS -Iunittests/ADT -I/Users/buildslave/jenkins/workspace/clang-stage2-Rthinlto-release_70/llvm/unittests/ADT -I/Applications/Xcode.app/Contents/Developer/Platforms/MacOSX.platform/Developer/SDKs/MacOSX10.14.sdk/usr/include/libxml2 -Iinclude -I/Users/buildslave/jenkins/workspace/clang-stage2-Rthinlto-release_70/llvm/include -I/Users/buildslave/jenkins/workspace/clang-stage2-Rthinlto-release_70/llvm/utils/unittest/googletest/include -I/Users/buildslave/jenkins/workspace/clang-stage2-Rthinlto-release_70/llvm/utils/unittest/googlemock/include -fno-stack-protector -fno-common -Wno-profile-instr-unprofiled -fPIC -fvisibility-inlines-hidden -Werror=date-time -Werror=unguarded-availability-new -std=c++11 -fmodules -fmodules-cache-path=/Users/buildslave/jenkins/workspace/clang-stage2-Rthinlto-release_70/clang-build/Build/module.cache -fcxx-modules -gmodules -Wall -Wextra -Wno-unused-parameter -Wwrite-strings -Wcast-qual -Wmissing-field-initializers -pedantic -Wno-long-long -Wcovered-switch-default -Wnon-virtual-dtor -Wdelete-non-virtual-dtor -Wstring-conversion -fdiagnostics-color -flto=thin -O2 -g -DNDEBUG -isysroot /Applications/Xcode.app/Contents/Developer/Platforms/MacOSX.platform/Developer/SDKs/MacOSX10.14.sdk    -Wno-variadic-macros -Wno-gnu-zero-variadic-macro-arguments -fno-exceptions -fno-rtti -MD -MT unittests/ADT/CMakeFiles/ADTTests.dir/MappedIteratorTest.cpp.o -MF unittests/ADT/CMakeFiles/ADTTests.dir/MappedIteratorTest.cpp.o.d -o unittests/ADT/CMakeFiles/ADTTests.dir/MappedIteratorTest.cpp.o -c /Users/buildslave/jenkins/workspace/clang-stage2-Rthinlto-release_70/llvm/unittests/ADT/MappedIteratorTest.cpp
[3033/3408] /Users/buildslave/jenkins/workspace/clang-stage2-Rthinlto-release_70/host-compiler/bin/clang++  -DGTEST_HAS_RTTI=0 -DGTEST_HAS_TR1_TUPLE=0 -DGTEST_LANG_CXX11=1 -D__STDC_CONSTANT_MACROS -D__STDC_FORMAT_MACROS -D__STDC_LIMIT_MACROS -Iunittests/ADT -I/Users/buildslave/jenkins/workspace/clang-stage2-Rthinlto-release_70/llvm/unittests/ADT -I/Applications/Xcode.app/Contents/Developer/Platforms/MacOSX.platform/Developer/SDKs/MacOSX10.14.sdk/usr/include/libxml2 -Iinclude -I/Users/buildslave/jenkins/workspace/clang-stage2-Rthinlto-release_70/llvm/include -I/Users/buildslave/jenkins/workspace/clang-stage2-Rthinlto-release_70/llvm/utils/unittest/googletest/include -I/Users/buildslave/jenkins/workspace/clang-stage2-Rthinlto-release_70/llvm/utils/unittest/googlemock/include -fno-stack-protector -fno-common -Wno-profile-instr-unprofiled -fPIC -fvisibility-inlines-hidden -Werror=date-time -Werror=unguarded-availability-new -std=c++11 -fmodules -fmodules-cache-path=/Users/buildslave/jenkins/workspace/clang-stage2-Rthinlto-release_70/clang-build/Build/module.cache -fcxx-modules -gmodules -Wall -Wextra -Wno-unused-parameter -Wwrite-strings -Wcast-qual -Wmissing-field-initializers -pedantic -Wno-long-long -Wcovered-switch-default -Wnon-virtual-dtor -Wdelete-non-virtual-dtor -Wstring-conversion -fdiagnostics-color -flto=thin -O2 -g -DNDEBUG -isysroot /Applications/Xcode.app/Contents/Developer/Platforms/MacOSX.platform/Developer/SDKs/MacOSX10.14.sdk    -Wno-variadic-macros -Wno-gnu-zero-variadic-macro-arguments -fno-exceptions -fno-rtti -MD -MT unittests/ADT/CMakeFiles/ADTTests.dir/MakeUniqueTest.cpp.o -MF unittests/ADT/CMakeFiles/ADTTests.dir/MakeUniqueTest.cpp.o.d -o unittests/ADT/CMakeFiles/ADTTests.dir/MakeUniqueTest.cpp.o -c /Users/buildslave/jenkins/workspace/clang-stage2-Rthinlto-release_70/llvm/unittests/ADT/MakeUniqueTest.cpp
[3034/3408] /Users/buildslave/jenkins/workspace/clang-stage2-Rthinlto-release_70/host-compiler/bin/clang++  -DGTEST_HAS_RTTI=0 -DGTEST_HAS_TR1_TUPLE=0 -DGTEST_LANG_CXX11=1 -D__STDC_CONSTANT_MACROS -D__STDC_FORMAT_MACROS -D__STDC_LIMIT_MACROS -Iunittests/ADT -I/Users/buildslave/jenkins/workspace/clang-stage2-Rthinlto-release_70/llvm/unittests/ADT -I/Applications/Xcode.app/Contents/Developer/Platforms/MacOSX.platform/Developer/SDKs/MacOSX10.14.sdk/usr/include/libxml2 -Iinclude -I/Users/buildslave/jenkins/workspace/clang-stage2-Rthinlto-release_70/llvm/include -I/Users/buildslave/jenkins/workspace/clang-stage2-Rthinlto-release_70/llvm/utils/unittest/googletest/include -I/Users/buildslave/jenkins/workspace/clang-stage2-Rthinlto-release_70/llvm/utils/unittest/googlemock/include -fno-stack-protector -fno-common -Wno-profile-instr-unprofiled -fPIC -fvisibility-inlines-hidden -Werror=date-time -Werror=unguarded-availability-new -std=c++11 -fmodules -fmodules-cache-path=/Users/buildslave/jenkins/workspace/clang-stage2-Rthinlto-release_70/clang-build/Build/module.cache -fcxx-modules -gmodules -Wall -Wextra -Wno-unused-parameter -Wwrite-strings -Wcast-qual -Wmissing-field-initializers -pedantic -Wno-long-long -Wcovered-switch-default -Wnon-virtual-dtor -Wdelete-non-virtual-dtor -Wstring-conversion -fdiagnostics-color -flto=thin -O2 -g -DNDEBUG -isysroot /Applications/Xcode.app/Contents/Developer/Platforms/MacOSX.platform/Developer/SDKs/MacOSX10.14.sdk    -Wno-variadic-macros -Wno-gnu-zero-variadic-macro-arguments -fno-exceptions -fno-rtti -MD -MT unittests/ADT/CMakeFiles/ADTTests.dir/IteratorTest.cpp.o -MF unittests/ADT/CMakeFiles/ADTTests.dir/IteratorTest.cpp.o.d -o unittests/ADT/CMakeFiles/ADTTests.dir/IteratorTest.cpp.o -c /Users/buildslave/jenkins/workspace/clang-stage2-Rthinlto-release_70/llvm/unittests/ADT/IteratorTest.cpp
[3035/3408] /Users/buildslave/jenkins/workspace/clang-stage2-Rthinlto-release_70/host-compiler/bin/clang++  -DGTEST_HAS_RTTI=0 -D__STDC_CONSTANT_MACROS -D__STDC_FORMAT_MACROS -D__STDC_LIMIT_MACROS -Itools/llvm-pdbutil -I/Users/buildslave/jenkins/workspace/clang-stage2-Rthinlto-release_70/llvm/tools/llvm-pdbutil -I/Applications/Xcode.app/Contents/Developer/Platforms/MacOSX.platform/Developer/SDKs/MacOSX10.14.sdk/usr/include/libxml2 -Iinclude -I/Users/buildslave/jenkins/workspace/clang-stage2-Rthinlto-release_70/llvm/include -fno-stack-protector -fno-common -Wno-profile-instr-unprofiled -fPIC -fvisibility-inlines-hidden -Werror=date-time -Werror=unguarded-availability-new -std=c++11 -fmodules -fmodules-cache-path=/Users/buildslave/jenkins/workspace/clang-stage2-Rthinlto-release_70/clang-build/Build/module.cache -fcxx-modules -gmodules -Wall -Wextra -Wno-unused-parameter -Wwrite-strings -Wcast-qual -Wmissing-field-initializers -pedantic -Wno-long-long -Wcovered-switch-default -Wnon-virtual-dtor -Wdelete-non-virtual-dtor -Wstring-conversion -fdiagnostics-color -flto=thin -O2 -g -DNDEBUG -isysroot /Applications/Xcode.app/Contents/Developer/Platforms/MacOSX.platform/Developer/SDKs/MacOSX10.14.sdk    -fno-exceptions -fno-rtti -MD -MT tools/llvm-pdbutil/CMakeFiles/llvm-pdbutil.dir/llvm-pdbutil.cpp.o -MF tools/llvm-pdbutil/CMakeFiles/llvm-pdbutil.dir/llvm-pdbutil.cpp.o.d -o tools/llvm-pdbutil/CMakeFiles/llvm-pdbutil.dir/llvm-pdbutil.cpp.o -c /Users/buildslave/jenkins/workspace/clang-stage2-Rthinlto-release_70/llvm/tools/llvm-pdbutil/llvm-pdbutil.cpp
[3036/3408] /Users/buildslave/jenkins/workspace/clang-stage2-Rthinlto-release_70/host-compiler/bin/clang++  -DGTEST_HAS_RTTI=0 -DGTEST_HAS_TR1_TUPLE=0 -DGTEST_LANG_CXX11=1 -D__STDC_CONSTANT_MACROS -D__STDC_FORMAT_MACROS -D__STDC_LIMIT_MACROS -Iunittests/ADT -I/Users/buildslave/jenkins/workspace/clang-stage2-Rthinlto-release_70/llvm/unittests/ADT -I/Applications/Xcode.app/Contents/Developer/Platforms/MacOSX.platform/Developer/SDKs/MacOSX10.14.sdk/usr/include/libxml2 -Iinclude -I/Users/buildslave/jenkins/workspace/clang-stage2-Rthinlto-release_70/llvm/include -I/Users/buildslave/jenkins/workspace/clang-stage2-Rthinlto-release_70/llvm/utils/unittest/googletest/include -I/Users/buildslave/jenkins/workspace/clang-stage2-Rthinlto-release_70/llvm/utils/unittest/googlemock/include -fno-stack-protector -fno-common -Wno-profile-instr-unprofiled -fPIC -fvisibility-inlines-hidden -Werror=date-time -Werror=unguarded-availability-new -std=c++11 -fmodules -fmodules-cache-path=/Users/buildslave/jenkins/workspace/clang-stage2-Rthinlto-release_70/clang-build/Build/module.cache -fcxx-modules -gmodules -Wall -Wextra -Wno-unused-parameter -Wwrite-strings -Wcast-qual -Wmissing-field-initializers -pedantic -Wno-long-long -Wcovered-switch-default -Wnon-virtual-dtor -Wdelete-non-virtual-dtor -Wstring-conversion -fdiagnostics-color -flto=thin -O2 -g -DNDEBUG -isysroot /Applications/Xcode.app/Contents/Developer/Platforms/MacOSX.platform/Developer/SDKs/MacOSX10.14.sdk    -Wno-variadic-macros -Wno-gnu-zero-variadic-macro-arguments -fno-exceptions -fno-rtti -MD -MT unittests/ADT/CMakeFiles/ADTTests.dir/OptionalTest.cpp.o -MF unittests/ADT/CMakeFiles/ADTTests.dir/OptionalTest.cpp.o.d -o unittests/ADT/CMakeFiles/ADTTests.dir/OptionalTest.cpp.o -c /Users/buildslave/jenkins/workspace/clang-stage2-Rthinlto-release_70/llvm/unittests/ADT/OptionalTest.cpp
[3037/3408] /Users/buildslave/jenkins/workspace/clang-stage2-Rthinlto-release_70/host-compiler/bin/clang++  -DGTEST_HAS_RTTI=0 -DGTEST_HAS_TR1_TUPLE=0 -DGTEST_LANG_CXX11=1 -D__STDC_CONSTANT_MACROS -D__STDC_FORMAT_MACROS -D__STDC_LIMIT_MACROS -Iunittests/ADT -I/Users/buildslave/jenkins/workspace/clang-stage2-Rthinlto-release_70/llvm/unittests/ADT -I/Applications/Xcode.app/Contents/Developer/Platforms/MacOSX.platform/Developer/SDKs/MacOSX10.14.sdk/usr/include/libxml2 -Iinclude -I/Users/buildslave/jenkins/workspace/clang-stage2-Rthinlto-release_70/llvm/include -I/Users/buildslave/jenkins/workspace/clang-stage2-Rthinlto-release_70/llvm/utils/unittest/googletest/include -I/Users/buildslave/jenkins/workspace/clang-stage2-Rthinlto-release_70/llvm/utils/unittest/googlemock/include -fno-stack-protector -fno-common -Wno-profile-instr-unprofiled -fPIC -fvisibility-inlines-hidden -Werror=date-time -Werror=unguarded-availability-new -std=c++11 -fmodules -fmodules-cache-path=/Users/buildslave/jenkins/workspace/clang-stage2-Rthinlto-release_70/clang-build/Build/module.cache -fcxx-modules -gmodules -Wall -Wextra -Wno-unused-parameter -Wwrite-strings -Wcast-qual -Wmissing-field-initializers -pedantic -Wno-long-long -Wcovered-switch-default -Wnon-virtual-dtor -Wdelete-non-virtual-dtor -Wstring-conversion -fdiagnostics-color -flto=thin -O2 -g -DNDEBUG -isysroot /Applications/Xcode.app/Contents/Developer/Platforms/MacOSX.platform/Developer/SDKs/MacOSX10.14.sdk    -Wno-variadic-macros -Wno-gnu-zero-variadic-macro-arguments -fno-exceptions -fno-rtti -MD -MT unittests/ADT/CMakeFiles/ADTTests.dir/PointerEmbeddedIntTest.cpp.o -MF unittests/ADT/CMakeFiles/ADTTests.dir/PointerEmbeddedIntTest.cpp.o.d -o unittests/ADT/CMakeFiles/ADTTests.dir/PointerEmbeddedIntTest.cpp.o -c /Users/buildslave/jenkins/workspace/clang-stage2-Rthinlto-release_70/llvm/unittests/ADT/PointerEmbeddedIntTest.cpp
[3038/3408] /Users/buildslave/jenkins/workspace/clang-stage2-Rthinlto-release_70/host-compiler/bin/clang++  -DGTEST_HAS_RTTI=0 -DGTEST_HAS_TR1_TUPLE=0 -DGTEST_LANG_CXX11=1 -D__STDC_CONSTANT_MACROS -D__STDC_FORMAT_MACROS -D__STDC_LIMIT_MACROS -Iunittests/ADT -I/Users/buildslave/jenkins/workspace/clang-stage2-Rthinlto-release_70/llvm/unittests/ADT -I/Applications/Xcode.app/Contents/Developer/Platforms/MacOSX.platform/Developer/SDKs/MacOSX10.14.sdk/usr/include/libxml2 -Iinclude -I/Users/buildslave/jenkins/workspace/clang-stage2-Rthinlto-release_70/llvm/include -I/Users/buildslave/jenkins/workspace/clang-stage2-Rthinlto-release_70/llvm/utils/unittest/googletest/include -I/Users/buildslave/jenkins/workspace/clang-stage2-Rthinlto-release_70/llvm/utils/unittest/googlemock/include -fno-stack-protector -fno-common -Wno-profile-instr-unprofiled -fPIC -fvisibility-inlines-hidden -Werror=date-time -Werror=unguarded-availability-new -std=c++11 -fmodules -fmodules-cache-path=/Users/buildslave/jenkins/workspace/clang-stage2-Rthinlto-release_70/clang-build/Build/module.cache -fcxx-modules -gmodules -Wall -Wextra -Wno-unused-parameter -Wwrite-strings -Wcast-qual -Wmissing-field-initializers -pedantic -Wno-long-long -Wcovered-switch-default -Wnon-virtual-dtor -Wdelete-non-virtual-dtor -Wstring-conversion -fdiagnostics-color -flto=thin -O2 -g -DNDEBUG -isysroot /Applications/Xcode.app/Contents/Developer/Platforms/MacOSX.platform/Developer/SDKs/MacOSX10.14.sdk    -Wno-variadic-macros -Wno-gnu-zero-variadic-macro-arguments -fno-exceptions -fno-rtti -MD -MT unittests/ADT/CMakeFiles/ADTTests.dir/PackedVectorTest.cpp.o -MF unittests/ADT/CMakeFiles/ADTTests.dir/PackedVectorTest.cpp.o.d -o unittests/ADT/CMakeFiles/ADTTests.dir/PackedVectorTest.cpp.o -c /Users/buildslave/jenkins/workspace/clang-stage2-Rthinlto-release_70/llvm/unittests/ADT/PackedVectorTest.cpp
[3039/3408] /Users/buildslave/jenkins/workspace/clang-stage2-Rthinlto-release_70/host-compiler/bin/clang++  -DGTEST_HAS_RTTI=0 -DGTEST_HAS_TR1_TUPLE=0 -DGTEST_LANG_CXX11=1 -D__STDC_CONSTANT_MACROS -D__STDC_FORMAT_MACROS -D__STDC_LIMIT_MACROS -Iunittests/ADT -I/Users/buildslave/jenkins/workspace/clang-stage2-Rthinlto-release_70/llvm/unittests/ADT -I/Applications/Xcode.app/Contents/Developer/Platforms/MacOSX.platform/Developer/SDKs/MacOSX10.14.sdk/usr/include/libxml2 -Iinclude -I/Users/buildslave/jenkins/workspace/clang-stage2-Rthinlto-release_70/llvm/include -I/Users/buildslave/jenkins/workspace/clang-stage2-Rthinlto-release_70/llvm/utils/unittest/googletest/include -I/Users/buildslave/jenkins/workspace/clang-stage2-Rthinlto-release_70/llvm/utils/unittest/googlemock/include -fno-stack-protector -fno-common -Wno-profile-instr-unprofiled -fPIC -fvisibility-inlines-hidden -Werror=date-time -Werror=unguarded-availability-new -std=c++11 -fmodules -fmodules-cache-path=/Users/buildslave/jenkins/workspace/clang-stage2-Rthinlto-release_70/clang-build/Build/module.cache -fcxx-modules -gmodules -Wall -Wextra -Wno-unused-parameter -Wwrite-strings -Wcast-qual -Wmissing-field-initializers -pedantic -Wno-long-long -Wcovered-switch-default -Wnon-virtual-dtor -Wdelete-non-virtual-dtor -Wstring-conversion -fdiagnostics-color -flto=thin -O2 -g -DNDEBUG -isysroot /Applications/Xcode.app/Contents/Developer/Platforms/MacOSX.platform/Developer/SDKs/MacOSX10.14.sdk    -Wno-variadic-macros -Wno-gnu-zero-variadic-macro-arguments -fno-exceptions -fno-rtti -MD -MT unittests/ADT/CMakeFiles/ADTTests.dir/PointerIntPairTest.cpp.o -MF unittests/ADT/CMakeFiles/ADTTests.dir/PointerIntPairTest.cpp.o.d -o unittests/ADT/CMakeFiles/ADTTests.dir/PointerIntPairTest.cpp.o -c /Users/buildslave/jenkins/workspace/clang-stage2-Rthinlto-release_70/llvm/unittests/ADT/PointerIntPairTest.cpp
[3040/3408] /Users/buildslave/jenkins/workspace/clang-stage2-Rthinlto-release_70/host-compiler/bin/clang++  -DGTEST_HAS_RTTI=0 -DGTEST_HAS_TR1_TUPLE=0 -DGTEST_LANG_CXX11=1 -D__STDC_CONSTANT_MACROS -D__STDC_FORMAT_MACROS -D__STDC_LIMIT_MACROS -Iunittests/ADT -I/Users/buildslave/jenkins/workspace/clang-stage2-Rthinlto-release_70/llvm/unittests/ADT -I/Applications/Xcode.app/Contents/Developer/Platforms/MacOSX.platform/Developer/SDKs/MacOSX10.14.sdk/usr/include/libxml2 -Iinclude -I/Users/buildslave/jenkins/workspace/clang-stage2-Rthinlto-release_70/llvm/include -I/Users/buildslave/jenkins/workspace/clang-stage2-Rthinlto-release_70/llvm/utils/unittest/googletest/include -I/Users/buildslave/jenkins/workspace/clang-stage2-Rthinlto-release_70/llvm/utils/unittest/googlemock/include -fno-stack-protector -fno-common -Wno-profile-instr-unprofiled -fPIC -fvisibility-inlines-hidden -Werror=date-time -Werror=unguarded-availability-new -std=c++11 -fmodules -fmodules-cache-path=/Users/buildslave/jenkins/workspace/clang-stage2-Rthinlto-release_70/clang-build/Build/module.cache -fcxx-modules -gmodules -Wall -Wextra -Wno-unused-parameter -Wwrite-strings -Wcast-qual -Wmissing-field-initializers -pedantic -Wno-long-long -Wcovered-switch-default -Wnon-virtual-dtor -Wdelete-non-virtual-dtor -Wstring-conversion -fdiagnostics-color -flto=thin -O2 -g -DNDEBUG -isysroot /Applications/Xcode.app/Contents/Developer/Platforms/MacOSX.platform/Developer/SDKs/MacOSX10.14.sdk    -Wno-variadic-macros -Wno-gnu-zero-variadic-macro-arguments -fno-exceptions -fno-rtti -MD -MT unittests/ADT/CMakeFiles/ADTTests.dir/PointerSumTypeTest.cpp.o -MF unittests/ADT/CMakeFiles/ADTTests.dir/PointerSumTypeTest.cpp.o.d -o unittests/ADT/CMakeFiles/ADTTests.dir/PointerSumTypeTest.cpp.o -c /Users/buildslave/jenkins/workspace/clang-stage2-Rthinlto-release_70/llvm/unittests/ADT/PointerSumTypeTest.cpp
[3041/3408] /Users/buildslave/jenkins/workspace/clang-stage2-Rthinlto-release_70/host-compiler/bin/clang++  -DGTEST_HAS_RTTI=0 -DGTEST_HAS_TR1_TUPLE=0 -DGTEST_LANG_CXX11=1 -D__STDC_CONSTANT_MACROS -D__STDC_FORMAT_MACROS -D__STDC_LIMIT_MACROS -Iunittests/ADT -I/Users/buildslave/jenkins/workspace/clang-stage2-Rthinlto-release_70/llvm/unittests/ADT -I/Applications/Xcode.app/Contents/Developer/Platforms/MacOSX.platform/Developer/SDKs/MacOSX10.14.sdk/usr/include/libxml2 -Iinclude -I/Users/buildslave/jenkins/workspace/clang-stage2-Rthinlto-release_70/llvm/include -I/Users/buildslave/jenkins/workspace/clang-stage2-Rthinlto-release_70/llvm/utils/unittest/googletest/include -I/Users/buildslave/jenkins/workspace/clang-stage2-Rthinlto-release_70/llvm/utils/unittest/googlemock/include -fno-stack-protector -fno-common -Wno-profile-instr-unprofiled -fPIC -fvisibility-inlines-hidden -Werror=date-time -Werror=unguarded-availability-new -std=c++11 -fmodules -fmodules-cache-path=/Users/buildslave/jenkins/workspace/clang-stage2-Rthinlto-release_70/clang-build/Build/module.cache -fcxx-modules -gmodules -Wall -Wextra -Wno-unused-parameter -Wwrite-strings -Wcast-qual -Wmissing-field-initializers -pedantic -Wno-long-long -Wcovered-switch-default -Wnon-virtual-dtor -Wdelete-non-virtual-dtor -Wstring-conversion -fdiagnostics-color -flto=thin -O2 -g -DNDEBUG -isysroot /Applications/Xcode.app/Contents/Developer/Platforms/MacOSX.platform/Developer/SDKs/MacOSX10.14.sdk    -Wno-variadic-macros -Wno-gnu-zero-variadic-macro-arguments -fno-exceptions -fno-rtti -MD -MT unittests/ADT/CMakeFiles/ADTTests.dir/PointerUnionTest.cpp.o -MF unittests/ADT/CMakeFiles/ADTTests.dir/PointerUnionTest.cpp.o.d -o unittests/ADT/CMakeFiles/ADTTests.dir/PointerUnionTest.cpp.o -c /Users/buildslave/jenkins/workspace/clang-stage2-Rthinlto-release_70/llvm/unittests/ADT/PointerUnionTest.cpp
[3042/3408] /Users/buildslave/jenkins/workspace/clang-stage2-Rthinlto-release_70/host-compiler/bin/clang++  -DGTEST_HAS_RTTI=0 -DGTEST_HAS_TR1_TUPLE=0 -DGTEST_LANG_CXX11=1 -D__STDC_CONSTANT_MACROS -D__STDC_FORMAT_MACROS -D__STDC_LIMIT_MACROS -Iunittests/ADT -I/Users/buildslave/jenkins/workspace/clang-stage2-Rthinlto-release_70/llvm/unittests/ADT -I/Applications/Xcode.app/Contents/Developer/Platforms/MacOSX.platform/Developer/SDKs/MacOSX10.14.sdk/usr/include/libxml2 -Iinclude -I/Users/buildslave/jenkins/workspace/clang-stage2-Rthinlto-release_70/llvm/include -I/Users/buildslave/jenkins/workspace/clang-stage2-Rthinlto-release_70/llvm/utils/unittest/googletest/include -I/Users/buildslave/jenkins/workspace/clang-stage2-Rthinlto-release_70/llvm/utils/unittest/googlemock/include -fno-stack-protector -fno-common -Wno-profile-instr-unprofiled -fPIC -fvisibility-inlines-hidden -Werror=date-time -Werror=unguarded-availability-new -std=c++11 -fmodules -fmodules-cache-path=/Users/buildslave/jenkins/workspace/clang-stage2-Rthinlto-release_70/clang-build/Build/module.cache -fcxx-modules -gmodules -Wall -Wextra -Wno-unused-parameter -Wwrite-strings -Wcast-qual -Wmissing-field-initializers -pedantic -Wno-long-long -Wcovered-switch-default -Wnon-virtual-dtor -Wdelete-non-virtual-dtor -Wstring-conversion -fdiagnostics-color -flto=thin -O2 -g -DNDEBUG -isysroot /Applications/Xcode.app/Contents/Developer/Platforms/MacOSX.platform/Developer/SDKs/MacOSX10.14.sdk    -Wno-variadic-macros -Wno-gnu-zero-variadic-macro-arguments -fno-exceptions -fno-rtti -MD -MT unittests/ADT/CMakeFiles/ADTTests.dir/PostOrderIteratorTest.cpp.o -MF unittests/ADT/CMakeFiles/ADTTests.dir/PostOrderIteratorTest.cpp.o.d -o unittests/ADT/CMakeFiles/ADTTests.dir/PostOrderIteratorTest.cpp.o -c /Users/buildslave/jenkins/workspace/clang-stage2-Rthinlto-release_70/llvm/unittests/ADT/PostOrderIteratorTest.cpp
[3043/3408] /Users/buildslave/jenkins/workspace/clang-stage2-Rthinlto-release_70/host-compiler/bin/clang++  -DGTEST_HAS_RTTI=0 -DGTEST_HAS_TR1_TUPLE=0 -DGTEST_LANG_CXX11=1 -D__STDC_CONSTANT_MACROS -D__STDC_FORMAT_MACROS -D__STDC_LIMIT_MACROS -Iunittests/ADT -I/Users/buildslave/jenkins/workspace/clang-stage2-Rthinlto-release_70/llvm/unittests/ADT -I/Applications/Xcode.app/Contents/Developer/Platforms/MacOSX.platform/Developer/SDKs/MacOSX10.14.sdk/usr/include/libxml2 -Iinclude -I/Users/buildslave/jenkins/workspace/clang-stage2-Rthinlto-release_70/llvm/include -I/Users/buildslave/jenkins/workspace/clang-stage2-Rthinlto-release_70/llvm/utils/unittest/googletest/include -I/Users/buildslave/jenkins/workspace/clang-stage2-Rthinlto-release_70/llvm/utils/unittest/googlemock/include -fno-stack-protector -fno-common -Wno-profile-instr-unprofiled -fPIC -fvisibility-inlines-hidden -Werror=date-time -Werror=unguarded-availability-new -std=c++11 -fmodules -fmodules-cache-path=/Users/buildslave/jenkins/workspace/clang-stage2-Rthinlto-release_70/clang-build/Build/module.cache -fcxx-modules -gmodules -Wall -Wextra -Wno-unused-parameter -Wwrite-strings -Wcast-qual -Wmissing-field-initializers -pedantic -Wno-long-long -Wcovered-switch-default -Wnon-virtual-dtor -Wdelete-non-virtual-dtor -Wstring-conversion -fdiagnostics-color -flto=thin -O2 -g -DNDEBUG -isysroot /Applications/Xcode.app/Contents/Developer/Platforms/MacOSX.platform/Developer/SDKs/MacOSX10.14.sdk    -Wno-variadic-macros -Wno-gnu-zero-variadic-macro-arguments -fno-exceptions -fno-rtti -MD -MT unittests/ADT/CMakeFiles/ADTTests.dir/MapVectorTest.cpp.o -MF unittests/ADT/CMakeFiles/ADTTests.dir/MapVectorTest.cpp.o.d -o unittests/ADT/CMakeFiles/ADTTests.dir/MapVectorTest.cpp.o -c /Users/buildslave/jenkins/workspace/clang-stage2-Rthinlto-release_70/llvm/unittests/ADT/MapVectorTest.cpp
[3044/3408] /Users/buildslave/jenkins/workspace/clang-stage2-Rthinlto-release_70/host-compiler/bin/clang++  -DGTEST_HAS_RTTI=0 -DGTEST_HAS_TR1_TUPLE=0 -DGTEST_LANG_CXX11=1 -D__STDC_CONSTANT_MACROS -D__STDC_FORMAT_MACROS -D__STDC_LIMIT_MACROS -Iunittests/ADT -I/Users/buildslave/jenkins/workspace/clang-stage2-Rthinlto-release_70/llvm/unittests/ADT -I/Applications/Xcode.app/Contents/Developer/Platforms/MacOSX.platform/Developer/SDKs/MacOSX10.14.sdk/usr/include/libxml2 -Iinclude -I/Users/buildslave/jenkins/workspace/clang-stage2-Rthinlto-release_70/llvm/include -I/Users/buildslave/jenkins/workspace/clang-stage2-Rthinlto-release_70/llvm/utils/unittest/googletest/include -I/Users/buildslave/jenkins/workspace/clang-stage2-Rthinlto-release_70/llvm/utils/unittest/googlemock/include -fno-stack-protector -fno-common -Wno-profile-instr-unprofiled -fPIC -fvisibility-inlines-hidden -Werror=date-time -Werror=unguarded-availability-new -std=c++11 -fmodules -fmodules-cache-path=/Users/buildslave/jenkins/workspace/clang-stage2-Rthinlto-release_70/clang-build/Build/module.cache -fcxx-modules -gmodules -Wall -Wextra -Wno-unused-parameter -Wwrite-strings -Wcast-qual -Wmissing-field-initializers -pedantic -Wno-long-long -Wcovered-switch-default -Wnon-virtual-dtor -Wdelete-non-virtual-dtor -Wstring-conversion -fdiagnostics-color -flto=thin -O2 -g -DNDEBUG -isysroot /Applications/Xcode.app/Contents/Developer/Platforms/MacOSX.platform/Developer/SDKs/MacOSX10.14.sdk    -Wno-variadic-macros -Wno-gnu-zero-variadic-macro-arguments -fno-exceptions -fno-rtti -MD -MT unittests/ADT/CMakeFiles/ADTTests.dir/SCCIteratorTest.cpp.o -MF unittests/ADT/CMakeFiles/ADTTests.dir/SCCIteratorTest.cpp.o.d -o unittests/ADT/CMakeFiles/ADTTests.dir/SCCIteratorTest.cpp.o -c /Users/buildslave/jenkins/workspace/clang-stage2-Rthinlto-release_70/llvm/unittests/ADT/SCCIteratorTest.cpp
[3045/3408] /Users/buildslave/jenkins/workspace/clang-stage2-Rthinlto-release_70/host-compiler/bin/clang++  -DGTEST_HAS_RTTI=0 -DGTEST_HAS_TR1_TUPLE=0 -DGTEST_LANG_CXX11=1 -D__STDC_CONSTANT_MACROS -D__STDC_FORMAT_MACROS -D__STDC_LIMIT_MACROS -Iunittests/ADT -I/Users/buildslave/jenkins/workspace/clang-stage2-Rthinlto-release_70/llvm/unittests/ADT -I/Applications/Xcode.app/Contents/Developer/Platforms/MacOSX.platform/Developer/SDKs/MacOSX10.14.sdk/usr/include/libxml2 -Iinclude -I/Users/buildslave/jenkins/workspace/clang-stage2-Rthinlto-release_70/llvm/include -I/Users/buildslave/jenkins/workspace/clang-stage2-Rthinlto-release_70/llvm/utils/unittest/googletest/include -I/Users/buildslave/jenkins/workspace/clang-stage2-Rthinlto-release_70/llvm/utils/unittest/googlemock/include -fno-stack-protector -fno-common -Wno-profile-instr-unprofiled -fPIC -fvisibility-inlines-hidden -Werror=date-time -Werror=unguarded-availability-new -std=c++11 -fmodules -fmodules-cache-path=/Users/buildslave/jenkins/workspace/clang-stage2-Rthinlto-release_70/clang-build/Build/module.cache -fcxx-modules -gmodules -Wall -Wextra -Wno-unused-parameter -Wwrite-strings -Wcast-qual -Wmissing-field-initializers -pedantic -Wno-long-long -Wcovered-switch-default -Wnon-virtual-dtor -Wdelete-non-virtual-dtor -Wstring-conversion -fdiagnostics-color -flto=thin -O2 -g -DNDEBUG -isysroot /Applications/Xcode.app/Contents/Developer/Platforms/MacOSX.platform/Developer/SDKs/MacOSX10.14.sdk    -Wno-variadic-macros -Wno-gnu-zero-variadic-macro-arguments -fno-exceptions -fno-rtti -MD -MT unittests/ADT/CMakeFiles/ADTTests.dir/STLExtrasTest.cpp.o -MF unittests/ADT/CMakeFiles/ADTTests.dir/STLExtrasTest.cpp.o.d -o unittests/ADT/CMakeFiles/ADTTests.dir/STLExtrasTest.cpp.o -c /Users/buildslave/jenkins/workspace/clang-stage2-Rthinlto-release_70/llvm/unittests/ADT/STLExtrasTest.cpp
[3046/3408] /Users/buildslave/jenkins/workspace/clang-stage2-Rthinlto-release_70/host-compiler/bin/clang++  -DGTEST_HAS_RTTI=0 -DGTEST_HAS_TR1_TUPLE=0 -DGTEST_LANG_CXX11=1 -D__STDC_CONSTANT_MACROS -D__STDC_FORMAT_MACROS -D__STDC_LIMIT_MACROS -Iunittests/ADT -I/Users/buildslave/jenkins/workspace/clang-stage2-Rthinlto-release_70/llvm/unittests/ADT -I/Applications/Xcode.app/Contents/Developer/Platforms/MacOSX.platform/Developer/SDKs/MacOSX10.14.sdk/usr/include/libxml2 -Iinclude -I/Users/buildslave/jenkins/workspace/clang-stage2-Rthinlto-release_70/llvm/include -I/Users/buildslave/jenkins/workspace/clang-stage2-Rthinlto-release_70/llvm/utils/unittest/googletest/include -I/Users/buildslave/jenkins/workspace/clang-stage2-Rthinlto-release_70/llvm/utils/unittest/googlemock/include -fno-stack-protector -fno-common -Wno-profile-instr-unprofiled -fPIC -fvisibility-inlines-hidden -Werror=date-time -Werror=unguarded-availability-new -std=c++11 -fmodules -fmodules-cache-path=/Users/buildslave/jenkins/workspace/clang-stage2-Rthinlto-release_70/clang-build/Build/module.cache -fcxx-modules -gmodules -Wall -Wextra -Wno-unused-parameter -Wwrite-strings -Wcast-qual -Wmissing-field-initializers -pedantic -Wno-long-long -Wcovered-switch-default -Wnon-virtual-dtor -Wdelete-non-virtual-dtor -Wstring-conversion -fdiagnostics-color -flto=thin -O2 -g -DNDEBUG -isysroot /Applications/Xcode.app/Contents/Developer/Platforms/MacOSX.platform/Developer/SDKs/MacOSX10.14.sdk    -Wno-variadic-macros -Wno-gnu-zero-variadic-macro-arguments -fno-exceptions -fno-rtti -MD -MT unittests/ADT/CMakeFiles/ADTTests.dir/ScopeExitTest.cpp.o -MF unittests/ADT/CMakeFiles/ADTTests.dir/ScopeExitTest.cpp.o.d -o unittests/ADT/CMakeFiles/ADTTests.dir/ScopeExitTest.cpp.o -c /Users/buildslave/jenkins/workspace/clang-stage2-Rthinlto-release_70/llvm/unittests/ADT/ScopeExitTest.cpp
[3047/3408] : && /Users/buildslave/jenkins/workspace/clang-stage2-Rthinlto-release_70/host-compiler/bin/clang++  -fno-stack-protector -fno-common -Wno-profile-instr-unprofiled -fPIC -fvisibility-inlines-hidden -Werror=date-time -Werror=unguarded-availability-new -std=c++11 -fmodules -fmodules-cache-path=/Users/buildslave/jenkins/workspace/clang-stage2-Rthinlto-release_70/clang-build/Build/module.cache -fcxx-modules -gmodules -Wall -Wextra -Wno-unused-parameter -Wwrite-strings -Wcast-qual -Wmissing-field-initializers -pedantic -Wno-long-long -Wcovered-switch-default -Wnon-virtual-dtor -Wdelete-non-virtual-dtor -Wstring-conversion -fdiagnostics-color -flto=thin -O2 -g -DNDEBUG -isysroot /Applications/Xcode.app/Contents/Developer/Platforms/MacOSX.platform/Developer/SDKs/MacOSX10.14.sdk -Wl,-search_paths_first -Wl,-headerpad_max_install_names -flto=thin -Wl,-cache_path_lto,/Users/buildslave/jenkins/workspace/clang-stage2-Rthinlto-release_70/clang-build/Build/lto.cache    -Wl,-dead_strip -Wl,-object_path_lto,/Users/buildslave/jenkins/workspace/clang-stage2-Rthinlto-release_70/clang-build/Build/tools/llvm-ar/./llvm-ar-lto.o tools/llvm-ar/CMakeFiles/llvm-ar.dir/llvm-ar.cpp.o  -o bin/llvm-ar  -Wl,-rpath,@loader_path/../lib lib/libLLVMX86CodeGen.a lib/libLLVMX86AsmParser.a lib/libLLVMX86AsmPrinter.a lib/libLLVMX86Desc.a lib/libLLVMX86Disassembler.a lib/libLLVMX86Info.a lib/libLLVMX86Utils.a lib/libLLVMARMCodeGen.a lib/libLLVMARMAsmParser.a lib/libLLVMARMAsmPrinter.a lib/libLLVMARMDesc.a lib/libLLVMARMDisassembler.a lib/libLLVMARMInfo.a lib/libLLVMARMUtils.a lib/libLLVMAArch64CodeGen.a lib/libLLVMAArch64AsmParser.a lib/libLLVMAArch64AsmPrinter.a lib/libLLVMAArch64Desc.a lib/libLLVMAArch64Disassembler.a lib/libLLVMAArch64Info.a lib/libLLVMAArch64Utils.a lib/libLLVMCore.a lib/libLLVMDlltoolDriver.a lib/libLLVMLibDriver.a lib/libLLVMObject.a lib/libLLVMSupport.a lib/libLLVMX86AsmPrinter.a lib/libLLVMX86Utils.a lib/libLLVMARMDesc.a lib/libLLVMARMAsmPrinter.a lib/libLLVMARMInfo.a lib/libLLVMARMUtils.a lib/libLLVMAsmPrinter.a lib/libLLVMGlobalISel.a lib/libLLVMSelectionDAG.a lib/libLLVMCodeGen.a lib/libLLVMBitWriter.a lib/libLLVMTarget.a lib/libLLVMScalarOpts.a lib/libLLVMAggressiveInstCombine.a lib/libLLVMInstCombine.a lib/libLLVMTransformUtils.a lib/libLLVMAnalysis.a lib/libLLVMProfileData.a lib/libLLVMAArch64Desc.a lib/libLLVMAArch64AsmPrinter.a lib/libLLVMAArch64Info.a lib/libLLVMAArch64Utils.a lib/libLLVMMCDisassembler.a lib/libLLVMObject.a lib/libLLVMMCParser.a lib/libLLVMMC.a lib/libLLVMDebugInfoCodeView.a lib/libLLVMDebugInfoMSF.a lib/libLLVMBitReader.a lib/libLLVMCore.a lib/libLLVMBinaryFormat.a lib/libLLVMOption.a lib/libLLVMSupport.a -lz -lcurses -lm lib/libLLVMDemangle.a && cd /Users/buildslave/jenkins/workspace/clang-stage2-Rthinlto-release_70/clang-build/Build/tools/llvm-ar && xcrun dsymutil /Users/buildslave/jenkins/workspace/clang-stage2-Rthinlto-release_70/clang-build/Build/bin/llvm-ar && /usr/bin/strip -Sxl /Users/buildslave/jenkins/workspace/clang-stage2-Rthinlto-release_70/clang-build/Build/bin/llvm-ar
FAILED: bin/llvm-ar 
: && /Users/buildslave/jenkins/workspace/clang-stage2-Rthinlto-release_70/host-compiler/bin/clang++  -fno-stack-protector -fno-common -Wno-profile-instr-unprofiled -fPIC -fvisibility-inlines-hidden -Werror=date-time -Werror=unguarded-availability-new -std=c++11 -fmodules -fmodules-cache-path=/Users/buildslave/jenkins/workspace/clang-stage2-Rthinlto-release_70/clang-build/Build/module.cache -fcxx-modules -gmodules -Wall -Wextra -Wno-unused-parameter -Wwrite-strings -Wcast-qual -Wmissing-field-initializers -pedantic -Wno-long-long -Wcovered-switch-default -Wnon-virtual-dtor -Wdelete-non-virtual-dtor -Wstring-conversion -fdiagnostics-color -flto=thin -O2 -g -DNDEBUG -isysroot /Applications/Xcode.app/Contents/Developer/Platforms/MacOSX.platform/Developer/SDKs/MacOSX10.14.sdk -Wl,-search_paths_first -Wl,-headerpad_max_install_names -flto=thin -Wl,-cache_path_lto,/Users/buildslave/jenkins/workspace/clang-stage2-Rthinlto-release_70/clang-build/Build/lto.cache    -Wl,-dead_strip -Wl,-object_path_lto,/Users/buildslave/jenkins/workspace/clang-stage2-Rthinlto-release_70/clang-build/Build/tools/llvm-ar/./llvm-ar-lto.o tools/llvm-ar/CMakeFiles/llvm-ar.dir/llvm-ar.cpp.o  -o bin/llvm-ar  -Wl,-rpath,@loader_path/../lib lib/libLLVMX86CodeGen.a lib/libLLVMX86AsmParser.a lib/libLLVMX86AsmPrinter.a lib/libLLVMX86Desc.a lib/libLLVMX86Disassembler.a lib/libLLVMX86Info.a lib/libLLVMX86Utils.a lib/libLLVMARMCodeGen.a lib/libLLVMARMAsmParser.a lib/libLLVMARMAsmPrinter.a lib/libLLVMARMDesc.a lib/libLLVMARMDisassembler.a lib/libLLVMARMInfo.a lib/libLLVMARMUtils.a lib/libLLVMAArch64CodeGen.a lib/libLLVMAArch64AsmParser.a lib/libLLVMAArch64AsmPrinter.a lib/libLLVMAArch64Desc.a lib/libLLVMAArch64Disassembler.a lib/libLLVMAArch64Info.a lib/libLLVMAArch64Utils.a lib/libLLVMCore.a lib/libLLVMDlltoolDriver.a lib/libLLVMLibDriver.a lib/libLLVMObject.a lib/libLLVMSupport.a lib/libLLVMX86AsmPrinter.a lib/libLLVMX86Utils.a lib/libLLVMARMDesc.a lib/libLLVMARMAsmPrinter.a lib/libLLVMARMInfo.a lib/libLLVMARMUtils.a lib/libLLVMAsmPrinter.a lib/libLLVMGlobalISel.a lib/libLLVMSelectionDAG.a lib/libLLVMCodeGen.a lib/libLLVMBitWriter.a lib/libLLVMTarget.a lib/libLLVMScalarOpts.a lib/libLLVMAggressiveInstCombine.a lib/libLLVMInstCombine.a lib/libLLVMTransformUtils.a lib/libLLVMAnalysis.a lib/libLLVMProfileData.a lib/libLLVMAArch64Desc.a lib/libLLVMAArch64AsmPrinter.a lib/libLLVMAArch64Info.a lib/libLLVMAArch64Utils.a lib/libLLVMMCDisassembler.a lib/libLLVMObject.a lib/libLLVMMCParser.a lib/libLLVMMC.a lib/libLLVMDebugInfoCodeView.a lib/libLLVMDebugInfoMSF.a lib/libLLVMBitReader.a lib/libLLVMCore.a lib/libLLVMBinaryFormat.a lib/libLLVMOption.a lib/libLLVMSupport.a -lz -lcurses -lm lib/libLLVMDemangle.a && cd /Users/buildslave/jenkins/workspace/clang-stage2-Rthinlto-release_70/clang-build/Build/tools/llvm-ar && xcrun dsymutil /Users/buildslave/jenkins/workspace/clang-stage2-Rthinlto-release_70/clang-build/Build/bin/llvm-ar && /usr/bin/strip -Sxl /Users/buildslave/jenkins/workspace/clang-stage2-Rthinlto-release_70/clang-build/Build/bin/llvm-ar
clang-7: error: unable to execute command: Bus error: 10
clang-7: error: linker command failed due to signal (use -v to see invocation)
[3048/3408] /Users/buildslave/jenkins/workspace/clang-stage2-Rthinlto-release_70/host-compiler/bin/clang++  -DGTEST_HAS_RTTI=0 -DGTEST_HAS_TR1_TUPLE=0 -DGTEST_LANG_CXX11=1 -D__STDC_CONSTANT_MACROS -D__STDC_FORMAT_MACROS -D__STDC_LIMIT_MACROS -Iunittests/ADT -I/Users/buildslave/jenkins/workspace/clang-stage2-Rthinlto-release_70/llvm/unittests/ADT -I/Applications/Xcode.app/Contents/Developer/Platforms/MacOSX.platform/Developer/SDKs/MacOSX10.14.sdk/usr/include/libxml2 -Iinclude -I/Users/buildslave/jenkins/workspace/clang-stage2-Rthinlto-release_70/llvm/include -I/Users/buildslave/jenkins/workspace/clang-stage2-Rthinlto-release_70/llvm/utils/unittest/googletest/include -I/Users/buildslave/jenkins/workspace/clang-stage2-Rthinlto-release_70/llvm/utils/unittest/googlemock/include -fno-stack-protector -fno-common -Wno-profile-instr-unprofiled -fPIC -fvisibility-inlines-hidden -Werror=date-time -Werror=unguarded-availability-new -std=c++11 -fmodules -fmodules-cache-path=/Users/buildslave/jenkins/workspace/clang-stage2-Rthinlto-release_70/clang-build/Build/module.cache -fcxx-modules -gmodules -Wall -Wextra -Wno-unused-parameter -Wwrite-strings -Wcast-qual -Wmissing-field-initializers -pedantic -Wno-long-long -Wcovered-switch-default -Wnon-virtual-dtor -Wdelete-non-virtual-dtor -Wstring-conversion -fdiagnostics-color -flto=thin -O2 -g -DNDEBUG -isysroot /Applications/Xcode.app/Contents/Developer/Platforms/MacOSX.platform/Developer/SDKs/MacOSX10.14.sdk    -Wno-variadic-macros -Wno-gnu-zero-variadic-macro-arguments -fno-exceptions -fno-rtti -MD -MT unittests/ADT/CMakeFiles/ADTTests.dir/RangeAdapterTest.cpp.o -MF unittests/ADT/CMakeFiles/ADTTests.dir/RangeAdapterTest.cpp.o.d -o unittests/ADT/CMakeFiles/ADTTests.dir/RangeAdapterTest.cpp.o -c /Users/buildslave/jenkins/workspace/clang-stage2-Rthinlto-release_70/llvm/unittests/ADT/RangeAdapterTest.cpp
[3049/3408] /Users/buildslave/jenkins/workspace/clang-stage2-Rthinlto-release_70/host-compiler/bin/clang++  -DGTEST_HAS_RTTI=0 -DGTEST_HAS_TR1_TUPLE=0 -DGTEST_LANG_CXX11=1 -D__STDC_CONSTANT_MACROS -D__STDC_FORMAT_MACROS -D__STDC_LIMIT_MACROS -Iunittests/ADT -I/Users/buildslave/jenkins/workspace/clang-stage2-Rthinlto-release_70/llvm/unittests/ADT -I/Applications/Xcode.app/Contents/Developer/Platforms/MacOSX.platform/Developer/SDKs/MacOSX10.14.sdk/usr/include/libxml2 -Iinclude -I/Users/buildslave/jenkins/workspace/clang-stage2-Rthinlto-release_70/llvm/include -I/Users/buildslave/jenkins/workspace/clang-stage2-Rthinlto-release_70/llvm/utils/unittest/googletest/include -I/Users/buildslave/jenkins/workspace/clang-stage2-Rthinlto-release_70/llvm/utils/unittest/googlemock/include -fno-stack-protector -fno-common -Wno-profile-instr-unprofiled -fPIC -fvisibility-inlines-hidden -Werror=date-time -Werror=unguarded-availability-new -std=c++11 -fmodules -fmodules-cache-path=/Users/buildslave/jenkins/workspace/clang-stage2-Rthinlto-release_70/clang-build/Build/module.cache -fcxx-modules -gmodules -Wall -Wextra -Wno-unused-parameter -Wwrite-strings -Wcast-qual -Wmissing-field-initializers -pedantic -Wno-long-long -Wcovered-switch-default -Wnon-virtual-dtor -Wdelete-non-virtual-dtor -Wstring-conversion -fdiagnostics-color -flto=thin -O2 -g -DNDEBUG -isysroot /Applications/Xcode.app/Contents/Developer/Platforms/MacOSX.platform/Developer/SDKs/MacOSX10.14.sdk    -Wno-variadic-macros -Wno-gnu-zero-variadic-macro-arguments -fno-exceptions -fno-rtti -MD -MT unittests/ADT/CMakeFiles/ADTTests.dir/SequenceTest.cpp.o -MF unittests/ADT/CMakeFiles/ADTTests.dir/SequenceTest.cpp.o.d -o unittests/ADT/CMakeFiles/ADTTests.dir/SequenceTest.cpp.o -c /Users/buildslave/jenkins/workspace/clang-stage2-Rthinlto-release_70/llvm/unittests/ADT/SequenceTest.cpp
[3050/3408] /Users/buildslave/jenkins/workspace/clang-stage2-Rthinlto-release_70/host-compiler/bin/clang++  -DCLANG_REPOSITORY_STRING=\"master\" -DCLANG_VENDOR="\"Apple \"" -DGTEST_HAS_RTTI=0 -DGTEST_HAS_TR1_TUPLE=0 -DGTEST_LANG_CXX11=1 -D_GNU_SOURCE -D__STDC_CONSTANT_MACROS -D__STDC_FORMAT_MACROS -D__STDC_LIMIT_MACROS -Itools/clang/unittests/Format -I/Users/buildslave/jenkins/workspace/clang-stage2-Rthinlto-release_70/llvm/tools/clang/unittests/Format -I/Users/buildslave/jenkins/workspace/clang-stage2-Rthinlto-release_70/llvm/tools/clang/include -Itools/clang/include -I/Applications/Xcode.app/Contents/Developer/Platforms/MacOSX.platform/Developer/SDKs/MacOSX10.14.sdk/usr/include/libxml2 -Iinclude -I/Users/buildslave/jenkins/workspace/clang-stage2-Rthinlto-release_70/llvm/include -I/Users/buildslave/jenkins/workspace/clang-stage2-Rthinlto-release_70/llvm/utils/unittest/googletest/include -I/Users/buildslave/jenkins/workspace/clang-stage2-Rthinlto-release_70/llvm/utils/unittest/googlemock/include -fno-stack-protector -fno-common -Wno-profile-instr-unprofiled -fPIC -fvisibility-inlines-hidden -Werror=date-time -Werror=unguarded-availability-new -std=c++11 -fmodules -fmodules-cache-path=/Users/buildslave/jenkins/workspace/clang-stage2-Rthinlto-release_70/clang-build/Build/module.cache -fcxx-modules -gmodules -Wall -Wextra -Wno-unused-parameter -Wwrite-strings -Wcast-qual -Wmissing-field-initializers -pedantic -Wno-long-long -Wcovered-switch-default -Wnon-virtual-dtor -Wdelete-non-virtual-dtor -Wstring-conversion -fdiagnostics-color -flto=thin -fno-common -Woverloaded-virtual -Wno-nested-anon-types -O2 -g -DNDEBUG -isysroot /Applications/Xcode.app/Contents/Developer/Platforms/MacOSX.platform/Developer/SDKs/MacOSX10.14.sdk    -Wno-variadic-macros -Wno-gnu-zero-variadic-macro-arguments -fno-exceptions -fno-rtti -MD -MT tools/clang/unittests/Format/CMakeFiles/FormatTests.dir/FormatTest.cpp.o -MF tools/clang/unittests/Format/CMakeFiles/FormatTests.dir/FormatTest.cpp.o.d -o tools/clang/unittests/Format/CMakeFiles/FormatTests.dir/FormatTest.cpp.o -c /Users/buildslave/jenkins/workspace/clang-stage2-Rthinlto-release_70/llvm/tools/clang/unittests/Format/FormatTest.cpp
[3051/3408] /Users/buildslave/jenkins/workspace/clang-stage2-Rthinlto-release_70/host-compiler/bin/clang++  -DGTEST_HAS_RTTI=0 -DGTEST_HAS_TR1_TUPLE=0 -DGTEST_LANG_CXX11=1 -D__STDC_CONSTANT_MACROS -D__STDC_FORMAT_MACROS -D__STDC_LIMIT_MACROS -Iunittests/ADT -I/Users/buildslave/jenkins/workspace/clang-stage2-Rthinlto-release_70/llvm/unittests/ADT -I/Applications/Xcode.app/Contents/Developer/Platforms/MacOSX.platform/Developer/SDKs/MacOSX10.14.sdk/usr/include/libxml2 -Iinclude -I/Users/buildslave/jenkins/workspace/clang-stage2-Rthinlto-release_70/llvm/include -I/Users/buildslave/jenkins/workspace/clang-stage2-Rthinlto-release_70/llvm/utils/unittest/googletest/include -I/Users/buildslave/jenkins/workspace/clang-stage2-Rthinlto-release_70/llvm/utils/unittest/googlemock/include -fno-stack-protector -fno-common -Wno-profile-instr-unprofiled -fPIC -fvisibility-inlines-hidden -Werror=date-time -Werror=unguarded-availability-new -std=c++11 -fmodules -fmodules-cache-path=/Users/buildslave/jenkins/workspace/clang-stage2-Rthinlto-release_70/clang-build/Build/module.cache -fcxx-modules -gmodules -Wall -Wextra -Wno-unused-parameter -Wwrite-strings -Wcast-qual -Wmissing-field-initializers -pedantic -Wno-long-long -Wcovered-switch-default -Wnon-virtual-dtor -Wdelete-non-virtual-dtor -Wstring-conversion -fdiagnostics-color -flto=thin -O2 -g -DNDEBUG -isysroot /Applications/Xcode.app/Contents/Developer/Platforms/MacOSX.platform/Developer/SDKs/MacOSX10.14.sdk    -Wno-variadic-macros -Wno-gnu-zero-variadic-macro-arguments -fno-exceptions -fno-rtti -MD -MT unittests/ADT/CMakeFiles/ADTTests.dir/PriorityWorklistTest.cpp.o -MF unittests/ADT/CMakeFiles/ADTTests.dir/PriorityWorklistTest.cpp.o.d -o unittests/ADT/CMakeFiles/ADTTests.dir/PriorityWorklistTest.cpp.o -c /Users/buildslave/jenkins/workspace/clang-stage2-Rthinlto-release_70/llvm/unittests/ADT/PriorityWorklistTest.cpp
[3052/3408] /Users/buildslave/jenkins/workspace/clang-stage2-Rthinlto-release_70/host-compiler/bin/clang++  -DCLANG_REPOSITORY_STRING=\"master\" -DCLANG_VENDOR="\"Apple \"" -DGTEST_HAS_RTTI=0 -DGTEST_HAS_TR1_TUPLE=0 -DGTEST_LANG_CXX11=1 -D_GNU_SOURCE -D__STDC_CONSTANT_MACROS -D__STDC_FORMAT_MACROS -D__STDC_LIMIT_MACROS -Itools/clang/unittests/Tooling -I/Users/buildslave/jenkins/workspace/clang-stage2-Rthinlto-release_70/llvm/tools/clang/unittests/Tooling -I/Users/buildslave/jenkins/workspace/clang-stage2-Rthinlto-release_70/llvm/tools/clang/include -Itools/clang/include -I/Applications/Xcode.app/Contents/Developer/Platforms/MacOSX.platform/Developer/SDKs/MacOSX10.14.sdk/usr/include/libxml2 -Iinclude -I/Users/buildslave/jenkins/workspace/clang-stage2-Rthinlto-release_70/llvm/include -I/Users/buildslave/jenkins/workspace/clang-stage2-Rthinlto-release_70/llvm/utils/unittest/googletest/include -I/Users/buildslave/jenkins/workspace/clang-stage2-Rthinlto-release_70/llvm/utils/unittest/googlemock/include -fno-stack-protector -fno-common -Wno-profile-instr-unprofiled -fPIC -fvisibility-inlines-hidden -Werror=date-time -Werror=unguarded-availability-new -std=c++11 -fmodules -fmodules-cache-path=/Users/buildslave/jenkins/workspace/clang-stage2-Rthinlto-release_70/clang-build/Build/module.cache -fcxx-modules -gmodules -Wall -Wextra -Wno-unused-parameter -Wwrite-strings -Wcast-qual -Wmissing-field-initializers -pedantic -Wno-long-long -Wcovered-switch-default -Wnon-virtual-dtor -Wdelete-non-virtual-dtor -Wstring-conversion -fdiagnostics-color -flto=thin -fno-common -Woverloaded-virtual -Wno-nested-anon-types -O2 -g -DNDEBUG -isysroot /Applications/Xcode.app/Contents/Developer/Platforms/MacOSX.platform/Developer/SDKs/MacOSX10.14.sdk    -Wno-variadic-macros -Wno-gnu-zero-variadic-macro-arguments -fno-exceptions -fno-rtti -MD -MT tools/clang/unittests/Tooling/CMakeFiles/ToolingTests.dir/RecursiveASTVisitorTests/LambdaDefaultCapture.cpp.o -MF tools/clang/unittests/Tooling/CMakeFiles/ToolingTests.dir/RecursiveASTVisitorTests/LambdaDefaultCapture.cpp.o.d -o tools/clang/unittests/Tooling/CMakeFiles/ToolingTests.dir/RecursiveASTVisitorTests/LambdaDefaultCapture.cpp.o -c /Users/buildslave/jenkins/workspace/clang-stage2-Rthinlto-release_70/llvm/tools/clang/unittests/Tooling/RecursiveASTVisitorTests/LambdaDefaultCapture.cpp
[3053/3408] /Users/buildslave/jenkins/workspace/clang-stage2-Rthinlto-release_70/host-compiler/bin/clang++  -DGTEST_HAS_RTTI=0 -DGTEST_HAS_TR1_TUPLE=0 -DGTEST_LANG_CXX11=1 -D__STDC_CONSTANT_MACROS -D__STDC_FORMAT_MACROS -D__STDC_LIMIT_MACROS -Iunittests/ADT -I/Users/buildslave/jenkins/workspace/clang-stage2-Rthinlto-release_70/llvm/unittests/ADT -I/Applications/Xcode.app/Contents/Developer/Platforms/MacOSX.platform/Developer/SDKs/MacOSX10.14.sdk/usr/include/libxml2 -Iinclude -I/Users/buildslave/jenkins/workspace/clang-stage2-Rthinlto-release_70/llvm/include -I/Users/buildslave/jenkins/workspace/clang-stage2-Rthinlto-release_70/llvm/utils/unittest/googletest/include -I/Users/buildslave/jenkins/workspace/clang-stage2-Rthinlto-release_70/llvm/utils/unittest/googlemock/include -fno-stack-protector -fno-common -Wno-profile-instr-unprofiled -fPIC -fvisibility-inlines-hidden -Werror=date-time -Werror=unguarded-availability-new -std=c++11 -fmodules -fmodules-cache-path=/Users/buildslave/jenkins/workspace/clang-stage2-Rthinlto-release_70/clang-build/Build/module.cache -fcxx-modules -gmodules -Wall -Wextra -Wno-unused-parameter -Wwrite-strings -Wcast-qual -Wmissing-field-initializers -pedantic -Wno-long-long -Wcovered-switch-default -Wnon-virtual-dtor -Wdelete-non-virtual-dtor -Wstring-conversion -fdiagnostics-color -flto=thin -O2 -g -DNDEBUG -isysroot /Applications/Xcode.app/Contents/Developer/Platforms/MacOSX.platform/Developer/SDKs/MacOSX10.14.sdk    -Wno-variadic-macros -Wno-gnu-zero-variadic-macro-arguments -fno-exceptions -fno-rtti -MD -MT unittests/ADT/CMakeFiles/ADTTests.dir/IntervalMapTest.cpp.o -MF unittests/ADT/CMakeFiles/ADTTests.dir/IntervalMapTest.cpp.o.d -o unittests/ADT/CMakeFiles/ADTTests.dir/IntervalMapTest.cpp.o -c /Users/buildslave/jenkins/workspace/clang-stage2-Rthinlto-release_70/llvm/unittests/ADT/IntervalMapTest.cpp
[3054/3408] /Users/buildslave/jenkins/workspace/clang-stage2-Rthinlto-release_70/host-compiler/bin/clang++  -DCLANG_REPOSITORY_STRING=\"master\" -DCLANG_VENDOR="\"Apple \"" -DGTEST_HAS_RTTI=0 -DGTEST_HAS_TR1_TUPLE=0 -DGTEST_LANG_CXX11=1 -D_GNU_SOURCE -D__STDC_CONSTANT_MACROS -D__STDC_FORMAT_MACROS -D__STDC_LIMIT_MACROS -Itools/clang/unittests/Tooling -I/Users/buildslave/jenkins/workspace/clang-stage2-Rthinlto-release_70/llvm/tools/clang/unittests/Tooling -I/Users/buildslave/jenkins/workspace/clang-stage2-Rthinlto-release_70/llvm/tools/clang/include -Itools/clang/include -I/Applications/Xcode.app/Contents/Developer/Platforms/MacOSX.platform/Developer/SDKs/MacOSX10.14.sdk/usr/include/libxml2 -Iinclude -I/Users/buildslave/jenkins/workspace/clang-stage2-Rthinlto-release_70/llvm/include -I/Users/buildslave/jenkins/workspace/clang-stage2-Rthinlto-release_70/llvm/utils/unittest/googletest/include -I/Users/buildslave/jenkins/workspace/clang-stage2-Rthinlto-release_70/llvm/utils/unittest/googlemock/include -fno-stack-protector -fno-common -Wno-profile-instr-unprofiled -fPIC -fvisibility-inlines-hidden -Werror=date-time -Werror=unguarded-availability-new -std=c++11 -fmodules -fmodules-cache-path=/Users/buildslave/jenkins/workspace/clang-stage2-Rthinlto-release_70/clang-build/Build/module.cache -fcxx-modules -gmodules -Wall -Wextra -Wno-unused-parameter -Wwrite-strings -Wcast-qual -Wmissing-field-initializers -pedantic -Wno-long-long -Wcovered-switch-default -Wnon-virtual-dtor -Wdelete-non-virtual-dtor -Wstring-conversion -fdiagnostics-color -flto=thin -fno-common -Woverloaded-virtual -Wno-nested-anon-types -O2 -g -DNDEBUG -isysroot /Applications/Xcode.app/Contents/Developer/Platforms/MacOSX.platform/Developer/SDKs/MacOSX10.14.sdk    -Wno-variadic-macros -Wno-gnu-zero-variadic-macro-arguments -fno-exceptions -fno-rtti -MD -MT tools/clang/unittests/Tooling/CMakeFiles/ToolingTests.dir/RecursiveASTVisitorTests/LambdaExpr.cpp.o -MF tools/clang/unittests/Tooling/CMakeFiles/ToolingTests.dir/RecursiveASTVisitorTests/LambdaExpr.cpp.o.d -o tools/clang/unittests/Tooling/CMakeFiles/ToolingTests.dir/RecursiveASTVisitorTests/LambdaExpr.cpp.o -c /Users/buildslave/jenkins/workspace/clang-stage2-Rthinlto-release_70/llvm/tools/clang/unittests/Tooling/RecursiveASTVisitorTests/LambdaExpr.cpp
[3055/3408] /Users/buildslave/jenkins/workspace/clang-stage2-Rthinlto-release_70/host-compiler/bin/clang++  -DCLANG_REPOSITORY_STRING=\"master\" -DCLANG_VENDOR="\"Apple \"" -DGTEST_HAS_RTTI=0 -DGTEST_HAS_TR1_TUPLE=0 -DGTEST_LANG_CXX11=1 -D_GNU_SOURCE -D__STDC_CONSTANT_MACROS -D__STDC_FORMAT_MACROS -D__STDC_LIMIT_MACROS -Itools/clang/unittests/Tooling -I/Users/buildslave/jenkins/workspace/clang-stage2-Rthinlto-release_70/llvm/tools/clang/unittests/Tooling -I/Users/buildslave/jenkins/workspace/clang-stage2-Rthinlto-release_70/llvm/tools/clang/include -Itools/clang/include -I/Applications/Xcode.app/Contents/Developer/Platforms/MacOSX.platform/Developer/SDKs/MacOSX10.14.sdk/usr/include/libxml2 -Iinclude -I/Users/buildslave/jenkins/workspace/clang-stage2-Rthinlto-release_70/llvm/include -I/Users/buildslave/jenkins/workspace/clang-stage2-Rthinlto-release_70/llvm/utils/unittest/googletest/include -I/Users/buildslave/jenkins/workspace/clang-stage2-Rthinlto-release_70/llvm/utils/unittest/googlemock/include -fno-stack-protector -fno-common -Wno-profile-instr-unprofiled -fPIC -fvisibility-inlines-hidden -Werror=date-time -Werror=unguarded-availability-new -std=c++11 -fmodules -fmodules-cache-path=/Users/buildslave/jenkins/workspace/clang-stage2-Rthinlto-release_70/clang-build/Build/module.cache -fcxx-modules -gmodules -Wall -Wextra -Wno-unused-parameter -Wwrite-strings -Wcast-qual -Wmissing-field-initializers -pedantic -Wno-long-long -Wcovered-switch-default -Wnon-virtual-dtor -Wdelete-non-virtual-dtor -Wstring-conversion -fdiagnostics-color -flto=thin -fno-common -Woverloaded-virtual -Wno-nested-anon-types -O2 -g -DNDEBUG -isysroot /Applications/Xcode.app/Contents/Developer/Platforms/MacOSX.platform/Developer/SDKs/MacOSX10.14.sdk    -Wno-variadic-macros -Wno-gnu-zero-variadic-macro-arguments -fno-exceptions -fno-rtti -MD -MT tools/clang/unittests/Tooling/CMakeFiles/ToolingTests.dir/RecursiveASTVisitorTests/NestedNameSpecifiers.cpp.o -MF tools/clang/unittests/Tooling/CMakeFiles/ToolingTests.dir/RecursiveASTVisitorTests/NestedNameSpecifiers.cpp.o.d -o tools/clang/unittests/Tooling/CMakeFiles/ToolingTests.dir/RecursiveASTVisitorTests/NestedNameSpecifiers.cpp.o -c /Users/buildslave/jenkins/workspace/clang-stage2-Rthinlto-release_70/llvm/tools/clang/unittests/Tooling/RecursiveASTVisitorTests/NestedNameSpecifiers.cpp
[3056/3408] /Users/buildslave/jenkins/workspace/clang-stage2-Rthinlto-release_70/host-compiler/bin/clang++  -DGTEST_HAS_RTTI=0 -DGTEST_HAS_TR1_TUPLE=0 -DGTEST_LANG_CXX11=1 -D__STDC_CONSTANT_MACROS -D__STDC_FORMAT_MACROS -D__STDC_LIMIT_MACROS -Iunittests/ADT -I/Users/buildslave/jenkins/workspace/clang-stage2-Rthinlto-release_70/llvm/unittests/ADT -I/Applications/Xcode.app/Contents/Developer/Platforms/MacOSX.platform/Developer/SDKs/MacOSX10.14.sdk/usr/include/libxml2 -Iinclude -I/Users/buildslave/jenkins/workspace/clang-stage2-Rthinlto-release_70/llvm/include -I/Users/buildslave/jenkins/workspace/clang-stage2-Rthinlto-release_70/llvm/utils/unittest/googletest/include -I/Users/buildslave/jenkins/workspace/clang-stage2-Rthinlto-release_70/llvm/utils/unittest/googlemock/include -fno-stack-protector -fno-common -Wno-profile-instr-unprofiled -fPIC -fvisibility-inlines-hidden -Werror=date-time -Werror=unguarded-availability-new -std=c++11 -fmodules -fmodules-cache-path=/Users/buildslave/jenkins/workspace/clang-stage2-Rthinlto-release_70/clang-build/Build/module.cache -fcxx-modules -gmodules -Wall -Wextra -Wno-unused-parameter -Wwrite-strings -Wcast-qual -Wmissing-field-initializers -pedantic -Wno-long-long -Wcovered-switch-default -Wnon-virtual-dtor -Wdelete-non-virtual-dtor -Wstring-conversion -fdiagnostics-color -flto=thin -O2 -g -DNDEBUG -isysroot /Applications/Xcode.app/Contents/Developer/Platforms/MacOSX.platform/Developer/SDKs/MacOSX10.14.sdk    -Wno-variadic-macros -Wno-gnu-zero-variadic-macro-arguments -fno-exceptions -fno-rtti -MD -MT unittests/ADT/CMakeFiles/ADTTests.dir/DenseMapTest.cpp.o -MF unittests/ADT/CMakeFiles/ADTTests.dir/DenseMapTest.cpp.o.d -o unittests/ADT/CMakeFiles/ADTTests.dir/DenseMapTest.cpp.o -c /Users/buildslave/jenkins/workspace/clang-stage2-Rthinlto-release_70/llvm/unittests/ADT/DenseMapTest.cpp
[3057/3408] /Users/buildslave/jenkins/workspace/clang-stage2-Rthinlto-release_70/host-compiler/bin/clang++  -DGTEST_HAS_RTTI=0 -DGTEST_HAS_TR1_TUPLE=0 -DGTEST_LANG_CXX11=1 -D__STDC_CONSTANT_MACROS -D__STDC_FORMAT_MACROS -D__STDC_LIMIT_MACROS -Iunittests/ADT -I/Users/buildslave/jenkins/workspace/clang-stage2-Rthinlto-release_70/llvm/unittests/ADT -I/Applications/Xcode.app/Contents/Developer/Platforms/MacOSX.platform/Developer/SDKs/MacOSX10.14.sdk/usr/include/libxml2 -Iinclude -I/Users/buildslave/jenkins/workspace/clang-stage2-Rthinlto-release_70/llvm/include -I/Users/buildslave/jenkins/workspace/clang-stage2-Rthinlto-release_70/llvm/utils/unittest/googletest/include -I/Users/buildslave/jenkins/workspace/clang-stage2-Rthinlto-release_70/llvm/utils/unittest/googlemock/include -fno-stack-protector -fno-common -Wno-profile-instr-unprofiled -fPIC -fvisibility-inlines-hidden -Werror=date-time -Werror=unguarded-availability-new -std=c++11 -fmodules -fmodules-cache-path=/Users/buildslave/jenkins/workspace/clang-stage2-Rthinlto-release_70/clang-build/Build/module.cache -fcxx-modules -gmodules -Wall -Wextra -Wno-unused-parameter -Wwrite-strings -Wcast-qual -Wmissing-field-initializers -pedantic -Wno-long-long -Wcovered-switch-default -Wnon-virtual-dtor -Wdelete-non-virtual-dtor -Wstring-conversion -fdiagnostics-color -flto=thin -O2 -g -DNDEBUG -isysroot /Applications/Xcode.app/Contents/Developer/Platforms/MacOSX.platform/Developer/SDKs/MacOSX10.14.sdk    -Wno-variadic-macros -Wno-gnu-zero-variadic-macro-arguments -fno-exceptions -fno-rtti -MD -MT unittests/ADT/CMakeFiles/ADTTests.dir/BitVectorTest.cpp.o -MF unittests/ADT/CMakeFiles/ADTTests.dir/BitVectorTest.cpp.o.d -o unittests/ADT/CMakeFiles/ADTTests.dir/BitVectorTest.cpp.o -c /Users/buildslave/jenkins/workspace/clang-stage2-Rthinlto-release_70/llvm/unittests/ADT/BitVectorTest.cpp
[3058/3408] /Users/buildslave/jenkins/workspace/clang-stage2-Rthinlto-release_70/host-compiler/bin/clang++  -DCLANG_REPOSITORY_STRING=\"master\" -DCLANG_VENDOR="\"Apple \"" -DGTEST_HAS_RTTI=0 -DGTEST_HAS_TR1_TUPLE=0 -DGTEST_LANG_CXX11=1 -D_GNU_SOURCE -D__STDC_CONSTANT_MACROS -D__STDC_FORMAT_MACROS -D__STDC_LIMIT_MACROS -Itools/clang/unittests/Tooling -I/Users/buildslave/jenkins/workspace/clang-stage2-Rthinlto-release_70/llvm/tools/clang/unittests/Tooling -I/Users/buildslave/jenkins/workspace/clang-stage2-Rthinlto-release_70/llvm/tools/clang/include -Itools/clang/include -I/Applications/Xcode.app/Contents/Developer/Platforms/MacOSX.platform/Developer/SDKs/MacOSX10.14.sdk/usr/include/libxml2 -Iinclude -I/Users/buildslave/jenkins/workspace/clang-stage2-Rthinlto-release_70/llvm/include -I/Users/buildslave/jenkins/workspace/clang-stage2-Rthinlto-release_70/llvm/utils/unittest/googletest/include -I/Users/buildslave/jenkins/workspace/clang-stage2-Rthinlto-release_70/llvm/utils/unittest/googlemock/include -fno-stack-protector -fno-common -Wno-profile-instr-unprofiled -fPIC -fvisibility-inlines-hidden -Werror=date-time -Werror=unguarded-availability-new -std=c++11 -fmodules -fmodules-cache-path=/Users/buildslave/jenkins/workspace/clang-stage2-Rthinlto-release_70/clang-build/Build/module.cache -fcxx-modules -gmodules -Wall -Wextra -Wno-unused-parameter -Wwrite-strings -Wcast-qual -Wmissing-field-initializers -pedantic -Wno-long-long -Wcovered-switch-default -Wnon-virtual-dtor -Wdelete-non-virtual-dtor -Wstring-conversion -fdiagnostics-color -flto=thin -fno-common -Woverloaded-virtual -Wno-nested-anon-types -O2 -g -DNDEBUG -isysroot /Applications/Xcode.app/Contents/Developer/Platforms/MacOSX.platform/Developer/SDKs/MacOSX10.14.sdk    -Wno-variadic-macros -Wno-gnu-zero-variadic-macro-arguments -fno-exceptions -fno-rtti -MD -MT tools/clang/unittests/Tooling/CMakeFiles/ToolingTests.dir/RecursiveASTVisitorTests/ParenExpr.cpp.o -MF tools/clang/unittests/Tooling/CMakeFiles/ToolingTests.dir/RecursiveASTVisitorTests/ParenExpr.cpp.o.d -o tools/clang/unittests/Tooling/CMakeFiles/ToolingTests.dir/RecursiveASTVisitorTests/ParenExpr.cpp.o -c /Users/buildslave/jenkins/workspace/clang-stage2-Rthinlto-release_70/llvm/tools/clang/unittests/Tooling/RecursiveASTVisitorTests/ParenExpr.cpp
[3059/3408] /Users/buildslave/jenkins/workspace/clang-stage2-Rthinlto-release_70/host-compiler/bin/clang++  -DCLANG_REPOSITORY_STRING=\"master\" -DCLANG_VENDOR="\"Apple \"" -DGTEST_HAS_RTTI=0 -D_GNU_SOURCE -D__STDC_CONSTANT_MACROS -D__STDC_FORMAT_MACROS -D__STDC_LIMIT_MACROS -Itools/clang/lib/Sema -I/Users/buildslave/jenkins/workspace/clang-stage2-Rthinlto-release_70/llvm/tools/clang/lib/Sema -I/Users/buildslave/jenkins/workspace/clang-stage2-Rthinlto-release_70/llvm/tools/clang/include -Itools/clang/include -I/Applications/Xcode.app/Contents/Developer/Platforms/MacOSX.platform/Developer/SDKs/MacOSX10.14.sdk/usr/include/libxml2 -Iinclude -I/Users/buildslave/jenkins/workspace/clang-stage2-Rthinlto-release_70/llvm/include -fno-stack-protector -fno-common -Wno-profile-instr-unprofiled -fPIC -fvisibility-inlines-hidden -Werror=date-time -Werror=unguarded-availability-new -std=c++11 -fmodules -fmodules-cache-path=/Users/buildslave/jenkins/workspace/clang-stage2-Rthinlto-release_70/clang-build/Build/module.cache -fcxx-modules -gmodules -Wall -Wextra -Wno-unused-parameter -Wwrite-strings -Wcast-qual -Wmissing-field-initializers -pedantic -Wno-long-long -Wcovered-switch-default -Wnon-virtual-dtor -Wdelete-non-virtual-dtor -Wstring-conversion -fdiagnostics-color -flto=thin -fno-common -Woverloaded-virtual -Wno-nested-anon-types -O2 -g -DNDEBUG -isysroot /Applications/Xcode.app/Contents/Developer/Platforms/MacOSX.platform/Developer/SDKs/MacOSX10.14.sdk    -fno-exceptions -fno-rtti -MD -MT tools/clang/lib/Sema/CMakeFiles/clangSema.dir/SemaChecking.cpp.o -MF tools/clang/lib/Sema/CMakeFiles/clangSema.dir/SemaChecking.cpp.o.d -o tools/clang/lib/Sema/CMakeFiles/clangSema.dir/SemaChecking.cpp.o -c /Users/buildslave/jenkins/workspace/clang-stage2-Rthinlto-release_70/llvm/tools/clang/lib/Sema/SemaChecking.cpp
[3060/3408] /Users/buildslave/jenkins/workspace/clang-stage2-Rthinlto-release_70/host-compiler/bin/clang++  -DCLANG_REPOSITORY_STRING=\"master\" -DCLANG_VENDOR="\"Apple \"" -DGTEST_HAS_RTTI=0 -DGTEST_HAS_TR1_TUPLE=0 -DGTEST_LANG_CXX11=1 -D_GNU_SOURCE -D__STDC_CONSTANT_MACROS -D__STDC_FORMAT_MACROS -D__STDC_LIMIT_MACROS -Itools/clang/unittests/Tooling -I/Users/buildslave/jenkins/workspace/clang-stage2-Rthinlto-release_70/llvm/tools/clang/unittests/Tooling -I/Users/buildslave/jenkins/workspace/clang-stage2-Rthinlto-release_70/llvm/tools/clang/include -Itools/clang/include -I/Applications/Xcode.app/Contents/Developer/Platforms/MacOSX.platform/Developer/SDKs/MacOSX10.14.sdk/usr/include/libxml2 -Iinclude -I/Users/buildslave/jenkins/workspace/clang-stage2-Rthinlto-release_70/llvm/include -I/Users/buildslave/jenkins/workspace/clang-stage2-Rthinlto-release_70/llvm/utils/unittest/googletest/include -I/Users/buildslave/jenkins/workspace/clang-stage2-Rthinlto-release_70/llvm/utils/unittest/googlemock/include -fno-stack-protector -fno-common -Wno-profile-instr-unprofiled -fPIC -fvisibility-inlines-hidden -Werror=date-time -Werror=unguarded-availability-new -std=c++11 -fmodules -fmodules-cache-path=/Users/buildslave/jenkins/workspace/clang-stage2-Rthinlto-release_70/clang-build/Build/module.cache -fcxx-modules -gmodules -Wall -Wextra -Wno-unused-parameter -Wwrite-strings -Wcast-qual -Wmissing-field-initializers -pedantic -Wno-long-long -Wcovered-switch-default -Wnon-virtual-dtor -Wdelete-non-virtual-dtor -Wstring-conversion -fdiagnostics-color -flto=thin -fno-common -Woverloaded-virtual -Wno-nested-anon-types -O2 -g -DNDEBUG -isysroot /Applications/Xcode.app/Contents/Developer/Platforms/MacOSX.platform/Developer/SDKs/MacOSX10.14.sdk    -Wno-variadic-macros -Wno-gnu-zero-variadic-macro-arguments -fno-exceptions -fno-rtti -MD -MT tools/clang/unittests/Tooling/CMakeFiles/ToolingTests.dir/RecursiveASTVisitorTests/TemplateArgumentLocTraverser.cpp.o -MF tools/clang/unittests/Tooling/CMakeFiles/ToolingTests.dir/RecursiveASTVisitorTests/TemplateArgumentLocTraverser.cpp.o.d -o tools/clang/unittests/Tooling/CMakeFiles/ToolingTests.dir/RecursiveASTVisitorTests/TemplateArgumentLocTraverser.cpp.o -c /Users/buildslave/jenkins/workspace/clang-stage2-Rthinlto-release_70/llvm/tools/clang/unittests/Tooling/RecursiveASTVisitorTests/TemplateArgumentLocTraverser.cpp
[3061/3408] /Users/buildslave/jenkins/workspace/clang-stage2-Rthinlto-release_70/host-compiler/bin/clang++  -DCLANG_REPOSITORY_STRING=\"master\" -DCLANG_VENDOR="\"Apple \"" -DGTEST_HAS_RTTI=0 -DGTEST_HAS_TR1_TUPLE=0 -DGTEST_LANG_CXX11=1 -D_GNU_SOURCE -D__STDC_CONSTANT_MACROS -D__STDC_FORMAT_MACROS -D__STDC_LIMIT_MACROS -Itools/clang/unittests/Tooling -I/Users/buildslave/jenkins/workspace/clang-stage2-Rthinlto-release_70/llvm/tools/clang/unittests/Tooling -I/Users/buildslave/jenkins/workspace/clang-stage2-Rthinlto-release_70/llvm/tools/clang/include -Itools/clang/include -I/Applications/Xcode.app/Contents/Developer/Platforms/MacOSX.platform/Developer/SDKs/MacOSX10.14.sdk/usr/include/libxml2 -Iinclude -I/Users/buildslave/jenkins/workspace/clang-stage2-Rthinlto-release_70/llvm/include -I/Users/buildslave/jenkins/workspace/clang-stage2-Rthinlto-release_70/llvm/utils/unittest/googletest/include -I/Users/buildslave/jenkins/workspace/clang-stage2-Rthinlto-release_70/llvm/utils/unittest/googlemock/include -fno-stack-protector -fno-common -Wno-profile-instr-unprofiled -fPIC -fvisibility-inlines-hidden -Werror=date-time -Werror=unguarded-availability-new -std=c++11 -fmodules -fmodules-cache-path=/Users/buildslave/jenkins/workspace/clang-stage2-Rthinlto-release_70/clang-build/Build/module.cache -fcxx-modules -gmodules -Wall -Wextra -Wno-unused-parameter -Wwrite-strings -Wcast-qual -Wmissing-field-initializers -pedantic -Wno-long-long -Wcovered-switch-default -Wnon-virtual-dtor -Wdelete-non-virtual-dtor -Wstring-conversion -fdiagnostics-color -flto=thin -fno-common -Woverloaded-virtual -Wno-nested-anon-types -O2 -g -DNDEBUG -isysroot /Applications/Xcode.app/Contents/Developer/Platforms/MacOSX.platform/Developer/SDKs/MacOSX10.14.sdk    -Wno-variadic-macros -Wno-gnu-zero-variadic-macro-arguments -fno-exceptions -fno-rtti -MD -MT tools/clang/unittests/Tooling/CMakeFiles/ToolingTests.dir/RecursiveASTVisitorTestPostOrderVisitor.cpp.o -MF tools/clang/unittests/Tooling/CMakeFiles/ToolingTests.dir/RecursiveASTVisitorTestPostOrderVisitor.cpp.o.d -o tools/clang/unittests/Tooling/CMakeFiles/ToolingTests.dir/RecursiveASTVisitorTestPostOrderVisitor.cpp.o -c /Users/buildslave/jenkins/workspace/clang-stage2-Rthinlto-release_70/llvm/tools/clang/unittests/Tooling/RecursiveASTVisitorTestPostOrderVisitor.cpp
[3062/3408] /Users/buildslave/jenkins/workspace/clang-stage2-Rthinlto-release_70/host-compiler/bin/clang++  -DCLANG_REPOSITORY_STRING=\"master\" -DCLANG_VENDOR="\"Apple \"" -DGTEST_HAS_RTTI=0 -DGTEST_HAS_TR1_TUPLE=0 -DGTEST_LANG_CXX11=1 -D_GNU_SOURCE -D__STDC_CONSTANT_MACROS -D__STDC_FORMAT_MACROS -D__STDC_LIMIT_MACROS -Itools/clang/unittests/Tooling -I/Users/buildslave/jenkins/workspace/clang-stage2-Rthinlto-release_70/llvm/tools/clang/unittests/Tooling -I/Users/buildslave/jenkins/workspace/clang-stage2-Rthinlto-release_70/llvm/tools/clang/include -Itools/clang/include -I/Applications/Xcode.app/Contents/Developer/Platforms/MacOSX.platform/Developer/SDKs/MacOSX10.14.sdk/usr/include/libxml2 -Iinclude -I/Users/buildslave/jenkins/workspace/clang-stage2-Rthinlto-release_70/llvm/include -I/Users/buildslave/jenkins/workspace/clang-stage2-Rthinlto-release_70/llvm/utils/unittest/googletest/include -I/Users/buildslave/jenkins/workspace/clang-stage2-Rthinlto-release_70/llvm/utils/unittest/googlemock/include -fno-stack-protector -fno-common -Wno-profile-instr-unprofiled -fPIC -fvisibility-inlines-hidden -Werror=date-time -Werror=unguarded-availability-new -std=c++11 -fmodules -fmodules-cache-path=/Users/buildslave/jenkins/workspace/clang-stage2-Rthinlto-release_70/clang-build/Build/module.cache -fcxx-modules -gmodules -Wall -Wextra -Wno-unused-parameter -Wwrite-strings -Wcast-qual -Wmissing-field-initializers -pedantic -Wno-long-long -Wcovered-switch-default -Wnon-virtual-dtor -Wdelete-non-virtual-dtor -Wstring-conversion -fdiagnostics-color -flto=thin -fno-common -Woverloaded-virtual -Wno-nested-anon-types -O2 -g -DNDEBUG -isysroot /Applications/Xcode.app/Contents/Developer/Platforms/MacOSX.platform/Developer/SDKs/MacOSX10.14.sdk    -Wno-variadic-macros -Wno-gnu-zero-variadic-macro-arguments -fno-exceptions -fno-rtti -MD -MT tools/clang/unittests/Tooling/CMakeFiles/ToolingTests.dir/RecursiveASTVisitorTestTypeLocVisitor.cpp.o -MF tools/clang/unittests/Tooling/CMakeFiles/ToolingTests.dir/RecursiveASTVisitorTestTypeLocVisitor.cpp.o.d -o tools/clang/unittests/Tooling/CMakeFiles/ToolingTests.dir/RecursiveASTVisitorTestTypeLocVisitor.cpp.o -c /Users/buildslave/jenkins/workspace/clang-stage2-Rthinlto-release_70/llvm/tools/clang/unittests/Tooling/RecursiveASTVisitorTestTypeLocVisitor.cpp
[3063/3408] /Users/buildslave/jenkins/workspace/clang-stage2-Rthinlto-release_70/host-compiler/bin/clang++  -DCLANG_REPOSITORY_STRING=\"master\" -DCLANG_VENDOR="\"Apple \"" -DGTEST_HAS_RTTI=0 -D_GNU_SOURCE -D__STDC_CONSTANT_MACROS -D__STDC_FORMAT_MACROS -D__STDC_LIMIT_MACROS -Itools/clang/lib/Sema -I/Users/buildslave/jenkins/workspace/clang-stage2-Rthinlto-release_70/llvm/tools/clang/lib/Sema -I/Users/buildslave/jenkins/workspace/clang-stage2-Rthinlto-release_70/llvm/tools/clang/include -Itools/clang/include -I/Applications/Xcode.app/Contents/Developer/Platforms/MacOSX.platform/Developer/SDKs/MacOSX10.14.sdk/usr/include/libxml2 -Iinclude -I/Users/buildslave/jenkins/workspace/clang-stage2-Rthinlto-release_70/llvm/include -fno-stack-protector -fno-common -Wno-profile-instr-unprofiled -fPIC -fvisibility-inlines-hidden -Werror=date-time -Werror=unguarded-availability-new -std=c++11 -fmodules -fmodules-cache-path=/Users/buildslave/jenkins/workspace/clang-stage2-Rthinlto-release_70/clang-build/Build/module.cache -fcxx-modules -gmodules -Wall -Wextra -Wno-unused-parameter -Wwrite-strings -Wcast-qual -Wmissing-field-initializers -pedantic -Wno-long-long -Wcovered-switch-default -Wnon-virtual-dtor -Wdelete-non-virtual-dtor -Wstring-conversion -fdiagnostics-color -flto=thin -fno-common -Woverloaded-virtual -Wno-nested-anon-types -O2 -g -DNDEBUG -isysroot /Applications/Xcode.app/Contents/Developer/Platforms/MacOSX.platform/Developer/SDKs/MacOSX10.14.sdk    -fno-exceptions -fno-rtti -MD -MT tools/clang/lib/Sema/CMakeFiles/clangSema.dir/SemaDeclAttr.cpp.o -MF tools/clang/lib/Sema/CMakeFiles/clangSema.dir/SemaDeclAttr.cpp.o.d -o tools/clang/lib/Sema/CMakeFiles/clangSema.dir/SemaDeclAttr.cpp.o -c /Users/buildslave/jenkins/workspace/clang-stage2-Rthinlto-release_70/llvm/tools/clang/lib/Sema/SemaDeclAttr.cpp
[3064/3408] /Users/buildslave/jenkins/workspace/clang-stage2-Rthinlto-release_70/host-compiler/bin/clang++  -DCLANG_REPOSITORY_STRING=\"master\" -DCLANG_VENDOR="\"Apple \"" -DGTEST_HAS_RTTI=0 -DGTEST_HAS_TR1_TUPLE=0 -DGTEST_LANG_CXX11=1 -D_GNU_SOURCE -D__STDC_CONSTANT_MACROS -D__STDC_FORMAT_MACROS -D__STDC_LIMIT_MACROS -Itools/clang/unittests/Tooling -I/Users/buildslave/jenkins/workspace/clang-stage2-Rthinlto-release_70/llvm/tools/clang/unittests/Tooling -I/Users/buildslave/jenkins/workspace/clang-stage2-Rthinlto-release_70/llvm/tools/clang/include -Itools/clang/include -I/Applications/Xcode.app/Contents/Developer/Platforms/MacOSX.platform/Developer/SDKs/MacOSX10.14.sdk/usr/include/libxml2 -Iinclude -I/Users/buildslave/jenkins/workspace/clang-stage2-Rthinlto-release_70/llvm/include -I/Users/buildslave/jenkins/workspace/clang-stage2-Rthinlto-release_70/llvm/utils/unittest/googletest/include -I/Users/buildslave/jenkins/workspace/clang-stage2-Rthinlto-release_70/llvm/utils/unittest/googlemock/include -fno-stack-protector -fno-common -Wno-profile-instr-unprofiled -fPIC -fvisibility-inlines-hidden -Werror=date-time -Werror=unguarded-availability-new -std=c++11 -fmodules -fmodules-cache-path=/Users/buildslave/jenkins/workspace/clang-stage2-Rthinlto-release_70/clang-build/Build/module.cache -fcxx-modules -gmodules -Wall -Wextra -Wno-unused-parameter -Wwrite-strings -Wcast-qual -Wmissing-field-initializers -pedantic -Wno-long-long -Wcovered-switch-default -Wnon-virtual-dtor -Wdelete-non-virtual-dtor -Wstring-conversion -fdiagnostics-color -flto=thin -fno-common -Woverloaded-virtual -Wno-nested-anon-types -O2 -g -DNDEBUG -isysroot /Applications/Xcode.app/Contents/Developer/Platforms/MacOSX.platform/Developer/SDKs/MacOSX10.14.sdk    -Wno-variadic-macros -Wno-gnu-zero-variadic-macro-arguments -fno-exceptions -fno-rtti -MD -MT tools/clang/unittests/Tooling/CMakeFiles/ToolingTests.dir/RecursiveASTVisitorTestDeclVisitor.cpp.o -MF tools/clang/unittests/Tooling/CMakeFiles/ToolingTests.dir/RecursiveASTVisitorTestDeclVisitor.cpp.o.d -o tools/clang/unittests/Tooling/CMakeFiles/ToolingTests.dir/RecursiveASTVisitorTestDeclVisitor.cpp.o -c /Users/buildslave/jenkins/workspace/clang-stage2-Rthinlto-release_70/llvm/tools/clang/unittests/Tooling/RecursiveASTVisitorTestDeclVisitor.cpp
ninja: build stopped: subcommand failed.
Command failed 
Command: ['/usr/local/bin/ninja', '-v', 'install']
Build step 'Execute shell' marked build as failure
[WARNINGS] Skipping publisher since build result is FAILURE
Recording test results
ERROR: Step ‘Publish JUnit test result report’ failed: No test report files were found. Configuration error?
[BFA] Scanning build for known causes...
[BFA] Found failure cause(s):
[BFA] Ninja target failed from category Compile
[BFA] Compile Error from category Compile
[BFA] Missing test results from category Infrastructure
[BFA] Done. 3s
Extended Email Publisher is currently disabled in project settings
Finished: FAILURE