FailedConsole Output

Skipping 13,223 KB.. Full Log
088/4595] /Users/buildslave/jenkins/workspace/clang-stage2-coverage-R/host-compiler/bin/clang++  -DGTEST_HAS_RTTI=0 -D_GNU_SOURCE -D__STDC_CONSTANT_MACROS -D__STDC_FORMAT_MACROS -D__STDC_LIMIT_MACROS -Itools/clang/lib/Sema -I/Users/buildslave/jenkins/workspace/clang-stage2-coverage-R/llvm/tools/clang/lib/Sema -I/Users/buildslave/jenkins/workspace/clang-stage2-coverage-R/llvm/tools/clang/include -Itools/clang/include -I/Applications/Xcode.app/Contents/Developer/Platforms/MacOSX.platform/Developer/SDKs/MacOSX10.14.sdk/usr/include/libxml2 -Iinclude -I/Users/buildslave/jenkins/workspace/clang-stage2-coverage-R/llvm/include -fPIC -fvisibility-inlines-hidden -Werror=date-time -Werror=unguarded-availability-new -std=c++11 -fmodules -fmodules-cache-path=/Users/buildslave/jenkins/workspace/clang-stage2-coverage-R/clang-build/module.cache -fcxx-modules -Wall -Wextra -Wno-unused-parameter -Wwrite-strings -Wcast-qual -Wmissing-field-initializers -pedantic -Wno-long-long -Wimplicit-fallthrough -Wcovered-switch-default -Wno-noexcept-type -Wnon-virtual-dtor -Wdelete-non-virtual-dtor -Wstring-conversion -fdiagnostics-color -fprofile-instr-generate='/Users/buildslave/jenkins/workspace/clang-stage2-coverage-R/clang-build/profiles/%6m.profraw' -fcoverage-mapping -fno-common -Woverloaded-virtual -Wno-nested-anon-types -O3 -DNDEBUG -isysroot /Applications/Xcode.app/Contents/Developer/Platforms/MacOSX.platform/Developer/SDKs/MacOSX10.14.sdk    -fno-exceptions -fno-rtti -MD -MT tools/clang/lib/Sema/CMakeFiles/obj.clangSema.dir/SemaStmtAttr.cpp.o -MF tools/clang/lib/Sema/CMakeFiles/obj.clangSema.dir/SemaStmtAttr.cpp.o.d -o tools/clang/lib/Sema/CMakeFiles/obj.clangSema.dir/SemaStmtAttr.cpp.o -c /Users/buildslave/jenkins/workspace/clang-stage2-coverage-R/llvm/tools/clang/lib/Sema/SemaStmtAttr.cpp
[3089/4595] /Users/buildslave/jenkins/workspace/clang-stage2-coverage-R/host-compiler/bin/clang++  -DGTEST_HAS_RTTI=0 -D_GNU_SOURCE -D__STDC_CONSTANT_MACROS -D__STDC_FORMAT_MACROS -D__STDC_LIMIT_MACROS -Itools/clang/lib/Sema -I/Users/buildslave/jenkins/workspace/clang-stage2-coverage-R/llvm/tools/clang/lib/Sema -I/Users/buildslave/jenkins/workspace/clang-stage2-coverage-R/llvm/tools/clang/include -Itools/clang/include -I/Applications/Xcode.app/Contents/Developer/Platforms/MacOSX.platform/Developer/SDKs/MacOSX10.14.sdk/usr/include/libxml2 -Iinclude -I/Users/buildslave/jenkins/workspace/clang-stage2-coverage-R/llvm/include -fPIC -fvisibility-inlines-hidden -Werror=date-time -Werror=unguarded-availability-new -std=c++11 -fmodules -fmodules-cache-path=/Users/buildslave/jenkins/workspace/clang-stage2-coverage-R/clang-build/module.cache -fcxx-modules -Wall -Wextra -Wno-unused-parameter -Wwrite-strings -Wcast-qual -Wmissing-field-initializers -pedantic -Wno-long-long -Wimplicit-fallthrough -Wcovered-switch-default -Wno-noexcept-type -Wnon-virtual-dtor -Wdelete-non-virtual-dtor -Wstring-conversion -fdiagnostics-color -fprofile-instr-generate='/Users/buildslave/jenkins/workspace/clang-stage2-coverage-R/clang-build/profiles/%6m.profraw' -fcoverage-mapping -fno-common -Woverloaded-virtual -Wno-nested-anon-types -O3 -DNDEBUG -isysroot /Applications/Xcode.app/Contents/Developer/Platforms/MacOSX.platform/Developer/SDKs/MacOSX10.14.sdk    -fno-exceptions -fno-rtti -MD -MT tools/clang/lib/Sema/CMakeFiles/obj.clangSema.dir/SemaStmtAsm.cpp.o -MF tools/clang/lib/Sema/CMakeFiles/obj.clangSema.dir/SemaStmtAsm.cpp.o.d -o tools/clang/lib/Sema/CMakeFiles/obj.clangSema.dir/SemaStmtAsm.cpp.o -c /Users/buildslave/jenkins/workspace/clang-stage2-coverage-R/llvm/tools/clang/lib/Sema/SemaStmtAsm.cpp
[3090/4595] /Users/buildslave/jenkins/workspace/clang-stage2-coverage-R/host-compiler/bin/clang++  -DGTEST_HAS_RTTI=0 -D_GNU_SOURCE -D__STDC_CONSTANT_MACROS -D__STDC_FORMAT_MACROS -D__STDC_LIMIT_MACROS -Itools/clang/lib/Sema -I/Users/buildslave/jenkins/workspace/clang-stage2-coverage-R/llvm/tools/clang/lib/Sema -I/Users/buildslave/jenkins/workspace/clang-stage2-coverage-R/llvm/tools/clang/include -Itools/clang/include -I/Applications/Xcode.app/Contents/Developer/Platforms/MacOSX.platform/Developer/SDKs/MacOSX10.14.sdk/usr/include/libxml2 -Iinclude -I/Users/buildslave/jenkins/workspace/clang-stage2-coverage-R/llvm/include -fPIC -fvisibility-inlines-hidden -Werror=date-time -Werror=unguarded-availability-new -std=c++11 -fmodules -fmodules-cache-path=/Users/buildslave/jenkins/workspace/clang-stage2-coverage-R/clang-build/module.cache -fcxx-modules -Wall -Wextra -Wno-unused-parameter -Wwrite-strings -Wcast-qual -Wmissing-field-initializers -pedantic -Wno-long-long -Wimplicit-fallthrough -Wcovered-switch-default -Wno-noexcept-type -Wnon-virtual-dtor -Wdelete-non-virtual-dtor -Wstring-conversion -fdiagnostics-color -fprofile-instr-generate='/Users/buildslave/jenkins/workspace/clang-stage2-coverage-R/clang-build/profiles/%6m.profraw' -fcoverage-mapping -fno-common -Woverloaded-virtual -Wno-nested-anon-types -O3 -DNDEBUG -isysroot /Applications/Xcode.app/Contents/Developer/Platforms/MacOSX.platform/Developer/SDKs/MacOSX10.14.sdk    -fno-exceptions -fno-rtti -MD -MT tools/clang/lib/Sema/CMakeFiles/obj.clangSema.dir/SemaOverload.cpp.o -MF tools/clang/lib/Sema/CMakeFiles/obj.clangSema.dir/SemaOverload.cpp.o.d -o tools/clang/lib/Sema/CMakeFiles/obj.clangSema.dir/SemaOverload.cpp.o -c /Users/buildslave/jenkins/workspace/clang-stage2-coverage-R/llvm/tools/clang/lib/Sema/SemaOverload.cpp
[3091/4595] /Users/buildslave/jenkins/workspace/clang-stage2-coverage-R/host-compiler/bin/clang++  -DGTEST_HAS_RTTI=0 -D_GNU_SOURCE -D__STDC_CONSTANT_MACROS -D__STDC_FORMAT_MACROS -D__STDC_LIMIT_MACROS -Itools/clang/lib/Sema -I/Users/buildslave/jenkins/workspace/clang-stage2-coverage-R/llvm/tools/clang/lib/Sema -I/Users/buildslave/jenkins/workspace/clang-stage2-coverage-R/llvm/tools/clang/include -Itools/clang/include -I/Applications/Xcode.app/Contents/Developer/Platforms/MacOSX.platform/Developer/SDKs/MacOSX10.14.sdk/usr/include/libxml2 -Iinclude -I/Users/buildslave/jenkins/workspace/clang-stage2-coverage-R/llvm/include -fPIC -fvisibility-inlines-hidden -Werror=date-time -Werror=unguarded-availability-new -std=c++11 -fmodules -fmodules-cache-path=/Users/buildslave/jenkins/workspace/clang-stage2-coverage-R/clang-build/module.cache -fcxx-modules -Wall -Wextra -Wno-unused-parameter -Wwrite-strings -Wcast-qual -Wmissing-field-initializers -pedantic -Wno-long-long -Wimplicit-fallthrough -Wcovered-switch-default -Wno-noexcept-type -Wnon-virtual-dtor -Wdelete-non-virtual-dtor -Wstring-conversion -fdiagnostics-color -fprofile-instr-generate='/Users/buildslave/jenkins/workspace/clang-stage2-coverage-R/clang-build/profiles/%6m.profraw' -fcoverage-mapping -fno-common -Woverloaded-virtual -Wno-nested-anon-types -O3 -DNDEBUG -isysroot /Applications/Xcode.app/Contents/Developer/Platforms/MacOSX.platform/Developer/SDKs/MacOSX10.14.sdk    -fno-exceptions -fno-rtti -MD -MT tools/clang/lib/Sema/CMakeFiles/obj.clangSema.dir/SemaTemplateInstantiateDecl.cpp.o -MF tools/clang/lib/Sema/CMakeFiles/obj.clangSema.dir/SemaTemplateInstantiateDecl.cpp.o.d -o tools/clang/lib/Sema/CMakeFiles/obj.clangSema.dir/SemaTemplateInstantiateDecl.cpp.o -c /Users/buildslave/jenkins/workspace/clang-stage2-coverage-R/llvm/tools/clang/lib/Sema/SemaTemplateInstantiateDecl.cpp
[3092/4595] /Users/buildslave/jenkins/workspace/clang-stage2-coverage-R/host-compiler/bin/clang++  -DGTEST_HAS_RTTI=0 -D_GNU_SOURCE -D__STDC_CONSTANT_MACROS -D__STDC_FORMAT_MACROS -D__STDC_LIMIT_MACROS -Itools/clang/lib/Sema -I/Users/buildslave/jenkins/workspace/clang-stage2-coverage-R/llvm/tools/clang/lib/Sema -I/Users/buildslave/jenkins/workspace/clang-stage2-coverage-R/llvm/tools/clang/include -Itools/clang/include -I/Applications/Xcode.app/Contents/Developer/Platforms/MacOSX.platform/Developer/SDKs/MacOSX10.14.sdk/usr/include/libxml2 -Iinclude -I/Users/buildslave/jenkins/workspace/clang-stage2-coverage-R/llvm/include -fPIC -fvisibility-inlines-hidden -Werror=date-time -Werror=unguarded-availability-new -std=c++11 -fmodules -fmodules-cache-path=/Users/buildslave/jenkins/workspace/clang-stage2-coverage-R/clang-build/module.cache -fcxx-modules -Wall -Wextra -Wno-unused-parameter -Wwrite-strings -Wcast-qual -Wmissing-field-initializers -pedantic -Wno-long-long -Wimplicit-fallthrough -Wcovered-switch-default -Wno-noexcept-type -Wnon-virtual-dtor -Wdelete-non-virtual-dtor -Wstring-conversion -fdiagnostics-color -fprofile-instr-generate='/Users/buildslave/jenkins/workspace/clang-stage2-coverage-R/clang-build/profiles/%6m.profraw' -fcoverage-mapping -fno-common -Woverloaded-virtual -Wno-nested-anon-types -O3 -DNDEBUG -isysroot /Applications/Xcode.app/Contents/Developer/Platforms/MacOSX.platform/Developer/SDKs/MacOSX10.14.sdk    -fno-exceptions -fno-rtti -MD -MT tools/clang/lib/Sema/CMakeFiles/obj.clangSema.dir/SemaTemplateDeduction.cpp.o -MF tools/clang/lib/Sema/CMakeFiles/obj.clangSema.dir/SemaTemplateDeduction.cpp.o.d -o tools/clang/lib/Sema/CMakeFiles/obj.clangSema.dir/SemaTemplateDeduction.cpp.o -c /Users/buildslave/jenkins/workspace/clang-stage2-coverage-R/llvm/tools/clang/lib/Sema/SemaTemplateDeduction.cpp
[3093/4595] /Users/buildslave/jenkins/workspace/clang-stage2-coverage-R/host-compiler/bin/clang++  -DGTEST_HAS_RTTI=0 -D_GNU_SOURCE -D__STDC_CONSTANT_MACROS -D__STDC_FORMAT_MACROS -D__STDC_LIMIT_MACROS -Itools/clang/lib/Sema -I/Users/buildslave/jenkins/workspace/clang-stage2-coverage-R/llvm/tools/clang/lib/Sema -I/Users/buildslave/jenkins/workspace/clang-stage2-coverage-R/llvm/tools/clang/include -Itools/clang/include -I/Applications/Xcode.app/Contents/Developer/Platforms/MacOSX.platform/Developer/SDKs/MacOSX10.14.sdk/usr/include/libxml2 -Iinclude -I/Users/buildslave/jenkins/workspace/clang-stage2-coverage-R/llvm/include -fPIC -fvisibility-inlines-hidden -Werror=date-time -Werror=unguarded-availability-new -std=c++11 -fmodules -fmodules-cache-path=/Users/buildslave/jenkins/workspace/clang-stage2-coverage-R/clang-build/module.cache -fcxx-modules -Wall -Wextra -Wno-unused-parameter -Wwrite-strings -Wcast-qual -Wmissing-field-initializers -pedantic -Wno-long-long -Wimplicit-fallthrough -Wcovered-switch-default -Wno-noexcept-type -Wnon-virtual-dtor -Wdelete-non-virtual-dtor -Wstring-conversion -fdiagnostics-color -fprofile-instr-generate='/Users/buildslave/jenkins/workspace/clang-stage2-coverage-R/clang-build/profiles/%6m.profraw' -fcoverage-mapping -fno-common -Woverloaded-virtual -Wno-nested-anon-types -O3 -DNDEBUG -isysroot /Applications/Xcode.app/Contents/Developer/Platforms/MacOSX.platform/Developer/SDKs/MacOSX10.14.sdk    -fno-exceptions -fno-rtti -MD -MT tools/clang/lib/Sema/CMakeFiles/obj.clangSema.dir/SemaOpenMP.cpp.o -MF tools/clang/lib/Sema/CMakeFiles/obj.clangSema.dir/SemaOpenMP.cpp.o.d -o tools/clang/lib/Sema/CMakeFiles/obj.clangSema.dir/SemaOpenMP.cpp.o -c /Users/buildslave/jenkins/workspace/clang-stage2-coverage-R/llvm/tools/clang/lib/Sema/SemaOpenMP.cpp
[3094/4595] /Users/buildslave/jenkins/workspace/clang-stage2-coverage-R/host-compiler/bin/clang++  -DGTEST_HAS_RTTI=0 -D_GNU_SOURCE -D__STDC_CONSTANT_MACROS -D__STDC_FORMAT_MACROS -D__STDC_LIMIT_MACROS -Itools/clang/lib/Sema -I/Users/buildslave/jenkins/workspace/clang-stage2-coverage-R/llvm/tools/clang/lib/Sema -I/Users/buildslave/jenkins/workspace/clang-stage2-coverage-R/llvm/tools/clang/include -Itools/clang/include -I/Applications/Xcode.app/Contents/Developer/Platforms/MacOSX.platform/Developer/SDKs/MacOSX10.14.sdk/usr/include/libxml2 -Iinclude -I/Users/buildslave/jenkins/workspace/clang-stage2-coverage-R/llvm/include -fPIC -fvisibility-inlines-hidden -Werror=date-time -Werror=unguarded-availability-new -std=c++11 -fmodules -fmodules-cache-path=/Users/buildslave/jenkins/workspace/clang-stage2-coverage-R/clang-build/module.cache -fcxx-modules -Wall -Wextra -Wno-unused-parameter -Wwrite-strings -Wcast-qual -Wmissing-field-initializers -pedantic -Wno-long-long -Wimplicit-fallthrough -Wcovered-switch-default -Wno-noexcept-type -Wnon-virtual-dtor -Wdelete-non-virtual-dtor -Wstring-conversion -fdiagnostics-color -fprofile-instr-generate='/Users/buildslave/jenkins/workspace/clang-stage2-coverage-R/clang-build/profiles/%6m.profraw' -fcoverage-mapping -fno-common -Woverloaded-virtual -Wno-nested-anon-types -O3 -DNDEBUG -isysroot /Applications/Xcode.app/Contents/Developer/Platforms/MacOSX.platform/Developer/SDKs/MacOSX10.14.sdk    -fno-exceptions -fno-rtti -MD -MT tools/clang/lib/Sema/CMakeFiles/obj.clangSema.dir/SemaStmt.cpp.o -MF tools/clang/lib/Sema/CMakeFiles/obj.clangSema.dir/SemaStmt.cpp.o.d -o tools/clang/lib/Sema/CMakeFiles/obj.clangSema.dir/SemaStmt.cpp.o -c /Users/buildslave/jenkins/workspace/clang-stage2-coverage-R/llvm/tools/clang/lib/Sema/SemaStmt.cpp
[3095/4595] /Users/buildslave/jenkins/workspace/clang-stage2-coverage-R/host-compiler/bin/clang++  -DGTEST_HAS_RTTI=0 -D_GNU_SOURCE -D__STDC_CONSTANT_MACROS -D__STDC_FORMAT_MACROS -D__STDC_LIMIT_MACROS -Itools/clang/lib/Sema -I/Users/buildslave/jenkins/workspace/clang-stage2-coverage-R/llvm/tools/clang/lib/Sema -I/Users/buildslave/jenkins/workspace/clang-stage2-coverage-R/llvm/tools/clang/include -Itools/clang/include -I/Applications/Xcode.app/Contents/Developer/Platforms/MacOSX.platform/Developer/SDKs/MacOSX10.14.sdk/usr/include/libxml2 -Iinclude -I/Users/buildslave/jenkins/workspace/clang-stage2-coverage-R/llvm/include -fPIC -fvisibility-inlines-hidden -Werror=date-time -Werror=unguarded-availability-new -std=c++11 -fmodules -fmodules-cache-path=/Users/buildslave/jenkins/workspace/clang-stage2-coverage-R/clang-build/module.cache -fcxx-modules -Wall -Wextra -Wno-unused-parameter -Wwrite-strings -Wcast-qual -Wmissing-field-initializers -pedantic -Wno-long-long -Wimplicit-fallthrough -Wcovered-switch-default -Wno-noexcept-type -Wnon-virtual-dtor -Wdelete-non-virtual-dtor -Wstring-conversion -fdiagnostics-color -fprofile-instr-generate='/Users/buildslave/jenkins/workspace/clang-stage2-coverage-R/clang-build/profiles/%6m.profraw' -fcoverage-mapping -fno-common -Woverloaded-virtual -Wno-nested-anon-types -O3 -DNDEBUG -isysroot /Applications/Xcode.app/Contents/Developer/Platforms/MacOSX.platform/Developer/SDKs/MacOSX10.14.sdk    -fno-exceptions -fno-rtti -MD -MT tools/clang/lib/Sema/CMakeFiles/obj.clangSema.dir/TypeLocBuilder.cpp.o -MF tools/clang/lib/Sema/CMakeFiles/obj.clangSema.dir/TypeLocBuilder.cpp.o.d -o tools/clang/lib/Sema/CMakeFiles/obj.clangSema.dir/TypeLocBuilder.cpp.o -c /Users/buildslave/jenkins/workspace/clang-stage2-coverage-R/llvm/tools/clang/lib/Sema/TypeLocBuilder.cpp
[3096/4595] /Users/buildslave/jenkins/workspace/clang-stage2-coverage-R/host-compiler/bin/clang++  -DGTEST_HAS_RTTI=0 -D_GNU_SOURCE -D__STDC_CONSTANT_MACROS -D__STDC_FORMAT_MACROS -D__STDC_LIMIT_MACROS -Itools/clang/lib/Sema -I/Users/buildslave/jenkins/workspace/clang-stage2-coverage-R/llvm/tools/clang/lib/Sema -I/Users/buildslave/jenkins/workspace/clang-stage2-coverage-R/llvm/tools/clang/include -Itools/clang/include -I/Applications/Xcode.app/Contents/Developer/Platforms/MacOSX.platform/Developer/SDKs/MacOSX10.14.sdk/usr/include/libxml2 -Iinclude -I/Users/buildslave/jenkins/workspace/clang-stage2-coverage-R/llvm/include -fPIC -fvisibility-inlines-hidden -Werror=date-time -Werror=unguarded-availability-new -std=c++11 -fmodules -fmodules-cache-path=/Users/buildslave/jenkins/workspace/clang-stage2-coverage-R/clang-build/module.cache -fcxx-modules -Wall -Wextra -Wno-unused-parameter -Wwrite-strings -Wcast-qual -Wmissing-field-initializers -pedantic -Wno-long-long -Wimplicit-fallthrough -Wcovered-switch-default -Wno-noexcept-type -Wnon-virtual-dtor -Wdelete-non-virtual-dtor -Wstring-conversion -fdiagnostics-color -fprofile-instr-generate='/Users/buildslave/jenkins/workspace/clang-stage2-coverage-R/clang-build/profiles/%6m.profraw' -fcoverage-mapping -fno-common -Woverloaded-virtual -Wno-nested-anon-types -O3 -DNDEBUG -isysroot /Applications/Xcode.app/Contents/Developer/Platforms/MacOSX.platform/Developer/SDKs/MacOSX10.14.sdk    -fno-exceptions -fno-rtti -MD -MT tools/clang/lib/Sema/CMakeFiles/obj.clangSema.dir/SemaTemplateInstantiate.cpp.o -MF tools/clang/lib/Sema/CMakeFiles/obj.clangSema.dir/SemaTemplateInstantiate.cpp.o.d -o tools/clang/lib/Sema/CMakeFiles/obj.clangSema.dir/SemaTemplateInstantiate.cpp.o -c /Users/buildslave/jenkins/workspace/clang-stage2-coverage-R/llvm/tools/clang/lib/Sema/SemaTemplateInstantiate.cpp
[3097/4595] /Users/buildslave/jenkins/workspace/clang-stage2-coverage-R/host-compiler/bin/clang++  -DGTEST_HAS_RTTI=0 -D_GNU_SOURCE -D__STDC_CONSTANT_MACROS -D__STDC_FORMAT_MACROS -D__STDC_LIMIT_MACROS -Itools/clang/lib/Sema -I/Users/buildslave/jenkins/workspace/clang-stage2-coverage-R/llvm/tools/clang/lib/Sema -I/Users/buildslave/jenkins/workspace/clang-stage2-coverage-R/llvm/tools/clang/include -Itools/clang/include -I/Applications/Xcode.app/Contents/Developer/Platforms/MacOSX.platform/Developer/SDKs/MacOSX10.14.sdk/usr/include/libxml2 -Iinclude -I/Users/buildslave/jenkins/workspace/clang-stage2-coverage-R/llvm/include -fPIC -fvisibility-inlines-hidden -Werror=date-time -Werror=unguarded-availability-new -std=c++11 -fmodules -fmodules-cache-path=/Users/buildslave/jenkins/workspace/clang-stage2-coverage-R/clang-build/module.cache -fcxx-modules -Wall -Wextra -Wno-unused-parameter -Wwrite-strings -Wcast-qual -Wmissing-field-initializers -pedantic -Wno-long-long -Wimplicit-fallthrough -Wcovered-switch-default -Wno-noexcept-type -Wnon-virtual-dtor -Wdelete-non-virtual-dtor -Wstring-conversion -fdiagnostics-color -fprofile-instr-generate='/Users/buildslave/jenkins/workspace/clang-stage2-coverage-R/clang-build/profiles/%6m.profraw' -fcoverage-mapping -fno-common -Woverloaded-virtual -Wno-nested-anon-types -O3 -DNDEBUG -isysroot /Applications/Xcode.app/Contents/Developer/Platforms/MacOSX.platform/Developer/SDKs/MacOSX10.14.sdk    -fno-exceptions -fno-rtti -MD -MT tools/clang/lib/Sema/CMakeFiles/obj.clangSema.dir/SemaType.cpp.o -MF tools/clang/lib/Sema/CMakeFiles/obj.clangSema.dir/SemaType.cpp.o.d -o tools/clang/lib/Sema/CMakeFiles/obj.clangSema.dir/SemaType.cpp.o -c /Users/buildslave/jenkins/workspace/clang-stage2-coverage-R/llvm/tools/clang/lib/Sema/SemaType.cpp
[3098/4595] /Users/buildslave/jenkins/workspace/clang-stage2-coverage-R/host-compiler/bin/clang++  -DGTEST_HAS_RTTI=0 -D_GNU_SOURCE -D__STDC_CONSTANT_MACROS -D__STDC_FORMAT_MACROS -D__STDC_LIMIT_MACROS -Itools/clang/lib/CodeGen -I/Users/buildslave/jenkins/workspace/clang-stage2-coverage-R/llvm/tools/clang/lib/CodeGen -I/Users/buildslave/jenkins/workspace/clang-stage2-coverage-R/llvm/tools/clang/include -Itools/clang/include -I/Applications/Xcode.app/Contents/Developer/Platforms/MacOSX.platform/Developer/SDKs/MacOSX10.14.sdk/usr/include/libxml2 -Iinclude -I/Users/buildslave/jenkins/workspace/clang-stage2-coverage-R/llvm/include -fPIC -fvisibility-inlines-hidden -Werror=date-time -Werror=unguarded-availability-new -std=c++11 -fmodules -fmodules-cache-path=/Users/buildslave/jenkins/workspace/clang-stage2-coverage-R/clang-build/module.cache -fcxx-modules -Wall -Wextra -Wno-unused-parameter -Wwrite-strings -Wcast-qual -Wmissing-field-initializers -pedantic -Wno-long-long -Wimplicit-fallthrough -Wcovered-switch-default -Wno-noexcept-type -Wnon-virtual-dtor -Wdelete-non-virtual-dtor -Wstring-conversion -fdiagnostics-color -fprofile-instr-generate='/Users/buildslave/jenkins/workspace/clang-stage2-coverage-R/clang-build/profiles/%6m.profraw' -fcoverage-mapping -fno-common -Woverloaded-virtual -Wno-nested-anon-types -O3 -DNDEBUG -isysroot /Applications/Xcode.app/Contents/Developer/Platforms/MacOSX.platform/Developer/SDKs/MacOSX10.14.sdk    -fno-exceptions -fno-rtti -MD -MT tools/clang/lib/CodeGen/CMakeFiles/obj.clangCodeGen.dir/CGAtomic.cpp.o -MF tools/clang/lib/CodeGen/CMakeFiles/obj.clangCodeGen.dir/CGAtomic.cpp.o.d -o tools/clang/lib/CodeGen/CMakeFiles/obj.clangCodeGen.dir/CGAtomic.cpp.o -c /Users/buildslave/jenkins/workspace/clang-stage2-coverage-R/llvm/tools/clang/lib/CodeGen/CGAtomic.cpp
[3099/4595] /Users/buildslave/jenkins/workspace/clang-stage2-coverage-R/host-compiler/bin/clang++  -DGTEST_HAS_RTTI=0 -D_GNU_SOURCE -D__STDC_CONSTANT_MACROS -D__STDC_FORMAT_MACROS -D__STDC_LIMIT_MACROS -Itools/clang/lib/Sema -I/Users/buildslave/jenkins/workspace/clang-stage2-coverage-R/llvm/tools/clang/lib/Sema -I/Users/buildslave/jenkins/workspace/clang-stage2-coverage-R/llvm/tools/clang/include -Itools/clang/include -I/Applications/Xcode.app/Contents/Developer/Platforms/MacOSX.platform/Developer/SDKs/MacOSX10.14.sdk/usr/include/libxml2 -Iinclude -I/Users/buildslave/jenkins/workspace/clang-stage2-coverage-R/llvm/include -fPIC -fvisibility-inlines-hidden -Werror=date-time -Werror=unguarded-availability-new -std=c++11 -fmodules -fmodules-cache-path=/Users/buildslave/jenkins/workspace/clang-stage2-coverage-R/clang-build/module.cache -fcxx-modules -Wall -Wextra -Wno-unused-parameter -Wwrite-strings -Wcast-qual -Wmissing-field-initializers -pedantic -Wno-long-long -Wimplicit-fallthrough -Wcovered-switch-default -Wno-noexcept-type -Wnon-virtual-dtor -Wdelete-non-virtual-dtor -Wstring-conversion -fdiagnostics-color -fprofile-instr-generate='/Users/buildslave/jenkins/workspace/clang-stage2-coverage-R/clang-build/profiles/%6m.profraw' -fcoverage-mapping -fno-common -Woverloaded-virtual -Wno-nested-anon-types -O3 -DNDEBUG -isysroot /Applications/Xcode.app/Contents/Developer/Platforms/MacOSX.platform/Developer/SDKs/MacOSX10.14.sdk    -fno-exceptions -fno-rtti -MD -MT tools/clang/lib/Sema/CMakeFiles/obj.clangSema.dir/SemaTemplateVariadic.cpp.o -MF tools/clang/lib/Sema/CMakeFiles/obj.clangSema.dir/SemaTemplateVariadic.cpp.o.d -o tools/clang/lib/Sema/CMakeFiles/obj.clangSema.dir/SemaTemplateVariadic.cpp.o -c /Users/buildslave/jenkins/workspace/clang-stage2-coverage-R/llvm/tools/clang/lib/Sema/SemaTemplateVariadic.cpp
[3100/4595] /Users/buildslave/jenkins/workspace/clang-stage2-coverage-R/host-compiler/bin/clang++  -DGTEST_HAS_RTTI=0 -D_GNU_SOURCE -D__STDC_CONSTANT_MACROS -D__STDC_FORMAT_MACROS -D__STDC_LIMIT_MACROS -Itools/clang/lib/CodeGen -I/Users/buildslave/jenkins/workspace/clang-stage2-coverage-R/llvm/tools/clang/lib/CodeGen -I/Users/buildslave/jenkins/workspace/clang-stage2-coverage-R/llvm/tools/clang/include -Itools/clang/include -I/Applications/Xcode.app/Contents/Developer/Platforms/MacOSX.platform/Developer/SDKs/MacOSX10.14.sdk/usr/include/libxml2 -Iinclude -I/Users/buildslave/jenkins/workspace/clang-stage2-coverage-R/llvm/include -fPIC -fvisibility-inlines-hidden -Werror=date-time -Werror=unguarded-availability-new -std=c++11 -fmodules -fmodules-cache-path=/Users/buildslave/jenkins/workspace/clang-stage2-coverage-R/clang-build/module.cache -fcxx-modules -Wall -Wextra -Wno-unused-parameter -Wwrite-strings -Wcast-qual -Wmissing-field-initializers -pedantic -Wno-long-long -Wimplicit-fallthrough -Wcovered-switch-default -Wno-noexcept-type -Wnon-virtual-dtor -Wdelete-non-virtual-dtor -Wstring-conversion -fdiagnostics-color -fprofile-instr-generate='/Users/buildslave/jenkins/workspace/clang-stage2-coverage-R/clang-build/profiles/%6m.profraw' -fcoverage-mapping -fno-common -Woverloaded-virtual -Wno-nested-anon-types -O3 -DNDEBUG -isysroot /Applications/Xcode.app/Contents/Developer/Platforms/MacOSX.platform/Developer/SDKs/MacOSX10.14.sdk    -fno-exceptions -fno-rtti -MD -MT tools/clang/lib/CodeGen/CMakeFiles/obj.clangCodeGen.dir/CGCUDARuntime.cpp.o -MF tools/clang/lib/CodeGen/CMakeFiles/obj.clangCodeGen.dir/CGCUDARuntime.cpp.o.d -o tools/clang/lib/CodeGen/CMakeFiles/obj.clangCodeGen.dir/CGCUDARuntime.cpp.o -c /Users/buildslave/jenkins/workspace/clang-stage2-coverage-R/llvm/tools/clang/lib/CodeGen/CGCUDARuntime.cpp
[3101/4595] /Users/buildslave/jenkins/workspace/clang-stage2-coverage-R/host-compiler/bin/clang++  -DGTEST_HAS_RTTI=0 -D_GNU_SOURCE -D__STDC_CONSTANT_MACROS -D__STDC_FORMAT_MACROS -D__STDC_LIMIT_MACROS -Itools/clang/lib/CodeGen -I/Users/buildslave/jenkins/workspace/clang-stage2-coverage-R/llvm/tools/clang/lib/CodeGen -I/Users/buildslave/jenkins/workspace/clang-stage2-coverage-R/llvm/tools/clang/include -Itools/clang/include -I/Applications/Xcode.app/Contents/Developer/Platforms/MacOSX.platform/Developer/SDKs/MacOSX10.14.sdk/usr/include/libxml2 -Iinclude -I/Users/buildslave/jenkins/workspace/clang-stage2-coverage-R/llvm/include -fPIC -fvisibility-inlines-hidden -Werror=date-time -Werror=unguarded-availability-new -std=c++11 -fmodules -fmodules-cache-path=/Users/buildslave/jenkins/workspace/clang-stage2-coverage-R/clang-build/module.cache -fcxx-modules -Wall -Wextra -Wno-unused-parameter -Wwrite-strings -Wcast-qual -Wmissing-field-initializers -pedantic -Wno-long-long -Wimplicit-fallthrough -Wcovered-switch-default -Wno-noexcept-type -Wnon-virtual-dtor -Wdelete-non-virtual-dtor -Wstring-conversion -fdiagnostics-color -fprofile-instr-generate='/Users/buildslave/jenkins/workspace/clang-stage2-coverage-R/clang-build/profiles/%6m.profraw' -fcoverage-mapping -fno-common -Woverloaded-virtual -Wno-nested-anon-types -O3 -DNDEBUG -isysroot /Applications/Xcode.app/Contents/Developer/Platforms/MacOSX.platform/Developer/SDKs/MacOSX10.14.sdk    -fno-exceptions -fno-rtti -MD -MT tools/clang/lib/CodeGen/CMakeFiles/obj.clangCodeGen.dir/CGCUDANV.cpp.o -MF tools/clang/lib/CodeGen/CMakeFiles/obj.clangCodeGen.dir/CGCUDANV.cpp.o.d -o tools/clang/lib/CodeGen/CMakeFiles/obj.clangCodeGen.dir/CGCUDANV.cpp.o -c /Users/buildslave/jenkins/workspace/clang-stage2-coverage-R/llvm/tools/clang/lib/CodeGen/CGCUDANV.cpp
[3102/4595] /Users/buildslave/jenkins/workspace/clang-stage2-coverage-R/host-compiler/bin/clang++  -DGTEST_HAS_RTTI=0 -D_GNU_SOURCE -D__STDC_CONSTANT_MACROS -D__STDC_FORMAT_MACROS -D__STDC_LIMIT_MACROS -Itools/clang/lib/CodeGen -I/Users/buildslave/jenkins/workspace/clang-stage2-coverage-R/llvm/tools/clang/lib/CodeGen -I/Users/buildslave/jenkins/workspace/clang-stage2-coverage-R/llvm/tools/clang/include -Itools/clang/include -I/Applications/Xcode.app/Contents/Developer/Platforms/MacOSX.platform/Developer/SDKs/MacOSX10.14.sdk/usr/include/libxml2 -Iinclude -I/Users/buildslave/jenkins/workspace/clang-stage2-coverage-R/llvm/include -fPIC -fvisibility-inlines-hidden -Werror=date-time -Werror=unguarded-availability-new -std=c++11 -fmodules -fmodules-cache-path=/Users/buildslave/jenkins/workspace/clang-stage2-coverage-R/clang-build/module.cache -fcxx-modules -Wall -Wextra -Wno-unused-parameter -Wwrite-strings -Wcast-qual -Wmissing-field-initializers -pedantic -Wno-long-long -Wimplicit-fallthrough -Wcovered-switch-default -Wno-noexcept-type -Wnon-virtual-dtor -Wdelete-non-virtual-dtor -Wstring-conversion -fdiagnostics-color -fprofile-instr-generate='/Users/buildslave/jenkins/workspace/clang-stage2-coverage-R/clang-build/profiles/%6m.profraw' -fcoverage-mapping -fno-common -Woverloaded-virtual -Wno-nested-anon-types -O3 -DNDEBUG -isysroot /Applications/Xcode.app/Contents/Developer/Platforms/MacOSX.platform/Developer/SDKs/MacOSX10.14.sdk    -fno-exceptions -fno-rtti -MD -MT tools/clang/lib/CodeGen/CMakeFiles/obj.clangCodeGen.dir/CGBlocks.cpp.o -MF tools/clang/lib/CodeGen/CMakeFiles/obj.clangCodeGen.dir/CGBlocks.cpp.o.d -o tools/clang/lib/CodeGen/CMakeFiles/obj.clangCodeGen.dir/CGBlocks.cpp.o -c /Users/buildslave/jenkins/workspace/clang-stage2-coverage-R/llvm/tools/clang/lib/CodeGen/CGBlocks.cpp
[3103/4595] /Users/buildslave/jenkins/workspace/clang-stage2-coverage-R/host-compiler/bin/clang++  -DGTEST_HAS_RTTI=0 -D_GNU_SOURCE -D__STDC_CONSTANT_MACROS -D__STDC_FORMAT_MACROS -D__STDC_LIMIT_MACROS -Itools/clang/lib/CodeGen -I/Users/buildslave/jenkins/workspace/clang-stage2-coverage-R/llvm/tools/clang/lib/CodeGen -I/Users/buildslave/jenkins/workspace/clang-stage2-coverage-R/llvm/tools/clang/include -Itools/clang/include -I/Applications/Xcode.app/Contents/Developer/Platforms/MacOSX.platform/Developer/SDKs/MacOSX10.14.sdk/usr/include/libxml2 -Iinclude -I/Users/buildslave/jenkins/workspace/clang-stage2-coverage-R/llvm/include -fPIC -fvisibility-inlines-hidden -Werror=date-time -Werror=unguarded-availability-new -std=c++11 -fmodules -fmodules-cache-path=/Users/buildslave/jenkins/workspace/clang-stage2-coverage-R/clang-build/module.cache -fcxx-modules -Wall -Wextra -Wno-unused-parameter -Wwrite-strings -Wcast-qual -Wmissing-field-initializers -pedantic -Wno-long-long -Wimplicit-fallthrough -Wcovered-switch-default -Wno-noexcept-type -Wnon-virtual-dtor -Wdelete-non-virtual-dtor -Wstring-conversion -fdiagnostics-color -fprofile-instr-generate='/Users/buildslave/jenkins/workspace/clang-stage2-coverage-R/clang-build/profiles/%6m.profraw' -fcoverage-mapping -fno-common -Woverloaded-virtual -Wno-nested-anon-types -O3 -DNDEBUG -isysroot /Applications/Xcode.app/Contents/Developer/Platforms/MacOSX.platform/Developer/SDKs/MacOSX10.14.sdk    -fno-exceptions -fno-rtti -MD -MT tools/clang/lib/CodeGen/CMakeFiles/obj.clangCodeGen.dir/CGCXX.cpp.o -MF tools/clang/lib/CodeGen/CMakeFiles/obj.clangCodeGen.dir/CGCXX.cpp.o.d -o tools/clang/lib/CodeGen/CMakeFiles/obj.clangCodeGen.dir/CGCXX.cpp.o -c /Users/buildslave/jenkins/workspace/clang-stage2-coverage-R/llvm/tools/clang/lib/CodeGen/CGCXX.cpp
[3104/4595] /Users/buildslave/jenkins/workspace/clang-stage2-coverage-R/host-compiler/bin/clang++  -DGTEST_HAS_RTTI=0 -D_GNU_SOURCE -D__STDC_CONSTANT_MACROS -D__STDC_FORMAT_MACROS -D__STDC_LIMIT_MACROS -Itools/clang/lib/CodeGen -I/Users/buildslave/jenkins/workspace/clang-stage2-coverage-R/llvm/tools/clang/lib/CodeGen -I/Users/buildslave/jenkins/workspace/clang-stage2-coverage-R/llvm/tools/clang/include -Itools/clang/include -I/Applications/Xcode.app/Contents/Developer/Platforms/MacOSX.platform/Developer/SDKs/MacOSX10.14.sdk/usr/include/libxml2 -Iinclude -I/Users/buildslave/jenkins/workspace/clang-stage2-coverage-R/llvm/include -fPIC -fvisibility-inlines-hidden -Werror=date-time -Werror=unguarded-availability-new -std=c++11 -fmodules -fmodules-cache-path=/Users/buildslave/jenkins/workspace/clang-stage2-coverage-R/clang-build/module.cache -fcxx-modules -Wall -Wextra -Wno-unused-parameter -Wwrite-strings -Wcast-qual -Wmissing-field-initializers -pedantic -Wno-long-long -Wimplicit-fallthrough -Wcovered-switch-default -Wno-noexcept-type -Wnon-virtual-dtor -Wdelete-non-virtual-dtor -Wstring-conversion -fdiagnostics-color -fprofile-instr-generate='/Users/buildslave/jenkins/workspace/clang-stage2-coverage-R/clang-build/profiles/%6m.profraw' -fcoverage-mapping -fno-common -Woverloaded-virtual -Wno-nested-anon-types -O3 -DNDEBUG -isysroot /Applications/Xcode.app/Contents/Developer/Platforms/MacOSX.platform/Developer/SDKs/MacOSX10.14.sdk    -fno-exceptions -fno-rtti -MD -MT tools/clang/lib/CodeGen/CMakeFiles/obj.clangCodeGen.dir/CGCXXABI.cpp.o -MF tools/clang/lib/CodeGen/CMakeFiles/obj.clangCodeGen.dir/CGCXXABI.cpp.o.d -o tools/clang/lib/CodeGen/CMakeFiles/obj.clangCodeGen.dir/CGCXXABI.cpp.o -c /Users/buildslave/jenkins/workspace/clang-stage2-coverage-R/llvm/tools/clang/lib/CodeGen/CGCXXABI.cpp
[3105/4595] /Users/buildslave/jenkins/workspace/clang-stage2-coverage-R/host-compiler/bin/clang++  -DGTEST_HAS_RTTI=0 -D_GNU_SOURCE -D__STDC_CONSTANT_MACROS -D__STDC_FORMAT_MACROS -D__STDC_LIMIT_MACROS -Itools/clang/lib/Sema -I/Users/buildslave/jenkins/workspace/clang-stage2-coverage-R/llvm/tools/clang/lib/Sema -I/Users/buildslave/jenkins/workspace/clang-stage2-coverage-R/llvm/tools/clang/include -Itools/clang/include -I/Applications/Xcode.app/Contents/Developer/Platforms/MacOSX.platform/Developer/SDKs/MacOSX10.14.sdk/usr/include/libxml2 -Iinclude -I/Users/buildslave/jenkins/workspace/clang-stage2-coverage-R/llvm/include -fPIC -fvisibility-inlines-hidden -Werror=date-time -Werror=unguarded-availability-new -std=c++11 -fmodules -fmodules-cache-path=/Users/buildslave/jenkins/workspace/clang-stage2-coverage-R/clang-build/module.cache -fcxx-modules -Wall -Wextra -Wno-unused-parameter -Wwrite-strings -Wcast-qual -Wmissing-field-initializers -pedantic -Wno-long-long -Wimplicit-fallthrough -Wcovered-switch-default -Wno-noexcept-type -Wnon-virtual-dtor -Wdelete-non-virtual-dtor -Wstring-conversion -fdiagnostics-color -fprofile-instr-generate='/Users/buildslave/jenkins/workspace/clang-stage2-coverage-R/clang-build/profiles/%6m.profraw' -fcoverage-mapping -fno-common -Woverloaded-virtual -Wno-nested-anon-types -O3 -DNDEBUG -isysroot /Applications/Xcode.app/Contents/Developer/Platforms/MacOSX.platform/Developer/SDKs/MacOSX10.14.sdk    -fno-exceptions -fno-rtti -MD -MT tools/clang/lib/Sema/CMakeFiles/obj.clangSema.dir/SemaTemplate.cpp.o -MF tools/clang/lib/Sema/CMakeFiles/obj.clangSema.dir/SemaTemplate.cpp.o.d -o tools/clang/lib/Sema/CMakeFiles/obj.clangSema.dir/SemaTemplate.cpp.o -c /Users/buildslave/jenkins/workspace/clang-stage2-coverage-R/llvm/tools/clang/lib/Sema/SemaTemplate.cpp
[3106/4595] : && "/Applications/Xcode.app/Contents/Developer/Toolchains/XcodeDefault.xctoolchain/usr/bin/libtool" -static -no_warning_for_no_symbols -o lib/libclangSema.a  tools/clang/lib/Sema/CMakeFiles/obj.clangSema.dir/AnalysisBasedWarnings.cpp.o tools/clang/lib/Sema/CMakeFiles/obj.clangSema.dir/CodeCompleteConsumer.cpp.o tools/clang/lib/Sema/CMakeFiles/obj.clangSema.dir/DeclSpec.cpp.o tools/clang/lib/Sema/CMakeFiles/obj.clangSema.dir/DelayedDiagnostic.cpp.o tools/clang/lib/Sema/CMakeFiles/obj.clangSema.dir/IdentifierResolver.cpp.o tools/clang/lib/Sema/CMakeFiles/obj.clangSema.dir/JumpDiagnostics.cpp.o tools/clang/lib/Sema/CMakeFiles/obj.clangSema.dir/MultiplexExternalSemaSource.cpp.o tools/clang/lib/Sema/CMakeFiles/obj.clangSema.dir/ParsedAttr.cpp.o tools/clang/lib/Sema/CMakeFiles/obj.clangSema.dir/Scope.cpp.o tools/clang/lib/Sema/CMakeFiles/obj.clangSema.dir/ScopeInfo.cpp.o tools/clang/lib/Sema/CMakeFiles/obj.clangSema.dir/Sema.cpp.o tools/clang/lib/Sema/CMakeFiles/obj.clangSema.dir/SemaAccess.cpp.o tools/clang/lib/Sema/CMakeFiles/obj.clangSema.dir/SemaAttr.cpp.o tools/clang/lib/Sema/CMakeFiles/obj.clangSema.dir/SemaCXXScopeSpec.cpp.o tools/clang/lib/Sema/CMakeFiles/obj.clangSema.dir/SemaCast.cpp.o tools/clang/lib/Sema/CMakeFiles/obj.clangSema.dir/SemaChecking.cpp.o tools/clang/lib/Sema/CMakeFiles/obj.clangSema.dir/SemaCodeComplete.cpp.o tools/clang/lib/Sema/CMakeFiles/obj.clangSema.dir/SemaConsumer.cpp.o tools/clang/lib/Sema/CMakeFiles/obj.clangSema.dir/SemaCoroutine.cpp.o tools/clang/lib/Sema/CMakeFiles/obj.clangSema.dir/SemaCUDA.cpp.o tools/clang/lib/Sema/CMakeFiles/obj.clangSema.dir/SemaDecl.cpp.o tools/clang/lib/Sema/CMakeFiles/obj.clangSema.dir/SemaDeclAttr.cpp.o tools/clang/lib/Sema/CMakeFiles/obj.clangSema.dir/SemaDeclCXX.cpp.o tools/clang/lib/Sema/CMakeFiles/obj.clangSema.dir/SemaDeclObjC.cpp.o tools/clang/lib/Sema/CMakeFiles/obj.clangSema.dir/SemaExceptionSpec.cpp.o tools/clang/lib/Sema/CMakeFiles/obj.clangSema.dir/SemaExpr.cpp.o tools/clang/lib/Sema/CMakeFiles/obj.clangSema.dir/SemaExprCXX.cpp.o tools/clang/lib/Sema/CMakeFiles/obj.clangSema.dir/SemaExprMember.cpp.o tools/clang/lib/Sema/CMakeFiles/obj.clangSema.dir/SemaExprObjC.cpp.o tools/clang/lib/Sema/CMakeFiles/obj.clangSema.dir/SemaFixItUtils.cpp.o tools/clang/lib/Sema/CMakeFiles/obj.clangSema.dir/SemaInit.cpp.o tools/clang/lib/Sema/CMakeFiles/obj.clangSema.dir/SemaLambda.cpp.o tools/clang/lib/Sema/CMakeFiles/obj.clangSema.dir/SemaLookup.cpp.o tools/clang/lib/Sema/CMakeFiles/obj.clangSema.dir/SemaModule.cpp.o tools/clang/lib/Sema/CMakeFiles/obj.clangSema.dir/SemaObjCProperty.cpp.o tools/clang/lib/Sema/CMakeFiles/obj.clangSema.dir/SemaOpenMP.cpp.o tools/clang/lib/Sema/CMakeFiles/obj.clangSema.dir/SemaOverload.cpp.o tools/clang/lib/Sema/CMakeFiles/obj.clangSema.dir/SemaPseudoObject.cpp.o tools/clang/lib/Sema/CMakeFiles/obj.clangSema.dir/SemaStmt.cpp.o tools/clang/lib/Sema/CMakeFiles/obj.clangSema.dir/SemaStmtAsm.cpp.o tools/clang/lib/Sema/CMakeFiles/obj.clangSema.dir/SemaStmtAttr.cpp.o tools/clang/lib/Sema/CMakeFiles/obj.clangSema.dir/SemaTemplate.cpp.o tools/clang/lib/Sema/CMakeFiles/obj.clangSema.dir/SemaTemplateDeduction.cpp.o tools/clang/lib/Sema/CMakeFiles/obj.clangSema.dir/SemaTemplateInstantiate.cpp.o tools/clang/lib/Sema/CMakeFiles/obj.clangSema.dir/SemaTemplateInstantiateDecl.cpp.o tools/clang/lib/Sema/CMakeFiles/obj.clangSema.dir/SemaTemplateVariadic.cpp.o tools/clang/lib/Sema/CMakeFiles/obj.clangSema.dir/SemaType.cpp.o tools/clang/lib/Sema/CMakeFiles/obj.clangSema.dir/TypeLocBuilder.cpp.o && :
[3107/4595] /Users/buildslave/jenkins/workspace/clang-stage2-coverage-R/host-compiler/bin/clang++  -DGTEST_HAS_RTTI=0 -D_GNU_SOURCE -D__STDC_CONSTANT_MACROS -D__STDC_FORMAT_MACROS -D__STDC_LIMIT_MACROS -Itools/clang/lib/CodeGen -I/Users/buildslave/jenkins/workspace/clang-stage2-coverage-R/llvm/tools/clang/lib/CodeGen -I/Users/buildslave/jenkins/workspace/clang-stage2-coverage-R/llvm/tools/clang/include -Itools/clang/include -I/Applications/Xcode.app/Contents/Developer/Platforms/MacOSX.platform/Developer/SDKs/MacOSX10.14.sdk/usr/include/libxml2 -Iinclude -I/Users/buildslave/jenkins/workspace/clang-stage2-coverage-R/llvm/include -fPIC -fvisibility-inlines-hidden -Werror=date-time -Werror=unguarded-availability-new -std=c++11 -fmodules -fmodules-cache-path=/Users/buildslave/jenkins/workspace/clang-stage2-coverage-R/clang-build/module.cache -fcxx-modules -Wall -Wextra -Wno-unused-parameter -Wwrite-strings -Wcast-qual -Wmissing-field-initializers -pedantic -Wno-long-long -Wimplicit-fallthrough -Wcovered-switch-default -Wno-noexcept-type -Wnon-virtual-dtor -Wdelete-non-virtual-dtor -Wstring-conversion -fdiagnostics-color -fprofile-instr-generate='/Users/buildslave/jenkins/workspace/clang-stage2-coverage-R/clang-build/profiles/%6m.profraw' -fcoverage-mapping -fno-common -Woverloaded-virtual -Wno-nested-anon-types -O3 -DNDEBUG -isysroot /Applications/Xcode.app/Contents/Developer/Platforms/MacOSX.platform/Developer/SDKs/MacOSX10.14.sdk    -fno-exceptions -fno-rtti -MD -MT tools/clang/lib/CodeGen/CMakeFiles/obj.clangCodeGen.dir/CGCleanup.cpp.o -MF tools/clang/lib/CodeGen/CMakeFiles/obj.clangCodeGen.dir/CGCleanup.cpp.o.d -o tools/clang/lib/CodeGen/CMakeFiles/obj.clangCodeGen.dir/CGCleanup.cpp.o -c /Users/buildslave/jenkins/workspace/clang-stage2-coverage-R/llvm/tools/clang/lib/CodeGen/CGCleanup.cpp
[3108/4595] /Users/buildslave/jenkins/workspace/clang-stage2-coverage-R/host-compiler/bin/clang++  -DGTEST_HAS_RTTI=0 -D_GNU_SOURCE -D__STDC_CONSTANT_MACROS -D__STDC_FORMAT_MACROS -D__STDC_LIMIT_MACROS -Itools/clang/lib/CodeGen -I/Users/buildslave/jenkins/workspace/clang-stage2-coverage-R/llvm/tools/clang/lib/CodeGen -I/Users/buildslave/jenkins/workspace/clang-stage2-coverage-R/llvm/tools/clang/include -Itools/clang/include -I/Applications/Xcode.app/Contents/Developer/Platforms/MacOSX.platform/Developer/SDKs/MacOSX10.14.sdk/usr/include/libxml2 -Iinclude -I/Users/buildslave/jenkins/workspace/clang-stage2-coverage-R/llvm/include -fPIC -fvisibility-inlines-hidden -Werror=date-time -Werror=unguarded-availability-new -std=c++11 -fmodules -fmodules-cache-path=/Users/buildslave/jenkins/workspace/clang-stage2-coverage-R/clang-build/module.cache -fcxx-modules -Wall -Wextra -Wno-unused-parameter -Wwrite-strings -Wcast-qual -Wmissing-field-initializers -pedantic -Wno-long-long -Wimplicit-fallthrough -Wcovered-switch-default -Wno-noexcept-type -Wnon-virtual-dtor -Wdelete-non-virtual-dtor -Wstring-conversion -fdiagnostics-color -fprofile-instr-generate='/Users/buildslave/jenkins/workspace/clang-stage2-coverage-R/clang-build/profiles/%6m.profraw' -fcoverage-mapping -fno-common -Woverloaded-virtual -Wno-nested-anon-types -O3 -DNDEBUG -isysroot /Applications/Xcode.app/Contents/Developer/Platforms/MacOSX.platform/Developer/SDKs/MacOSX10.14.sdk    -fno-exceptions -fno-rtti -MD -MT tools/clang/lib/CodeGen/CMakeFiles/obj.clangCodeGen.dir/CGCoroutine.cpp.o -MF tools/clang/lib/CodeGen/CMakeFiles/obj.clangCodeGen.dir/CGCoroutine.cpp.o.d -o tools/clang/lib/CodeGen/CMakeFiles/obj.clangCodeGen.dir/CGCoroutine.cpp.o -c /Users/buildslave/jenkins/workspace/clang-stage2-coverage-R/llvm/tools/clang/lib/CodeGen/CGCoroutine.cpp
[3109/4595] /Users/buildslave/jenkins/workspace/clang-stage2-coverage-R/host-compiler/bin/clang++  -DGTEST_HAS_RTTI=0 -D_GNU_SOURCE -D__STDC_CONSTANT_MACROS -D__STDC_FORMAT_MACROS -D__STDC_LIMIT_MACROS -Itools/clang/lib/CodeGen -I/Users/buildslave/jenkins/workspace/clang-stage2-coverage-R/llvm/tools/clang/lib/CodeGen -I/Users/buildslave/jenkins/workspace/clang-stage2-coverage-R/llvm/tools/clang/include -Itools/clang/include -I/Applications/Xcode.app/Contents/Developer/Platforms/MacOSX.platform/Developer/SDKs/MacOSX10.14.sdk/usr/include/libxml2 -Iinclude -I/Users/buildslave/jenkins/workspace/clang-stage2-coverage-R/llvm/include -fPIC -fvisibility-inlines-hidden -Werror=date-time -Werror=unguarded-availability-new -std=c++11 -fmodules -fmodules-cache-path=/Users/buildslave/jenkins/workspace/clang-stage2-coverage-R/clang-build/module.cache -fcxx-modules -Wall -Wextra -Wno-unused-parameter -Wwrite-strings -Wcast-qual -Wmissing-field-initializers -pedantic -Wno-long-long -Wimplicit-fallthrough -Wcovered-switch-default -Wno-noexcept-type -Wnon-virtual-dtor -Wdelete-non-virtual-dtor -Wstring-conversion -fdiagnostics-color -fprofile-instr-generate='/Users/buildslave/jenkins/workspace/clang-stage2-coverage-R/clang-build/profiles/%6m.profraw' -fcoverage-mapping -fno-common -Woverloaded-virtual -Wno-nested-anon-types -O3 -DNDEBUG -isysroot /Applications/Xcode.app/Contents/Developer/Platforms/MacOSX.platform/Developer/SDKs/MacOSX10.14.sdk    -fno-exceptions -fno-rtti -MD -MT tools/clang/lib/CodeGen/CMakeFiles/obj.clangCodeGen.dir/CGClass.cpp.o -MF tools/clang/lib/CodeGen/CMakeFiles/obj.clangCodeGen.dir/CGClass.cpp.o.d -o tools/clang/lib/CodeGen/CMakeFiles/obj.clangCodeGen.dir/CGClass.cpp.o -c /Users/buildslave/jenkins/workspace/clang-stage2-coverage-R/llvm/tools/clang/lib/CodeGen/CGClass.cpp
[3110/4595] /Users/buildslave/jenkins/workspace/clang-stage2-coverage-R/host-compiler/bin/clang++  -DGTEST_HAS_RTTI=0 -D_GNU_SOURCE -D__STDC_CONSTANT_MACROS -D__STDC_FORMAT_MACROS -D__STDC_LIMIT_MACROS -Itools/clang/lib/CodeGen -I/Users/buildslave/jenkins/workspace/clang-stage2-coverage-R/llvm/tools/clang/lib/CodeGen -I/Users/buildslave/jenkins/workspace/clang-stage2-coverage-R/llvm/tools/clang/include -Itools/clang/include -I/Applications/Xcode.app/Contents/Developer/Platforms/MacOSX.platform/Developer/SDKs/MacOSX10.14.sdk/usr/include/libxml2 -Iinclude -I/Users/buildslave/jenkins/workspace/clang-stage2-coverage-R/llvm/include -fPIC -fvisibility-inlines-hidden -Werror=date-time -Werror=unguarded-availability-new -std=c++11 -fmodules -fmodules-cache-path=/Users/buildslave/jenkins/workspace/clang-stage2-coverage-R/clang-build/module.cache -fcxx-modules -Wall -Wextra -Wno-unused-parameter -Wwrite-strings -Wcast-qual -Wmissing-field-initializers -pedantic -Wno-long-long -Wimplicit-fallthrough -Wcovered-switch-default -Wno-noexcept-type -Wnon-virtual-dtor -Wdelete-non-virtual-dtor -Wstring-conversion -fdiagnostics-color -fprofile-instr-generate='/Users/buildslave/jenkins/workspace/clang-stage2-coverage-R/clang-build/profiles/%6m.profraw' -fcoverage-mapping -fno-common -Woverloaded-virtual -Wno-nested-anon-types -O3 -DNDEBUG -isysroot /Applications/Xcode.app/Contents/Developer/Platforms/MacOSX.platform/Developer/SDKs/MacOSX10.14.sdk    -fno-exceptions -fno-rtti -MD -MT tools/clang/lib/CodeGen/CMakeFiles/obj.clangCodeGen.dir/CGBuiltin.cpp.o -MF tools/clang/lib/CodeGen/CMakeFiles/obj.clangCodeGen.dir/CGBuiltin.cpp.o.d -o tools/clang/lib/CodeGen/CMakeFiles/obj.clangCodeGen.dir/CGBuiltin.cpp.o -c /Users/buildslave/jenkins/workspace/clang-stage2-coverage-R/llvm/tools/clang/lib/CodeGen/CGBuiltin.cpp
[3111/4595] /Users/buildslave/jenkins/workspace/clang-stage2-coverage-R/host-compiler/bin/clang++  -DGTEST_HAS_RTTI=0 -D_GNU_SOURCE -D__STDC_CONSTANT_MACROS -D__STDC_FORMAT_MACROS -D__STDC_LIMIT_MACROS -Itools/clang/lib/CodeGen -I/Users/buildslave/jenkins/workspace/clang-stage2-coverage-R/llvm/tools/clang/lib/CodeGen -I/Users/buildslave/jenkins/workspace/clang-stage2-coverage-R/llvm/tools/clang/include -Itools/clang/include -I/Applications/Xcode.app/Contents/Developer/Platforms/MacOSX.platform/Developer/SDKs/MacOSX10.14.sdk/usr/include/libxml2 -Iinclude -I/Users/buildslave/jenkins/workspace/clang-stage2-coverage-R/llvm/include -fPIC -fvisibility-inlines-hidden -Werror=date-time -Werror=unguarded-availability-new -std=c++11 -fmodules -fmodules-cache-path=/Users/buildslave/jenkins/workspace/clang-stage2-coverage-R/clang-build/module.cache -fcxx-modules -Wall -Wextra -Wno-unused-parameter -Wwrite-strings -Wcast-qual -Wmissing-field-initializers -pedantic -Wno-long-long -Wimplicit-fallthrough -Wcovered-switch-default -Wno-noexcept-type -Wnon-virtual-dtor -Wdelete-non-virtual-dtor -Wstring-conversion -fdiagnostics-color -fprofile-instr-generate='/Users/buildslave/jenkins/workspace/clang-stage2-coverage-R/clang-build/profiles/%6m.profraw' -fcoverage-mapping -fno-common -Woverloaded-virtual -Wno-nested-anon-types -O3 -DNDEBUG -isysroot /Applications/Xcode.app/Contents/Developer/Platforms/MacOSX.platform/Developer/SDKs/MacOSX10.14.sdk    -fno-exceptions -fno-rtti -MD -MT tools/clang/lib/CodeGen/CMakeFiles/obj.clangCodeGen.dir/BackendUtil.cpp.o -MF tools/clang/lib/CodeGen/CMakeFiles/obj.clangCodeGen.dir/BackendUtil.cpp.o.d -o tools/clang/lib/CodeGen/CMakeFiles/obj.clangCodeGen.dir/BackendUtil.cpp.o -c /Users/buildslave/jenkins/workspace/clang-stage2-coverage-R/llvm/tools/clang/lib/CodeGen/BackendUtil.cpp
[3112/4595] /Users/buildslave/jenkins/workspace/clang-stage2-coverage-R/host-compiler/bin/clang++  -DGTEST_HAS_RTTI=0 -D_GNU_SOURCE -D__STDC_CONSTANT_MACROS -D__STDC_FORMAT_MACROS -D__STDC_LIMIT_MACROS -Itools/clang/lib/CodeGen -I/Users/buildslave/jenkins/workspace/clang-stage2-coverage-R/llvm/tools/clang/lib/CodeGen -I/Users/buildslave/jenkins/workspace/clang-stage2-coverage-R/llvm/tools/clang/include -Itools/clang/include -I/Applications/Xcode.app/Contents/Developer/Platforms/MacOSX.platform/Developer/SDKs/MacOSX10.14.sdk/usr/include/libxml2 -Iinclude -I/Users/buildslave/jenkins/workspace/clang-stage2-coverage-R/llvm/include -fPIC -fvisibility-inlines-hidden -Werror=date-time -Werror=unguarded-availability-new -std=c++11 -fmodules -fmodules-cache-path=/Users/buildslave/jenkins/workspace/clang-stage2-coverage-R/clang-build/module.cache -fcxx-modules -Wall -Wextra -Wno-unused-parameter -Wwrite-strings -Wcast-qual -Wmissing-field-initializers -pedantic -Wno-long-long -Wimplicit-fallthrough -Wcovered-switch-default -Wno-noexcept-type -Wnon-virtual-dtor -Wdelete-non-virtual-dtor -Wstring-conversion -fdiagnostics-color -fprofile-instr-generate='/Users/buildslave/jenkins/workspace/clang-stage2-coverage-R/clang-build/profiles/%6m.profraw' -fcoverage-mapping -fno-common -Woverloaded-virtual -Wno-nested-anon-types -O3 -DNDEBUG -isysroot /Applications/Xcode.app/Contents/Developer/Platforms/MacOSX.platform/Developer/SDKs/MacOSX10.14.sdk    -fno-exceptions -fno-rtti -MD -MT tools/clang/lib/CodeGen/CMakeFiles/obj.clangCodeGen.dir/CGCall.cpp.o -MF tools/clang/lib/CodeGen/CMakeFiles/obj.clangCodeGen.dir/CGCall.cpp.o.d -o tools/clang/lib/CodeGen/CMakeFiles/obj.clangCodeGen.dir/CGCall.cpp.o -c /Users/buildslave/jenkins/workspace/clang-stage2-coverage-R/llvm/tools/clang/lib/CodeGen/CGCall.cpp
[3113/4595] /Users/buildslave/jenkins/workspace/clang-stage2-coverage-R/host-compiler/bin/clang++  -DGTEST_HAS_RTTI=0 -D_GNU_SOURCE -D__STDC_CONSTANT_MACROS -D__STDC_FORMAT_MACROS -D__STDC_LIMIT_MACROS -Itools/clang/lib/CodeGen -I/Users/buildslave/jenkins/workspace/clang-stage2-coverage-R/llvm/tools/clang/lib/CodeGen -I/Users/buildslave/jenkins/workspace/clang-stage2-coverage-R/llvm/tools/clang/include -Itools/clang/include -I/Applications/Xcode.app/Contents/Developer/Platforms/MacOSX.platform/Developer/SDKs/MacOSX10.14.sdk/usr/include/libxml2 -Iinclude -I/Users/buildslave/jenkins/workspace/clang-stage2-coverage-R/llvm/include -fPIC -fvisibility-inlines-hidden -Werror=date-time -Werror=unguarded-availability-new -std=c++11 -fmodules -fmodules-cache-path=/Users/buildslave/jenkins/workspace/clang-stage2-coverage-R/clang-build/module.cache -fcxx-modules -Wall -Wextra -Wno-unused-parameter -Wwrite-strings -Wcast-qual -Wmissing-field-initializers -pedantic -Wno-long-long -Wimplicit-fallthrough -Wcovered-switch-default -Wno-noexcept-type -Wnon-virtual-dtor -Wdelete-non-virtual-dtor -Wstring-conversion -fdiagnostics-color -fprofile-instr-generate='/Users/buildslave/jenkins/workspace/clang-stage2-coverage-R/clang-build/profiles/%6m.profraw' -fcoverage-mapping -fno-common -Woverloaded-virtual -Wno-nested-anon-types -O3 -DNDEBUG -isysroot /Applications/Xcode.app/Contents/Developer/Platforms/MacOSX.platform/Developer/SDKs/MacOSX10.14.sdk    -fno-exceptions -fno-rtti -MD -MT tools/clang/lib/CodeGen/CMakeFiles/obj.clangCodeGen.dir/CGDeclCXX.cpp.o -MF tools/clang/lib/CodeGen/CMakeFiles/obj.clangCodeGen.dir/CGDeclCXX.cpp.o.d -o tools/clang/lib/CodeGen/CMakeFiles/obj.clangCodeGen.dir/CGDeclCXX.cpp.o -c /Users/buildslave/jenkins/workspace/clang-stage2-coverage-R/llvm/tools/clang/lib/CodeGen/CGDeclCXX.cpp
[3114/4595] /Users/buildslave/jenkins/workspace/clang-stage2-coverage-R/host-compiler/bin/clang++  -DGTEST_HAS_RTTI=0 -D_GNU_SOURCE -D__STDC_CONSTANT_MACROS -D__STDC_FORMAT_MACROS -D__STDC_LIMIT_MACROS -Itools/clang/lib/CodeGen -I/Users/buildslave/jenkins/workspace/clang-stage2-coverage-R/llvm/tools/clang/lib/CodeGen -I/Users/buildslave/jenkins/workspace/clang-stage2-coverage-R/llvm/tools/clang/include -Itools/clang/include -I/Applications/Xcode.app/Contents/Developer/Platforms/MacOSX.platform/Developer/SDKs/MacOSX10.14.sdk/usr/include/libxml2 -Iinclude -I/Users/buildslave/jenkins/workspace/clang-stage2-coverage-R/llvm/include -fPIC -fvisibility-inlines-hidden -Werror=date-time -Werror=unguarded-availability-new -std=c++11 -fmodules -fmodules-cache-path=/Users/buildslave/jenkins/workspace/clang-stage2-coverage-R/clang-build/module.cache -fcxx-modules -Wall -Wextra -Wno-unused-parameter -Wwrite-strings -Wcast-qual -Wmissing-field-initializers -pedantic -Wno-long-long -Wimplicit-fallthrough -Wcovered-switch-default -Wno-noexcept-type -Wnon-virtual-dtor -Wdelete-non-virtual-dtor -Wstring-conversion -fdiagnostics-color -fprofile-instr-generate='/Users/buildslave/jenkins/workspace/clang-stage2-coverage-R/clang-build/profiles/%6m.profraw' -fcoverage-mapping -fno-common -Woverloaded-virtual -Wno-nested-anon-types -O3 -DNDEBUG -isysroot /Applications/Xcode.app/Contents/Developer/Platforms/MacOSX.platform/Developer/SDKs/MacOSX10.14.sdk    -fno-exceptions -fno-rtti -MD -MT tools/clang/lib/CodeGen/CMakeFiles/obj.clangCodeGen.dir/CGException.cpp.o -MF tools/clang/lib/CodeGen/CMakeFiles/obj.clangCodeGen.dir/CGException.cpp.o.d -o tools/clang/lib/CodeGen/CMakeFiles/obj.clangCodeGen.dir/CGException.cpp.o -c /Users/buildslave/jenkins/workspace/clang-stage2-coverage-R/llvm/tools/clang/lib/CodeGen/CGException.cpp
[3115/4595] /Users/buildslave/jenkins/workspace/clang-stage2-coverage-R/host-compiler/bin/clang++  -DGTEST_HAS_RTTI=0 -D_GNU_SOURCE -D__STDC_CONSTANT_MACROS -D__STDC_FORMAT_MACROS -D__STDC_LIMIT_MACROS -Itools/clang/lib/CodeGen -I/Users/buildslave/jenkins/workspace/clang-stage2-coverage-R/llvm/tools/clang/lib/CodeGen -I/Users/buildslave/jenkins/workspace/clang-stage2-coverage-R/llvm/tools/clang/include -Itools/clang/include -I/Applications/Xcode.app/Contents/Developer/Platforms/MacOSX.platform/Developer/SDKs/MacOSX10.14.sdk/usr/include/libxml2 -Iinclude -I/Users/buildslave/jenkins/workspace/clang-stage2-coverage-R/llvm/include -fPIC -fvisibility-inlines-hidden -Werror=date-time -Werror=unguarded-availability-new -std=c++11 -fmodules -fmodules-cache-path=/Users/buildslave/jenkins/workspace/clang-stage2-coverage-R/clang-build/module.cache -fcxx-modules -Wall -Wextra -Wno-unused-parameter -Wwrite-strings -Wcast-qual -Wmissing-field-initializers -pedantic -Wno-long-long -Wimplicit-fallthrough -Wcovered-switch-default -Wno-noexcept-type -Wnon-virtual-dtor -Wdelete-non-virtual-dtor -Wstring-conversion -fdiagnostics-color -fprofile-instr-generate='/Users/buildslave/jenkins/workspace/clang-stage2-coverage-R/clang-build/profiles/%6m.profraw' -fcoverage-mapping -fno-common -Woverloaded-virtual -Wno-nested-anon-types -O3 -DNDEBUG -isysroot /Applications/Xcode.app/Contents/Developer/Platforms/MacOSX.platform/Developer/SDKs/MacOSX10.14.sdk    -fno-exceptions -fno-rtti -MD -MT tools/clang/lib/CodeGen/CMakeFiles/obj.clangCodeGen.dir/CGDecl.cpp.o -MF tools/clang/lib/CodeGen/CMakeFiles/obj.clangCodeGen.dir/CGDecl.cpp.o.d -o tools/clang/lib/CodeGen/CMakeFiles/obj.clangCodeGen.dir/CGDecl.cpp.o -c /Users/buildslave/jenkins/workspace/clang-stage2-coverage-R/llvm/tools/clang/lib/CodeGen/CGDecl.cpp
[3116/4595] /Users/buildslave/jenkins/workspace/clang-stage2-coverage-R/host-compiler/bin/clang++  -DGTEST_HAS_RTTI=0 -D_GNU_SOURCE -D__STDC_CONSTANT_MACROS -D__STDC_FORMAT_MACROS -D__STDC_LIMIT_MACROS -Itools/clang/lib/CodeGen -I/Users/buildslave/jenkins/workspace/clang-stage2-coverage-R/llvm/tools/clang/lib/CodeGen -I/Users/buildslave/jenkins/workspace/clang-stage2-coverage-R/llvm/tools/clang/include -Itools/clang/include -I/Applications/Xcode.app/Contents/Developer/Platforms/MacOSX.platform/Developer/SDKs/MacOSX10.14.sdk/usr/include/libxml2 -Iinclude -I/Users/buildslave/jenkins/workspace/clang-stage2-coverage-R/llvm/include -fPIC -fvisibility-inlines-hidden -Werror=date-time -Werror=unguarded-availability-new -std=c++11 -fmodules -fmodules-cache-path=/Users/buildslave/jenkins/workspace/clang-stage2-coverage-R/clang-build/module.cache -fcxx-modules -Wall -Wextra -Wno-unused-parameter -Wwrite-strings -Wcast-qual -Wmissing-field-initializers -pedantic -Wno-long-long -Wimplicit-fallthrough -Wcovered-switch-default -Wno-noexcept-type -Wnon-virtual-dtor -Wdelete-non-virtual-dtor -Wstring-conversion -fdiagnostics-color -fprofile-instr-generate='/Users/buildslave/jenkins/workspace/clang-stage2-coverage-R/clang-build/profiles/%6m.profraw' -fcoverage-mapping -fno-common -Woverloaded-virtual -Wno-nested-anon-types -O3 -DNDEBUG -isysroot /Applications/Xcode.app/Contents/Developer/Platforms/MacOSX.platform/Developer/SDKs/MacOSX10.14.sdk    -fno-exceptions -fno-rtti -MD -MT tools/clang/lib/CodeGen/CMakeFiles/obj.clangCodeGen.dir/CGExprAgg.cpp.o -MF tools/clang/lib/CodeGen/CMakeFiles/obj.clangCodeGen.dir/CGExprAgg.cpp.o.d -o tools/clang/lib/CodeGen/CMakeFiles/obj.clangCodeGen.dir/CGExprAgg.cpp.o -c /Users/buildslave/jenkins/workspace/clang-stage2-coverage-R/llvm/tools/clang/lib/CodeGen/CGExprAgg.cpp
[3117/4595] /Users/buildslave/jenkins/workspace/clang-stage2-coverage-R/host-compiler/bin/clang++  -DGTEST_HAS_RTTI=0 -D_GNU_SOURCE -D__STDC_CONSTANT_MACROS -D__STDC_FORMAT_MACROS -D__STDC_LIMIT_MACROS -Itools/clang/lib/CodeGen -I/Users/buildslave/jenkins/workspace/clang-stage2-coverage-R/llvm/tools/clang/lib/CodeGen -I/Users/buildslave/jenkins/workspace/clang-stage2-coverage-R/llvm/tools/clang/include -Itools/clang/include -I/Applications/Xcode.app/Contents/Developer/Platforms/MacOSX.platform/Developer/SDKs/MacOSX10.14.sdk/usr/include/libxml2 -Iinclude -I/Users/buildslave/jenkins/workspace/clang-stage2-coverage-R/llvm/include -fPIC -fvisibility-inlines-hidden -Werror=date-time -Werror=unguarded-availability-new -std=c++11 -fmodules -fmodules-cache-path=/Users/buildslave/jenkins/workspace/clang-stage2-coverage-R/clang-build/module.cache -fcxx-modules -Wall -Wextra -Wno-unused-parameter -Wwrite-strings -Wcast-qual -Wmissing-field-initializers -pedantic -Wno-long-long -Wimplicit-fallthrough -Wcovered-switch-default -Wno-noexcept-type -Wnon-virtual-dtor -Wdelete-non-virtual-dtor -Wstring-conversion -fdiagnostics-color -fprofile-instr-generate='/Users/buildslave/jenkins/workspace/clang-stage2-coverage-R/clang-build/profiles/%6m.profraw' -fcoverage-mapping -fno-common -Woverloaded-virtual -Wno-nested-anon-types -O3 -DNDEBUG -isysroot /Applications/Xcode.app/Contents/Developer/Platforms/MacOSX.platform/Developer/SDKs/MacOSX10.14.sdk    -fno-exceptions -fno-rtti -MD -MT tools/clang/lib/CodeGen/CMakeFiles/obj.clangCodeGen.dir/CGExprCXX.cpp.o -MF tools/clang/lib/CodeGen/CMakeFiles/obj.clangCodeGen.dir/CGExprCXX.cpp.o.d -o tools/clang/lib/CodeGen/CMakeFiles/obj.clangCodeGen.dir/CGExprCXX.cpp.o -c /Users/buildslave/jenkins/workspace/clang-stage2-coverage-R/llvm/tools/clang/lib/CodeGen/CGExprCXX.cpp
[3118/4595] /Users/buildslave/jenkins/workspace/clang-stage2-coverage-R/host-compiler/bin/clang++  -DGTEST_HAS_RTTI=0 -D_GNU_SOURCE -D__STDC_CONSTANT_MACROS -D__STDC_FORMAT_MACROS -D__STDC_LIMIT_MACROS -Itools/clang/lib/CodeGen -I/Users/buildslave/jenkins/workspace/clang-stage2-coverage-R/llvm/tools/clang/lib/CodeGen -I/Users/buildslave/jenkins/workspace/clang-stage2-coverage-R/llvm/tools/clang/include -Itools/clang/include -I/Applications/Xcode.app/Contents/Developer/Platforms/MacOSX.platform/Developer/SDKs/MacOSX10.14.sdk/usr/include/libxml2 -Iinclude -I/Users/buildslave/jenkins/workspace/clang-stage2-coverage-R/llvm/include -fPIC -fvisibility-inlines-hidden -Werror=date-time -Werror=unguarded-availability-new -std=c++11 -fmodules -fmodules-cache-path=/Users/buildslave/jenkins/workspace/clang-stage2-coverage-R/clang-build/module.cache -fcxx-modules -Wall -Wextra -Wno-unused-parameter -Wwrite-strings -Wcast-qual -Wmissing-field-initializers -pedantic -Wno-long-long -Wimplicit-fallthrough -Wcovered-switch-default -Wno-noexcept-type -Wnon-virtual-dtor -Wdelete-non-virtual-dtor -Wstring-conversion -fdiagnostics-color -fprofile-instr-generate='/Users/buildslave/jenkins/workspace/clang-stage2-coverage-R/clang-build/profiles/%6m.profraw' -fcoverage-mapping -fno-common -Woverloaded-virtual -Wno-nested-anon-types -O3 -DNDEBUG -isysroot /Applications/Xcode.app/Contents/Developer/Platforms/MacOSX.platform/Developer/SDKs/MacOSX10.14.sdk    -fno-exceptions -fno-rtti -MD -MT tools/clang/lib/CodeGen/CMakeFiles/obj.clangCodeGen.dir/CGExpr.cpp.o -MF tools/clang/lib/CodeGen/CMakeFiles/obj.clangCodeGen.dir/CGExpr.cpp.o.d -o tools/clang/lib/CodeGen/CMakeFiles/obj.clangCodeGen.dir/CGExpr.cpp.o -c /Users/buildslave/jenkins/workspace/clang-stage2-coverage-R/llvm/tools/clang/lib/CodeGen/CGExpr.cpp
[3119/4595] /Users/buildslave/jenkins/workspace/clang-stage2-coverage-R/host-compiler/bin/clang++  -DGTEST_HAS_RTTI=0 -D_GNU_SOURCE -D__STDC_CONSTANT_MACROS -D__STDC_FORMAT_MACROS -D__STDC_LIMIT_MACROS -Itools/clang/lib/CodeGen -I/Users/buildslave/jenkins/workspace/clang-stage2-coverage-R/llvm/tools/clang/lib/CodeGen -I/Users/buildslave/jenkins/workspace/clang-stage2-coverage-R/llvm/tools/clang/include -Itools/clang/include -I/Applications/Xcode.app/Contents/Developer/Platforms/MacOSX.platform/Developer/SDKs/MacOSX10.14.sdk/usr/include/libxml2 -Iinclude -I/Users/buildslave/jenkins/workspace/clang-stage2-coverage-R/llvm/include -fPIC -fvisibility-inlines-hidden -Werror=date-time -Werror=unguarded-availability-new -std=c++11 -fmodules -fmodules-cache-path=/Users/buildslave/jenkins/workspace/clang-stage2-coverage-R/clang-build/module.cache -fcxx-modules -Wall -Wextra -Wno-unused-parameter -Wwrite-strings -Wcast-qual -Wmissing-field-initializers -pedantic -Wno-long-long -Wimplicit-fallthrough -Wcovered-switch-default -Wno-noexcept-type -Wnon-virtual-dtor -Wdelete-non-virtual-dtor -Wstring-conversion -fdiagnostics-color -fprofile-instr-generate='/Users/buildslave/jenkins/workspace/clang-stage2-coverage-R/clang-build/profiles/%6m.profraw' -fcoverage-mapping -fno-common -Woverloaded-virtual -Wno-nested-anon-types -O3 -DNDEBUG -isysroot /Applications/Xcode.app/Contents/Developer/Platforms/MacOSX.platform/Developer/SDKs/MacOSX10.14.sdk    -fno-exceptions -fno-rtti -MD -MT tools/clang/lib/CodeGen/CMakeFiles/obj.clangCodeGen.dir/CGExprComplex.cpp.o -MF tools/clang/lib/CodeGen/CMakeFiles/obj.clangCodeGen.dir/CGExprComplex.cpp.o.d -o tools/clang/lib/CodeGen/CMakeFiles/obj.clangCodeGen.dir/CGExprComplex.cpp.o -c /Users/buildslave/jenkins/workspace/clang-stage2-coverage-R/llvm/tools/clang/lib/CodeGen/CGExprComplex.cpp
[3120/4595] /Users/buildslave/jenkins/workspace/clang-stage2-coverage-R/host-compiler/bin/clang++  -DGTEST_HAS_RTTI=0 -D_GNU_SOURCE -D__STDC_CONSTANT_MACROS -D__STDC_FORMAT_MACROS -D__STDC_LIMIT_MACROS -Itools/clang/lib/CodeGen -I/Users/buildslave/jenkins/workspace/clang-stage2-coverage-R/llvm/tools/clang/lib/CodeGen -I/Users/buildslave/jenkins/workspace/clang-stage2-coverage-R/llvm/tools/clang/include -Itools/clang/include -I/Applications/Xcode.app/Contents/Developer/Platforms/MacOSX.platform/Developer/SDKs/MacOSX10.14.sdk/usr/include/libxml2 -Iinclude -I/Users/buildslave/jenkins/workspace/clang-stage2-coverage-R/llvm/include -fPIC -fvisibility-inlines-hidden -Werror=date-time -Werror=unguarded-availability-new -std=c++11 -fmodules -fmodules-cache-path=/Users/buildslave/jenkins/workspace/clang-stage2-coverage-R/clang-build/module.cache -fcxx-modules -Wall -Wextra -Wno-unused-parameter -Wwrite-strings -Wcast-qual -Wmissing-field-initializers -pedantic -Wno-long-long -Wimplicit-fallthrough -Wcovered-switch-default -Wno-noexcept-type -Wnon-virtual-dtor -Wdelete-non-virtual-dtor -Wstring-conversion -fdiagnostics-color -fprofile-instr-generate='/Users/buildslave/jenkins/workspace/clang-stage2-coverage-R/clang-build/profiles/%6m.profraw' -fcoverage-mapping -fno-common -Woverloaded-virtual -Wno-nested-anon-types -O3 -DNDEBUG -isysroot /Applications/Xcode.app/Contents/Developer/Platforms/MacOSX.platform/Developer/SDKs/MacOSX10.14.sdk    -fno-exceptions -fno-rtti -MD -MT tools/clang/lib/CodeGen/CMakeFiles/obj.clangCodeGen.dir/CGLoopInfo.cpp.o -MF tools/clang/lib/CodeGen/CMakeFiles/obj.clangCodeGen.dir/CGLoopInfo.cpp.o.d -o tools/clang/lib/CodeGen/CMakeFiles/obj.clangCodeGen.dir/CGLoopInfo.cpp.o -c /Users/buildslave/jenkins/workspace/clang-stage2-coverage-R/llvm/tools/clang/lib/CodeGen/CGLoopInfo.cpp
[3121/4595] /Users/buildslave/jenkins/workspace/clang-stage2-coverage-R/host-compiler/bin/clang++  -DGTEST_HAS_RTTI=0 -D_GNU_SOURCE -D__STDC_CONSTANT_MACROS -D__STDC_FORMAT_MACROS -D__STDC_LIMIT_MACROS -Itools/clang/lib/CodeGen -I/Users/buildslave/jenkins/workspace/clang-stage2-coverage-R/llvm/tools/clang/lib/CodeGen -I/Users/buildslave/jenkins/workspace/clang-stage2-coverage-R/llvm/tools/clang/include -Itools/clang/include -I/Applications/Xcode.app/Contents/Developer/Platforms/MacOSX.platform/Developer/SDKs/MacOSX10.14.sdk/usr/include/libxml2 -Iinclude -I/Users/buildslave/jenkins/workspace/clang-stage2-coverage-R/llvm/include -fPIC -fvisibility-inlines-hidden -Werror=date-time -Werror=unguarded-availability-new -std=c++11 -fmodules -fmodules-cache-path=/Users/buildslave/jenkins/workspace/clang-stage2-coverage-R/clang-build/module.cache -fcxx-modules -Wall -Wextra -Wno-unused-parameter -Wwrite-strings -Wcast-qual -Wmissing-field-initializers -pedantic -Wno-long-long -Wimplicit-fallthrough -Wcovered-switch-default -Wno-noexcept-type -Wnon-virtual-dtor -Wdelete-non-virtual-dtor -Wstring-conversion -fdiagnostics-color -fprofile-instr-generate='/Users/buildslave/jenkins/workspace/clang-stage2-coverage-R/clang-build/profiles/%6m.profraw' -fcoverage-mapping -fno-common -Woverloaded-virtual -Wno-nested-anon-types -O3 -DNDEBUG -isysroot /Applications/Xcode.app/Contents/Developer/Platforms/MacOSX.platform/Developer/SDKs/MacOSX10.14.sdk    -fno-exceptions -fno-rtti -MD -MT tools/clang/lib/CodeGen/CMakeFiles/obj.clangCodeGen.dir/CGDebugInfo.cpp.o -MF tools/clang/lib/CodeGen/CMakeFiles/obj.clangCodeGen.dir/CGDebugInfo.cpp.o.d -o tools/clang/lib/CodeGen/CMakeFiles/obj.clangCodeGen.dir/CGDebugInfo.cpp.o -c /Users/buildslave/jenkins/workspace/clang-stage2-coverage-R/llvm/tools/clang/lib/CodeGen/CGDebugInfo.cpp
[3122/4595] /Users/buildslave/jenkins/workspace/clang-stage2-coverage-R/host-compiler/bin/clang++  -DGTEST_HAS_RTTI=0 -D_GNU_SOURCE -D__STDC_CONSTANT_MACROS -D__STDC_FORMAT_MACROS -D__STDC_LIMIT_MACROS -Itools/clang/lib/CodeGen -I/Users/buildslave/jenkins/workspace/clang-stage2-coverage-R/llvm/tools/clang/lib/CodeGen -I/Users/buildslave/jenkins/workspace/clang-stage2-coverage-R/llvm/tools/clang/include -Itools/clang/include -I/Applications/Xcode.app/Contents/Developer/Platforms/MacOSX.platform/Developer/SDKs/MacOSX10.14.sdk/usr/include/libxml2 -Iinclude -I/Users/buildslave/jenkins/workspace/clang-stage2-coverage-R/llvm/include -fPIC -fvisibility-inlines-hidden -Werror=date-time -Werror=unguarded-availability-new -std=c++11 -fmodules -fmodules-cache-path=/Users/buildslave/jenkins/workspace/clang-stage2-coverage-R/clang-build/module.cache -fcxx-modules -Wall -Wextra -Wno-unused-parameter -Wwrite-strings -Wcast-qual -Wmissing-field-initializers -pedantic -Wno-long-long -Wimplicit-fallthrough -Wcovered-switch-default -Wno-noexcept-type -Wnon-virtual-dtor -Wdelete-non-virtual-dtor -Wstring-conversion -fdiagnostics-color -fprofile-instr-generate='/Users/buildslave/jenkins/workspace/clang-stage2-coverage-R/clang-build/profiles/%6m.profraw' -fcoverage-mapping -fno-common -Woverloaded-virtual -Wno-nested-anon-types -O3 -DNDEBUG -isysroot /Applications/Xcode.app/Contents/Developer/Platforms/MacOSX.platform/Developer/SDKs/MacOSX10.14.sdk    -fno-exceptions -fno-rtti -MD -MT tools/clang/lib/CodeGen/CMakeFiles/obj.clangCodeGen.dir/CGGPUBuiltin.cpp.o -MF tools/clang/lib/CodeGen/CMakeFiles/obj.clangCodeGen.dir/CGGPUBuiltin.cpp.o.d -o tools/clang/lib/CodeGen/CMakeFiles/obj.clangCodeGen.dir/CGGPUBuiltin.cpp.o -c /Users/buildslave/jenkins/workspace/clang-stage2-coverage-R/llvm/tools/clang/lib/CodeGen/CGGPUBuiltin.cpp
[3123/4595] /Users/buildslave/jenkins/workspace/clang-stage2-coverage-R/host-compiler/bin/clang++  -DGTEST_HAS_RTTI=0 -D_GNU_SOURCE -D__STDC_CONSTANT_MACROS -D__STDC_FORMAT_MACROS -D__STDC_LIMIT_MACROS -Itools/clang/lib/CodeGen -I/Users/buildslave/jenkins/workspace/clang-stage2-coverage-R/llvm/tools/clang/lib/CodeGen -I/Users/buildslave/jenkins/workspace/clang-stage2-coverage-R/llvm/tools/clang/include -Itools/clang/include -I/Applications/Xcode.app/Contents/Developer/Platforms/MacOSX.platform/Developer/SDKs/MacOSX10.14.sdk/usr/include/libxml2 -Iinclude -I/Users/buildslave/jenkins/workspace/clang-stage2-coverage-R/llvm/include -fPIC -fvisibility-inlines-hidden -Werror=date-time -Werror=unguarded-availability-new -std=c++11 -fmodules -fmodules-cache-path=/Users/buildslave/jenkins/workspace/clang-stage2-coverage-R/clang-build/module.cache -fcxx-modules -Wall -Wextra -Wno-unused-parameter -Wwrite-strings -Wcast-qual -Wmissing-field-initializers -pedantic -Wno-long-long -Wimplicit-fallthrough -Wcovered-switch-default -Wno-noexcept-type -Wnon-virtual-dtor -Wdelete-non-virtual-dtor -Wstring-conversion -fdiagnostics-color -fprofile-instr-generate='/Users/buildslave/jenkins/workspace/clang-stage2-coverage-R/clang-build/profiles/%6m.profraw' -fcoverage-mapping -fno-common -Woverloaded-virtual -Wno-nested-anon-types -O3 -DNDEBUG -isysroot /Applications/Xcode.app/Contents/Developer/Platforms/MacOSX.platform/Developer/SDKs/MacOSX10.14.sdk    -fno-exceptions -fno-rtti -MD -MT tools/clang/lib/CodeGen/CMakeFiles/obj.clangCodeGen.dir/CGExprConstant.cpp.o -MF tools/clang/lib/CodeGen/CMakeFiles/obj.clangCodeGen.dir/CGExprConstant.cpp.o.d -o tools/clang/lib/CodeGen/CMakeFiles/obj.clangCodeGen.dir/CGExprConstant.cpp.o -c /Users/buildslave/jenkins/workspace/clang-stage2-coverage-R/llvm/tools/clang/lib/CodeGen/CGExprConstant.cpp
[3124/4595] /Users/buildslave/jenkins/workspace/clang-stage2-coverage-R/host-compiler/bin/clang++  -DGTEST_HAS_RTTI=0 -D_GNU_SOURCE -D__STDC_CONSTANT_MACROS -D__STDC_FORMAT_MACROS -D__STDC_LIMIT_MACROS -Itools/clang/lib/CodeGen -I/Users/buildslave/jenkins/workspace/clang-stage2-coverage-R/llvm/tools/clang/lib/CodeGen -I/Users/buildslave/jenkins/workspace/clang-stage2-coverage-R/llvm/tools/clang/include -Itools/clang/include -I/Applications/Xcode.app/Contents/Developer/Platforms/MacOSX.platform/Developer/SDKs/MacOSX10.14.sdk/usr/include/libxml2 -Iinclude -I/Users/buildslave/jenkins/workspace/clang-stage2-coverage-R/llvm/include -fPIC -fvisibility-inlines-hidden -Werror=date-time -Werror=unguarded-availability-new -std=c++11 -fmodules -fmodules-cache-path=/Users/buildslave/jenkins/workspace/clang-stage2-coverage-R/clang-build/module.cache -fcxx-modules -Wall -Wextra -Wno-unused-parameter -Wwrite-strings -Wcast-qual -Wmissing-field-initializers -pedantic -Wno-long-long -Wimplicit-fallthrough -Wcovered-switch-default -Wno-noexcept-type -Wnon-virtual-dtor -Wdelete-non-virtual-dtor -Wstring-conversion -fdiagnostics-color -fprofile-instr-generate='/Users/buildslave/jenkins/workspace/clang-stage2-coverage-R/clang-build/profiles/%6m.profraw' -fcoverage-mapping -fno-common -Woverloaded-virtual -Wno-nested-anon-types -O3 -DNDEBUG -isysroot /Applications/Xcode.app/Contents/Developer/Platforms/MacOSX.platform/Developer/SDKs/MacOSX10.14.sdk    -fno-exceptions -fno-rtti -MD -MT tools/clang/lib/CodeGen/CMakeFiles/obj.clangCodeGen.dir/CGExprScalar.cpp.o -MF tools/clang/lib/CodeGen/CMakeFiles/obj.clangCodeGen.dir/CGExprScalar.cpp.o.d -o tools/clang/lib/CodeGen/CMakeFiles/obj.clangCodeGen.dir/CGExprScalar.cpp.o -c /Users/buildslave/jenkins/workspace/clang-stage2-coverage-R/llvm/tools/clang/lib/CodeGen/CGExprScalar.cpp
[3125/4595] /Users/buildslave/jenkins/workspace/clang-stage2-coverage-R/host-compiler/bin/clang++  -DGTEST_HAS_RTTI=0 -D_GNU_SOURCE -D__STDC_CONSTANT_MACROS -D__STDC_FORMAT_MACROS -D__STDC_LIMIT_MACROS -Itools/clang/lib/CodeGen -I/Users/buildslave/jenkins/workspace/clang-stage2-coverage-R/llvm/tools/clang/lib/CodeGen -I/Users/buildslave/jenkins/workspace/clang-stage2-coverage-R/llvm/tools/clang/include -Itools/clang/include -I/Applications/Xcode.app/Contents/Developer/Platforms/MacOSX.platform/Developer/SDKs/MacOSX10.14.sdk/usr/include/libxml2 -Iinclude -I/Users/buildslave/jenkins/workspace/clang-stage2-coverage-R/llvm/include -fPIC -fvisibility-inlines-hidden -Werror=date-time -Werror=unguarded-availability-new -std=c++11 -fmodules -fmodules-cache-path=/Users/buildslave/jenkins/workspace/clang-stage2-coverage-R/clang-build/module.cache -fcxx-modules -Wall -Wextra -Wno-unused-parameter -Wwrite-strings -Wcast-qual -Wmissing-field-initializers -pedantic -Wno-long-long -Wimplicit-fallthrough -Wcovered-switch-default -Wno-noexcept-type -Wnon-virtual-dtor -Wdelete-non-virtual-dtor -Wstring-conversion -fdiagnostics-color -fprofile-instr-generate='/Users/buildslave/jenkins/workspace/clang-stage2-coverage-R/clang-build/profiles/%6m.profraw' -fcoverage-mapping -fno-common -Woverloaded-virtual -Wno-nested-anon-types -O3 -DNDEBUG -isysroot /Applications/Xcode.app/Contents/Developer/Platforms/MacOSX.platform/Developer/SDKs/MacOSX10.14.sdk    -fno-exceptions -fno-rtti -MD -MT tools/clang/lib/CodeGen/CMakeFiles/obj.clangCodeGen.dir/CGNonTrivialStruct.cpp.o -MF tools/clang/lib/CodeGen/CMakeFiles/obj.clangCodeGen.dir/CGNonTrivialStruct.cpp.o.d -o tools/clang/lib/CodeGen/CMakeFiles/obj.clangCodeGen.dir/CGNonTrivialStruct.cpp.o -c /Users/buildslave/jenkins/workspace/clang-stage2-coverage-R/llvm/tools/clang/lib/CodeGen/CGNonTrivialStruct.cpp
[3126/4595] /Users/buildslave/jenkins/workspace/clang-stage2-coverage-R/host-compiler/bin/clang++  -DGTEST_HAS_RTTI=0 -D_GNU_SOURCE -D__STDC_CONSTANT_MACROS -D__STDC_FORMAT_MACROS -D__STDC_LIMIT_MACROS -Itools/clang/lib/CodeGen -I/Users/buildslave/jenkins/workspace/clang-stage2-coverage-R/llvm/tools/clang/lib/CodeGen -I/Users/buildslave/jenkins/workspace/clang-stage2-coverage-R/llvm/tools/clang/include -Itools/clang/include -I/Applications/Xcode.app/Contents/Developer/Platforms/MacOSX.platform/Developer/SDKs/MacOSX10.14.sdk/usr/include/libxml2 -Iinclude -I/Users/buildslave/jenkins/workspace/clang-stage2-coverage-R/llvm/include -fPIC -fvisibility-inlines-hidden -Werror=date-time -Werror=unguarded-availability-new -std=c++11 -fmodules -fmodules-cache-path=/Users/buildslave/jenkins/workspace/clang-stage2-coverage-R/clang-build/module.cache -fcxx-modules -Wall -Wextra -Wno-unused-parameter -Wwrite-strings -Wcast-qual -Wmissing-field-initializers -pedantic -Wno-long-long -Wimplicit-fallthrough -Wcovered-switch-default -Wno-noexcept-type -Wnon-virtual-dtor -Wdelete-non-virtual-dtor -Wstring-conversion -fdiagnostics-color -fprofile-instr-generate='/Users/buildslave/jenkins/workspace/clang-stage2-coverage-R/clang-build/profiles/%6m.profraw' -fcoverage-mapping -fno-common -Woverloaded-virtual -Wno-nested-anon-types -O3 -DNDEBUG -isysroot /Applications/Xcode.app/Contents/Developer/Platforms/MacOSX.platform/Developer/SDKs/MacOSX10.14.sdk    -fno-exceptions -fno-rtti -MD -MT tools/clang/lib/CodeGen/CMakeFiles/obj.clangCodeGen.dir/CGObjCRuntime.cpp.o -MF tools/clang/lib/CodeGen/CMakeFiles/obj.clangCodeGen.dir/CGObjCRuntime.cpp.o.d -o tools/clang/lib/CodeGen/CMakeFiles/obj.clangCodeGen.dir/CGObjCRuntime.cpp.o -c /Users/buildslave/jenkins/workspace/clang-stage2-coverage-R/llvm/tools/clang/lib/CodeGen/CGObjCRuntime.cpp
[3127/4595] /Users/buildslave/jenkins/workspace/clang-stage2-coverage-R/host-compiler/bin/clang++  -DGTEST_HAS_RTTI=0 -D_GNU_SOURCE -D__STDC_CONSTANT_MACROS -D__STDC_FORMAT_MACROS -D__STDC_LIMIT_MACROS -Itools/clang/lib/CodeGen -I/Users/buildslave/jenkins/workspace/clang-stage2-coverage-R/llvm/tools/clang/lib/CodeGen -I/Users/buildslave/jenkins/workspace/clang-stage2-coverage-R/llvm/tools/clang/include -Itools/clang/include -I/Applications/Xcode.app/Contents/Developer/Platforms/MacOSX.platform/Developer/SDKs/MacOSX10.14.sdk/usr/include/libxml2 -Iinclude -I/Users/buildslave/jenkins/workspace/clang-stage2-coverage-R/llvm/include -fPIC -fvisibility-inlines-hidden -Werror=date-time -Werror=unguarded-availability-new -std=c++11 -fmodules -fmodules-cache-path=/Users/buildslave/jenkins/workspace/clang-stage2-coverage-R/clang-build/module.cache -fcxx-modules -Wall -Wextra -Wno-unused-parameter -Wwrite-strings -Wcast-qual -Wmissing-field-initializers -pedantic -Wno-long-long -Wimplicit-fallthrough -Wcovered-switch-default -Wno-noexcept-type -Wnon-virtual-dtor -Wdelete-non-virtual-dtor -Wstring-conversion -fdiagnostics-color -fprofile-instr-generate='/Users/buildslave/jenkins/workspace/clang-stage2-coverage-R/clang-build/profiles/%6m.profraw' -fcoverage-mapping -fno-common -Woverloaded-virtual -Wno-nested-anon-types -O3 -DNDEBUG -isysroot /Applications/Xcode.app/Contents/Developer/Platforms/MacOSX.platform/Developer/SDKs/MacOSX10.14.sdk    -fno-exceptions -fno-rtti -MD -MT tools/clang/lib/CodeGen/CMakeFiles/obj.clangCodeGen.dir/CGOpenCLRuntime.cpp.o -MF tools/clang/lib/CodeGen/CMakeFiles/obj.clangCodeGen.dir/CGOpenCLRuntime.cpp.o.d -o tools/clang/lib/CodeGen/CMakeFiles/obj.clangCodeGen.dir/CGOpenCLRuntime.cpp.o -c /Users/buildslave/jenkins/workspace/clang-stage2-coverage-R/llvm/tools/clang/lib/CodeGen/CGOpenCLRuntime.cpp
[3128/4595] /Users/buildslave/jenkins/workspace/clang-stage2-coverage-R/host-compiler/bin/clang++  -DGTEST_HAS_RTTI=0 -D_GNU_SOURCE -D__STDC_CONSTANT_MACROS -D__STDC_FORMAT_MACROS -D__STDC_LIMIT_MACROS -Itools/clang/lib/CodeGen -I/Users/buildslave/jenkins/workspace/clang-stage2-coverage-R/llvm/tools/clang/lib/CodeGen -I/Users/buildslave/jenkins/workspace/clang-stage2-coverage-R/llvm/tools/clang/include -Itools/clang/include -I/Applications/Xcode.app/Contents/Developer/Platforms/MacOSX.platform/Developer/SDKs/MacOSX10.14.sdk/usr/include/libxml2 -Iinclude -I/Users/buildslave/jenkins/workspace/clang-stage2-coverage-R/llvm/include -fPIC -fvisibility-inlines-hidden -Werror=date-time -Werror=unguarded-availability-new -std=c++11 -fmodules -fmodules-cache-path=/Users/buildslave/jenkins/workspace/clang-stage2-coverage-R/clang-build/module.cache -fcxx-modules -Wall -Wextra -Wno-unused-parameter -Wwrite-strings -Wcast-qual -Wmissing-field-initializers -pedantic -Wno-long-long -Wimplicit-fallthrough -Wcovered-switch-default -Wno-noexcept-type -Wnon-virtual-dtor -Wdelete-non-virtual-dtor -Wstring-conversion -fdiagnostics-color -fprofile-instr-generate='/Users/buildslave/jenkins/workspace/clang-stage2-coverage-R/clang-build/profiles/%6m.profraw' -fcoverage-mapping -fno-common -Woverloaded-virtual -Wno-nested-anon-types -O3 -DNDEBUG -isysroot /Applications/Xcode.app/Contents/Developer/Platforms/MacOSX.platform/Developer/SDKs/MacOSX10.14.sdk    -fno-exceptions -fno-rtti -MD -MT tools/clang/lib/CodeGen/CMakeFiles/obj.clangCodeGen.dir/CGObjC.cpp.o -MF tools/clang/lib/CodeGen/CMakeFiles/obj.clangCodeGen.dir/CGObjC.cpp.o.d -o tools/clang/lib/CodeGen/CMakeFiles/obj.clangCodeGen.dir/CGObjC.cpp.o -c /Users/buildslave/jenkins/workspace/clang-stage2-coverage-R/llvm/tools/clang/lib/CodeGen/CGObjC.cpp
[3129/4595] /Users/buildslave/jenkins/workspace/clang-stage2-coverage-R/host-compiler/bin/clang++  -DGTEST_HAS_RTTI=0 -D_GNU_SOURCE -D__STDC_CONSTANT_MACROS -D__STDC_FORMAT_MACROS -D__STDC_LIMIT_MACROS -Itools/clang/lib/CodeGen -I/Users/buildslave/jenkins/workspace/clang-stage2-coverage-R/llvm/tools/clang/lib/CodeGen -I/Users/buildslave/jenkins/workspace/clang-stage2-coverage-R/llvm/tools/clang/include -Itools/clang/include -I/Applications/Xcode.app/Contents/Developer/Platforms/MacOSX.platform/Developer/SDKs/MacOSX10.14.sdk/usr/include/libxml2 -Iinclude -I/Users/buildslave/jenkins/workspace/clang-stage2-coverage-R/llvm/include -fPIC -fvisibility-inlines-hidden -Werror=date-time -Werror=unguarded-availability-new -std=c++11 -fmodules -fmodules-cache-path=/Users/buildslave/jenkins/workspace/clang-stage2-coverage-R/clang-build/module.cache -fcxx-modules -Wall -Wextra -Wno-unused-parameter -Wwrite-strings -Wcast-qual -Wmissing-field-initializers -pedantic -Wno-long-long -Wimplicit-fallthrough -Wcovered-switch-default -Wno-noexcept-type -Wnon-virtual-dtor -Wdelete-non-virtual-dtor -Wstring-conversion -fdiagnostics-color -fprofile-instr-generate='/Users/buildslave/jenkins/workspace/clang-stage2-coverage-R/clang-build/profiles/%6m.profraw' -fcoverage-mapping -fno-common -Woverloaded-virtual -Wno-nested-anon-types -O3 -DNDEBUG -isysroot /Applications/Xcode.app/Contents/Developer/Platforms/MacOSX.platform/Developer/SDKs/MacOSX10.14.sdk    -fno-exceptions -fno-rtti -MD -MT tools/clang/lib/CodeGen/CMakeFiles/obj.clangCodeGen.dir/CGObjCGNU.cpp.o -MF tools/clang/lib/CodeGen/CMakeFiles/obj.clangCodeGen.dir/CGObjCGNU.cpp.o.d -o tools/clang/lib/CodeGen/CMakeFiles/obj.clangCodeGen.dir/CGObjCGNU.cpp.o -c /Users/buildslave/jenkins/workspace/clang-stage2-coverage-R/llvm/tools/clang/lib/CodeGen/CGObjCGNU.cpp
[3130/4595] /Users/buildslave/jenkins/workspace/clang-stage2-coverage-R/host-compiler/bin/clang++  -DGTEST_HAS_RTTI=0 -D_GNU_SOURCE -D__STDC_CONSTANT_MACROS -D__STDC_FORMAT_MACROS -D__STDC_LIMIT_MACROS -Itools/clang/lib/CodeGen -I/Users/buildslave/jenkins/workspace/clang-stage2-coverage-R/llvm/tools/clang/lib/CodeGen -I/Users/buildslave/jenkins/workspace/clang-stage2-coverage-R/llvm/tools/clang/include -Itools/clang/include -I/Applications/Xcode.app/Contents/Developer/Platforms/MacOSX.platform/Developer/SDKs/MacOSX10.14.sdk/usr/include/libxml2 -Iinclude -I/Users/buildslave/jenkins/workspace/clang-stage2-coverage-R/llvm/include -fPIC -fvisibility-inlines-hidden -Werror=date-time -Werror=unguarded-availability-new -std=c++11 -fmodules -fmodules-cache-path=/Users/buildslave/jenkins/workspace/clang-stage2-coverage-R/clang-build/module.cache -fcxx-modules -Wall -Wextra -Wno-unused-parameter -Wwrite-strings -Wcast-qual -Wmissing-field-initializers -pedantic -Wno-long-long -Wimplicit-fallthrough -Wcovered-switch-default -Wno-noexcept-type -Wnon-virtual-dtor -Wdelete-non-virtual-dtor -Wstring-conversion -fdiagnostics-color -fprofile-instr-generate='/Users/buildslave/jenkins/workspace/clang-stage2-coverage-R/clang-build/profiles/%6m.profraw' -fcoverage-mapping -fno-common -Woverloaded-virtual -Wno-nested-anon-types -O3 -DNDEBUG -isysroot /Applications/Xcode.app/Contents/Developer/Platforms/MacOSX.platform/Developer/SDKs/MacOSX10.14.sdk    -fno-exceptions -fno-rtti -MD -MT tools/clang/lib/CodeGen/CMakeFiles/obj.clangCodeGen.dir/CGRecordLayoutBuilder.cpp.o -MF tools/clang/lib/CodeGen/CMakeFiles/obj.clangCodeGen.dir/CGRecordLayoutBuilder.cpp.o.d -o tools/clang/lib/CodeGen/CMakeFiles/obj.clangCodeGen.dir/CGRecordLayoutBuilder.cpp.o -c /Users/buildslave/jenkins/workspace/clang-stage2-coverage-R/llvm/tools/clang/lib/CodeGen/CGRecordLayoutBuilder.cpp
[3131/4595] /Users/buildslave/jenkins/workspace/clang-stage2-coverage-R/host-compiler/bin/clang++  -DGTEST_HAS_RTTI=0 -D_GNU_SOURCE -D__STDC_CONSTANT_MACROS -D__STDC_FORMAT_MACROS -D__STDC_LIMIT_MACROS -Itools/clang/lib/CodeGen -I/Users/buildslave/jenkins/workspace/clang-stage2-coverage-R/llvm/tools/clang/lib/CodeGen -I/Users/buildslave/jenkins/workspace/clang-stage2-coverage-R/llvm/tools/clang/include -Itools/clang/include -I/Applications/Xcode.app/Contents/Developer/Platforms/MacOSX.platform/Developer/SDKs/MacOSX10.14.sdk/usr/include/libxml2 -Iinclude -I/Users/buildslave/jenkins/workspace/clang-stage2-coverage-R/llvm/include -fPIC -fvisibility-inlines-hidden -Werror=date-time -Werror=unguarded-availability-new -std=c++11 -fmodules -fmodules-cache-path=/Users/buildslave/jenkins/workspace/clang-stage2-coverage-R/clang-build/module.cache -fcxx-modules -Wall -Wextra -Wno-unused-parameter -Wwrite-strings -Wcast-qual -Wmissing-field-initializers -pedantic -Wno-long-long -Wimplicit-fallthrough -Wcovered-switch-default -Wno-noexcept-type -Wnon-virtual-dtor -Wdelete-non-virtual-dtor -Wstring-conversion -fdiagnostics-color -fprofile-instr-generate='/Users/buildslave/jenkins/workspace/clang-stage2-coverage-R/clang-build/profiles/%6m.profraw' -fcoverage-mapping -fno-common -Woverloaded-virtual -Wno-nested-anon-types -O3 -DNDEBUG -isysroot /Applications/Xcode.app/Contents/Developer/Platforms/MacOSX.platform/Developer/SDKs/MacOSX10.14.sdk    -fno-exceptions -fno-rtti -MD -MT tools/clang/lib/CodeGen/CMakeFiles/obj.clangCodeGen.dir/CGObjCMac.cpp.o -MF tools/clang/lib/CodeGen/CMakeFiles/obj.clangCodeGen.dir/CGObjCMac.cpp.o.d -o tools/clang/lib/CodeGen/CMakeFiles/obj.clangCodeGen.dir/CGObjCMac.cpp.o -c /Users/buildslave/jenkins/workspace/clang-stage2-coverage-R/llvm/tools/clang/lib/CodeGen/CGObjCMac.cpp
[3132/4595] /Users/buildslave/jenkins/workspace/clang-stage2-coverage-R/host-compiler/bin/clang++  -DGTEST_HAS_RTTI=0 -D_GNU_SOURCE -D__STDC_CONSTANT_MACROS -D__STDC_FORMAT_MACROS -D__STDC_LIMIT_MACROS -Itools/clang/lib/CodeGen -I/Users/buildslave/jenkins/workspace/clang-stage2-coverage-R/llvm/tools/clang/lib/CodeGen -I/Users/buildslave/jenkins/workspace/clang-stage2-coverage-R/llvm/tools/clang/include -Itools/clang/include -I/Applications/Xcode.app/Contents/Developer/Platforms/MacOSX.platform/Developer/SDKs/MacOSX10.14.sdk/usr/include/libxml2 -Iinclude -I/Users/buildslave/jenkins/workspace/clang-stage2-coverage-R/llvm/include -fPIC -fvisibility-inlines-hidden -Werror=date-time -Werror=unguarded-availability-new -std=c++11 -fmodules -fmodules-cache-path=/Users/buildslave/jenkins/workspace/clang-stage2-coverage-R/clang-build/module.cache -fcxx-modules -Wall -Wextra -Wno-unused-parameter -Wwrite-strings -Wcast-qual -Wmissing-field-initializers -pedantic -Wno-long-long -Wimplicit-fallthrough -Wcovered-switch-default -Wno-noexcept-type -Wnon-virtual-dtor -Wdelete-non-virtual-dtor -Wstring-conversion -fdiagnostics-color -fprofile-instr-generate='/Users/buildslave/jenkins/workspace/clang-stage2-coverage-R/clang-build/profiles/%6m.profraw' -fcoverage-mapping -fno-common -Woverloaded-virtual -Wno-nested-anon-types -O3 -DNDEBUG -isysroot /Applications/Xcode.app/Contents/Developer/Platforms/MacOSX.platform/Developer/SDKs/MacOSX10.14.sdk    -fno-exceptions -fno-rtti -MD -MT tools/clang/lib/CodeGen/CMakeFiles/obj.clangCodeGen.dir/CGStmt.cpp.o -MF tools/clang/lib/CodeGen/CMakeFiles/obj.clangCodeGen.dir/CGStmt.cpp.o.d -o tools/clang/lib/CodeGen/CMakeFiles/obj.clangCodeGen.dir/CGStmt.cpp.o -c /Users/buildslave/jenkins/workspace/clang-stage2-coverage-R/llvm/tools/clang/lib/CodeGen/CGStmt.cpp
[3133/4595] /Users/buildslave/jenkins/workspace/clang-stage2-coverage-R/host-compiler/bin/clang++  -DGTEST_HAS_RTTI=0 -D_GNU_SOURCE -D__STDC_CONSTANT_MACROS -D__STDC_FORMAT_MACROS -D__STDC_LIMIT_MACROS -Itools/clang/lib/CodeGen -I/Users/buildslave/jenkins/workspace/clang-stage2-coverage-R/llvm/tools/clang/lib/CodeGen -I/Users/buildslave/jenkins/workspace/clang-stage2-coverage-R/llvm/tools/clang/include -Itools/clang/include -I/Applications/Xcode.app/Contents/Developer/Platforms/MacOSX.platform/Developer/SDKs/MacOSX10.14.sdk/usr/include/libxml2 -Iinclude -I/Users/buildslave/jenkins/workspace/clang-stage2-coverage-R/llvm/include -fPIC -fvisibility-inlines-hidden -Werror=date-time -Werror=unguarded-availability-new -std=c++11 -fmodules -fmodules-cache-path=/Users/buildslave/jenkins/workspace/clang-stage2-coverage-R/clang-build/module.cache -fcxx-modules -Wall -Wextra -Wno-unused-parameter -Wwrite-strings -Wcast-qual -Wmissing-field-initializers -pedantic -Wno-long-long -Wimplicit-fallthrough -Wcovered-switch-default -Wno-noexcept-type -Wnon-virtual-dtor -Wdelete-non-virtual-dtor -Wstring-conversion -fdiagnostics-color -fprofile-instr-generate='/Users/buildslave/jenkins/workspace/clang-stage2-coverage-R/clang-build/profiles/%6m.profraw' -fcoverage-mapping -fno-common -Woverloaded-virtual -Wno-nested-anon-types -O3 -DNDEBUG -isysroot /Applications/Xcode.app/Contents/Developer/Platforms/MacOSX.platform/Developer/SDKs/MacOSX10.14.sdk    -fno-exceptions -fno-rtti -MD -MT tools/clang/lib/CodeGen/CMakeFiles/obj.clangCodeGen.dir/CGVTT.cpp.o -MF tools/clang/lib/CodeGen/CMakeFiles/obj.clangCodeGen.dir/CGVTT.cpp.o.d -o tools/clang/lib/CodeGen/CMakeFiles/obj.clangCodeGen.dir/CGVTT.cpp.o -c /Users/buildslave/jenkins/workspace/clang-stage2-coverage-R/llvm/tools/clang/lib/CodeGen/CGVTT.cpp
[3134/4595] /Users/buildslave/jenkins/workspace/clang-stage2-coverage-R/host-compiler/bin/clang++  -DGTEST_HAS_RTTI=0 -D_GNU_SOURCE -D__STDC_CONSTANT_MACROS -D__STDC_FORMAT_MACROS -D__STDC_LIMIT_MACROS -Itools/clang/lib/CodeGen -I/Users/buildslave/jenkins/workspace/clang-stage2-coverage-R/llvm/tools/clang/lib/CodeGen -I/Users/buildslave/jenkins/workspace/clang-stage2-coverage-R/llvm/tools/clang/include -Itools/clang/include -I/Applications/Xcode.app/Contents/Developer/Platforms/MacOSX.platform/Developer/SDKs/MacOSX10.14.sdk/usr/include/libxml2 -Iinclude -I/Users/buildslave/jenkins/workspace/clang-stage2-coverage-R/llvm/include -fPIC -fvisibility-inlines-hidden -Werror=date-time -Werror=unguarded-availability-new -std=c++11 -fmodules -fmodules-cache-path=/Users/buildslave/jenkins/workspace/clang-stage2-coverage-R/clang-build/module.cache -fcxx-modules -Wall -Wextra -Wno-unused-parameter -Wwrite-strings -Wcast-qual -Wmissing-field-initializers -pedantic -Wno-long-long -Wimplicit-fallthrough -Wcovered-switch-default -Wno-noexcept-type -Wnon-virtual-dtor -Wdelete-non-virtual-dtor -Wstring-conversion -fdiagnostics-color -fprofile-instr-generate='/Users/buildslave/jenkins/workspace/clang-stage2-coverage-R/clang-build/profiles/%6m.profraw' -fcoverage-mapping -fno-common -Woverloaded-virtual -Wno-nested-anon-types -O3 -DNDEBUG -isysroot /Applications/Xcode.app/Contents/Developer/Platforms/MacOSX.platform/Developer/SDKs/MacOSX10.14.sdk    -fno-exceptions -fno-rtti -MD -MT tools/clang/lib/CodeGen/CMakeFiles/obj.clangCodeGen.dir/CGOpenMPRuntimeNVPTX.cpp.o -MF tools/clang/lib/CodeGen/CMakeFiles/obj.clangCodeGen.dir/CGOpenMPRuntimeNVPTX.cpp.o.d -o tools/clang/lib/CodeGen/CMakeFiles/obj.clangCodeGen.dir/CGOpenMPRuntimeNVPTX.cpp.o -c /Users/buildslave/jenkins/workspace/clang-stage2-coverage-R/llvm/tools/clang/lib/CodeGen/CGOpenMPRuntimeNVPTX.cpp
[3135/4595] /Users/buildslave/jenkins/workspace/clang-stage2-coverage-R/host-compiler/bin/clang++  -DGTEST_HAS_RTTI=0 -D_GNU_SOURCE -D__STDC_CONSTANT_MACROS -D__STDC_FORMAT_MACROS -D__STDC_LIMIT_MACROS -Itools/clang/lib/CodeGen -I/Users/buildslave/jenkins/workspace/clang-stage2-coverage-R/llvm/tools/clang/lib/CodeGen -I/Users/buildslave/jenkins/workspace/clang-stage2-coverage-R/llvm/tools/clang/include -Itools/clang/include -I/Applications/Xcode.app/Contents/Developer/Platforms/MacOSX.platform/Developer/SDKs/MacOSX10.14.sdk/usr/include/libxml2 -Iinclude -I/Users/buildslave/jenkins/workspace/clang-stage2-coverage-R/llvm/include -fPIC -fvisibility-inlines-hidden -Werror=date-time -Werror=unguarded-availability-new -std=c++11 -fmodules -fmodules-cache-path=/Users/buildslave/jenkins/workspace/clang-stage2-coverage-R/clang-build/module.cache -fcxx-modules -Wall -Wextra -Wno-unused-parameter -Wwrite-strings -Wcast-qual -Wmissing-field-initializers -pedantic -Wno-long-long -Wimplicit-fallthrough -Wcovered-switch-default -Wno-noexcept-type -Wnon-virtual-dtor -Wdelete-non-virtual-dtor -Wstring-conversion -fdiagnostics-color -fprofile-instr-generate='/Users/buildslave/jenkins/workspace/clang-stage2-coverage-R/clang-build/profiles/%6m.profraw' -fcoverage-mapping -fno-common -Woverloaded-virtual -Wno-nested-anon-types -O3 -DNDEBUG -isysroot /Applications/Xcode.app/Contents/Developer/Platforms/MacOSX.platform/Developer/SDKs/MacOSX10.14.sdk    -fno-exceptions -fno-rtti -MD -MT tools/clang/lib/CodeGen/CMakeFiles/obj.clangCodeGen.dir/CodeGenABITypes.cpp.o -MF tools/clang/lib/CodeGen/CMakeFiles/obj.clangCodeGen.dir/CodeGenABITypes.cpp.o.d -o tools/clang/lib/CodeGen/CMakeFiles/obj.clangCodeGen.dir/CodeGenABITypes.cpp.o -c /Users/buildslave/jenkins/workspace/clang-stage2-coverage-R/llvm/tools/clang/lib/CodeGen/CodeGenABITypes.cpp
[3136/4595] /Users/buildslave/jenkins/workspace/clang-stage2-coverage-R/host-compiler/bin/clang++  -DGTEST_HAS_RTTI=0 -D_GNU_SOURCE -D__STDC_CONSTANT_MACROS -D__STDC_FORMAT_MACROS -D__STDC_LIMIT_MACROS -Itools/clang/lib/CodeGen -I/Users/buildslave/jenkins/workspace/clang-stage2-coverage-R/llvm/tools/clang/lib/CodeGen -I/Users/buildslave/jenkins/workspace/clang-stage2-coverage-R/llvm/tools/clang/include -Itools/clang/include -I/Applications/Xcode.app/Contents/Developer/Platforms/MacOSX.platform/Developer/SDKs/MacOSX10.14.sdk/usr/include/libxml2 -Iinclude -I/Users/buildslave/jenkins/workspace/clang-stage2-coverage-R/llvm/include -fPIC -fvisibility-inlines-hidden -Werror=date-time -Werror=unguarded-availability-new -std=c++11 -fmodules -fmodules-cache-path=/Users/buildslave/jenkins/workspace/clang-stage2-coverage-R/clang-build/module.cache -fcxx-modules -Wall -Wextra -Wno-unused-parameter -Wwrite-strings -Wcast-qual -Wmissing-field-initializers -pedantic -Wno-long-long -Wimplicit-fallthrough -Wcovered-switch-default -Wno-noexcept-type -Wnon-virtual-dtor -Wdelete-non-virtual-dtor -Wstring-conversion -fdiagnostics-color -fprofile-instr-generate='/Users/buildslave/jenkins/workspace/clang-stage2-coverage-R/clang-build/profiles/%6m.profraw' -fcoverage-mapping -fno-common -Woverloaded-virtual -Wno-nested-anon-types -O3 -DNDEBUG -isysroot /Applications/Xcode.app/Contents/Developer/Platforms/MacOSX.platform/Developer/SDKs/MacOSX10.14.sdk    -fno-exceptions -fno-rtti -MD -MT tools/clang/lib/CodeGen/CMakeFiles/obj.clangCodeGen.dir/CGVTables.cpp.o -MF tools/clang/lib/CodeGen/CMakeFiles/obj.clangCodeGen.dir/CGVTables.cpp.o.d -o tools/clang/lib/CodeGen/CMakeFiles/obj.clangCodeGen.dir/CGVTables.cpp.o -c /Users/buildslave/jenkins/workspace/clang-stage2-coverage-R/llvm/tools/clang/lib/CodeGen/CGVTables.cpp
[3137/4595] /Users/buildslave/jenkins/workspace/clang-stage2-coverage-R/host-compiler/bin/clang++  -DGTEST_HAS_RTTI=0 -D_GNU_SOURCE -D__STDC_CONSTANT_MACROS -D__STDC_FORMAT_MACROS -D__STDC_LIMIT_MACROS -Itools/clang/lib/CodeGen -I/Users/buildslave/jenkins/workspace/clang-stage2-coverage-R/llvm/tools/clang/lib/CodeGen -I/Users/buildslave/jenkins/workspace/clang-stage2-coverage-R/llvm/tools/clang/include -Itools/clang/include -I/Applications/Xcode.app/Contents/Developer/Platforms/MacOSX.platform/Developer/SDKs/MacOSX10.14.sdk/usr/include/libxml2 -Iinclude -I/Users/buildslave/jenkins/workspace/clang-stage2-coverage-R/llvm/include -fPIC -fvisibility-inlines-hidden -Werror=date-time -Werror=unguarded-availability-new -std=c++11 -fmodules -fmodules-cache-path=/Users/buildslave/jenkins/workspace/clang-stage2-coverage-R/clang-build/module.cache -fcxx-modules -Wall -Wextra -Wno-unused-parameter -Wwrite-strings -Wcast-qual -Wmissing-field-initializers -pedantic -Wno-long-long -Wimplicit-fallthrough -Wcovered-switch-default -Wno-noexcept-type -Wnon-virtual-dtor -Wdelete-non-virtual-dtor -Wstring-conversion -fdiagnostics-color -fprofile-instr-generate='/Users/buildslave/jenkins/workspace/clang-stage2-coverage-R/clang-build/profiles/%6m.profraw' -fcoverage-mapping -fno-common -Woverloaded-virtual -Wno-nested-anon-types -O3 -DNDEBUG -isysroot /Applications/Xcode.app/Contents/Developer/Platforms/MacOSX.platform/Developer/SDKs/MacOSX10.14.sdk    -fno-exceptions -fno-rtti -MD -MT tools/clang/lib/CodeGen/CMakeFiles/obj.clangCodeGen.dir/CodeGenAction.cpp.o -MF tools/clang/lib/CodeGen/CMakeFiles/obj.clangCodeGen.dir/CodeGenAction.cpp.o.d -o tools/clang/lib/CodeGen/CMakeFiles/obj.clangCodeGen.dir/CodeGenAction.cpp.o -c /Users/buildslave/jenkins/workspace/clang-stage2-coverage-R/llvm/tools/clang/lib/CodeGen/CodeGenAction.cpp
[3138/4595] /Users/buildslave/jenkins/workspace/clang-stage2-coverage-R/host-compiler/bin/clang++  -DGTEST_HAS_RTTI=0 -D_GNU_SOURCE -D__STDC_CONSTANT_MACROS -D__STDC_FORMAT_MACROS -D__STDC_LIMIT_MACROS -Itools/clang/lib/CodeGen -I/Users/buildslave/jenkins/workspace/clang-stage2-coverage-R/llvm/tools/clang/lib/CodeGen -I/Users/buildslave/jenkins/workspace/clang-stage2-coverage-R/llvm/tools/clang/include -Itools/clang/include -I/Applications/Xcode.app/Contents/Developer/Platforms/MacOSX.platform/Developer/SDKs/MacOSX10.14.sdk/usr/include/libxml2 -Iinclude -I/Users/buildslave/jenkins/workspace/clang-stage2-coverage-R/llvm/include -fPIC -fvisibility-inlines-hidden -Werror=date-time -Werror=unguarded-availability-new -std=c++11 -fmodules -fmodules-cache-path=/Users/buildslave/jenkins/workspace/clang-stage2-coverage-R/clang-build/module.cache -fcxx-modules -Wall -Wextra -Wno-unused-parameter -Wwrite-strings -Wcast-qual -Wmissing-field-initializers -pedantic -Wno-long-long -Wimplicit-fallthrough -Wcovered-switch-default -Wno-noexcept-type -Wnon-virtual-dtor -Wdelete-non-virtual-dtor -Wstring-conversion -fdiagnostics-color -fprofile-instr-generate='/Users/buildslave/jenkins/workspace/clang-stage2-coverage-R/clang-build/profiles/%6m.profraw' -fcoverage-mapping -fno-common -Woverloaded-virtual -Wno-nested-anon-types -O3 -DNDEBUG -isysroot /Applications/Xcode.app/Contents/Developer/Platforms/MacOSX.platform/Developer/SDKs/MacOSX10.14.sdk    -fno-exceptions -fno-rtti -MD -MT tools/clang/lib/CodeGen/CMakeFiles/obj.clangCodeGen.dir/CGStmtOpenMP.cpp.o -MF tools/clang/lib/CodeGen/CMakeFiles/obj.clangCodeGen.dir/CGStmtOpenMP.cpp.o.d -o tools/clang/lib/CodeGen/CMakeFiles/obj.clangCodeGen.dir/CGStmtOpenMP.cpp.o -c /Users/buildslave/jenkins/workspace/clang-stage2-coverage-R/llvm/tools/clang/lib/CodeGen/CGStmtOpenMP.cpp
[3139/4595] /Users/buildslave/jenkins/workspace/clang-stage2-coverage-R/host-compiler/bin/clang++  -DGTEST_HAS_RTTI=0 -D_GNU_SOURCE -D__STDC_CONSTANT_MACROS -D__STDC_FORMAT_MACROS -D__STDC_LIMIT_MACROS -Itools/clang/lib/CodeGen -I/Users/buildslave/jenkins/workspace/clang-stage2-coverage-R/llvm/tools/clang/lib/CodeGen -I/Users/buildslave/jenkins/workspace/clang-stage2-coverage-R/llvm/tools/clang/include -Itools/clang/include -I/Applications/Xcode.app/Contents/Developer/Platforms/MacOSX.platform/Developer/SDKs/MacOSX10.14.sdk/usr/include/libxml2 -Iinclude -I/Users/buildslave/jenkins/workspace/clang-stage2-coverage-R/llvm/include -fPIC -fvisibility-inlines-hidden -Werror=date-time -Werror=unguarded-availability-new -std=c++11 -fmodules -fmodules-cache-path=/Users/buildslave/jenkins/workspace/clang-stage2-coverage-R/clang-build/module.cache -fcxx-modules -Wall -Wextra -Wno-unused-parameter -Wwrite-strings -Wcast-qual -Wmissing-field-initializers -pedantic -Wno-long-long -Wimplicit-fallthrough -Wcovered-switch-default -Wno-noexcept-type -Wnon-virtual-dtor -Wdelete-non-virtual-dtor -Wstring-conversion -fdiagnostics-color -fprofile-instr-generate='/Users/buildslave/jenkins/workspace/clang-stage2-coverage-R/clang-build/profiles/%6m.profraw' -fcoverage-mapping -fno-common -Woverloaded-virtual -Wno-nested-anon-types -O3 -DNDEBUG -isysroot /Applications/Xcode.app/Contents/Developer/Platforms/MacOSX.platform/Developer/SDKs/MacOSX10.14.sdk    -fno-exceptions -fno-rtti -MD -MT tools/clang/lib/CodeGen/CMakeFiles/obj.clangCodeGen.dir/CGOpenMPRuntime.cpp.o -MF tools/clang/lib/CodeGen/CMakeFiles/obj.clangCodeGen.dir/CGOpenMPRuntime.cpp.o.d -o tools/clang/lib/CodeGen/CMakeFiles/obj.clangCodeGen.dir/CGOpenMPRuntime.cpp.o -c /Users/buildslave/jenkins/workspace/clang-stage2-coverage-R/llvm/tools/clang/lib/CodeGen/CGOpenMPRuntime.cpp
[3140/4595] /Users/buildslave/jenkins/workspace/clang-stage2-coverage-R/host-compiler/bin/clang++  -DGTEST_HAS_RTTI=0 -D_GNU_SOURCE -D__STDC_CONSTANT_MACROS -D__STDC_FORMAT_MACROS -D__STDC_LIMIT_MACROS -Itools/clang/lib/CodeGen -I/Users/buildslave/jenkins/workspace/clang-stage2-coverage-R/llvm/tools/clang/lib/CodeGen -I/Users/buildslave/jenkins/workspace/clang-stage2-coverage-R/llvm/tools/clang/include -Itools/clang/include -I/Applications/Xcode.app/Contents/Developer/Platforms/MacOSX.platform/Developer/SDKs/MacOSX10.14.sdk/usr/include/libxml2 -Iinclude -I/Users/buildslave/jenkins/workspace/clang-stage2-coverage-R/llvm/include -fPIC -fvisibility-inlines-hidden -Werror=date-time -Werror=unguarded-availability-new -std=c++11 -fmodules -fmodules-cache-path=/Users/buildslave/jenkins/workspace/clang-stage2-coverage-R/clang-build/module.cache -fcxx-modules -Wall -Wextra -Wno-unused-parameter -Wwrite-strings -Wcast-qual -Wmissing-field-initializers -pedantic -Wno-long-long -Wimplicit-fallthrough -Wcovered-switch-default -Wno-noexcept-type -Wnon-virtual-dtor -Wdelete-non-virtual-dtor -Wstring-conversion -fdiagnostics-color -fprofile-instr-generate='/Users/buildslave/jenkins/workspace/clang-stage2-coverage-R/clang-build/profiles/%6m.profraw' -fcoverage-mapping -fno-common -Woverloaded-virtual -Wno-nested-anon-types -O3 -DNDEBUG -isysroot /Applications/Xcode.app/Contents/Developer/Platforms/MacOSX.platform/Developer/SDKs/MacOSX10.14.sdk    -fno-exceptions -fno-rtti -MD -MT tools/clang/lib/CodeGen/CMakeFiles/obj.clangCodeGen.dir/CodeGenTBAA.cpp.o -MF tools/clang/lib/CodeGen/CMakeFiles/obj.clangCodeGen.dir/CodeGenTBAA.cpp.o.d -o tools/clang/lib/CodeGen/CMakeFiles/obj.clangCodeGen.dir/CodeGenTBAA.cpp.o -c /Users/buildslave/jenkins/workspace/clang-stage2-coverage-R/llvm/tools/clang/lib/CodeGen/CodeGenTBAA.cpp
[3141/4595] /Users/buildslave/jenkins/workspace/clang-stage2-coverage-R/host-compiler/bin/clang++  -DGTEST_HAS_RTTI=0 -D_GNU_SOURCE -D__STDC_CONSTANT_MACROS -D__STDC_FORMAT_MACROS -D__STDC_LIMIT_MACROS -Itools/clang/lib/CodeGen -I/Users/buildslave/jenkins/workspace/clang-stage2-coverage-R/llvm/tools/clang/lib/CodeGen -I/Users/buildslave/jenkins/workspace/clang-stage2-coverage-R/llvm/tools/clang/include -Itools/clang/include -I/Applications/Xcode.app/Contents/Developer/Platforms/MacOSX.platform/Developer/SDKs/MacOSX10.14.sdk/usr/include/libxml2 -Iinclude -I/Users/buildslave/jenkins/workspace/clang-stage2-coverage-R/llvm/include -fPIC -fvisibility-inlines-hidden -Werror=date-time -Werror=unguarded-availability-new -std=c++11 -fmodules -fmodules-cache-path=/Users/buildslave/jenkins/workspace/clang-stage2-coverage-R/clang-build/module.cache -fcxx-modules -Wall -Wextra -Wno-unused-parameter -Wwrite-strings -Wcast-qual -Wmissing-field-initializers -pedantic -Wno-long-long -Wimplicit-fallthrough -Wcovered-switch-default -Wno-noexcept-type -Wnon-virtual-dtor -Wdelete-non-virtual-dtor -Wstring-conversion -fdiagnostics-color -fprofile-instr-generate='/Users/buildslave/jenkins/workspace/clang-stage2-coverage-R/clang-build/profiles/%6m.profraw' -fcoverage-mapping -fno-common -Woverloaded-virtual -Wno-nested-anon-types -O3 -DNDEBUG -isysroot /Applications/Xcode.app/Contents/Developer/Platforms/MacOSX.platform/Developer/SDKs/MacOSX10.14.sdk    -fno-exceptions -fno-rtti -MD -MT tools/clang/lib/CodeGen/CMakeFiles/obj.clangCodeGen.dir/CodeGenFunction.cpp.o -MF tools/clang/lib/CodeGen/CMakeFiles/obj.clangCodeGen.dir/CodeGenFunction.cpp.o.d -o tools/clang/lib/CodeGen/CMakeFiles/obj.clangCodeGen.dir/CodeGenFunction.cpp.o -c /Users/buildslave/jenkins/workspace/clang-stage2-coverage-R/llvm/tools/clang/lib/CodeGen/CodeGenFunction.cpp
[3142/4595] /Users/buildslave/jenkins/workspace/clang-stage2-coverage-R/host-compiler/bin/clang++  -DGTEST_HAS_RTTI=0 -D_GNU_SOURCE -D__STDC_CONSTANT_MACROS -D__STDC_FORMAT_MACROS -D__STDC_LIMIT_MACROS -Itools/clang/lib/CodeGen -I/Users/buildslave/jenkins/workspace/clang-stage2-coverage-R/llvm/tools/clang/lib/CodeGen -I/Users/buildslave/jenkins/workspace/clang-stage2-coverage-R/llvm/tools/clang/include -Itools/clang/include -I/Applications/Xcode.app/Contents/Developer/Platforms/MacOSX.platform/Developer/SDKs/MacOSX10.14.sdk/usr/include/libxml2 -Iinclude -I/Users/buildslave/jenkins/workspace/clang-stage2-coverage-R/llvm/include -fPIC -fvisibility-inlines-hidden -Werror=date-time -Werror=unguarded-availability-new -std=c++11 -fmodules -fmodules-cache-path=/Users/buildslave/jenkins/workspace/clang-stage2-coverage-R/clang-build/module.cache -fcxx-modules -Wall -Wextra -Wno-unused-parameter -Wwrite-strings -Wcast-qual -Wmissing-field-initializers -pedantic -Wno-long-long -Wimplicit-fallthrough -Wcovered-switch-default -Wno-noexcept-type -Wnon-virtual-dtor -Wdelete-non-virtual-dtor -Wstring-conversion -fdiagnostics-color -fprofile-instr-generate='/Users/buildslave/jenkins/workspace/clang-stage2-coverage-R/clang-build/profiles/%6m.profraw' -fcoverage-mapping -fno-common -Woverloaded-virtual -Wno-nested-anon-types -O3 -DNDEBUG -isysroot /Applications/Xcode.app/Contents/Developer/Platforms/MacOSX.platform/Developer/SDKs/MacOSX10.14.sdk    -fno-exceptions -fno-rtti -MD -MT tools/clang/lib/CodeGen/CMakeFiles/obj.clangCodeGen.dir/ConstantInitBuilder.cpp.o -MF tools/clang/lib/CodeGen/CMakeFiles/obj.clangCodeGen.dir/ConstantInitBuilder.cpp.o.d -o tools/clang/lib/CodeGen/CMakeFiles/obj.clangCodeGen.dir/ConstantInitBuilder.cpp.o -c /Users/buildslave/jenkins/workspace/clang-stage2-coverage-R/llvm/tools/clang/lib/CodeGen/ConstantInitBuilder.cpp
[3143/4595] /Users/buildslave/jenkins/workspace/clang-stage2-coverage-R/host-compiler/bin/clang++  -DGTEST_HAS_RTTI=0 -D_GNU_SOURCE -D__STDC_CONSTANT_MACROS -D__STDC_FORMAT_MACROS -D__STDC_LIMIT_MACROS -Itools/clang/lib/CodeGen -I/Users/buildslave/jenkins/workspace/clang-stage2-coverage-R/llvm/tools/clang/lib/CodeGen -I/Users/buildslave/jenkins/workspace/clang-stage2-coverage-R/llvm/tools/clang/include -Itools/clang/include -I/Applications/Xcode.app/Contents/Developer/Platforms/MacOSX.platform/Developer/SDKs/MacOSX10.14.sdk/usr/include/libxml2 -Iinclude -I/Users/buildslave/jenkins/workspace/clang-stage2-coverage-R/llvm/include -fPIC -fvisibility-inlines-hidden -Werror=date-time -Werror=unguarded-availability-new -std=c++11 -fmodules -fmodules-cache-path=/Users/buildslave/jenkins/workspace/clang-stage2-coverage-R/clang-build/module.cache -fcxx-modules -Wall -Wextra -Wno-unused-parameter -Wwrite-strings -Wcast-qual -Wmissing-field-initializers -pedantic -Wno-long-long -Wimplicit-fallthrough -Wcovered-switch-default -Wno-noexcept-type -Wnon-virtual-dtor -Wdelete-non-virtual-dtor -Wstring-conversion -fdiagnostics-color -fprofile-instr-generate='/Users/buildslave/jenkins/workspace/clang-stage2-coverage-R/clang-build/profiles/%6m.profraw' -fcoverage-mapping -fno-common -Woverloaded-virtual -Wno-nested-anon-types -O3 -DNDEBUG -isysroot /Applications/Xcode.app/Contents/Developer/Platforms/MacOSX.platform/Developer/SDKs/MacOSX10.14.sdk    -fno-exceptions -fno-rtti -MD -MT tools/clang/lib/CodeGen/CMakeFiles/obj.clangCodeGen.dir/MacroPPCallbacks.cpp.o -MF tools/clang/lib/CodeGen/CMakeFiles/obj.clangCodeGen.dir/MacroPPCallbacks.cpp.o.d -o tools/clang/lib/CodeGen/CMakeFiles/obj.clangCodeGen.dir/MacroPPCallbacks.cpp.o -c /Users/buildslave/jenkins/workspace/clang-stage2-coverage-R/llvm/tools/clang/lib/CodeGen/MacroPPCallbacks.cpp
[3144/4595] /Users/buildslave/jenkins/workspace/clang-stage2-coverage-R/host-compiler/bin/clang++  -DGTEST_HAS_RTTI=0 -D_GNU_SOURCE -D__STDC_CONSTANT_MACROS -D__STDC_FORMAT_MACROS -D__STDC_LIMIT_MACROS -Itools/clang/lib/CodeGen -I/Users/buildslave/jenkins/workspace/clang-stage2-coverage-R/llvm/tools/clang/lib/CodeGen -I/Users/buildslave/jenkins/workspace/clang-stage2-coverage-R/llvm/tools/clang/include -Itools/clang/include -I/Applications/Xcode.app/Contents/Developer/Platforms/MacOSX.platform/Developer/SDKs/MacOSX10.14.sdk/usr/include/libxml2 -Iinclude -I/Users/buildslave/jenkins/workspace/clang-stage2-coverage-R/llvm/include -fPIC -fvisibility-inlines-hidden -Werror=date-time -Werror=unguarded-availability-new -std=c++11 -fmodules -fmodules-cache-path=/Users/buildslave/jenkins/workspace/clang-stage2-coverage-R/clang-build/module.cache -fcxx-modules -Wall -Wextra -Wno-unused-parameter -Wwrite-strings -Wcast-qual -Wmissing-field-initializers -pedantic -Wno-long-long -Wimplicit-fallthrough -Wcovered-switch-default -Wno-noexcept-type -Wnon-virtual-dtor -Wdelete-non-virtual-dtor -Wstring-conversion -fdiagnostics-color -fprofile-instr-generate='/Users/buildslave/jenkins/workspace/clang-stage2-coverage-R/clang-build/profiles/%6m.profraw' -fcoverage-mapping -fno-common -Woverloaded-virtual -Wno-nested-anon-types -O3 -DNDEBUG -isysroot /Applications/Xcode.app/Contents/Developer/Platforms/MacOSX.platform/Developer/SDKs/MacOSX10.14.sdk    -fno-exceptions -fno-rtti -MD -MT tools/clang/lib/CodeGen/CMakeFiles/obj.clangCodeGen.dir/CodeGenTypes.cpp.o -MF tools/clang/lib/CodeGen/CMakeFiles/obj.clangCodeGen.dir/CodeGenTypes.cpp.o.d -o tools/clang/lib/CodeGen/CMakeFiles/obj.clangCodeGen.dir/CodeGenTypes.cpp.o -c /Users/buildslave/jenkins/workspace/clang-stage2-coverage-R/llvm/tools/clang/lib/CodeGen/CodeGenTypes.cpp
[3145/4595] /Users/buildslave/jenkins/workspace/clang-stage2-coverage-R/host-compiler/bin/clang++  -DGTEST_HAS_RTTI=0 -D_GNU_SOURCE -D__STDC_CONSTANT_MACROS -D__STDC_FORMAT_MACROS -D__STDC_LIMIT_MACROS -Itools/clang/lib/CodeGen -I/Users/buildslave/jenkins/workspace/clang-stage2-coverage-R/llvm/tools/clang/lib/CodeGen -I/Users/buildslave/jenkins/workspace/clang-stage2-coverage-R/llvm/tools/clang/include -Itools/clang/include -I/Applications/Xcode.app/Contents/Developer/Platforms/MacOSX.platform/Developer/SDKs/MacOSX10.14.sdk/usr/include/libxml2 -Iinclude -I/Users/buildslave/jenkins/workspace/clang-stage2-coverage-R/llvm/include -fPIC -fvisibility-inlines-hidden -Werror=date-time -Werror=unguarded-availability-new -std=c++11 -fmodules -fmodules-cache-path=/Users/buildslave/jenkins/workspace/clang-stage2-coverage-R/clang-build/module.cache -fcxx-modules -Wall -Wextra -Wno-unused-parameter -Wwrite-strings -Wcast-qual -Wmissing-field-initializers -pedantic -Wno-long-long -Wimplicit-fallthrough -Wcovered-switch-default -Wno-noexcept-type -Wnon-virtual-dtor -Wdelete-non-virtual-dtor -Wstring-conversion -fdiagnostics-color -fprofile-instr-generate='/Users/buildslave/jenkins/workspace/clang-stage2-coverage-R/clang-build/profiles/%6m.profraw' -fcoverage-mapping -fno-common -Woverloaded-virtual -Wno-nested-anon-types -O3 -DNDEBUG -isysroot /Applications/Xcode.app/Contents/Developer/Platforms/MacOSX.platform/Developer/SDKs/MacOSX10.14.sdk    -fno-exceptions -fno-rtti -MD -MT tools/clang/lib/CodeGen/CMakeFiles/obj.clangCodeGen.dir/CoverageMappingGen.cpp.o -MF tools/clang/lib/CodeGen/CMakeFiles/obj.clangCodeGen.dir/CoverageMappingGen.cpp.o.d -o tools/clang/lib/CodeGen/CMakeFiles/obj.clangCodeGen.dir/CoverageMappingGen.cpp.o -c /Users/buildslave/jenkins/workspace/clang-stage2-coverage-R/llvm/tools/clang/lib/CodeGen/CoverageMappingGen.cpp
[3146/4595] /Users/buildslave/jenkins/workspace/clang-stage2-coverage-R/host-compiler/bin/clang++  -DGTEST_HAS_RTTI=0 -D_GNU_SOURCE -D__STDC_CONSTANT_MACROS -D__STDC_FORMAT_MACROS -D__STDC_LIMIT_MACROS -Itools/clang/lib/CodeGen -I/Users/buildslave/jenkins/workspace/clang-stage2-coverage-R/llvm/tools/clang/lib/CodeGen -I/Users/buildslave/jenkins/workspace/clang-stage2-coverage-R/llvm/tools/clang/include -Itools/clang/include -I/Applications/Xcode.app/Contents/Developer/Platforms/MacOSX.platform/Developer/SDKs/MacOSX10.14.sdk/usr/include/libxml2 -Iinclude -I/Users/buildslave/jenkins/workspace/clang-stage2-coverage-R/llvm/include -fPIC -fvisibility-inlines-hidden -Werror=date-time -Werror=unguarded-availability-new -std=c++11 -fmodules -fmodules-cache-path=/Users/buildslave/jenkins/workspace/clang-stage2-coverage-R/clang-build/module.cache -fcxx-modules -Wall -Wextra -Wno-unused-parameter -Wwrite-strings -Wcast-qual -Wmissing-field-initializers -pedantic -Wno-long-long -Wimplicit-fallthrough -Wcovered-switch-default -Wno-noexcept-type -Wnon-virtual-dtor -Wdelete-non-virtual-dtor -Wstring-conversion -fdiagnostics-color -fprofile-instr-generate='/Users/buildslave/jenkins/workspace/clang-stage2-coverage-R/clang-build/profiles/%6m.profraw' -fcoverage-mapping -fno-common -Woverloaded-virtual -Wno-nested-anon-types -O3 -DNDEBUG -isysroot /Applications/Xcode.app/Contents/Developer/Platforms/MacOSX.platform/Developer/SDKs/MacOSX10.14.sdk    -fno-exceptions -fno-rtti -MD -MT tools/clang/lib/CodeGen/CMakeFiles/obj.clangCodeGen.dir/ModuleBuilder.cpp.o -MF tools/clang/lib/CodeGen/CMakeFiles/obj.clangCodeGen.dir/ModuleBuilder.cpp.o.d -o tools/clang/lib/CodeGen/CMakeFiles/obj.clangCodeGen.dir/ModuleBuilder.cpp.o -c /Users/buildslave/jenkins/workspace/clang-stage2-coverage-R/llvm/tools/clang/lib/CodeGen/ModuleBuilder.cpp
[3147/4595] /Users/buildslave/jenkins/workspace/clang-stage2-coverage-R/host-compiler/bin/clang++  -DGTEST_HAS_RTTI=0 -D_GNU_SOURCE -D__STDC_CONSTANT_MACROS -D__STDC_FORMAT_MACROS -D__STDC_LIMIT_MACROS -Itools/clang/lib/CodeGen -I/Users/buildslave/jenkins/workspace/clang-stage2-coverage-R/llvm/tools/clang/lib/CodeGen -I/Users/buildslave/jenkins/workspace/clang-stage2-coverage-R/llvm/tools/clang/include -Itools/clang/include -I/Applications/Xcode.app/Contents/Developer/Platforms/MacOSX.platform/Developer/SDKs/MacOSX10.14.sdk/usr/include/libxml2 -Iinclude -I/Users/buildslave/jenkins/workspace/clang-stage2-coverage-R/llvm/include -fPIC -fvisibility-inlines-hidden -Werror=date-time -Werror=unguarded-availability-new -std=c++11 -fmodules -fmodules-cache-path=/Users/buildslave/jenkins/workspace/clang-stage2-coverage-R/clang-build/module.cache -fcxx-modules -Wall -Wextra -Wno-unused-parameter -Wwrite-strings -Wcast-qual -Wmissing-field-initializers -pedantic -Wno-long-long -Wimplicit-fallthrough -Wcovered-switch-default -Wno-noexcept-type -Wnon-virtual-dtor -Wdelete-non-virtual-dtor -Wstring-conversion -fdiagnostics-color -fprofile-instr-generate='/Users/buildslave/jenkins/workspace/clang-stage2-coverage-R/clang-build/profiles/%6m.profraw' -fcoverage-mapping -fno-common -Woverloaded-virtual -Wno-nested-anon-types -O3 -DNDEBUG -isysroot /Applications/Xcode.app/Contents/Developer/Platforms/MacOSX.platform/Developer/SDKs/MacOSX10.14.sdk    -fno-exceptions -fno-rtti -MD -MT tools/clang/lib/CodeGen/CMakeFiles/obj.clangCodeGen.dir/ItaniumCXXABI.cpp.o -MF tools/clang/lib/CodeGen/CMakeFiles/obj.clangCodeGen.dir/ItaniumCXXABI.cpp.o.d -o tools/clang/lib/CodeGen/CMakeFiles/obj.clangCodeGen.dir/ItaniumCXXABI.cpp.o -c /Users/buildslave/jenkins/workspace/clang-stage2-coverage-R/llvm/tools/clang/lib/CodeGen/ItaniumCXXABI.cpp
[3148/4595] /Users/buildslave/jenkins/workspace/clang-stage2-coverage-R/host-compiler/bin/clang++  -DGTEST_HAS_RTTI=0 -D_GNU_SOURCE -D__STDC_CONSTANT_MACROS -D__STDC_FORMAT_MACROS -D__STDC_LIMIT_MACROS -Itools/clang/lib/CodeGen -I/Users/buildslave/jenkins/workspace/clang-stage2-coverage-R/llvm/tools/clang/lib/CodeGen -I/Users/buildslave/jenkins/workspace/clang-stage2-coverage-R/llvm/tools/clang/include -Itools/clang/include -I/Applications/Xcode.app/Contents/Developer/Platforms/MacOSX.platform/Developer/SDKs/MacOSX10.14.sdk/usr/include/libxml2 -Iinclude -I/Users/buildslave/jenkins/workspace/clang-stage2-coverage-R/llvm/include -fPIC -fvisibility-inlines-hidden -Werror=date-time -Werror=unguarded-availability-new -std=c++11 -fmodules -fmodules-cache-path=/Users/buildslave/jenkins/workspace/clang-stage2-coverage-R/clang-build/module.cache -fcxx-modules -Wall -Wextra -Wno-unused-parameter -Wwrite-strings -Wcast-qual -Wmissing-field-initializers -pedantic -Wno-long-long -Wimplicit-fallthrough -Wcovered-switch-default -Wno-noexcept-type -Wnon-virtual-dtor -Wdelete-non-virtual-dtor -Wstring-conversion -fdiagnostics-color -fprofile-instr-generate='/Users/buildslave/jenkins/workspace/clang-stage2-coverage-R/clang-build/profiles/%6m.profraw' -fcoverage-mapping -fno-common -Woverloaded-virtual -Wno-nested-anon-types -O3 -DNDEBUG -isysroot /Applications/Xcode.app/Contents/Developer/Platforms/MacOSX.platform/Developer/SDKs/MacOSX10.14.sdk    -fno-exceptions -fno-rtti -MD -MT tools/clang/lib/CodeGen/CMakeFiles/obj.clangCodeGen.dir/PatternInit.cpp.o -MF tools/clang/lib/CodeGen/CMakeFiles/obj.clangCodeGen.dir/PatternInit.cpp.o.d -o tools/clang/lib/CodeGen/CMakeFiles/obj.clangCodeGen.dir/PatternInit.cpp.o -c /Users/buildslave/jenkins/workspace/clang-stage2-coverage-R/llvm/tools/clang/lib/CodeGen/PatternInit.cpp
[3149/4595] /Users/buildslave/jenkins/workspace/clang-stage2-coverage-R/host-compiler/bin/clang++  -DGTEST_HAS_RTTI=0 -D_GNU_SOURCE -D__STDC_CONSTANT_MACROS -D__STDC_FORMAT_MACROS -D__STDC_LIMIT_MACROS -Itools/clang/lib/CodeGen -I/Users/buildslave/jenkins/workspace/clang-stage2-coverage-R/llvm/tools/clang/lib/CodeGen -I/Users/buildslave/jenkins/workspace/clang-stage2-coverage-R/llvm/tools/clang/include -Itools/clang/include -I/Applications/Xcode.app/Contents/Developer/Platforms/MacOSX.platform/Developer/SDKs/MacOSX10.14.sdk/usr/include/libxml2 -Iinclude -I/Users/buildslave/jenkins/workspace/clang-stage2-coverage-R/llvm/include -fPIC -fvisibility-inlines-hidden -Werror=date-time -Werror=unguarded-availability-new -std=c++11 -fmodules -fmodules-cache-path=/Users/buildslave/jenkins/workspace/clang-stage2-coverage-R/clang-build/module.cache -fcxx-modules -Wall -Wextra -Wno-unused-parameter -Wwrite-strings -Wcast-qual -Wmissing-field-initializers -pedantic -Wno-long-long -Wimplicit-fallthrough -Wcovered-switch-default -Wno-noexcept-type -Wnon-virtual-dtor -Wdelete-non-virtual-dtor -Wstring-conversion -fdiagnostics-color -fprofile-instr-generate='/Users/buildslave/jenkins/workspace/clang-stage2-coverage-R/clang-build/profiles/%6m.profraw' -fcoverage-mapping -fno-common -Woverloaded-virtual -Wno-nested-anon-types -O3 -DNDEBUG -isysroot /Applications/Xcode.app/Contents/Developer/Platforms/MacOSX.platform/Developer/SDKs/MacOSX10.14.sdk    -fno-exceptions -fno-rtti -MD -MT tools/clang/lib/CodeGen/CMakeFiles/obj.clangCodeGen.dir/SanitizerMetadata.cpp.o -MF tools/clang/lib/CodeGen/CMakeFiles/obj.clangCodeGen.dir/SanitizerMetadata.cpp.o.d -o tools/clang/lib/CodeGen/CMakeFiles/obj.clangCodeGen.dir/SanitizerMetadata.cpp.o -c /Users/buildslave/jenkins/workspace/clang-stage2-coverage-R/llvm/tools/clang/lib/CodeGen/SanitizerMetadata.cpp
[3150/4595] /Users/buildslave/jenkins/workspace/clang-stage2-coverage-R/host-compiler/bin/clang++  -DGTEST_HAS_RTTI=0 -D_GNU_SOURCE -D__STDC_CONSTANT_MACROS -D__STDC_FORMAT_MACROS -D__STDC_LIMIT_MACROS -Itools/clang/lib/CodeGen -I/Users/buildslave/jenkins/workspace/clang-stage2-coverage-R/llvm/tools/clang/lib/CodeGen -I/Users/buildslave/jenkins/workspace/clang-stage2-coverage-R/llvm/tools/clang/include -Itools/clang/include -I/Applications/Xcode.app/Contents/Developer/Platforms/MacOSX.platform/Developer/SDKs/MacOSX10.14.sdk/usr/include/libxml2 -Iinclude -I/Users/buildslave/jenkins/workspace/clang-stage2-coverage-R/llvm/include -fPIC -fvisibility-inlines-hidden -Werror=date-time -Werror=unguarded-availability-new -std=c++11 -fmodules -fmodules-cache-path=/Users/buildslave/jenkins/workspace/clang-stage2-coverage-R/clang-build/module.cache -fcxx-modules -Wall -Wextra -Wno-unused-parameter -Wwrite-strings -Wcast-qual -Wmissing-field-initializers -pedantic -Wno-long-long -Wimplicit-fallthrough -Wcovered-switch-default -Wno-noexcept-type -Wnon-virtual-dtor -Wdelete-non-virtual-dtor -Wstring-conversion -fdiagnostics-color -fprofile-instr-generate='/Users/buildslave/jenkins/workspace/clang-stage2-coverage-R/clang-build/profiles/%6m.profraw' -fcoverage-mapping -fno-common -Woverloaded-virtual -Wno-nested-anon-types -O3 -DNDEBUG -isysroot /Applications/Xcode.app/Contents/Developer/Platforms/MacOSX.platform/Developer/SDKs/MacOSX10.14.sdk    -fno-exceptions -fno-rtti -MD -MT tools/clang/lib/CodeGen/CMakeFiles/obj.clangCodeGen.dir/CodeGenPGO.cpp.o -MF tools/clang/lib/CodeGen/CMakeFiles/obj.clangCodeGen.dir/CodeGenPGO.cpp.o.d -o tools/clang/lib/CodeGen/CMakeFiles/obj.clangCodeGen.dir/CodeGenPGO.cpp.o -c /Users/buildslave/jenkins/workspace/clang-stage2-coverage-R/llvm/tools/clang/lib/CodeGen/CodeGenPGO.cpp
[3151/4595] /Users/buildslave/jenkins/workspace/clang-stage2-coverage-R/host-compiler/bin/clang++  -DGTEST_HAS_RTTI=0 -D_GNU_SOURCE -D__STDC_CONSTANT_MACROS -D__STDC_FORMAT_MACROS -D__STDC_LIMIT_MACROS -Itools/clang/lib/CodeGen -I/Users/buildslave/jenkins/workspace/clang-stage2-coverage-R/llvm/tools/clang/lib/CodeGen -I/Users/buildslave/jenkins/workspace/clang-stage2-coverage-R/llvm/tools/clang/include -Itools/clang/include -I/Applications/Xcode.app/Contents/Developer/Platforms/MacOSX.platform/Developer/SDKs/MacOSX10.14.sdk/usr/include/libxml2 -Iinclude -I/Users/buildslave/jenkins/workspace/clang-stage2-coverage-R/llvm/include -fPIC -fvisibility-inlines-hidden -Werror=date-time -Werror=unguarded-availability-new -std=c++11 -fmodules -fmodules-cache-path=/Users/buildslave/jenkins/workspace/clang-stage2-coverage-R/clang-build/module.cache -fcxx-modules -Wall -Wextra -Wno-unused-parameter -Wwrite-strings -Wcast-qual -Wmissing-field-initializers -pedantic -Wno-long-long -Wimplicit-fallthrough -Wcovered-switch-default -Wno-noexcept-type -Wnon-virtual-dtor -Wdelete-non-virtual-dtor -Wstring-conversion -fdiagnostics-color -fprofile-instr-generate='/Users/buildslave/jenkins/workspace/clang-stage2-coverage-R/clang-build/profiles/%6m.profraw' -fcoverage-mapping -fno-common -Woverloaded-virtual -Wno-nested-anon-types -O3 -DNDEBUG -isysroot /Applications/Xcode.app/Contents/Developer/Platforms/MacOSX.platform/Developer/SDKs/MacOSX10.14.sdk    -fno-exceptions -fno-rtti -MD -MT tools/clang/lib/CodeGen/CMakeFiles/obj.clangCodeGen.dir/MicrosoftCXXABI.cpp.o -MF tools/clang/lib/CodeGen/CMakeFiles/obj.clangCodeGen.dir/MicrosoftCXXABI.cpp.o.d -o tools/clang/lib/CodeGen/CMakeFiles/obj.clangCodeGen.dir/MicrosoftCXXABI.cpp.o -c /Users/buildslave/jenkins/workspace/clang-stage2-coverage-R/llvm/tools/clang/lib/CodeGen/MicrosoftCXXABI.cpp
[3152/4595] /Users/buildslave/jenkins/workspace/clang-stage2-coverage-R/host-compiler/bin/clang++  -DGTEST_HAS_RTTI=0 -D_GNU_SOURCE -D__STDC_CONSTANT_MACROS -D__STDC_FORMAT_MACROS -D__STDC_LIMIT_MACROS -Itools/clang/lib/CodeGen -I/Users/buildslave/jenkins/workspace/clang-stage2-coverage-R/llvm/tools/clang/lib/CodeGen -I/Users/buildslave/jenkins/workspace/clang-stage2-coverage-R/llvm/tools/clang/include -Itools/clang/include -I/Applications/Xcode.app/Contents/Developer/Platforms/MacOSX.platform/Developer/SDKs/MacOSX10.14.sdk/usr/include/libxml2 -Iinclude -I/Users/buildslave/jenkins/workspace/clang-stage2-coverage-R/llvm/include -fPIC -fvisibility-inlines-hidden -Werror=date-time -Werror=unguarded-availability-new -std=c++11 -fmodules -fmodules-cache-path=/Users/buildslave/jenkins/workspace/clang-stage2-coverage-R/clang-build/module.cache -fcxx-modules -Wall -Wextra -Wno-unused-parameter -Wwrite-strings -Wcast-qual -Wmissing-field-initializers -pedantic -Wno-long-long -Wimplicit-fallthrough -Wcovered-switch-default -Wno-noexcept-type -Wnon-virtual-dtor -Wdelete-non-virtual-dtor -Wstring-conversion -fdiagnostics-color -fprofile-instr-generate='/Users/buildslave/jenkins/workspace/clang-stage2-coverage-R/clang-build/profiles/%6m.profraw' -fcoverage-mapping -fno-common -Woverloaded-virtual -Wno-nested-anon-types -O3 -DNDEBUG -isysroot /Applications/Xcode.app/Contents/Developer/Platforms/MacOSX.platform/Developer/SDKs/MacOSX10.14.sdk    -fno-exceptions -fno-rtti -MD -MT tools/clang/lib/CodeGen/CMakeFiles/obj.clangCodeGen.dir/SwiftCallingConv.cpp.o -MF tools/clang/lib/CodeGen/CMakeFiles/obj.clangCodeGen.dir/SwiftCallingConv.cpp.o.d -o tools/clang/lib/CodeGen/CMakeFiles/obj.clangCodeGen.dir/SwiftCallingConv.cpp.o -c /Users/buildslave/jenkins/workspace/clang-stage2-coverage-R/llvm/tools/clang/lib/CodeGen/SwiftCallingConv.cpp
[3153/4595] /Users/buildslave/jenkins/workspace/clang-stage2-coverage-R/host-compiler/bin/clang++  -DGTEST_HAS_RTTI=0 -D_GNU_SOURCE -D__STDC_CONSTANT_MACROS -D__STDC_FORMAT_MACROS -D__STDC_LIMIT_MACROS -Itools/clang/lib/CodeGen -I/Users/buildslave/jenkins/workspace/clang-stage2-coverage-R/llvm/tools/clang/lib/CodeGen -I/Users/buildslave/jenkins/workspace/clang-stage2-coverage-R/llvm/tools/clang/include -Itools/clang/include -I/Applications/Xcode.app/Contents/Developer/Platforms/MacOSX.platform/Developer/SDKs/MacOSX10.14.sdk/usr/include/libxml2 -Iinclude -I/Users/buildslave/jenkins/workspace/clang-stage2-coverage-R/llvm/include -fPIC -fvisibility-inlines-hidden -Werror=date-time -Werror=unguarded-availability-new -std=c++11 -fmodules -fmodules-cache-path=/Users/buildslave/jenkins/workspace/clang-stage2-coverage-R/clang-build/module.cache -fcxx-modules -Wall -Wextra -Wno-unused-parameter -Wwrite-strings -Wcast-qual -Wmissing-field-initializers -pedantic -Wno-long-long -Wimplicit-fallthrough -Wcovered-switch-default -Wno-noexcept-type -Wnon-virtual-dtor -Wdelete-non-virtual-dtor -Wstring-conversion -fdiagnostics-color -fprofile-instr-generate='/Users/buildslave/jenkins/workspace/clang-stage2-coverage-R/clang-build/profiles/%6m.profraw' -fcoverage-mapping -fno-common -Woverloaded-virtual -Wno-nested-anon-types -O3 -DNDEBUG -isysroot /Applications/Xcode.app/Contents/Developer/Platforms/MacOSX.platform/Developer/SDKs/MacOSX10.14.sdk    -fno-exceptions -fno-rtti -MD -MT tools/clang/lib/CodeGen/CMakeFiles/obj.clangCodeGen.dir/VarBypassDetector.cpp.o -MF tools/clang/lib/CodeGen/CMakeFiles/obj.clangCodeGen.dir/VarBypassDetector.cpp.o.d -o tools/clang/lib/CodeGen/CMakeFiles/obj.clangCodeGen.dir/VarBypassDetector.cpp.o -c /Users/buildslave/jenkins/workspace/clang-stage2-coverage-R/llvm/tools/clang/lib/CodeGen/VarBypassDetector.cpp
[3154/4595] /Users/buildslave/jenkins/workspace/clang-stage2-coverage-R/host-compiler/bin/clang++  -DGTEST_HAS_RTTI=0 -D_GNU_SOURCE -D__STDC_CONSTANT_MACROS -D__STDC_FORMAT_MACROS -D__STDC_LIMIT_MACROS -Itools/clang/lib/Analysis -I/Users/buildslave/jenkins/workspace/clang-stage2-coverage-R/llvm/tools/clang/lib/Analysis -I/Users/buildslave/jenkins/workspace/clang-stage2-coverage-R/llvm/tools/clang/include -Itools/clang/include -I/Applications/Xcode.app/Contents/Developer/Platforms/MacOSX.platform/Developer/SDKs/MacOSX10.14.sdk/usr/include/libxml2 -Iinclude -I/Users/buildslave/jenkins/workspace/clang-stage2-coverage-R/llvm/include -fPIC -fvisibility-inlines-hidden -Werror=date-time -Werror=unguarded-availability-new -std=c++11 -fmodules -fmodules-cache-path=/Users/buildslave/jenkins/workspace/clang-stage2-coverage-R/clang-build/module.cache -fcxx-modules -Wall -Wextra -Wno-unused-parameter -Wwrite-strings -Wcast-qual -Wmissing-field-initializers -pedantic -Wno-long-long -Wimplicit-fallthrough -Wcovered-switch-default -Wno-noexcept-type -Wnon-virtual-dtor -Wdelete-non-virtual-dtor -Wstring-conversion -fdiagnostics-color -fprofile-instr-generate='/Users/buildslave/jenkins/workspace/clang-stage2-coverage-R/clang-build/profiles/%6m.profraw' -fcoverage-mapping -fno-common -Woverloaded-virtual -Wno-nested-anon-types -O3 -DNDEBUG -isysroot /Applications/Xcode.app/Contents/Developer/Platforms/MacOSX.platform/Developer/SDKs/MacOSX10.14.sdk    -fno-exceptions -fno-rtti -MD -MT tools/clang/lib/Analysis/CMakeFiles/obj.clangAnalysis.dir/BodyFarm.cpp.o -MF tools/clang/lib/Analysis/CMakeFiles/obj.clangAnalysis.dir/BodyFarm.cpp.o.d -o tools/clang/lib/Analysis/CMakeFiles/obj.clangAnalysis.dir/BodyFarm.cpp.o -c /Users/buildslave/jenkins/workspace/clang-stage2-coverage-R/llvm/tools/clang/lib/Analysis/BodyFarm.cpp
[3155/4595] /Users/buildslave/jenkins/workspace/clang-stage2-coverage-R/host-compiler/bin/clang++  -DGTEST_HAS_RTTI=0 -D_GNU_SOURCE -D__STDC_CONSTANT_MACROS -D__STDC_FORMAT_MACROS -D__STDC_LIMIT_MACROS -Itools/clang/lib/Analysis -I/Users/buildslave/jenkins/workspace/clang-stage2-coverage-R/llvm/tools/clang/lib/Analysis -I/Users/buildslave/jenkins/workspace/clang-stage2-coverage-R/llvm/tools/clang/include -Itools/clang/include -I/Applications/Xcode.app/Contents/Developer/Platforms/MacOSX.platform/Developer/SDKs/MacOSX10.14.sdk/usr/include/libxml2 -Iinclude -I/Users/buildslave/jenkins/workspace/clang-stage2-coverage-R/llvm/include -fPIC -fvisibility-inlines-hidden -Werror=date-time -Werror=unguarded-availability-new -std=c++11 -fmodules -fmodules-cache-path=/Users/buildslave/jenkins/workspace/clang-stage2-coverage-R/clang-build/module.cache -fcxx-modules -Wall -Wextra -Wno-unused-parameter -Wwrite-strings -Wcast-qual -Wmissing-field-initializers -pedantic -Wno-long-long -Wimplicit-fallthrough -Wcovered-switch-default -Wno-noexcept-type -Wnon-virtual-dtor -Wdelete-non-virtual-dtor -Wstring-conversion -fdiagnostics-color -fprofile-instr-generate='/Users/buildslave/jenkins/workspace/clang-stage2-coverage-R/clang-build/profiles/%6m.profraw' -fcoverage-mapping -fno-common -Woverloaded-virtual -Wno-nested-anon-types -O3 -DNDEBUG -isysroot /Applications/Xcode.app/Contents/Developer/Platforms/MacOSX.platform/Developer/SDKs/MacOSX10.14.sdk    -fno-exceptions -fno-rtti -MD -MT tools/clang/lib/Analysis/CMakeFiles/obj.clangAnalysis.dir/CFGReachabilityAnalysis.cpp.o -MF tools/clang/lib/Analysis/CMakeFiles/obj.clangAnalysis.dir/CFGReachabilityAnalysis.cpp.o.d -o tools/clang/lib/Analysis/CMakeFiles/obj.clangAnalysis.dir/CFGReachabilityAnalysis.cpp.o -c /Users/buildslave/jenkins/workspace/clang-stage2-coverage-R/llvm/tools/clang/lib/Analysis/CFGReachabilityAnalysis.cpp
[3156/4595] /Users/buildslave/jenkins/workspace/clang-stage2-coverage-R/host-compiler/bin/clang++  -DGTEST_HAS_RTTI=0 -D_GNU_SOURCE -D__STDC_CONSTANT_MACROS -D__STDC_FORMAT_MACROS -D__STDC_LIMIT_MACROS -Itools/clang/lib/Analysis -I/Users/buildslave/jenkins/workspace/clang-stage2-coverage-R/llvm/tools/clang/lib/Analysis -I/Users/buildslave/jenkins/workspace/clang-stage2-coverage-R/llvm/tools/clang/include -Itools/clang/include -I/Applications/Xcode.app/Contents/Developer/Platforms/MacOSX.platform/Developer/SDKs/MacOSX10.14.sdk/usr/include/libxml2 -Iinclude -I/Users/buildslave/jenkins/workspace/clang-stage2-coverage-R/llvm/include -fPIC -fvisibility-inlines-hidden -Werror=date-time -Werror=unguarded-availability-new -std=c++11 -fmodules -fmodules-cache-path=/Users/buildslave/jenkins/workspace/clang-stage2-coverage-R/clang-build/module.cache -fcxx-modules -Wall -Wextra -Wno-unused-parameter -Wwrite-strings -Wcast-qual -Wmissing-field-initializers -pedantic -Wno-long-long -Wimplicit-fallthrough -Wcovered-switch-default -Wno-noexcept-type -Wnon-virtual-dtor -Wdelete-non-virtual-dtor -Wstring-conversion -fdiagnostics-color -fprofile-instr-generate='/Users/buildslave/jenkins/workspace/clang-stage2-coverage-R/clang-build/profiles/%6m.profraw' -fcoverage-mapping -fno-common -Woverloaded-virtual -Wno-nested-anon-types -O3 -DNDEBUG -isysroot /Applications/Xcode.app/Contents/Developer/Platforms/MacOSX.platform/Developer/SDKs/MacOSX10.14.sdk    -fno-exceptions -fno-rtti -MD -MT tools/clang/lib/Analysis/CMakeFiles/obj.clangAnalysis.dir/AnalysisDeclContext.cpp.o -MF tools/clang/lib/Analysis/CMakeFiles/obj.clangAnalysis.dir/AnalysisDeclContext.cpp.o.d -o tools/clang/lib/Analysis/CMakeFiles/obj.clangAnalysis.dir/AnalysisDeclContext.cpp.o -c /Users/buildslave/jenkins/workspace/clang-stage2-coverage-R/llvm/tools/clang/lib/Analysis/AnalysisDeclContext.cpp
[3157/4595] /Users/buildslave/jenkins/workspace/clang-stage2-coverage-R/host-compiler/bin/clang++  -DGTEST_HAS_RTTI=0 -D_GNU_SOURCE -D__STDC_CONSTANT_MACROS -D__STDC_FORMAT_MACROS -D__STDC_LIMIT_MACROS -Itools/clang/lib/Analysis -I/Users/buildslave/jenkins/workspace/clang-stage2-coverage-R/llvm/tools/clang/lib/Analysis -I/Users/buildslave/jenkins/workspace/clang-stage2-coverage-R/llvm/tools/clang/include -Itools/clang/include -I/Applications/Xcode.app/Contents/Developer/Platforms/MacOSX.platform/Developer/SDKs/MacOSX10.14.sdk/usr/include/libxml2 -Iinclude -I/Users/buildslave/jenkins/workspace/clang-stage2-coverage-R/llvm/include -fPIC -fvisibility-inlines-hidden -Werror=date-time -Werror=unguarded-availability-new -std=c++11 -fmodules -fmodules-cache-path=/Users/buildslave/jenkins/workspace/clang-stage2-coverage-R/clang-build/module.cache -fcxx-modules -Wall -Wextra -Wno-unused-parameter -Wwrite-strings -Wcast-qual -Wmissing-field-initializers -pedantic -Wno-long-long -Wimplicit-fallthrough -Wcovered-switch-default -Wno-noexcept-type -Wnon-virtual-dtor -Wdelete-non-virtual-dtor -Wstring-conversion -fdiagnostics-color -fprofile-instr-generate='/Users/buildslave/jenkins/workspace/clang-stage2-coverage-R/clang-build/profiles/%6m.profraw' -fcoverage-mapping -fno-common -Woverloaded-virtual -Wno-nested-anon-types -O3 -DNDEBUG -isysroot /Applications/Xcode.app/Contents/Developer/Platforms/MacOSX.platform/Developer/SDKs/MacOSX10.14.sdk    -fno-exceptions -fno-rtti -MD -MT tools/clang/lib/Analysis/CMakeFiles/obj.clangAnalysis.dir/CFGStmtMap.cpp.o -MF tools/clang/lib/Analysis/CMakeFiles/obj.clangAnalysis.dir/CFGStmtMap.cpp.o.d -o tools/clang/lib/Analysis/CMakeFiles/obj.clangAnalysis.dir/CFGStmtMap.cpp.o -c /Users/buildslave/jenkins/workspace/clang-stage2-coverage-R/llvm/tools/clang/lib/Analysis/CFGStmtMap.cpp
[3158/4595] /Users/buildslave/jenkins/workspace/clang-stage2-coverage-R/host-compiler/bin/clang++  -DGTEST_HAS_RTTI=0 -D_GNU_SOURCE -D__STDC_CONSTANT_MACROS -D__STDC_FORMAT_MACROS -D__STDC_LIMIT_MACROS -Itools/clang/lib/Analysis -I/Users/buildslave/jenkins/workspace/clang-stage2-coverage-R/llvm/tools/clang/lib/Analysis -I/Users/buildslave/jenkins/workspace/clang-stage2-coverage-R/llvm/tools/clang/include -Itools/clang/include -I/Applications/Xcode.app/Contents/Developer/Platforms/MacOSX.platform/Developer/SDKs/MacOSX10.14.sdk/usr/include/libxml2 -Iinclude -I/Users/buildslave/jenkins/workspace/clang-stage2-coverage-R/llvm/include -fPIC -fvisibility-inlines-hidden -Werror=date-time -Werror=unguarded-availability-new -std=c++11 -fmodules -fmodules-cache-path=/Users/buildslave/jenkins/workspace/clang-stage2-coverage-R/clang-build/module.cache -fcxx-modules -Wall -Wextra -Wno-unused-parameter -Wwrite-strings -Wcast-qual -Wmissing-field-initializers -pedantic -Wno-long-long -Wimplicit-fallthrough -Wcovered-switch-default -Wno-noexcept-type -Wnon-virtual-dtor -Wdelete-non-virtual-dtor -Wstring-conversion -fdiagnostics-color -fprofile-instr-generate='/Users/buildslave/jenkins/workspace/clang-stage2-coverage-R/clang-build/profiles/%6m.profraw' -fcoverage-mapping -fno-common -Woverloaded-virtual -Wno-nested-anon-types -O3 -DNDEBUG -isysroot /Applications/Xcode.app/Contents/Developer/Platforms/MacOSX.platform/Developer/SDKs/MacOSX10.14.sdk    -fno-exceptions -fno-rtti -MD -MT tools/clang/lib/Analysis/CMakeFiles/obj.clangAnalysis.dir/CallGraph.cpp.o -MF tools/clang/lib/Analysis/CMakeFiles/obj.clangAnalysis.dir/CallGraph.cpp.o.d -o tools/clang/lib/Analysis/CMakeFiles/obj.clangAnalysis.dir/CallGraph.cpp.o -c /Users/buildslave/jenkins/workspace/clang-stage2-coverage-R/llvm/tools/clang/lib/Analysis/CallGraph.cpp
[3159/4595] /Users/buildslave/jenkins/workspace/clang-stage2-coverage-R/host-compiler/bin/clang++  -DGTEST_HAS_RTTI=0 -D_GNU_SOURCE -D__STDC_CONSTANT_MACROS -D__STDC_FORMAT_MACROS -D__STDC_LIMIT_MACROS -Itools/clang/lib/Analysis -I/Users/buildslave/jenkins/workspace/clang-stage2-coverage-R/llvm/tools/clang/lib/Analysis -I/Users/buildslave/jenkins/workspace/clang-stage2-coverage-R/llvm/tools/clang/include -Itools/clang/include -I/Applications/Xcode.app/Contents/Developer/Platforms/MacOSX.platform/Developer/SDKs/MacOSX10.14.sdk/usr/include/libxml2 -Iinclude -I/Users/buildslave/jenkins/workspace/clang-stage2-coverage-R/llvm/include -fPIC -fvisibility-inlines-hidden -Werror=date-time -Werror=unguarded-availability-new -std=c++11 -fmodules -fmodules-cache-path=/Users/buildslave/jenkins/workspace/clang-stage2-coverage-R/clang-build/module.cache -fcxx-modules -Wall -Wextra -Wno-unused-parameter -Wwrite-strings -Wcast-qual -Wmissing-field-initializers -pedantic -Wno-long-long -Wimplicit-fallthrough -Wcovered-switch-default -Wno-noexcept-type -Wnon-virtual-dtor -Wdelete-non-virtual-dtor -Wstring-conversion -fdiagnostics-color -fprofile-instr-generate='/Users/buildslave/jenkins/workspace/clang-stage2-coverage-R/clang-build/profiles/%6m.profraw' -fcoverage-mapping -fno-common -Woverloaded-virtual -Wno-nested-anon-types -O3 -DNDEBUG -isysroot /Applications/Xcode.app/Contents/Developer/Platforms/MacOSX.platform/Developer/SDKs/MacOSX10.14.sdk    -fno-exceptions -fno-rtti -MD -MT tools/clang/lib/Analysis/CMakeFiles/obj.clangAnalysis.dir/CocoaConventions.cpp.o -MF tools/clang/lib/Analysis/CMakeFiles/obj.clangAnalysis.dir/CocoaConventions.cpp.o.d -o tools/clang/lib/Analysis/CMakeFiles/obj.clangAnalysis.dir/CocoaConventions.cpp.o -c /Users/buildslave/jenkins/workspace/clang-stage2-coverage-R/llvm/tools/clang/lib/Analysis/CocoaConventions.cpp
[3160/4595] /Users/buildslave/jenkins/workspace/clang-stage2-coverage-R/host-compiler/bin/clang++  -DGTEST_HAS_RTTI=0 -D_GNU_SOURCE -D__STDC_CONSTANT_MACROS -D__STDC_FORMAT_MACROS -D__STDC_LIMIT_MACROS -Itools/clang/lib/Analysis -I/Users/buildslave/jenkins/workspace/clang-stage2-coverage-R/llvm/tools/clang/lib/Analysis -I/Users/buildslave/jenkins/workspace/clang-stage2-coverage-R/llvm/tools/clang/include -Itools/clang/include -I/Applications/Xcode.app/Contents/Developer/Platforms/MacOSX.platform/Developer/SDKs/MacOSX10.14.sdk/usr/include/libxml2 -Iinclude -I/Users/buildslave/jenkins/workspace/clang-stage2-coverage-R/llvm/include -fPIC -fvisibility-inlines-hidden -Werror=date-time -Werror=unguarded-availability-new -std=c++11 -fmodules -fmodules-cache-path=/Users/buildslave/jenkins/workspace/clang-stage2-coverage-R/clang-build/module.cache -fcxx-modules -Wall -Wextra -Wno-unused-parameter -Wwrite-strings -Wcast-qual -Wmissing-field-initializers -pedantic -Wno-long-long -Wimplicit-fallthrough -Wcovered-switch-default -Wno-noexcept-type -Wnon-virtual-dtor -Wdelete-non-virtual-dtor -Wstring-conversion -fdiagnostics-color -fprofile-instr-generate='/Users/buildslave/jenkins/workspace/clang-stage2-coverage-R/clang-build/profiles/%6m.profraw' -fcoverage-mapping -fno-common -Woverloaded-virtual -Wno-nested-anon-types -O3 -DNDEBUG -isysroot /Applications/Xcode.app/Contents/Developer/Platforms/MacOSX.platform/Developer/SDKs/MacOSX10.14.sdk    -fno-exceptions -fno-rtti -MD -MT tools/clang/lib/Analysis/CMakeFiles/obj.clangAnalysis.dir/ConstructionContext.cpp.o -MF tools/clang/lib/Analysis/CMakeFiles/obj.clangAnalysis.dir/ConstructionContext.cpp.o.d -o tools/clang/lib/Analysis/CMakeFiles/obj.clangAnalysis.dir/ConstructionContext.cpp.o -c /Users/buildslave/jenkins/workspace/clang-stage2-coverage-R/llvm/tools/clang/lib/Analysis/ConstructionContext.cpp
[3161/4595] /Users/buildslave/jenkins/workspace/clang-stage2-coverage-R/host-compiler/bin/clang++  -DGTEST_HAS_RTTI=0 -D_GNU_SOURCE -D__STDC_CONSTANT_MACROS -D__STDC_FORMAT_MACROS -D__STDC_LIMIT_MACROS -Itools/clang/lib/Analysis -I/Users/buildslave/jenkins/workspace/clang-stage2-coverage-R/llvm/tools/clang/lib/Analysis -I/Users/buildslave/jenkins/workspace/clang-stage2-coverage-R/llvm/tools/clang/include -Itools/clang/include -I/Applications/Xcode.app/Contents/Developer/Platforms/MacOSX.platform/Developer/SDKs/MacOSX10.14.sdk/usr/include/libxml2 -Iinclude -I/Users/buildslave/jenkins/workspace/clang-stage2-coverage-R/llvm/include -fPIC -fvisibility-inlines-hidden -Werror=date-time -Werror=unguarded-availability-new -std=c++11 -fmodules -fmodules-cache-path=/Users/buildslave/jenkins/workspace/clang-stage2-coverage-R/clang-build/module.cache -fcxx-modules -Wall -Wextra -Wno-unused-parameter -Wwrite-strings -Wcast-qual -Wmissing-field-initializers -pedantic -Wno-long-long -Wimplicit-fallthrough -Wcovered-switch-default -Wno-noexcept-type -Wnon-virtual-dtor -Wdelete-non-virtual-dtor -Wstring-conversion -fdiagnostics-color -fprofile-instr-generate='/Users/buildslave/jenkins/workspace/clang-stage2-coverage-R/clang-build/profiles/%6m.profraw' -fcoverage-mapping -fno-common -Woverloaded-virtual -Wno-nested-anon-types -O3 -DNDEBUG -isysroot /Applications/Xcode.app/Contents/Developer/Platforms/MacOSX.platform/Developer/SDKs/MacOSX10.14.sdk    -fno-exceptions -fno-rtti -MD -MT tools/clang/lib/Analysis/CMakeFiles/obj.clangAnalysis.dir/CloneDetection.cpp.o -MF tools/clang/lib/Analysis/CMakeFiles/obj.clangAnalysis.dir/CloneDetection.cpp.o.d -o tools/clang/lib/Analysis/CMakeFiles/obj.clangAnalysis.dir/CloneDetection.cpp.o -c /Users/buildslave/jenkins/workspace/clang-stage2-coverage-R/llvm/tools/clang/lib/Analysis/CloneDetection.cpp
[3162/4595] /Users/buildslave/jenkins/workspace/clang-stage2-coverage-R/host-compiler/bin/clang++  -DGTEST_HAS_RTTI=0 -D_GNU_SOURCE -D__STDC_CONSTANT_MACROS -D__STDC_FORMAT_MACROS -D__STDC_LIMIT_MACROS -Itools/clang/lib/Analysis -I/Users/buildslave/jenkins/workspace/clang-stage2-coverage-R/llvm/tools/clang/lib/Analysis -I/Users/buildslave/jenkins/workspace/clang-stage2-coverage-R/llvm/tools/clang/include -Itools/clang/include -I/Applications/Xcode.app/Contents/Developer/Platforms/MacOSX.platform/Developer/SDKs/MacOSX10.14.sdk/usr/include/libxml2 -Iinclude -I/Users/buildslave/jenkins/workspace/clang-stage2-coverage-R/llvm/include -fPIC -fvisibility-inlines-hidden -Werror=date-time -Werror=unguarded-availability-new -std=c++11 -fmodules -fmodules-cache-path=/Users/buildslave/jenkins/workspace/clang-stage2-coverage-R/clang-build/module.cache -fcxx-modules -Wall -Wextra -Wno-unused-parameter -Wwrite-strings -Wcast-qual -Wmissing-field-initializers -pedantic -Wno-long-long -Wimplicit-fallthrough -Wcovered-switch-default -Wno-noexcept-type -Wnon-virtual-dtor -Wdelete-non-virtual-dtor -Wstring-conversion -fdiagnostics-color -fprofile-instr-generate='/Users/buildslave/jenkins/workspace/clang-stage2-coverage-R/clang-build/profiles/%6m.profraw' -fcoverage-mapping -fno-common -Woverloaded-virtual -Wno-nested-anon-types -O3 -DNDEBUG -isysroot /Applications/Xcode.app/Contents/Developer/Platforms/MacOSX.platform/Developer/SDKs/MacOSX10.14.sdk    -fno-exceptions -fno-rtti -MD -MT tools/clang/lib/Analysis/CMakeFiles/obj.clangAnalysis.dir/CodeInjector.cpp.o -MF tools/clang/lib/Analysis/CMakeFiles/obj.clangAnalysis.dir/CodeInjector.cpp.o.d -o tools/clang/lib/Analysis/CMakeFiles/obj.clangAnalysis.dir/CodeInjector.cpp.o -c /Users/buildslave/jenkins/workspace/clang-stage2-coverage-R/llvm/tools/clang/lib/Analysis/CodeInjector.cpp
[3163/4595] /Users/buildslave/jenkins/workspace/clang-stage2-coverage-R/host-compiler/bin/clang++  -DGTEST_HAS_RTTI=0 -D_GNU_SOURCE -D__STDC_CONSTANT_MACROS -D__STDC_FORMAT_MACROS -D__STDC_LIMIT_MACROS -Itools/clang/lib/Analysis -I/Users/buildslave/jenkins/workspace/clang-stage2-coverage-R/llvm/tools/clang/lib/Analysis -I/Users/buildslave/jenkins/workspace/clang-stage2-coverage-R/llvm/tools/clang/include -Itools/clang/include -I/Applications/Xcode.app/Contents/Developer/Platforms/MacOSX.platform/Developer/SDKs/MacOSX10.14.sdk/usr/include/libxml2 -Iinclude -I/Users/buildslave/jenkins/workspace/clang-stage2-coverage-R/llvm/include -fPIC -fvisibility-inlines-hidden -Werror=date-time -Werror=unguarded-availability-new -std=c++11 -fmodules -fmodules-cache-path=/Users/buildslave/jenkins/workspace/clang-stage2-coverage-R/clang-build/module.cache -fcxx-modules -Wall -Wextra -Wno-unused-parameter -Wwrite-strings -Wcast-qual -Wmissing-field-initializers -pedantic -Wno-long-long -Wimplicit-fallthrough -Wcovered-switch-default -Wno-noexcept-type -Wnon-virtual-dtor -Wdelete-non-virtual-dtor -Wstring-conversion -fdiagnostics-color -fprofile-instr-generate='/Users/buildslave/jenkins/workspace/clang-stage2-coverage-R/clang-build/profiles/%6m.profraw' -fcoverage-mapping -fno-common -Woverloaded-virtual -Wno-nested-anon-types -O3 -DNDEBUG -isysroot /Applications/Xcode.app/Contents/Developer/Platforms/MacOSX.platform/Developer/SDKs/MacOSX10.14.sdk    -fno-exceptions -fno-rtti -MD -MT tools/clang/lib/Analysis/CMakeFiles/obj.clangAnalysis.dir/Dominators.cpp.o -MF tools/clang/lib/Analysis/CMakeFiles/obj.clangAnalysis.dir/Dominators.cpp.o.d -o tools/clang/lib/Analysis/CMakeFiles/obj.clangAnalysis.dir/Dominators.cpp.o -c /Users/buildslave/jenkins/workspace/clang-stage2-coverage-R/llvm/tools/clang/lib/Analysis/Dominators.cpp
FAILED: tools/clang/lib/Analysis/CMakeFiles/obj.clangAnalysis.dir/Dominators.cpp.o 
/Users/buildslave/jenkins/workspace/clang-stage2-coverage-R/host-compiler/bin/clang++  -DGTEST_HAS_RTTI=0 -D_GNU_SOURCE -D__STDC_CONSTANT_MACROS -D__STDC_FORMAT_MACROS -D__STDC_LIMIT_MACROS -Itools/clang/lib/Analysis -I/Users/buildslave/jenkins/workspace/clang-stage2-coverage-R/llvm/tools/clang/lib/Analysis -I/Users/buildslave/jenkins/workspace/clang-stage2-coverage-R/llvm/tools/clang/include -Itools/clang/include -I/Applications/Xcode.app/Contents/Developer/Platforms/MacOSX.platform/Developer/SDKs/MacOSX10.14.sdk/usr/include/libxml2 -Iinclude -I/Users/buildslave/jenkins/workspace/clang-stage2-coverage-R/llvm/include -fPIC -fvisibility-inlines-hidden -Werror=date-time -Werror=unguarded-availability-new -std=c++11 -fmodules -fmodules-cache-path=/Users/buildslave/jenkins/workspace/clang-stage2-coverage-R/clang-build/module.cache -fcxx-modules -Wall -Wextra -Wno-unused-parameter -Wwrite-strings -Wcast-qual -Wmissing-field-initializers -pedantic -Wno-long-long -Wimplicit-fallthrough -Wcovered-switch-default -Wno-noexcept-type -Wnon-virtual-dtor -Wdelete-non-virtual-dtor -Wstring-conversion -fdiagnostics-color -fprofile-instr-generate='/Users/buildslave/jenkins/workspace/clang-stage2-coverage-R/clang-build/profiles/%6m.profraw' -fcoverage-mapping -fno-common -Woverloaded-virtual -Wno-nested-anon-types -O3 -DNDEBUG -isysroot /Applications/Xcode.app/Contents/Developer/Platforms/MacOSX.platform/Developer/SDKs/MacOSX10.14.sdk    -fno-exceptions -fno-rtti -MD -MT tools/clang/lib/Analysis/CMakeFiles/obj.clangAnalysis.dir/Dominators.cpp.o -MF tools/clang/lib/Analysis/CMakeFiles/obj.clangAnalysis.dir/Dominators.cpp.o.d -o tools/clang/lib/Analysis/CMakeFiles/obj.clangAnalysis.dir/Dominators.cpp.o -c /Users/buildslave/jenkins/workspace/clang-stage2-coverage-R/llvm/tools/clang/lib/Analysis/Dominators.cpp
/Users/buildslave/jenkins/workspace/clang-stage2-coverage-R/llvm/tools/clang/lib/Analysis/Dominators.cpp:14:48: error: explicit specialization of 'anchor' after instantiation
void CFGDominatorTreeImpl</*IsPostDom=*/true>::anchor() {}
                                               ^
/Users/buildslave/jenkins/workspace/clang-stage2-coverage-R/llvm/tools/clang/include/clang/Analysis/Analyses/Dominators.h:225:3: note: implicit instantiation first required here
  ControlDependencyCalculator(CFG *cfg)
  ^
1 error generated.
[3164/4595] /Users/buildslave/jenkins/workspace/clang-stage2-coverage-R/host-compiler/bin/clang++  -DGTEST_HAS_RTTI=0 -D_GNU_SOURCE -D__STDC_CONSTANT_MACROS -D__STDC_FORMAT_MACROS -D__STDC_LIMIT_MACROS -Itools/clang/lib/CodeGen -I/Users/buildslave/jenkins/workspace/clang-stage2-coverage-R/llvm/tools/clang/lib/CodeGen -I/Users/buildslave/jenkins/workspace/clang-stage2-coverage-R/llvm/tools/clang/include -Itools/clang/include -I/Applications/Xcode.app/Contents/Developer/Platforms/MacOSX.platform/Developer/SDKs/MacOSX10.14.sdk/usr/include/libxml2 -Iinclude -I/Users/buildslave/jenkins/workspace/clang-stage2-coverage-R/llvm/include -fPIC -fvisibility-inlines-hidden -Werror=date-time -Werror=unguarded-availability-new -std=c++11 -fmodules -fmodules-cache-path=/Users/buildslave/jenkins/workspace/clang-stage2-coverage-R/clang-build/module.cache -fcxx-modules -Wall -Wextra -Wno-unused-parameter -Wwrite-strings -Wcast-qual -Wmissing-field-initializers -pedantic -Wno-long-long -Wimplicit-fallthrough -Wcovered-switch-default -Wno-noexcept-type -Wnon-virtual-dtor -Wdelete-non-virtual-dtor -Wstring-conversion -fdiagnostics-color -fprofile-instr-generate='/Users/buildslave/jenkins/workspace/clang-stage2-coverage-R/clang-build/profiles/%6m.profraw' -fcoverage-mapping -fno-common -Woverloaded-virtual -Wno-nested-anon-types -O3 -DNDEBUG -isysroot /Applications/Xcode.app/Contents/Developer/Platforms/MacOSX.platform/Developer/SDKs/MacOSX10.14.sdk    -fno-exceptions -fno-rtti -MD -MT tools/clang/lib/CodeGen/CMakeFiles/obj.clangCodeGen.dir/TargetInfo.cpp.o -MF tools/clang/lib/CodeGen/CMakeFiles/obj.clangCodeGen.dir/TargetInfo.cpp.o.d -o tools/clang/lib/CodeGen/CMakeFiles/obj.clangCodeGen.dir/TargetInfo.cpp.o -c /Users/buildslave/jenkins/workspace/clang-stage2-coverage-R/llvm/tools/clang/lib/CodeGen/TargetInfo.cpp
[3165/4595] /Users/buildslave/jenkins/workspace/clang-stage2-coverage-R/host-compiler/bin/clang++  -DGTEST_HAS_RTTI=0 -D_GNU_SOURCE -D__STDC_CONSTANT_MACROS -D__STDC_FORMAT_MACROS -D__STDC_LIMIT_MACROS -Itools/clang/lib/Analysis -I/Users/buildslave/jenkins/workspace/clang-stage2-coverage-R/llvm/tools/clang/lib/Analysis -I/Users/buildslave/jenkins/workspace/clang-stage2-coverage-R/llvm/tools/clang/include -Itools/clang/include -I/Applications/Xcode.app/Contents/Developer/Platforms/MacOSX.platform/Developer/SDKs/MacOSX10.14.sdk/usr/include/libxml2 -Iinclude -I/Users/buildslave/jenkins/workspace/clang-stage2-coverage-R/llvm/include -fPIC -fvisibility-inlines-hidden -Werror=date-time -Werror=unguarded-availability-new -std=c++11 -fmodules -fmodules-cache-path=/Users/buildslave/jenkins/workspace/clang-stage2-coverage-R/clang-build/module.cache -fcxx-modules -Wall -Wextra -Wno-unused-parameter -Wwrite-strings -Wcast-qual -Wmissing-field-initializers -pedantic -Wno-long-long -Wimplicit-fallthrough -Wcovered-switch-default -Wno-noexcept-type -Wnon-virtual-dtor -Wdelete-non-virtual-dtor -Wstring-conversion -fdiagnostics-color -fprofile-instr-generate='/Users/buildslave/jenkins/workspace/clang-stage2-coverage-R/clang-build/profiles/%6m.profraw' -fcoverage-mapping -fno-common -Woverloaded-virtual -Wno-nested-anon-types -O3 -DNDEBUG -isysroot /Applications/Xcode.app/Contents/Developer/Platforms/MacOSX.platform/Developer/SDKs/MacOSX10.14.sdk    -fno-exceptions -fno-rtti -MD -MT tools/clang/lib/Analysis/CMakeFiles/obj.clangAnalysis.dir/CFG.cpp.o -MF tools/clang/lib/Analysis/CMakeFiles/obj.clangAnalysis.dir/CFG.cpp.o.d -o tools/clang/lib/Analysis/CMakeFiles/obj.clangAnalysis.dir/CFG.cpp.o -c /Users/buildslave/jenkins/workspace/clang-stage2-coverage-R/llvm/tools/clang/lib/Analysis/CFG.cpp
[3166/4595] /Users/buildslave/jenkins/workspace/clang-stage2-coverage-R/host-compiler/bin/clang++  -DGTEST_HAS_RTTI=0 -D_GNU_SOURCE -D__STDC_CONSTANT_MACROS -D__STDC_FORMAT_MACROS -D__STDC_LIMIT_MACROS -Itools/clang/lib/CodeGen -I/Users/buildslave/jenkins/workspace/clang-stage2-coverage-R/llvm/tools/clang/lib/CodeGen -I/Users/buildslave/jenkins/workspace/clang-stage2-coverage-R/llvm/tools/clang/include -Itools/clang/include -I/Applications/Xcode.app/Contents/Developer/Platforms/MacOSX.platform/Developer/SDKs/MacOSX10.14.sdk/usr/include/libxml2 -Iinclude -I/Users/buildslave/jenkins/workspace/clang-stage2-coverage-R/llvm/include -fPIC -fvisibility-inlines-hidden -Werror=date-time -Werror=unguarded-availability-new -std=c++11 -fmodules -fmodules-cache-path=/Users/buildslave/jenkins/workspace/clang-stage2-coverage-R/clang-build/module.cache -fcxx-modules -Wall -Wextra -Wno-unused-parameter -Wwrite-strings -Wcast-qual -Wmissing-field-initializers -pedantic -Wno-long-long -Wimplicit-fallthrough -Wcovered-switch-default -Wno-noexcept-type -Wnon-virtual-dtor -Wdelete-non-virtual-dtor -Wstring-conversion -fdiagnostics-color -fprofile-instr-generate='/Users/buildslave/jenkins/workspace/clang-stage2-coverage-R/clang-build/profiles/%6m.profraw' -fcoverage-mapping -fno-common -Woverloaded-virtual -Wno-nested-anon-types -O3 -DNDEBUG -isysroot /Applications/Xcode.app/Contents/Developer/Platforms/MacOSX.platform/Developer/SDKs/MacOSX10.14.sdk    -fno-exceptions -fno-rtti -MD -MT tools/clang/lib/CodeGen/CMakeFiles/obj.clangCodeGen.dir/CodeGenModule.cpp.o -MF tools/clang/lib/CodeGen/CMakeFiles/obj.clangCodeGen.dir/CodeGenModule.cpp.o.d -o tools/clang/lib/CodeGen/CMakeFiles/obj.clangCodeGen.dir/CodeGenModule.cpp.o -c /Users/buildslave/jenkins/workspace/clang-stage2-coverage-R/llvm/tools/clang/lib/CodeGen/CodeGenModule.cpp
[3167/4595] /Users/buildslave/jenkins/workspace/clang-stage2-coverage-R/host-compiler/bin/clang++  -DGTEST_HAS_RTTI=0 -D_GNU_SOURCE -D__STDC_CONSTANT_MACROS -D__STDC_FORMAT_MACROS -D__STDC_LIMIT_MACROS -Itools/clang/lib/CodeGen -I/Users/buildslave/jenkins/workspace/clang-stage2-coverage-R/llvm/tools/clang/lib/CodeGen -I/Users/buildslave/jenkins/workspace/clang-stage2-coverage-R/llvm/tools/clang/include -Itools/clang/include -I/Applications/Xcode.app/Contents/Developer/Platforms/MacOSX.platform/Developer/SDKs/MacOSX10.14.sdk/usr/include/libxml2 -Iinclude -I/Users/buildslave/jenkins/workspace/clang-stage2-coverage-R/llvm/include -fPIC -fvisibility-inlines-hidden -Werror=date-time -Werror=unguarded-availability-new -std=c++11 -fmodules -fmodules-cache-path=/Users/buildslave/jenkins/workspace/clang-stage2-coverage-R/clang-build/module.cache -fcxx-modules -Wall -Wextra -Wno-unused-parameter -Wwrite-strings -Wcast-qual -Wmissing-field-initializers -pedantic -Wno-long-long -Wimplicit-fallthrough -Wcovered-switch-default -Wno-noexcept-type -Wnon-virtual-dtor -Wdelete-non-virtual-dtor -Wstring-conversion -fdiagnostics-color -fprofile-instr-generate='/Users/buildslave/jenkins/workspace/clang-stage2-coverage-R/clang-build/profiles/%6m.profraw' -fcoverage-mapping -fno-common -Woverloaded-virtual -Wno-nested-anon-types -O3 -DNDEBUG -isysroot /Applications/Xcode.app/Contents/Developer/Platforms/MacOSX.platform/Developer/SDKs/MacOSX10.14.sdk    -fno-exceptions -fno-rtti -MD -MT tools/clang/lib/CodeGen/CMakeFiles/obj.clangCodeGen.dir/ObjectFilePCHContainerOperations.cpp.o -MF tools/clang/lib/CodeGen/CMakeFiles/obj.clangCodeGen.dir/ObjectFilePCHContainerOperations.cpp.o.d -o tools/clang/lib/CodeGen/CMakeFiles/obj.clangCodeGen.dir/ObjectFilePCHContainerOperations.cpp.o -c /Users/buildslave/jenkins/workspace/clang-stage2-coverage-R/llvm/tools/clang/lib/CodeGen/ObjectFilePCHContainerOperations.cpp
[3168/4595] /Users/buildslave/jenkins/workspace/clang-stage2-coverage-R/host-compiler/bin/clang++  -DGTEST_HAS_RTTI=0 -D_GNU_SOURCE -D__STDC_CONSTANT_MACROS -D__STDC_FORMAT_MACROS -D__STDC_LIMIT_MACROS -Itools/clang/lib/Analysis -I/Users/buildslave/jenkins/workspace/clang-stage2-coverage-R/llvm/tools/clang/lib/Analysis -I/Users/buildslave/jenkins/workspace/clang-stage2-coverage-R/llvm/tools/clang/include -Itools/clang/include -I/Applications/Xcode.app/Contents/Developer/Platforms/MacOSX.platform/Developer/SDKs/MacOSX10.14.sdk/usr/include/libxml2 -Iinclude -I/Users/buildslave/jenkins/workspace/clang-stage2-coverage-R/llvm/include -fPIC -fvisibility-inlines-hidden -Werror=date-time -Werror=unguarded-availability-new -std=c++11 -fmodules -fmodules-cache-path=/Users/buildslave/jenkins/workspace/clang-stage2-coverage-R/clang-build/module.cache -fcxx-modules -Wall -Wextra -Wno-unused-parameter -Wwrite-strings -Wcast-qual -Wmissing-field-initializers -pedantic -Wno-long-long -Wimplicit-fallthrough -Wcovered-switch-default -Wno-noexcept-type -Wnon-virtual-dtor -Wdelete-non-virtual-dtor -Wstring-conversion -fdiagnostics-color -fprofile-instr-generate='/Users/buildslave/jenkins/workspace/clang-stage2-coverage-R/clang-build/profiles/%6m.profraw' -fcoverage-mapping -fno-common -Woverloaded-virtual -Wno-nested-anon-types -O3 -DNDEBUG -isysroot /Applications/Xcode.app/Contents/Developer/Platforms/MacOSX.platform/Developer/SDKs/MacOSX10.14.sdk    -fno-exceptions -fno-rtti -MD -MT tools/clang/lib/Analysis/CMakeFiles/obj.clangAnalysis.dir/Consumed.cpp.o -MF tools/clang/lib/Analysis/CMakeFiles/obj.clangAnalysis.dir/Consumed.cpp.o.d -o tools/clang/lib/Analysis/CMakeFiles/obj.clangAnalysis.dir/Consumed.cpp.o -c /Users/buildslave/jenkins/workspace/clang-stage2-coverage-R/llvm/tools/clang/lib/Analysis/Consumed.cpp
ninja: build stopped: subcommand failed.
Command failed 
Command: ['/usr/local/bin/ninja', '-v', 'all']
Build step 'Execute shell' marked build as failure
[WARNINGS] Skipping publisher since build result is FAILURE
[BFA] Scanning build for known causes...
[BFA] Found failure cause(s):
[BFA] Ninja target failed from category Compile
[BFA] Compile Error from category Compile
[BFA] Done. 3s
Email was triggered for: Failure - Any
Sending email for trigger: Failure - Any

Hide Details

Begin Pre-Send Script... Username Vedant not found in auth.groovy. This may indicate a problem with the svn-mailer.conf update process. Please check this job: http://green.lab.llvm.org/green/view/Infrastructure/job/Update%20SVN%20email%20list/ User Vedant will need to be notified of the build failure manually.

Hide Details

Username Kumar not found in auth.groovy. This may indicate a problem with the svn-mailer.conf update process. Please check this job: http://green.lab.llvm.org/green/view/Infrastructure/job/Update%20SVN%20email%20list/ User Kumar will need to be notified of the build failure manually.

Hide Details

Sending email to: vsk@apple.com JF Bastien <jfbastien@apple.com> Andi Bergen <abergen@apple.com> Azhar Mohammed <azhar@apple.com> Finished: FAILURE