FailedConsole Output

Skipping 8,452 KB.. Full Log
tual-dtor -Wdelete-non-virtual-dtor -Wstring-conversion -fdiagnostics-color -fprofile-instr-generate='/Users/buildslave/jenkins/workspace/clang-stage2-coverage-R/clang-build/profiles/%6m.profraw' -fcoverage-mapping -fno-common -Woverloaded-virtual -Wno-nested-anon-types -O3 -DNDEBUG -isysroot /Applications/Xcode.app/Contents/Developer/Platforms/MacOSX.platform/Developer/SDKs/MacOSX10.14.sdk -Wl,-search_paths_first -Wl,-headerpad_max_install_names -fprofile-instr-generate='/Users/buildslave/jenkins/workspace/clang-stage2-coverage-R/clang-build/profiles/%6m.profraw' -fcoverage-mapping    -Wl,-dead_strip tools/clang/tools/extra/clang-doc/tool/CMakeFiles/clang-doc.dir/ClangDocMain.cpp.o  -o bin/clang-doc  -Wl,-rpath,@loader_path/../lib lib/libLLVMSupport.a lib/libLLVMBitstreamReader.a lib/libclangAST.a lib/libclangASTMatchers.a lib/libclangBasic.a lib/libclangFrontend.a lib/libclangDoc.a lib/libclangTooling.a lib/libclangToolingCore.a lib/libclangIndex.a lib/libclangFrontend.a lib/libclangDriver.a lib/libclangParse.a lib/libLLVMMCParser.a lib/libLLVMOption.a lib/libLLVMProfileData.a lib/libclangSerialization.a lib/libclangSema.a lib/libclangEdit.a lib/libclangAnalysis.a lib/libclangASTMatchers.a lib/libLLVMBitReader.a lib/libLLVMBitstreamReader.a lib/libclangFormat.a lib/libclangToolingInclusions.a lib/libclangToolingCore.a lib/libclangAST.a lib/libclangRewrite.a lib/libclangLex.a lib/libclangBasic.a lib/libLLVMCore.a lib/libLLVMRemarks.a lib/libLLVMMC.a lib/libLLVMBinaryFormat.a lib/libLLVMDebugInfoCodeView.a lib/libLLVMDebugInfoMSF.a lib/libLLVMSupport.a -lz -lcurses -lm lib/libLLVMDemangle.a && :
[3954/4598] /Users/buildslave/jenkins/workspace/clang-stage2-coverage-R/host-compiler/bin/clang++  -DGTEST_HAS_RTTI=0 -D_GNU_SOURCE -D__STDC_CONSTANT_MACROS -D__STDC_FORMAT_MACROS -D__STDC_LIMIT_MACROS -Itools/clang/tools/extra/clang-include-fixer/find-all-symbols -I/Users/buildslave/jenkins/workspace/clang-stage2-coverage-R/llvm/tools/clang/tools/extra/clang-include-fixer/find-all-symbols -I/Users/buildslave/jenkins/workspace/clang-stage2-coverage-R/llvm/tools/clang/include -Itools/clang/include -I/Applications/Xcode.app/Contents/Developer/Platforms/MacOSX.platform/Developer/SDKs/MacOSX10.14.sdk/usr/include/libxml2 -Iinclude -I/Users/buildslave/jenkins/workspace/clang-stage2-coverage-R/llvm/include -fPIC -fvisibility-inlines-hidden -Werror=date-time -Werror=unguarded-availability-new -std=c++11 -fmodules -fmodules-cache-path=/Users/buildslave/jenkins/workspace/clang-stage2-coverage-R/clang-build/module.cache -fcxx-modules -Wall -Wextra -Wno-unused-parameter -Wwrite-strings -Wcast-qual -Wmissing-field-initializers -pedantic -Wno-long-long -Wimplicit-fallthrough -Wcovered-switch-default -Wno-noexcept-type -Wnon-virtual-dtor -Wdelete-non-virtual-dtor -Wstring-conversion -fdiagnostics-color -fprofile-instr-generate='/Users/buildslave/jenkins/workspace/clang-stage2-coverage-R/clang-build/profiles/%6m.profraw' -fcoverage-mapping -fno-common -Woverloaded-virtual -Wno-nested-anon-types -O3 -DNDEBUG -isysroot /Applications/Xcode.app/Contents/Developer/Platforms/MacOSX.platform/Developer/SDKs/MacOSX10.14.sdk    -fno-exceptions -fno-rtti -MD -MT tools/clang/tools/extra/clang-include-fixer/find-all-symbols/CMakeFiles/obj.findAllSymbols.dir/FindAllSymbolsAction.cpp.o -MF tools/clang/tools/extra/clang-include-fixer/find-all-symbols/CMakeFiles/obj.findAllSymbols.dir/FindAllSymbolsAction.cpp.o.d -o tools/clang/tools/extra/clang-include-fixer/find-all-symbols/CMakeFiles/obj.findAllSymbols.dir/FindAllSymbolsAction.cpp.o -c /Users/buildslave/jenkins/workspace/clang-stage2-coverage-R/llvm/tools/clang/tools/extra/clang-include-fixer/find-all-symbols/FindAllSymbolsAction.cpp
[3955/4598] /Users/buildslave/jenkins/workspace/clang-stage2-coverage-R/host-compiler/bin/clang++  -DGTEST_HAS_RTTI=0 -D_GNU_SOURCE -D__STDC_CONSTANT_MACROS -D__STDC_FORMAT_MACROS -D__STDC_LIMIT_MACROS -Itools/clang/tools/extra/clang-include-fixer/find-all-symbols -I/Users/buildslave/jenkins/workspace/clang-stage2-coverage-R/llvm/tools/clang/tools/extra/clang-include-fixer/find-all-symbols -I/Users/buildslave/jenkins/workspace/clang-stage2-coverage-R/llvm/tools/clang/include -Itools/clang/include -I/Applications/Xcode.app/Contents/Developer/Platforms/MacOSX.platform/Developer/SDKs/MacOSX10.14.sdk/usr/include/libxml2 -Iinclude -I/Users/buildslave/jenkins/workspace/clang-stage2-coverage-R/llvm/include -fPIC -fvisibility-inlines-hidden -Werror=date-time -Werror=unguarded-availability-new -std=c++11 -fmodules -fmodules-cache-path=/Users/buildslave/jenkins/workspace/clang-stage2-coverage-R/clang-build/module.cache -fcxx-modules -Wall -Wextra -Wno-unused-parameter -Wwrite-strings -Wcast-qual -Wmissing-field-initializers -pedantic -Wno-long-long -Wimplicit-fallthrough -Wcovered-switch-default -Wno-noexcept-type -Wnon-virtual-dtor -Wdelete-non-virtual-dtor -Wstring-conversion -fdiagnostics-color -fprofile-instr-generate='/Users/buildslave/jenkins/workspace/clang-stage2-coverage-R/clang-build/profiles/%6m.profraw' -fcoverage-mapping -fno-common -Woverloaded-virtual -Wno-nested-anon-types -O3 -DNDEBUG -isysroot /Applications/Xcode.app/Contents/Developer/Platforms/MacOSX.platform/Developer/SDKs/MacOSX10.14.sdk    -fno-exceptions -fno-rtti -MD -MT tools/clang/tools/extra/clang-include-fixer/find-all-symbols/CMakeFiles/obj.findAllSymbols.dir/SymbolInfo.cpp.o -MF tools/clang/tools/extra/clang-include-fixer/find-all-symbols/CMakeFiles/obj.findAllSymbols.dir/SymbolInfo.cpp.o.d -o tools/clang/tools/extra/clang-include-fixer/find-all-symbols/CMakeFiles/obj.findAllSymbols.dir/SymbolInfo.cpp.o -c /Users/buildslave/jenkins/workspace/clang-stage2-coverage-R/llvm/tools/clang/tools/extra/clang-include-fixer/find-all-symbols/SymbolInfo.cpp
[3956/4598] /Users/buildslave/jenkins/workspace/clang-stage2-coverage-R/host-compiler/bin/clang++  -DGTEST_HAS_RTTI=0 -D_GNU_SOURCE -D__STDC_CONSTANT_MACROS -D__STDC_FORMAT_MACROS -D__STDC_LIMIT_MACROS -Itools/clang/tools/extra/clang-include-fixer/tool -I/Users/buildslave/jenkins/workspace/clang-stage2-coverage-R/llvm/tools/clang/tools/extra/clang-include-fixer/tool -I/Users/buildslave/jenkins/workspace/clang-stage2-coverage-R/llvm/tools/clang/include -Itools/clang/include -I/Applications/Xcode.app/Contents/Developer/Platforms/MacOSX.platform/Developer/SDKs/MacOSX10.14.sdk/usr/include/libxml2 -Iinclude -I/Users/buildslave/jenkins/workspace/clang-stage2-coverage-R/llvm/include -I/Users/buildslave/jenkins/workspace/clang-stage2-coverage-R/llvm/tools/clang/tools/extra/clang-include-fixer/tool/.. -fPIC -fvisibility-inlines-hidden -Werror=date-time -Werror=unguarded-availability-new -std=c++11 -fmodules -fmodules-cache-path=/Users/buildslave/jenkins/workspace/clang-stage2-coverage-R/clang-build/module.cache -fcxx-modules -Wall -Wextra -Wno-unused-parameter -Wwrite-strings -Wcast-qual -Wmissing-field-initializers -pedantic -Wno-long-long -Wimplicit-fallthrough -Wcovered-switch-default -Wno-noexcept-type -Wnon-virtual-dtor -Wdelete-non-virtual-dtor -Wstring-conversion -fdiagnostics-color -fprofile-instr-generate='/Users/buildslave/jenkins/workspace/clang-stage2-coverage-R/clang-build/profiles/%6m.profraw' -fcoverage-mapping -fno-common -Woverloaded-virtual -Wno-nested-anon-types -O3 -DNDEBUG -isysroot /Applications/Xcode.app/Contents/Developer/Platforms/MacOSX.platform/Developer/SDKs/MacOSX10.14.sdk    -fno-exceptions -fno-rtti -MD -MT tools/clang/tools/extra/clang-include-fixer/tool/CMakeFiles/clang-include-fixer.dir/ClangIncludeFixer.cpp.o -MF tools/clang/tools/extra/clang-include-fixer/tool/CMakeFiles/clang-include-fixer.dir/ClangIncludeFixer.cpp.o.d -o tools/clang/tools/extra/clang-include-fixer/tool/CMakeFiles/clang-include-fixer.dir/ClangIncludeFixer.cpp.o -c /Users/buildslave/jenkins/workspace/clang-stage2-coverage-R/llvm/tools/clang/tools/extra/clang-include-fixer/tool/ClangIncludeFixer.cpp
[3957/4598] /Users/buildslave/jenkins/workspace/clang-stage2-coverage-R/host-compiler/bin/clang++  -DGTEST_HAS_RTTI=0 -D_GNU_SOURCE -D__STDC_CONSTANT_MACROS -D__STDC_FORMAT_MACROS -D__STDC_LIMIT_MACROS -Itools/clang/tools/extra/clang-include-fixer/find-all-symbols -I/Users/buildslave/jenkins/workspace/clang-stage2-coverage-R/llvm/tools/clang/tools/extra/clang-include-fixer/find-all-symbols -I/Users/buildslave/jenkins/workspace/clang-stage2-coverage-R/llvm/tools/clang/include -Itools/clang/include -I/Applications/Xcode.app/Contents/Developer/Platforms/MacOSX.platform/Developer/SDKs/MacOSX10.14.sdk/usr/include/libxml2 -Iinclude -I/Users/buildslave/jenkins/workspace/clang-stage2-coverage-R/llvm/include -fPIC -fvisibility-inlines-hidden -Werror=date-time -Werror=unguarded-availability-new -std=c++11 -fmodules -fmodules-cache-path=/Users/buildslave/jenkins/workspace/clang-stage2-coverage-R/clang-build/module.cache -fcxx-modules -Wall -Wextra -Wno-unused-parameter -Wwrite-strings -Wcast-qual -Wmissing-field-initializers -pedantic -Wno-long-long -Wimplicit-fallthrough -Wcovered-switch-default -Wno-noexcept-type -Wnon-virtual-dtor -Wdelete-non-virtual-dtor -Wstring-conversion -fdiagnostics-color -fprofile-instr-generate='/Users/buildslave/jenkins/workspace/clang-stage2-coverage-R/clang-build/profiles/%6m.profraw' -fcoverage-mapping -fno-common -Woverloaded-virtual -Wno-nested-anon-types -O3 -DNDEBUG -isysroot /Applications/Xcode.app/Contents/Developer/Platforms/MacOSX.platform/Developer/SDKs/MacOSX10.14.sdk    -fno-exceptions -fno-rtti -MD -MT tools/clang/tools/extra/clang-include-fixer/find-all-symbols/CMakeFiles/obj.findAllSymbols.dir/PragmaCommentHandler.cpp.o -MF tools/clang/tools/extra/clang-include-fixer/find-all-symbols/CMakeFiles/obj.findAllSymbols.dir/PragmaCommentHandler.cpp.o.d -o tools/clang/tools/extra/clang-include-fixer/find-all-symbols/CMakeFiles/obj.findAllSymbols.dir/PragmaCommentHandler.cpp.o -c /Users/buildslave/jenkins/workspace/clang-stage2-coverage-R/llvm/tools/clang/tools/extra/clang-include-fixer/find-all-symbols/PragmaCommentHandler.cpp
[3958/4598] /Users/buildslave/jenkins/workspace/clang-stage2-coverage-R/host-compiler/bin/clang++  -DGTEST_HAS_RTTI=0 -D_GNU_SOURCE -D__STDC_CONSTANT_MACROS -D__STDC_FORMAT_MACROS -D__STDC_LIMIT_MACROS -Itools/clang/tools/extra/clang-include-fixer/find-all-symbols -I/Users/buildslave/jenkins/workspace/clang-stage2-coverage-R/llvm/tools/clang/tools/extra/clang-include-fixer/find-all-symbols -I/Users/buildslave/jenkins/workspace/clang-stage2-coverage-R/llvm/tools/clang/include -Itools/clang/include -I/Applications/Xcode.app/Contents/Developer/Platforms/MacOSX.platform/Developer/SDKs/MacOSX10.14.sdk/usr/include/libxml2 -Iinclude -I/Users/buildslave/jenkins/workspace/clang-stage2-coverage-R/llvm/include -fPIC -fvisibility-inlines-hidden -Werror=date-time -Werror=unguarded-availability-new -std=c++11 -fmodules -fmodules-cache-path=/Users/buildslave/jenkins/workspace/clang-stage2-coverage-R/clang-build/module.cache -fcxx-modules -Wall -Wextra -Wno-unused-parameter -Wwrite-strings -Wcast-qual -Wmissing-field-initializers -pedantic -Wno-long-long -Wimplicit-fallthrough -Wcovered-switch-default -Wno-noexcept-type -Wnon-virtual-dtor -Wdelete-non-virtual-dtor -Wstring-conversion -fdiagnostics-color -fprofile-instr-generate='/Users/buildslave/jenkins/workspace/clang-stage2-coverage-R/clang-build/profiles/%6m.profraw' -fcoverage-mapping -fno-common -Woverloaded-virtual -Wno-nested-anon-types -O3 -DNDEBUG -isysroot /Applications/Xcode.app/Contents/Developer/Platforms/MacOSX.platform/Developer/SDKs/MacOSX10.14.sdk    -fno-exceptions -fno-rtti -MD -MT tools/clang/tools/extra/clang-include-fixer/find-all-symbols/CMakeFiles/obj.findAllSymbols.dir/FindAllSymbols.cpp.o -MF tools/clang/tools/extra/clang-include-fixer/find-all-symbols/CMakeFiles/obj.findAllSymbols.dir/FindAllSymbols.cpp.o.d -o tools/clang/tools/extra/clang-include-fixer/find-all-symbols/CMakeFiles/obj.findAllSymbols.dir/FindAllSymbols.cpp.o -c /Users/buildslave/jenkins/workspace/clang-stage2-coverage-R/llvm/tools/clang/tools/extra/clang-include-fixer/find-all-symbols/FindAllSymbols.cpp
[3959/4598] : && "/Applications/Xcode.app/Contents/Developer/Toolchains/XcodeDefault.xctoolchain/usr/bin/libtool" -static -no_warning_for_no_symbols -o lib/libfindAllSymbols.a  tools/clang/tools/extra/clang-include-fixer/find-all-symbols/CMakeFiles/obj.findAllSymbols.dir/FindAllSymbols.cpp.o tools/clang/tools/extra/clang-include-fixer/find-all-symbols/CMakeFiles/obj.findAllSymbols.dir/FindAllSymbolsAction.cpp.o tools/clang/tools/extra/clang-include-fixer/find-all-symbols/CMakeFiles/obj.findAllSymbols.dir/FindAllMacros.cpp.o tools/clang/tools/extra/clang-include-fixer/find-all-symbols/CMakeFiles/obj.findAllSymbols.dir/HeaderMapCollector.cpp.o tools/clang/tools/extra/clang-include-fixer/find-all-symbols/CMakeFiles/obj.findAllSymbols.dir/PathConfig.cpp.o tools/clang/tools/extra/clang-include-fixer/find-all-symbols/CMakeFiles/obj.findAllSymbols.dir/PragmaCommentHandler.cpp.o tools/clang/tools/extra/clang-include-fixer/find-all-symbols/CMakeFiles/obj.findAllSymbols.dir/STLPostfixHeaderMap.cpp.o tools/clang/tools/extra/clang-include-fixer/find-all-symbols/CMakeFiles/obj.findAllSymbols.dir/SymbolInfo.cpp.o && :
[3960/4598] /Users/buildslave/jenkins/workspace/clang-stage2-coverage-R/host-compiler/bin/clang++  -DGTEST_HAS_RTTI=0 -D_GNU_SOURCE -D__STDC_CONSTANT_MACROS -D__STDC_FORMAT_MACROS -D__STDC_LIMIT_MACROS -Itools/clang/tools/extra/clang-include-fixer/find-all-symbols/tool -I/Users/buildslave/jenkins/workspace/clang-stage2-coverage-R/llvm/tools/clang/tools/extra/clang-include-fixer/find-all-symbols/tool -I/Users/buildslave/jenkins/workspace/clang-stage2-coverage-R/llvm/tools/clang/include -Itools/clang/include -I/Applications/Xcode.app/Contents/Developer/Platforms/MacOSX.platform/Developer/SDKs/MacOSX10.14.sdk/usr/include/libxml2 -Iinclude -I/Users/buildslave/jenkins/workspace/clang-stage2-coverage-R/llvm/include -I/Users/buildslave/jenkins/workspace/clang-stage2-coverage-R/llvm/tools/clang/tools/extra/clang-include-fixer/find-all-symbols/tool/.. -fPIC -fvisibility-inlines-hidden -Werror=date-time -Werror=unguarded-availability-new -std=c++11 -fmodules -fmodules-cache-path=/Users/buildslave/jenkins/workspace/clang-stage2-coverage-R/clang-build/module.cache -fcxx-modules -Wall -Wextra -Wno-unused-parameter -Wwrite-strings -Wcast-qual -Wmissing-field-initializers -pedantic -Wno-long-long -Wimplicit-fallthrough -Wcovered-switch-default -Wno-noexcept-type -Wnon-virtual-dtor -Wdelete-non-virtual-dtor -Wstring-conversion -fdiagnostics-color -fprofile-instr-generate='/Users/buildslave/jenkins/workspace/clang-stage2-coverage-R/clang-build/profiles/%6m.profraw' -fcoverage-mapping -fno-common -Woverloaded-virtual -Wno-nested-anon-types -O3 -DNDEBUG -isysroot /Applications/Xcode.app/Contents/Developer/Platforms/MacOSX.platform/Developer/SDKs/MacOSX10.14.sdk    -fno-exceptions -fno-rtti -MD -MT tools/clang/tools/extra/clang-include-fixer/find-all-symbols/tool/CMakeFiles/find-all-symbols.dir/FindAllSymbolsMain.cpp.o -MF tools/clang/tools/extra/clang-include-fixer/find-all-symbols/tool/CMakeFiles/find-all-symbols.dir/FindAllSymbolsMain.cpp.o.d -o tools/clang/tools/extra/clang-include-fixer/find-all-symbols/tool/CMakeFiles/find-all-symbols.dir/FindAllSymbolsMain.cpp.o -c /Users/buildslave/jenkins/workspace/clang-stage2-coverage-R/llvm/tools/clang/tools/extra/clang-include-fixer/find-all-symbols/tool/FindAllSymbolsMain.cpp
[3961/4598] /Users/buildslave/jenkins/workspace/clang-stage2-coverage-R/host-compiler/bin/clang++  -DGTEST_HAS_RTTI=0 -D_GNU_SOURCE -D__STDC_CONSTANT_MACROS -D__STDC_FORMAT_MACROS -D__STDC_LIMIT_MACROS -Itools/clang/tools/extra/clang-move -I/Users/buildslave/jenkins/workspace/clang-stage2-coverage-R/llvm/tools/clang/tools/extra/clang-move -I/Users/buildslave/jenkins/workspace/clang-stage2-coverage-R/llvm/tools/clang/include -Itools/clang/include -I/Applications/Xcode.app/Contents/Developer/Platforms/MacOSX.platform/Developer/SDKs/MacOSX10.14.sdk/usr/include/libxml2 -Iinclude -I/Users/buildslave/jenkins/workspace/clang-stage2-coverage-R/llvm/include -fPIC -fvisibility-inlines-hidden -Werror=date-time -Werror=unguarded-availability-new -std=c++11 -fmodules -fmodules-cache-path=/Users/buildslave/jenkins/workspace/clang-stage2-coverage-R/clang-build/module.cache -fcxx-modules -Wall -Wextra -Wno-unused-parameter -Wwrite-strings -Wcast-qual -Wmissing-field-initializers -pedantic -Wno-long-long -Wimplicit-fallthrough -Wcovered-switch-default -Wno-noexcept-type -Wnon-virtual-dtor -Wdelete-non-virtual-dtor -Wstring-conversion -fdiagnostics-color -fprofile-instr-generate='/Users/buildslave/jenkins/workspace/clang-stage2-coverage-R/clang-build/profiles/%6m.profraw' -fcoverage-mapping -fno-common -Woverloaded-virtual -Wno-nested-anon-types -O3 -DNDEBUG -isysroot /Applications/Xcode.app/Contents/Developer/Platforms/MacOSX.platform/Developer/SDKs/MacOSX10.14.sdk    -fno-exceptions -fno-rtti -MD -MT tools/clang/tools/extra/clang-move/CMakeFiles/obj.clangMove.dir/HelperDeclRefGraph.cpp.o -MF tools/clang/tools/extra/clang-move/CMakeFiles/obj.clangMove.dir/HelperDeclRefGraph.cpp.o.d -o tools/clang/tools/extra/clang-move/CMakeFiles/obj.clangMove.dir/HelperDeclRefGraph.cpp.o -c /Users/buildslave/jenkins/workspace/clang-stage2-coverage-R/llvm/tools/clang/tools/extra/clang-move/HelperDeclRefGraph.cpp
[3962/4598] : && /Users/buildslave/jenkins/workspace/clang-stage2-coverage-R/host-compiler/bin/clang++  -fPIC -fvisibility-inlines-hidden -Werror=date-time -Werror=unguarded-availability-new -std=c++11 -fmodules -fmodules-cache-path=/Users/buildslave/jenkins/workspace/clang-stage2-coverage-R/clang-build/module.cache -fcxx-modules -Wall -Wextra -Wno-unused-parameter -Wwrite-strings -Wcast-qual -Wmissing-field-initializers -pedantic -Wno-long-long -Wimplicit-fallthrough -Wcovered-switch-default -Wno-noexcept-type -Wnon-virtual-dtor -Wdelete-non-virtual-dtor -Wstring-conversion -fdiagnostics-color -fprofile-instr-generate='/Users/buildslave/jenkins/workspace/clang-stage2-coverage-R/clang-build/profiles/%6m.profraw' -fcoverage-mapping -fno-common -Woverloaded-virtual -Wno-nested-anon-types -O3 -DNDEBUG -isysroot /Applications/Xcode.app/Contents/Developer/Platforms/MacOSX.platform/Developer/SDKs/MacOSX10.14.sdk -Wl,-search_paths_first -Wl,-headerpad_max_install_names -fprofile-instr-generate='/Users/buildslave/jenkins/workspace/clang-stage2-coverage-R/clang-build/profiles/%6m.profraw' -fcoverage-mapping    -Wl,-dead_strip tools/clang/tools/extra/clang-include-fixer/tool/CMakeFiles/clang-include-fixer.dir/ClangIncludeFixer.cpp.o  -o bin/clang-include-fixer  -Wl,-rpath,@loader_path/../lib lib/libLLVMSupport.a lib/libclangBasic.a lib/libclangFormat.a lib/libclangFrontend.a lib/libclangIncludeFixer.a lib/libclangRewrite.a lib/libclangSerialization.a lib/libclangTooling.a lib/libclangToolingCore.a lib/libfindAllSymbols.a lib/libclangTooling.a lib/libclangFormat.a lib/libclangToolingInclusions.a lib/libclangFrontend.a lib/libLLVMProfileData.a lib/libclangSerialization.a lib/libLLVMBitReader.a lib/libLLVMBitstreamReader.a lib/libclangToolingCore.a lib/libclangRewrite.a lib/libclangDriver.a lib/libLLVMOption.a lib/libclangParse.a lib/libLLVMMCParser.a lib/libclangSema.a lib/libclangEdit.a lib/libclangAnalysis.a lib/libclangASTMatchers.a lib/libclangAST.a lib/libclangLex.a lib/libclangBasic.a lib/libLLVMCore.a lib/libLLVMRemarks.a lib/libLLVMMC.a lib/libLLVMDebugInfoCodeView.a lib/libLLVMDebugInfoMSF.a lib/libLLVMBinaryFormat.a lib/libLLVMSupport.a -lz -lcurses -lm lib/libLLVMDemangle.a && :
[3963/4598] /Users/buildslave/jenkins/workspace/clang-stage2-coverage-R/host-compiler/bin/clang++  -DGTEST_HAS_RTTI=0 -D_GNU_SOURCE -D__STDC_CONSTANT_MACROS -D__STDC_FORMAT_MACROS -D__STDC_LIMIT_MACROS -Itools/clang/tools/extra/clang-query -I/Users/buildslave/jenkins/workspace/clang-stage2-coverage-R/llvm/tools/clang/tools/extra/clang-query -I/Users/buildslave/jenkins/workspace/clang-stage2-coverage-R/llvm/tools/clang/include -Itools/clang/include -I/Applications/Xcode.app/Contents/Developer/Platforms/MacOSX.platform/Developer/SDKs/MacOSX10.14.sdk/usr/include/libxml2 -Iinclude -I/Users/buildslave/jenkins/workspace/clang-stage2-coverage-R/llvm/include -fPIC -fvisibility-inlines-hidden -Werror=date-time -Werror=unguarded-availability-new -std=c++11 -fmodules -fmodules-cache-path=/Users/buildslave/jenkins/workspace/clang-stage2-coverage-R/clang-build/module.cache -fcxx-modules -Wall -Wextra -Wno-unused-parameter -Wwrite-strings -Wcast-qual -Wmissing-field-initializers -pedantic -Wno-long-long -Wimplicit-fallthrough -Wcovered-switch-default -Wno-noexcept-type -Wnon-virtual-dtor -Wdelete-non-virtual-dtor -Wstring-conversion -fdiagnostics-color -fprofile-instr-generate='/Users/buildslave/jenkins/workspace/clang-stage2-coverage-R/clang-build/profiles/%6m.profraw' -fcoverage-mapping -fno-common -Woverloaded-virtual -Wno-nested-anon-types -O3 -DNDEBUG -isysroot /Applications/Xcode.app/Contents/Developer/Platforms/MacOSX.platform/Developer/SDKs/MacOSX10.14.sdk    -fno-exceptions -fno-rtti -MD -MT tools/clang/tools/extra/clang-query/CMakeFiles/obj.clangQuery.dir/Query.cpp.o -MF tools/clang/tools/extra/clang-query/CMakeFiles/obj.clangQuery.dir/Query.cpp.o.d -o tools/clang/tools/extra/clang-query/CMakeFiles/obj.clangQuery.dir/Query.cpp.o -c /Users/buildslave/jenkins/workspace/clang-stage2-coverage-R/llvm/tools/clang/tools/extra/clang-query/Query.cpp
[3964/4598] /Users/buildslave/jenkins/workspace/clang-stage2-coverage-R/host-compiler/bin/clang++  -DGTEST_HAS_RTTI=0 -D_GNU_SOURCE -D__STDC_CONSTANT_MACROS -D__STDC_FORMAT_MACROS -D__STDC_LIMIT_MACROS -Itools/clang/tools/extra/clang-move/tool -I/Users/buildslave/jenkins/workspace/clang-stage2-coverage-R/llvm/tools/clang/tools/extra/clang-move/tool -I/Users/buildslave/jenkins/workspace/clang-stage2-coverage-R/llvm/tools/clang/include -Itools/clang/include -I/Applications/Xcode.app/Contents/Developer/Platforms/MacOSX.platform/Developer/SDKs/MacOSX10.14.sdk/usr/include/libxml2 -Iinclude -I/Users/buildslave/jenkins/workspace/clang-stage2-coverage-R/llvm/include -I/Users/buildslave/jenkins/workspace/clang-stage2-coverage-R/llvm/tools/clang/tools/extra/clang-move/tool/.. -fPIC -fvisibility-inlines-hidden -Werror=date-time -Werror=unguarded-availability-new -std=c++11 -fmodules -fmodules-cache-path=/Users/buildslave/jenkins/workspace/clang-stage2-coverage-R/clang-build/module.cache -fcxx-modules -Wall -Wextra -Wno-unused-parameter -Wwrite-strings -Wcast-qual -Wmissing-field-initializers -pedantic -Wno-long-long -Wimplicit-fallthrough -Wcovered-switch-default -Wno-noexcept-type -Wnon-virtual-dtor -Wdelete-non-virtual-dtor -Wstring-conversion -fdiagnostics-color -fprofile-instr-generate='/Users/buildslave/jenkins/workspace/clang-stage2-coverage-R/clang-build/profiles/%6m.profraw' -fcoverage-mapping -fno-common -Woverloaded-virtual -Wno-nested-anon-types -O3 -DNDEBUG -isysroot /Applications/Xcode.app/Contents/Developer/Platforms/MacOSX.platform/Developer/SDKs/MacOSX10.14.sdk    -fno-exceptions -fno-rtti -MD -MT tools/clang/tools/extra/clang-move/tool/CMakeFiles/clang-move.dir/ClangMove.cpp.o -MF tools/clang/tools/extra/clang-move/tool/CMakeFiles/clang-move.dir/ClangMove.cpp.o.d -o tools/clang/tools/extra/clang-move/tool/CMakeFiles/clang-move.dir/ClangMove.cpp.o -c /Users/buildslave/jenkins/workspace/clang-stage2-coverage-R/llvm/tools/clang/tools/extra/clang-move/tool/ClangMove.cpp
[3965/4598] /Users/buildslave/jenkins/workspace/clang-stage2-coverage-R/host-compiler/bin/clang++  -DGTEST_HAS_RTTI=0 -D_GNU_SOURCE -D__STDC_CONSTANT_MACROS -D__STDC_FORMAT_MACROS -D__STDC_LIMIT_MACROS -Itools/clang/tools/extra/pp-trace -I/Users/buildslave/jenkins/workspace/clang-stage2-coverage-R/llvm/tools/clang/tools/extra/pp-trace -I/Users/buildslave/jenkins/workspace/clang-stage2-coverage-R/llvm/tools/clang/include -Itools/clang/include -I/Applications/Xcode.app/Contents/Developer/Platforms/MacOSX.platform/Developer/SDKs/MacOSX10.14.sdk/usr/include/libxml2 -Iinclude -I/Users/buildslave/jenkins/workspace/clang-stage2-coverage-R/llvm/include -fPIC -fvisibility-inlines-hidden -Werror=date-time -Werror=unguarded-availability-new -std=c++11 -fmodules -fmodules-cache-path=/Users/buildslave/jenkins/workspace/clang-stage2-coverage-R/clang-build/module.cache -fcxx-modules -Wall -Wextra -Wno-unused-parameter -Wwrite-strings -Wcast-qual -Wmissing-field-initializers -pedantic -Wno-long-long -Wimplicit-fallthrough -Wcovered-switch-default -Wno-noexcept-type -Wnon-virtual-dtor -Wdelete-non-virtual-dtor -Wstring-conversion -fdiagnostics-color -fprofile-instr-generate='/Users/buildslave/jenkins/workspace/clang-stage2-coverage-R/clang-build/profiles/%6m.profraw' -fcoverage-mapping -fno-common -Woverloaded-virtual -Wno-nested-anon-types -O3 -DNDEBUG -isysroot /Applications/Xcode.app/Contents/Developer/Platforms/MacOSX.platform/Developer/SDKs/MacOSX10.14.sdk    -fno-exceptions -fno-rtti -MD -MT tools/clang/tools/extra/pp-trace/CMakeFiles/pp-trace.dir/PPCallbacksTracker.cpp.o -MF tools/clang/tools/extra/pp-trace/CMakeFiles/pp-trace.dir/PPCallbacksTracker.cpp.o.d -o tools/clang/tools/extra/pp-trace/CMakeFiles/pp-trace.dir/PPCallbacksTracker.cpp.o -c /Users/buildslave/jenkins/workspace/clang-stage2-coverage-R/llvm/tools/clang/tools/extra/pp-trace/PPCallbacksTracker.cpp
[3966/4598] : && /Users/buildslave/jenkins/workspace/clang-stage2-coverage-R/host-compiler/bin/clang++  -fPIC -fvisibility-inlines-hidden -Werror=date-time -Werror=unguarded-availability-new -std=c++11 -fmodules -fmodules-cache-path=/Users/buildslave/jenkins/workspace/clang-stage2-coverage-R/clang-build/module.cache -fcxx-modules -Wall -Wextra -Wno-unused-parameter -Wwrite-strings -Wcast-qual -Wmissing-field-initializers -pedantic -Wno-long-long -Wimplicit-fallthrough -Wcovered-switch-default -Wno-noexcept-type -Wnon-virtual-dtor -Wdelete-non-virtual-dtor -Wstring-conversion -fdiagnostics-color -fprofile-instr-generate='/Users/buildslave/jenkins/workspace/clang-stage2-coverage-R/clang-build/profiles/%6m.profraw' -fcoverage-mapping -fno-common -Woverloaded-virtual -Wno-nested-anon-types -O3 -DNDEBUG -isysroot /Applications/Xcode.app/Contents/Developer/Platforms/MacOSX.platform/Developer/SDKs/MacOSX10.14.sdk -Wl,-search_paths_first -Wl,-headerpad_max_install_names -fprofile-instr-generate='/Users/buildslave/jenkins/workspace/clang-stage2-coverage-R/clang-build/profiles/%6m.profraw' -fcoverage-mapping    -Wl,-dead_strip tools/clang/tools/extra/clang-include-fixer/find-all-symbols/tool/CMakeFiles/find-all-symbols.dir/FindAllSymbolsMain.cpp.o  -o bin/find-all-symbols  -Wl,-rpath,@loader_path/../lib lib/libLLVMSupport.a lib/libclangAST.a lib/libclangASTMatchers.a lib/libclangBasic.a lib/libclangFrontend.a lib/libclangLex.a lib/libclangSerialization.a lib/libclangTooling.a lib/libfindAllSymbols.a lib/libclangTooling.a lib/libclangFrontend.a lib/libclangParse.a lib/libLLVMMCParser.a lib/libLLVMProfileData.a lib/libclangSerialization.a lib/libclangSema.a lib/libclangEdit.a lib/libclangAnalysis.a lib/libclangASTMatchers.a lib/libLLVMBitReader.a lib/libLLVMBitstreamReader.a lib/libclangDriver.a lib/libLLVMOption.a lib/libclangFormat.a lib/libclangToolingInclusions.a lib/libclangToolingCore.a lib/libclangAST.a lib/libclangRewrite.a lib/libclangLex.a lib/libclangBasic.a lib/libLLVMCore.a lib/libLLVMRemarks.a lib/libLLVMMC.a lib/libLLVMBinaryFormat.a lib/libLLVMDebugInfoCodeView.a lib/libLLVMDebugInfoMSF.a lib/libLLVMSupport.a -lz -lcurses -lm lib/libLLVMDemangle.a && :
[3967/4598] /Users/buildslave/jenkins/workspace/clang-stage2-coverage-R/host-compiler/bin/clang++  -DGTEST_HAS_RTTI=0 -D_GNU_SOURCE -D__STDC_CONSTANT_MACROS -D__STDC_FORMAT_MACROS -D__STDC_LIMIT_MACROS -Itools/clang/tools/extra/clang-query -I/Users/buildslave/jenkins/workspace/clang-stage2-coverage-R/llvm/tools/clang/tools/extra/clang-query -I/Users/buildslave/jenkins/workspace/clang-stage2-coverage-R/llvm/tools/clang/include -Itools/clang/include -I/Applications/Xcode.app/Contents/Developer/Platforms/MacOSX.platform/Developer/SDKs/MacOSX10.14.sdk/usr/include/libxml2 -Iinclude -I/Users/buildslave/jenkins/workspace/clang-stage2-coverage-R/llvm/include -fPIC -fvisibility-inlines-hidden -Werror=date-time -Werror=unguarded-availability-new -std=c++11 -fmodules -fmodules-cache-path=/Users/buildslave/jenkins/workspace/clang-stage2-coverage-R/clang-build/module.cache -fcxx-modules -Wall -Wextra -Wno-unused-parameter -Wwrite-strings -Wcast-qual -Wmissing-field-initializers -pedantic -Wno-long-long -Wimplicit-fallthrough -Wcovered-switch-default -Wno-noexcept-type -Wnon-virtual-dtor -Wdelete-non-virtual-dtor -Wstring-conversion -fdiagnostics-color -fprofile-instr-generate='/Users/buildslave/jenkins/workspace/clang-stage2-coverage-R/clang-build/profiles/%6m.profraw' -fcoverage-mapping -fno-common -Woverloaded-virtual -Wno-nested-anon-types -O3 -DNDEBUG -isysroot /Applications/Xcode.app/Contents/Developer/Platforms/MacOSX.platform/Developer/SDKs/MacOSX10.14.sdk    -fno-exceptions -fno-rtti -MD -MT tools/clang/tools/extra/clang-query/CMakeFiles/obj.clangQuery.dir/QueryParser.cpp.o -MF tools/clang/tools/extra/clang-query/CMakeFiles/obj.clangQuery.dir/QueryParser.cpp.o.d -o tools/clang/tools/extra/clang-query/CMakeFiles/obj.clangQuery.dir/QueryParser.cpp.o -c /Users/buildslave/jenkins/workspace/clang-stage2-coverage-R/llvm/tools/clang/tools/extra/clang-query/QueryParser.cpp
[3968/4598] : && "/Applications/Xcode.app/Contents/Developer/Toolchains/XcodeDefault.xctoolchain/usr/bin/libtool" -static -no_warning_for_no_symbols -o lib/libclangQuery.a  tools/clang/tools/extra/clang-query/CMakeFiles/obj.clangQuery.dir/Query.cpp.o tools/clang/tools/extra/clang-query/CMakeFiles/obj.clangQuery.dir/QueryParser.cpp.o && :
[3969/4598] /Users/buildslave/jenkins/workspace/clang-stage2-coverage-R/host-compiler/bin/clang++  -DGTEST_HAS_RTTI=0 -D_GNU_SOURCE -D__STDC_CONSTANT_MACROS -D__STDC_FORMAT_MACROS -D__STDC_LIMIT_MACROS -Itools/clang/tools/extra/clang-move -I/Users/buildslave/jenkins/workspace/clang-stage2-coverage-R/llvm/tools/clang/tools/extra/clang-move -I/Users/buildslave/jenkins/workspace/clang-stage2-coverage-R/llvm/tools/clang/include -Itools/clang/include -I/Applications/Xcode.app/Contents/Developer/Platforms/MacOSX.platform/Developer/SDKs/MacOSX10.14.sdk/usr/include/libxml2 -Iinclude -I/Users/buildslave/jenkins/workspace/clang-stage2-coverage-R/llvm/include -fPIC -fvisibility-inlines-hidden -Werror=date-time -Werror=unguarded-availability-new -std=c++11 -fmodules -fmodules-cache-path=/Users/buildslave/jenkins/workspace/clang-stage2-coverage-R/clang-build/module.cache -fcxx-modules -Wall -Wextra -Wno-unused-parameter -Wwrite-strings -Wcast-qual -Wmissing-field-initializers -pedantic -Wno-long-long -Wimplicit-fallthrough -Wcovered-switch-default -Wno-noexcept-type -Wnon-virtual-dtor -Wdelete-non-virtual-dtor -Wstring-conversion -fdiagnostics-color -fprofile-instr-generate='/Users/buildslave/jenkins/workspace/clang-stage2-coverage-R/clang-build/profiles/%6m.profraw' -fcoverage-mapping -fno-common -Woverloaded-virtual -Wno-nested-anon-types -O3 -DNDEBUG -isysroot /Applications/Xcode.app/Contents/Developer/Platforms/MacOSX.platform/Developer/SDKs/MacOSX10.14.sdk    -fno-exceptions -fno-rtti -MD -MT tools/clang/tools/extra/clang-move/CMakeFiles/obj.clangMove.dir/Move.cpp.o -MF tools/clang/tools/extra/clang-move/CMakeFiles/obj.clangMove.dir/Move.cpp.o.d -o tools/clang/tools/extra/clang-move/CMakeFiles/obj.clangMove.dir/Move.cpp.o -c /Users/buildslave/jenkins/workspace/clang-stage2-coverage-R/llvm/tools/clang/tools/extra/clang-move/Move.cpp
[3970/4598] : && "/Applications/Xcode.app/Contents/Developer/Toolchains/XcodeDefault.xctoolchain/usr/bin/libtool" -static -no_warning_for_no_symbols -o lib/libclangMove.a  tools/clang/tools/extra/clang-move/CMakeFiles/obj.clangMove.dir/Move.cpp.o tools/clang/tools/extra/clang-move/CMakeFiles/obj.clangMove.dir/HelperDeclRefGraph.cpp.o && :
[3971/4598] /Users/buildslave/jenkins/workspace/clang-stage2-coverage-R/host-compiler/bin/clang++  -DGTEST_HAS_RTTI=0 -D_GNU_SOURCE -D__STDC_CONSTANT_MACROS -D__STDC_FORMAT_MACROS -D__STDC_LIMIT_MACROS -Itools/clang/tools/extra/clangd -I/Users/buildslave/jenkins/workspace/clang-stage2-coverage-R/llvm/tools/clang/tools/extra/clangd -I/Users/buildslave/jenkins/workspace/clang-stage2-coverage-R/llvm/tools/clang/include -Itools/clang/include -I/Applications/Xcode.app/Contents/Developer/Platforms/MacOSX.platform/Developer/SDKs/MacOSX10.14.sdk/usr/include/libxml2 -Iinclude -I/Users/buildslave/jenkins/workspace/clang-stage2-coverage-R/llvm/include -fPIC -fvisibility-inlines-hidden -Werror=date-time -Werror=unguarded-availability-new -std=c++11 -fmodules -fmodules-cache-path=/Users/buildslave/jenkins/workspace/clang-stage2-coverage-R/clang-build/module.cache -fcxx-modules -Wall -Wextra -Wno-unused-parameter -Wwrite-strings -Wcast-qual -Wmissing-field-initializers -pedantic -Wno-long-long -Wimplicit-fallthrough -Wcovered-switch-default -Wno-noexcept-type -Wnon-virtual-dtor -Wdelete-non-virtual-dtor -Wstring-conversion -fdiagnostics-color -fprofile-instr-generate='/Users/buildslave/jenkins/workspace/clang-stage2-coverage-R/clang-build/profiles/%6m.profraw' -fcoverage-mapping -fno-common -Woverloaded-virtual -Wno-nested-anon-types -O3 -DNDEBUG -isysroot /Applications/Xcode.app/Contents/Developer/Platforms/MacOSX.platform/Developer/SDKs/MacOSX10.14.sdk    -fno-exceptions -fno-rtti -MD -MT tools/clang/tools/extra/clangd/CMakeFiles/obj.clangDaemon.dir/AST.cpp.o -MF tools/clang/tools/extra/clangd/CMakeFiles/obj.clangDaemon.dir/AST.cpp.o.d -o tools/clang/tools/extra/clangd/CMakeFiles/obj.clangDaemon.dir/AST.cpp.o -c /Users/buildslave/jenkins/workspace/clang-stage2-coverage-R/llvm/tools/clang/tools/extra/clangd/AST.cpp
[3972/4598] /Users/buildslave/jenkins/workspace/clang-stage2-coverage-R/host-compiler/bin/clang++  -DGTEST_HAS_RTTI=0 -D_GNU_SOURCE -D__STDC_CONSTANT_MACROS -D__STDC_FORMAT_MACROS -D__STDC_LIMIT_MACROS -Itools/clang/tools/extra/clangd -I/Users/buildslave/jenkins/workspace/clang-stage2-coverage-R/llvm/tools/clang/tools/extra/clangd -I/Users/buildslave/jenkins/workspace/clang-stage2-coverage-R/llvm/tools/clang/include -Itools/clang/include -I/Applications/Xcode.app/Contents/Developer/Platforms/MacOSX.platform/Developer/SDKs/MacOSX10.14.sdk/usr/include/libxml2 -Iinclude -I/Users/buildslave/jenkins/workspace/clang-stage2-coverage-R/llvm/include -fPIC -fvisibility-inlines-hidden -Werror=date-time -Werror=unguarded-availability-new -std=c++11 -fmodules -fmodules-cache-path=/Users/buildslave/jenkins/workspace/clang-stage2-coverage-R/clang-build/module.cache -fcxx-modules -Wall -Wextra -Wno-unused-parameter -Wwrite-strings -Wcast-qual -Wmissing-field-initializers -pedantic -Wno-long-long -Wimplicit-fallthrough -Wcovered-switch-default -Wno-noexcept-type -Wnon-virtual-dtor -Wdelete-non-virtual-dtor -Wstring-conversion -fdiagnostics-color -fprofile-instr-generate='/Users/buildslave/jenkins/workspace/clang-stage2-coverage-R/clang-build/profiles/%6m.profraw' -fcoverage-mapping -fno-common -Woverloaded-virtual -Wno-nested-anon-types -O3 -DNDEBUG -isysroot /Applications/Xcode.app/Contents/Developer/Platforms/MacOSX.platform/Developer/SDKs/MacOSX10.14.sdk    -fno-exceptions -fno-rtti -MD -MT tools/clang/tools/extra/clangd/CMakeFiles/obj.clangDaemon.dir/Cancellation.cpp.o -MF tools/clang/tools/extra/clangd/CMakeFiles/obj.clangDaemon.dir/Cancellation.cpp.o.d -o tools/clang/tools/extra/clangd/CMakeFiles/obj.clangDaemon.dir/Cancellation.cpp.o -c /Users/buildslave/jenkins/workspace/clang-stage2-coverage-R/llvm/tools/clang/tools/extra/clangd/Cancellation.cpp
[3973/4598] /Users/buildslave/jenkins/workspace/clang-stage2-coverage-R/host-compiler/bin/clang++  -DGTEST_HAS_RTTI=0 -D_GNU_SOURCE -D__STDC_CONSTANT_MACROS -D__STDC_FORMAT_MACROS -D__STDC_LIMIT_MACROS -Itools/clang/tools/extra/clang-query/tool -I/Users/buildslave/jenkins/workspace/clang-stage2-coverage-R/llvm/tools/clang/tools/extra/clang-query/tool -I/Users/buildslave/jenkins/workspace/clang-stage2-coverage-R/llvm/tools/clang/include -Itools/clang/include -I/Applications/Xcode.app/Contents/Developer/Platforms/MacOSX.platform/Developer/SDKs/MacOSX10.14.sdk/usr/include/libxml2 -Iinclude -I/Users/buildslave/jenkins/workspace/clang-stage2-coverage-R/llvm/include -I/Users/buildslave/jenkins/workspace/clang-stage2-coverage-R/llvm/tools/clang/tools/extra/clang-query/tool/.. -fPIC -fvisibility-inlines-hidden -Werror=date-time -Werror=unguarded-availability-new -std=c++11 -fmodules -fmodules-cache-path=/Users/buildslave/jenkins/workspace/clang-stage2-coverage-R/clang-build/module.cache -fcxx-modules -Wall -Wextra -Wno-unused-parameter -Wwrite-strings -Wcast-qual -Wmissing-field-initializers -pedantic -Wno-long-long -Wimplicit-fallthrough -Wcovered-switch-default -Wno-noexcept-type -Wnon-virtual-dtor -Wdelete-non-virtual-dtor -Wstring-conversion -fdiagnostics-color -fprofile-instr-generate='/Users/buildslave/jenkins/workspace/clang-stage2-coverage-R/clang-build/profiles/%6m.profraw' -fcoverage-mapping -fno-common -Woverloaded-virtual -Wno-nested-anon-types -O3 -DNDEBUG -isysroot /Applications/Xcode.app/Contents/Developer/Platforms/MacOSX.platform/Developer/SDKs/MacOSX10.14.sdk    -fno-exceptions -fno-rtti -MD -MT tools/clang/tools/extra/clang-query/tool/CMakeFiles/clang-query.dir/ClangQuery.cpp.o -MF tools/clang/tools/extra/clang-query/tool/CMakeFiles/clang-query.dir/ClangQuery.cpp.o.d -o tools/clang/tools/extra/clang-query/tool/CMakeFiles/clang-query.dir/ClangQuery.cpp.o -c /Users/buildslave/jenkins/workspace/clang-stage2-coverage-R/llvm/tools/clang/tools/extra/clang-query/tool/ClangQuery.cpp
[3974/4598] /Users/buildslave/jenkins/workspace/clang-stage2-coverage-R/host-compiler/bin/clang++  -DGTEST_HAS_RTTI=0 -D_GNU_SOURCE -D__STDC_CONSTANT_MACROS -D__STDC_FORMAT_MACROS -D__STDC_LIMIT_MACROS -Itools/clang/tools/extra/pp-trace -I/Users/buildslave/jenkins/workspace/clang-stage2-coverage-R/llvm/tools/clang/tools/extra/pp-trace -I/Users/buildslave/jenkins/workspace/clang-stage2-coverage-R/llvm/tools/clang/include -Itools/clang/include -I/Applications/Xcode.app/Contents/Developer/Platforms/MacOSX.platform/Developer/SDKs/MacOSX10.14.sdk/usr/include/libxml2 -Iinclude -I/Users/buildslave/jenkins/workspace/clang-stage2-coverage-R/llvm/include -fPIC -fvisibility-inlines-hidden -Werror=date-time -Werror=unguarded-availability-new -std=c++11 -fmodules -fmodules-cache-path=/Users/buildslave/jenkins/workspace/clang-stage2-coverage-R/clang-build/module.cache -fcxx-modules -Wall -Wextra -Wno-unused-parameter -Wwrite-strings -Wcast-qual -Wmissing-field-initializers -pedantic -Wno-long-long -Wimplicit-fallthrough -Wcovered-switch-default -Wno-noexcept-type -Wnon-virtual-dtor -Wdelete-non-virtual-dtor -Wstring-conversion -fdiagnostics-color -fprofile-instr-generate='/Users/buildslave/jenkins/workspace/clang-stage2-coverage-R/clang-build/profiles/%6m.profraw' -fcoverage-mapping -fno-common -Woverloaded-virtual -Wno-nested-anon-types -O3 -DNDEBUG -isysroot /Applications/Xcode.app/Contents/Developer/Platforms/MacOSX.platform/Developer/SDKs/MacOSX10.14.sdk    -fno-exceptions -fno-rtti -MD -MT tools/clang/tools/extra/pp-trace/CMakeFiles/pp-trace.dir/PPTrace.cpp.o -MF tools/clang/tools/extra/pp-trace/CMakeFiles/pp-trace.dir/PPTrace.cpp.o.d -o tools/clang/tools/extra/pp-trace/CMakeFiles/pp-trace.dir/PPTrace.cpp.o -c /Users/buildslave/jenkins/workspace/clang-stage2-coverage-R/llvm/tools/clang/tools/extra/pp-trace/PPTrace.cpp
[3975/4598] /Users/buildslave/jenkins/workspace/clang-stage2-coverage-R/host-compiler/bin/clang++  -DGTEST_HAS_RTTI=0 -D_GNU_SOURCE -D__STDC_CONSTANT_MACROS -D__STDC_FORMAT_MACROS -D__STDC_LIMIT_MACROS -Itools/clang/tools/extra/tool-template -I/Users/buildslave/jenkins/workspace/clang-stage2-coverage-R/llvm/tools/clang/tools/extra/tool-template -I/Users/buildslave/jenkins/workspace/clang-stage2-coverage-R/llvm/tools/clang/include -Itools/clang/include -I/Applications/Xcode.app/Contents/Developer/Platforms/MacOSX.platform/Developer/SDKs/MacOSX10.14.sdk/usr/include/libxml2 -Iinclude -I/Users/buildslave/jenkins/workspace/clang-stage2-coverage-R/llvm/include -fPIC -fvisibility-inlines-hidden -Werror=date-time -Werror=unguarded-availability-new -std=c++11 -fmodules -fmodules-cache-path=/Users/buildslave/jenkins/workspace/clang-stage2-coverage-R/clang-build/module.cache -fcxx-modules -Wall -Wextra -Wno-unused-parameter -Wwrite-strings -Wcast-qual -Wmissing-field-initializers -pedantic -Wno-long-long -Wimplicit-fallthrough -Wcovered-switch-default -Wno-noexcept-type -Wnon-virtual-dtor -Wdelete-non-virtual-dtor -Wstring-conversion -fdiagnostics-color -fprofile-instr-generate='/Users/buildslave/jenkins/workspace/clang-stage2-coverage-R/clang-build/profiles/%6m.profraw' -fcoverage-mapping -fno-common -Woverloaded-virtual -Wno-nested-anon-types -O3 -DNDEBUG -isysroot /Applications/Xcode.app/Contents/Developer/Platforms/MacOSX.platform/Developer/SDKs/MacOSX10.14.sdk    -fno-exceptions -fno-rtti -MD -MT tools/clang/tools/extra/tool-template/CMakeFiles/tool-template.dir/ToolTemplate.cpp.o -MF tools/clang/tools/extra/tool-template/CMakeFiles/tool-template.dir/ToolTemplate.cpp.o.d -o tools/clang/tools/extra/tool-template/CMakeFiles/tool-template.dir/ToolTemplate.cpp.o -c /Users/buildslave/jenkins/workspace/clang-stage2-coverage-R/llvm/tools/clang/tools/extra/tool-template/ToolTemplate.cpp
[3976/4598] : && /Users/buildslave/jenkins/workspace/clang-stage2-coverage-R/host-compiler/bin/clang++  -fPIC -fvisibility-inlines-hidden -Werror=date-time -Werror=unguarded-availability-new -std=c++11 -fmodules -fmodules-cache-path=/Users/buildslave/jenkins/workspace/clang-stage2-coverage-R/clang-build/module.cache -fcxx-modules -Wall -Wextra -Wno-unused-parameter -Wwrite-strings -Wcast-qual -Wmissing-field-initializers -pedantic -Wno-long-long -Wimplicit-fallthrough -Wcovered-switch-default -Wno-noexcept-type -Wnon-virtual-dtor -Wdelete-non-virtual-dtor -Wstring-conversion -fdiagnostics-color -fprofile-instr-generate='/Users/buildslave/jenkins/workspace/clang-stage2-coverage-R/clang-build/profiles/%6m.profraw' -fcoverage-mapping -fno-common -Woverloaded-virtual -Wno-nested-anon-types -O3 -DNDEBUG -isysroot /Applications/Xcode.app/Contents/Developer/Platforms/MacOSX.platform/Developer/SDKs/MacOSX10.14.sdk -Wl,-search_paths_first -Wl,-headerpad_max_install_names -fprofile-instr-generate='/Users/buildslave/jenkins/workspace/clang-stage2-coverage-R/clang-build/profiles/%6m.profraw' -fcoverage-mapping    -Wl,-dead_strip tools/clang/tools/extra/clang-move/tool/CMakeFiles/clang-move.dir/ClangMove.cpp.o  -o bin/clang-move  -Wl,-rpath,@loader_path/../lib lib/libLLVMSupport.a lib/libclangAST.a lib/libclangASTMatchers.a lib/libclangBasic.a lib/libclangFormat.a lib/libclangFrontend.a lib/libclangMove.a lib/libclangRewrite.a lib/libclangSerialization.a lib/libclangTooling.a lib/libclangToolingCore.a lib/libclangFormat.a lib/libclangToolingInclusions.a lib/libclangFrontend.a lib/libclangParse.a lib/libLLVMMCParser.a lib/libLLVMProfileData.a lib/libclangSerialization.a lib/libclangSema.a lib/libclangEdit.a lib/libLLVMBitReader.a lib/libLLVMBitstreamReader.a lib/libclangDriver.a lib/libLLVMOption.a lib/libclangToolingCore.a lib/libclangRewrite.a lib/libclangAnalysis.a lib/libclangASTMatchers.a lib/libclangAST.a lib/libclangLex.a lib/libclangBasic.a lib/libLLVMCore.a lib/libLLVMRemarks.a lib/libLLVMMC.a lib/libLLVMBinaryFormat.a lib/libLLVMDebugInfoCodeView.a lib/libLLVMDebugInfoMSF.a lib/libLLVMSupport.a -lz -lcurses -lm lib/libLLVMDemangle.a && :
[3977/4598] : && /Users/buildslave/jenkins/workspace/clang-stage2-coverage-R/host-compiler/bin/clang++  -fPIC -fvisibility-inlines-hidden -Werror=date-time -Werror=unguarded-availability-new -std=c++11 -fmodules -fmodules-cache-path=/Users/buildslave/jenkins/workspace/clang-stage2-coverage-R/clang-build/module.cache -fcxx-modules -Wall -Wextra -Wno-unused-parameter -Wwrite-strings -Wcast-qual -Wmissing-field-initializers -pedantic -Wno-long-long -Wimplicit-fallthrough -Wcovered-switch-default -Wno-noexcept-type -Wnon-virtual-dtor -Wdelete-non-virtual-dtor -Wstring-conversion -fdiagnostics-color -fprofile-instr-generate='/Users/buildslave/jenkins/workspace/clang-stage2-coverage-R/clang-build/profiles/%6m.profraw' -fcoverage-mapping -fno-common -Woverloaded-virtual -Wno-nested-anon-types -O3 -DNDEBUG -isysroot /Applications/Xcode.app/Contents/Developer/Platforms/MacOSX.platform/Developer/SDKs/MacOSX10.14.sdk -Wl,-search_paths_first -Wl,-headerpad_max_install_names -fprofile-instr-generate='/Users/buildslave/jenkins/workspace/clang-stage2-coverage-R/clang-build/profiles/%6m.profraw' -fcoverage-mapping    -Wl,-dead_strip tools/clang/tools/extra/clang-query/tool/CMakeFiles/clang-query.dir/ClangQuery.cpp.o  -o bin/clang-query  -Wl,-rpath,@loader_path/../lib lib/libLLVMLineEditor.a lib/libLLVMSupport.a lib/libclangAST.a lib/libclangASTMatchers.a lib/libclangBasic.a lib/libclangDynamicASTMatchers.a lib/libclangFrontend.a lib/libclangQuery.a lib/libclangSerialization.a lib/libclangTooling.a lib/libLLVMLineEditor.a -ledit lib/libclangDynamicASTMatchers.a lib/libclangFrontend.a lib/libclangParse.a lib/libLLVMMCParser.a lib/libLLVMProfileData.a lib/libclangSerialization.a lib/libclangSema.a lib/libclangEdit.a lib/libclangAnalysis.a lib/libclangASTMatchers.a lib/libLLVMBitReader.a lib/libLLVMBitstreamReader.a lib/libclangDriver.a lib/libLLVMOption.a lib/libclangFormat.a lib/libclangToolingInclusions.a lib/libclangToolingCore.a lib/libclangAST.a lib/libclangRewrite.a lib/libclangLex.a lib/libclangBasic.a lib/libLLVMCore.a lib/libLLVMRemarks.a lib/libLLVMMC.a lib/libLLVMBinaryFormat.a lib/libLLVMDebugInfoCodeView.a lib/libLLVMDebugInfoMSF.a lib/libLLVMSupport.a -lz -lcurses -lm lib/libLLVMDemangle.a && :
[3978/4598] : && /Users/buildslave/jenkins/workspace/clang-stage2-coverage-R/host-compiler/bin/clang++  -fPIC -fvisibility-inlines-hidden -Werror=date-time -Werror=unguarded-availability-new -std=c++11 -fmodules -fmodules-cache-path=/Users/buildslave/jenkins/workspace/clang-stage2-coverage-R/clang-build/module.cache -fcxx-modules -Wall -Wextra -Wno-unused-parameter -Wwrite-strings -Wcast-qual -Wmissing-field-initializers -pedantic -Wno-long-long -Wimplicit-fallthrough -Wcovered-switch-default -Wno-noexcept-type -Wnon-virtual-dtor -Wdelete-non-virtual-dtor -Wstring-conversion -fdiagnostics-color -fprofile-instr-generate='/Users/buildslave/jenkins/workspace/clang-stage2-coverage-R/clang-build/profiles/%6m.profraw' -fcoverage-mapping -fno-common -Woverloaded-virtual -Wno-nested-anon-types -O3 -DNDEBUG -isysroot /Applications/Xcode.app/Contents/Developer/Platforms/MacOSX.platform/Developer/SDKs/MacOSX10.14.sdk -Wl,-search_paths_first -Wl,-headerpad_max_install_names -fprofile-instr-generate='/Users/buildslave/jenkins/workspace/clang-stage2-coverage-R/clang-build/profiles/%6m.profraw' -fcoverage-mapping    -Wl,-dead_strip tools/clang/tools/extra/pp-trace/CMakeFiles/pp-trace.dir/PPTrace.cpp.o tools/clang/tools/extra/pp-trace/CMakeFiles/pp-trace.dir/PPCallbacksTracker.cpp.o  -o bin/pp-trace  -Wl,-rpath,@loader_path/../lib lib/libLLVMSupport.a lib/libclangAST.a lib/libclangBasic.a lib/libclangFrontend.a lib/libclangLex.a lib/libclangSerialization.a lib/libclangTooling.a lib/libclangFrontend.a lib/libclangParse.a lib/libLLVMMCParser.a lib/libLLVMProfileData.a lib/libclangSerialization.a lib/libclangSema.a lib/libclangEdit.a lib/libclangAnalysis.a lib/libLLVMBitReader.a lib/libLLVMBitstreamReader.a lib/libclangDriver.a lib/libLLVMOption.a lib/libclangASTMatchers.a lib/libclangFormat.a lib/libclangToolingInclusions.a lib/libclangToolingCore.a lib/libclangAST.a lib/libclangRewrite.a lib/libclangLex.a lib/libclangBasic.a lib/libLLVMCore.a lib/libLLVMRemarks.a lib/libLLVMMC.a lib/libLLVMBinaryFormat.a lib/libLLVMDebugInfoCodeView.a lib/libLLVMDebugInfoMSF.a lib/libLLVMSupport.a -lz -lcurses -lm lib/libLLVMDemangle.a && :
[3979/4598] /Users/buildslave/jenkins/workspace/clang-stage2-coverage-R/host-compiler/bin/clang++  -DGTEST_HAS_RTTI=0 -D_GNU_SOURCE -D__STDC_CONSTANT_MACROS -D__STDC_FORMAT_MACROS -D__STDC_LIMIT_MACROS -Itools/clang/tools/extra/clangd -I/Users/buildslave/jenkins/workspace/clang-stage2-coverage-R/llvm/tools/clang/tools/extra/clangd -I/Users/buildslave/jenkins/workspace/clang-stage2-coverage-R/llvm/tools/clang/include -Itools/clang/include -I/Applications/Xcode.app/Contents/Developer/Platforms/MacOSX.platform/Developer/SDKs/MacOSX10.14.sdk/usr/include/libxml2 -Iinclude -I/Users/buildslave/jenkins/workspace/clang-stage2-coverage-R/llvm/include -fPIC -fvisibility-inlines-hidden -Werror=date-time -Werror=unguarded-availability-new -std=c++11 -fmodules -fmodules-cache-path=/Users/buildslave/jenkins/workspace/clang-stage2-coverage-R/clang-build/module.cache -fcxx-modules -Wall -Wextra -Wno-unused-parameter -Wwrite-strings -Wcast-qual -Wmissing-field-initializers -pedantic -Wno-long-long -Wimplicit-fallthrough -Wcovered-switch-default -Wno-noexcept-type -Wnon-virtual-dtor -Wdelete-non-virtual-dtor -Wstring-conversion -fdiagnostics-color -fprofile-instr-generate='/Users/buildslave/jenkins/workspace/clang-stage2-coverage-R/clang-build/profiles/%6m.profraw' -fcoverage-mapping -fno-common -Woverloaded-virtual -Wno-nested-anon-types -O3 -DNDEBUG -isysroot /Applications/Xcode.app/Contents/Developer/Platforms/MacOSX.platform/Developer/SDKs/MacOSX10.14.sdk    -fno-exceptions -fno-rtti -MD -MT tools/clang/tools/extra/clangd/CMakeFiles/obj.clangDaemon.dir/CodeCompletionStrings.cpp.o -MF tools/clang/tools/extra/clangd/CMakeFiles/obj.clangDaemon.dir/CodeCompletionStrings.cpp.o.d -o tools/clang/tools/extra/clangd/CMakeFiles/obj.clangDaemon.dir/CodeCompletionStrings.cpp.o -c /Users/buildslave/jenkins/workspace/clang-stage2-coverage-R/llvm/tools/clang/tools/extra/clangd/CodeCompletionStrings.cpp
[3980/4598] : && /Users/buildslave/jenkins/workspace/clang-stage2-coverage-R/host-compiler/bin/clang++  -fPIC -fvisibility-inlines-hidden -Werror=date-time -Werror=unguarded-availability-new -std=c++11 -fmodules -fmodules-cache-path=/Users/buildslave/jenkins/workspace/clang-stage2-coverage-R/clang-build/module.cache -fcxx-modules -Wall -Wextra -Wno-unused-parameter -Wwrite-strings -Wcast-qual -Wmissing-field-initializers -pedantic -Wno-long-long -Wimplicit-fallthrough -Wcovered-switch-default -Wno-noexcept-type -Wnon-virtual-dtor -Wdelete-non-virtual-dtor -Wstring-conversion -fdiagnostics-color -fprofile-instr-generate='/Users/buildslave/jenkins/workspace/clang-stage2-coverage-R/clang-build/profiles/%6m.profraw' -fcoverage-mapping -fno-common -Woverloaded-virtual -Wno-nested-anon-types -O3 -DNDEBUG -isysroot /Applications/Xcode.app/Contents/Developer/Platforms/MacOSX.platform/Developer/SDKs/MacOSX10.14.sdk -Wl,-search_paths_first -Wl,-headerpad_max_install_names -fprofile-instr-generate='/Users/buildslave/jenkins/workspace/clang-stage2-coverage-R/clang-build/profiles/%6m.profraw' -fcoverage-mapping    -Wl,-dead_strip tools/clang/tools/extra/tool-template/CMakeFiles/tool-template.dir/ToolTemplate.cpp.o  -o bin/tool-template  -Wl,-rpath,@loader_path/../lib lib/libLLVMSupport.a lib/libclangAST.a lib/libclangASTMatchers.a lib/libclangBasic.a lib/libclangFrontend.a lib/libclangTooling.a lib/libclangToolingRefactoring.a lib/libclangIndex.a lib/libclangFrontend.a lib/libclangDriver.a lib/libclangParse.a lib/libLLVMMCParser.a lib/libLLVMOption.a lib/libLLVMProfileData.a lib/libclangSerialization.a lib/libclangSema.a lib/libclangEdit.a lib/libclangAnalysis.a lib/libclangASTMatchers.a lib/libLLVMBitReader.a lib/libLLVMBitstreamReader.a lib/libclangFormat.a lib/libclangToolingInclusions.a lib/libclangToolingCore.a lib/libclangAST.a lib/libclangRewrite.a lib/libclangLex.a lib/libclangBasic.a lib/libLLVMCore.a lib/libLLVMRemarks.a lib/libLLVMMC.a lib/libLLVMBinaryFormat.a lib/libLLVMDebugInfoCodeView.a lib/libLLVMDebugInfoMSF.a lib/libLLVMSupport.a -lz -lcurses -lm lib/libLLVMDemangle.a && :
[3981/4598] /Users/buildslave/jenkins/workspace/clang-stage2-coverage-R/host-compiler/bin/clang++  -DGTEST_HAS_RTTI=0 -D_GNU_SOURCE -D__STDC_CONSTANT_MACROS -D__STDC_FORMAT_MACROS -D__STDC_LIMIT_MACROS -Itools/clang/tools/extra/clangd -I/Users/buildslave/jenkins/workspace/clang-stage2-coverage-R/llvm/tools/clang/tools/extra/clangd -I/Users/buildslave/jenkins/workspace/clang-stage2-coverage-R/llvm/tools/clang/include -Itools/clang/include -I/Applications/Xcode.app/Contents/Developer/Platforms/MacOSX.platform/Developer/SDKs/MacOSX10.14.sdk/usr/include/libxml2 -Iinclude -I/Users/buildslave/jenkins/workspace/clang-stage2-coverage-R/llvm/include -fPIC -fvisibility-inlines-hidden -Werror=date-time -Werror=unguarded-availability-new -std=c++11 -fmodules -fmodules-cache-path=/Users/buildslave/jenkins/workspace/clang-stage2-coverage-R/clang-build/module.cache -fcxx-modules -Wall -Wextra -Wno-unused-parameter -Wwrite-strings -Wcast-qual -Wmissing-field-initializers -pedantic -Wno-long-long -Wimplicit-fallthrough -Wcovered-switch-default -Wno-noexcept-type -Wnon-virtual-dtor -Wdelete-non-virtual-dtor -Wstring-conversion -fdiagnostics-color -fprofile-instr-generate='/Users/buildslave/jenkins/workspace/clang-stage2-coverage-R/clang-build/profiles/%6m.profraw' -fcoverage-mapping -fno-common -Woverloaded-virtual -Wno-nested-anon-types -O3 -DNDEBUG -isysroot /Applications/Xcode.app/Contents/Developer/Platforms/MacOSX.platform/Developer/SDKs/MacOSX10.14.sdk    -fno-exceptions -fno-rtti -MD -MT tools/clang/tools/extra/clangd/CMakeFiles/obj.clangDaemon.dir/Context.cpp.o -MF tools/clang/tools/extra/clangd/CMakeFiles/obj.clangDaemon.dir/Context.cpp.o.d -o tools/clang/tools/extra/clangd/CMakeFiles/obj.clangDaemon.dir/Context.cpp.o -c /Users/buildslave/jenkins/workspace/clang-stage2-coverage-R/llvm/tools/clang/tools/extra/clangd/Context.cpp
[3982/4598] /Users/buildslave/jenkins/workspace/clang-stage2-coverage-R/host-compiler/bin/clang++  -DGTEST_HAS_RTTI=0 -D_GNU_SOURCE -D__STDC_CONSTANT_MACROS -D__STDC_FORMAT_MACROS -D__STDC_LIMIT_MACROS -Itools/clang/tools/extra/clangd -I/Users/buildslave/jenkins/workspace/clang-stage2-coverage-R/llvm/tools/clang/tools/extra/clangd -I/Users/buildslave/jenkins/workspace/clang-stage2-coverage-R/llvm/tools/clang/include -Itools/clang/include -I/Applications/Xcode.app/Contents/Developer/Platforms/MacOSX.platform/Developer/SDKs/MacOSX10.14.sdk/usr/include/libxml2 -Iinclude -I/Users/buildslave/jenkins/workspace/clang-stage2-coverage-R/llvm/include -fPIC -fvisibility-inlines-hidden -Werror=date-time -Werror=unguarded-availability-new -std=c++11 -fmodules -fmodules-cache-path=/Users/buildslave/jenkins/workspace/clang-stage2-coverage-R/clang-build/module.cache -fcxx-modules -Wall -Wextra -Wno-unused-parameter -Wwrite-strings -Wcast-qual -Wmissing-field-initializers -pedantic -Wno-long-long -Wimplicit-fallthrough -Wcovered-switch-default -Wno-noexcept-type -Wnon-virtual-dtor -Wdelete-non-virtual-dtor -Wstring-conversion -fdiagnostics-color -fprofile-instr-generate='/Users/buildslave/jenkins/workspace/clang-stage2-coverage-R/clang-build/profiles/%6m.profraw' -fcoverage-mapping -fno-common -Woverloaded-virtual -Wno-nested-anon-types -O3 -DNDEBUG -isysroot /Applications/Xcode.app/Contents/Developer/Platforms/MacOSX.platform/Developer/SDKs/MacOSX10.14.sdk    -fno-exceptions -fno-rtti -MD -MT tools/clang/tools/extra/clangd/CMakeFiles/obj.clangDaemon.dir/ClangdServer.cpp.o -MF tools/clang/tools/extra/clangd/CMakeFiles/obj.clangDaemon.dir/ClangdServer.cpp.o.d -o tools/clang/tools/extra/clangd/CMakeFiles/obj.clangDaemon.dir/ClangdServer.cpp.o -c /Users/buildslave/jenkins/workspace/clang-stage2-coverage-R/llvm/tools/clang/tools/extra/clangd/ClangdServer.cpp
[3983/4598] /Users/buildslave/jenkins/workspace/clang-stage2-coverage-R/host-compiler/bin/clang++  -DGTEST_HAS_RTTI=0 -D_GNU_SOURCE -D__STDC_CONSTANT_MACROS -D__STDC_FORMAT_MACROS -D__STDC_LIMIT_MACROS -Itools/clang/tools/extra/clangd -I/Users/buildslave/jenkins/workspace/clang-stage2-coverage-R/llvm/tools/clang/tools/extra/clangd -I/Users/buildslave/jenkins/workspace/clang-stage2-coverage-R/llvm/tools/clang/include -Itools/clang/include -I/Applications/Xcode.app/Contents/Developer/Platforms/MacOSX.platform/Developer/SDKs/MacOSX10.14.sdk/usr/include/libxml2 -Iinclude -I/Users/buildslave/jenkins/workspace/clang-stage2-coverage-R/llvm/include -fPIC -fvisibility-inlines-hidden -Werror=date-time -Werror=unguarded-availability-new -std=c++11 -fmodules -fmodules-cache-path=/Users/buildslave/jenkins/workspace/clang-stage2-coverage-R/clang-build/module.cache -fcxx-modules -Wall -Wextra -Wno-unused-parameter -Wwrite-strings -Wcast-qual -Wmissing-field-initializers -pedantic -Wno-long-long -Wimplicit-fallthrough -Wcovered-switch-default -Wno-noexcept-type -Wnon-virtual-dtor -Wdelete-non-virtual-dtor -Wstring-conversion -fdiagnostics-color -fprofile-instr-generate='/Users/buildslave/jenkins/workspace/clang-stage2-coverage-R/clang-build/profiles/%6m.profraw' -fcoverage-mapping -fno-common -Woverloaded-virtual -Wno-nested-anon-types -O3 -DNDEBUG -isysroot /Applications/Xcode.app/Contents/Developer/Platforms/MacOSX.platform/Developer/SDKs/MacOSX10.14.sdk    -fno-exceptions -fno-rtti -MD -MT tools/clang/tools/extra/clangd/CMakeFiles/obj.clangDaemon.dir/DraftStore.cpp.o -MF tools/clang/tools/extra/clangd/CMakeFiles/obj.clangDaemon.dir/DraftStore.cpp.o.d -o tools/clang/tools/extra/clangd/CMakeFiles/obj.clangDaemon.dir/DraftStore.cpp.o -c /Users/buildslave/jenkins/workspace/clang-stage2-coverage-R/llvm/tools/clang/tools/extra/clangd/DraftStore.cpp
[3984/4598] /Users/buildslave/jenkins/workspace/clang-stage2-coverage-R/host-compiler/bin/clang++  -DGTEST_HAS_RTTI=0 -D_GNU_SOURCE -D__STDC_CONSTANT_MACROS -D__STDC_FORMAT_MACROS -D__STDC_LIMIT_MACROS -Itools/clang/tools/extra/clangd -I/Users/buildslave/jenkins/workspace/clang-stage2-coverage-R/llvm/tools/clang/tools/extra/clangd -I/Users/buildslave/jenkins/workspace/clang-stage2-coverage-R/llvm/tools/clang/include -Itools/clang/include -I/Applications/Xcode.app/Contents/Developer/Platforms/MacOSX.platform/Developer/SDKs/MacOSX10.14.sdk/usr/include/libxml2 -Iinclude -I/Users/buildslave/jenkins/workspace/clang-stage2-coverage-R/llvm/include -fPIC -fvisibility-inlines-hidden -Werror=date-time -Werror=unguarded-availability-new -std=c++11 -fmodules -fmodules-cache-path=/Users/buildslave/jenkins/workspace/clang-stage2-coverage-R/clang-build/module.cache -fcxx-modules -Wall -Wextra -Wno-unused-parameter -Wwrite-strings -Wcast-qual -Wmissing-field-initializers -pedantic -Wno-long-long -Wimplicit-fallthrough -Wcovered-switch-default -Wno-noexcept-type -Wnon-virtual-dtor -Wdelete-non-virtual-dtor -Wstring-conversion -fdiagnostics-color -fprofile-instr-generate='/Users/buildslave/jenkins/workspace/clang-stage2-coverage-R/clang-build/profiles/%6m.profraw' -fcoverage-mapping -fno-common -Woverloaded-virtual -Wno-nested-anon-types -O3 -DNDEBUG -isysroot /Applications/Xcode.app/Contents/Developer/Platforms/MacOSX.platform/Developer/SDKs/MacOSX10.14.sdk    -fno-exceptions -fno-rtti -MD -MT tools/clang/tools/extra/clangd/CMakeFiles/obj.clangDaemon.dir/Compiler.cpp.o -MF tools/clang/tools/extra/clangd/CMakeFiles/obj.clangDaemon.dir/Compiler.cpp.o.d -o tools/clang/tools/extra/clangd/CMakeFiles/obj.clangDaemon.dir/Compiler.cpp.o -c /Users/buildslave/jenkins/workspace/clang-stage2-coverage-R/llvm/tools/clang/tools/extra/clangd/Compiler.cpp
[3985/4598] /Users/buildslave/jenkins/workspace/clang-stage2-coverage-R/host-compiler/bin/clang++  -DGTEST_HAS_RTTI=0 -D_GNU_SOURCE -D__STDC_CONSTANT_MACROS -D__STDC_FORMAT_MACROS -D__STDC_LIMIT_MACROS -Itools/clang/tools/extra/clangd -I/Users/buildslave/jenkins/workspace/clang-stage2-coverage-R/llvm/tools/clang/tools/extra/clangd -I/Users/buildslave/jenkins/workspace/clang-stage2-coverage-R/llvm/tools/clang/include -Itools/clang/include -I/Applications/Xcode.app/Contents/Developer/Platforms/MacOSX.platform/Developer/SDKs/MacOSX10.14.sdk/usr/include/libxml2 -Iinclude -I/Users/buildslave/jenkins/workspace/clang-stage2-coverage-R/llvm/include -fPIC -fvisibility-inlines-hidden -Werror=date-time -Werror=unguarded-availability-new -std=c++11 -fmodules -fmodules-cache-path=/Users/buildslave/jenkins/workspace/clang-stage2-coverage-R/clang-build/module.cache -fcxx-modules -Wall -Wextra -Wno-unused-parameter -Wwrite-strings -Wcast-qual -Wmissing-field-initializers -pedantic -Wno-long-long -Wimplicit-fallthrough -Wcovered-switch-default -Wno-noexcept-type -Wnon-virtual-dtor -Wdelete-non-virtual-dtor -Wstring-conversion -fdiagnostics-color -fprofile-instr-generate='/Users/buildslave/jenkins/workspace/clang-stage2-coverage-R/clang-build/profiles/%6m.profraw' -fcoverage-mapping -fno-common -Woverloaded-virtual -Wno-nested-anon-types -O3 -DNDEBUG -isysroot /Applications/Xcode.app/Contents/Developer/Platforms/MacOSX.platform/Developer/SDKs/MacOSX10.14.sdk    -fno-exceptions -fno-rtti -MD -MT tools/clang/tools/extra/clangd/CMakeFiles/obj.clangDaemon.dir/ExpectedTypes.cpp.o -MF tools/clang/tools/extra/clangd/CMakeFiles/obj.clangDaemon.dir/ExpectedTypes.cpp.o.d -o tools/clang/tools/extra/clangd/CMakeFiles/obj.clangDaemon.dir/ExpectedTypes.cpp.o -c /Users/buildslave/jenkins/workspace/clang-stage2-coverage-R/llvm/tools/clang/tools/extra/clangd/ExpectedTypes.cpp
[3986/4598] /Users/buildslave/jenkins/workspace/clang-stage2-coverage-R/host-compiler/bin/clang++  -DGTEST_HAS_RTTI=0 -D_GNU_SOURCE -D__STDC_CONSTANT_MACROS -D__STDC_FORMAT_MACROS -D__STDC_LIMIT_MACROS -Itools/clang/tools/extra/clangd -I/Users/buildslave/jenkins/workspace/clang-stage2-coverage-R/llvm/tools/clang/tools/extra/clangd -I/Users/buildslave/jenkins/workspace/clang-stage2-coverage-R/llvm/tools/clang/include -Itools/clang/include -I/Applications/Xcode.app/Contents/Developer/Platforms/MacOSX.platform/Developer/SDKs/MacOSX10.14.sdk/usr/include/libxml2 -Iinclude -I/Users/buildslave/jenkins/workspace/clang-stage2-coverage-R/llvm/include -fPIC -fvisibility-inlines-hidden -Werror=date-time -Werror=unguarded-availability-new -std=c++11 -fmodules -fmodules-cache-path=/Users/buildslave/jenkins/workspace/clang-stage2-coverage-R/clang-build/module.cache -fcxx-modules -Wall -Wextra -Wno-unused-parameter -Wwrite-strings -Wcast-qual -Wmissing-field-initializers -pedantic -Wno-long-long -Wimplicit-fallthrough -Wcovered-switch-default -Wno-noexcept-type -Wnon-virtual-dtor -Wdelete-non-virtual-dtor -Wstring-conversion -fdiagnostics-color -fprofile-instr-generate='/Users/buildslave/jenkins/workspace/clang-stage2-coverage-R/clang-build/profiles/%6m.profraw' -fcoverage-mapping -fno-common -Woverloaded-virtual -Wno-nested-anon-types -O3 -DNDEBUG -isysroot /Applications/Xcode.app/Contents/Developer/Platforms/MacOSX.platform/Developer/SDKs/MacOSX10.14.sdk    -fno-exceptions -fno-rtti -MD -MT tools/clang/tools/extra/clangd/CMakeFiles/obj.clangDaemon.dir/ClangdUnit.cpp.o -MF tools/clang/tools/extra/clangd/CMakeFiles/obj.clangDaemon.dir/ClangdUnit.cpp.o.d -o tools/clang/tools/extra/clangd/CMakeFiles/obj.clangDaemon.dir/ClangdUnit.cpp.o -c /Users/buildslave/jenkins/workspace/clang-stage2-coverage-R/llvm/tools/clang/tools/extra/clangd/ClangdUnit.cpp
[3987/4598] /Users/buildslave/jenkins/workspace/clang-stage2-coverage-R/host-compiler/bin/clang++  -DGTEST_HAS_RTTI=0 -D_GNU_SOURCE -D__STDC_CONSTANT_MACROS -D__STDC_FORMAT_MACROS -D__STDC_LIMIT_MACROS -Itools/clang/tools/extra/clangd -I/Users/buildslave/jenkins/workspace/clang-stage2-coverage-R/llvm/tools/clang/tools/extra/clangd -I/Users/buildslave/jenkins/workspace/clang-stage2-coverage-R/llvm/tools/clang/include -Itools/clang/include -I/Applications/Xcode.app/Contents/Developer/Platforms/MacOSX.platform/Developer/SDKs/MacOSX10.14.sdk/usr/include/libxml2 -Iinclude -I/Users/buildslave/jenkins/workspace/clang-stage2-coverage-R/llvm/include -fPIC -fvisibility-inlines-hidden -Werror=date-time -Werror=unguarded-availability-new -std=c++11 -fmodules -fmodules-cache-path=/Users/buildslave/jenkins/workspace/clang-stage2-coverage-R/clang-build/module.cache -fcxx-modules -Wall -Wextra -Wno-unused-parameter -Wwrite-strings -Wcast-qual -Wmissing-field-initializers -pedantic -Wno-long-long -Wimplicit-fallthrough -Wcovered-switch-default -Wno-noexcept-type -Wnon-virtual-dtor -Wdelete-non-virtual-dtor -Wstring-conversion -fdiagnostics-color -fprofile-instr-generate='/Users/buildslave/jenkins/workspace/clang-stage2-coverage-R/clang-build/profiles/%6m.profraw' -fcoverage-mapping -fno-common -Woverloaded-virtual -Wno-nested-anon-types -O3 -DNDEBUG -isysroot /Applications/Xcode.app/Contents/Developer/Platforms/MacOSX.platform/Developer/SDKs/MacOSX10.14.sdk    -fno-exceptions -fno-rtti -MD -MT tools/clang/tools/extra/clangd/CMakeFiles/obj.clangDaemon.dir/FileDistance.cpp.o -MF tools/clang/tools/extra/clangd/CMakeFiles/obj.clangDaemon.dir/FileDistance.cpp.o.d -o tools/clang/tools/extra/clangd/CMakeFiles/obj.clangDaemon.dir/FileDistance.cpp.o -c /Users/buildslave/jenkins/workspace/clang-stage2-coverage-R/llvm/tools/clang/tools/extra/clangd/FileDistance.cpp
[3988/4598] /Users/buildslave/jenkins/workspace/clang-stage2-coverage-R/host-compiler/bin/clang++  -DGTEST_HAS_RTTI=0 -D_GNU_SOURCE -D__STDC_CONSTANT_MACROS -D__STDC_FORMAT_MACROS -D__STDC_LIMIT_MACROS -Itools/clang/tools/extra/clangd -I/Users/buildslave/jenkins/workspace/clang-stage2-coverage-R/llvm/tools/clang/tools/extra/clangd -I/Users/buildslave/jenkins/workspace/clang-stage2-coverage-R/llvm/tools/clang/include -Itools/clang/include -I/Applications/Xcode.app/Contents/Developer/Platforms/MacOSX.platform/Developer/SDKs/MacOSX10.14.sdk/usr/include/libxml2 -Iinclude -I/Users/buildslave/jenkins/workspace/clang-stage2-coverage-R/llvm/include -fPIC -fvisibility-inlines-hidden -Werror=date-time -Werror=unguarded-availability-new -std=c++11 -fmodules -fmodules-cache-path=/Users/buildslave/jenkins/workspace/clang-stage2-coverage-R/clang-build/module.cache -fcxx-modules -Wall -Wextra -Wno-unused-parameter -Wwrite-strings -Wcast-qual -Wmissing-field-initializers -pedantic -Wno-long-long -Wimplicit-fallthrough -Wcovered-switch-default -Wno-noexcept-type -Wnon-virtual-dtor -Wdelete-non-virtual-dtor -Wstring-conversion -fdiagnostics-color -fprofile-instr-generate='/Users/buildslave/jenkins/workspace/clang-stage2-coverage-R/clang-build/profiles/%6m.profraw' -fcoverage-mapping -fno-common -Woverloaded-virtual -Wno-nested-anon-types -O3 -DNDEBUG -isysroot /Applications/Xcode.app/Contents/Developer/Platforms/MacOSX.platform/Developer/SDKs/MacOSX10.14.sdk    -fno-exceptions -fno-rtti -MD -MT tools/clang/tools/extra/clangd/CMakeFiles/obj.clangDaemon.dir/FS.cpp.o -MF tools/clang/tools/extra/clangd/CMakeFiles/obj.clangDaemon.dir/FS.cpp.o.d -o tools/clang/tools/extra/clangd/CMakeFiles/obj.clangDaemon.dir/FS.cpp.o -c /Users/buildslave/jenkins/workspace/clang-stage2-coverage-R/llvm/tools/clang/tools/extra/clangd/FS.cpp
[3989/4598] /Users/buildslave/jenkins/workspace/clang-stage2-coverage-R/host-compiler/bin/clang++  -DGTEST_HAS_RTTI=0 -D_GNU_SOURCE -D__STDC_CONSTANT_MACROS -D__STDC_FORMAT_MACROS -D__STDC_LIMIT_MACROS -Itools/clang/tools/extra/clangd -I/Users/buildslave/jenkins/workspace/clang-stage2-coverage-R/llvm/tools/clang/tools/extra/clangd -I/Users/buildslave/jenkins/workspace/clang-stage2-coverage-R/llvm/tools/clang/include -Itools/clang/include -I/Applications/Xcode.app/Contents/Developer/Platforms/MacOSX.platform/Developer/SDKs/MacOSX10.14.sdk/usr/include/libxml2 -Iinclude -I/Users/buildslave/jenkins/workspace/clang-stage2-coverage-R/llvm/include -fPIC -fvisibility-inlines-hidden -Werror=date-time -Werror=unguarded-availability-new -std=c++11 -fmodules -fmodules-cache-path=/Users/buildslave/jenkins/workspace/clang-stage2-coverage-R/clang-build/module.cache -fcxx-modules -Wall -Wextra -Wno-unused-parameter -Wwrite-strings -Wcast-qual -Wmissing-field-initializers -pedantic -Wno-long-long -Wimplicit-fallthrough -Wcovered-switch-default -Wno-noexcept-type -Wnon-virtual-dtor -Wdelete-non-virtual-dtor -Wstring-conversion -fdiagnostics-color -fprofile-instr-generate='/Users/buildslave/jenkins/workspace/clang-stage2-coverage-R/clang-build/profiles/%6m.profraw' -fcoverage-mapping -fno-common -Woverloaded-virtual -Wno-nested-anon-types -O3 -DNDEBUG -isysroot /Applications/Xcode.app/Contents/Developer/Platforms/MacOSX.platform/Developer/SDKs/MacOSX10.14.sdk    -fno-exceptions -fno-rtti -MD -MT tools/clang/tools/extra/clangd/CMakeFiles/obj.clangDaemon.dir/FSProvider.cpp.o -MF tools/clang/tools/extra/clangd/CMakeFiles/obj.clangDaemon.dir/FSProvider.cpp.o.d -o tools/clang/tools/extra/clangd/CMakeFiles/obj.clangDaemon.dir/FSProvider.cpp.o -c /Users/buildslave/jenkins/workspace/clang-stage2-coverage-R/llvm/tools/clang/tools/extra/clangd/FSProvider.cpp
[3990/4598] /Users/buildslave/jenkins/workspace/clang-stage2-coverage-R/host-compiler/bin/clang++  -DGTEST_HAS_RTTI=0 -D_GNU_SOURCE -D__STDC_CONSTANT_MACROS -D__STDC_FORMAT_MACROS -D__STDC_LIMIT_MACROS -Itools/clang/tools/extra/clangd -I/Users/buildslave/jenkins/workspace/clang-stage2-coverage-R/llvm/tools/clang/tools/extra/clangd -I/Users/buildslave/jenkins/workspace/clang-stage2-coverage-R/llvm/tools/clang/include -Itools/clang/include -I/Applications/Xcode.app/Contents/Developer/Platforms/MacOSX.platform/Developer/SDKs/MacOSX10.14.sdk/usr/include/libxml2 -Iinclude -I/Users/buildslave/jenkins/workspace/clang-stage2-coverage-R/llvm/include -fPIC -fvisibility-inlines-hidden -Werror=date-time -Werror=unguarded-availability-new -std=c++11 -fmodules -fmodules-cache-path=/Users/buildslave/jenkins/workspace/clang-stage2-coverage-R/clang-build/module.cache -fcxx-modules -Wall -Wextra -Wno-unused-parameter -Wwrite-strings -Wcast-qual -Wmissing-field-initializers -pedantic -Wno-long-long -Wimplicit-fallthrough -Wcovered-switch-default -Wno-noexcept-type -Wnon-virtual-dtor -Wdelete-non-virtual-dtor -Wstring-conversion -fdiagnostics-color -fprofile-instr-generate='/Users/buildslave/jenkins/workspace/clang-stage2-coverage-R/clang-build/profiles/%6m.profraw' -fcoverage-mapping -fno-common -Woverloaded-virtual -Wno-nested-anon-types -O3 -DNDEBUG -isysroot /Applications/Xcode.app/Contents/Developer/Platforms/MacOSX.platform/Developer/SDKs/MacOSX10.14.sdk    -fno-exceptions -fno-rtti -MD -MT tools/clang/tools/extra/clangd/CMakeFiles/obj.clangDaemon.dir/Diagnostics.cpp.o -MF tools/clang/tools/extra/clangd/CMakeFiles/obj.clangDaemon.dir/Diagnostics.cpp.o.d -o tools/clang/tools/extra/clangd/CMakeFiles/obj.clangDaemon.dir/Diagnostics.cpp.o -c /Users/buildslave/jenkins/workspace/clang-stage2-coverage-R/llvm/tools/clang/tools/extra/clangd/Diagnostics.cpp
[3991/4598] /Users/buildslave/jenkins/workspace/clang-stage2-coverage-R/host-compiler/bin/clang++  -DGTEST_HAS_RTTI=0 -D_GNU_SOURCE -D__STDC_CONSTANT_MACROS -D__STDC_FORMAT_MACROS -D__STDC_LIMIT_MACROS -Itools/clang/tools/extra/clangd -I/Users/buildslave/jenkins/workspace/clang-stage2-coverage-R/llvm/tools/clang/tools/extra/clangd -I/Users/buildslave/jenkins/workspace/clang-stage2-coverage-R/llvm/tools/clang/include -Itools/clang/include -I/Applications/Xcode.app/Contents/Developer/Platforms/MacOSX.platform/Developer/SDKs/MacOSX10.14.sdk/usr/include/libxml2 -Iinclude -I/Users/buildslave/jenkins/workspace/clang-stage2-coverage-R/llvm/include -fPIC -fvisibility-inlines-hidden -Werror=date-time -Werror=unguarded-availability-new -std=c++11 -fmodules -fmodules-cache-path=/Users/buildslave/jenkins/workspace/clang-stage2-coverage-R/clang-build/module.cache -fcxx-modules -Wall -Wextra -Wno-unused-parameter -Wwrite-strings -Wcast-qual -Wmissing-field-initializers -pedantic -Wno-long-long -Wimplicit-fallthrough -Wcovered-switch-default -Wno-noexcept-type -Wnon-virtual-dtor -Wdelete-non-virtual-dtor -Wstring-conversion -fdiagnostics-color -fprofile-instr-generate='/Users/buildslave/jenkins/workspace/clang-stage2-coverage-R/clang-build/profiles/%6m.profraw' -fcoverage-mapping -fno-common -Woverloaded-virtual -Wno-nested-anon-types -O3 -DNDEBUG -isysroot /Applications/Xcode.app/Contents/Developer/Platforms/MacOSX.platform/Developer/SDKs/MacOSX10.14.sdk    -fno-exceptions -fno-rtti -MD -MT tools/clang/tools/extra/clangd/CMakeFiles/obj.clangDaemon.dir/FuzzyMatch.cpp.o -MF tools/clang/tools/extra/clangd/CMakeFiles/obj.clangDaemon.dir/FuzzyMatch.cpp.o.d -o tools/clang/tools/extra/clangd/CMakeFiles/obj.clangDaemon.dir/FuzzyMatch.cpp.o -c /Users/buildslave/jenkins/workspace/clang-stage2-coverage-R/llvm/tools/clang/tools/extra/clangd/FuzzyMatch.cpp
[3992/4598] /Users/buildslave/jenkins/workspace/clang-stage2-coverage-R/host-compiler/bin/clang++  -DGTEST_HAS_RTTI=0 -D_GNU_SOURCE -D__STDC_CONSTANT_MACROS -D__STDC_FORMAT_MACROS -D__STDC_LIMIT_MACROS -Itools/clang/tools/extra/clangd -I/Users/buildslave/jenkins/workspace/clang-stage2-coverage-R/llvm/tools/clang/tools/extra/clangd -I/Users/buildslave/jenkins/workspace/clang-stage2-coverage-R/llvm/tools/clang/include -Itools/clang/include -I/Applications/Xcode.app/Contents/Developer/Platforms/MacOSX.platform/Developer/SDKs/MacOSX10.14.sdk/usr/include/libxml2 -Iinclude -I/Users/buildslave/jenkins/workspace/clang-stage2-coverage-R/llvm/include -fPIC -fvisibility-inlines-hidden -Werror=date-time -Werror=unguarded-availability-new -std=c++11 -fmodules -fmodules-cache-path=/Users/buildslave/jenkins/workspace/clang-stage2-coverage-R/clang-build/module.cache -fcxx-modules -Wall -Wextra -Wno-unused-parameter -Wwrite-strings -Wcast-qual -Wmissing-field-initializers -pedantic -Wno-long-long -Wimplicit-fallthrough -Wcovered-switch-default -Wno-noexcept-type -Wnon-virtual-dtor -Wdelete-non-virtual-dtor -Wstring-conversion -fdiagnostics-color -fprofile-instr-generate='/Users/buildslave/jenkins/workspace/clang-stage2-coverage-R/clang-build/profiles/%6m.profraw' -fcoverage-mapping -fno-common -Woverloaded-virtual -Wno-nested-anon-types -O3 -DNDEBUG -isysroot /Applications/Xcode.app/Contents/Developer/Platforms/MacOSX.platform/Developer/SDKs/MacOSX10.14.sdk    -fno-exceptions -fno-rtti -MD -MT tools/clang/tools/extra/clangd/CMakeFiles/obj.clangDaemon.dir/FormattedString.cpp.o -MF tools/clang/tools/extra/clangd/CMakeFiles/obj.clangDaemon.dir/FormattedString.cpp.o.d -o tools/clang/tools/extra/clangd/CMakeFiles/obj.clangDaemon.dir/FormattedString.cpp.o -c /Users/buildslave/jenkins/workspace/clang-stage2-coverage-R/llvm/tools/clang/tools/extra/clangd/FormattedString.cpp
[3993/4598] /Users/buildslave/jenkins/workspace/clang-stage2-coverage-R/host-compiler/bin/clang++  -DGTEST_HAS_RTTI=0 -D_GNU_SOURCE -D__STDC_CONSTANT_MACROS -D__STDC_FORMAT_MACROS -D__STDC_LIMIT_MACROS -Itools/clang/tools/extra/clangd -I/Users/buildslave/jenkins/workspace/clang-stage2-coverage-R/llvm/tools/clang/tools/extra/clangd -I/Users/buildslave/jenkins/workspace/clang-stage2-coverage-R/llvm/tools/clang/include -Itools/clang/include -I/Applications/Xcode.app/Contents/Developer/Platforms/MacOSX.platform/Developer/SDKs/MacOSX10.14.sdk/usr/include/libxml2 -Iinclude -I/Users/buildslave/jenkins/workspace/clang-stage2-coverage-R/llvm/include -fPIC -fvisibility-inlines-hidden -Werror=date-time -Werror=unguarded-availability-new -std=c++11 -fmodules -fmodules-cache-path=/Users/buildslave/jenkins/workspace/clang-stage2-coverage-R/clang-build/module.cache -fcxx-modules -Wall -Wextra -Wno-unused-parameter -Wwrite-strings -Wcast-qual -Wmissing-field-initializers -pedantic -Wno-long-long -Wimplicit-fallthrough -Wcovered-switch-default -Wno-noexcept-type -Wnon-virtual-dtor -Wdelete-non-virtual-dtor -Wstring-conversion -fdiagnostics-color -fprofile-instr-generate='/Users/buildslave/jenkins/workspace/clang-stage2-coverage-R/clang-build/profiles/%6m.profraw' -fcoverage-mapping -fno-common -Woverloaded-virtual -Wno-nested-anon-types -O3 -DNDEBUG -isysroot /Applications/Xcode.app/Contents/Developer/Platforms/MacOSX.platform/Developer/SDKs/MacOSX10.14.sdk    -fno-exceptions -fno-rtti -MD -MT tools/clang/tools/extra/clangd/CMakeFiles/obj.clangDaemon.dir/Format.cpp.o -MF tools/clang/tools/extra/clangd/CMakeFiles/obj.clangDaemon.dir/Format.cpp.o.d -o tools/clang/tools/extra/clangd/CMakeFiles/obj.clangDaemon.dir/Format.cpp.o -c /Users/buildslave/jenkins/workspace/clang-stage2-coverage-R/llvm/tools/clang/tools/extra/clangd/Format.cpp
[3994/4598] /Users/buildslave/jenkins/workspace/clang-stage2-coverage-R/host-compiler/bin/clang++  -DGTEST_HAS_RTTI=0 -D_GNU_SOURCE -D__STDC_CONSTANT_MACROS -D__STDC_FORMAT_MACROS -D__STDC_LIMIT_MACROS -Itools/clang/tools/extra/clangd -I/Users/buildslave/jenkins/workspace/clang-stage2-coverage-R/llvm/tools/clang/tools/extra/clangd -I/Users/buildslave/jenkins/workspace/clang-stage2-coverage-R/llvm/tools/clang/include -Itools/clang/include -I/Applications/Xcode.app/Contents/Developer/Platforms/MacOSX.platform/Developer/SDKs/MacOSX10.14.sdk/usr/include/libxml2 -Iinclude -I/Users/buildslave/jenkins/workspace/clang-stage2-coverage-R/llvm/include -fPIC -fvisibility-inlines-hidden -Werror=date-time -Werror=unguarded-availability-new -std=c++11 -fmodules -fmodules-cache-path=/Users/buildslave/jenkins/workspace/clang-stage2-coverage-R/clang-build/module.cache -fcxx-modules -Wall -Wextra -Wno-unused-parameter -Wwrite-strings -Wcast-qual -Wmissing-field-initializers -pedantic -Wno-long-long -Wimplicit-fallthrough -Wcovered-switch-default -Wno-noexcept-type -Wnon-virtual-dtor -Wdelete-non-virtual-dtor -Wstring-conversion -fdiagnostics-color -fprofile-instr-generate='/Users/buildslave/jenkins/workspace/clang-stage2-coverage-R/clang-build/profiles/%6m.profraw' -fcoverage-mapping -fno-common -Woverloaded-virtual -Wno-nested-anon-types -O3 -DNDEBUG -isysroot /Applications/Xcode.app/Contents/Developer/Platforms/MacOSX.platform/Developer/SDKs/MacOSX10.14.sdk    -fno-exceptions -fno-rtti -MD -MT tools/clang/tools/extra/clangd/CMakeFiles/obj.clangDaemon.dir/ClangdLSPServer.cpp.o -MF tools/clang/tools/extra/clangd/CMakeFiles/obj.clangDaemon.dir/ClangdLSPServer.cpp.o.d -o tools/clang/tools/extra/clangd/CMakeFiles/obj.clangDaemon.dir/ClangdLSPServer.cpp.o -c /Users/buildslave/jenkins/workspace/clang-stage2-coverage-R/llvm/tools/clang/tools/extra/clangd/ClangdLSPServer.cpp
[3995/4598] /Users/buildslave/jenkins/workspace/clang-stage2-coverage-R/host-compiler/bin/clang++  -DGTEST_HAS_RTTI=0 -D_GNU_SOURCE -D__STDC_CONSTANT_MACROS -D__STDC_FORMAT_MACROS -D__STDC_LIMIT_MACROS -Itools/clang/tools/extra/clangd -I/Users/buildslave/jenkins/workspace/clang-stage2-coverage-R/llvm/tools/clang/tools/extra/clangd -I/Users/buildslave/jenkins/workspace/clang-stage2-coverage-R/llvm/tools/clang/include -Itools/clang/include -I/Applications/Xcode.app/Contents/Developer/Platforms/MacOSX.platform/Developer/SDKs/MacOSX10.14.sdk/usr/include/libxml2 -Iinclude -I/Users/buildslave/jenkins/workspace/clang-stage2-coverage-R/llvm/include -fPIC -fvisibility-inlines-hidden -Werror=date-time -Werror=unguarded-availability-new -std=c++11 -fmodules -fmodules-cache-path=/Users/buildslave/jenkins/workspace/clang-stage2-coverage-R/clang-build/module.cache -fcxx-modules -Wall -Wextra -Wno-unused-parameter -Wwrite-strings -Wcast-qual -Wmissing-field-initializers -pedantic -Wno-long-long -Wimplicit-fallthrough -Wcovered-switch-default -Wno-noexcept-type -Wnon-virtual-dtor -Wdelete-non-virtual-dtor -Wstring-conversion -fdiagnostics-color -fprofile-instr-generate='/Users/buildslave/jenkins/workspace/clang-stage2-coverage-R/clang-build/profiles/%6m.profraw' -fcoverage-mapping -fno-common -Woverloaded-virtual -Wno-nested-anon-types -O3 -DNDEBUG -isysroot /Applications/Xcode.app/Contents/Developer/Platforms/MacOSX.platform/Developer/SDKs/MacOSX10.14.sdk    -fno-exceptions -fno-rtti -MD -MT tools/clang/tools/extra/clangd/CMakeFiles/obj.clangDaemon.dir/CodeComplete.cpp.o -MF tools/clang/tools/extra/clangd/CMakeFiles/obj.clangDaemon.dir/CodeComplete.cpp.o.d -o tools/clang/tools/extra/clangd/CMakeFiles/obj.clangDaemon.dir/CodeComplete.cpp.o -c /Users/buildslave/jenkins/workspace/clang-stage2-coverage-R/llvm/tools/clang/tools/extra/clangd/CodeComplete.cpp
[3996/4598] /Users/buildslave/jenkins/workspace/clang-stage2-coverage-R/host-compiler/bin/clang++  -DGTEST_HAS_RTTI=0 -D_GNU_SOURCE -D__STDC_CONSTANT_MACROS -D__STDC_FORMAT_MACROS -D__STDC_LIMIT_MACROS -Itools/clang/tools/extra/clangd -I/Users/buildslave/jenkins/workspace/clang-stage2-coverage-R/llvm/tools/clang/tools/extra/clangd -I/Users/buildslave/jenkins/workspace/clang-stage2-coverage-R/llvm/tools/clang/include -Itools/clang/include -I/Applications/Xcode.app/Contents/Developer/Platforms/MacOSX.platform/Developer/SDKs/MacOSX10.14.sdk/usr/include/libxml2 -Iinclude -I/Users/buildslave/jenkins/workspace/clang-stage2-coverage-R/llvm/include -fPIC -fvisibility-inlines-hidden -Werror=date-time -Werror=unguarded-availability-new -std=c++11 -fmodules -fmodules-cache-path=/Users/buildslave/jenkins/workspace/clang-stage2-coverage-R/clang-build/module.cache -fcxx-modules -Wall -Wextra -Wno-unused-parameter -Wwrite-strings -Wcast-qual -Wmissing-field-initializers -pedantic -Wno-long-long -Wimplicit-fallthrough -Wcovered-switch-default -Wno-noexcept-type -Wnon-virtual-dtor -Wdelete-non-virtual-dtor -Wstring-conversion -fdiagnostics-color -fprofile-instr-generate='/Users/buildslave/jenkins/workspace/clang-stage2-coverage-R/clang-build/profiles/%6m.profraw' -fcoverage-mapping -fno-common -Woverloaded-virtual -Wno-nested-anon-types -O3 -DNDEBUG -isysroot /Applications/Xcode.app/Contents/Developer/Platforms/MacOSX.platform/Developer/SDKs/MacOSX10.14.sdk    -fno-exceptions -fno-rtti -MD -MT tools/clang/tools/extra/clangd/CMakeFiles/obj.clangDaemon.dir/IncludeFixer.cpp.o -MF tools/clang/tools/extra/clangd/CMakeFiles/obj.clangDaemon.dir/IncludeFixer.cpp.o.d -o tools/clang/tools/extra/clangd/CMakeFiles/obj.clangDaemon.dir/IncludeFixer.cpp.o -c /Users/buildslave/jenkins/workspace/clang-stage2-coverage-R/llvm/tools/clang/tools/extra/clangd/IncludeFixer.cpp
[3997/4598] /Users/buildslave/jenkins/workspace/clang-stage2-coverage-R/host-compiler/bin/clang++  -DGTEST_HAS_RTTI=0 -D_GNU_SOURCE -D__STDC_CONSTANT_MACROS -D__STDC_FORMAT_MACROS -D__STDC_LIMIT_MACROS -Itools/clang/tools/extra/clangd -I/Users/buildslave/jenkins/workspace/clang-stage2-coverage-R/llvm/tools/clang/tools/extra/clangd -I/Users/buildslave/jenkins/workspace/clang-stage2-coverage-R/llvm/tools/clang/include -Itools/clang/include -I/Applications/Xcode.app/Contents/Developer/Platforms/MacOSX.platform/Developer/SDKs/MacOSX10.14.sdk/usr/include/libxml2 -Iinclude -I/Users/buildslave/jenkins/workspace/clang-stage2-coverage-R/llvm/include -fPIC -fvisibility-inlines-hidden -Werror=date-time -Werror=unguarded-availability-new -std=c++11 -fmodules -fmodules-cache-path=/Users/buildslave/jenkins/workspace/clang-stage2-coverage-R/clang-build/module.cache -fcxx-modules -Wall -Wextra -Wno-unused-parameter -Wwrite-strings -Wcast-qual -Wmissing-field-initializers -pedantic -Wno-long-long -Wimplicit-fallthrough -Wcovered-switch-default -Wno-noexcept-type -Wnon-virtual-dtor -Wdelete-non-virtual-dtor -Wstring-conversion -fdiagnostics-color -fprofile-instr-generate='/Users/buildslave/jenkins/workspace/clang-stage2-coverage-R/clang-build/profiles/%6m.profraw' -fcoverage-mapping -fno-common -Woverloaded-virtual -Wno-nested-anon-types -O3 -DNDEBUG -isysroot /Applications/Xcode.app/Contents/Developer/Platforms/MacOSX.platform/Developer/SDKs/MacOSX10.14.sdk    -fno-exceptions -fno-rtti -MD -MT tools/clang/tools/extra/clangd/CMakeFiles/obj.clangDaemon.dir/JSONTransport.cpp.o -MF tools/clang/tools/extra/clangd/CMakeFiles/obj.clangDaemon.dir/JSONTransport.cpp.o.d -o tools/clang/tools/extra/clangd/CMakeFiles/obj.clangDaemon.dir/JSONTransport.cpp.o -c /Users/buildslave/jenkins/workspace/clang-stage2-coverage-R/llvm/tools/clang/tools/extra/clangd/JSONTransport.cpp
[3998/4598] /Users/buildslave/jenkins/workspace/clang-stage2-coverage-R/host-compiler/bin/clang++  -DGTEST_HAS_RTTI=0 -D_GNU_SOURCE -D__STDC_CONSTANT_MACROS -D__STDC_FORMAT_MACROS -D__STDC_LIMIT_MACROS -Itools/clang/tools/extra/clangd -I/Users/buildslave/jenkins/workspace/clang-stage2-coverage-R/llvm/tools/clang/tools/extra/clangd -I/Users/buildslave/jenkins/workspace/clang-stage2-coverage-R/llvm/tools/clang/include -Itools/clang/include -I/Applications/Xcode.app/Contents/Developer/Platforms/MacOSX.platform/Developer/SDKs/MacOSX10.14.sdk/usr/include/libxml2 -Iinclude -I/Users/buildslave/jenkins/workspace/clang-stage2-coverage-R/llvm/include -fPIC -fvisibility-inlines-hidden -Werror=date-time -Werror=unguarded-availability-new -std=c++11 -fmodules -fmodules-cache-path=/Users/buildslave/jenkins/workspace/clang-stage2-coverage-R/clang-build/module.cache -fcxx-modules -Wall -Wextra -Wno-unused-parameter -Wwrite-strings -Wcast-qual -Wmissing-field-initializers -pedantic -Wno-long-long -Wimplicit-fallthrough -Wcovered-switch-default -Wno-noexcept-type -Wnon-virtual-dtor -Wdelete-non-virtual-dtor -Wstring-conversion -fdiagnostics-color -fprofile-instr-generate='/Users/buildslave/jenkins/workspace/clang-stage2-coverage-R/clang-build/profiles/%6m.profraw' -fcoverage-mapping -fno-common -Woverloaded-virtual -Wno-nested-anon-types -O3 -DNDEBUG -isysroot /Applications/Xcode.app/Contents/Developer/Platforms/MacOSX.platform/Developer/SDKs/MacOSX10.14.sdk    -fno-exceptions -fno-rtti -MD -MT tools/clang/tools/extra/clangd/CMakeFiles/obj.clangDaemon.dir/Logger.cpp.o -MF tools/clang/tools/extra/clangd/CMakeFiles/obj.clangDaemon.dir/Logger.cpp.o.d -o tools/clang/tools/extra/clangd/CMakeFiles/obj.clangDaemon.dir/Logger.cpp.o -c /Users/buildslave/jenkins/workspace/clang-stage2-coverage-R/llvm/tools/clang/tools/extra/clangd/Logger.cpp
[3999/4598] /Users/buildslave/jenkins/workspace/clang-stage2-coverage-R/host-compiler/bin/clang++  -DGTEST_HAS_RTTI=0 -D_GNU_SOURCE -D__STDC_CONSTANT_MACROS -D__STDC_FORMAT_MACROS -D__STDC_LIMIT_MACROS -Itools/clang/tools/extra/clangd -I/Users/buildslave/jenkins/workspace/clang-stage2-coverage-R/llvm/tools/clang/tools/extra/clangd -I/Users/buildslave/jenkins/workspace/clang-stage2-coverage-R/llvm/tools/clang/include -Itools/clang/include -I/Applications/Xcode.app/Contents/Developer/Platforms/MacOSX.platform/Developer/SDKs/MacOSX10.14.sdk/usr/include/libxml2 -Iinclude -I/Users/buildslave/jenkins/workspace/clang-stage2-coverage-R/llvm/include -fPIC -fvisibility-inlines-hidden -Werror=date-time -Werror=unguarded-availability-new -std=c++11 -fmodules -fmodules-cache-path=/Users/buildslave/jenkins/workspace/clang-stage2-coverage-R/clang-build/module.cache -fcxx-modules -Wall -Wextra -Wno-unused-parameter -Wwrite-strings -Wcast-qual -Wmissing-field-initializers -pedantic -Wno-long-long -Wimplicit-fallthrough -Wcovered-switch-default -Wno-noexcept-type -Wnon-virtual-dtor -Wdelete-non-virtual-dtor -Wstring-conversion -fdiagnostics-color -fprofile-instr-generate='/Users/buildslave/jenkins/workspace/clang-stage2-coverage-R/clang-build/profiles/%6m.profraw' -fcoverage-mapping -fno-common -Woverloaded-virtual -Wno-nested-anon-types -O3 -DNDEBUG -isysroot /Applications/Xcode.app/Contents/Developer/Platforms/MacOSX.platform/Developer/SDKs/MacOSX10.14.sdk    -fno-exceptions -fno-rtti -MD -MT tools/clang/tools/extra/clangd/CMakeFiles/obj.clangDaemon.dir/GlobalCompilationDatabase.cpp.o -MF tools/clang/tools/extra/clangd/CMakeFiles/obj.clangDaemon.dir/GlobalCompilationDatabase.cpp.o.d -o tools/clang/tools/extra/clangd/CMakeFiles/obj.clangDaemon.dir/GlobalCompilationDatabase.cpp.o -c /Users/buildslave/jenkins/workspace/clang-stage2-coverage-R/llvm/tools/clang/tools/extra/clangd/GlobalCompilationDatabase.cpp
[4000/4598] /Users/buildslave/jenkins/workspace/clang-stage2-coverage-R/host-compiler/bin/clang++  -DGTEST_HAS_RTTI=0 -D_GNU_SOURCE -D__STDC_CONSTANT_MACROS -D__STDC_FORMAT_MACROS -D__STDC_LIMIT_MACROS -Itools/clang/tools/extra/clangd -I/Users/buildslave/jenkins/workspace/clang-stage2-coverage-R/llvm/tools/clang/tools/extra/clangd -I/Users/buildslave/jenkins/workspace/clang-stage2-coverage-R/llvm/tools/clang/include -Itools/clang/include -I/Applications/Xcode.app/Contents/Developer/Platforms/MacOSX.platform/Developer/SDKs/MacOSX10.14.sdk/usr/include/libxml2 -Iinclude -I/Users/buildslave/jenkins/workspace/clang-stage2-coverage-R/llvm/include -fPIC -fvisibility-inlines-hidden -Werror=date-time -Werror=unguarded-availability-new -std=c++11 -fmodules -fmodules-cache-path=/Users/buildslave/jenkins/workspace/clang-stage2-coverage-R/clang-build/module.cache -fcxx-modules -Wall -Wextra -Wno-unused-parameter -Wwrite-strings -Wcast-qual -Wmissing-field-initializers -pedantic -Wno-long-long -Wimplicit-fallthrough -Wcovered-switch-default -Wno-noexcept-type -Wnon-virtual-dtor -Wdelete-non-virtual-dtor -Wstring-conversion -fdiagnostics-color -fprofile-instr-generate='/Users/buildslave/jenkins/workspace/clang-stage2-coverage-R/clang-build/profiles/%6m.profraw' -fcoverage-mapping -fno-common -Woverloaded-virtual -Wno-nested-anon-types -O3 -DNDEBUG -isysroot /Applications/Xcode.app/Contents/Developer/Platforms/MacOSX.platform/Developer/SDKs/MacOSX10.14.sdk    -fno-exceptions -fno-rtti -MD -MT tools/clang/tools/extra/clangd/CMakeFiles/obj.clangDaemon.dir/RIFF.cpp.o -MF tools/clang/tools/extra/clangd/CMakeFiles/obj.clangDaemon.dir/RIFF.cpp.o.d -o tools/clang/tools/extra/clangd/CMakeFiles/obj.clangDaemon.dir/RIFF.cpp.o -c /Users/buildslave/jenkins/workspace/clang-stage2-coverage-R/llvm/tools/clang/tools/extra/clangd/RIFF.cpp
[4001/4598] /Users/buildslave/jenkins/workspace/clang-stage2-coverage-R/host-compiler/bin/clang++  -DGTEST_HAS_RTTI=0 -D_GNU_SOURCE -D__STDC_CONSTANT_MACROS -D__STDC_FORMAT_MACROS -D__STDC_LIMIT_MACROS -Itools/clang/tools/extra/clangd -I/Users/buildslave/jenkins/workspace/clang-stage2-coverage-R/llvm/tools/clang/tools/extra/clangd -I/Users/buildslave/jenkins/workspace/clang-stage2-coverage-R/llvm/tools/clang/include -Itools/clang/include -I/Applications/Xcode.app/Contents/Developer/Platforms/MacOSX.platform/Developer/SDKs/MacOSX10.14.sdk/usr/include/libxml2 -Iinclude -I/Users/buildslave/jenkins/workspace/clang-stage2-coverage-R/llvm/include -fPIC -fvisibility-inlines-hidden -Werror=date-time -Werror=unguarded-availability-new -std=c++11 -fmodules -fmodules-cache-path=/Users/buildslave/jenkins/workspace/clang-stage2-coverage-R/clang-build/module.cache -fcxx-modules -Wall -Wextra -Wno-unused-parameter -Wwrite-strings -Wcast-qual -Wmissing-field-initializers -pedantic -Wno-long-long -Wimplicit-fallthrough -Wcovered-switch-default -Wno-noexcept-type -Wnon-virtual-dtor -Wdelete-non-virtual-dtor -Wstring-conversion -fdiagnostics-color -fprofile-instr-generate='/Users/buildslave/jenkins/workspace/clang-stage2-coverage-R/clang-build/profiles/%6m.profraw' -fcoverage-mapping -fno-common -Woverloaded-virtual -Wno-nested-anon-types -O3 -DNDEBUG -isysroot /Applications/Xcode.app/Contents/Developer/Platforms/MacOSX.platform/Developer/SDKs/MacOSX10.14.sdk    -fno-exceptions -fno-rtti -MD -MT tools/clang/tools/extra/clangd/CMakeFiles/obj.clangDaemon.dir/Quality.cpp.o -MF tools/clang/tools/extra/clangd/CMakeFiles/obj.clangDaemon.dir/Quality.cpp.o.d -o tools/clang/tools/extra/clangd/CMakeFiles/obj.clangDaemon.dir/Quality.cpp.o -c /Users/buildslave/jenkins/workspace/clang-stage2-coverage-R/llvm/tools/clang/tools/extra/clangd/Quality.cpp
[4002/4598] /Users/buildslave/jenkins/workspace/clang-stage2-coverage-R/host-compiler/bin/clang++  -DGTEST_HAS_RTTI=0 -D_GNU_SOURCE -D__STDC_CONSTANT_MACROS -D__STDC_FORMAT_MACROS -D__STDC_LIMIT_MACROS -Itools/clang/tools/extra/clangd -I/Users/buildslave/jenkins/workspace/clang-stage2-coverage-R/llvm/tools/clang/tools/extra/clangd -I/Users/buildslave/jenkins/workspace/clang-stage2-coverage-R/llvm/tools/clang/include -Itools/clang/include -I/Applications/Xcode.app/Contents/Developer/Platforms/MacOSX.platform/Developer/SDKs/MacOSX10.14.sdk/usr/include/libxml2 -Iinclude -I/Users/buildslave/jenkins/workspace/clang-stage2-coverage-R/llvm/include -fPIC -fvisibility-inlines-hidden -Werror=date-time -Werror=unguarded-availability-new -std=c++11 -fmodules -fmodules-cache-path=/Users/buildslave/jenkins/workspace/clang-stage2-coverage-R/clang-build/module.cache -fcxx-modules -Wall -Wextra -Wno-unused-parameter -Wwrite-strings -Wcast-qual -Wmissing-field-initializers -pedantic -Wno-long-long -Wimplicit-fallthrough -Wcovered-switch-default -Wno-noexcept-type -Wnon-virtual-dtor -Wdelete-non-virtual-dtor -Wstring-conversion -fdiagnostics-color -fprofile-instr-generate='/Users/buildslave/jenkins/workspace/clang-stage2-coverage-R/clang-build/profiles/%6m.profraw' -fcoverage-mapping -fno-common -Woverloaded-virtual -Wno-nested-anon-types -O3 -DNDEBUG -isysroot /Applications/Xcode.app/Contents/Developer/Platforms/MacOSX.platform/Developer/SDKs/MacOSX10.14.sdk    -fno-exceptions -fno-rtti -MD -MT tools/clang/tools/extra/clangd/CMakeFiles/obj.clangDaemon.dir/Protocol.cpp.o -MF tools/clang/tools/extra/clangd/CMakeFiles/obj.clangDaemon.dir/Protocol.cpp.o.d -o tools/clang/tools/extra/clangd/CMakeFiles/obj.clangDaemon.dir/Protocol.cpp.o -c /Users/buildslave/jenkins/workspace/clang-stage2-coverage-R/llvm/tools/clang/tools/extra/clangd/Protocol.cpp
[4003/4598] /Users/buildslave/jenkins/workspace/clang-stage2-coverage-R/host-compiler/bin/clang++  -DGTEST_HAS_RTTI=0 -D_GNU_SOURCE -D__STDC_CONSTANT_MACROS -D__STDC_FORMAT_MACROS -D__STDC_LIMIT_MACROS -Itools/clang/tools/extra/clangd -I/Users/buildslave/jenkins/workspace/clang-stage2-coverage-R/llvm/tools/clang/tools/extra/clangd -I/Users/buildslave/jenkins/workspace/clang-stage2-coverage-R/llvm/tools/clang/include -Itools/clang/include -I/Applications/Xcode.app/Contents/Developer/Platforms/MacOSX.platform/Developer/SDKs/MacOSX10.14.sdk/usr/include/libxml2 -Iinclude -I/Users/buildslave/jenkins/workspace/clang-stage2-coverage-R/llvm/include -fPIC -fvisibility-inlines-hidden -Werror=date-time -Werror=unguarded-availability-new -std=c++11 -fmodules -fmodules-cache-path=/Users/buildslave/jenkins/workspace/clang-stage2-coverage-R/clang-build/module.cache -fcxx-modules -Wall -Wextra -Wno-unused-parameter -Wwrite-strings -Wcast-qual -Wmissing-field-initializers -pedantic -Wno-long-long -Wimplicit-fallthrough -Wcovered-switch-default -Wno-noexcept-type -Wnon-virtual-dtor -Wdelete-non-virtual-dtor -Wstring-conversion -fdiagnostics-color -fprofile-instr-generate='/Users/buildslave/jenkins/workspace/clang-stage2-coverage-R/clang-build/profiles/%6m.profraw' -fcoverage-mapping -fno-common -Woverloaded-virtual -Wno-nested-anon-types -O3 -DNDEBUG -isysroot /Applications/Xcode.app/Contents/Developer/Platforms/MacOSX.platform/Developer/SDKs/MacOSX10.14.sdk    -fno-exceptions -fno-rtti -MD -MT tools/clang/tools/extra/clangd/CMakeFiles/obj.clangDaemon.dir/SourceCode.cpp.o -MF tools/clang/tools/extra/clangd/CMakeFiles/obj.clangDaemon.dir/SourceCode.cpp.o.d -o tools/clang/tools/extra/clangd/CMakeFiles/obj.clangDaemon.dir/SourceCode.cpp.o -c /Users/buildslave/jenkins/workspace/clang-stage2-coverage-R/llvm/tools/clang/tools/extra/clangd/SourceCode.cpp
[4004/4598] /Users/buildslave/jenkins/workspace/clang-stage2-coverage-R/host-compiler/bin/clang++  -DGTEST_HAS_RTTI=0 -D_GNU_SOURCE -D__STDC_CONSTANT_MACROS -D__STDC_FORMAT_MACROS -D__STDC_LIMIT_MACROS -Itools/clang/tools/extra/clangd -I/Users/buildslave/jenkins/workspace/clang-stage2-coverage-R/llvm/tools/clang/tools/extra/clangd -I/Users/buildslave/jenkins/workspace/clang-stage2-coverage-R/llvm/tools/clang/include -Itools/clang/include -I/Applications/Xcode.app/Contents/Developer/Platforms/MacOSX.platform/Developer/SDKs/MacOSX10.14.sdk/usr/include/libxml2 -Iinclude -I/Users/buildslave/jenkins/workspace/clang-stage2-coverage-R/llvm/include -fPIC -fvisibility-inlines-hidden -Werror=date-time -Werror=unguarded-availability-new -std=c++11 -fmodules -fmodules-cache-path=/Users/buildslave/jenkins/workspace/clang-stage2-coverage-R/clang-build/module.cache -fcxx-modules -Wall -Wextra -Wno-unused-parameter -Wwrite-strings -Wcast-qual -Wmissing-field-initializers -pedantic -Wno-long-long -Wimplicit-fallthrough -Wcovered-switch-default -Wno-noexcept-type -Wnon-virtual-dtor -Wdelete-non-virtual-dtor -Wstring-conversion -fdiagnostics-color -fprofile-instr-generate='/Users/buildslave/jenkins/workspace/clang-stage2-coverage-R/clang-build/profiles/%6m.profraw' -fcoverage-mapping -fno-common -Woverloaded-virtual -Wno-nested-anon-types -O3 -DNDEBUG -isysroot /Applications/Xcode.app/Contents/Developer/Platforms/MacOSX.platform/Developer/SDKs/MacOSX10.14.sdk    -fno-exceptions -fno-rtti -MD -MT tools/clang/tools/extra/clangd/CMakeFiles/obj.clangDaemon.dir/Threading.cpp.o -MF tools/clang/tools/extra/clangd/CMakeFiles/obj.clangDaemon.dir/Threading.cpp.o.d -o tools/clang/tools/extra/clangd/CMakeFiles/obj.clangDaemon.dir/Threading.cpp.o -c /Users/buildslave/jenkins/workspace/clang-stage2-coverage-R/llvm/tools/clang/tools/extra/clangd/Threading.cpp
[4005/4598] /Users/buildslave/jenkins/workspace/clang-stage2-coverage-R/host-compiler/bin/clang++  -DGTEST_HAS_RTTI=0 -D_GNU_SOURCE -D__STDC_CONSTANT_MACROS -D__STDC_FORMAT_MACROS -D__STDC_LIMIT_MACROS -Itools/clang/tools/extra/clangd -I/Users/buildslave/jenkins/workspace/clang-stage2-coverage-R/llvm/tools/clang/tools/extra/clangd -I/Users/buildslave/jenkins/workspace/clang-stage2-coverage-R/llvm/tools/clang/include -Itools/clang/include -I/Applications/Xcode.app/Contents/Developer/Platforms/MacOSX.platform/Developer/SDKs/MacOSX10.14.sdk/usr/include/libxml2 -Iinclude -I/Users/buildslave/jenkins/workspace/clang-stage2-coverage-R/llvm/include -fPIC -fvisibility-inlines-hidden -Werror=date-time -Werror=unguarded-availability-new -std=c++11 -fmodules -fmodules-cache-path=/Users/buildslave/jenkins/workspace/clang-stage2-coverage-R/clang-build/module.cache -fcxx-modules -Wall -Wextra -Wno-unused-parameter -Wwrite-strings -Wcast-qual -Wmissing-field-initializers -pedantic -Wno-long-long -Wimplicit-fallthrough -Wcovered-switch-default -Wno-noexcept-type -Wnon-virtual-dtor -Wdelete-non-virtual-dtor -Wstring-conversion -fdiagnostics-color -fprofile-instr-generate='/Users/buildslave/jenkins/workspace/clang-stage2-coverage-R/clang-build/profiles/%6m.profraw' -fcoverage-mapping -fno-common -Woverloaded-virtual -Wno-nested-anon-types -O3 -DNDEBUG -isysroot /Applications/Xcode.app/Contents/Developer/Platforms/MacOSX.platform/Developer/SDKs/MacOSX10.14.sdk    -fno-exceptions -fno-rtti -MD -MT tools/clang/tools/extra/clangd/CMakeFiles/obj.clangDaemon.dir/Trace.cpp.o -MF tools/clang/tools/extra/clangd/CMakeFiles/obj.clangDaemon.dir/Trace.cpp.o.d -o tools/clang/tools/extra/clangd/CMakeFiles/obj.clangDaemon.dir/Trace.cpp.o -c /Users/buildslave/jenkins/workspace/clang-stage2-coverage-R/llvm/tools/clang/tools/extra/clangd/Trace.cpp
[4006/4598] /Users/buildslave/jenkins/workspace/clang-stage2-coverage-R/host-compiler/bin/clang++  -DGTEST_HAS_RTTI=0 -D_GNU_SOURCE -D__STDC_CONSTANT_MACROS -D__STDC_FORMAT_MACROS -D__STDC_LIMIT_MACROS -Itools/clang/tools/extra/clangd -I/Users/buildslave/jenkins/workspace/clang-stage2-coverage-R/llvm/tools/clang/tools/extra/clangd -I/Users/buildslave/jenkins/workspace/clang-stage2-coverage-R/llvm/tools/clang/include -Itools/clang/include -I/Applications/Xcode.app/Contents/Developer/Platforms/MacOSX.platform/Developer/SDKs/MacOSX10.14.sdk/usr/include/libxml2 -Iinclude -I/Users/buildslave/jenkins/workspace/clang-stage2-coverage-R/llvm/include -fPIC -fvisibility-inlines-hidden -Werror=date-time -Werror=unguarded-availability-new -std=c++11 -fmodules -fmodules-cache-path=/Users/buildslave/jenkins/workspace/clang-stage2-coverage-R/clang-build/module.cache -fcxx-modules -Wall -Wextra -Wno-unused-parameter -Wwrite-strings -Wcast-qual -Wmissing-field-initializers -pedantic -Wno-long-long -Wimplicit-fallthrough -Wcovered-switch-default -Wno-noexcept-type -Wnon-virtual-dtor -Wdelete-non-virtual-dtor -Wstring-conversion -fdiagnostics-color -fprofile-instr-generate='/Users/buildslave/jenkins/workspace/clang-stage2-coverage-R/clang-build/profiles/%6m.profraw' -fcoverage-mapping -fno-common -Woverloaded-virtual -Wno-nested-anon-types -O3 -DNDEBUG -isysroot /Applications/Xcode.app/Contents/Developer/Platforms/MacOSX.platform/Developer/SDKs/MacOSX10.14.sdk    -fno-exceptions -fno-rtti -MD -MT tools/clang/tools/extra/clangd/CMakeFiles/obj.clangDaemon.dir/QueryDriverDatabase.cpp.o -MF tools/clang/tools/extra/clangd/CMakeFiles/obj.clangDaemon.dir/QueryDriverDatabase.cpp.o.d -o tools/clang/tools/extra/clangd/CMakeFiles/obj.clangDaemon.dir/QueryDriverDatabase.cpp.o -c /Users/buildslave/jenkins/workspace/clang-stage2-coverage-R/llvm/tools/clang/tools/extra/clangd/QueryDriverDatabase.cpp
[4007/4598] /Users/buildslave/jenkins/workspace/clang-stage2-coverage-R/host-compiler/bin/clang++  -DGTEST_HAS_RTTI=0 -D_GNU_SOURCE -D__STDC_CONSTANT_MACROS -D__STDC_FORMAT_MACROS -D__STDC_LIMIT_MACROS -Itools/clang/tools/extra/clangd -I/Users/buildslave/jenkins/workspace/clang-stage2-coverage-R/llvm/tools/clang/tools/extra/clangd -I/Users/buildslave/jenkins/workspace/clang-stage2-coverage-R/llvm/tools/clang/include -Itools/clang/include -I/Applications/Xcode.app/Contents/Developer/Platforms/MacOSX.platform/Developer/SDKs/MacOSX10.14.sdk/usr/include/libxml2 -Iinclude -I/Users/buildslave/jenkins/workspace/clang-stage2-coverage-R/llvm/include -fPIC -fvisibility-inlines-hidden -Werror=date-time -Werror=unguarded-availability-new -std=c++11 -fmodules -fmodules-cache-path=/Users/buildslave/jenkins/workspace/clang-stage2-coverage-R/clang-build/module.cache -fcxx-modules -Wall -Wextra -Wno-unused-parameter -Wwrite-strings -Wcast-qual -Wmissing-field-initializers -pedantic -Wno-long-long -Wimplicit-fallthrough -Wcovered-switch-default -Wno-noexcept-type -Wnon-virtual-dtor -Wdelete-non-virtual-dtor -Wstring-conversion -fdiagnostics-color -fprofile-instr-generate='/Users/buildslave/jenkins/workspace/clang-stage2-coverage-R/clang-build/profiles/%6m.profraw' -fcoverage-mapping -fno-common -Woverloaded-virtual -Wno-nested-anon-types -O3 -DNDEBUG -isysroot /Applications/Xcode.app/Contents/Developer/Platforms/MacOSX.platform/Developer/SDKs/MacOSX10.14.sdk    -fno-exceptions -fno-rtti -MD -MT tools/clang/tools/extra/clangd/CMakeFiles/obj.clangDaemon.dir/URI.cpp.o -MF tools/clang/tools/extra/clangd/CMakeFiles/obj.clangDaemon.dir/URI.cpp.o.d -o tools/clang/tools/extra/clangd/CMakeFiles/obj.clangDaemon.dir/URI.cpp.o -c /Users/buildslave/jenkins/workspace/clang-stage2-coverage-R/llvm/tools/clang/tools/extra/clangd/URI.cpp
[4008/4598] /Users/buildslave/jenkins/workspace/clang-stage2-coverage-R/host-compiler/bin/clang++  -DGTEST_HAS_RTTI=0 -D_GNU_SOURCE -D__STDC_CONSTANT_MACROS -D__STDC_FORMAT_MACROS -D__STDC_LIMIT_MACROS -Itools/clang/tools/extra/clangd -I/Users/buildslave/jenkins/workspace/clang-stage2-coverage-R/llvm/tools/clang/tools/extra/clangd -I/Users/buildslave/jenkins/workspace/clang-stage2-coverage-R/llvm/tools/clang/include -Itools/clang/include -I/Applications/Xcode.app/Contents/Developer/Platforms/MacOSX.platform/Developer/SDKs/MacOSX10.14.sdk/usr/include/libxml2 -Iinclude -I/Users/buildslave/jenkins/workspace/clang-stage2-coverage-R/llvm/include -fPIC -fvisibility-inlines-hidden -Werror=date-time -Werror=unguarded-availability-new -std=c++11 -fmodules -fmodules-cache-path=/Users/buildslave/jenkins/workspace/clang-stage2-coverage-R/clang-build/module.cache -fcxx-modules -Wall -Wextra -Wno-unused-parameter -Wwrite-strings -Wcast-qual -Wmissing-field-initializers -pedantic -Wno-long-long -Wimplicit-fallthrough -Wcovered-switch-default -Wno-noexcept-type -Wnon-virtual-dtor -Wdelete-non-virtual-dtor -Wstring-conversion -fdiagnostics-color -fprofile-instr-generate='/Users/buildslave/jenkins/workspace/clang-stage2-coverage-R/clang-build/profiles/%6m.profraw' -fcoverage-mapping -fno-common -Woverloaded-virtual -Wno-nested-anon-types -O3 -DNDEBUG -isysroot /Applications/Xcode.app/Contents/Developer/Platforms/MacOSX.platform/Developer/SDKs/MacOSX10.14.sdk    -fno-exceptions -fno-rtti -MD -MT tools/clang/tools/extra/clangd/CMakeFiles/obj.clangDaemon.dir/Selection.cpp.o -MF tools/clang/tools/extra/clangd/CMakeFiles/obj.clangDaemon.dir/Selection.cpp.o.d -o tools/clang/tools/extra/clangd/CMakeFiles/obj.clangDaemon.dir/Selection.cpp.o -c /Users/buildslave/jenkins/workspace/clang-stage2-coverage-R/llvm/tools/clang/tools/extra/clangd/Selection.cpp
[4009/4598] /Users/buildslave/jenkins/workspace/clang-stage2-coverage-R/host-compiler/bin/clang++  -DGTEST_HAS_RTTI=0 -D_GNU_SOURCE -D__STDC_CONSTANT_MACROS -D__STDC_FORMAT_MACROS -D__STDC_LIMIT_MACROS -Itools/clang/tools/extra/clangd -I/Users/buildslave/jenkins/workspace/clang-stage2-coverage-R/llvm/tools/clang/tools/extra/clangd -I/Users/buildslave/jenkins/workspace/clang-stage2-coverage-R/llvm/tools/clang/include -Itools/clang/include -I/Applications/Xcode.app/Contents/Developer/Platforms/MacOSX.platform/Developer/SDKs/MacOSX10.14.sdk/usr/include/libxml2 -Iinclude -I/Users/buildslave/jenkins/workspace/clang-stage2-coverage-R/llvm/include -fPIC -fvisibility-inlines-hidden -Werror=date-time -Werror=unguarded-availability-new -std=c++11 -fmodules -fmodules-cache-path=/Users/buildslave/jenkins/workspace/clang-stage2-coverage-R/clang-build/module.cache -fcxx-modules -Wall -Wextra -Wno-unused-parameter -Wwrite-strings -Wcast-qual -Wmissing-field-initializers -pedantic -Wno-long-long -Wimplicit-fallthrough -Wcovered-switch-default -Wno-noexcept-type -Wnon-virtual-dtor -Wdelete-non-virtual-dtor -Wstring-conversion -fdiagnostics-color -fprofile-instr-generate='/Users/buildslave/jenkins/workspace/clang-stage2-coverage-R/clang-build/profiles/%6m.profraw' -fcoverage-mapping -fno-common -Woverloaded-virtual -Wno-nested-anon-types -O3 -DNDEBUG -isysroot /Applications/Xcode.app/Contents/Developer/Platforms/MacOSX.platform/Developer/SDKs/MacOSX10.14.sdk    -fno-exceptions -fno-rtti -MD -MT tools/clang/tools/extra/clangd/CMakeFiles/obj.clangDaemon.dir/FindSymbols.cpp.o -MF tools/clang/tools/extra/clangd/CMakeFiles/obj.clangDaemon.dir/FindSymbols.cpp.o.d -o tools/clang/tools/extra/clangd/CMakeFiles/obj.clangDaemon.dir/FindSymbols.cpp.o -c /Users/buildslave/jenkins/workspace/clang-stage2-coverage-R/llvm/tools/clang/tools/extra/clangd/FindSymbols.cpp
FAILED: tools/clang/tools/extra/clangd/CMakeFiles/obj.clangDaemon.dir/FindSymbols.cpp.o 
/Users/buildslave/jenkins/workspace/clang-stage2-coverage-R/host-compiler/bin/clang++  -DGTEST_HAS_RTTI=0 -D_GNU_SOURCE -D__STDC_CONSTANT_MACROS -D__STDC_FORMAT_MACROS -D__STDC_LIMIT_MACROS -Itools/clang/tools/extra/clangd -I/Users/buildslave/jenkins/workspace/clang-stage2-coverage-R/llvm/tools/clang/tools/extra/clangd -I/Users/buildslave/jenkins/workspace/clang-stage2-coverage-R/llvm/tools/clang/include -Itools/clang/include -I/Applications/Xcode.app/Contents/Developer/Platforms/MacOSX.platform/Developer/SDKs/MacOSX10.14.sdk/usr/include/libxml2 -Iinclude -I/Users/buildslave/jenkins/workspace/clang-stage2-coverage-R/llvm/include -fPIC -fvisibility-inlines-hidden -Werror=date-time -Werror=unguarded-availability-new -std=c++11 -fmodules -fmodules-cache-path=/Users/buildslave/jenkins/workspace/clang-stage2-coverage-R/clang-build/module.cache -fcxx-modules -Wall -Wextra -Wno-unused-parameter -Wwrite-strings -Wcast-qual -Wmissing-field-initializers -pedantic -Wno-long-long -Wimplicit-fallthrough -Wcovered-switch-default -Wno-noexcept-type -Wnon-virtual-dtor -Wdelete-non-virtual-dtor -Wstring-conversion -fdiagnostics-color -fprofile-instr-generate='/Users/buildslave/jenkins/workspace/clang-stage2-coverage-R/clang-build/profiles/%6m.profraw' -fcoverage-mapping -fno-common -Woverloaded-virtual -Wno-nested-anon-types -O3 -DNDEBUG -isysroot /Applications/Xcode.app/Contents/Developer/Platforms/MacOSX.platform/Developer/SDKs/MacOSX10.14.sdk    -fno-exceptions -fno-rtti -MD -MT tools/clang/tools/extra/clangd/CMakeFiles/obj.clangDaemon.dir/FindSymbols.cpp.o -MF tools/clang/tools/extra/clangd/CMakeFiles/obj.clangDaemon.dir/FindSymbols.cpp.o.d -o tools/clang/tools/extra/clangd/CMakeFiles/obj.clangDaemon.dir/FindSymbols.cpp.o -c /Users/buildslave/jenkins/workspace/clang-stage2-coverage-R/llvm/tools/clang/tools/extra/clangd/FindSymbols.cpp
Assertion failed: (CachedFieldIndex && "failed to find field in parent"), function getFieldIndex, file /Users/buildslave/jenkins/workspace/clang-stage1-configure-RA/llvm/tools/clang/lib/AST/Decl.cpp, line 3965.
Stack dump:
0.	Program arguments: /Users/buildslave/jenkins/workspace/clang-stage2-coverage-R/host-compiler/bin/clang-9 -cc1 -triple x86_64-apple-macosx10.14.0 -Wdeprecated-objc-isa-usage -Werror=deprecated-objc-isa-usage -emit-obj -disable-free -main-file-name FindSymbols.cpp -mrelocation-model pic -pic-level 2 -mthread-model posix -mdisable-fp-elim -masm-verbose -munwind-tables -target-sdk-version=10.14 -target-cpu penryn -dwarf-column-info -debugger-tuning=lldb -ggnu-pubnames -target-linker-version 409.12 -fprofile-instrument-path=/Users/buildslave/jenkins/workspace/clang-stage2-coverage-R/clang-build/profiles/%6m.profraw -fprofile-instrument=clang -fcoverage-mapping -coverage-notes-file /Users/buildslave/jenkins/workspace/clang-stage2-coverage-R/clang-build/tools/clang/tools/extra/clangd/CMakeFiles/obj.clangDaemon.dir/FindSymbols.cpp.gcno -resource-dir /Users/buildslave/jenkins/workspace/clang-stage2-coverage-R/host-compiler/lib/clang/9.0.0 -dependency-file tools/clang/tools/extra/clangd/CMakeFiles/obj.clangDaemon.dir/FindSymbols.cpp.o.d -sys-header-deps -MT tools/clang/tools/extra/clangd/CMakeFiles/obj.clangDaemon.dir/FindSymbols.cpp.o -isysroot /Applications/Xcode.app/Contents/Developer/Platforms/MacOSX.platform/Developer/SDKs/MacOSX10.14.sdk -D GTEST_HAS_RTTI=0 -D _GNU_SOURCE -D __STDC_CONSTANT_MACROS -D __STDC_FORMAT_MACROS -D __STDC_LIMIT_MACROS -I tools/clang/tools/extra/clangd -I /Users/buildslave/jenkins/workspace/clang-stage2-coverage-R/llvm/tools/clang/tools/extra/clangd -I /Users/buildslave/jenkins/workspace/clang-stage2-coverage-R/llvm/tools/clang/include -I tools/clang/include -I /Applications/Xcode.app/Contents/Developer/Platforms/MacOSX.platform/Developer/SDKs/MacOSX10.14.sdk/usr/include/libxml2 -I include -I /Users/buildslave/jenkins/workspace/clang-stage2-coverage-R/llvm/include -D NDEBUG -stdlib=libc++ -internal-isystem /Users/buildslave/jenkins/workspace/clang-stage2-coverage-R/host-compiler/bin/../include/c++/v1 -internal-isystem /Applications/Xcode.app/Contents/Developer/Platforms/MacOSX.platform/Developer/SDKs/MacOSX10.14.sdk/usr/include/c++/v1 -internal-isystem /Applications/Xcode.app/Contents/Developer/Platforms/MacOSX.platform/Developer/SDKs/MacOSX10.14.sdk/usr/local/include -internal-isystem /Users/buildslave/jenkins/workspace/clang-stage2-coverage-R/host-compiler/lib/clang/9.0.0/include -internal-externc-isystem /Applications/Xcode.app/Contents/Developer/Platforms/MacOSX.platform/Developer/SDKs/MacOSX10.14.sdk/usr/include -O3 -Werror=date-time -Werror=unguarded-availability-new -Wall -Wextra -Wno-unused-parameter -Wwrite-strings -Wcast-qual -Wmissing-field-initializers -Wno-long-long -Wimplicit-fallthrough -Wcovered-switch-default -Wno-noexcept-type -Wnon-virtual-dtor -Wdelete-non-virtual-dtor -Wstring-conversion -Woverloaded-virtual -Wno-nested-anon-types -pedantic -std=c++11 -fdeprecated-macro -fdebug-compilation-dir /Users/buildslave/jenkins/workspace/clang-stage2-coverage-R/clang-build -ferror-limit 19 -fmessage-length 0 -fvisibility-inlines-hidden -stack-protector 1 -fblocks -fencode-extended-block-signature -fno-rtti -fregister-global-dtors-with-atexit -fmodules -fimplicit-module-maps -fmodules-cache-path=/Users/buildslave/jenkins/workspace/clang-stage2-coverage-R/clang-build/module.cache -fmodules-validate-system-headers -fobjc-runtime=macosx-10.14.0 -fmax-type-align=16 -fno-common -fdiagnostics-show-option -fcolor-diagnostics -vectorize-loops -vectorize-slp -o tools/clang/tools/extra/clangd/CMakeFiles/obj.clangDaemon.dir/FindSymbols.cpp.o -x c++ /Users/buildslave/jenkins/workspace/clang-stage2-coverage-R/llvm/tools/clang/tools/extra/clangd/FindSymbols.cpp 
1.	<eof> parser at end of file
2.	Per-file LLVM IR generation
3.	/Users/buildslave/jenkins/workspace/clang-stage2-coverage-R/llvm/include/llvm/Support/Error.h:625:17: Generating code for declaration 'llvm::Expected<std::__1::basic_string<char> >::getStorage'
0  clang-9                  0x00000001063912b8 llvm::sys::PrintStackTrace(llvm::raw_ostream&) + 40
1  clang-9                  0x0000000106390465 llvm::sys::RunSignalHandlers() + 85
2  clang-9                  0x00000001063918c8 SignalHandler(int) + 264
3  libsystem_platform.dylib 0x00007fff7bacbb3d _sigtramp + 29
4  clang-9                  0x00000001062f2ad6 llvm::FoldingSetBase::FindNodeOrInsertPos(llvm::FoldingSetNodeID const&, void*&) + 182
5  libsystem_c.dylib        0x00007fff7b98a1c9 abort + 127
6  libsystem_c.dylib        0x00007fff7b952868 basename_r + 0
7  clang-9                  0x000000010810dbe6 clang::FieldDecl::getFieldIndex() const + 694
8  clang-9                  0x00000001066848b5 clang::CodeGen::CodeGenFunction::EmitLValueForField(clang::CodeGen::LValue, clang::FieldDecl const*) + 1413
9  clang-9                  0x000000010668f5df clang::CodeGen::CodeGenFunction::EmitMemberExpr(clang::MemberExpr const*) + 1247
10 clang-9                  0x000000010668124a clang::CodeGen::CodeGenFunction::EmitLValue(clang::Expr const*) + 1018
11 clang-9                  0x000000010668973d clang::CodeGen::CodeGenFunction::EmitCheckedLValue(clang::Expr const*, clang::CodeGen::CodeGenFunction::TypeCheckKind) + 173
12 clang-9                  0x000000010668f236 clang::CodeGen::CodeGenFunction::EmitMemberExpr(clang::MemberExpr const*) + 310
13 clang-9                  0x000000010668124a clang::CodeGen::CodeGenFunction::EmitLValue(clang::Expr const*) + 1018
14 clang-9                  0x00000001066907fc clang::CodeGen::CodeGenFunction::EmitCastLValue(clang::CastExpr const*) + 1372
15 clang-9                  0x0000000106680ecf clang::CodeGen::CodeGenFunction::EmitLValue(clang::Expr const*) + 127
16 clang-9                  0x000000010668973d clang::CodeGen::CodeGenFunction::EmitCheckedLValue(clang::Expr const*, clang::CodeGen::CodeGenFunction::TypeCheckKind) + 173
17 clang-9                  0x000000010668f236 clang::CodeGen::CodeGenFunction::EmitMemberExpr(clang::MemberExpr const*) + 310
18 clang-9                  0x000000010668124a clang::CodeGen::CodeGenFunction::EmitLValue(clang::Expr const*) + 1018
19 clang-9                  0x0000000106689047 clang::CodeGen::CodeGenFunction::EmitArrayToPointerDecay(clang::Expr const*, clang::CodeGen::LValueBaseInfo*, clang::CodeGen::TBAAAccessInfo*) + 119
20 clang-9                  0x00000001066d9c98 (anonymous namespace)::ScalarExprEmitter::VisitCastExpr(clang::CastExpr*) + 3896
21 clang-9                  0x00000001066d8e04 (anonymous namespace)::ScalarExprEmitter::VisitCastExpr(clang::CastExpr*) + 164
22 clang-9                  0x00000001066c6e88 clang::CodeGen::CodeGenFunction::EmitScalarExpr(clang::Expr const*, bool) + 104
23 clang-9                  0x00000001067bb866 clang::CodeGen::CodeGenFunction::EmitReturnStmt(clang::ReturnStmt const&) + 1430
24 clang-9                  0x00000001067b8a72 clang::CodeGen::CodeGenFunction::EmitStmt(clang::Stmt const*, llvm::ArrayRef<clang::Attr const*>) + 2482
25 clang-9                  0x00000001067c0def clang::CodeGen::CodeGenFunction::EmitCompoundStmtWithoutScope(clang::CompoundStmt const&, bool, clang::CodeGen::AggValueSlot) + 95
26 clang-9                  0x0000000106800ae7 clang::CodeGen::CodeGenFunction::GenerateCode(clang::GlobalDecl, llvm::Function*, clang::CodeGen::CGFunctionInfo const&) + 791
27 clang-9                  0x000000010681b887 clang::CodeGen::CodeGenModule::EmitGlobalFunctionDefinition(clang::GlobalDecl, llvm::GlobalValue*) + 503
28 clang-9                  0x00000001068157a6 clang::CodeGen::CodeGenModule::EmitGlobalDefinition(clang::GlobalDecl, llvm::GlobalValue*) + 486
29 clang-9                  0x000000010680b791 clang::CodeGen::CodeGenModule::EmitDeferred() + 289
30 clang-9                  0x000000010680b7b9 clang::CodeGen::CodeGenModule::EmitDeferred() + 329
31 clang-9                  0x000000010680b7b9 clang::CodeGen::CodeGenModule::EmitDeferred() + 329
32 clang-9                  0x000000010680aa8a clang::CodeGen::CodeGenModule::Release() + 42
33 clang-9                  0x0000000106892864 (anonymous namespace)::CodeGeneratorImpl::HandleTranslationUnit(clang::ASTContext&) + 100
34 clang-9                  0x00000001067f7516 clang::BackendConsumer::HandleTranslationUnit(clang::ASTContext&) + 134
35 clang-9                  0x00000001076f0173 clang::ParseAST(clang::Sema&, bool, bool) + 611
36 clang-9                  0x0000000106a770c4 clang::FrontendAction::Execute() + 84
37 clang-9                  0x0000000106a28a68 clang::CompilerInstance::ExecuteAction(clang::FrontendAction&) + 1544
38 clang-9                  0x0000000106aef7c0 clang::ExecuteCompilerInvocation(clang::CompilerInstance*) + 1808
39 clang-9                  0x0000000104798074 cc1_main(llvm::ArrayRef<char const*>, char const*, void*) + 2356
40 clang-9                  0x00000001047956f3 main + 10851
41 libdyld.dylib            0x00007fff7b8e2085 start + 1
clang-9: error: unable to execute command: Abort trap: 6
clang-9: error: clang frontend command failed due to signal (use -v to see invocation)
clang version 9.0.0 (trunk)
Target: x86_64-apple-darwin18.0.0
Thread model: posix
InstalledDir: /Users/buildslave/jenkins/workspace/clang-stage2-coverage-R/host-compiler/bin
clang-9: note: diagnostic msg: PLEASE submit a bug report to https://bugs.llvm.org/ and include the crash backtrace, preprocessed source, and associated run script.
clang-9: note: diagnostic msg: 
********************

Hide Details

PLEASE ATTACH THE FOLLOWING FILES TO THE BUG REPORT: Preprocessed source(s) and associated run script(s) are located at: clang-9: note: diagnostic msg: /var/folders/09/r4vw4v8n5kb67jl66zvlbljw0000gn/T/FindSymbols-681439.cpp clang-9: note: diagnostic msg: /var/folders/09/r4vw4v8n5kb67jl66zvlbljw0000gn/T/FindSymbols-681439.cache clang-9: note: diagnostic msg: /var/folders/09/r4vw4v8n5kb67jl66zvlbljw0000gn/T/FindSymbols-681439.sh clang-9: note: diagnostic msg: Crash backtrace is located in clang-9: note: diagnostic msg: /Users/buildslave/Library/Logs/DiagnosticReports/clang-9_<YYYY-MM-DD-HHMMSS>_<hostname>.crash clang-9: note: diagnostic msg: (choose the .crash file that corresponds to your crash) clang-9: note: diagnostic msg:

Hide Details

******************** [4010/4598] /Users/buildslave/jenkins/workspace/clang-stage2-coverage-R/host-compiler/bin/clang++ -DGTEST_HAS_RTTI=0 -D_GNU_SOURCE -D__STDC_CONSTANT_MACROS -D__STDC_FORMAT_MACROS -D__STDC_LIMIT_MACROS -Itools/clang/tools/extra/clangd -I/Users/buildslave/jenkins/workspace/clang-stage2-coverage-R/llvm/tools/clang/tools/extra/clangd -I/Users/buildslave/jenkins/workspace/clang-stage2-coverage-R/llvm/tools/clang/include -Itools/clang/include -I/Applications/Xcode.app/Contents/Developer/Platforms/MacOSX.platform/Developer/SDKs/MacOSX10.14.sdk/usr/include/libxml2 -Iinclude -I/Users/buildslave/jenkins/workspace/clang-stage2-coverage-R/llvm/include -fPIC -fvisibility-inlines-hidden -Werror=date-time -Werror=unguarded-availability-new -std=c++11 -fmodules -fmodules-cache-path=/Users/buildslave/jenkins/workspace/clang-stage2-coverage-R/clang-build/module.cache -fcxx-modules -Wall -Wextra -Wno-unused-parameter -Wwrite-strings -Wcast-qual -Wmissing-field-initializers -pedantic -Wno-long-long -Wimplicit-fallthrough -Wcovered-switch-default -Wno-noexcept-type -Wnon-virtual-dtor -Wdelete-non-virtual-dtor -Wstring-conversion -fdiagnostics-color -fprofile-instr-generate='/Users/buildslave/jenkins/workspace/clang-stage2-coverage-R/clang-build/profiles/%6m.profraw' -fcoverage-mapping -fno-common -Woverloaded-virtual -Wno-nested-anon-types -O3 -DNDEBUG -isysroot /Applications/Xcode.app/Contents/Developer/Platforms/MacOSX.platform/Developer/SDKs/MacOSX10.14.sdk -fno-exceptions -fno-rtti -MD -MT tools/clang/tools/extra/clangd/CMakeFiles/obj.clangDaemon.dir/SemanticHighlighting.cpp.o -MF tools/clang/tools/extra/clangd/CMakeFiles/obj.clangDaemon.dir/SemanticHighlighting.cpp.o.d -o tools/clang/tools/extra/clangd/CMakeFiles/obj.clangDaemon.dir/SemanticHighlighting.cpp.o -c /Users/buildslave/jenkins/workspace/clang-stage2-coverage-R/llvm/tools/clang/tools/extra/clangd/SemanticHighlighting.cpp [4011/4598] /Users/buildslave/jenkins/workspace/clang-stage2-coverage-R/host-compiler/bin/clang++ -DGTEST_HAS_RTTI=0 -D_GNU_SOURCE -D__STDC_CONSTANT_MACROS -D__STDC_FORMAT_MACROS -D__STDC_LIMIT_MACROS -Itools/clang/tools/extra/clangd -I/Users/buildslave/jenkins/workspace/clang-stage2-coverage-R/llvm/tools/clang/tools/extra/clangd -I/Users/buildslave/jenkins/workspace/clang-stage2-coverage-R/llvm/tools/clang/include -Itools/clang/include -I/Applications/Xcode.app/Contents/Developer/Platforms/MacOSX.platform/Developer/SDKs/MacOSX10.14.sdk/usr/include/libxml2 -Iinclude -I/Users/buildslave/jenkins/workspace/clang-stage2-coverage-R/llvm/include -fPIC -fvisibility-inlines-hidden -Werror=date-time -Werror=unguarded-availability-new -std=c++11 -fmodules -fmodules-cache-path=/Users/buildslave/jenkins/workspace/clang-stage2-coverage-R/clang-build/module.cache -fcxx-modules -Wall -Wextra -Wno-unused-parameter -Wwrite-strings -Wcast-qual -Wmissing-field-initializers -pedantic -Wno-long-long -Wimplicit-fallthrough -Wcovered-switch-default -Wno-noexcept-type -Wnon-virtual-dtor -Wdelete-non-virtual-dtor -Wstring-conversion -fdiagnostics-color -fprofile-instr-generate='/Users/buildslave/jenkins/workspace/clang-stage2-coverage-R/clang-build/profiles/%6m.profraw' -fcoverage-mapping -fno-common -Woverloaded-virtual -Wno-nested-anon-types -O3 -DNDEBUG -isysroot /Applications/Xcode.app/Contents/Developer/Platforms/MacOSX.platform/Developer/SDKs/MacOSX10.14.sdk -fno-exceptions -fno-rtti -MD -MT tools/clang/tools/extra/clangd/CMakeFiles/obj.clangDaemon.dir/TUScheduler.cpp.o -MF tools/clang/tools/extra/clangd/CMakeFiles/obj.clangDaemon.dir/TUScheduler.cpp.o.d -o tools/clang/tools/extra/clangd/CMakeFiles/obj.clangDaemon.dir/TUScheduler.cpp.o -c /Users/buildslave/jenkins/workspace/clang-stage2-coverage-R/llvm/tools/clang/tools/extra/clangd/TUScheduler.cpp [4012/4598] /Users/buildslave/jenkins/workspace/clang-stage2-coverage-R/host-compiler/bin/clang++ -DGTEST_HAS_RTTI=0 -D_GNU_SOURCE -D__STDC_CONSTANT_MACROS -D__STDC_FORMAT_MACROS -D__STDC_LIMIT_MACROS -Itools/clang/tools/extra/clangd -I/Users/buildslave/jenkins/workspace/clang-stage2-coverage-R/llvm/tools/clang/tools/extra/clangd -I/Users/buildslave/jenkins/workspace/clang-stage2-coverage-R/llvm/tools/clang/include -Itools/clang/include -I/Applications/Xcode.app/Contents/Developer/Platforms/MacOSX.platform/Developer/SDKs/MacOSX10.14.sdk/usr/include/libxml2 -Iinclude -I/Users/buildslave/jenkins/workspace/clang-stage2-coverage-R/llvm/include -fPIC -fvisibility-inlines-hidden -Werror=date-time -Werror=unguarded-availability-new -std=c++11 -fmodules -fmodules-cache-path=/Users/buildslave/jenkins/workspace/clang-stage2-coverage-R/clang-build/module.cache -fcxx-modules -Wall -Wextra -Wno-unused-parameter -Wwrite-strings -Wcast-qual -Wmissing-field-initializers -pedantic -Wno-long-long -Wimplicit-fallthrough -Wcovered-switch-default -Wno-noexcept-type -Wnon-virtual-dtor -Wdelete-non-virtual-dtor -Wstring-conversion -fdiagnostics-color -fprofile-instr-generate='/Users/buildslave/jenkins/workspace/clang-stage2-coverage-R/clang-build/profiles/%6m.profraw' -fcoverage-mapping -fno-common -Woverloaded-virtual -Wno-nested-anon-types -O3 -DNDEBUG -isysroot /Applications/Xcode.app/Contents/Developer/Platforms/MacOSX.platform/Developer/SDKs/MacOSX10.14.sdk -fno-exceptions -fno-rtti -MD -MT tools/clang/tools/extra/clangd/CMakeFiles/obj.clangDaemon.dir/Headers.cpp.o -MF tools/clang/tools/extra/clangd/CMakeFiles/obj.clangDaemon.dir/Headers.cpp.o.d -o tools/clang/tools/extra/clangd/CMakeFiles/obj.clangDaemon.dir/Headers.cpp.o -c /Users/buildslave/jenkins/workspace/clang-stage2-coverage-R/llvm/tools/clang/tools/extra/clangd/Headers.cpp FAILED: tools/clang/tools/extra/clangd/CMakeFiles/obj.clangDaemon.dir/Headers.cpp.o /Users/buildslave/jenkins/workspace/clang-stage2-coverage-R/host-compiler/bin/clang++ -DGTEST_HAS_RTTI=0 -D_GNU_SOURCE -D__STDC_CONSTANT_MACROS -D__STDC_FORMAT_MACROS -D__STDC_LIMIT_MACROS -Itools/clang/tools/extra/clangd -I/Users/buildslave/jenkins/workspace/clang-stage2-coverage-R/llvm/tools/clang/tools/extra/clangd -I/Users/buildslave/jenkins/workspace/clang-stage2-coverage-R/llvm/tools/clang/include -Itools/clang/include -I/Applications/Xcode.app/Contents/Developer/Platforms/MacOSX.platform/Developer/SDKs/MacOSX10.14.sdk/usr/include/libxml2 -Iinclude -I/Users/buildslave/jenkins/workspace/clang-stage2-coverage-R/llvm/include -fPIC -fvisibility-inlines-hidden -Werror=date-time -Werror=unguarded-availability-new -std=c++11 -fmodules -fmodules-cache-path=/Users/buildslave/jenkins/workspace/clang-stage2-coverage-R/clang-build/module.cache -fcxx-modules -Wall -Wextra -Wno-unused-parameter -Wwrite-strings -Wcast-qual -Wmissing-field-initializers -pedantic -Wno-long-long -Wimplicit-fallthrough -Wcovered-switch-default -Wno-noexcept-type -Wnon-virtual-dtor -Wdelete-non-virtual-dtor -Wstring-conversion -fdiagnostics-color -fprofile-instr-generate='/Users/buildslave/jenkins/workspace/clang-stage2-coverage-R/clang-build/profiles/%6m.profraw' -fcoverage-mapping -fno-common -Woverloaded-virtual -Wno-nested-anon-types -O3 -DNDEBUG -isysroot /Applications/Xcode.app/Contents/Developer/Platforms/MacOSX.platform/Developer/SDKs/MacOSX10.14.sdk -fno-exceptions -fno-rtti -MD -MT tools/clang/tools/extra/clangd/CMakeFiles/obj.clangDaemon.dir/Headers.cpp.o -MF tools/clang/tools/extra/clangd/CMakeFiles/obj.clangDaemon.dir/Headers.cpp.o.d -o tools/clang/tools/extra/clangd/CMakeFiles/obj.clangDaemon.dir/Headers.cpp.o -c /Users/buildslave/jenkins/workspace/clang-stage2-coverage-R/llvm/tools/clang/tools/extra/clangd/Headers.cpp Assertion failed: (CachedFieldIndex && "failed to find field in parent"), function getFieldIndex, file /Users/buildslave/jenkins/workspace/clang-stage1-configure-RA/llvm/tools/clang/lib/AST/Decl.cpp, line 3965. Stack dump: 0. Program arguments: /Users/buildslave/jenkins/workspace/clang-stage2-coverage-R/host-compiler/bin/clang-9 -cc1 -triple x86_64-apple-macosx10.14.0 -Wdeprecated-objc-isa-usage -Werror=deprecated-objc-isa-usage -emit-obj -disable-free -main-file-name Headers.cpp -mrelocation-model pic -pic-level 2 -mthread-model posix -mdisable-fp-elim -masm-verbose -munwind-tables -target-sdk-version=10.14 -target-cpu penryn -dwarf-column-info -debugger-tuning=lldb -ggnu-pubnames -target-linker-version 409.12 -fprofile-instrument-path=/Users/buildslave/jenkins/workspace/clang-stage2-coverage-R/clang-build/profiles/%6m.profraw -fprofile-instrument=clang -fcoverage-mapping -coverage-notes-file /Users/buildslave/jenkins/workspace/clang-stage2-coverage-R/clang-build/tools/clang/tools/extra/clangd/CMakeFiles/obj.clangDaemon.dir/Headers.cpp.gcno -resource-dir /Users/buildslave/jenkins/workspace/clang-stage2-coverage-R/host-compiler/lib/clang/9.0.0 -dependency-file tools/clang/tools/extra/clangd/CMakeFiles/obj.clangDaemon.dir/Headers.cpp.o.d -sys-header-deps -MT tools/clang/tools/extra/clangd/CMakeFiles/obj.clangDaemon.dir/Headers.cpp.o -isysroot /Applications/Xcode.app/Contents/Developer/Platforms/MacOSX.platform/Developer/SDKs/MacOSX10.14.sdk -D GTEST_HAS_RTTI=0 -D _GNU_SOURCE -D __STDC_CONSTANT_MACROS -D __STDC_FORMAT_MACROS -D __STDC_LIMIT_MACROS -I tools/clang/tools/extra/clangd -I /Users/buildslave/jenkins/workspace/clang-stage2-coverage-R/llvm/tools/clang/tools/extra/clangd -I /Users/buildslave/jenkins/workspace/clang-stage2-coverage-R/llvm/tools/clang/include -I tools/clang/include -I /Applications/Xcode.app/Contents/Developer/Platforms/MacOSX.platform/Developer/SDKs/MacOSX10.14.sdk/usr/include/libxml2 -I include -I /Users/buildslave/jenkins/workspace/clang-stage2-coverage-R/llvm/include -D NDEBUG -stdlib=libc++ -internal-isystem /Users/buildslave/jenkins/workspace/clang-stage2-coverage-R/host-compiler/bin/../include/c++/v1 -internal-isystem /Applications/Xcode.app/Contents/Developer/Platforms/MacOSX.platform/Developer/SDKs/MacOSX10.14.sdk/usr/include/c++/v1 -internal-isystem /Applications/Xcode.app/Contents/Developer/Platforms/MacOSX.platform/Developer/SDKs/MacOSX10.14.sdk/usr/local/include -internal-isystem /Users/buildslave/jenkins/workspace/clang-stage2-coverage-R/host-compiler/lib/clang/9.0.0/include -internal-externc-isystem /Applications/Xcode.app/Contents/Developer/Platforms/MacOSX.platform/Developer/SDKs/MacOSX10.14.sdk/usr/include -O3 -Werror=date-time -Werror=unguarded-availability-new -Wall -Wextra -Wno-unused-parameter -Wwrite-strings -Wcast-qual -Wmissing-field-initializers -Wno-long-long -Wimplicit-fallthrough -Wcovered-switch-default -Wno-noexcept-type -Wnon-virtual-dtor -Wdelete-non-virtual-dtor -Wstring-conversion -Woverloaded-virtual -Wno-nested-anon-types -pedantic -std=c++11 -fdeprecated-macro -fdebug-compilation-dir /Users/buildslave/jenkins/workspace/clang-stage2-coverage-R/clang-build -ferror-limit 19 -fmessage-length 0 -fvisibility-inlines-hidden -stack-protector 1 -fblocks -fencode-extended-block-signature -fno-rtti -fregister-global-dtors-with-atexit -fmodules -fimplicit-module-maps -fmodules-cache-path=/Users/buildslave/jenkins/workspace/clang-stage2-coverage-R/clang-build/module.cache -fmodules-validate-system-headers -fobjc-runtime=macosx-10.14.0 -fmax-type-align=16 -fno-common -fdiagnostics-show-option -fcolor-diagnostics -vectorize-loops -vectorize-slp -o tools/clang/tools/extra/clangd/CMakeFiles/obj.clangDaemon.dir/Headers.cpp.o -x c++ /Users/buildslave/jenkins/workspace/clang-stage2-coverage-R/llvm/tools/clang/tools/extra/clangd/Headers.cpp 1. <eof> parser at end of file 2. Per-file LLVM IR generation 3. /Users/buildslave/jenkins/workspace/clang-stage2-coverage-R/llvm/include/llvm/Support/Error.h:625:17: Generating code for declaration 'llvm::Expected<std::__1::basic_string<char> >::getStorage' 0 clang-9 0x000000011158a2b8 llvm::sys::PrintStackTrace(llvm::raw_ostream&) + 40 1 clang-9 0x0000000111589465 llvm::sys::RunSignalHandlers() + 85 2 clang-9 0x000000011158a8c8 SignalHandler(int) + 264 3 libsystem_platform.dylib 0x00007fff7bacbb3d _sigtramp + 29 4 clang-9 0x00000001114ebad6 llvm::FoldingSetBase::FindNodeOrInsertPos(llvm::FoldingSetNodeID const&, void*&) + 182 5 libsystem_c.dylib 0x00007fff7b98a1c9 abort + 127 6 libsystem_c.dylib 0x00007fff7b952868 basename_r + 0 7 clang-9 0x0000000113306be6 clang::FieldDecl::getFieldIndex() const + 694 8 clang-9 0x000000011187d8b5 clang::CodeGen::CodeGenFunction::EmitLValueForField(clang::CodeGen::LValue, clang::FieldDecl const*) + 1413 9 clang-9 0x00000001118885df clang::CodeGen::CodeGenFunction::EmitMemberExpr(clang::MemberExpr const*) + 1247 10 clang-9 0x000000011187a24a clang::CodeGen::CodeGenFunction::EmitLValue(clang::Expr const*) + 1018 11 clang-9 0x000000011188273d clang::CodeGen::CodeGenFunction::EmitCheckedLValue(clang::Expr const*, clang::CodeGen::CodeGenFunction::TypeCheckKind) + 173 12 clang-9 0x0000000111888236 clang::CodeGen::CodeGenFunction::EmitMemberExpr(clang::MemberExpr const*) + 310 13 clang-9 0x000000011187a24a clang::CodeGen::CodeGenFunction::EmitLValue(clang::Expr const*) + 1018 14 clang-9 0x00000001118897fc clang::CodeGen::CodeGenFunction::EmitCastLValue(clang::CastExpr const*) + 1372 15 clang-9 0x0000000111879ecf clang::CodeGen::CodeGenFunction::EmitLValue(clang::Expr const*) + 127 16 clang-9 0x000000011188273d clang::CodeGen::CodeGenFunction::EmitCheckedLValue(clang::Expr const*, clang::CodeGen::CodeGenFunction::TypeCheckKind) + 173 17 clang-9 0x0000000111888236 clang::CodeGen::CodeGenFunction::EmitMemberExpr(clang::MemberExpr const*) + 310 18 clang-9 0x000000011187a24a clang::CodeGen::CodeGenFunction::EmitLValue(clang::Expr const*) + 1018 19 clang-9 0x0000000111882047 clang::CodeGen::CodeGenFunction::EmitArrayToPointerDecay(clang::Expr const*, clang::CodeGen::LValueBaseInfo*, clang::CodeGen::TBAAAccessInfo*) + 119 20 clang-9 0x00000001118d2c98 (anonymous namespace)::ScalarExprEmitter::VisitCastExpr(clang::CastExpr*) + 3896 21 clang-9 0x00000001118d1e04 (anonymous namespace)::ScalarExprEmitter::VisitCastExpr(clang::CastExpr*) + 164 22 clang-9 0x00000001118bfe88 clang::CodeGen::CodeGenFunction::EmitScalarExpr(clang::Expr const*, bool) + 104 23 clang-9 0x00000001119b4866 clang::CodeGen::CodeGenFunction::EmitReturnStmt(clang::ReturnStmt const&) + 1430 24 clang-9 0x00000001119b1a72 clang::CodeGen::CodeGenFunction::EmitStmt(clang::Stmt const*, llvm::ArrayRef<clang::Attr const*>) + 2482 25 clang-9 0x00000001119b9def clang::CodeGen::CodeGenFunction::EmitCompoundStmtWithoutScope(clang::CompoundStmt const&, bool, clang::CodeGen::AggValueSlot) + 95 26 clang-9 0x00000001119f9ae7 clang::CodeGen::CodeGenFunction::GenerateCode(clang::GlobalDecl, llvm::Function*, clang::CodeGen::CGFunctionInfo const&) + 791 27 clang-9 0x0000000111a14887 clang::CodeGen::CodeGenModule::EmitGlobalFunctionDefinition(clang::GlobalDecl, llvm::GlobalValue*) + 503 28 clang-9 0x0000000111a0e7a6 clang::CodeGen::CodeGenModule::EmitGlobalDefinition(clang::GlobalDecl, llvm::GlobalValue*) + 486 29 clang-9 0x0000000111a04791 clang::CodeGen::CodeGenModule::EmitDeferred() + 289 30 clang-9 0x0000000111a047b9 clang::CodeGen::CodeGenModule::EmitDeferred() + 329 31 clang-9 0x0000000111a047b9 clang::CodeGen::CodeGenModule::EmitDeferred() + 329 32 clang-9 0x0000000111a03a8a clang::CodeGen::CodeGenModule::Release() + 42 33 clang-9 0x0000000111a8b864 (anonymous namespace)::CodeGeneratorImpl::HandleTranslationUnit(clang::ASTContext&) + 100 34 clang-9 0x00000001119f0516 clang::BackendConsumer::HandleTranslationUnit(clang::ASTContext&) + 134 35 clang-9 0x00000001128e9173 clang::ParseAST(clang::Sema&, bool, bool) + 611 36 clang-9 0x0000000111c700c4 clang::FrontendAction::Execute() + 84 37 clang-9 0x0000000111c21a68 clang::CompilerInstance::ExecuteAction(clang::FrontendAction&) + 1544 38 clang-9 0x0000000111ce87c0 clang::ExecuteCompilerInvocation(clang::CompilerInstance*) + 1808 39 clang-9 0x000000010f991074 cc1_main(llvm::ArrayRef<char const*>, char const*, void*) + 2356 40 clang-9 0x000000010f98e6f3 main + 10851 41 libdyld.dylib 0x00007fff7b8e2085 start + 1 42 libdyld.dylib 0x0000000000000080 start + 18446603338443251708 clang-9: error: unable to execute command: Abort trap: 6 clang-9: error: clang frontend command failed due to signal (use -v to see invocation) clang version 9.0.0 (trunk) Target: x86_64-apple-darwin18.0.0 Thread model: posix InstalledDir: /Users/buildslave/jenkins/workspace/clang-stage2-coverage-R/host-compiler/bin clang-9: note: diagnostic msg: PLEASE submit a bug report to https://bugs.llvm.org/ and include the crash backtrace, preprocessed source, and associated run script. clang-9: note: diagnostic msg: ********************

Hide Details

PLEASE ATTACH THE FOLLOWING FILES TO THE BUG REPORT: Preprocessed source(s) and associated run script(s) are located at: clang-9: note: diagnostic msg: /var/folders/09/r4vw4v8n5kb67jl66zvlbljw0000gn/T/Headers-1981cc.cpp clang-9: note: diagnostic msg: /var/folders/09/r4vw4v8n5kb67jl66zvlbljw0000gn/T/Headers-1981cc.cache clang-9: note: diagnostic msg: /var/folders/09/r4vw4v8n5kb67jl66zvlbljw0000gn/T/Headers-1981cc.sh clang-9: note: diagnostic msg: Crash backtrace is located in clang-9: note: diagnostic msg: /Users/buildslave/Library/Logs/DiagnosticReports/clang-9_<YYYY-MM-DD-HHMMSS>_<hostname>.crash clang-9: note: diagnostic msg: (choose the .crash file that corresponds to your crash) clang-9: note: diagnostic msg:

Hide Details

******************** [4013/4598] /Users/buildslave/jenkins/workspace/clang-stage2-coverage-R/host-compiler/bin/clang++ -DGTEST_HAS_RTTI=0 -D_GNU_SOURCE -D__STDC_CONSTANT_MACROS -D__STDC_FORMAT_MACROS -D__STDC_LIMIT_MACROS -Itools/clang/tools/extra/clangd -I/Users/buildslave/jenkins/workspace/clang-stage2-coverage-R/llvm/tools/clang/tools/extra/clangd -I/Users/buildslave/jenkins/workspace/clang-stage2-coverage-R/llvm/tools/clang/include -Itools/clang/include -I/Applications/Xcode.app/Contents/Developer/Platforms/MacOSX.platform/Developer/SDKs/MacOSX10.14.sdk/usr/include/libxml2 -Iinclude -I/Users/buildslave/jenkins/workspace/clang-stage2-coverage-R/llvm/include -fPIC -fvisibility-inlines-hidden -Werror=date-time -Werror=unguarded-availability-new -std=c++11 -fmodules -fmodules-cache-path=/Users/buildslave/jenkins/workspace/clang-stage2-coverage-R/clang-build/module.cache -fcxx-modules -Wall -Wextra -Wno-unused-parameter -Wwrite-strings -Wcast-qual -Wmissing-field-initializers -pedantic -Wno-long-long -Wimplicit-fallthrough -Wcovered-switch-default -Wno-noexcept-type -Wnon-virtual-dtor -Wdelete-non-virtual-dtor -Wstring-conversion -fdiagnostics-color -fprofile-instr-generate='/Users/buildslave/jenkins/workspace/clang-stage2-coverage-R/clang-build/profiles/%6m.profraw' -fcoverage-mapping -fno-common -Woverloaded-virtual -Wno-nested-anon-types -O3 -DNDEBUG -isysroot /Applications/Xcode.app/Contents/Developer/Platforms/MacOSX.platform/Developer/SDKs/MacOSX10.14.sdk -fno-exceptions -fno-rtti -MD -MT tools/clang/tools/extra/clangd/CMakeFiles/obj.clangDaemon.dir/XRefs.cpp.o -MF tools/clang/tools/extra/clangd/CMakeFiles/obj.clangDaemon.dir/XRefs.cpp.o.d -o tools/clang/tools/extra/clangd/CMakeFiles/obj.clangDaemon.dir/XRefs.cpp.o -c /Users/buildslave/jenkins/workspace/clang-stage2-coverage-R/llvm/tools/clang/tools/extra/clangd/XRefs.cpp [4014/4598] /Users/buildslave/jenkins/workspace/clang-stage2-coverage-R/host-compiler/bin/clang++ -DGTEST_HAS_RTTI=0 -D_GNU_SOURCE -D__STDC_CONSTANT_MACROS -D__STDC_FORMAT_MACROS -D__STDC_LIMIT_MACROS -Itools/clang/tools/extra/clangd -I/Users/buildslave/jenkins/workspace/clang-stage2-coverage-R/llvm/tools/clang/tools/extra/clangd -I/Users/buildslave/jenkins/workspace/clang-stage2-coverage-R/llvm/tools/clang/include -Itools/clang/include -I/Applications/Xcode.app/Contents/Developer/Platforms/MacOSX.platform/Developer/SDKs/MacOSX10.14.sdk/usr/include/libxml2 -Iinclude -I/Users/buildslave/jenkins/workspace/clang-stage2-coverage-R/llvm/include -fPIC -fvisibility-inlines-hidden -Werror=date-time -Werror=unguarded-availability-new -std=c++11 -fmodules -fmodules-cache-path=/Users/buildslave/jenkins/workspace/clang-stage2-coverage-R/clang-build/module.cache -fcxx-modules -Wall -Wextra -Wno-unused-parameter -Wwrite-strings -Wcast-qual -Wmissing-field-initializers -pedantic -Wno-long-long -Wimplicit-fallthrough -Wcovered-switch-default -Wno-noexcept-type -Wnon-virtual-dtor -Wdelete-non-virtual-dtor -Wstring-conversion -fdiagnostics-color -fprofile-instr-generate='/Users/buildslave/jenkins/workspace/clang-stage2-coverage-R/clang-build/profiles/%6m.profraw' -fcoverage-mapping -fno-common -Woverloaded-virtual -Wno-nested-anon-types -O3 -DNDEBUG -isysroot /Applications/Xcode.app/Contents/Developer/Platforms/MacOSX.platform/Developer/SDKs/MacOSX10.14.sdk -fno-exceptions -fno-rtti -MD -MT tools/clang/tools/extra/clangd/CMakeFiles/obj.clangDaemon.dir/index/Background.cpp.o -MF tools/clang/tools/extra/clangd/CMakeFiles/obj.clangDaemon.dir/index/Background.cpp.o.d -o tools/clang/tools/extra/clangd/CMakeFiles/obj.clangDaemon.dir/index/Background.cpp.o -c /Users/buildslave/jenkins/workspace/clang-stage2-coverage-R/llvm/tools/clang/tools/extra/clangd/index/Background.cpp FAILED: tools/clang/tools/extra/clangd/CMakeFiles/obj.clangDaemon.dir/index/Background.cpp.o /Users/buildslave/jenkins/workspace/clang-stage2-coverage-R/host-compiler/bin/clang++ -DGTEST_HAS_RTTI=0 -D_GNU_SOURCE -D__STDC_CONSTANT_MACROS -D__STDC_FORMAT_MACROS -D__STDC_LIMIT_MACROS -Itools/clang/tools/extra/clangd -I/Users/buildslave/jenkins/workspace/clang-stage2-coverage-R/llvm/tools/clang/tools/extra/clangd -I/Users/buildslave/jenkins/workspace/clang-stage2-coverage-R/llvm/tools/clang/include -Itools/clang/include -I/Applications/Xcode.app/Contents/Developer/Platforms/MacOSX.platform/Developer/SDKs/MacOSX10.14.sdk/usr/include/libxml2 -Iinclude -I/Users/buildslave/jenkins/workspace/clang-stage2-coverage-R/llvm/include -fPIC -fvisibility-inlines-hidden -Werror=date-time -Werror=unguarded-availability-new -std=c++11 -fmodules -fmodules-cache-path=/Users/buildslave/jenkins/workspace/clang-stage2-coverage-R/clang-build/module.cache -fcxx-modules -Wall -Wextra -Wno-unused-parameter -Wwrite-strings -Wcast-qual -Wmissing-field-initializers -pedantic -Wno-long-long -Wimplicit-fallthrough -Wcovered-switch-default -Wno-noexcept-type -Wnon-virtual-dtor -Wdelete-non-virtual-dtor -Wstring-conversion -fdiagnostics-color -fprofile-instr-generate='/Users/buildslave/jenkins/workspace/clang-stage2-coverage-R/clang-build/profiles/%6m.profraw' -fcoverage-mapping -fno-common -Woverloaded-virtual -Wno-nested-anon-types -O3 -DNDEBUG -isysroot /Applications/Xcode.app/Contents/Developer/Platforms/MacOSX.platform/Developer/SDKs/MacOSX10.14.sdk -fno-exceptions -fno-rtti -MD -MT tools/clang/tools/extra/clangd/CMakeFiles/obj.clangDaemon.dir/index/Background.cpp.o -MF tools/clang/tools/extra/clangd/CMakeFiles/obj.clangDaemon.dir/index/Background.cpp.o.d -o tools/clang/tools/extra/clangd/CMakeFiles/obj.clangDaemon.dir/index/Background.cpp.o -c /Users/buildslave/jenkins/workspace/clang-stage2-coverage-R/llvm/tools/clang/tools/extra/clangd/index/Background.cpp Assertion failed: (CachedFieldIndex && "failed to find field in parent"), function getFieldIndex, file /Users/buildslave/jenkins/workspace/clang-stage1-configure-RA/llvm/tools/clang/lib/AST/Decl.cpp, line 3965. Stack dump: 0. Program arguments: /Users/buildslave/jenkins/workspace/clang-stage2-coverage-R/host-compiler/bin/clang-9 -cc1 -triple x86_64-apple-macosx10.14.0 -Wdeprecated-objc-isa-usage -Werror=deprecated-objc-isa-usage -emit-obj -disable-free -main-file-name Background.cpp -mrelocation-model pic -pic-level 2 -mthread-model posix -mdisable-fp-elim -masm-verbose -munwind-tables -target-sdk-version=10.14 -target-cpu penryn -dwarf-column-info -debugger-tuning=lldb -ggnu-pubnames -target-linker-version 409.12 -fprofile-instrument-path=/Users/buildslave/jenkins/workspace/clang-stage2-coverage-R/clang-build/profiles/%6m.profraw -fprofile-instrument=clang -fcoverage-mapping -coverage-notes-file /Users/buildslave/jenkins/workspace/clang-stage2-coverage-R/clang-build/tools/clang/tools/extra/clangd/CMakeFiles/obj.clangDaemon.dir/index/Background.cpp.gcno -resource-dir /Users/buildslave/jenkins/workspace/clang-stage2-coverage-R/host-compiler/lib/clang/9.0.0 -dependency-file tools/clang/tools/extra/clangd/CMakeFiles/obj.clangDaemon.dir/index/Background.cpp.o.d -sys-header-deps -MT tools/clang/tools/extra/clangd/CMakeFiles/obj.clangDaemon.dir/index/Background.cpp.o -isysroot /Applications/Xcode.app/Contents/Developer/Platforms/MacOSX.platform/Developer/SDKs/MacOSX10.14.sdk -D GTEST_HAS_RTTI=0 -D _GNU_SOURCE -D __STDC_CONSTANT_MACROS -D __STDC_FORMAT_MACROS -D __STDC_LIMIT_MACROS -I tools/clang/tools/extra/clangd -I /Users/buildslave/jenkins/workspace/clang-stage2-coverage-R/llvm/tools/clang/tools/extra/clangd -I /Users/buildslave/jenkins/workspace/clang-stage2-coverage-R/llvm/tools/clang/include -I tools/clang/include -I /Applications/Xcode.app/Contents/Developer/Platforms/MacOSX.platform/Developer/SDKs/MacOSX10.14.sdk/usr/include/libxml2 -I include -I /Users/buildslave/jenkins/workspace/clang-stage2-coverage-R/llvm/include -D NDEBUG -stdlib=libc++ -internal-isystem /Users/buildslave/jenkins/workspace/clang-stage2-coverage-R/host-compiler/bin/../include/c++/v1 -internal-isystem /Applications/Xcode.app/Contents/Developer/Platforms/MacOSX.platform/Developer/SDKs/MacOSX10.14.sdk/usr/include/c++/v1 -internal-isystem /Applications/Xcode.app/Contents/Developer/Platforms/MacOSX.platform/Developer/SDKs/MacOSX10.14.sdk/usr/local/include -internal-isystem /Users/buildslave/jenkins/workspace/clang-stage2-coverage-R/host-compiler/lib/clang/9.0.0/include -internal-externc-isystem /Applications/Xcode.app/Contents/Developer/Platforms/MacOSX.platform/Developer/SDKs/MacOSX10.14.sdk/usr/include -O3 -Werror=date-time -Werror=unguarded-availability-new -Wall -Wextra -Wno-unused-parameter -Wwrite-strings -Wcast-qual -Wmissing-field-initializers -Wno-long-long -Wimplicit-fallthrough -Wcovered-switch-default -Wno-noexcept-type -Wnon-virtual-dtor -Wdelete-non-virtual-dtor -Wstring-conversion -Woverloaded-virtual -Wno-nested-anon-types -pedantic -std=c++11 -fdeprecated-macro -fdebug-compilation-dir /Users/buildslave/jenkins/workspace/clang-stage2-coverage-R/clang-build -ferror-limit 19 -fmessage-length 0 -fvisibility-inlines-hidden -stack-protector 1 -fblocks -fencode-extended-block-signature -fno-rtti -fregister-global-dtors-with-atexit -fmodules -fimplicit-module-maps -fmodules-cache-path=/Users/buildslave/jenkins/workspace/clang-stage2-coverage-R/clang-build/module.cache -fmodules-validate-system-headers -fobjc-runtime=macosx-10.14.0 -fmax-type-align=16 -fno-common -fdiagnostics-show-option -fcolor-diagnostics -vectorize-loops -vectorize-slp -o tools/clang/tools/extra/clangd/CMakeFiles/obj.clangDaemon.dir/index/Background.cpp.o -x c++ /Users/buildslave/jenkins/workspace/clang-stage2-coverage-R/llvm/tools/clang/tools/extra/clangd/index/Background.cpp 1. <eof> parser at end of file 2. Per-file LLVM IR generation 3. /Users/buildslave/jenkins/workspace/clang-stage2-coverage-R/llvm/include/llvm/Support/Error.h:635:15: Generating code for declaration 'llvm::Expected<std::__1::basic_string<char> >::getErrorStorage' 0 clang-9 0x000000010fb052b8 llvm::sys::PrintStackTrace(llvm::raw_ostream&) + 40 1 clang-9 0x000000010fb04465 llvm::sys::RunSignalHandlers() + 85 2 clang-9 0x000000010fb058c8 SignalHandler(int) + 264 3 libsystem_platform.dylib 0x00007fff7bacbb3d _sigtramp + 29 4 libsystem_platform.dylib 0x0000000000000040 _sigtramp + 18446603338441245984 5 libsystem_c.dylib 0x00007fff7b98a1c9 abort + 127 6 libsystem_c.dylib 0x00007fff7b952868 basename_r + 0 7 clang-9 0x0000000111881be6 clang::FieldDecl::getFieldIndex() const + 694 8 clang-9 0x000000010fdf88b5 clang::CodeGen::CodeGenFunction::EmitLValueForField(clang::CodeGen::LValue, clang::FieldDecl const*) + 1413 9 clang-9 0x000000010fe035df clang::CodeGen::CodeGenFunction::EmitMemberExpr(clang::MemberExpr const*) + 1247 10 clang-9 0x000000010fdf524a clang::CodeGen::CodeGenFunction::EmitLValue(clang::Expr const*) + 1018 11 clang-9 0x000000010fdfd73d clang::CodeGen::CodeGenFunction::EmitCheckedLValue(clang::Expr const*, clang::CodeGen::CodeGenFunction::TypeCheckKind) + 173 12 clang-9 0x000000010fe03236 clang::CodeGen::CodeGenFunction::EmitMemberExpr(clang::MemberExpr const*) + 310 13 clang-9 0x000000010fdf524a clang::CodeGen::CodeGenFunction::EmitLValue(clang::Expr const*) + 1018 14 clang-9 0x000000010fe047fc clang::CodeGen::CodeGenFunction::EmitCastLValue(clang::CastExpr const*) + 1372 15 clang-9 0x000000010fdf4ecf clang::CodeGen::CodeGenFunction::EmitLValue(clang::Expr const*) + 127 16 clang-9 0x000000010fdfd73d clang::CodeGen::CodeGenFunction::EmitCheckedLValue(clang::Expr const*, clang::CodeGen::CodeGenFunction::TypeCheckKind) + 173 17 clang-9 0x000000010fe03236 clang::CodeGen::CodeGenFunction::EmitMemberExpr(clang::MemberExpr const*) + 310 18 clang-9 0x000000010fdf524a clang::CodeGen::CodeGenFunction::EmitLValue(clang::Expr const*) + 1018 19 clang-9 0x000000010fdfd047 clang::CodeGen::CodeGenFunction::EmitArrayToPointerDecay(clang::Expr const*, clang::CodeGen::LValueBaseInfo*, clang::CodeGen::TBAAAccessInfo*) + 119 20 clang-9 0x000000010fe4dc98 (anonymous namespace)::ScalarExprEmitter::VisitCastExpr(clang::CastExpr*) + 3896 21 clang-9 0x000000010fe4ce04 (anonymous namespace)::ScalarExprEmitter::VisitCastExpr(clang::CastExpr*) + 164 22 clang-9 0x000000010fe3ae88 clang::CodeGen::CodeGenFunction::EmitScalarExpr(clang::Expr const*, bool) + 104 23 clang-9 0x000000010ff2f866 clang::CodeGen::CodeGenFunction::EmitReturnStmt(clang::ReturnStmt const&) + 1430 24 clang-9 0x000000010ff2ca72 clang::CodeGen::CodeGenFunction::EmitStmt(clang::Stmt const*, llvm::ArrayRef<clang::Attr const*>) + 2482 25 clang-9 0x000000010ff34def clang::CodeGen::CodeGenFunction::EmitCompoundStmtWithoutScope(clang::CompoundStmt const&, bool, clang::CodeGen::AggValueSlot) + 95 26 clang-9 0x000000010ff74ae7 clang::CodeGen::CodeGenFunction::GenerateCode(clang::GlobalDecl, llvm::Function*, clang::CodeGen::CGFunctionInfo const&) + 791 27 clang-9 0x000000010ff8f887 clang::CodeGen::CodeGenModule::EmitGlobalFunctionDefinition(clang::GlobalDecl, llvm::GlobalValue*) + 503 28 clang-9 0x000000010ff897a6 clang::CodeGen::CodeGenModule::EmitGlobalDefinition(clang::GlobalDecl, llvm::GlobalValue*) + 486 29 clang-9 0x000000010ff7f791 clang::CodeGen::CodeGenModule::EmitDeferred() + 289 30 clang-9 0x000000010ff7f7b9 clang::CodeGen::CodeGenModule::EmitDeferred() + 329 31 clang-9 0x000000010ff7f7b9 clang::CodeGen::CodeGenModule::EmitDeferred() + 329 32 clang-9 0x000000010ff7ea8a clang::CodeGen::CodeGenModule::Release() + 42 33 clang-9 0x0000000110006864 (anonymous namespace)::CodeGeneratorImpl::HandleTranslationUnit(clang::ASTContext&) + 100 34 clang-9 0x000000010ff6b516 clang::BackendConsumer::HandleTranslationUnit(clang::ASTContext&) + 134 35 clang-9 0x0000000110e64173 clang::ParseAST(clang::Sema&, bool, bool) + 611 36 clang-9 0x00000001101eb0c4 clang::FrontendAction::Execute() + 84 37 clang-9 0x000000011019ca68 clang::CompilerInstance::ExecuteAction(clang::FrontendAction&) + 1544 38 clang-9 0x00000001102637c0 clang::ExecuteCompilerInvocation(clang::CompilerInstance*) + 1808 39 clang-9 0x000000010df0c074 cc1_main(llvm::ArrayRef<char const*>, char const*, void*) + 2356 40 clang-9 0x000000010df096f3 main + 10851 41 libdyld.dylib 0x00007fff7b8e2085 start + 1 42 libdyld.dylib 0x0000000000000080 start + 18446603338443251708 clang-9: error: unable to execute command: Abort trap: 6 clang-9: error: clang frontend command failed due to signal (use -v to see invocation) clang version 9.0.0 (trunk) Target: x86_64-apple-darwin18.0.0 Thread model: posix InstalledDir: /Users/buildslave/jenkins/workspace/clang-stage2-coverage-R/host-compiler/bin clang-9: note: diagnostic msg: PLEASE submit a bug report to https://bugs.llvm.org/ and include the crash backtrace, preprocessed source, and associated run script. clang-9: note: diagnostic msg: ********************

Hide Details

PLEASE ATTACH THE FOLLOWING FILES TO THE BUG REPORT: Preprocessed source(s) and associated run script(s) are located at: clang-9: note: diagnostic msg: /var/folders/09/r4vw4v8n5kb67jl66zvlbljw0000gn/T/Background-229634.cpp clang-9: note: diagnostic msg: /var/folders/09/r4vw4v8n5kb67jl66zvlbljw0000gn/T/Background-229634.cache clang-9: note: diagnostic msg: /var/folders/09/r4vw4v8n5kb67jl66zvlbljw0000gn/T/Background-229634.sh clang-9: note: diagnostic msg: Crash backtrace is located in clang-9: note: diagnostic msg: /Users/buildslave/Library/Logs/DiagnosticReports/clang-9_<YYYY-MM-DD-HHMMSS>_<hostname>.crash clang-9: note: diagnostic msg: (choose the .crash file that corresponds to your crash) clang-9: note: diagnostic msg:

Hide Details

******************** ninja: build stopped: subcommand failed. Command failed Command: ['/usr/local/bin/ninja', '-v', 'all'] Build step 'Execute shell' marked build as failure [WARNINGS] Skipping publisher since build result is FAILURE [BFA] Scanning build for known causes... [BFA] Found failure cause(s): [BFA] Assertion failure from category Assert [BFA] Ninja target failed from category Compile [BFA] Compile Error from category Compile [BFA] Done. 1s Email was triggered for: Failure - Any Sending email for trigger: Failure - Any

Hide Details

Begin Pre-Send Script... Username Vedant not found in auth.groovy. This may indicate a problem with the svn-mailer.conf update process. Please check this job: http://green.lab.llvm.org/green/view/Infrastructure/job/Update%20SVN%20email%20list/ User Vedant will need to be notified of the build failure manually.

Hide Details

Username Kumar not found in auth.groovy. This may indicate a problem with the svn-mailer.conf update process. Please check this job: http://green.lab.llvm.org/green/view/Infrastructure/job/Update%20SVN%20email%20list/ User Kumar will need to be notified of the build failure manually.

Hide Details

Sending email to: vsk@apple.com JF Bastien <jfbastien@apple.com> Andi Bergen <abergen@apple.com> Azhar Mohammed <azhar@apple.com> Finished: FAILURE