FailedConsole Output

Skipping 6,138 KB.. Full Log
e/jenkins/workspace/clang-stage2-coverage-R/llvm/include /Users/buildslave/jenkins/workspace/clang-stage2-coverage-R/llvm/tools/clang/include/clang/AST/../Basic/Attr.td -o tools/clang/include/clang/AST/AttrNodeTraverse.inc -d tools/clang/include/clang/AST/AttrNodeTraverse.inc.d
[2693/4599] cd /Users/buildslave/jenkins/workspace/clang-stage2-coverage-R/clang-build && /Users/buildslave/jenkins/workspace/clang-stage2-coverage-R/clang-build/bin/clang-tblgen -gen-clang-comment-html-tags-properties -I /Users/buildslave/jenkins/workspace/clang-stage2-coverage-R/llvm/tools/clang/include/clang/AST -I /Users/buildslave/jenkins/workspace/clang-stage2-coverage-R/llvm/include /Users/buildslave/jenkins/workspace/clang-stage2-coverage-R/llvm/tools/clang/include/clang/AST/CommentHTMLTags.td -o tools/clang/include/clang/AST/CommentHTMLTagsProperties.inc -d tools/clang/include/clang/AST/CommentHTMLTagsProperties.inc.d
[2694/4599] cd /Users/buildslave/jenkins/workspace/clang-stage2-coverage-R/clang-build && /Users/buildslave/jenkins/workspace/clang-stage2-coverage-R/clang-build/bin/clang-tblgen -gen-clang-attr-text-node-dump -I /Users/buildslave/jenkins/workspace/clang-stage2-coverage-R/llvm/tools/clang/include/clang/AST/../../ -I /Users/buildslave/jenkins/workspace/clang-stage2-coverage-R/llvm/tools/clang/include/clang/AST -I /Users/buildslave/jenkins/workspace/clang-stage2-coverage-R/llvm/include /Users/buildslave/jenkins/workspace/clang-stage2-coverage-R/llvm/tools/clang/include/clang/AST/../Basic/Attr.td -o tools/clang/include/clang/AST/AttrTextNodeDump.inc -d tools/clang/include/clang/AST/AttrTextNodeDump.inc.d
[2695/4599] cd /Users/buildslave/jenkins/workspace/clang-stage2-coverage-R/clang-build && /Users/buildslave/jenkins/workspace/clang-stage2-coverage-R/clang-build/bin/clang-tblgen -gen-clang-attr-impl -I /Users/buildslave/jenkins/workspace/clang-stage2-coverage-R/llvm/tools/clang/include/clang/AST/../../ -I /Users/buildslave/jenkins/workspace/clang-stage2-coverage-R/llvm/tools/clang/include/clang/AST -I /Users/buildslave/jenkins/workspace/clang-stage2-coverage-R/llvm/include /Users/buildslave/jenkins/workspace/clang-stage2-coverage-R/llvm/tools/clang/include/clang/AST/../Basic/Attr.td -o tools/clang/include/clang/AST/AttrImpl.inc -d tools/clang/include/clang/AST/AttrImpl.inc.d
[2696/4599] cd /Users/buildslave/jenkins/workspace/clang-stage2-coverage-R/clang-build && /Users/buildslave/jenkins/workspace/clang-stage2-coverage-R/clang-build/bin/clang-tblgen -gen-clang-comment-nodes -I /Users/buildslave/jenkins/workspace/clang-stage2-coverage-R/llvm/tools/clang/include/clang/AST -I /Users/buildslave/jenkins/workspace/clang-stage2-coverage-R/llvm/include /Users/buildslave/jenkins/workspace/clang-stage2-coverage-R/llvm/tools/clang/include/clang/AST/../Basic/CommentNodes.td -o tools/clang/include/clang/AST/CommentNodes.inc -d tools/clang/include/clang/AST/CommentNodes.inc.d
[2697/4599] cd /Users/buildslave/jenkins/workspace/clang-stage2-coverage-R/clang-build && /Users/buildslave/jenkins/workspace/clang-stage2-coverage-R/clang-build/bin/clang-tblgen -gen-clang-comment-html-tags -I /Users/buildslave/jenkins/workspace/clang-stage2-coverage-R/llvm/tools/clang/include/clang/AST -I /Users/buildslave/jenkins/workspace/clang-stage2-coverage-R/llvm/include /Users/buildslave/jenkins/workspace/clang-stage2-coverage-R/llvm/tools/clang/include/clang/AST/CommentHTMLTags.td -o tools/clang/include/clang/AST/CommentHTMLTags.inc -d tools/clang/include/clang/AST/CommentHTMLTags.inc.d
[2698/4599] cd /Users/buildslave/jenkins/workspace/clang-stage2-coverage-R/clang-build && /Users/buildslave/jenkins/workspace/clang-stage2-coverage-R/clang-build/bin/clang-tblgen -gen-clang-stmt-nodes -I /Users/buildslave/jenkins/workspace/clang-stage2-coverage-R/llvm/tools/clang/include/clang/AST -I /Users/buildslave/jenkins/workspace/clang-stage2-coverage-R/llvm/include /Users/buildslave/jenkins/workspace/clang-stage2-coverage-R/llvm/tools/clang/include/clang/AST/../Basic/StmtNodes.td -o tools/clang/include/clang/AST/StmtNodes.inc -d tools/clang/include/clang/AST/StmtNodes.inc.d
[2699/4599] cd /Users/buildslave/jenkins/workspace/clang-stage2-coverage-R/clang-build && /Users/buildslave/jenkins/workspace/clang-stage2-coverage-R/clang-build/bin/clang-tblgen -gen-clang-attr-ast-visitor -I /Users/buildslave/jenkins/workspace/clang-stage2-coverage-R/llvm/tools/clang/include/clang/AST/../../ -I /Users/buildslave/jenkins/workspace/clang-stage2-coverage-R/llvm/tools/clang/include/clang/AST -I /Users/buildslave/jenkins/workspace/clang-stage2-coverage-R/llvm/include /Users/buildslave/jenkins/workspace/clang-stage2-coverage-R/llvm/tools/clang/include/clang/AST/../Basic/Attr.td -o tools/clang/include/clang/AST/AttrVisitor.inc -d tools/clang/include/clang/AST/AttrVisitor.inc.d
[2700/4599] cd /Users/buildslave/jenkins/workspace/clang-stage2-coverage-R/clang-build && /Users/buildslave/jenkins/workspace/clang-stage2-coverage-R/clang-build/bin/clang-tblgen -gen-clang-decl-nodes -I /Users/buildslave/jenkins/workspace/clang-stage2-coverage-R/llvm/tools/clang/include/clang/AST -I /Users/buildslave/jenkins/workspace/clang-stage2-coverage-R/llvm/include /Users/buildslave/jenkins/workspace/clang-stage2-coverage-R/llvm/tools/clang/include/clang/AST/../Basic/DeclNodes.td -o tools/clang/include/clang/AST/DeclNodes.inc -d tools/clang/include/clang/AST/DeclNodes.inc.d
[2701/4599] cd /Users/buildslave/jenkins/workspace/clang-stage2-coverage-R/clang-build && /Users/buildslave/jenkins/workspace/clang-stage2-coverage-R/clang-build/bin/clang-tblgen -gen-clang-attr-classes -I /Users/buildslave/jenkins/workspace/clang-stage2-coverage-R/llvm/tools/clang/include/clang/AST/../../ -I /Users/buildslave/jenkins/workspace/clang-stage2-coverage-R/llvm/tools/clang/include/clang/AST -I /Users/buildslave/jenkins/workspace/clang-stage2-coverage-R/llvm/include /Users/buildslave/jenkins/workspace/clang-stage2-coverage-R/llvm/tools/clang/include/clang/AST/../Basic/Attr.td -o tools/clang/include/clang/AST/Attrs.inc -d tools/clang/include/clang/AST/Attrs.inc.d
[2702/4599] cd /Users/buildslave/jenkins/workspace/clang-stage2-coverage-R/clang-build && /Users/buildslave/jenkins/workspace/clang-stage2-coverage-R/clang-build/bin/clang-tblgen -gen-clang-diags-defs -clang-component=Common -I /Users/buildslave/jenkins/workspace/clang-stage2-coverage-R/llvm/tools/clang/include/clang/Basic -I /Users/buildslave/jenkins/workspace/clang-stage2-coverage-R/llvm/include /Users/buildslave/jenkins/workspace/clang-stage2-coverage-R/llvm/tools/clang/include/clang/Basic/Diagnostic.td -o tools/clang/include/clang/Basic/DiagnosticCommonKinds.inc -d tools/clang/include/clang/Basic/DiagnosticCommonKinds.inc.d
[2703/4599] cd /Users/buildslave/jenkins/workspace/clang-stage2-coverage-R/clang-build && /Users/buildslave/jenkins/workspace/clang-stage2-coverage-R/clang-build/bin/clang-tblgen -gen-arm-neon-sema -I /Users/buildslave/jenkins/workspace/clang-stage2-coverage-R/llvm/tools/clang/include/clang/Basic -I /Users/buildslave/jenkins/workspace/clang-stage2-coverage-R/llvm/include /Users/buildslave/jenkins/workspace/clang-stage2-coverage-R/llvm/tools/clang/include/clang/Basic/arm_fp16.td -o tools/clang/include/clang/Basic/arm_fp16.inc -d tools/clang/include/clang/Basic/arm_fp16.inc.d
[2704/4599] cd /Users/buildslave/jenkins/workspace/clang-stage2-coverage-R/clang-build && /Users/buildslave/jenkins/workspace/clang-stage2-coverage-R/clang-build/bin/clang-tblgen -gen-arm-neon-sema -I /Users/buildslave/jenkins/workspace/clang-stage2-coverage-R/llvm/tools/clang/include/clang/Basic -I /Users/buildslave/jenkins/workspace/clang-stage2-coverage-R/llvm/include /Users/buildslave/jenkins/workspace/clang-stage2-coverage-R/llvm/tools/clang/include/clang/Basic/arm_neon.td -o tools/clang/include/clang/Basic/arm_neon.inc -d tools/clang/include/clang/Basic/arm_neon.inc.d
[2705/4599] cd /Users/buildslave/jenkins/workspace/clang-stage2-coverage-R/clang-build && /Users/buildslave/jenkins/workspace/clang-stage2-coverage-R/clang-build/bin/clang-tblgen -gen-clang-diags-index-name -I /Users/buildslave/jenkins/workspace/clang-stage2-coverage-R/llvm/tools/clang/include/clang/Basic -I /Users/buildslave/jenkins/workspace/clang-stage2-coverage-R/llvm/include /Users/buildslave/jenkins/workspace/clang-stage2-coverage-R/llvm/tools/clang/include/clang/Basic/Diagnostic.td -o tools/clang/include/clang/Basic/DiagnosticIndexName.inc -d tools/clang/include/clang/Basic/DiagnosticIndexName.inc.d
[2706/4599] cd /Users/buildslave/jenkins/workspace/clang-stage2-coverage-R/clang-build && /Users/buildslave/jenkins/workspace/clang-stage2-coverage-R/clang-build/bin/clang-tblgen -gen-clang-diag-groups -I /Users/buildslave/jenkins/workspace/clang-stage2-coverage-R/llvm/tools/clang/include/clang/Basic -I /Users/buildslave/jenkins/workspace/clang-stage2-coverage-R/llvm/include /Users/buildslave/jenkins/workspace/clang-stage2-coverage-R/llvm/tools/clang/include/clang/Basic/Diagnostic.td -o tools/clang/include/clang/Basic/DiagnosticGroups.inc -d tools/clang/include/clang/Basic/DiagnosticGroups.inc.d
[2707/4599] cd /Users/buildslave/jenkins/workspace/clang-stage2-coverage-R/clang-build && /Users/buildslave/jenkins/workspace/clang-stage2-coverage-R/clang-build/bin/clang-tblgen -gen-clang-attr-subject-match-rule-list -I /Users/buildslave/jenkins/workspace/clang-stage2-coverage-R/llvm/tools/clang/include/clang/Basic/../../ -I /Users/buildslave/jenkins/workspace/clang-stage2-coverage-R/llvm/tools/clang/include/clang/Basic -I /Users/buildslave/jenkins/workspace/clang-stage2-coverage-R/llvm/include /Users/buildslave/jenkins/workspace/clang-stage2-coverage-R/llvm/tools/clang/include/clang/Basic/Attr.td -o tools/clang/include/clang/Basic/AttrSubMatchRulesList.inc -d tools/clang/include/clang/Basic/AttrSubMatchRulesList.inc.d
[2708/4599] cd /Users/buildslave/jenkins/workspace/clang-stage2-coverage-R/clang-build && /Users/buildslave/jenkins/workspace/clang-stage2-coverage-R/clang-build/bin/clang-tblgen -gen-clang-diags-defs -clang-component=Serialization -I /Users/buildslave/jenkins/workspace/clang-stage2-coverage-R/llvm/tools/clang/include/clang/Basic -I /Users/buildslave/jenkins/workspace/clang-stage2-coverage-R/llvm/include /Users/buildslave/jenkins/workspace/clang-stage2-coverage-R/llvm/tools/clang/include/clang/Basic/Diagnostic.td -o tools/clang/include/clang/Basic/DiagnosticSerializationKinds.inc -d tools/clang/include/clang/Basic/DiagnosticSerializationKinds.inc.d
[2709/4599] cd /Users/buildslave/jenkins/workspace/clang-stage2-coverage-R/clang-build && /Users/buildslave/jenkins/workspace/clang-stage2-coverage-R/clang-build/bin/clang-tblgen -gen-clang-diags-defs -clang-component=Parse -I /Users/buildslave/jenkins/workspace/clang-stage2-coverage-R/llvm/tools/clang/include/clang/Basic -I /Users/buildslave/jenkins/workspace/clang-stage2-coverage-R/llvm/include /Users/buildslave/jenkins/workspace/clang-stage2-coverage-R/llvm/tools/clang/include/clang/Basic/Diagnostic.td -o tools/clang/include/clang/Basic/DiagnosticParseKinds.inc -d tools/clang/include/clang/Basic/DiagnosticParseKinds.inc.d
[2710/4599] cd /Users/buildslave/jenkins/workspace/clang-stage2-coverage-R/clang-build && /Users/buildslave/jenkins/workspace/clang-stage2-coverage-R/clang-build/bin/clang-tblgen -gen-clang-diags-defs -clang-component=Refactoring -I /Users/buildslave/jenkins/workspace/clang-stage2-coverage-R/llvm/tools/clang/include/clang/Basic -I /Users/buildslave/jenkins/workspace/clang-stage2-coverage-R/llvm/include /Users/buildslave/jenkins/workspace/clang-stage2-coverage-R/llvm/tools/clang/include/clang/Basic/Diagnostic.td -o tools/clang/include/clang/Basic/DiagnosticRefactoringKinds.inc -d tools/clang/include/clang/Basic/DiagnosticRefactoringKinds.inc.d
[2711/4599] cd /Users/buildslave/jenkins/workspace/clang-stage2-coverage-R/clang-build && /Users/buildslave/jenkins/workspace/clang-stage2-coverage-R/clang-build/bin/clang-tblgen -gen-clang-diags-defs -clang-component=Analysis -I /Users/buildslave/jenkins/workspace/clang-stage2-coverage-R/llvm/tools/clang/include/clang/Basic -I /Users/buildslave/jenkins/workspace/clang-stage2-coverage-R/llvm/include /Users/buildslave/jenkins/workspace/clang-stage2-coverage-R/llvm/tools/clang/include/clang/Basic/Diagnostic.td -o tools/clang/include/clang/Basic/DiagnosticAnalysisKinds.inc -d tools/clang/include/clang/Basic/DiagnosticAnalysisKinds.inc.d
[2712/4599] cd /Users/buildslave/jenkins/workspace/clang-stage2-coverage-R/clang-build && /Users/buildslave/jenkins/workspace/clang-stage2-coverage-R/clang-build/bin/clang-tblgen -gen-clang-diags-defs -clang-component=Comment -I /Users/buildslave/jenkins/workspace/clang-stage2-coverage-R/llvm/tools/clang/include/clang/Basic -I /Users/buildslave/jenkins/workspace/clang-stage2-coverage-R/llvm/include /Users/buildslave/jenkins/workspace/clang-stage2-coverage-R/llvm/tools/clang/include/clang/Basic/Diagnostic.td -o tools/clang/include/clang/Basic/DiagnosticCommentKinds.inc -d tools/clang/include/clang/Basic/DiagnosticCommentKinds.inc.d
[2713/4599] cd /Users/buildslave/jenkins/workspace/clang-stage2-coverage-R/clang-build && /Users/buildslave/jenkins/workspace/clang-stage2-coverage-R/clang-build/bin/clang-tblgen -gen-clang-diags-defs -clang-component=Frontend -I /Users/buildslave/jenkins/workspace/clang-stage2-coverage-R/llvm/tools/clang/include/clang/Basic -I /Users/buildslave/jenkins/workspace/clang-stage2-coverage-R/llvm/include /Users/buildslave/jenkins/workspace/clang-stage2-coverage-R/llvm/tools/clang/include/clang/Basic/Diagnostic.td -o tools/clang/include/clang/Basic/DiagnosticFrontendKinds.inc -d tools/clang/include/clang/Basic/DiagnosticFrontendKinds.inc.d
[2714/4599] cd /Users/buildslave/jenkins/workspace/clang-stage2-coverage-R/clang-build && /Users/buildslave/jenkins/workspace/clang-stage2-coverage-R/clang-build/bin/clang-tblgen -gen-clang-diags-defs -clang-component=Driver -I /Users/buildslave/jenkins/workspace/clang-stage2-coverage-R/llvm/tools/clang/include/clang/Basic -I /Users/buildslave/jenkins/workspace/clang-stage2-coverage-R/llvm/include /Users/buildslave/jenkins/workspace/clang-stage2-coverage-R/llvm/tools/clang/include/clang/Basic/Diagnostic.td -o tools/clang/include/clang/Basic/DiagnosticDriverKinds.inc -d tools/clang/include/clang/Basic/DiagnosticDriverKinds.inc.d
[2715/4599] cd /Users/buildslave/jenkins/workspace/clang-stage2-coverage-R/clang-build && /Users/buildslave/jenkins/workspace/clang-stage2-coverage-R/clang-build/bin/clang-tblgen -gen-clang-diags-defs -clang-component=Sema -I /Users/buildslave/jenkins/workspace/clang-stage2-coverage-R/llvm/tools/clang/include/clang/Basic -I /Users/buildslave/jenkins/workspace/clang-stage2-coverage-R/llvm/include /Users/buildslave/jenkins/workspace/clang-stage2-coverage-R/llvm/tools/clang/include/clang/Basic/Diagnostic.td -o tools/clang/include/clang/Basic/DiagnosticSemaKinds.inc -d tools/clang/include/clang/Basic/DiagnosticSemaKinds.inc.d
[2716/4599] cd /Users/buildslave/jenkins/workspace/clang-stage2-coverage-R/clang-build && /Users/buildslave/jenkins/workspace/clang-stage2-coverage-R/clang-build/bin/clang-tblgen -gen-clang-diags-defs -clang-component=CrossTU -I /Users/buildslave/jenkins/workspace/clang-stage2-coverage-R/llvm/tools/clang/include/clang/Basic -I /Users/buildslave/jenkins/workspace/clang-stage2-coverage-R/llvm/include /Users/buildslave/jenkins/workspace/clang-stage2-coverage-R/llvm/tools/clang/include/clang/Basic/Diagnostic.td -o tools/clang/include/clang/Basic/DiagnosticCrossTUKinds.inc -d tools/clang/include/clang/Basic/DiagnosticCrossTUKinds.inc.d
[2717/4599] cd /Users/buildslave/jenkins/workspace/clang-stage2-coverage-R/clang-build && /Users/buildslave/jenkins/workspace/clang-stage2-coverage-R/clang-build/bin/clang-tblgen -gen-clang-diags-defs -clang-component=Lex -I /Users/buildslave/jenkins/workspace/clang-stage2-coverage-R/llvm/tools/clang/include/clang/Basic -I /Users/buildslave/jenkins/workspace/clang-stage2-coverage-R/llvm/include /Users/buildslave/jenkins/workspace/clang-stage2-coverage-R/llvm/tools/clang/include/clang/Basic/Diagnostic.td -o tools/clang/include/clang/Basic/DiagnosticLexKinds.inc -d tools/clang/include/clang/Basic/DiagnosticLexKinds.inc.d
[2718/4599] cd /Users/buildslave/jenkins/workspace/clang-stage2-coverage-R/clang-build && /Users/buildslave/jenkins/workspace/clang-stage2-coverage-R/clang-build/bin/clang-tblgen -gen-clang-attr-list -I /Users/buildslave/jenkins/workspace/clang-stage2-coverage-R/llvm/tools/clang/include/clang/Basic/../../ -I /Users/buildslave/jenkins/workspace/clang-stage2-coverage-R/llvm/tools/clang/include/clang/Basic -I /Users/buildslave/jenkins/workspace/clang-stage2-coverage-R/llvm/include /Users/buildslave/jenkins/workspace/clang-stage2-coverage-R/llvm/tools/clang/include/clang/Basic/Attr.td -o tools/clang/include/clang/Basic/AttrList.inc -d tools/clang/include/clang/Basic/AttrList.inc.d
[2719/4599] cd /Users/buildslave/jenkins/workspace/clang-stage2-coverage-R/clang-build && /Users/buildslave/jenkins/workspace/clang-stage2-coverage-R/clang-build/bin/clang-tblgen -gen-clang-attr-has-attribute-impl -I /Users/buildslave/jenkins/workspace/clang-stage2-coverage-R/llvm/tools/clang/include/clang/Basic/../../ -I /Users/buildslave/jenkins/workspace/clang-stage2-coverage-R/llvm/tools/clang/include/clang/Basic -I /Users/buildslave/jenkins/workspace/clang-stage2-coverage-R/llvm/include /Users/buildslave/jenkins/workspace/clang-stage2-coverage-R/llvm/tools/clang/include/clang/Basic/Attr.td -o tools/clang/include/clang/Basic/AttrHasAttributeImpl.inc -d tools/clang/include/clang/Basic/AttrHasAttributeImpl.inc.d
[2720/4599] cd /Users/buildslave/jenkins/workspace/clang-stage2-coverage-R/clang-build && /Users/buildslave/jenkins/workspace/clang-stage2-coverage-R/clang-build/bin/clang-tblgen -gen-clang-diags-defs -clang-component=AST -I /Users/buildslave/jenkins/workspace/clang-stage2-coverage-R/llvm/tools/clang/include/clang/Basic -I /Users/buildslave/jenkins/workspace/clang-stage2-coverage-R/llvm/include /Users/buildslave/jenkins/workspace/clang-stage2-coverage-R/llvm/tools/clang/include/clang/Basic/Diagnostic.td -o tools/clang/include/clang/Basic/DiagnosticASTKinds.inc -d tools/clang/include/clang/Basic/DiagnosticASTKinds.inc.d
[2721/4599] cd /Users/buildslave/jenkins/workspace/clang-stage2-coverage-R/clang-build && /Users/buildslave/jenkins/workspace/clang-stage2-coverage-R/clang-build/bin/clang-tblgen -gen-clang-attr-parser-string-switches -I /Users/buildslave/jenkins/workspace/clang-stage2-coverage-R/llvm/tools/clang/include/clang/Parse/../../ -I /Users/buildslave/jenkins/workspace/clang-stage2-coverage-R/llvm/tools/clang/include/clang/Parse -I /Users/buildslave/jenkins/workspace/clang-stage2-coverage-R/llvm/include /Users/buildslave/jenkins/workspace/clang-stage2-coverage-R/llvm/tools/clang/include/clang/Parse/../Basic/Attr.td -o tools/clang/include/clang/Parse/AttrParserStringSwitches.inc -d tools/clang/include/clang/Parse/AttrParserStringSwitches.inc.d
[2722/4599] cd /Users/buildslave/jenkins/workspace/clang-stage2-coverage-R/clang-build && /Users/buildslave/jenkins/workspace/clang-stage2-coverage-R/clang-build/bin/clang-tblgen -gen-clang-attr-subject-match-rules-parser-string-switches -I /Users/buildslave/jenkins/workspace/clang-stage2-coverage-R/llvm/tools/clang/include/clang/Parse/../../ -I /Users/buildslave/jenkins/workspace/clang-stage2-coverage-R/llvm/tools/clang/include/clang/Parse -I /Users/buildslave/jenkins/workspace/clang-stage2-coverage-R/llvm/include /Users/buildslave/jenkins/workspace/clang-stage2-coverage-R/llvm/tools/clang/include/clang/Parse/../Basic/Attr.td -o tools/clang/include/clang/Parse/AttrSubMatchRulesParserStringSwitches.inc -d tools/clang/include/clang/Parse/AttrSubMatchRulesParserStringSwitches.inc.d
[2723/4599] cd /Users/buildslave/jenkins/workspace/clang-stage2-coverage-R/clang-build && /Users/buildslave/jenkins/workspace/clang-stage2-coverage-R/clang-build/bin/clang-tblgen -gen-clang-attr-parsed-attr-list -I /Users/buildslave/jenkins/workspace/clang-stage2-coverage-R/llvm/tools/clang/include/clang/Sema/../../ -I /Users/buildslave/jenkins/workspace/clang-stage2-coverage-R/llvm/tools/clang/include/clang/Sema -I /Users/buildslave/jenkins/workspace/clang-stage2-coverage-R/llvm/include /Users/buildslave/jenkins/workspace/clang-stage2-coverage-R/llvm/tools/clang/include/clang/Sema/../Basic/Attr.td -o tools/clang/include/clang/Sema/AttrParsedAttrList.inc -d tools/clang/include/clang/Sema/AttrParsedAttrList.inc.d
[2724/4599] cd /Users/buildslave/jenkins/workspace/clang-stage2-coverage-R/clang-build && /Users/buildslave/jenkins/workspace/clang-stage2-coverage-R/clang-build/bin/clang-tblgen -gen-clang-attr-template-instantiate -I /Users/buildslave/jenkins/workspace/clang-stage2-coverage-R/llvm/tools/clang/include/clang/Sema/../../ -I /Users/buildslave/jenkins/workspace/clang-stage2-coverage-R/llvm/tools/clang/include/clang/Sema -I /Users/buildslave/jenkins/workspace/clang-stage2-coverage-R/llvm/include /Users/buildslave/jenkins/workspace/clang-stage2-coverage-R/llvm/tools/clang/include/clang/Sema/../Basic/Attr.td -o tools/clang/include/clang/Sema/AttrTemplateInstantiate.inc -d tools/clang/include/clang/Sema/AttrTemplateInstantiate.inc.d
[2725/4599] cd /Users/buildslave/jenkins/workspace/clang-stage2-coverage-R/clang-build && /Users/buildslave/jenkins/workspace/clang-stage2-coverage-R/clang-build/bin/clang-tblgen -gen-clang-attr-spelling-index -I /Users/buildslave/jenkins/workspace/clang-stage2-coverage-R/llvm/tools/clang/include/clang/Sema/../../ -I /Users/buildslave/jenkins/workspace/clang-stage2-coverage-R/llvm/tools/clang/include/clang/Sema -I /Users/buildslave/jenkins/workspace/clang-stage2-coverage-R/llvm/include /Users/buildslave/jenkins/workspace/clang-stage2-coverage-R/llvm/tools/clang/include/clang/Sema/../Basic/Attr.td -o tools/clang/include/clang/Sema/AttrSpellingListIndex.inc -d tools/clang/include/clang/Sema/AttrSpellingListIndex.inc.d
[2726/4599] cd /Users/buildslave/jenkins/workspace/clang-stage2-coverage-R/clang-build && /Users/buildslave/jenkins/workspace/clang-stage2-coverage-R/clang-build/bin/clang-tblgen -gen-clang-attr-parsed-attr-impl -I /Users/buildslave/jenkins/workspace/clang-stage2-coverage-R/llvm/tools/clang/include/clang/Sema/../../ -I /Users/buildslave/jenkins/workspace/clang-stage2-coverage-R/llvm/tools/clang/include/clang/Sema -I /Users/buildslave/jenkins/workspace/clang-stage2-coverage-R/llvm/include /Users/buildslave/jenkins/workspace/clang-stage2-coverage-R/llvm/tools/clang/include/clang/Sema/../Basic/Attr.td -o tools/clang/include/clang/Sema/AttrParsedAttrImpl.inc -d tools/clang/include/clang/Sema/AttrParsedAttrImpl.inc.d
[2727/4599] cd /Users/buildslave/jenkins/workspace/clang-stage2-coverage-R/clang-build && /Users/buildslave/jenkins/workspace/clang-stage2-coverage-R/clang-build/bin/clang-tblgen -gen-clang-attr-parsed-attr-kinds -I /Users/buildslave/jenkins/workspace/clang-stage2-coverage-R/llvm/tools/clang/include/clang/Sema/../../ -I /Users/buildslave/jenkins/workspace/clang-stage2-coverage-R/llvm/tools/clang/include/clang/Sema -I /Users/buildslave/jenkins/workspace/clang-stage2-coverage-R/llvm/include /Users/buildslave/jenkins/workspace/clang-stage2-coverage-R/llvm/tools/clang/include/clang/Sema/../Basic/Attr.td -o tools/clang/include/clang/Sema/AttrParsedAttrKinds.inc -d tools/clang/include/clang/Sema/AttrParsedAttrKinds.inc.d
[2728/4599] cd /Users/buildslave/jenkins/workspace/clang-stage2-coverage-R/clang-build && /Users/buildslave/jenkins/workspace/clang-stage2-coverage-R/clang-build/bin/clang-tblgen -gen-clang-attr-pch-write -I /Users/buildslave/jenkins/workspace/clang-stage2-coverage-R/llvm/tools/clang/include/clang/Serialization/../../ -I /Users/buildslave/jenkins/workspace/clang-stage2-coverage-R/llvm/tools/clang/include/clang/Serialization -I /Users/buildslave/jenkins/workspace/clang-stage2-coverage-R/llvm/include /Users/buildslave/jenkins/workspace/clang-stage2-coverage-R/llvm/tools/clang/include/clang/Serialization/../Basic/Attr.td -o tools/clang/include/clang/Serialization/AttrPCHWrite.inc -d tools/clang/include/clang/Serialization/AttrPCHWrite.inc.d
[2729/4599] cd /Users/buildslave/jenkins/workspace/clang-stage2-coverage-R/clang-build && /Users/buildslave/jenkins/workspace/clang-stage2-coverage-R/clang-build/bin/clang-tblgen -gen-clang-attr-pch-read -I /Users/buildslave/jenkins/workspace/clang-stage2-coverage-R/llvm/tools/clang/include/clang/Serialization/../../ -I /Users/buildslave/jenkins/workspace/clang-stage2-coverage-R/llvm/tools/clang/include/clang/Serialization -I /Users/buildslave/jenkins/workspace/clang-stage2-coverage-R/llvm/include /Users/buildslave/jenkins/workspace/clang-stage2-coverage-R/llvm/tools/clang/include/clang/Serialization/../Basic/Attr.td -o tools/clang/include/clang/Serialization/AttrPCHRead.inc -d tools/clang/include/clang/Serialization/AttrPCHRead.inc.d
[2730/4599] cd /Users/buildslave/jenkins/workspace/clang-stage2-coverage-R/clang-build && /Users/buildslave/jenkins/workspace/clang-stage2-coverage-R/clang-build/bin/clang-tblgen -gen-clang-sa-checkers -I /Users/buildslave/jenkins/workspace/clang-stage2-coverage-R/llvm/tools/clang/include/clang/StaticAnalyzer/Checkers -I /Users/buildslave/jenkins/workspace/clang-stage2-coverage-R/llvm/include /Users/buildslave/jenkins/workspace/clang-stage2-coverage-R/llvm/tools/clang/include/clang/StaticAnalyzer/Checkers/Checkers.td -o tools/clang/include/clang/StaticAnalyzer/Checkers/Checkers.inc -d tools/clang/include/clang/StaticAnalyzer/Checkers/Checkers.inc.d
[2731/4599] : && /Users/buildslave/jenkins/workspace/clang-stage2-coverage-R/host-compiler/bin/clang++  -fPIC -fvisibility-inlines-hidden -Werror=date-time -Werror=unguarded-availability-new -std=c++11 -fmodules -fmodules-cache-path=/Users/buildslave/jenkins/workspace/clang-stage2-coverage-R/clang-build/module.cache -fcxx-modules -Wall -Wextra -Wno-unused-parameter -Wwrite-strings -Wcast-qual -Wmissing-field-initializers -pedantic -Wno-long-long -Wimplicit-fallthrough -Wcovered-switch-default -Wno-noexcept-type -Wnon-virtual-dtor -Wdelete-non-virtual-dtor -Wstring-conversion -fdiagnostics-color -fprofile-instr-generate='/Users/buildslave/jenkins/workspace/clang-stage2-coverage-R/clang-build/profiles/%6m.profraw' -fcoverage-mapping -O3 -DNDEBUG -isysroot /Applications/Xcode.app/Contents/Developer/Platforms/MacOSX.platform/Developer/SDKs/MacOSX10.14.sdk -Wl,-search_paths_first -Wl,-headerpad_max_install_names -fprofile-instr-generate='/Users/buildslave/jenkins/workspace/clang-stage2-coverage-R/clang-build/profiles/%6m.profraw' -fcoverage-mapping    -Wl,-dead_strip tools/llvm-lto/CMakeFiles/llvm-lto.dir/llvm-lto.cpp.o  -o bin/llvm-lto  -Wl,-rpath,@loader_path/../lib lib/libLLVMAArch64AsmParser.a lib/libLLVMAMDGPUAsmParser.a lib/libLLVMARMAsmParser.a lib/libLLVMBPFAsmParser.a lib/libLLVMHexagonAsmParser.a lib/libLLVMLanaiAsmParser.a lib/libLLVMMipsAsmParser.a lib/libLLVMMSP430AsmParser.a lib/libLLVMPowerPCAsmParser.a lib/libLLVMSparcAsmParser.a lib/libLLVMSystemZAsmParser.a lib/libLLVMWebAssemblyAsmParser.a lib/libLLVMX86AsmParser.a lib/libLLVMAArch64CodeGen.a lib/libLLVMAMDGPUCodeGen.a lib/libLLVMARMCodeGen.a lib/libLLVMBPFCodeGen.a lib/libLLVMHexagonCodeGen.a lib/libLLVMLanaiCodeGen.a lib/libLLVMMipsCodeGen.a lib/libLLVMMSP430CodeGen.a lib/libLLVMNVPTXCodeGen.a lib/libLLVMPowerPCCodeGen.a lib/libLLVMSparcCodeGen.a lib/libLLVMSystemZCodeGen.a lib/libLLVMWebAssemblyCodeGen.a lib/libLLVMX86CodeGen.a lib/libLLVMXCoreCodeGen.a lib/libLLVMAArch64Desc.a lib/libLLVMAMDGPUDesc.a lib/libLLVMARMDesc.a lib/libLLVMBPFDesc.a lib/libLLVMHexagonDesc.a lib/libLLVMLanaiDesc.a lib/libLLVMMipsDesc.a lib/libLLVMMSP430Desc.a lib/libLLVMNVPTXDesc.a lib/libLLVMPowerPCDesc.a lib/libLLVMSparcDesc.a lib/libLLVMSystemZDesc.a lib/libLLVMWebAssemblyDesc.a lib/libLLVMX86Desc.a lib/libLLVMXCoreDesc.a lib/libLLVMAArch64Info.a lib/libLLVMAMDGPUInfo.a lib/libLLVMARMInfo.a lib/libLLVMBPFInfo.a lib/libLLVMHexagonInfo.a lib/libLLVMLanaiInfo.a lib/libLLVMMipsInfo.a lib/libLLVMMSP430Info.a lib/libLLVMNVPTXInfo.a lib/libLLVMPowerPCInfo.a lib/libLLVMSparcInfo.a lib/libLLVMSystemZInfo.a lib/libLLVMWebAssemblyInfo.a lib/libLLVMX86Info.a lib/libLLVMXCoreInfo.a lib/libLLVMBitReader.a lib/libLLVMBitWriter.a lib/libLLVMCore.a lib/libLLVMIRReader.a lib/libLLVMLTO.a lib/libLLVMMC.a lib/libLLVMObject.a lib/libLLVMSupport.a lib/libLLVMTarget.a lib/libLLVMAArch64Utils.a lib/libLLVMAMDGPUUtils.a lib/libLLVMMIRParser.a lib/libLLVMARMUtils.a lib/libLLVMHexagonAsmParser.a lib/libLLVMHexagonDesc.a lib/libLLVMHexagonInfo.a lib/libLLVMLanaiAsmParser.a lib/libLLVMLanaiDesc.a lib/libLLVMLanaiInfo.a lib/libLLVMMCDisassembler.a lib/libLLVMGlobalISel.a lib/libLLVMX86Utils.a lib/libLLVMAsmPrinter.a lib/libLLVMDebugInfoDWARF.a lib/libLLVMSelectionDAG.a lib/libLLVMObjCARCOpts.a lib/libLLVMPasses.a lib/libLLVMCodeGen.a lib/libLLVMTarget.a lib/libLLVMipo.a lib/libLLVMBitWriter.a lib/libLLVMIRReader.a lib/libLLVMAsmParser.a lib/libLLVMScalarOpts.a lib/libLLVMVectorize.a lib/libLLVMLinker.a lib/libLLVMAggressiveInstCombine.a lib/libLLVMInstCombine.a lib/libLLVMInstrumentation.a lib/libLLVMTransformUtils.a lib/libLLVMAnalysis.a lib/libLLVMObject.a lib/libLLVMBitReader.a lib/libLLVMBitstreamReader.a lib/libLLVMMCParser.a lib/libLLVMMC.a lib/libLLVMDebugInfoCodeView.a lib/libLLVMDebugInfoMSF.a lib/libLLVMProfileData.a lib/libLLVMCore.a lib/libLLVMBinaryFormat.a lib/libLLVMRemarks.a lib/libLLVMSupport.a -lz -lcurses -lm lib/libLLVMDemangle.a && :
[2732/4599] /Users/buildslave/jenkins/workspace/clang-stage2-coverage-R/host-compiler/bin/clang++  -DGTEST_HAS_RTTI=0 -D__STDC_CONSTANT_MACROS -D__STDC_FORMAT_MACROS -D__STDC_LIMIT_MACROS -Itools/llvm-lto2 -I/Users/buildslave/jenkins/workspace/clang-stage2-coverage-R/llvm/tools/llvm-lto2 -I/Applications/Xcode.app/Contents/Developer/Platforms/MacOSX.platform/Developer/SDKs/MacOSX10.14.sdk/usr/include/libxml2 -Iinclude -I/Users/buildslave/jenkins/workspace/clang-stage2-coverage-R/llvm/include -fPIC -fvisibility-inlines-hidden -Werror=date-time -Werror=unguarded-availability-new -std=c++11 -fmodules -fmodules-cache-path=/Users/buildslave/jenkins/workspace/clang-stage2-coverage-R/clang-build/module.cache -fcxx-modules -Wall -Wextra -Wno-unused-parameter -Wwrite-strings -Wcast-qual -Wmissing-field-initializers -pedantic -Wno-long-long -Wimplicit-fallthrough -Wcovered-switch-default -Wno-noexcept-type -Wnon-virtual-dtor -Wdelete-non-virtual-dtor -Wstring-conversion -fdiagnostics-color -fprofile-instr-generate='/Users/buildslave/jenkins/workspace/clang-stage2-coverage-R/clang-build/profiles/%6m.profraw' -fcoverage-mapping -O3 -DNDEBUG -isysroot /Applications/Xcode.app/Contents/Developer/Platforms/MacOSX.platform/Developer/SDKs/MacOSX10.14.sdk    -fno-exceptions -fno-rtti -MD -MT tools/llvm-lto2/CMakeFiles/llvm-lto2.dir/llvm-lto2.cpp.o -MF tools/llvm-lto2/CMakeFiles/llvm-lto2.dir/llvm-lto2.cpp.o.d -o tools/llvm-lto2/CMakeFiles/llvm-lto2.dir/llvm-lto2.cpp.o -c /Users/buildslave/jenkins/workspace/clang-stage2-coverage-R/llvm/tools/llvm-lto2/llvm-lto2.cpp
[2733/4599] /Users/buildslave/jenkins/workspace/clang-stage2-coverage-R/host-compiler/bin/clang++  -DGTEST_HAS_RTTI=0 -D__STDC_CONSTANT_MACROS -D__STDC_FORMAT_MACROS -D__STDC_LIMIT_MACROS -Itools/llc -I/Users/buildslave/jenkins/workspace/clang-stage2-coverage-R/llvm/tools/llc -I/Applications/Xcode.app/Contents/Developer/Platforms/MacOSX.platform/Developer/SDKs/MacOSX10.14.sdk/usr/include/libxml2 -Iinclude -I/Users/buildslave/jenkins/workspace/clang-stage2-coverage-R/llvm/include -fPIC -fvisibility-inlines-hidden -Werror=date-time -Werror=unguarded-availability-new -std=c++11 -fmodules -fmodules-cache-path=/Users/buildslave/jenkins/workspace/clang-stage2-coverage-R/clang-build/module.cache -fcxx-modules -Wall -Wextra -Wno-unused-parameter -Wwrite-strings -Wcast-qual -Wmissing-field-initializers -pedantic -Wno-long-long -Wimplicit-fallthrough -Wcovered-switch-default -Wno-noexcept-type -Wnon-virtual-dtor -Wdelete-non-virtual-dtor -Wstring-conversion -fdiagnostics-color -fprofile-instr-generate='/Users/buildslave/jenkins/workspace/clang-stage2-coverage-R/clang-build/profiles/%6m.profraw' -fcoverage-mapping -O3 -DNDEBUG -isysroot /Applications/Xcode.app/Contents/Developer/Platforms/MacOSX.platform/Developer/SDKs/MacOSX10.14.sdk    -fno-exceptions -fno-rtti -MD -MT tools/llc/CMakeFiles/llc.dir/llc.cpp.o -MF tools/llc/CMakeFiles/llc.dir/llc.cpp.o.d -o tools/llc/CMakeFiles/llc.dir/llc.cpp.o -c /Users/buildslave/jenkins/workspace/clang-stage2-coverage-R/llvm/tools/llc/llc.cpp
[2734/4599] /Users/buildslave/jenkins/workspace/clang-stage2-coverage-R/host-compiler/bin/clang++  -DGTEST_HAS_RTTI=0 -D__STDC_CONSTANT_MACROS -D__STDC_FORMAT_MACROS -D__STDC_LIMIT_MACROS -Itools/lli/ChildTarget -I/Users/buildslave/jenkins/workspace/clang-stage2-coverage-R/llvm/tools/lli/ChildTarget -I/Applications/Xcode.app/Contents/Developer/Platforms/MacOSX.platform/Developer/SDKs/MacOSX10.14.sdk/usr/include/libxml2 -Iinclude -I/Users/buildslave/jenkins/workspace/clang-stage2-coverage-R/llvm/include -fPIC -fvisibility-inlines-hidden -Werror=date-time -Werror=unguarded-availability-new -std=c++11 -fmodules -fmodules-cache-path=/Users/buildslave/jenkins/workspace/clang-stage2-coverage-R/clang-build/module.cache -fcxx-modules -Wall -Wextra -Wno-unused-parameter -Wwrite-strings -Wcast-qual -Wmissing-field-initializers -pedantic -Wno-long-long -Wimplicit-fallthrough -Wcovered-switch-default -Wno-noexcept-type -Wnon-virtual-dtor -Wdelete-non-virtual-dtor -Wstring-conversion -fdiagnostics-color -fprofile-instr-generate='/Users/buildslave/jenkins/workspace/clang-stage2-coverage-R/clang-build/profiles/%6m.profraw' -fcoverage-mapping -O3 -DNDEBUG -isysroot /Applications/Xcode.app/Contents/Developer/Platforms/MacOSX.platform/Developer/SDKs/MacOSX10.14.sdk    -fno-exceptions -fno-rtti -MD -MT tools/lli/ChildTarget/CMakeFiles/lli-child-target.dir/ChildTarget.cpp.o -MF tools/lli/ChildTarget/CMakeFiles/lli-child-target.dir/ChildTarget.cpp.o.d -o tools/lli/ChildTarget/CMakeFiles/lli-child-target.dir/ChildTarget.cpp.o -c /Users/buildslave/jenkins/workspace/clang-stage2-coverage-R/llvm/tools/lli/ChildTarget/ChildTarget.cpp
[2735/4599] /Users/buildslave/jenkins/workspace/clang-stage2-coverage-R/host-compiler/bin/clang++  -DGTEST_HAS_RTTI=0 -D_GNU_SOURCE -D__STDC_CONSTANT_MACROS -D__STDC_FORMAT_MACROS -D__STDC_LIMIT_MACROS -Itools/clang/tools/extra/clangd -I/Users/buildslave/jenkins/workspace/clang-stage2-coverage-R/llvm/tools/clang/tools/extra/clangd -I/Users/buildslave/jenkins/workspace/clang-stage2-coverage-R/llvm/tools/clang/include -Itools/clang/include -I/Applications/Xcode.app/Contents/Developer/Platforms/MacOSX.platform/Developer/SDKs/MacOSX10.14.sdk/usr/include/libxml2 -Iinclude -I/Users/buildslave/jenkins/workspace/clang-stage2-coverage-R/llvm/include -fPIC -fvisibility-inlines-hidden -Werror=date-time -Werror=unguarded-availability-new -std=c++11 -fmodules -fmodules-cache-path=/Users/buildslave/jenkins/workspace/clang-stage2-coverage-R/clang-build/module.cache -fcxx-modules -Wall -Wextra -Wno-unused-parameter -Wwrite-strings -Wcast-qual -Wmissing-field-initializers -pedantic -Wno-long-long -Wimplicit-fallthrough -Wcovered-switch-default -Wno-noexcept-type -Wnon-virtual-dtor -Wdelete-non-virtual-dtor -Wstring-conversion -fdiagnostics-color -fprofile-instr-generate='/Users/buildslave/jenkins/workspace/clang-stage2-coverage-R/clang-build/profiles/%6m.profraw' -fcoverage-mapping -fno-common -Woverloaded-virtual -Wno-nested-anon-types -O3 -DNDEBUG -isysroot /Applications/Xcode.app/Contents/Developer/Platforms/MacOSX.platform/Developer/SDKs/MacOSX10.14.sdk    -fno-exceptions -fno-rtti -MD -MT tools/clang/tools/extra/clangd/CMakeFiles/obj.clangDaemon.dir/AST.cpp.o -MF tools/clang/tools/extra/clangd/CMakeFiles/obj.clangDaemon.dir/AST.cpp.o.d -o tools/clang/tools/extra/clangd/CMakeFiles/obj.clangDaemon.dir/AST.cpp.o -c /Users/buildslave/jenkins/workspace/clang-stage2-coverage-R/llvm/tools/clang/tools/extra/clangd/AST.cpp
[2736/4599] /Users/buildslave/jenkins/workspace/clang-stage2-coverage-R/host-compiler/bin/clang++  -DGTEST_HAS_RTTI=0 -D_GNU_SOURCE -D__STDC_CONSTANT_MACROS -D__STDC_FORMAT_MACROS -D__STDC_LIMIT_MACROS -Itools/clang/tools/extra/clangd -I/Users/buildslave/jenkins/workspace/clang-stage2-coverage-R/llvm/tools/clang/tools/extra/clangd -I/Users/buildslave/jenkins/workspace/clang-stage2-coverage-R/llvm/tools/clang/include -Itools/clang/include -I/Applications/Xcode.app/Contents/Developer/Platforms/MacOSX.platform/Developer/SDKs/MacOSX10.14.sdk/usr/include/libxml2 -Iinclude -I/Users/buildslave/jenkins/workspace/clang-stage2-coverage-R/llvm/include -fPIC -fvisibility-inlines-hidden -Werror=date-time -Werror=unguarded-availability-new -std=c++11 -fmodules -fmodules-cache-path=/Users/buildslave/jenkins/workspace/clang-stage2-coverage-R/clang-build/module.cache -fcxx-modules -Wall -Wextra -Wno-unused-parameter -Wwrite-strings -Wcast-qual -Wmissing-field-initializers -pedantic -Wno-long-long -Wimplicit-fallthrough -Wcovered-switch-default -Wno-noexcept-type -Wnon-virtual-dtor -Wdelete-non-virtual-dtor -Wstring-conversion -fdiagnostics-color -fprofile-instr-generate='/Users/buildslave/jenkins/workspace/clang-stage2-coverage-R/clang-build/profiles/%6m.profraw' -fcoverage-mapping -fno-common -Woverloaded-virtual -Wno-nested-anon-types -O3 -DNDEBUG -isysroot /Applications/Xcode.app/Contents/Developer/Platforms/MacOSX.platform/Developer/SDKs/MacOSX10.14.sdk    -fno-exceptions -fno-rtti -MD -MT tools/clang/tools/extra/clangd/CMakeFiles/obj.clangDaemon.dir/Cancellation.cpp.o -MF tools/clang/tools/extra/clangd/CMakeFiles/obj.clangDaemon.dir/Cancellation.cpp.o.d -o tools/clang/tools/extra/clangd/CMakeFiles/obj.clangDaemon.dir/Cancellation.cpp.o -c /Users/buildslave/jenkins/workspace/clang-stage2-coverage-R/llvm/tools/clang/tools/extra/clangd/Cancellation.cpp
[2737/4599] /Users/buildslave/jenkins/workspace/clang-stage2-coverage-R/host-compiler/bin/clang++  -DGTEST_HAS_RTTI=0 -D__STDC_CONSTANT_MACROS -D__STDC_FORMAT_MACROS -D__STDC_LIMIT_MACROS -Itools/lli -I/Users/buildslave/jenkins/workspace/clang-stage2-coverage-R/llvm/tools/lli -I/Applications/Xcode.app/Contents/Developer/Platforms/MacOSX.platform/Developer/SDKs/MacOSX10.14.sdk/usr/include/libxml2 -Iinclude -I/Users/buildslave/jenkins/workspace/clang-stage2-coverage-R/llvm/include -fPIC -fvisibility-inlines-hidden -Werror=date-time -Werror=unguarded-availability-new -std=c++11 -fmodules -fmodules-cache-path=/Users/buildslave/jenkins/workspace/clang-stage2-coverage-R/clang-build/module.cache -fcxx-modules -Wall -Wextra -Wno-unused-parameter -Wwrite-strings -Wcast-qual -Wmissing-field-initializers -pedantic -Wno-long-long -Wimplicit-fallthrough -Wcovered-switch-default -Wno-noexcept-type -Wnon-virtual-dtor -Wdelete-non-virtual-dtor -Wstring-conversion -fdiagnostics-color -fprofile-instr-generate='/Users/buildslave/jenkins/workspace/clang-stage2-coverage-R/clang-build/profiles/%6m.profraw' -fcoverage-mapping -O3 -DNDEBUG -isysroot /Applications/Xcode.app/Contents/Developer/Platforms/MacOSX.platform/Developer/SDKs/MacOSX10.14.sdk    -fno-exceptions -fno-rtti -MD -MT tools/lli/CMakeFiles/lli.dir/lli.cpp.o -MF tools/lli/CMakeFiles/lli.dir/lli.cpp.o.d -o tools/lli/CMakeFiles/lli.dir/lli.cpp.o -c /Users/buildslave/jenkins/workspace/clang-stage2-coverage-R/llvm/tools/lli/lli.cpp
[2738/4599] /Users/buildslave/jenkins/workspace/clang-stage2-coverage-R/host-compiler/bin/clang++  -DGTEST_HAS_RTTI=0 -D_GNU_SOURCE -D__STDC_CONSTANT_MACROS -D__STDC_FORMAT_MACROS -D__STDC_LIMIT_MACROS -Itools/clang/lib/StaticAnalyzer/Core -I/Users/buildslave/jenkins/workspace/clang-stage2-coverage-R/llvm/tools/clang/lib/StaticAnalyzer/Core -I/Users/buildslave/jenkins/workspace/clang-stage2-coverage-R/llvm/tools/clang/include -Itools/clang/include -I/Applications/Xcode.app/Contents/Developer/Platforms/MacOSX.platform/Developer/SDKs/MacOSX10.14.sdk/usr/include/libxml2 -Iinclude -I/Users/buildslave/jenkins/workspace/clang-stage2-coverage-R/llvm/include -fPIC -fvisibility-inlines-hidden -Werror=date-time -Werror=unguarded-availability-new -std=c++11 -fmodules -fmodules-cache-path=/Users/buildslave/jenkins/workspace/clang-stage2-coverage-R/clang-build/module.cache -fcxx-modules -Wall -Wextra -Wno-unused-parameter -Wwrite-strings -Wcast-qual -Wmissing-field-initializers -pedantic -Wno-long-long -Wimplicit-fallthrough -Wcovered-switch-default -Wno-noexcept-type -Wnon-virtual-dtor -Wdelete-non-virtual-dtor -Wstring-conversion -fdiagnostics-color -fprofile-instr-generate='/Users/buildslave/jenkins/workspace/clang-stage2-coverage-R/clang-build/profiles/%6m.profraw' -fcoverage-mapping -fno-common -Woverloaded-virtual -Wno-nested-anon-types -O3 -DNDEBUG -isysroot /Applications/Xcode.app/Contents/Developer/Platforms/MacOSX.platform/Developer/SDKs/MacOSX10.14.sdk    -fno-exceptions -fno-rtti -MD -MT tools/clang/lib/StaticAnalyzer/Core/CMakeFiles/obj.clangStaticAnalyzerCore.dir/CommonBugCategories.cpp.o -MF tools/clang/lib/StaticAnalyzer/Core/CMakeFiles/obj.clangStaticAnalyzerCore.dir/CommonBugCategories.cpp.o.d -o tools/clang/lib/StaticAnalyzer/Core/CMakeFiles/obj.clangStaticAnalyzerCore.dir/CommonBugCategories.cpp.o -c /Users/buildslave/jenkins/workspace/clang-stage2-coverage-R/llvm/tools/clang/lib/StaticAnalyzer/Core/CommonBugCategories.cpp
[2739/4599] /Users/buildslave/jenkins/workspace/clang-stage2-coverage-R/host-compiler/bin/clang++  -DGTEST_HAS_RTTI=0 -D_GNU_SOURCE -D__STDC_CONSTANT_MACROS -D__STDC_FORMAT_MACROS -D__STDC_LIMIT_MACROS -Itools/clang/tools/extra/clang-reorder-fields -I/Users/buildslave/jenkins/workspace/clang-stage2-coverage-R/llvm/tools/clang/tools/extra/clang-reorder-fields -I/Users/buildslave/jenkins/workspace/clang-stage2-coverage-R/llvm/tools/clang/include -Itools/clang/include -I/Applications/Xcode.app/Contents/Developer/Platforms/MacOSX.platform/Developer/SDKs/MacOSX10.14.sdk/usr/include/libxml2 -Iinclude -I/Users/buildslave/jenkins/workspace/clang-stage2-coverage-R/llvm/include -fPIC -fvisibility-inlines-hidden -Werror=date-time -Werror=unguarded-availability-new -std=c++11 -fmodules -fmodules-cache-path=/Users/buildslave/jenkins/workspace/clang-stage2-coverage-R/clang-build/module.cache -fcxx-modules -Wall -Wextra -Wno-unused-parameter -Wwrite-strings -Wcast-qual -Wmissing-field-initializers -pedantic -Wno-long-long -Wimplicit-fallthrough -Wcovered-switch-default -Wno-noexcept-type -Wnon-virtual-dtor -Wdelete-non-virtual-dtor -Wstring-conversion -fdiagnostics-color -fprofile-instr-generate='/Users/buildslave/jenkins/workspace/clang-stage2-coverage-R/clang-build/profiles/%6m.profraw' -fcoverage-mapping -fno-common -Woverloaded-virtual -Wno-nested-anon-types -O3 -DNDEBUG -isysroot /Applications/Xcode.app/Contents/Developer/Platforms/MacOSX.platform/Developer/SDKs/MacOSX10.14.sdk    -fno-exceptions -fno-rtti -MD -MT tools/clang/tools/extra/clang-reorder-fields/CMakeFiles/obj.clangReorderFields.dir/ReorderFieldsAction.cpp.o -MF tools/clang/tools/extra/clang-reorder-fields/CMakeFiles/obj.clangReorderFields.dir/ReorderFieldsAction.cpp.o.d -o tools/clang/tools/extra/clang-reorder-fields/CMakeFiles/obj.clangReorderFields.dir/ReorderFieldsAction.cpp.o -c /Users/buildslave/jenkins/workspace/clang-stage2-coverage-R/llvm/tools/clang/tools/extra/clang-reorder-fields/ReorderFieldsAction.cpp
[2740/4599] : && "/Applications/Xcode.app/Contents/Developer/Toolchains/XcodeDefault.xctoolchain/usr/bin/libtool" -static -no_warning_for_no_symbols -o lib/libclangReorderFields.a  tools/clang/tools/extra/clang-reorder-fields/CMakeFiles/obj.clangReorderFields.dir/ReorderFieldsAction.cpp.o && :
[2741/4599] /Users/buildslave/jenkins/workspace/clang-stage2-coverage-R/host-compiler/bin/clang++  -DGTEST_HAS_RTTI=0 -D_GNU_SOURCE -D__STDC_CONSTANT_MACROS -D__STDC_FORMAT_MACROS -D__STDC_LIMIT_MACROS -Itools/clang/lib/StaticAnalyzer/Core -I/Users/buildslave/jenkins/workspace/clang-stage2-coverage-R/llvm/tools/clang/lib/StaticAnalyzer/Core -I/Users/buildslave/jenkins/workspace/clang-stage2-coverage-R/llvm/tools/clang/include -Itools/clang/include -I/Applications/Xcode.app/Contents/Developer/Platforms/MacOSX.platform/Developer/SDKs/MacOSX10.14.sdk/usr/include/libxml2 -Iinclude -I/Users/buildslave/jenkins/workspace/clang-stage2-coverage-R/llvm/include -fPIC -fvisibility-inlines-hidden -Werror=date-time -Werror=unguarded-availability-new -std=c++11 -fmodules -fmodules-cache-path=/Users/buildslave/jenkins/workspace/clang-stage2-coverage-R/clang-build/module.cache -fcxx-modules -Wall -Wextra -Wno-unused-parameter -Wwrite-strings -Wcast-qual -Wmissing-field-initializers -pedantic -Wno-long-long -Wimplicit-fallthrough -Wcovered-switch-default -Wno-noexcept-type -Wnon-virtual-dtor -Wdelete-non-virtual-dtor -Wstring-conversion -fdiagnostics-color -fprofile-instr-generate='/Users/buildslave/jenkins/workspace/clang-stage2-coverage-R/clang-build/profiles/%6m.profraw' -fcoverage-mapping -fno-common -Woverloaded-virtual -Wno-nested-anon-types -O3 -DNDEBUG -isysroot /Applications/Xcode.app/Contents/Developer/Platforms/MacOSX.platform/Developer/SDKs/MacOSX10.14.sdk    -fno-exceptions -fno-rtti -MD -MT tools/clang/lib/StaticAnalyzer/Core/CMakeFiles/obj.clangStaticAnalyzerCore.dir/CheckerManager.cpp.o -MF tools/clang/lib/StaticAnalyzer/Core/CMakeFiles/obj.clangStaticAnalyzerCore.dir/CheckerManager.cpp.o.d -o tools/clang/lib/StaticAnalyzer/Core/CMakeFiles/obj.clangStaticAnalyzerCore.dir/CheckerManager.cpp.o -c /Users/buildslave/jenkins/workspace/clang-stage2-coverage-R/llvm/tools/clang/lib/StaticAnalyzer/Core/CheckerManager.cpp
[2742/4599] /Users/buildslave/jenkins/workspace/clang-stage2-coverage-R/host-compiler/bin/clang++  -DGTEST_HAS_RTTI=0 -D_GNU_SOURCE -D__STDC_CONSTANT_MACROS -D__STDC_FORMAT_MACROS -D__STDC_LIMIT_MACROS -Itools/clang/tools/extra/clangd -I/Users/buildslave/jenkins/workspace/clang-stage2-coverage-R/llvm/tools/clang/tools/extra/clangd -I/Users/buildslave/jenkins/workspace/clang-stage2-coverage-R/llvm/tools/clang/include -Itools/clang/include -I/Applications/Xcode.app/Contents/Developer/Platforms/MacOSX.platform/Developer/SDKs/MacOSX10.14.sdk/usr/include/libxml2 -Iinclude -I/Users/buildslave/jenkins/workspace/clang-stage2-coverage-R/llvm/include -fPIC -fvisibility-inlines-hidden -Werror=date-time -Werror=unguarded-availability-new -std=c++11 -fmodules -fmodules-cache-path=/Users/buildslave/jenkins/workspace/clang-stage2-coverage-R/clang-build/module.cache -fcxx-modules -Wall -Wextra -Wno-unused-parameter -Wwrite-strings -Wcast-qual -Wmissing-field-initializers -pedantic -Wno-long-long -Wimplicit-fallthrough -Wcovered-switch-default -Wno-noexcept-type -Wnon-virtual-dtor -Wdelete-non-virtual-dtor -Wstring-conversion -fdiagnostics-color -fprofile-instr-generate='/Users/buildslave/jenkins/workspace/clang-stage2-coverage-R/clang-build/profiles/%6m.profraw' -fcoverage-mapping -fno-common -Woverloaded-virtual -Wno-nested-anon-types -O3 -DNDEBUG -isysroot /Applications/Xcode.app/Contents/Developer/Platforms/MacOSX.platform/Developer/SDKs/MacOSX10.14.sdk    -fno-exceptions -fno-rtti -MD -MT tools/clang/tools/extra/clangd/CMakeFiles/obj.clangDaemon.dir/CodeCompletionStrings.cpp.o -MF tools/clang/tools/extra/clangd/CMakeFiles/obj.clangDaemon.dir/CodeCompletionStrings.cpp.o.d -o tools/clang/tools/extra/clangd/CMakeFiles/obj.clangDaemon.dir/CodeCompletionStrings.cpp.o -c /Users/buildslave/jenkins/workspace/clang-stage2-coverage-R/llvm/tools/clang/tools/extra/clangd/CodeCompletionStrings.cpp
[2743/4599] /Users/buildslave/jenkins/workspace/clang-stage2-coverage-R/host-compiler/bin/clang++  -DGTEST_HAS_RTTI=0 -D_GNU_SOURCE -D__STDC_CONSTANT_MACROS -D__STDC_FORMAT_MACROS -D__STDC_LIMIT_MACROS -Itools/clang/tools/extra/clang-apply-replacements -I/Users/buildslave/jenkins/workspace/clang-stage2-coverage-R/llvm/tools/clang/tools/extra/clang-apply-replacements -I/Users/buildslave/jenkins/workspace/clang-stage2-coverage-R/llvm/tools/clang/include -Itools/clang/include -I/Applications/Xcode.app/Contents/Developer/Platforms/MacOSX.platform/Developer/SDKs/MacOSX10.14.sdk/usr/include/libxml2 -Iinclude -I/Users/buildslave/jenkins/workspace/clang-stage2-coverage-R/llvm/include -I/Users/buildslave/jenkins/workspace/clang-stage2-coverage-R/llvm/tools/clang/tools/extra/clang-apply-replacements/include -fPIC -fvisibility-inlines-hidden -Werror=date-time -Werror=unguarded-availability-new -std=c++11 -fmodules -fmodules-cache-path=/Users/buildslave/jenkins/workspace/clang-stage2-coverage-R/clang-build/module.cache -fcxx-modules -Wall -Wextra -Wno-unused-parameter -Wwrite-strings -Wcast-qual -Wmissing-field-initializers -pedantic -Wno-long-long -Wimplicit-fallthrough -Wcovered-switch-default -Wno-noexcept-type -Wnon-virtual-dtor -Wdelete-non-virtual-dtor -Wstring-conversion -fdiagnostics-color -fprofile-instr-generate='/Users/buildslave/jenkins/workspace/clang-stage2-coverage-R/clang-build/profiles/%6m.profraw' -fcoverage-mapping -fno-common -Woverloaded-virtual -Wno-nested-anon-types -O3 -DNDEBUG -isysroot /Applications/Xcode.app/Contents/Developer/Platforms/MacOSX.platform/Developer/SDKs/MacOSX10.14.sdk    -fno-exceptions -fno-rtti -MD -MT tools/clang/tools/extra/clang-apply-replacements/CMakeFiles/obj.clangApplyReplacements.dir/lib/Tooling/ApplyReplacements.cpp.o -MF tools/clang/tools/extra/clang-apply-replacements/CMakeFiles/obj.clangApplyReplacements.dir/lib/Tooling/ApplyReplacements.cpp.o.d -o tools/clang/tools/extra/clang-apply-replacements/CMakeFiles/obj.clangApplyReplacements.dir/lib/Tooling/ApplyReplacements.cpp.o -c /Users/buildslave/jenkins/workspace/clang-stage2-coverage-R/llvm/tools/clang/tools/extra/clang-apply-replacements/lib/Tooling/ApplyReplacements.cpp
[2744/4599] : && "/Applications/Xcode.app/Contents/Developer/Toolchains/XcodeDefault.xctoolchain/usr/bin/libtool" -static -no_warning_for_no_symbols -o lib/libclangApplyReplacements.a  tools/clang/tools/extra/clang-apply-replacements/CMakeFiles/obj.clangApplyReplacements.dir/lib/Tooling/ApplyReplacements.cpp.o && :
[2745/4599] /Users/buildslave/jenkins/workspace/clang-stage2-coverage-R/host-compiler/bin/clang++  -DGTEST_HAS_RTTI=0 -D_GNU_SOURCE -D__STDC_CONSTANT_MACROS -D__STDC_FORMAT_MACROS -D__STDC_LIMIT_MACROS -Itools/clang/tools/extra/clangd -I/Users/buildslave/jenkins/workspace/clang-stage2-coverage-R/llvm/tools/clang/tools/extra/clangd -I/Users/buildslave/jenkins/workspace/clang-stage2-coverage-R/llvm/tools/clang/include -Itools/clang/include -I/Applications/Xcode.app/Contents/Developer/Platforms/MacOSX.platform/Developer/SDKs/MacOSX10.14.sdk/usr/include/libxml2 -Iinclude -I/Users/buildslave/jenkins/workspace/clang-stage2-coverage-R/llvm/include -fPIC -fvisibility-inlines-hidden -Werror=date-time -Werror=unguarded-availability-new -std=c++11 -fmodules -fmodules-cache-path=/Users/buildslave/jenkins/workspace/clang-stage2-coverage-R/clang-build/module.cache -fcxx-modules -Wall -Wextra -Wno-unused-parameter -Wwrite-strings -Wcast-qual -Wmissing-field-initializers -pedantic -Wno-long-long -Wimplicit-fallthrough -Wcovered-switch-default -Wno-noexcept-type -Wnon-virtual-dtor -Wdelete-non-virtual-dtor -Wstring-conversion -fdiagnostics-color -fprofile-instr-generate='/Users/buildslave/jenkins/workspace/clang-stage2-coverage-R/clang-build/profiles/%6m.profraw' -fcoverage-mapping -fno-common -Woverloaded-virtual -Wno-nested-anon-types -O3 -DNDEBUG -isysroot /Applications/Xcode.app/Contents/Developer/Platforms/MacOSX.platform/Developer/SDKs/MacOSX10.14.sdk    -fno-exceptions -fno-rtti -MD -MT tools/clang/tools/extra/clangd/CMakeFiles/obj.clangDaemon.dir/Context.cpp.o -MF tools/clang/tools/extra/clangd/CMakeFiles/obj.clangDaemon.dir/Context.cpp.o.d -o tools/clang/tools/extra/clangd/CMakeFiles/obj.clangDaemon.dir/Context.cpp.o -c /Users/buildslave/jenkins/workspace/clang-stage2-coverage-R/llvm/tools/clang/tools/extra/clangd/Context.cpp
[2746/4599] /Users/buildslave/jenkins/workspace/clang-stage2-coverage-R/host-compiler/bin/clang++  -DGTEST_HAS_RTTI=0 -D_GNU_SOURCE -D__STDC_CONSTANT_MACROS -D__STDC_FORMAT_MACROS -D__STDC_LIMIT_MACROS -Itools/clang/tools/extra/clangd -I/Users/buildslave/jenkins/workspace/clang-stage2-coverage-R/llvm/tools/clang/tools/extra/clangd -I/Users/buildslave/jenkins/workspace/clang-stage2-coverage-R/llvm/tools/clang/include -Itools/clang/include -I/Applications/Xcode.app/Contents/Developer/Platforms/MacOSX.platform/Developer/SDKs/MacOSX10.14.sdk/usr/include/libxml2 -Iinclude -I/Users/buildslave/jenkins/workspace/clang-stage2-coverage-R/llvm/include -fPIC -fvisibility-inlines-hidden -Werror=date-time -Werror=unguarded-availability-new -std=c++11 -fmodules -fmodules-cache-path=/Users/buildslave/jenkins/workspace/clang-stage2-coverage-R/clang-build/module.cache -fcxx-modules -Wall -Wextra -Wno-unused-parameter -Wwrite-strings -Wcast-qual -Wmissing-field-initializers -pedantic -Wno-long-long -Wimplicit-fallthrough -Wcovered-switch-default -Wno-noexcept-type -Wnon-virtual-dtor -Wdelete-non-virtual-dtor -Wstring-conversion -fdiagnostics-color -fprofile-instr-generate='/Users/buildslave/jenkins/workspace/clang-stage2-coverage-R/clang-build/profiles/%6m.profraw' -fcoverage-mapping -fno-common -Woverloaded-virtual -Wno-nested-anon-types -O3 -DNDEBUG -isysroot /Applications/Xcode.app/Contents/Developer/Platforms/MacOSX.platform/Developer/SDKs/MacOSX10.14.sdk    -fno-exceptions -fno-rtti -MD -MT tools/clang/tools/extra/clangd/CMakeFiles/obj.clangDaemon.dir/ClangdServer.cpp.o -MF tools/clang/tools/extra/clangd/CMakeFiles/obj.clangDaemon.dir/ClangdServer.cpp.o.d -o tools/clang/tools/extra/clangd/CMakeFiles/obj.clangDaemon.dir/ClangdServer.cpp.o -c /Users/buildslave/jenkins/workspace/clang-stage2-coverage-R/llvm/tools/clang/tools/extra/clangd/ClangdServer.cpp
[2747/4599] /Users/buildslave/jenkins/workspace/clang-stage2-coverage-R/host-compiler/bin/clang++  -DGTEST_HAS_RTTI=0 -D_GNU_SOURCE -D__STDC_CONSTANT_MACROS -D__STDC_FORMAT_MACROS -D__STDC_LIMIT_MACROS -Itools/clang/tools/extra/clangd -I/Users/buildslave/jenkins/workspace/clang-stage2-coverage-R/llvm/tools/clang/tools/extra/clangd -I/Users/buildslave/jenkins/workspace/clang-stage2-coverage-R/llvm/tools/clang/include -Itools/clang/include -I/Applications/Xcode.app/Contents/Developer/Platforms/MacOSX.platform/Developer/SDKs/MacOSX10.14.sdk/usr/include/libxml2 -Iinclude -I/Users/buildslave/jenkins/workspace/clang-stage2-coverage-R/llvm/include -fPIC -fvisibility-inlines-hidden -Werror=date-time -Werror=unguarded-availability-new -std=c++11 -fmodules -fmodules-cache-path=/Users/buildslave/jenkins/workspace/clang-stage2-coverage-R/clang-build/module.cache -fcxx-modules -Wall -Wextra -Wno-unused-parameter -Wwrite-strings -Wcast-qual -Wmissing-field-initializers -pedantic -Wno-long-long -Wimplicit-fallthrough -Wcovered-switch-default -Wno-noexcept-type -Wnon-virtual-dtor -Wdelete-non-virtual-dtor -Wstring-conversion -fdiagnostics-color -fprofile-instr-generate='/Users/buildslave/jenkins/workspace/clang-stage2-coverage-R/clang-build/profiles/%6m.profraw' -fcoverage-mapping -fno-common -Woverloaded-virtual -Wno-nested-anon-types -O3 -DNDEBUG -isysroot /Applications/Xcode.app/Contents/Developer/Platforms/MacOSX.platform/Developer/SDKs/MacOSX10.14.sdk    -fno-exceptions -fno-rtti -MD -MT tools/clang/tools/extra/clangd/CMakeFiles/obj.clangDaemon.dir/ClangdUnit.cpp.o -MF tools/clang/tools/extra/clangd/CMakeFiles/obj.clangDaemon.dir/ClangdUnit.cpp.o.d -o tools/clang/tools/extra/clangd/CMakeFiles/obj.clangDaemon.dir/ClangdUnit.cpp.o -c /Users/buildslave/jenkins/workspace/clang-stage2-coverage-R/llvm/tools/clang/tools/extra/clangd/ClangdUnit.cpp
[2748/4599] /Users/buildslave/jenkins/workspace/clang-stage2-coverage-R/host-compiler/bin/clang++  -DGTEST_HAS_RTTI=0 -D_GNU_SOURCE -D__STDC_CONSTANT_MACROS -D__STDC_FORMAT_MACROS -D__STDC_LIMIT_MACROS -Itools/clang/tools/extra/clangd -I/Users/buildslave/jenkins/workspace/clang-stage2-coverage-R/llvm/tools/clang/tools/extra/clangd -I/Users/buildslave/jenkins/workspace/clang-stage2-coverage-R/llvm/tools/clang/include -Itools/clang/include -I/Applications/Xcode.app/Contents/Developer/Platforms/MacOSX.platform/Developer/SDKs/MacOSX10.14.sdk/usr/include/libxml2 -Iinclude -I/Users/buildslave/jenkins/workspace/clang-stage2-coverage-R/llvm/include -fPIC -fvisibility-inlines-hidden -Werror=date-time -Werror=unguarded-availability-new -std=c++11 -fmodules -fmodules-cache-path=/Users/buildslave/jenkins/workspace/clang-stage2-coverage-R/clang-build/module.cache -fcxx-modules -Wall -Wextra -Wno-unused-parameter -Wwrite-strings -Wcast-qual -Wmissing-field-initializers -pedantic -Wno-long-long -Wimplicit-fallthrough -Wcovered-switch-default -Wno-noexcept-type -Wnon-virtual-dtor -Wdelete-non-virtual-dtor -Wstring-conversion -fdiagnostics-color -fprofile-instr-generate='/Users/buildslave/jenkins/workspace/clang-stage2-coverage-R/clang-build/profiles/%6m.profraw' -fcoverage-mapping -fno-common -Woverloaded-virtual -Wno-nested-anon-types -O3 -DNDEBUG -isysroot /Applications/Xcode.app/Contents/Developer/Platforms/MacOSX.platform/Developer/SDKs/MacOSX10.14.sdk    -fno-exceptions -fno-rtti -MD -MT tools/clang/tools/extra/clangd/CMakeFiles/obj.clangDaemon.dir/ExpectedTypes.cpp.o -MF tools/clang/tools/extra/clangd/CMakeFiles/obj.clangDaemon.dir/ExpectedTypes.cpp.o.d -o tools/clang/tools/extra/clangd/CMakeFiles/obj.clangDaemon.dir/ExpectedTypes.cpp.o -c /Users/buildslave/jenkins/workspace/clang-stage2-coverage-R/llvm/tools/clang/tools/extra/clangd/ExpectedTypes.cpp
[2749/4599] /Users/buildslave/jenkins/workspace/clang-stage2-coverage-R/host-compiler/bin/clang++  -DGTEST_HAS_RTTI=0 -D_GNU_SOURCE -D__STDC_CONSTANT_MACROS -D__STDC_FORMAT_MACROS -D__STDC_LIMIT_MACROS -Itools/clang/tools/extra/clangd -I/Users/buildslave/jenkins/workspace/clang-stage2-coverage-R/llvm/tools/clang/tools/extra/clangd -I/Users/buildslave/jenkins/workspace/clang-stage2-coverage-R/llvm/tools/clang/include -Itools/clang/include -I/Applications/Xcode.app/Contents/Developer/Platforms/MacOSX.platform/Developer/SDKs/MacOSX10.14.sdk/usr/include/libxml2 -Iinclude -I/Users/buildslave/jenkins/workspace/clang-stage2-coverage-R/llvm/include -fPIC -fvisibility-inlines-hidden -Werror=date-time -Werror=unguarded-availability-new -std=c++11 -fmodules -fmodules-cache-path=/Users/buildslave/jenkins/workspace/clang-stage2-coverage-R/clang-build/module.cache -fcxx-modules -Wall -Wextra -Wno-unused-parameter -Wwrite-strings -Wcast-qual -Wmissing-field-initializers -pedantic -Wno-long-long -Wimplicit-fallthrough -Wcovered-switch-default -Wno-noexcept-type -Wnon-virtual-dtor -Wdelete-non-virtual-dtor -Wstring-conversion -fdiagnostics-color -fprofile-instr-generate='/Users/buildslave/jenkins/workspace/clang-stage2-coverage-R/clang-build/profiles/%6m.profraw' -fcoverage-mapping -fno-common -Woverloaded-virtual -Wno-nested-anon-types -O3 -DNDEBUG -isysroot /Applications/Xcode.app/Contents/Developer/Platforms/MacOSX.platform/Developer/SDKs/MacOSX10.14.sdk    -fno-exceptions -fno-rtti -MD -MT tools/clang/tools/extra/clangd/CMakeFiles/obj.clangDaemon.dir/DraftStore.cpp.o -MF tools/clang/tools/extra/clangd/CMakeFiles/obj.clangDaemon.dir/DraftStore.cpp.o.d -o tools/clang/tools/extra/clangd/CMakeFiles/obj.clangDaemon.dir/DraftStore.cpp.o -c /Users/buildslave/jenkins/workspace/clang-stage2-coverage-R/llvm/tools/clang/tools/extra/clangd/DraftStore.cpp
[2750/4599] /Users/buildslave/jenkins/workspace/clang-stage2-coverage-R/host-compiler/bin/clang++  -DGTEST_HAS_RTTI=0 -D_GNU_SOURCE -D__STDC_CONSTANT_MACROS -D__STDC_FORMAT_MACROS -D__STDC_LIMIT_MACROS -Itools/clang/tools/extra/clangd -I/Users/buildslave/jenkins/workspace/clang-stage2-coverage-R/llvm/tools/clang/tools/extra/clangd -I/Users/buildslave/jenkins/workspace/clang-stage2-coverage-R/llvm/tools/clang/include -Itools/clang/include -I/Applications/Xcode.app/Contents/Developer/Platforms/MacOSX.platform/Developer/SDKs/MacOSX10.14.sdk/usr/include/libxml2 -Iinclude -I/Users/buildslave/jenkins/workspace/clang-stage2-coverage-R/llvm/include -fPIC -fvisibility-inlines-hidden -Werror=date-time -Werror=unguarded-availability-new -std=c++11 -fmodules -fmodules-cache-path=/Users/buildslave/jenkins/workspace/clang-stage2-coverage-R/clang-build/module.cache -fcxx-modules -Wall -Wextra -Wno-unused-parameter -Wwrite-strings -Wcast-qual -Wmissing-field-initializers -pedantic -Wno-long-long -Wimplicit-fallthrough -Wcovered-switch-default -Wno-noexcept-type -Wnon-virtual-dtor -Wdelete-non-virtual-dtor -Wstring-conversion -fdiagnostics-color -fprofile-instr-generate='/Users/buildslave/jenkins/workspace/clang-stage2-coverage-R/clang-build/profiles/%6m.profraw' -fcoverage-mapping -fno-common -Woverloaded-virtual -Wno-nested-anon-types -O3 -DNDEBUG -isysroot /Applications/Xcode.app/Contents/Developer/Platforms/MacOSX.platform/Developer/SDKs/MacOSX10.14.sdk    -fno-exceptions -fno-rtti -MD -MT tools/clang/tools/extra/clangd/CMakeFiles/obj.clangDaemon.dir/Compiler.cpp.o -MF tools/clang/tools/extra/clangd/CMakeFiles/obj.clangDaemon.dir/Compiler.cpp.o.d -o tools/clang/tools/extra/clangd/CMakeFiles/obj.clangDaemon.dir/Compiler.cpp.o -c /Users/buildslave/jenkins/workspace/clang-stage2-coverage-R/llvm/tools/clang/tools/extra/clangd/Compiler.cpp
[2751/4599] /Users/buildslave/jenkins/workspace/clang-stage2-coverage-R/host-compiler/bin/clang++  -DGTEST_HAS_RTTI=0 -D_GNU_SOURCE -D__STDC_CONSTANT_MACROS -D__STDC_FORMAT_MACROS -D__STDC_LIMIT_MACROS -Itools/clang/tools/extra/clangd -I/Users/buildslave/jenkins/workspace/clang-stage2-coverage-R/llvm/tools/clang/tools/extra/clangd -I/Users/buildslave/jenkins/workspace/clang-stage2-coverage-R/llvm/tools/clang/include -Itools/clang/include -I/Applications/Xcode.app/Contents/Developer/Platforms/MacOSX.platform/Developer/SDKs/MacOSX10.14.sdk/usr/include/libxml2 -Iinclude -I/Users/buildslave/jenkins/workspace/clang-stage2-coverage-R/llvm/include -fPIC -fvisibility-inlines-hidden -Werror=date-time -Werror=unguarded-availability-new -std=c++11 -fmodules -fmodules-cache-path=/Users/buildslave/jenkins/workspace/clang-stage2-coverage-R/clang-build/module.cache -fcxx-modules -Wall -Wextra -Wno-unused-parameter -Wwrite-strings -Wcast-qual -Wmissing-field-initializers -pedantic -Wno-long-long -Wimplicit-fallthrough -Wcovered-switch-default -Wno-noexcept-type -Wnon-virtual-dtor -Wdelete-non-virtual-dtor -Wstring-conversion -fdiagnostics-color -fprofile-instr-generate='/Users/buildslave/jenkins/workspace/clang-stage2-coverage-R/clang-build/profiles/%6m.profraw' -fcoverage-mapping -fno-common -Woverloaded-virtual -Wno-nested-anon-types -O3 -DNDEBUG -isysroot /Applications/Xcode.app/Contents/Developer/Platforms/MacOSX.platform/Developer/SDKs/MacOSX10.14.sdk    -fno-exceptions -fno-rtti -MD -MT tools/clang/tools/extra/clangd/CMakeFiles/obj.clangDaemon.dir/FS.cpp.o -MF tools/clang/tools/extra/clangd/CMakeFiles/obj.clangDaemon.dir/FS.cpp.o.d -o tools/clang/tools/extra/clangd/CMakeFiles/obj.clangDaemon.dir/FS.cpp.o -c /Users/buildslave/jenkins/workspace/clang-stage2-coverage-R/llvm/tools/clang/tools/extra/clangd/FS.cpp
[2752/4599] /Users/buildslave/jenkins/workspace/clang-stage2-coverage-R/host-compiler/bin/clang++  -DGTEST_HAS_RTTI=0 -D_GNU_SOURCE -D__STDC_CONSTANT_MACROS -D__STDC_FORMAT_MACROS -D__STDC_LIMIT_MACROS -Itools/clang/tools/extra/clangd -I/Users/buildslave/jenkins/workspace/clang-stage2-coverage-R/llvm/tools/clang/tools/extra/clangd -I/Users/buildslave/jenkins/workspace/clang-stage2-coverage-R/llvm/tools/clang/include -Itools/clang/include -I/Applications/Xcode.app/Contents/Developer/Platforms/MacOSX.platform/Developer/SDKs/MacOSX10.14.sdk/usr/include/libxml2 -Iinclude -I/Users/buildslave/jenkins/workspace/clang-stage2-coverage-R/llvm/include -fPIC -fvisibility-inlines-hidden -Werror=date-time -Werror=unguarded-availability-new -std=c++11 -fmodules -fmodules-cache-path=/Users/buildslave/jenkins/workspace/clang-stage2-coverage-R/clang-build/module.cache -fcxx-modules -Wall -Wextra -Wno-unused-parameter -Wwrite-strings -Wcast-qual -Wmissing-field-initializers -pedantic -Wno-long-long -Wimplicit-fallthrough -Wcovered-switch-default -Wno-noexcept-type -Wnon-virtual-dtor -Wdelete-non-virtual-dtor -Wstring-conversion -fdiagnostics-color -fprofile-instr-generate='/Users/buildslave/jenkins/workspace/clang-stage2-coverage-R/clang-build/profiles/%6m.profraw' -fcoverage-mapping -fno-common -Woverloaded-virtual -Wno-nested-anon-types -O3 -DNDEBUG -isysroot /Applications/Xcode.app/Contents/Developer/Platforms/MacOSX.platform/Developer/SDKs/MacOSX10.14.sdk    -fno-exceptions -fno-rtti -MD -MT tools/clang/tools/extra/clangd/CMakeFiles/obj.clangDaemon.dir/FileDistance.cpp.o -MF tools/clang/tools/extra/clangd/CMakeFiles/obj.clangDaemon.dir/FileDistance.cpp.o.d -o tools/clang/tools/extra/clangd/CMakeFiles/obj.clangDaemon.dir/FileDistance.cpp.o -c /Users/buildslave/jenkins/workspace/clang-stage2-coverage-R/llvm/tools/clang/tools/extra/clangd/FileDistance.cpp
[2753/4599] /Users/buildslave/jenkins/workspace/clang-stage2-coverage-R/host-compiler/bin/clang++  -DGTEST_HAS_RTTI=0 -D_GNU_SOURCE -D__STDC_CONSTANT_MACROS -D__STDC_FORMAT_MACROS -D__STDC_LIMIT_MACROS -Itools/clang/tools/extra/clangd -I/Users/buildslave/jenkins/workspace/clang-stage2-coverage-R/llvm/tools/clang/tools/extra/clangd -I/Users/buildslave/jenkins/workspace/clang-stage2-coverage-R/llvm/tools/clang/include -Itools/clang/include -I/Applications/Xcode.app/Contents/Developer/Platforms/MacOSX.platform/Developer/SDKs/MacOSX10.14.sdk/usr/include/libxml2 -Iinclude -I/Users/buildslave/jenkins/workspace/clang-stage2-coverage-R/llvm/include -fPIC -fvisibility-inlines-hidden -Werror=date-time -Werror=unguarded-availability-new -std=c++11 -fmodules -fmodules-cache-path=/Users/buildslave/jenkins/workspace/clang-stage2-coverage-R/clang-build/module.cache -fcxx-modules -Wall -Wextra -Wno-unused-parameter -Wwrite-strings -Wcast-qual -Wmissing-field-initializers -pedantic -Wno-long-long -Wimplicit-fallthrough -Wcovered-switch-default -Wno-noexcept-type -Wnon-virtual-dtor -Wdelete-non-virtual-dtor -Wstring-conversion -fdiagnostics-color -fprofile-instr-generate='/Users/buildslave/jenkins/workspace/clang-stage2-coverage-R/clang-build/profiles/%6m.profraw' -fcoverage-mapping -fno-common -Woverloaded-virtual -Wno-nested-anon-types -O3 -DNDEBUG -isysroot /Applications/Xcode.app/Contents/Developer/Platforms/MacOSX.platform/Developer/SDKs/MacOSX10.14.sdk    -fno-exceptions -fno-rtti -MD -MT tools/clang/tools/extra/clangd/CMakeFiles/obj.clangDaemon.dir/FSProvider.cpp.o -MF tools/clang/tools/extra/clangd/CMakeFiles/obj.clangDaemon.dir/FSProvider.cpp.o.d -o tools/clang/tools/extra/clangd/CMakeFiles/obj.clangDaemon.dir/FSProvider.cpp.o -c /Users/buildslave/jenkins/workspace/clang-stage2-coverage-R/llvm/tools/clang/tools/extra/clangd/FSProvider.cpp
[2754/4599] /Users/buildslave/jenkins/workspace/clang-stage2-coverage-R/host-compiler/bin/clang++  -DGTEST_HAS_RTTI=0 -D_GNU_SOURCE -D__STDC_CONSTANT_MACROS -D__STDC_FORMAT_MACROS -D__STDC_LIMIT_MACROS -Itools/clang/tools/extra/clangd -I/Users/buildslave/jenkins/workspace/clang-stage2-coverage-R/llvm/tools/clang/tools/extra/clangd -I/Users/buildslave/jenkins/workspace/clang-stage2-coverage-R/llvm/tools/clang/include -Itools/clang/include -I/Applications/Xcode.app/Contents/Developer/Platforms/MacOSX.platform/Developer/SDKs/MacOSX10.14.sdk/usr/include/libxml2 -Iinclude -I/Users/buildslave/jenkins/workspace/clang-stage2-coverage-R/llvm/include -fPIC -fvisibility-inlines-hidden -Werror=date-time -Werror=unguarded-availability-new -std=c++11 -fmodules -fmodules-cache-path=/Users/buildslave/jenkins/workspace/clang-stage2-coverage-R/clang-build/module.cache -fcxx-modules -Wall -Wextra -Wno-unused-parameter -Wwrite-strings -Wcast-qual -Wmissing-field-initializers -pedantic -Wno-long-long -Wimplicit-fallthrough -Wcovered-switch-default -Wno-noexcept-type -Wnon-virtual-dtor -Wdelete-non-virtual-dtor -Wstring-conversion -fdiagnostics-color -fprofile-instr-generate='/Users/buildslave/jenkins/workspace/clang-stage2-coverage-R/clang-build/profiles/%6m.profraw' -fcoverage-mapping -fno-common -Woverloaded-virtual -Wno-nested-anon-types -O3 -DNDEBUG -isysroot /Applications/Xcode.app/Contents/Developer/Platforms/MacOSX.platform/Developer/SDKs/MacOSX10.14.sdk    -fno-exceptions -fno-rtti -MD -MT tools/clang/tools/extra/clangd/CMakeFiles/obj.clangDaemon.dir/FormattedString.cpp.o -MF tools/clang/tools/extra/clangd/CMakeFiles/obj.clangDaemon.dir/FormattedString.cpp.o.d -o tools/clang/tools/extra/clangd/CMakeFiles/obj.clangDaemon.dir/FormattedString.cpp.o -c /Users/buildslave/jenkins/workspace/clang-stage2-coverage-R/llvm/tools/clang/tools/extra/clangd/FormattedString.cpp
[2755/4599] /Users/buildslave/jenkins/workspace/clang-stage2-coverage-R/host-compiler/bin/clang++  -DGTEST_HAS_RTTI=0 -D_GNU_SOURCE -D__STDC_CONSTANT_MACROS -D__STDC_FORMAT_MACROS -D__STDC_LIMIT_MACROS -Itools/clang/tools/extra/clangd -I/Users/buildslave/jenkins/workspace/clang-stage2-coverage-R/llvm/tools/clang/tools/extra/clangd -I/Users/buildslave/jenkins/workspace/clang-stage2-coverage-R/llvm/tools/clang/include -Itools/clang/include -I/Applications/Xcode.app/Contents/Developer/Platforms/MacOSX.platform/Developer/SDKs/MacOSX10.14.sdk/usr/include/libxml2 -Iinclude -I/Users/buildslave/jenkins/workspace/clang-stage2-coverage-R/llvm/include -fPIC -fvisibility-inlines-hidden -Werror=date-time -Werror=unguarded-availability-new -std=c++11 -fmodules -fmodules-cache-path=/Users/buildslave/jenkins/workspace/clang-stage2-coverage-R/clang-build/module.cache -fcxx-modules -Wall -Wextra -Wno-unused-parameter -Wwrite-strings -Wcast-qual -Wmissing-field-initializers -pedantic -Wno-long-long -Wimplicit-fallthrough -Wcovered-switch-default -Wno-noexcept-type -Wnon-virtual-dtor -Wdelete-non-virtual-dtor -Wstring-conversion -fdiagnostics-color -fprofile-instr-generate='/Users/buildslave/jenkins/workspace/clang-stage2-coverage-R/clang-build/profiles/%6m.profraw' -fcoverage-mapping -fno-common -Woverloaded-virtual -Wno-nested-anon-types -O3 -DNDEBUG -isysroot /Applications/Xcode.app/Contents/Developer/Platforms/MacOSX.platform/Developer/SDKs/MacOSX10.14.sdk    -fno-exceptions -fno-rtti -MD -MT tools/clang/tools/extra/clangd/CMakeFiles/obj.clangDaemon.dir/FuzzyMatch.cpp.o -MF tools/clang/tools/extra/clangd/CMakeFiles/obj.clangDaemon.dir/FuzzyMatch.cpp.o.d -o tools/clang/tools/extra/clangd/CMakeFiles/obj.clangDaemon.dir/FuzzyMatch.cpp.o -c /Users/buildslave/jenkins/workspace/clang-stage2-coverage-R/llvm/tools/clang/tools/extra/clangd/FuzzyMatch.cpp
[2756/4599] /Users/buildslave/jenkins/workspace/clang-stage2-coverage-R/host-compiler/bin/clang++  -DGTEST_HAS_RTTI=0 -D_GNU_SOURCE -D__STDC_CONSTANT_MACROS -D__STDC_FORMAT_MACROS -D__STDC_LIMIT_MACROS -Itools/clang/tools/extra/clangd -I/Users/buildslave/jenkins/workspace/clang-stage2-coverage-R/llvm/tools/clang/tools/extra/clangd -I/Users/buildslave/jenkins/workspace/clang-stage2-coverage-R/llvm/tools/clang/include -Itools/clang/include -I/Applications/Xcode.app/Contents/Developer/Platforms/MacOSX.platform/Developer/SDKs/MacOSX10.14.sdk/usr/include/libxml2 -Iinclude -I/Users/buildslave/jenkins/workspace/clang-stage2-coverage-R/llvm/include -fPIC -fvisibility-inlines-hidden -Werror=date-time -Werror=unguarded-availability-new -std=c++11 -fmodules -fmodules-cache-path=/Users/buildslave/jenkins/workspace/clang-stage2-coverage-R/clang-build/module.cache -fcxx-modules -Wall -Wextra -Wno-unused-parameter -Wwrite-strings -Wcast-qual -Wmissing-field-initializers -pedantic -Wno-long-long -Wimplicit-fallthrough -Wcovered-switch-default -Wno-noexcept-type -Wnon-virtual-dtor -Wdelete-non-virtual-dtor -Wstring-conversion -fdiagnostics-color -fprofile-instr-generate='/Users/buildslave/jenkins/workspace/clang-stage2-coverage-R/clang-build/profiles/%6m.profraw' -fcoverage-mapping -fno-common -Woverloaded-virtual -Wno-nested-anon-types -O3 -DNDEBUG -isysroot /Applications/Xcode.app/Contents/Developer/Platforms/MacOSX.platform/Developer/SDKs/MacOSX10.14.sdk    -fno-exceptions -fno-rtti -MD -MT tools/clang/tools/extra/clangd/CMakeFiles/obj.clangDaemon.dir/Format.cpp.o -MF tools/clang/tools/extra/clangd/CMakeFiles/obj.clangDaemon.dir/Format.cpp.o.d -o tools/clang/tools/extra/clangd/CMakeFiles/obj.clangDaemon.dir/Format.cpp.o -c /Users/buildslave/jenkins/workspace/clang-stage2-coverage-R/llvm/tools/clang/tools/extra/clangd/Format.cpp
[2757/4599] /Users/buildslave/jenkins/workspace/clang-stage2-coverage-R/host-compiler/bin/clang++  -DGTEST_HAS_RTTI=0 -D_GNU_SOURCE -D__STDC_CONSTANT_MACROS -D__STDC_FORMAT_MACROS -D__STDC_LIMIT_MACROS -Itools/clang/tools/extra/clangd -I/Users/buildslave/jenkins/workspace/clang-stage2-coverage-R/llvm/tools/clang/tools/extra/clangd -I/Users/buildslave/jenkins/workspace/clang-stage2-coverage-R/llvm/tools/clang/include -Itools/clang/include -I/Applications/Xcode.app/Contents/Developer/Platforms/MacOSX.platform/Developer/SDKs/MacOSX10.14.sdk/usr/include/libxml2 -Iinclude -I/Users/buildslave/jenkins/workspace/clang-stage2-coverage-R/llvm/include -fPIC -fvisibility-inlines-hidden -Werror=date-time -Werror=unguarded-availability-new -std=c++11 -fmodules -fmodules-cache-path=/Users/buildslave/jenkins/workspace/clang-stage2-coverage-R/clang-build/module.cache -fcxx-modules -Wall -Wextra -Wno-unused-parameter -Wwrite-strings -Wcast-qual -Wmissing-field-initializers -pedantic -Wno-long-long -Wimplicit-fallthrough -Wcovered-switch-default -Wno-noexcept-type -Wnon-virtual-dtor -Wdelete-non-virtual-dtor -Wstring-conversion -fdiagnostics-color -fprofile-instr-generate='/Users/buildslave/jenkins/workspace/clang-stage2-coverage-R/clang-build/profiles/%6m.profraw' -fcoverage-mapping -fno-common -Woverloaded-virtual -Wno-nested-anon-types -O3 -DNDEBUG -isysroot /Applications/Xcode.app/Contents/Developer/Platforms/MacOSX.platform/Developer/SDKs/MacOSX10.14.sdk    -fno-exceptions -fno-rtti -MD -MT tools/clang/tools/extra/clangd/CMakeFiles/obj.clangDaemon.dir/Diagnostics.cpp.o -MF tools/clang/tools/extra/clangd/CMakeFiles/obj.clangDaemon.dir/Diagnostics.cpp.o.d -o tools/clang/tools/extra/clangd/CMakeFiles/obj.clangDaemon.dir/Diagnostics.cpp.o -c /Users/buildslave/jenkins/workspace/clang-stage2-coverage-R/llvm/tools/clang/tools/extra/clangd/Diagnostics.cpp
[2758/4599] /Users/buildslave/jenkins/workspace/clang-stage2-coverage-R/host-compiler/bin/clang++  -DGTEST_HAS_RTTI=0 -D_GNU_SOURCE -D__STDC_CONSTANT_MACROS -D__STDC_FORMAT_MACROS -D__STDC_LIMIT_MACROS -Itools/clang/tools/extra/clangd -I/Users/buildslave/jenkins/workspace/clang-stage2-coverage-R/llvm/tools/clang/tools/extra/clangd -I/Users/buildslave/jenkins/workspace/clang-stage2-coverage-R/llvm/tools/clang/include -Itools/clang/include -I/Applications/Xcode.app/Contents/Developer/Platforms/MacOSX.platform/Developer/SDKs/MacOSX10.14.sdk/usr/include/libxml2 -Iinclude -I/Users/buildslave/jenkins/workspace/clang-stage2-coverage-R/llvm/include -fPIC -fvisibility-inlines-hidden -Werror=date-time -Werror=unguarded-availability-new -std=c++11 -fmodules -fmodules-cache-path=/Users/buildslave/jenkins/workspace/clang-stage2-coverage-R/clang-build/module.cache -fcxx-modules -Wall -Wextra -Wno-unused-parameter -Wwrite-strings -Wcast-qual -Wmissing-field-initializers -pedantic -Wno-long-long -Wimplicit-fallthrough -Wcovered-switch-default -Wno-noexcept-type -Wnon-virtual-dtor -Wdelete-non-virtual-dtor -Wstring-conversion -fdiagnostics-color -fprofile-instr-generate='/Users/buildslave/jenkins/workspace/clang-stage2-coverage-R/clang-build/profiles/%6m.profraw' -fcoverage-mapping -fno-common -Woverloaded-virtual -Wno-nested-anon-types -O3 -DNDEBUG -isysroot /Applications/Xcode.app/Contents/Developer/Platforms/MacOSX.platform/Developer/SDKs/MacOSX10.14.sdk    -fno-exceptions -fno-rtti -MD -MT tools/clang/tools/extra/clangd/CMakeFiles/obj.clangDaemon.dir/CodeComplete.cpp.o -MF tools/clang/tools/extra/clangd/CMakeFiles/obj.clangDaemon.dir/CodeComplete.cpp.o.d -o tools/clang/tools/extra/clangd/CMakeFiles/obj.clangDaemon.dir/CodeComplete.cpp.o -c /Users/buildslave/jenkins/workspace/clang-stage2-coverage-R/llvm/tools/clang/tools/extra/clangd/CodeComplete.cpp
[2759/4599] /Users/buildslave/jenkins/workspace/clang-stage2-coverage-R/host-compiler/bin/clang++  -DGTEST_HAS_RTTI=0 -D_GNU_SOURCE -D__STDC_CONSTANT_MACROS -D__STDC_FORMAT_MACROS -D__STDC_LIMIT_MACROS -Itools/clang/tools/extra/clangd -I/Users/buildslave/jenkins/workspace/clang-stage2-coverage-R/llvm/tools/clang/tools/extra/clangd -I/Users/buildslave/jenkins/workspace/clang-stage2-coverage-R/llvm/tools/clang/include -Itools/clang/include -I/Applications/Xcode.app/Contents/Developer/Platforms/MacOSX.platform/Developer/SDKs/MacOSX10.14.sdk/usr/include/libxml2 -Iinclude -I/Users/buildslave/jenkins/workspace/clang-stage2-coverage-R/llvm/include -fPIC -fvisibility-inlines-hidden -Werror=date-time -Werror=unguarded-availability-new -std=c++11 -fmodules -fmodules-cache-path=/Users/buildslave/jenkins/workspace/clang-stage2-coverage-R/clang-build/module.cache -fcxx-modules -Wall -Wextra -Wno-unused-parameter -Wwrite-strings -Wcast-qual -Wmissing-field-initializers -pedantic -Wno-long-long -Wimplicit-fallthrough -Wcovered-switch-default -Wno-noexcept-type -Wnon-virtual-dtor -Wdelete-non-virtual-dtor -Wstring-conversion -fdiagnostics-color -fprofile-instr-generate='/Users/buildslave/jenkins/workspace/clang-stage2-coverage-R/clang-build/profiles/%6m.profraw' -fcoverage-mapping -fno-common -Woverloaded-virtual -Wno-nested-anon-types -O3 -DNDEBUG -isysroot /Applications/Xcode.app/Contents/Developer/Platforms/MacOSX.platform/Developer/SDKs/MacOSX10.14.sdk    -fno-exceptions -fno-rtti -MD -MT tools/clang/tools/extra/clangd/CMakeFiles/obj.clangDaemon.dir/ClangdLSPServer.cpp.o -MF tools/clang/tools/extra/clangd/CMakeFiles/obj.clangDaemon.dir/ClangdLSPServer.cpp.o.d -o tools/clang/tools/extra/clangd/CMakeFiles/obj.clangDaemon.dir/ClangdLSPServer.cpp.o -c /Users/buildslave/jenkins/workspace/clang-stage2-coverage-R/llvm/tools/clang/tools/extra/clangd/ClangdLSPServer.cpp
[2760/4599] /Users/buildslave/jenkins/workspace/clang-stage2-coverage-R/host-compiler/bin/clang++  -DGTEST_HAS_RTTI=0 -D_GNU_SOURCE -D__STDC_CONSTANT_MACROS -D__STDC_FORMAT_MACROS -D__STDC_LIMIT_MACROS -Itools/clang/tools/extra/clangd -I/Users/buildslave/jenkins/workspace/clang-stage2-coverage-R/llvm/tools/clang/tools/extra/clangd -I/Users/buildslave/jenkins/workspace/clang-stage2-coverage-R/llvm/tools/clang/include -Itools/clang/include -I/Applications/Xcode.app/Contents/Developer/Platforms/MacOSX.platform/Developer/SDKs/MacOSX10.14.sdk/usr/include/libxml2 -Iinclude -I/Users/buildslave/jenkins/workspace/clang-stage2-coverage-R/llvm/include -fPIC -fvisibility-inlines-hidden -Werror=date-time -Werror=unguarded-availability-new -std=c++11 -fmodules -fmodules-cache-path=/Users/buildslave/jenkins/workspace/clang-stage2-coverage-R/clang-build/module.cache -fcxx-modules -Wall -Wextra -Wno-unused-parameter -Wwrite-strings -Wcast-qual -Wmissing-field-initializers -pedantic -Wno-long-long -Wimplicit-fallthrough -Wcovered-switch-default -Wno-noexcept-type -Wnon-virtual-dtor -Wdelete-non-virtual-dtor -Wstring-conversion -fdiagnostics-color -fprofile-instr-generate='/Users/buildslave/jenkins/workspace/clang-stage2-coverage-R/clang-build/profiles/%6m.profraw' -fcoverage-mapping -fno-common -Woverloaded-virtual -Wno-nested-anon-types -O3 -DNDEBUG -isysroot /Applications/Xcode.app/Contents/Developer/Platforms/MacOSX.platform/Developer/SDKs/MacOSX10.14.sdk    -fno-exceptions -fno-rtti -MD -MT tools/clang/tools/extra/clangd/CMakeFiles/obj.clangDaemon.dir/IncludeFixer.cpp.o -MF tools/clang/tools/extra/clangd/CMakeFiles/obj.clangDaemon.dir/IncludeFixer.cpp.o.d -o tools/clang/tools/extra/clangd/CMakeFiles/obj.clangDaemon.dir/IncludeFixer.cpp.o -c /Users/buildslave/jenkins/workspace/clang-stage2-coverage-R/llvm/tools/clang/tools/extra/clangd/IncludeFixer.cpp
[2761/4599] /Users/buildslave/jenkins/workspace/clang-stage2-coverage-R/host-compiler/bin/clang++  -DGTEST_HAS_RTTI=0 -D_GNU_SOURCE -D__STDC_CONSTANT_MACROS -D__STDC_FORMAT_MACROS -D__STDC_LIMIT_MACROS -Itools/clang/tools/extra/clangd -I/Users/buildslave/jenkins/workspace/clang-stage2-coverage-R/llvm/tools/clang/tools/extra/clangd -I/Users/buildslave/jenkins/workspace/clang-stage2-coverage-R/llvm/tools/clang/include -Itools/clang/include -I/Applications/Xcode.app/Contents/Developer/Platforms/MacOSX.platform/Developer/SDKs/MacOSX10.14.sdk/usr/include/libxml2 -Iinclude -I/Users/buildslave/jenkins/workspace/clang-stage2-coverage-R/llvm/include -fPIC -fvisibility-inlines-hidden -Werror=date-time -Werror=unguarded-availability-new -std=c++11 -fmodules -fmodules-cache-path=/Users/buildslave/jenkins/workspace/clang-stage2-coverage-R/clang-build/module.cache -fcxx-modules -Wall -Wextra -Wno-unused-parameter -Wwrite-strings -Wcast-qual -Wmissing-field-initializers -pedantic -Wno-long-long -Wimplicit-fallthrough -Wcovered-switch-default -Wno-noexcept-type -Wnon-virtual-dtor -Wdelete-non-virtual-dtor -Wstring-conversion -fdiagnostics-color -fprofile-instr-generate='/Users/buildslave/jenkins/workspace/clang-stage2-coverage-R/clang-build/profiles/%6m.profraw' -fcoverage-mapping -fno-common -Woverloaded-virtual -Wno-nested-anon-types -O3 -DNDEBUG -isysroot /Applications/Xcode.app/Contents/Developer/Platforms/MacOSX.platform/Developer/SDKs/MacOSX10.14.sdk    -fno-exceptions -fno-rtti -MD -MT tools/clang/tools/extra/clangd/CMakeFiles/obj.clangDaemon.dir/Logger.cpp.o -MF tools/clang/tools/extra/clangd/CMakeFiles/obj.clangDaemon.dir/Logger.cpp.o.d -o tools/clang/tools/extra/clangd/CMakeFiles/obj.clangDaemon.dir/Logger.cpp.o -c /Users/buildslave/jenkins/workspace/clang-stage2-coverage-R/llvm/tools/clang/tools/extra/clangd/Logger.cpp
[2762/4599] /Users/buildslave/jenkins/workspace/clang-stage2-coverage-R/host-compiler/bin/clang++  -DGTEST_HAS_RTTI=0 -D_GNU_SOURCE -D__STDC_CONSTANT_MACROS -D__STDC_FORMAT_MACROS -D__STDC_LIMIT_MACROS -Itools/clang/tools/extra/clangd -I/Users/buildslave/jenkins/workspace/clang-stage2-coverage-R/llvm/tools/clang/tools/extra/clangd -I/Users/buildslave/jenkins/workspace/clang-stage2-coverage-R/llvm/tools/clang/include -Itools/clang/include -I/Applications/Xcode.app/Contents/Developer/Platforms/MacOSX.platform/Developer/SDKs/MacOSX10.14.sdk/usr/include/libxml2 -Iinclude -I/Users/buildslave/jenkins/workspace/clang-stage2-coverage-R/llvm/include -fPIC -fvisibility-inlines-hidden -Werror=date-time -Werror=unguarded-availability-new -std=c++11 -fmodules -fmodules-cache-path=/Users/buildslave/jenkins/workspace/clang-stage2-coverage-R/clang-build/module.cache -fcxx-modules -Wall -Wextra -Wno-unused-parameter -Wwrite-strings -Wcast-qual -Wmissing-field-initializers -pedantic -Wno-long-long -Wimplicit-fallthrough -Wcovered-switch-default -Wno-noexcept-type -Wnon-virtual-dtor -Wdelete-non-virtual-dtor -Wstring-conversion -fdiagnostics-color -fprofile-instr-generate='/Users/buildslave/jenkins/workspace/clang-stage2-coverage-R/clang-build/profiles/%6m.profraw' -fcoverage-mapping -fno-common -Woverloaded-virtual -Wno-nested-anon-types -O3 -DNDEBUG -isysroot /Applications/Xcode.app/Contents/Developer/Platforms/MacOSX.platform/Developer/SDKs/MacOSX10.14.sdk    -fno-exceptions -fno-rtti -MD -MT tools/clang/tools/extra/clangd/CMakeFiles/obj.clangDaemon.dir/GlobalCompilationDatabase.cpp.o -MF tools/clang/tools/extra/clangd/CMakeFiles/obj.clangDaemon.dir/GlobalCompilationDatabase.cpp.o.d -o tools/clang/tools/extra/clangd/CMakeFiles/obj.clangDaemon.dir/GlobalCompilationDatabase.cpp.o -c /Users/buildslave/jenkins/workspace/clang-stage2-coverage-R/llvm/tools/clang/tools/extra/clangd/GlobalCompilationDatabase.cpp
[2763/4599] /Users/buildslave/jenkins/workspace/clang-stage2-coverage-R/host-compiler/bin/clang++  -DGTEST_HAS_RTTI=0 -D_GNU_SOURCE -D__STDC_CONSTANT_MACROS -D__STDC_FORMAT_MACROS -D__STDC_LIMIT_MACROS -Itools/clang/tools/extra/clangd -I/Users/buildslave/jenkins/workspace/clang-stage2-coverage-R/llvm/tools/clang/tools/extra/clangd -I/Users/buildslave/jenkins/workspace/clang-stage2-coverage-R/llvm/tools/clang/include -Itools/clang/include -I/Applications/Xcode.app/Contents/Developer/Platforms/MacOSX.platform/Developer/SDKs/MacOSX10.14.sdk/usr/include/libxml2 -Iinclude -I/Users/buildslave/jenkins/workspace/clang-stage2-coverage-R/llvm/include -fPIC -fvisibility-inlines-hidden -Werror=date-time -Werror=unguarded-availability-new -std=c++11 -fmodules -fmodules-cache-path=/Users/buildslave/jenkins/workspace/clang-stage2-coverage-R/clang-build/module.cache -fcxx-modules -Wall -Wextra -Wno-unused-parameter -Wwrite-strings -Wcast-qual -Wmissing-field-initializers -pedantic -Wno-long-long -Wimplicit-fallthrough -Wcovered-switch-default -Wno-noexcept-type -Wnon-virtual-dtor -Wdelete-non-virtual-dtor -Wstring-conversion -fdiagnostics-color -fprofile-instr-generate='/Users/buildslave/jenkins/workspace/clang-stage2-coverage-R/clang-build/profiles/%6m.profraw' -fcoverage-mapping -fno-common -Woverloaded-virtual -Wno-nested-anon-types -O3 -DNDEBUG -isysroot /Applications/Xcode.app/Contents/Developer/Platforms/MacOSX.platform/Developer/SDKs/MacOSX10.14.sdk    -fno-exceptions -fno-rtti -MD -MT tools/clang/tools/extra/clangd/CMakeFiles/obj.clangDaemon.dir/JSONTransport.cpp.o -MF tools/clang/tools/extra/clangd/CMakeFiles/obj.clangDaemon.dir/JSONTransport.cpp.o.d -o tools/clang/tools/extra/clangd/CMakeFiles/obj.clangDaemon.dir/JSONTransport.cpp.o -c /Users/buildslave/jenkins/workspace/clang-stage2-coverage-R/llvm/tools/clang/tools/extra/clangd/JSONTransport.cpp
[2764/4599] /Users/buildslave/jenkins/workspace/clang-stage2-coverage-R/host-compiler/bin/clang++  -DGTEST_HAS_RTTI=0 -D_GNU_SOURCE -D__STDC_CONSTANT_MACROS -D__STDC_FORMAT_MACROS -D__STDC_LIMIT_MACROS -Itools/clang/tools/extra/clangd -I/Users/buildslave/jenkins/workspace/clang-stage2-coverage-R/llvm/tools/clang/tools/extra/clangd -I/Users/buildslave/jenkins/workspace/clang-stage2-coverage-R/llvm/tools/clang/include -Itools/clang/include -I/Applications/Xcode.app/Contents/Developer/Platforms/MacOSX.platform/Developer/SDKs/MacOSX10.14.sdk/usr/include/libxml2 -Iinclude -I/Users/buildslave/jenkins/workspace/clang-stage2-coverage-R/llvm/include -fPIC -fvisibility-inlines-hidden -Werror=date-time -Werror=unguarded-availability-new -std=c++11 -fmodules -fmodules-cache-path=/Users/buildslave/jenkins/workspace/clang-stage2-coverage-R/clang-build/module.cache -fcxx-modules -Wall -Wextra -Wno-unused-parameter -Wwrite-strings -Wcast-qual -Wmissing-field-initializers -pedantic -Wno-long-long -Wimplicit-fallthrough -Wcovered-switch-default -Wno-noexcept-type -Wnon-virtual-dtor -Wdelete-non-virtual-dtor -Wstring-conversion -fdiagnostics-color -fprofile-instr-generate='/Users/buildslave/jenkins/workspace/clang-stage2-coverage-R/clang-build/profiles/%6m.profraw' -fcoverage-mapping -fno-common -Woverloaded-virtual -Wno-nested-anon-types -O3 -DNDEBUG -isysroot /Applications/Xcode.app/Contents/Developer/Platforms/MacOSX.platform/Developer/SDKs/MacOSX10.14.sdk    -fno-exceptions -fno-rtti -MD -MT tools/clang/tools/extra/clangd/CMakeFiles/obj.clangDaemon.dir/RIFF.cpp.o -MF tools/clang/tools/extra/clangd/CMakeFiles/obj.clangDaemon.dir/RIFF.cpp.o.d -o tools/clang/tools/extra/clangd/CMakeFiles/obj.clangDaemon.dir/RIFF.cpp.o -c /Users/buildslave/jenkins/workspace/clang-stage2-coverage-R/llvm/tools/clang/tools/extra/clangd/RIFF.cpp
[2765/4599] /Users/buildslave/jenkins/workspace/clang-stage2-coverage-R/host-compiler/bin/clang++  -DGTEST_HAS_RTTI=0 -D_GNU_SOURCE -D__STDC_CONSTANT_MACROS -D__STDC_FORMAT_MACROS -D__STDC_LIMIT_MACROS -Itools/clang/tools/extra/clangd -I/Users/buildslave/jenkins/workspace/clang-stage2-coverage-R/llvm/tools/clang/tools/extra/clangd -I/Users/buildslave/jenkins/workspace/clang-stage2-coverage-R/llvm/tools/clang/include -Itools/clang/include -I/Applications/Xcode.app/Contents/Developer/Platforms/MacOSX.platform/Developer/SDKs/MacOSX10.14.sdk/usr/include/libxml2 -Iinclude -I/Users/buildslave/jenkins/workspace/clang-stage2-coverage-R/llvm/include -fPIC -fvisibility-inlines-hidden -Werror=date-time -Werror=unguarded-availability-new -std=c++11 -fmodules -fmodules-cache-path=/Users/buildslave/jenkins/workspace/clang-stage2-coverage-R/clang-build/module.cache -fcxx-modules -Wall -Wextra -Wno-unused-parameter -Wwrite-strings -Wcast-qual -Wmissing-field-initializers -pedantic -Wno-long-long -Wimplicit-fallthrough -Wcovered-switch-default -Wno-noexcept-type -Wnon-virtual-dtor -Wdelete-non-virtual-dtor -Wstring-conversion -fdiagnostics-color -fprofile-instr-generate='/Users/buildslave/jenkins/workspace/clang-stage2-coverage-R/clang-build/profiles/%6m.profraw' -fcoverage-mapping -fno-common -Woverloaded-virtual -Wno-nested-anon-types -O3 -DNDEBUG -isysroot /Applications/Xcode.app/Contents/Developer/Platforms/MacOSX.platform/Developer/SDKs/MacOSX10.14.sdk    -fno-exceptions -fno-rtti -MD -MT tools/clang/tools/extra/clangd/CMakeFiles/obj.clangDaemon.dir/Quality.cpp.o -MF tools/clang/tools/extra/clangd/CMakeFiles/obj.clangDaemon.dir/Quality.cpp.o.d -o tools/clang/tools/extra/clangd/CMakeFiles/obj.clangDaemon.dir/Quality.cpp.o -c /Users/buildslave/jenkins/workspace/clang-stage2-coverage-R/llvm/tools/clang/tools/extra/clangd/Quality.cpp
[2766/4599] /Users/buildslave/jenkins/workspace/clang-stage2-coverage-R/host-compiler/bin/clang++  -DGTEST_HAS_RTTI=0 -D_GNU_SOURCE -D__STDC_CONSTANT_MACROS -D__STDC_FORMAT_MACROS -D__STDC_LIMIT_MACROS -Itools/clang/tools/extra/clangd -I/Users/buildslave/jenkins/workspace/clang-stage2-coverage-R/llvm/tools/clang/tools/extra/clangd -I/Users/buildslave/jenkins/workspace/clang-stage2-coverage-R/llvm/tools/clang/include -Itools/clang/include -I/Applications/Xcode.app/Contents/Developer/Platforms/MacOSX.platform/Developer/SDKs/MacOSX10.14.sdk/usr/include/libxml2 -Iinclude -I/Users/buildslave/jenkins/workspace/clang-stage2-coverage-R/llvm/include -fPIC -fvisibility-inlines-hidden -Werror=date-time -Werror=unguarded-availability-new -std=c++11 -fmodules -fmodules-cache-path=/Users/buildslave/jenkins/workspace/clang-stage2-coverage-R/clang-build/module.cache -fcxx-modules -Wall -Wextra -Wno-unused-parameter -Wwrite-strings -Wcast-qual -Wmissing-field-initializers -pedantic -Wno-long-long -Wimplicit-fallthrough -Wcovered-switch-default -Wno-noexcept-type -Wnon-virtual-dtor -Wdelete-non-virtual-dtor -Wstring-conversion -fdiagnostics-color -fprofile-instr-generate='/Users/buildslave/jenkins/workspace/clang-stage2-coverage-R/clang-build/profiles/%6m.profraw' -fcoverage-mapping -fno-common -Woverloaded-virtual -Wno-nested-anon-types -O3 -DNDEBUG -isysroot /Applications/Xcode.app/Contents/Developer/Platforms/MacOSX.platform/Developer/SDKs/MacOSX10.14.sdk    -fno-exceptions -fno-rtti -MD -MT tools/clang/tools/extra/clangd/CMakeFiles/obj.clangDaemon.dir/Protocol.cpp.o -MF tools/clang/tools/extra/clangd/CMakeFiles/obj.clangDaemon.dir/Protocol.cpp.o.d -o tools/clang/tools/extra/clangd/CMakeFiles/obj.clangDaemon.dir/Protocol.cpp.o -c /Users/buildslave/jenkins/workspace/clang-stage2-coverage-R/llvm/tools/clang/tools/extra/clangd/Protocol.cpp
[2767/4599] /Users/buildslave/jenkins/workspace/clang-stage2-coverage-R/host-compiler/bin/clang++  -DGTEST_HAS_RTTI=0 -D_GNU_SOURCE -D__STDC_CONSTANT_MACROS -D__STDC_FORMAT_MACROS -D__STDC_LIMIT_MACROS -Itools/clang/tools/extra/clangd -I/Users/buildslave/jenkins/workspace/clang-stage2-coverage-R/llvm/tools/clang/tools/extra/clangd -I/Users/buildslave/jenkins/workspace/clang-stage2-coverage-R/llvm/tools/clang/include -Itools/clang/include -I/Applications/Xcode.app/Contents/Developer/Platforms/MacOSX.platform/Developer/SDKs/MacOSX10.14.sdk/usr/include/libxml2 -Iinclude -I/Users/buildslave/jenkins/workspace/clang-stage2-coverage-R/llvm/include -fPIC -fvisibility-inlines-hidden -Werror=date-time -Werror=unguarded-availability-new -std=c++11 -fmodules -fmodules-cache-path=/Users/buildslave/jenkins/workspace/clang-stage2-coverage-R/clang-build/module.cache -fcxx-modules -Wall -Wextra -Wno-unused-parameter -Wwrite-strings -Wcast-qual -Wmissing-field-initializers -pedantic -Wno-long-long -Wimplicit-fallthrough -Wcovered-switch-default -Wno-noexcept-type -Wnon-virtual-dtor -Wdelete-non-virtual-dtor -Wstring-conversion -fdiagnostics-color -fprofile-instr-generate='/Users/buildslave/jenkins/workspace/clang-stage2-coverage-R/clang-build/profiles/%6m.profraw' -fcoverage-mapping -fno-common -Woverloaded-virtual -Wno-nested-anon-types -O3 -DNDEBUG -isysroot /Applications/Xcode.app/Contents/Developer/Platforms/MacOSX.platform/Developer/SDKs/MacOSX10.14.sdk    -fno-exceptions -fno-rtti -MD -MT tools/clang/tools/extra/clangd/CMakeFiles/obj.clangDaemon.dir/SourceCode.cpp.o -MF tools/clang/tools/extra/clangd/CMakeFiles/obj.clangDaemon.dir/SourceCode.cpp.o.d -o tools/clang/tools/extra/clangd/CMakeFiles/obj.clangDaemon.dir/SourceCode.cpp.o -c /Users/buildslave/jenkins/workspace/clang-stage2-coverage-R/llvm/tools/clang/tools/extra/clangd/SourceCode.cpp
[2768/4599] /Users/buildslave/jenkins/workspace/clang-stage2-coverage-R/host-compiler/bin/clang++  -DGTEST_HAS_RTTI=0 -D_GNU_SOURCE -D__STDC_CONSTANT_MACROS -D__STDC_FORMAT_MACROS -D__STDC_LIMIT_MACROS -Itools/clang/tools/extra/clangd -I/Users/buildslave/jenkins/workspace/clang-stage2-coverage-R/llvm/tools/clang/tools/extra/clangd -I/Users/buildslave/jenkins/workspace/clang-stage2-coverage-R/llvm/tools/clang/include -Itools/clang/include -I/Applications/Xcode.app/Contents/Developer/Platforms/MacOSX.platform/Developer/SDKs/MacOSX10.14.sdk/usr/include/libxml2 -Iinclude -I/Users/buildslave/jenkins/workspace/clang-stage2-coverage-R/llvm/include -fPIC -fvisibility-inlines-hidden -Werror=date-time -Werror=unguarded-availability-new -std=c++11 -fmodules -fmodules-cache-path=/Users/buildslave/jenkins/workspace/clang-stage2-coverage-R/clang-build/module.cache -fcxx-modules -Wall -Wextra -Wno-unused-parameter -Wwrite-strings -Wcast-qual -Wmissing-field-initializers -pedantic -Wno-long-long -Wimplicit-fallthrough -Wcovered-switch-default -Wno-noexcept-type -Wnon-virtual-dtor -Wdelete-non-virtual-dtor -Wstring-conversion -fdiagnostics-color -fprofile-instr-generate='/Users/buildslave/jenkins/workspace/clang-stage2-coverage-R/clang-build/profiles/%6m.profraw' -fcoverage-mapping -fno-common -Woverloaded-virtual -Wno-nested-anon-types -O3 -DNDEBUG -isysroot /Applications/Xcode.app/Contents/Developer/Platforms/MacOSX.platform/Developer/SDKs/MacOSX10.14.sdk    -fno-exceptions -fno-rtti -MD -MT tools/clang/tools/extra/clangd/CMakeFiles/obj.clangDaemon.dir/Threading.cpp.o -MF tools/clang/tools/extra/clangd/CMakeFiles/obj.clangDaemon.dir/Threading.cpp.o.d -o tools/clang/tools/extra/clangd/CMakeFiles/obj.clangDaemon.dir/Threading.cpp.o -c /Users/buildslave/jenkins/workspace/clang-stage2-coverage-R/llvm/tools/clang/tools/extra/clangd/Threading.cpp
[2769/4599] /Users/buildslave/jenkins/workspace/clang-stage2-coverage-R/host-compiler/bin/clang++  -DGTEST_HAS_RTTI=0 -D_GNU_SOURCE -D__STDC_CONSTANT_MACROS -D__STDC_FORMAT_MACROS -D__STDC_LIMIT_MACROS -Itools/clang/tools/extra/clangd -I/Users/buildslave/jenkins/workspace/clang-stage2-coverage-R/llvm/tools/clang/tools/extra/clangd -I/Users/buildslave/jenkins/workspace/clang-stage2-coverage-R/llvm/tools/clang/include -Itools/clang/include -I/Applications/Xcode.app/Contents/Developer/Platforms/MacOSX.platform/Developer/SDKs/MacOSX10.14.sdk/usr/include/libxml2 -Iinclude -I/Users/buildslave/jenkins/workspace/clang-stage2-coverage-R/llvm/include -fPIC -fvisibility-inlines-hidden -Werror=date-time -Werror=unguarded-availability-new -std=c++11 -fmodules -fmodules-cache-path=/Users/buildslave/jenkins/workspace/clang-stage2-coverage-R/clang-build/module.cache -fcxx-modules -Wall -Wextra -Wno-unused-parameter -Wwrite-strings -Wcast-qual -Wmissing-field-initializers -pedantic -Wno-long-long -Wimplicit-fallthrough -Wcovered-switch-default -Wno-noexcept-type -Wnon-virtual-dtor -Wdelete-non-virtual-dtor -Wstring-conversion -fdiagnostics-color -fprofile-instr-generate='/Users/buildslave/jenkins/workspace/clang-stage2-coverage-R/clang-build/profiles/%6m.profraw' -fcoverage-mapping -fno-common -Woverloaded-virtual -Wno-nested-anon-types -O3 -DNDEBUG -isysroot /Applications/Xcode.app/Contents/Developer/Platforms/MacOSX.platform/Developer/SDKs/MacOSX10.14.sdk    -fno-exceptions -fno-rtti -MD -MT tools/clang/tools/extra/clangd/CMakeFiles/obj.clangDaemon.dir/Trace.cpp.o -MF tools/clang/tools/extra/clangd/CMakeFiles/obj.clangDaemon.dir/Trace.cpp.o.d -o tools/clang/tools/extra/clangd/CMakeFiles/obj.clangDaemon.dir/Trace.cpp.o -c /Users/buildslave/jenkins/workspace/clang-stage2-coverage-R/llvm/tools/clang/tools/extra/clangd/Trace.cpp
[2770/4599] /Users/buildslave/jenkins/workspace/clang-stage2-coverage-R/host-compiler/bin/clang++  -DGTEST_HAS_RTTI=0 -D_GNU_SOURCE -D__STDC_CONSTANT_MACROS -D__STDC_FORMAT_MACROS -D__STDC_LIMIT_MACROS -Itools/clang/tools/extra/clangd -I/Users/buildslave/jenkins/workspace/clang-stage2-coverage-R/llvm/tools/clang/tools/extra/clangd -I/Users/buildslave/jenkins/workspace/clang-stage2-coverage-R/llvm/tools/clang/include -Itools/clang/include -I/Applications/Xcode.app/Contents/Developer/Platforms/MacOSX.platform/Developer/SDKs/MacOSX10.14.sdk/usr/include/libxml2 -Iinclude -I/Users/buildslave/jenkins/workspace/clang-stage2-coverage-R/llvm/include -fPIC -fvisibility-inlines-hidden -Werror=date-time -Werror=unguarded-availability-new -std=c++11 -fmodules -fmodules-cache-path=/Users/buildslave/jenkins/workspace/clang-stage2-coverage-R/clang-build/module.cache -fcxx-modules -Wall -Wextra -Wno-unused-parameter -Wwrite-strings -Wcast-qual -Wmissing-field-initializers -pedantic -Wno-long-long -Wimplicit-fallthrough -Wcovered-switch-default -Wno-noexcept-type -Wnon-virtual-dtor -Wdelete-non-virtual-dtor -Wstring-conversion -fdiagnostics-color -fprofile-instr-generate='/Users/buildslave/jenkins/workspace/clang-stage2-coverage-R/clang-build/profiles/%6m.profraw' -fcoverage-mapping -fno-common -Woverloaded-virtual -Wno-nested-anon-types -O3 -DNDEBUG -isysroot /Applications/Xcode.app/Contents/Developer/Platforms/MacOSX.platform/Developer/SDKs/MacOSX10.14.sdk    -fno-exceptions -fno-rtti -MD -MT tools/clang/tools/extra/clangd/CMakeFiles/obj.clangDaemon.dir/QueryDriverDatabase.cpp.o -MF tools/clang/tools/extra/clangd/CMakeFiles/obj.clangDaemon.dir/QueryDriverDatabase.cpp.o.d -o tools/clang/tools/extra/clangd/CMakeFiles/obj.clangDaemon.dir/QueryDriverDatabase.cpp.o -c /Users/buildslave/jenkins/workspace/clang-stage2-coverage-R/llvm/tools/clang/tools/extra/clangd/QueryDriverDatabase.cpp
[2771/4599] /Users/buildslave/jenkins/workspace/clang-stage2-coverage-R/host-compiler/bin/clang++  -DGTEST_HAS_RTTI=0 -D_GNU_SOURCE -D__STDC_CONSTANT_MACROS -D__STDC_FORMAT_MACROS -D__STDC_LIMIT_MACROS -Itools/clang/tools/extra/clangd -I/Users/buildslave/jenkins/workspace/clang-stage2-coverage-R/llvm/tools/clang/tools/extra/clangd -I/Users/buildslave/jenkins/workspace/clang-stage2-coverage-R/llvm/tools/clang/include -Itools/clang/include -I/Applications/Xcode.app/Contents/Developer/Platforms/MacOSX.platform/Developer/SDKs/MacOSX10.14.sdk/usr/include/libxml2 -Iinclude -I/Users/buildslave/jenkins/workspace/clang-stage2-coverage-R/llvm/include -fPIC -fvisibility-inlines-hidden -Werror=date-time -Werror=unguarded-availability-new -std=c++11 -fmodules -fmodules-cache-path=/Users/buildslave/jenkins/workspace/clang-stage2-coverage-R/clang-build/module.cache -fcxx-modules -Wall -Wextra -Wno-unused-parameter -Wwrite-strings -Wcast-qual -Wmissing-field-initializers -pedantic -Wno-long-long -Wimplicit-fallthrough -Wcovered-switch-default -Wno-noexcept-type -Wnon-virtual-dtor -Wdelete-non-virtual-dtor -Wstring-conversion -fdiagnostics-color -fprofile-instr-generate='/Users/buildslave/jenkins/workspace/clang-stage2-coverage-R/clang-build/profiles/%6m.profraw' -fcoverage-mapping -fno-common -Woverloaded-virtual -Wno-nested-anon-types -O3 -DNDEBUG -isysroot /Applications/Xcode.app/Contents/Developer/Platforms/MacOSX.platform/Developer/SDKs/MacOSX10.14.sdk    -fno-exceptions -fno-rtti -MD -MT tools/clang/tools/extra/clangd/CMakeFiles/obj.clangDaemon.dir/URI.cpp.o -MF tools/clang/tools/extra/clangd/CMakeFiles/obj.clangDaemon.dir/URI.cpp.o.d -o tools/clang/tools/extra/clangd/CMakeFiles/obj.clangDaemon.dir/URI.cpp.o -c /Users/buildslave/jenkins/workspace/clang-stage2-coverage-R/llvm/tools/clang/tools/extra/clangd/URI.cpp
[2772/4599] /Users/buildslave/jenkins/workspace/clang-stage2-coverage-R/host-compiler/bin/clang++  -DGTEST_HAS_RTTI=0 -D_GNU_SOURCE -D__STDC_CONSTANT_MACROS -D__STDC_FORMAT_MACROS -D__STDC_LIMIT_MACROS -Itools/clang/tools/extra/clangd -I/Users/buildslave/jenkins/workspace/clang-stage2-coverage-R/llvm/tools/clang/tools/extra/clangd -I/Users/buildslave/jenkins/workspace/clang-stage2-coverage-R/llvm/tools/clang/include -Itools/clang/include -I/Applications/Xcode.app/Contents/Developer/Platforms/MacOSX.platform/Developer/SDKs/MacOSX10.14.sdk/usr/include/libxml2 -Iinclude -I/Users/buildslave/jenkins/workspace/clang-stage2-coverage-R/llvm/include -fPIC -fvisibility-inlines-hidden -Werror=date-time -Werror=unguarded-availability-new -std=c++11 -fmodules -fmodules-cache-path=/Users/buildslave/jenkins/workspace/clang-stage2-coverage-R/clang-build/module.cache -fcxx-modules -Wall -Wextra -Wno-unused-parameter -Wwrite-strings -Wcast-qual -Wmissing-field-initializers -pedantic -Wno-long-long -Wimplicit-fallthrough -Wcovered-switch-default -Wno-noexcept-type -Wnon-virtual-dtor -Wdelete-non-virtual-dtor -Wstring-conversion -fdiagnostics-color -fprofile-instr-generate='/Users/buildslave/jenkins/workspace/clang-stage2-coverage-R/clang-build/profiles/%6m.profraw' -fcoverage-mapping -fno-common -Woverloaded-virtual -Wno-nested-anon-types -O3 -DNDEBUG -isysroot /Applications/Xcode.app/Contents/Developer/Platforms/MacOSX.platform/Developer/SDKs/MacOSX10.14.sdk    -fno-exceptions -fno-rtti -MD -MT tools/clang/tools/extra/clangd/CMakeFiles/obj.clangDaemon.dir/Selection.cpp.o -MF tools/clang/tools/extra/clangd/CMakeFiles/obj.clangDaemon.dir/Selection.cpp.o.d -o tools/clang/tools/extra/clangd/CMakeFiles/obj.clangDaemon.dir/Selection.cpp.o -c /Users/buildslave/jenkins/workspace/clang-stage2-coverage-R/llvm/tools/clang/tools/extra/clangd/Selection.cpp
[2773/4599] /Users/buildslave/jenkins/workspace/clang-stage2-coverage-R/host-compiler/bin/clang++  -DGTEST_HAS_RTTI=0 -D_GNU_SOURCE -D__STDC_CONSTANT_MACROS -D__STDC_FORMAT_MACROS -D__STDC_LIMIT_MACROS -Itools/clang/tools/extra/clangd -I/Users/buildslave/jenkins/workspace/clang-stage2-coverage-R/llvm/tools/clang/tools/extra/clangd -I/Users/buildslave/jenkins/workspace/clang-stage2-coverage-R/llvm/tools/clang/include -Itools/clang/include -I/Applications/Xcode.app/Contents/Developer/Platforms/MacOSX.platform/Developer/SDKs/MacOSX10.14.sdk/usr/include/libxml2 -Iinclude -I/Users/buildslave/jenkins/workspace/clang-stage2-coverage-R/llvm/include -fPIC -fvisibility-inlines-hidden -Werror=date-time -Werror=unguarded-availability-new -std=c++11 -fmodules -fmodules-cache-path=/Users/buildslave/jenkins/workspace/clang-stage2-coverage-R/clang-build/module.cache -fcxx-modules -Wall -Wextra -Wno-unused-parameter -Wwrite-strings -Wcast-qual -Wmissing-field-initializers -pedantic -Wno-long-long -Wimplicit-fallthrough -Wcovered-switch-default -Wno-noexcept-type -Wnon-virtual-dtor -Wdelete-non-virtual-dtor -Wstring-conversion -fdiagnostics-color -fprofile-instr-generate='/Users/buildslave/jenkins/workspace/clang-stage2-coverage-R/clang-build/profiles/%6m.profraw' -fcoverage-mapping -fno-common -Woverloaded-virtual -Wno-nested-anon-types -O3 -DNDEBUG -isysroot /Applications/Xcode.app/Contents/Developer/Platforms/MacOSX.platform/Developer/SDKs/MacOSX10.14.sdk    -fno-exceptions -fno-rtti -MD -MT tools/clang/tools/extra/clangd/CMakeFiles/obj.clangDaemon.dir/SemanticHighlighting.cpp.o -MF tools/clang/tools/extra/clangd/CMakeFiles/obj.clangDaemon.dir/SemanticHighlighting.cpp.o.d -o tools/clang/tools/extra/clangd/CMakeFiles/obj.clangDaemon.dir/SemanticHighlighting.cpp.o -c /Users/buildslave/jenkins/workspace/clang-stage2-coverage-R/llvm/tools/clang/tools/extra/clangd/SemanticHighlighting.cpp
[2774/4599] /Users/buildslave/jenkins/workspace/clang-stage2-coverage-R/host-compiler/bin/clang++  -DGTEST_HAS_RTTI=0 -D_GNU_SOURCE -D__STDC_CONSTANT_MACROS -D__STDC_FORMAT_MACROS -D__STDC_LIMIT_MACROS -Itools/clang/tools/extra/clangd -I/Users/buildslave/jenkins/workspace/clang-stage2-coverage-R/llvm/tools/clang/tools/extra/clangd -I/Users/buildslave/jenkins/workspace/clang-stage2-coverage-R/llvm/tools/clang/include -Itools/clang/include -I/Applications/Xcode.app/Contents/Developer/Platforms/MacOSX.platform/Developer/SDKs/MacOSX10.14.sdk/usr/include/libxml2 -Iinclude -I/Users/buildslave/jenkins/workspace/clang-stage2-coverage-R/llvm/include -fPIC -fvisibility-inlines-hidden -Werror=date-time -Werror=unguarded-availability-new -std=c++11 -fmodules -fmodules-cache-path=/Users/buildslave/jenkins/workspace/clang-stage2-coverage-R/clang-build/module.cache -fcxx-modules -Wall -Wextra -Wno-unused-parameter -Wwrite-strings -Wcast-qual -Wmissing-field-initializers -pedantic -Wno-long-long -Wimplicit-fallthrough -Wcovered-switch-default -Wno-noexcept-type -Wnon-virtual-dtor -Wdelete-non-virtual-dtor -Wstring-conversion -fdiagnostics-color -fprofile-instr-generate='/Users/buildslave/jenkins/workspace/clang-stage2-coverage-R/clang-build/profiles/%6m.profraw' -fcoverage-mapping -fno-common -Woverloaded-virtual -Wno-nested-anon-types -O3 -DNDEBUG -isysroot /Applications/Xcode.app/Contents/Developer/Platforms/MacOSX.platform/Developer/SDKs/MacOSX10.14.sdk    -fno-exceptions -fno-rtti -MD -MT tools/clang/tools/extra/clangd/CMakeFiles/obj.clangDaemon.dir/FindSymbols.cpp.o -MF tools/clang/tools/extra/clangd/CMakeFiles/obj.clangDaemon.dir/FindSymbols.cpp.o.d -o tools/clang/tools/extra/clangd/CMakeFiles/obj.clangDaemon.dir/FindSymbols.cpp.o -c /Users/buildslave/jenkins/workspace/clang-stage2-coverage-R/llvm/tools/clang/tools/extra/clangd/FindSymbols.cpp
FAILED: tools/clang/tools/extra/clangd/CMakeFiles/obj.clangDaemon.dir/FindSymbols.cpp.o 
/Users/buildslave/jenkins/workspace/clang-stage2-coverage-R/host-compiler/bin/clang++  -DGTEST_HAS_RTTI=0 -D_GNU_SOURCE -D__STDC_CONSTANT_MACROS -D__STDC_FORMAT_MACROS -D__STDC_LIMIT_MACROS -Itools/clang/tools/extra/clangd -I/Users/buildslave/jenkins/workspace/clang-stage2-coverage-R/llvm/tools/clang/tools/extra/clangd -I/Users/buildslave/jenkins/workspace/clang-stage2-coverage-R/llvm/tools/clang/include -Itools/clang/include -I/Applications/Xcode.app/Contents/Developer/Platforms/MacOSX.platform/Developer/SDKs/MacOSX10.14.sdk/usr/include/libxml2 -Iinclude -I/Users/buildslave/jenkins/workspace/clang-stage2-coverage-R/llvm/include -fPIC -fvisibility-inlines-hidden -Werror=date-time -Werror=unguarded-availability-new -std=c++11 -fmodules -fmodules-cache-path=/Users/buildslave/jenkins/workspace/clang-stage2-coverage-R/clang-build/module.cache -fcxx-modules -Wall -Wextra -Wno-unused-parameter -Wwrite-strings -Wcast-qual -Wmissing-field-initializers -pedantic -Wno-long-long -Wimplicit-fallthrough -Wcovered-switch-default -Wno-noexcept-type -Wnon-virtual-dtor -Wdelete-non-virtual-dtor -Wstring-conversion -fdiagnostics-color -fprofile-instr-generate='/Users/buildslave/jenkins/workspace/clang-stage2-coverage-R/clang-build/profiles/%6m.profraw' -fcoverage-mapping -fno-common -Woverloaded-virtual -Wno-nested-anon-types -O3 -DNDEBUG -isysroot /Applications/Xcode.app/Contents/Developer/Platforms/MacOSX.platform/Developer/SDKs/MacOSX10.14.sdk    -fno-exceptions -fno-rtti -MD -MT tools/clang/tools/extra/clangd/CMakeFiles/obj.clangDaemon.dir/FindSymbols.cpp.o -MF tools/clang/tools/extra/clangd/CMakeFiles/obj.clangDaemon.dir/FindSymbols.cpp.o.d -o tools/clang/tools/extra/clangd/CMakeFiles/obj.clangDaemon.dir/FindSymbols.cpp.o -c /Users/buildslave/jenkins/workspace/clang-stage2-coverage-R/llvm/tools/clang/tools/extra/clangd/FindSymbols.cpp
Assertion failed: (CachedFieldIndex && "failed to find field in parent"), function getFieldIndex, file /Users/buildslave/jenkins/workspace/clang-stage1-configure-RA/llvm/tools/clang/lib/AST/Decl.cpp, line 3965.
Stack dump:
0.	Program arguments: /Users/buildslave/jenkins/workspace/clang-stage2-coverage-R/host-compiler/bin/clang-9 -cc1 -triple x86_64-apple-macosx10.14.0 -Wdeprecated-objc-isa-usage -Werror=deprecated-objc-isa-usage -emit-obj -disable-free -main-file-name FindSymbols.cpp -mrelocation-model pic -pic-level 2 -mthread-model posix -mdisable-fp-elim -masm-verbose -munwind-tables -target-sdk-version=10.14 -target-cpu penryn -dwarf-column-info -debugger-tuning=lldb -ggnu-pubnames -target-linker-version 409.12 -fprofile-instrument-path=/Users/buildslave/jenkins/workspace/clang-stage2-coverage-R/clang-build/profiles/%6m.profraw -fprofile-instrument=clang -fcoverage-mapping -coverage-notes-file /Users/buildslave/jenkins/workspace/clang-stage2-coverage-R/clang-build/tools/clang/tools/extra/clangd/CMakeFiles/obj.clangDaemon.dir/FindSymbols.cpp.gcno -resource-dir /Users/buildslave/jenkins/workspace/clang-stage2-coverage-R/host-compiler/lib/clang/9.0.0 -dependency-file tools/clang/tools/extra/clangd/CMakeFiles/obj.clangDaemon.dir/FindSymbols.cpp.o.d -sys-header-deps -MT tools/clang/tools/extra/clangd/CMakeFiles/obj.clangDaemon.dir/FindSymbols.cpp.o -isysroot /Applications/Xcode.app/Contents/Developer/Platforms/MacOSX.platform/Developer/SDKs/MacOSX10.14.sdk -D GTEST_HAS_RTTI=0 -D _GNU_SOURCE -D __STDC_CONSTANT_MACROS -D __STDC_FORMAT_MACROS -D __STDC_LIMIT_MACROS -I tools/clang/tools/extra/clangd -I /Users/buildslave/jenkins/workspace/clang-stage2-coverage-R/llvm/tools/clang/tools/extra/clangd -I /Users/buildslave/jenkins/workspace/clang-stage2-coverage-R/llvm/tools/clang/include -I tools/clang/include -I /Applications/Xcode.app/Contents/Developer/Platforms/MacOSX.platform/Developer/SDKs/MacOSX10.14.sdk/usr/include/libxml2 -I include -I /Users/buildslave/jenkins/workspace/clang-stage2-coverage-R/llvm/include -D NDEBUG -stdlib=libc++ -internal-isystem /Users/buildslave/jenkins/workspace/clang-stage2-coverage-R/host-compiler/bin/../include/c++/v1 -internal-isystem /Applications/Xcode.app/Contents/Developer/Platforms/MacOSX.platform/Developer/SDKs/MacOSX10.14.sdk/usr/include/c++/v1 -internal-isystem /Applications/Xcode.app/Contents/Developer/Platforms/MacOSX.platform/Developer/SDKs/MacOSX10.14.sdk/usr/local/include -internal-isystem /Users/buildslave/jenkins/workspace/clang-stage2-coverage-R/host-compiler/lib/clang/9.0.0/include -internal-externc-isystem /Applications/Xcode.app/Contents/Developer/Platforms/MacOSX.platform/Developer/SDKs/MacOSX10.14.sdk/usr/include -O3 -Werror=date-time -Werror=unguarded-availability-new -Wall -Wextra -Wno-unused-parameter -Wwrite-strings -Wcast-qual -Wmissing-field-initializers -Wno-long-long -Wimplicit-fallthrough -Wcovered-switch-default -Wno-noexcept-type -Wnon-virtual-dtor -Wdelete-non-virtual-dtor -Wstring-conversion -Woverloaded-virtual -Wno-nested-anon-types -pedantic -std=c++11 -fdeprecated-macro -fdebug-compilation-dir /Users/buildslave/jenkins/workspace/clang-stage2-coverage-R/clang-build -ferror-limit 19 -fmessage-length 0 -fvisibility-inlines-hidden -stack-protector 1 -fblocks -fencode-extended-block-signature -fno-rtti -fregister-global-dtors-with-atexit -fmodules -fimplicit-module-maps -fmodules-cache-path=/Users/buildslave/jenkins/workspace/clang-stage2-coverage-R/clang-build/module.cache -fmodules-validate-system-headers -fobjc-runtime=macosx-10.14.0 -fmax-type-align=16 -fno-common -fdiagnostics-show-option -fcolor-diagnostics -vectorize-loops -vectorize-slp -o tools/clang/tools/extra/clangd/CMakeFiles/obj.clangDaemon.dir/FindSymbols.cpp.o -x c++ /Users/buildslave/jenkins/workspace/clang-stage2-coverage-R/llvm/tools/clang/tools/extra/clangd/FindSymbols.cpp 
1.	<eof> parser at end of file
2.	Per-file LLVM IR generation
3.	/Users/buildslave/jenkins/workspace/clang-stage2-coverage-R/llvm/include/llvm/Support/Error.h:625:17: Generating code for declaration 'llvm::Expected<std::__1::basic_string<char> >::getStorage'
0  clang-9                  0x000000010e582398 llvm::sys::PrintStackTrace(llvm::raw_ostream&) + 40
1  clang-9                  0x000000010e581545 llvm::sys::RunSignalHandlers() + 85
2  clang-9                  0x000000010e5829a8 SignalHandler(int) + 264
3  libsystem_platform.dylib 0x00007fff7de97b3d _sigtramp + 29
4  clang-9                  0x000000010e4e3bb6 llvm::FoldingSetBase::FindNodeOrInsertPos(llvm::FoldingSetNodeID const&, void*&) + 182
5  libsystem_c.dylib        0x00007fff7dd561c9 abort + 127
6  libsystem_c.dylib        0x00007fff7dd1e868 basename_r + 0
7  clang-9                  0x0000000110300986 clang::FieldDecl::getFieldIndex() const + 694
8  clang-9                  0x000000010e875b15 clang::CodeGen::CodeGenFunction::EmitLValueForField(clang::CodeGen::LValue, clang::FieldDecl const*) + 1413
9  clang-9                  0x000000010e88083f clang::CodeGen::CodeGenFunction::EmitMemberExpr(clang::MemberExpr const*) + 1247
10 clang-9                  0x000000010e8724aa clang::CodeGen::CodeGenFunction::EmitLValue(clang::Expr const*) + 1018
11 clang-9                  0x000000010e87a99d clang::CodeGen::CodeGenFunction::EmitCheckedLValue(clang::Expr const*, clang::CodeGen::CodeGenFunction::TypeCheckKind) + 173
12 clang-9                  0x000000010e880496 clang::CodeGen::CodeGenFunction::EmitMemberExpr(clang::MemberExpr const*) + 310
13 clang-9                  0x000000010e8724aa clang::CodeGen::CodeGenFunction::EmitLValue(clang::Expr const*) + 1018
14 clang-9                  0x000000010e881a5c clang::CodeGen::CodeGenFunction::EmitCastLValue(clang::CastExpr const*) + 1372
15 clang-9                  0x000000010e87212f clang::CodeGen::CodeGenFunction::EmitLValue(clang::Expr const*) + 127
16 clang-9                  0x000000010e87a99d clang::CodeGen::CodeGenFunction::EmitCheckedLValue(clang::Expr const*, clang::CodeGen::CodeGenFunction::TypeCheckKind) + 173
17 clang-9                  0x000000010e880496 clang::CodeGen::CodeGenFunction::EmitMemberExpr(clang::MemberExpr const*) + 310
18 clang-9                  0x000000010e8724aa clang::CodeGen::CodeGenFunction::EmitLValue(clang::Expr const*) + 1018
19 clang-9                  0x000000010e87a2a7 clang::CodeGen::CodeGenFunction::EmitArrayToPointerDecay(clang::Expr const*, clang::CodeGen::LValueBaseInfo*, clang::CodeGen::TBAAAccessInfo*) + 119
20 clang-9                  0x000000010e8caef8 (anonymous namespace)::ScalarExprEmitter::VisitCastExpr(clang::CastExpr*) + 3896
21 clang-9                  0x000000010e8ca064 (anonymous namespace)::ScalarExprEmitter::VisitCastExpr(clang::CastExpr*) + 164
22 clang-9                  0x000000010e8b80e8 clang::CodeGen::CodeGenFunction::EmitScalarExpr(clang::Expr const*, bool) + 104
23 clang-9                  0x000000010e9acac6 clang::CodeGen::CodeGenFunction::EmitReturnStmt(clang::ReturnStmt const&) + 1430
24 clang-9                  0x000000010e9a9cd2 clang::CodeGen::CodeGenFunction::EmitStmt(clang::Stmt const*, llvm::ArrayRef<clang::Attr const*>) + 2482
25 clang-9                  0x000000010e9b204f clang::CodeGen::CodeGenFunction::EmitCompoundStmtWithoutScope(clang::CompoundStmt const&, bool, clang::CodeGen::AggValueSlot) + 95
26 clang-9                  0x000000010e9f1d47 clang::CodeGen::CodeGenFunction::GenerateCode(clang::GlobalDecl, llvm::Function*, clang::CodeGen::CGFunctionInfo const&) + 791
27 clang-9                  0x000000010ea0cae7 clang::CodeGen::CodeGenModule::EmitGlobalFunctionDefinition(clang::GlobalDecl, llvm::GlobalValue*) + 503
28 clang-9                  0x000000010ea06a06 clang::CodeGen::CodeGenModule::EmitGlobalDefinition(clang::GlobalDecl, llvm::GlobalValue*) + 486
29 clang-9                  0x000000010e9fc9f1 clang::CodeGen::CodeGenModule::EmitDeferred() + 289
30 clang-9                  0x000000010e9fca19 clang::CodeGen::CodeGenModule::EmitDeferred() + 329
31 clang-9                  0x000000010e9fca19 clang::CodeGen::CodeGenModule::EmitDeferred() + 329
32 clang-9                  0x000000010e9fbcea clang::CodeGen::CodeGenModule::Release() + 42
33 clang-9                  0x000000010ea83ac4 (anonymous namespace)::CodeGeneratorImpl::HandleTranslationUnit(clang::ASTContext&) + 100
34 clang-9                  0x000000010e9e8776 clang::BackendConsumer::HandleTranslationUnit(clang::ASTContext&) + 134
35 clang-9                  0x000000010f8e2db3 clang::ParseAST(clang::Sema&, bool, bool) + 611
36 clang-9                  0x000000010ec68324 clang::FrontendAction::Execute() + 84
37 clang-9                  0x000000010ec19cc8 clang::CompilerInstance::ExecuteAction(clang::FrontendAction&) + 1544
38 clang-9                  0x000000010ece0a20 clang::ExecuteCompilerInvocation(clang::CompilerInstance*) + 1808
39 clang-9                  0x000000010c987454 cc1_main(llvm::ArrayRef<char const*>, char const*, void*) + 2356
40 clang-9                  0x000000010c984ad3 main + 10851
41 libdyld.dylib            0x00007fff7dcae085 start + 1
clang-9: error: unable to execute command: Abort trap: 6
clang-9: error: clang frontend command failed due to signal (use -v to see invocation)
clang version 9.0.0 (trunk)
Target: x86_64-apple-darwin18.0.0
Thread model: posix
InstalledDir: /Users/buildslave/jenkins/workspace/clang-stage2-coverage-R/host-compiler/bin
clang-9: note: diagnostic msg: PLEASE submit a bug report to https://bugs.llvm.org/ and include the crash backtrace, preprocessed source, and associated run script.
clang-9: note: diagnostic msg: 
********************

Hide Details

PLEASE ATTACH THE FOLLOWING FILES TO THE BUG REPORT: Preprocessed source(s) and associated run script(s) are located at: clang-9: note: diagnostic msg: /var/folders/09/r4vw4v8n5kb67jl66zvlbljw0000gn/T/FindSymbols-5e6916.cpp clang-9: note: diagnostic msg: /var/folders/09/r4vw4v8n5kb67jl66zvlbljw0000gn/T/FindSymbols-5e6916.cache clang-9: note: diagnostic msg: /var/folders/09/r4vw4v8n5kb67jl66zvlbljw0000gn/T/FindSymbols-5e6916.sh clang-9: note: diagnostic msg: Crash backtrace is located in clang-9: note: diagnostic msg: /Users/buildslave/Library/Logs/DiagnosticReports/clang-9_<YYYY-MM-DD-HHMMSS>_<hostname>.crash clang-9: note: diagnostic msg: (choose the .crash file that corresponds to your crash) clang-9: note: diagnostic msg:

Hide Details

******************** [2775/4599] /Users/buildslave/jenkins/workspace/clang-stage2-coverage-R/host-compiler/bin/clang++ -DGTEST_HAS_RTTI=0 -D_GNU_SOURCE -D__STDC_CONSTANT_MACROS -D__STDC_FORMAT_MACROS -D__STDC_LIMIT_MACROS -Itools/clang/tools/extra/clangd -I/Users/buildslave/jenkins/workspace/clang-stage2-coverage-R/llvm/tools/clang/tools/extra/clangd -I/Users/buildslave/jenkins/workspace/clang-stage2-coverage-R/llvm/tools/clang/include -Itools/clang/include -I/Applications/Xcode.app/Contents/Developer/Platforms/MacOSX.platform/Developer/SDKs/MacOSX10.14.sdk/usr/include/libxml2 -Iinclude -I/Users/buildslave/jenkins/workspace/clang-stage2-coverage-R/llvm/include -fPIC -fvisibility-inlines-hidden -Werror=date-time -Werror=unguarded-availability-new -std=c++11 -fmodules -fmodules-cache-path=/Users/buildslave/jenkins/workspace/clang-stage2-coverage-R/clang-build/module.cache -fcxx-modules -Wall -Wextra -Wno-unused-parameter -Wwrite-strings -Wcast-qual -Wmissing-field-initializers -pedantic -Wno-long-long -Wimplicit-fallthrough -Wcovered-switch-default -Wno-noexcept-type -Wnon-virtual-dtor -Wdelete-non-virtual-dtor -Wstring-conversion -fdiagnostics-color -fprofile-instr-generate='/Users/buildslave/jenkins/workspace/clang-stage2-coverage-R/clang-build/profiles/%6m.profraw' -fcoverage-mapping -fno-common -Woverloaded-virtual -Wno-nested-anon-types -O3 -DNDEBUG -isysroot /Applications/Xcode.app/Contents/Developer/Platforms/MacOSX.platform/Developer/SDKs/MacOSX10.14.sdk -fno-exceptions -fno-rtti -MD -MT tools/clang/tools/extra/clangd/CMakeFiles/obj.clangDaemon.dir/TUScheduler.cpp.o -MF tools/clang/tools/extra/clangd/CMakeFiles/obj.clangDaemon.dir/TUScheduler.cpp.o.d -o tools/clang/tools/extra/clangd/CMakeFiles/obj.clangDaemon.dir/TUScheduler.cpp.o -c /Users/buildslave/jenkins/workspace/clang-stage2-coverage-R/llvm/tools/clang/tools/extra/clangd/TUScheduler.cpp [2776/4599] /Users/buildslave/jenkins/workspace/clang-stage2-coverage-R/host-compiler/bin/clang++ -DGTEST_HAS_RTTI=0 -D_GNU_SOURCE -D__STDC_CONSTANT_MACROS -D__STDC_FORMAT_MACROS -D__STDC_LIMIT_MACROS -Itools/clang/tools/extra/clangd -I/Users/buildslave/jenkins/workspace/clang-stage2-coverage-R/llvm/tools/clang/tools/extra/clangd -I/Users/buildslave/jenkins/workspace/clang-stage2-coverage-R/llvm/tools/clang/include -Itools/clang/include -I/Applications/Xcode.app/Contents/Developer/Platforms/MacOSX.platform/Developer/SDKs/MacOSX10.14.sdk/usr/include/libxml2 -Iinclude -I/Users/buildslave/jenkins/workspace/clang-stage2-coverage-R/llvm/include -fPIC -fvisibility-inlines-hidden -Werror=date-time -Werror=unguarded-availability-new -std=c++11 -fmodules -fmodules-cache-path=/Users/buildslave/jenkins/workspace/clang-stage2-coverage-R/clang-build/module.cache -fcxx-modules -Wall -Wextra -Wno-unused-parameter -Wwrite-strings -Wcast-qual -Wmissing-field-initializers -pedantic -Wno-long-long -Wimplicit-fallthrough -Wcovered-switch-default -Wno-noexcept-type -Wnon-virtual-dtor -Wdelete-non-virtual-dtor -Wstring-conversion -fdiagnostics-color -fprofile-instr-generate='/Users/buildslave/jenkins/workspace/clang-stage2-coverage-R/clang-build/profiles/%6m.profraw' -fcoverage-mapping -fno-common -Woverloaded-virtual -Wno-nested-anon-types -O3 -DNDEBUG -isysroot /Applications/Xcode.app/Contents/Developer/Platforms/MacOSX.platform/Developer/SDKs/MacOSX10.14.sdk -fno-exceptions -fno-rtti -MD -MT tools/clang/tools/extra/clangd/CMakeFiles/obj.clangDaemon.dir/Headers.cpp.o -MF tools/clang/tools/extra/clangd/CMakeFiles/obj.clangDaemon.dir/Headers.cpp.o.d -o tools/clang/tools/extra/clangd/CMakeFiles/obj.clangDaemon.dir/Headers.cpp.o -c /Users/buildslave/jenkins/workspace/clang-stage2-coverage-R/llvm/tools/clang/tools/extra/clangd/Headers.cpp FAILED: tools/clang/tools/extra/clangd/CMakeFiles/obj.clangDaemon.dir/Headers.cpp.o /Users/buildslave/jenkins/workspace/clang-stage2-coverage-R/host-compiler/bin/clang++ -DGTEST_HAS_RTTI=0 -D_GNU_SOURCE -D__STDC_CONSTANT_MACROS -D__STDC_FORMAT_MACROS -D__STDC_LIMIT_MACROS -Itools/clang/tools/extra/clangd -I/Users/buildslave/jenkins/workspace/clang-stage2-coverage-R/llvm/tools/clang/tools/extra/clangd -I/Users/buildslave/jenkins/workspace/clang-stage2-coverage-R/llvm/tools/clang/include -Itools/clang/include -I/Applications/Xcode.app/Contents/Developer/Platforms/MacOSX.platform/Developer/SDKs/MacOSX10.14.sdk/usr/include/libxml2 -Iinclude -I/Users/buildslave/jenkins/workspace/clang-stage2-coverage-R/llvm/include -fPIC -fvisibility-inlines-hidden -Werror=date-time -Werror=unguarded-availability-new -std=c++11 -fmodules -fmodules-cache-path=/Users/buildslave/jenkins/workspace/clang-stage2-coverage-R/clang-build/module.cache -fcxx-modules -Wall -Wextra -Wno-unused-parameter -Wwrite-strings -Wcast-qual -Wmissing-field-initializers -pedantic -Wno-long-long -Wimplicit-fallthrough -Wcovered-switch-default -Wno-noexcept-type -Wnon-virtual-dtor -Wdelete-non-virtual-dtor -Wstring-conversion -fdiagnostics-color -fprofile-instr-generate='/Users/buildslave/jenkins/workspace/clang-stage2-coverage-R/clang-build/profiles/%6m.profraw' -fcoverage-mapping -fno-common -Woverloaded-virtual -Wno-nested-anon-types -O3 -DNDEBUG -isysroot /Applications/Xcode.app/Contents/Developer/Platforms/MacOSX.platform/Developer/SDKs/MacOSX10.14.sdk -fno-exceptions -fno-rtti -MD -MT tools/clang/tools/extra/clangd/CMakeFiles/obj.clangDaemon.dir/Headers.cpp.o -MF tools/clang/tools/extra/clangd/CMakeFiles/obj.clangDaemon.dir/Headers.cpp.o.d -o tools/clang/tools/extra/clangd/CMakeFiles/obj.clangDaemon.dir/Headers.cpp.o -c /Users/buildslave/jenkins/workspace/clang-stage2-coverage-R/llvm/tools/clang/tools/extra/clangd/Headers.cpp Assertion failed: (CachedFieldIndex && "failed to find field in parent"), function getFieldIndex, file /Users/buildslave/jenkins/workspace/clang-stage1-configure-RA/llvm/tools/clang/lib/AST/Decl.cpp, line 3965. Stack dump: 0. Program arguments: /Users/buildslave/jenkins/workspace/clang-stage2-coverage-R/host-compiler/bin/clang-9 -cc1 -triple x86_64-apple-macosx10.14.0 -Wdeprecated-objc-isa-usage -Werror=deprecated-objc-isa-usage -emit-obj -disable-free -main-file-name Headers.cpp -mrelocation-model pic -pic-level 2 -mthread-model posix -mdisable-fp-elim -masm-verbose -munwind-tables -target-sdk-version=10.14 -target-cpu penryn -dwarf-column-info -debugger-tuning=lldb -ggnu-pubnames -target-linker-version 409.12 -fprofile-instrument-path=/Users/buildslave/jenkins/workspace/clang-stage2-coverage-R/clang-build/profiles/%6m.profraw -fprofile-instrument=clang -fcoverage-mapping -coverage-notes-file /Users/buildslave/jenkins/workspace/clang-stage2-coverage-R/clang-build/tools/clang/tools/extra/clangd/CMakeFiles/obj.clangDaemon.dir/Headers.cpp.gcno -resource-dir /Users/buildslave/jenkins/workspace/clang-stage2-coverage-R/host-compiler/lib/clang/9.0.0 -dependency-file tools/clang/tools/extra/clangd/CMakeFiles/obj.clangDaemon.dir/Headers.cpp.o.d -sys-header-deps -MT tools/clang/tools/extra/clangd/CMakeFiles/obj.clangDaemon.dir/Headers.cpp.o -isysroot /Applications/Xcode.app/Contents/Developer/Platforms/MacOSX.platform/Developer/SDKs/MacOSX10.14.sdk -D GTEST_HAS_RTTI=0 -D _GNU_SOURCE -D __STDC_CONSTANT_MACROS -D __STDC_FORMAT_MACROS -D __STDC_LIMIT_MACROS -I tools/clang/tools/extra/clangd -I /Users/buildslave/jenkins/workspace/clang-stage2-coverage-R/llvm/tools/clang/tools/extra/clangd -I /Users/buildslave/jenkins/workspace/clang-stage2-coverage-R/llvm/tools/clang/include -I tools/clang/include -I /Applications/Xcode.app/Contents/Developer/Platforms/MacOSX.platform/Developer/SDKs/MacOSX10.14.sdk/usr/include/libxml2 -I include -I /Users/buildslave/jenkins/workspace/clang-stage2-coverage-R/llvm/include -D NDEBUG -stdlib=libc++ -internal-isystem /Users/buildslave/jenkins/workspace/clang-stage2-coverage-R/host-compiler/bin/../include/c++/v1 -internal-isystem /Applications/Xcode.app/Contents/Developer/Platforms/MacOSX.platform/Developer/SDKs/MacOSX10.14.sdk/usr/include/c++/v1 -internal-isystem /Applications/Xcode.app/Contents/Developer/Platforms/MacOSX.platform/Developer/SDKs/MacOSX10.14.sdk/usr/local/include -internal-isystem /Users/buildslave/jenkins/workspace/clang-stage2-coverage-R/host-compiler/lib/clang/9.0.0/include -internal-externc-isystem /Applications/Xcode.app/Contents/Developer/Platforms/MacOSX.platform/Developer/SDKs/MacOSX10.14.sdk/usr/include -O3 -Werror=date-time -Werror=unguarded-availability-new -Wall -Wextra -Wno-unused-parameter -Wwrite-strings -Wcast-qual -Wmissing-field-initializers -Wno-long-long -Wimplicit-fallthrough -Wcovered-switch-default -Wno-noexcept-type -Wnon-virtual-dtor -Wdelete-non-virtual-dtor -Wstring-conversion -Woverloaded-virtual -Wno-nested-anon-types -pedantic -std=c++11 -fdeprecated-macro -fdebug-compilation-dir /Users/buildslave/jenkins/workspace/clang-stage2-coverage-R/clang-build -ferror-limit 19 -fmessage-length 0 -fvisibility-inlines-hidden -stack-protector 1 -fblocks -fencode-extended-block-signature -fno-rtti -fregister-global-dtors-with-atexit -fmodules -fimplicit-module-maps -fmodules-cache-path=/Users/buildslave/jenkins/workspace/clang-stage2-coverage-R/clang-build/module.cache -fmodules-validate-system-headers -fobjc-runtime=macosx-10.14.0 -fmax-type-align=16 -fno-common -fdiagnostics-show-option -fcolor-diagnostics -vectorize-loops -vectorize-slp -o tools/clang/tools/extra/clangd/CMakeFiles/obj.clangDaemon.dir/Headers.cpp.o -x c++ /Users/buildslave/jenkins/workspace/clang-stage2-coverage-R/llvm/tools/clang/tools/extra/clangd/Headers.cpp 1. <eof> parser at end of file 2. Per-file LLVM IR generation 3. /Users/buildslave/jenkins/workspace/clang-stage2-coverage-R/llvm/include/llvm/Support/Error.h:625:17: Generating code for declaration 'llvm::Expected<std::__1::basic_string<char> >::getStorage' 0 clang-9 0x00000001096ea398 llvm::sys::PrintStackTrace(llvm::raw_ostream&) + 40 1 clang-9 0x00000001096e9545 llvm::sys::RunSignalHandlers() + 85 2 clang-9 0x00000001096ea9a8 SignalHandler(int) + 264 3 libsystem_platform.dylib 0x00007fff7de97b3d _sigtramp + 29 4 clang-9 0x000000010964bbb6 llvm::FoldingSetBase::FindNodeOrInsertPos(llvm::FoldingSetNodeID const&, void*&) + 182 5 libsystem_c.dylib 0x00007fff7dd561c9 abort + 127 6 libsystem_c.dylib 0x00007fff7dd1e868 basename_r + 0 7 clang-9 0x000000010b468986 clang::FieldDecl::getFieldIndex() const + 694 8 clang-9 0x00000001099ddb15 clang::CodeGen::CodeGenFunction::EmitLValueForField(clang::CodeGen::LValue, clang::FieldDecl const*) + 1413 9 clang-9 0x00000001099e883f clang::CodeGen::CodeGenFunction::EmitMemberExpr(clang::MemberExpr const*) + 1247 10 clang-9 0x00000001099da4aa clang::CodeGen::CodeGenFunction::EmitLValue(clang::Expr const*) + 1018 11 clang-9 0x00000001099e299d clang::CodeGen::CodeGenFunction::EmitCheckedLValue(clang::Expr const*, clang::CodeGen::CodeGenFunction::TypeCheckKind) + 173 12 clang-9 0x00000001099e8496 clang::CodeGen::CodeGenFunction::EmitMemberExpr(clang::MemberExpr const*) + 310 13 clang-9 0x00000001099da4aa clang::CodeGen::CodeGenFunction::EmitLValue(clang::Expr const*) + 1018 14 clang-9 0x00000001099e9a5c clang::CodeGen::CodeGenFunction::EmitCastLValue(clang::CastExpr const*) + 1372 15 clang-9 0x00000001099da12f clang::CodeGen::CodeGenFunction::EmitLValue(clang::Expr const*) + 127 16 clang-9 0x00000001099e299d clang::CodeGen::CodeGenFunction::EmitCheckedLValue(clang::Expr const*, clang::CodeGen::CodeGenFunction::TypeCheckKind) + 173 17 clang-9 0x00000001099e8496 clang::CodeGen::CodeGenFunction::EmitMemberExpr(clang::MemberExpr const*) + 310 18 clang-9 0x00000001099da4aa clang::CodeGen::CodeGenFunction::EmitLValue(clang::Expr const*) + 1018 19 clang-9 0x00000001099e22a7 clang::CodeGen::CodeGenFunction::EmitArrayToPointerDecay(clang::Expr const*, clang::CodeGen::LValueBaseInfo*, clang::CodeGen::TBAAAccessInfo*) + 119 20 clang-9 0x0000000109a32ef8 (anonymous namespace)::ScalarExprEmitter::VisitCastExpr(clang::CastExpr*) + 3896 21 clang-9 0x0000000109a32064 (anonymous namespace)::ScalarExprEmitter::VisitCastExpr(clang::CastExpr*) + 164 22 clang-9 0x0000000109a200e8 clang::CodeGen::CodeGenFunction::EmitScalarExpr(clang::Expr const*, bool) + 104 23 clang-9 0x0000000109b14ac6 clang::CodeGen::CodeGenFunction::EmitReturnStmt(clang::ReturnStmt const&) + 1430 24 clang-9 0x0000000109b11cd2 clang::CodeGen::CodeGenFunction::EmitStmt(clang::Stmt const*, llvm::ArrayRef<clang::Attr const*>) + 2482 25 clang-9 0x0000000109b1a04f clang::CodeGen::CodeGenFunction::EmitCompoundStmtWithoutScope(clang::CompoundStmt const&, bool, clang::CodeGen::AggValueSlot) + 95 26 clang-9 0x0000000109b59d47 clang::CodeGen::CodeGenFunction::GenerateCode(clang::GlobalDecl, llvm::Function*, clang::CodeGen::CGFunctionInfo const&) + 791 27 clang-9 0x0000000109b74ae7 clang::CodeGen::CodeGenModule::EmitGlobalFunctionDefinition(clang::GlobalDecl, llvm::GlobalValue*) + 503 28 clang-9 0x0000000109b6ea06 clang::CodeGen::CodeGenModule::EmitGlobalDefinition(clang::GlobalDecl, llvm::GlobalValue*) + 486 29 clang-9 0x0000000109b649f1 clang::CodeGen::CodeGenModule::EmitDeferred() + 289 30 clang-9 0x0000000109b64a19 clang::CodeGen::CodeGenModule::EmitDeferred() + 329 31 clang-9 0x0000000109b64a19 clang::CodeGen::CodeGenModule::EmitDeferred() + 329 32 clang-9 0x0000000109b63cea clang::CodeGen::CodeGenModule::Release() + 42 33 clang-9 0x0000000109bebac4 (anonymous namespace)::CodeGeneratorImpl::HandleTranslationUnit(clang::ASTContext&) + 100 34 clang-9 0x0000000109b50776 clang::BackendConsumer::HandleTranslationUnit(clang::ASTContext&) + 134 35 clang-9 0x000000010aa4adb3 clang::ParseAST(clang::Sema&, bool, bool) + 611 36 clang-9 0x0000000109dd0324 clang::FrontendAction::Execute() + 84 37 clang-9 0x0000000109d81cc8 clang::CompilerInstance::ExecuteAction(clang::FrontendAction&) + 1544 38 clang-9 0x0000000109e48a20 clang::ExecuteCompilerInvocation(clang::CompilerInstance*) + 1808 39 clang-9 0x0000000107aef454 cc1_main(llvm::ArrayRef<char const*>, char const*, void*) + 2356 40 clang-9 0x0000000107aecad3 main + 10851 41 libdyld.dylib 0x00007fff7dcae085 start + 1 42 libdyld.dylib 0x0000000000000080 start + 18446603338405715964 clang-9: error: unable to execute command: Abort trap: 6 clang-9: error: clang frontend command failed due to signal (use -v to see invocation) clang version 9.0.0 (trunk) Target: x86_64-apple-darwin18.0.0 Thread model: posix InstalledDir: /Users/buildslave/jenkins/workspace/clang-stage2-coverage-R/host-compiler/bin clang-9: note: diagnostic msg: PLEASE submit a bug report to https://bugs.llvm.org/ and include the crash backtrace, preprocessed source, and associated run script. clang-9: note: diagnostic msg: ********************

Hide Details

PLEASE ATTACH THE FOLLOWING FILES TO THE BUG REPORT: Preprocessed source(s) and associated run script(s) are located at: clang-9: note: diagnostic msg: /var/folders/09/r4vw4v8n5kb67jl66zvlbljw0000gn/T/Headers-8aa9d6.cpp clang-9: note: diagnostic msg: /var/folders/09/r4vw4v8n5kb67jl66zvlbljw0000gn/T/Headers-8aa9d6.cache clang-9: note: diagnostic msg: /var/folders/09/r4vw4v8n5kb67jl66zvlbljw0000gn/T/Headers-8aa9d6.sh clang-9: note: diagnostic msg: Crash backtrace is located in clang-9: note: diagnostic msg: /Users/buildslave/Library/Logs/DiagnosticReports/clang-9_<YYYY-MM-DD-HHMMSS>_<hostname>.crash clang-9: note: diagnostic msg: (choose the .crash file that corresponds to your crash) clang-9: note: diagnostic msg:

Hide Details

******************** [2777/4599] /Users/buildslave/jenkins/workspace/clang-stage2-coverage-R/host-compiler/bin/clang++ -DGTEST_HAS_RTTI=0 -D_GNU_SOURCE -D__STDC_CONSTANT_MACROS -D__STDC_FORMAT_MACROS -D__STDC_LIMIT_MACROS -Itools/clang/tools/extra/clangd -I/Users/buildslave/jenkins/workspace/clang-stage2-coverage-R/llvm/tools/clang/tools/extra/clangd -I/Users/buildslave/jenkins/workspace/clang-stage2-coverage-R/llvm/tools/clang/include -Itools/clang/include -I/Applications/Xcode.app/Contents/Developer/Platforms/MacOSX.platform/Developer/SDKs/MacOSX10.14.sdk/usr/include/libxml2 -Iinclude -I/Users/buildslave/jenkins/workspace/clang-stage2-coverage-R/llvm/include -fPIC -fvisibility-inlines-hidden -Werror=date-time -Werror=unguarded-availability-new -std=c++11 -fmodules -fmodules-cache-path=/Users/buildslave/jenkins/workspace/clang-stage2-coverage-R/clang-build/module.cache -fcxx-modules -Wall -Wextra -Wno-unused-parameter -Wwrite-strings -Wcast-qual -Wmissing-field-initializers -pedantic -Wno-long-long -Wimplicit-fallthrough -Wcovered-switch-default -Wno-noexcept-type -Wnon-virtual-dtor -Wdelete-non-virtual-dtor -Wstring-conversion -fdiagnostics-color -fprofile-instr-generate='/Users/buildslave/jenkins/workspace/clang-stage2-coverage-R/clang-build/profiles/%6m.profraw' -fcoverage-mapping -fno-common -Woverloaded-virtual -Wno-nested-anon-types -O3 -DNDEBUG -isysroot /Applications/Xcode.app/Contents/Developer/Platforms/MacOSX.platform/Developer/SDKs/MacOSX10.14.sdk -fno-exceptions -fno-rtti -MD -MT tools/clang/tools/extra/clangd/CMakeFiles/obj.clangDaemon.dir/index/BackgroundIndexStorage.cpp.o -MF tools/clang/tools/extra/clangd/CMakeFiles/obj.clangDaemon.dir/index/BackgroundIndexStorage.cpp.o.d -o tools/clang/tools/extra/clangd/CMakeFiles/obj.clangDaemon.dir/index/BackgroundIndexStorage.cpp.o -c /Users/buildslave/jenkins/workspace/clang-stage2-coverage-R/llvm/tools/clang/tools/extra/clangd/index/BackgroundIndexStorage.cpp [2778/4599] /Users/buildslave/jenkins/workspace/clang-stage2-coverage-R/host-compiler/bin/clang++ -DGTEST_HAS_RTTI=0 -D_GNU_SOURCE -D__STDC_CONSTANT_MACROS -D__STDC_FORMAT_MACROS -D__STDC_LIMIT_MACROS -Itools/clang/tools/extra/clangd -I/Users/buildslave/jenkins/workspace/clang-stage2-coverage-R/llvm/tools/clang/tools/extra/clangd -I/Users/buildslave/jenkins/workspace/clang-stage2-coverage-R/llvm/tools/clang/include -Itools/clang/include -I/Applications/Xcode.app/Contents/Developer/Platforms/MacOSX.platform/Developer/SDKs/MacOSX10.14.sdk/usr/include/libxml2 -Iinclude -I/Users/buildslave/jenkins/workspace/clang-stage2-coverage-R/llvm/include -fPIC -fvisibility-inlines-hidden -Werror=date-time -Werror=unguarded-availability-new -std=c++11 -fmodules -fmodules-cache-path=/Users/buildslave/jenkins/workspace/clang-stage2-coverage-R/clang-build/module.cache -fcxx-modules -Wall -Wextra -Wno-unused-parameter -Wwrite-strings -Wcast-qual -Wmissing-field-initializers -pedantic -Wno-long-long -Wimplicit-fallthrough -Wcovered-switch-default -Wno-noexcept-type -Wnon-virtual-dtor -Wdelete-non-virtual-dtor -Wstring-conversion -fdiagnostics-color -fprofile-instr-generate='/Users/buildslave/jenkins/workspace/clang-stage2-coverage-R/clang-build/profiles/%6m.profraw' -fcoverage-mapping -fno-common -Woverloaded-virtual -Wno-nested-anon-types -O3 -DNDEBUG -isysroot /Applications/Xcode.app/Contents/Developer/Platforms/MacOSX.platform/Developer/SDKs/MacOSX10.14.sdk -fno-exceptions -fno-rtti -MD -MT tools/clang/tools/extra/clangd/CMakeFiles/obj.clangDaemon.dir/XRefs.cpp.o -MF tools/clang/tools/extra/clangd/CMakeFiles/obj.clangDaemon.dir/XRefs.cpp.o.d -o tools/clang/tools/extra/clangd/CMakeFiles/obj.clangDaemon.dir/XRefs.cpp.o -c /Users/buildslave/jenkins/workspace/clang-stage2-coverage-R/llvm/tools/clang/tools/extra/clangd/XRefs.cpp [2779/4599] /Users/buildslave/jenkins/workspace/clang-stage2-coverage-R/host-compiler/bin/clang++ -DGTEST_HAS_RTTI=0 -D_GNU_SOURCE -D__STDC_CONSTANT_MACROS -D__STDC_FORMAT_MACROS -D__STDC_LIMIT_MACROS -Itools/clang/tools/extra/clangd -I/Users/buildslave/jenkins/workspace/clang-stage2-coverage-R/llvm/tools/clang/tools/extra/clangd -I/Users/buildslave/jenkins/workspace/clang-stage2-coverage-R/llvm/tools/clang/include -Itools/clang/include -I/Applications/Xcode.app/Contents/Developer/Platforms/MacOSX.platform/Developer/SDKs/MacOSX10.14.sdk/usr/include/libxml2 -Iinclude -I/Users/buildslave/jenkins/workspace/clang-stage2-coverage-R/llvm/include -fPIC -fvisibility-inlines-hidden -Werror=date-time -Werror=unguarded-availability-new -std=c++11 -fmodules -fmodules-cache-path=/Users/buildslave/jenkins/workspace/clang-stage2-coverage-R/clang-build/module.cache -fcxx-modules -Wall -Wextra -Wno-unused-parameter -Wwrite-strings -Wcast-qual -Wmissing-field-initializers -pedantic -Wno-long-long -Wimplicit-fallthrough -Wcovered-switch-default -Wno-noexcept-type -Wnon-virtual-dtor -Wdelete-non-virtual-dtor -Wstring-conversion -fdiagnostics-color -fprofile-instr-generate='/Users/buildslave/jenkins/workspace/clang-stage2-coverage-R/clang-build/profiles/%6m.profraw' -fcoverage-mapping -fno-common -Woverloaded-virtual -Wno-nested-anon-types -O3 -DNDEBUG -isysroot /Applications/Xcode.app/Contents/Developer/Platforms/MacOSX.platform/Developer/SDKs/MacOSX10.14.sdk -fno-exceptions -fno-rtti -MD -MT tools/clang/tools/extra/clangd/CMakeFiles/obj.clangDaemon.dir/index/Background.cpp.o -MF tools/clang/tools/extra/clangd/CMakeFiles/obj.clangDaemon.dir/index/Background.cpp.o.d -o tools/clang/tools/extra/clangd/CMakeFiles/obj.clangDaemon.dir/index/Background.cpp.o -c /Users/buildslave/jenkins/workspace/clang-stage2-coverage-R/llvm/tools/clang/tools/extra/clangd/index/Background.cpp FAILED: tools/clang/tools/extra/clangd/CMakeFiles/obj.clangDaemon.dir/index/Background.cpp.o /Users/buildslave/jenkins/workspace/clang-stage2-coverage-R/host-compiler/bin/clang++ -DGTEST_HAS_RTTI=0 -D_GNU_SOURCE -D__STDC_CONSTANT_MACROS -D__STDC_FORMAT_MACROS -D__STDC_LIMIT_MACROS -Itools/clang/tools/extra/clangd -I/Users/buildslave/jenkins/workspace/clang-stage2-coverage-R/llvm/tools/clang/tools/extra/clangd -I/Users/buildslave/jenkins/workspace/clang-stage2-coverage-R/llvm/tools/clang/include -Itools/clang/include -I/Applications/Xcode.app/Contents/Developer/Platforms/MacOSX.platform/Developer/SDKs/MacOSX10.14.sdk/usr/include/libxml2 -Iinclude -I/Users/buildslave/jenkins/workspace/clang-stage2-coverage-R/llvm/include -fPIC -fvisibility-inlines-hidden -Werror=date-time -Werror=unguarded-availability-new -std=c++11 -fmodules -fmodules-cache-path=/Users/buildslave/jenkins/workspace/clang-stage2-coverage-R/clang-build/module.cache -fcxx-modules -Wall -Wextra -Wno-unused-parameter -Wwrite-strings -Wcast-qual -Wmissing-field-initializers -pedantic -Wno-long-long -Wimplicit-fallthrough -Wcovered-switch-default -Wno-noexcept-type -Wnon-virtual-dtor -Wdelete-non-virtual-dtor -Wstring-conversion -fdiagnostics-color -fprofile-instr-generate='/Users/buildslave/jenkins/workspace/clang-stage2-coverage-R/clang-build/profiles/%6m.profraw' -fcoverage-mapping -fno-common -Woverloaded-virtual -Wno-nested-anon-types -O3 -DNDEBUG -isysroot /Applications/Xcode.app/Contents/Developer/Platforms/MacOSX.platform/Developer/SDKs/MacOSX10.14.sdk -fno-exceptions -fno-rtti -MD -MT tools/clang/tools/extra/clangd/CMakeFiles/obj.clangDaemon.dir/index/Background.cpp.o -MF tools/clang/tools/extra/clangd/CMakeFiles/obj.clangDaemon.dir/index/Background.cpp.o.d -o tools/clang/tools/extra/clangd/CMakeFiles/obj.clangDaemon.dir/index/Background.cpp.o -c /Users/buildslave/jenkins/workspace/clang-stage2-coverage-R/llvm/tools/clang/tools/extra/clangd/index/Background.cpp Assertion failed: (CachedFieldIndex && "failed to find field in parent"), function getFieldIndex, file /Users/buildslave/jenkins/workspace/clang-stage1-configure-RA/llvm/tools/clang/lib/AST/Decl.cpp, line 3965. Stack dump: 0. Program arguments: /Users/buildslave/jenkins/workspace/clang-stage2-coverage-R/host-compiler/bin/clang-9 -cc1 -triple x86_64-apple-macosx10.14.0 -Wdeprecated-objc-isa-usage -Werror=deprecated-objc-isa-usage -emit-obj -disable-free -main-file-name Background.cpp -mrelocation-model pic -pic-level 2 -mthread-model posix -mdisable-fp-elim -masm-verbose -munwind-tables -target-sdk-version=10.14 -target-cpu penryn -dwarf-column-info -debugger-tuning=lldb -ggnu-pubnames -target-linker-version 409.12 -fprofile-instrument-path=/Users/buildslave/jenkins/workspace/clang-stage2-coverage-R/clang-build/profiles/%6m.profraw -fprofile-instrument=clang -fcoverage-mapping -coverage-notes-file /Users/buildslave/jenkins/workspace/clang-stage2-coverage-R/clang-build/tools/clang/tools/extra/clangd/CMakeFiles/obj.clangDaemon.dir/index/Background.cpp.gcno -resource-dir /Users/buildslave/jenkins/workspace/clang-stage2-coverage-R/host-compiler/lib/clang/9.0.0 -dependency-file tools/clang/tools/extra/clangd/CMakeFiles/obj.clangDaemon.dir/index/Background.cpp.o.d -sys-header-deps -MT tools/clang/tools/extra/clangd/CMakeFiles/obj.clangDaemon.dir/index/Background.cpp.o -isysroot /Applications/Xcode.app/Contents/Developer/Platforms/MacOSX.platform/Developer/SDKs/MacOSX10.14.sdk -D GTEST_HAS_RTTI=0 -D _GNU_SOURCE -D __STDC_CONSTANT_MACROS -D __STDC_FORMAT_MACROS -D __STDC_LIMIT_MACROS -I tools/clang/tools/extra/clangd -I /Users/buildslave/jenkins/workspace/clang-stage2-coverage-R/llvm/tools/clang/tools/extra/clangd -I /Users/buildslave/jenkins/workspace/clang-stage2-coverage-R/llvm/tools/clang/include -I tools/clang/include -I /Applications/Xcode.app/Contents/Developer/Platforms/MacOSX.platform/Developer/SDKs/MacOSX10.14.sdk/usr/include/libxml2 -I include -I /Users/buildslave/jenkins/workspace/clang-stage2-coverage-R/llvm/include -D NDEBUG -stdlib=libc++ -internal-isystem /Users/buildslave/jenkins/workspace/clang-stage2-coverage-R/host-compiler/bin/../include/c++/v1 -internal-isystem /Applications/Xcode.app/Contents/Developer/Platforms/MacOSX.platform/Developer/SDKs/MacOSX10.14.sdk/usr/include/c++/v1 -internal-isystem /Applications/Xcode.app/Contents/Developer/Platforms/MacOSX.platform/Developer/SDKs/MacOSX10.14.sdk/usr/local/include -internal-isystem /Users/buildslave/jenkins/workspace/clang-stage2-coverage-R/host-compiler/lib/clang/9.0.0/include -internal-externc-isystem /Applications/Xcode.app/Contents/Developer/Platforms/MacOSX.platform/Developer/SDKs/MacOSX10.14.sdk/usr/include -O3 -Werror=date-time -Werror=unguarded-availability-new -Wall -Wextra -Wno-unused-parameter -Wwrite-strings -Wcast-qual -Wmissing-field-initializers -Wno-long-long -Wimplicit-fallthrough -Wcovered-switch-default -Wno-noexcept-type -Wnon-virtual-dtor -Wdelete-non-virtual-dtor -Wstring-conversion -Woverloaded-virtual -Wno-nested-anon-types -pedantic -std=c++11 -fdeprecated-macro -fdebug-compilation-dir /Users/buildslave/jenkins/workspace/clang-stage2-coverage-R/clang-build -ferror-limit 19 -fmessage-length 0 -fvisibility-inlines-hidden -stack-protector 1 -fblocks -fencode-extended-block-signature -fno-rtti -fregister-global-dtors-with-atexit -fmodules -fimplicit-module-maps -fmodules-cache-path=/Users/buildslave/jenkins/workspace/clang-stage2-coverage-R/clang-build/module.cache -fmodules-validate-system-headers -fobjc-runtime=macosx-10.14.0 -fmax-type-align=16 -fno-common -fdiagnostics-show-option -fcolor-diagnostics -vectorize-loops -vectorize-slp -o tools/clang/tools/extra/clangd/CMakeFiles/obj.clangDaemon.dir/index/Background.cpp.o -x c++ /Users/buildslave/jenkins/workspace/clang-stage2-coverage-R/llvm/tools/clang/tools/extra/clangd/index/Background.cpp 1. <eof> parser at end of file 2. Per-file LLVM IR generation 3. /Users/buildslave/jenkins/workspace/clang-stage2-coverage-R/llvm/include/llvm/Support/Error.h:635:15: Generating code for declaration 'llvm::Expected<std::__1::basic_string<char> >::getErrorStorage' 0 clang-9 0x0000000109fff398 llvm::sys::PrintStackTrace(llvm::raw_ostream&) + 40 1 clang-9 0x0000000109ffe545 llvm::sys::RunSignalHandlers() + 85 2 clang-9 0x0000000109fff9a8 SignalHandler(int) + 264 3 libsystem_platform.dylib 0x00007fff7de97b3d _sigtramp + 29 4 libsystem_platform.dylib 0x0000000000000040 _sigtramp + 18446603338403710240 5 libsystem_c.dylib 0x00007fff7dd561c9 abort + 127 6 libsystem_c.dylib 0x00007fff7dd1e868 basename_r + 0 7 clang-9 0x000000010bd7d986 clang::FieldDecl::getFieldIndex() const + 694 8 clang-9 0x000000010a2f2b15 clang::CodeGen::CodeGenFunction::EmitLValueForField(clang::CodeGen::LValue, clang::FieldDecl const*) + 1413 9 clang-9 0x000000010a2fd83f clang::CodeGen::CodeGenFunction::EmitMemberExpr(clang::MemberExpr const*) + 1247 10 clang-9 0x000000010a2ef4aa clang::CodeGen::CodeGenFunction::EmitLValue(clang::Expr const*) + 1018 11 clang-9 0x000000010a2f799d clang::CodeGen::CodeGenFunction::EmitCheckedLValue(clang::Expr const*, clang::CodeGen::CodeGenFunction::TypeCheckKind) + 173 12 clang-9 0x000000010a2fd496 clang::CodeGen::CodeGenFunction::EmitMemberExpr(clang::MemberExpr const*) + 310 13 clang-9 0x000000010a2ef4aa clang::CodeGen::CodeGenFunction::EmitLValue(clang::Expr const*) + 1018 14 clang-9 0x000000010a2fea5c clang::CodeGen::CodeGenFunction::EmitCastLValue(clang::CastExpr const*) + 1372 15 clang-9 0x000000010a2ef12f clang::CodeGen::CodeGenFunction::EmitLValue(clang::Expr const*) + 127 16 clang-9 0x000000010a2f799d clang::CodeGen::CodeGenFunction::EmitCheckedLValue(clang::Expr const*, clang::CodeGen::CodeGenFunction::TypeCheckKind) + 173 17 clang-9 0x000000010a2fd496 clang::CodeGen::CodeGenFunction::EmitMemberExpr(clang::MemberExpr const*) + 310 18 clang-9 0x000000010a2ef4aa clang::CodeGen::CodeGenFunction::EmitLValue(clang::Expr const*) + 1018 19 clang-9 0x000000010a2f72a7 clang::CodeGen::CodeGenFunction::EmitArrayToPointerDecay(clang::Expr const*, clang::CodeGen::LValueBaseInfo*, clang::CodeGen::TBAAAccessInfo*) + 119 20 clang-9 0x000000010a347ef8 (anonymous namespace)::ScalarExprEmitter::VisitCastExpr(clang::CastExpr*) + 3896 21 clang-9 0x000000010a347064 (anonymous namespace)::ScalarExprEmitter::VisitCastExpr(clang::CastExpr*) + 164 22 clang-9 0x000000010a3350e8 clang::CodeGen::CodeGenFunction::EmitScalarExpr(clang::Expr const*, bool) + 104 23 clang-9 0x000000010a429ac6 clang::CodeGen::CodeGenFunction::EmitReturnStmt(clang::ReturnStmt const&) + 1430 24 clang-9 0x000000010a426cd2 clang::CodeGen::CodeGenFunction::EmitStmt(clang::Stmt const*, llvm::ArrayRef<clang::Attr const*>) + 2482 25 clang-9 0x000000010a42f04f clang::CodeGen::CodeGenFunction::EmitCompoundStmtWithoutScope(clang::CompoundStmt const&, bool, clang::CodeGen::AggValueSlot) + 95 26 clang-9 0x000000010a46ed47 clang::CodeGen::CodeGenFunction::GenerateCode(clang::GlobalDecl, llvm::Function*, clang::CodeGen::CGFunctionInfo const&) + 791 27 clang-9 0x000000010a489ae7 clang::CodeGen::CodeGenModule::EmitGlobalFunctionDefinition(clang::GlobalDecl, llvm::GlobalValue*) + 503 28 clang-9 0x000000010a483a06 clang::CodeGen::CodeGenModule::EmitGlobalDefinition(clang::GlobalDecl, llvm::GlobalValue*) + 486 29 clang-9 0x000000010a4799f1 clang::CodeGen::CodeGenModule::EmitDeferred() + 289 30 clang-9 0x000000010a479a19 clang::CodeGen::CodeGenModule::EmitDeferred() + 329 31 clang-9 0x000000010a479a19 clang::CodeGen::CodeGenModule::EmitDeferred() + 329 32 clang-9 0x000000010a478cea clang::CodeGen::CodeGenModule::Release() + 42 33 clang-9 0x000000010a500ac4 (anonymous namespace)::CodeGeneratorImpl::HandleTranslationUnit(clang::ASTContext&) + 100 34 clang-9 0x000000010a465776 clang::BackendConsumer::HandleTranslationUnit(clang::ASTContext&) + 134 35 clang-9 0x000000010b35fdb3 clang::ParseAST(clang::Sema&, bool, bool) + 611 36 clang-9 0x000000010a6e5324 clang::FrontendAction::Execute() + 84 37 clang-9 0x000000010a696cc8 clang::CompilerInstance::ExecuteAction(clang::FrontendAction&) + 1544 38 clang-9 0x000000010a75da20 clang::ExecuteCompilerInvocation(clang::CompilerInstance*) + 1808 39 clang-9 0x0000000108404454 cc1_main(llvm::ArrayRef<char const*>, char const*, void*) + 2356 40 clang-9 0x0000000108401ad3 main + 10851 41 libdyld.dylib 0x00007fff7dcae085 start + 1 42 libdyld.dylib 0x0000000000000080 start + 18446603338405715964 clang-9: error: unable to execute command: Abort trap: 6 clang-9: error: clang frontend command failed due to signal (use -v to see invocation) clang version 9.0.0 (trunk) Target: x86_64-apple-darwin18.0.0 Thread model: posix InstalledDir: /Users/buildslave/jenkins/workspace/clang-stage2-coverage-R/host-compiler/bin clang-9: note: diagnostic msg: PLEASE submit a bug report to https://bugs.llvm.org/ and include the crash backtrace, preprocessed source, and associated run script. clang-9: note: diagnostic msg: ********************

Hide Details

PLEASE ATTACH THE FOLLOWING FILES TO THE BUG REPORT: Preprocessed source(s) and associated run script(s) are located at: clang-9: note: diagnostic msg: /var/folders/09/r4vw4v8n5kb67jl66zvlbljw0000gn/T/Background-cfb48a.cpp clang-9: note: diagnostic msg: /var/folders/09/r4vw4v8n5kb67jl66zvlbljw0000gn/T/Background-cfb48a.cache clang-9: note: diagnostic msg: /var/folders/09/r4vw4v8n5kb67jl66zvlbljw0000gn/T/Background-cfb48a.sh clang-9: note: diagnostic msg: Crash backtrace is located in clang-9: note: diagnostic msg: /Users/buildslave/Library/Logs/DiagnosticReports/clang-9_<YYYY-MM-DD-HHMMSS>_<hostname>.crash clang-9: note: diagnostic msg: (choose the .crash file that corresponds to your crash) clang-9: note: diagnostic msg:

Hide Details

******************** ninja: build stopped: subcommand failed. Command failed Command: ['/usr/local/bin/ninja', '-v', 'all'] Build step 'Execute shell' marked build as failure [WARNINGS] Skipping publisher since build result is FAILURE [BFA] Scanning build for known causes... [BFA] Found failure cause(s): [BFA] Assertion failure from category Assert [BFA] Ninja target failed from category Compile [BFA] Compile Error from category Compile [BFA] Done. 1s Email was triggered for: Failure - Any Sending email for trigger: Failure - Any

Hide Details

Begin Pre-Send Script... Username Vedant not found in auth.groovy. This may indicate a problem with the svn-mailer.conf update process. Please check this job: http://green.lab.llvm.org/green/view/Infrastructure/job/Update%20SVN%20email%20list/ User Vedant will need to be notified of the build failure manually.

Hide Details

Username Kumar not found in auth.groovy. This may indicate a problem with the svn-mailer.conf update process. Please check this job: http://green.lab.llvm.org/green/view/Infrastructure/job/Update%20SVN%20email%20list/ User Kumar will need to be notified of the build failure manually.

Hide Details

Sending email to: vsk@apple.com JF Bastien <jfbastien@apple.com> Andi Bergen <abergen@apple.com> Azhar Mohammed <azhar@apple.com> Finished: FAILURE