FailedConsole Output

Skipping 6,555 KB.. Full Log
/buildslave/jenkins/workspace/clang-stage2-coverage-R/llvm/tools/clang/lib/Headers/tgmath.h /Users/buildslave/jenkins/workspace/clang-stage2-coverage-R/clang-build/./lib/clang/9.0.0/include/tgmath.h
[2956/4610] cd /Users/buildslave/jenkins/workspace/clang-stage2-coverage-R/clang-build/tools/clang/lib/Headers && /usr/local/Cellar/cmake/3.13.1/bin/cmake -E copy_if_different /Users/buildslave/jenkins/workspace/clang-stage2-coverage-R/llvm/tools/clang/lib/Headers/unwind.h /Users/buildslave/jenkins/workspace/clang-stage2-coverage-R/clang-build/./lib/clang/9.0.0/include/unwind.h
[2957/4610] cd /Users/buildslave/jenkins/workspace/clang-stage2-coverage-R/clang-build/tools/clang/lib/Headers && /usr/local/Cellar/cmake/3.13.1/bin/cmake -E copy_if_different /Users/buildslave/jenkins/workspace/clang-stage2-coverage-R/llvm/tools/clang/lib/Headers/tmmintrin.h /Users/buildslave/jenkins/workspace/clang-stage2-coverage-R/clang-build/./lib/clang/9.0.0/include/tmmintrin.h
[2958/4610] cd /Users/buildslave/jenkins/workspace/clang-stage2-coverage-R/clang-build/tools/clang/lib/Headers && /usr/local/Cellar/cmake/3.13.1/bin/cmake -E copy_if_different /Users/buildslave/jenkins/workspace/clang-stage2-coverage-R/llvm/tools/clang/lib/Headers/vadefs.h /Users/buildslave/jenkins/workspace/clang-stage2-coverage-R/clang-build/./lib/clang/9.0.0/include/vadefs.h
[2959/4610] cd /Users/buildslave/jenkins/workspace/clang-stage2-coverage-R/clang-build/tools/clang/lib/Headers && /usr/local/Cellar/cmake/3.13.1/bin/cmake -E copy_if_different /Users/buildslave/jenkins/workspace/clang-stage2-coverage-R/llvm/tools/clang/lib/Headers/vaesintrin.h /Users/buildslave/jenkins/workspace/clang-stage2-coverage-R/clang-build/./lib/clang/9.0.0/include/vaesintrin.h
[2960/4610] cd /Users/buildslave/jenkins/workspace/clang-stage2-coverage-R/clang-build/tools/clang/lib/Headers && /usr/local/Cellar/cmake/3.13.1/bin/cmake -E copy_if_different /Users/buildslave/jenkins/workspace/clang-stage2-coverage-R/llvm/tools/clang/lib/Headers/varargs.h /Users/buildslave/jenkins/workspace/clang-stage2-coverage-R/clang-build/./lib/clang/9.0.0/include/varargs.h
[2961/4610] cd /Users/buildslave/jenkins/workspace/clang-stage2-coverage-R/clang-build/tools/clang/lib/Headers && /usr/local/Cellar/cmake/3.13.1/bin/cmake -E copy_if_different /Users/buildslave/jenkins/workspace/clang-stage2-coverage-R/llvm/tools/clang/lib/Headers/vecintrin.h /Users/buildslave/jenkins/workspace/clang-stage2-coverage-R/clang-build/./lib/clang/9.0.0/include/vecintrin.h
[2962/4610] cd /Users/buildslave/jenkins/workspace/clang-stage2-coverage-R/clang-build/tools/clang/lib/Headers && /usr/local/Cellar/cmake/3.13.1/bin/cmake -E copy_if_different /Users/buildslave/jenkins/workspace/clang-stage2-coverage-R/llvm/tools/clang/lib/Headers/vpclmulqdqintrin.h /Users/buildslave/jenkins/workspace/clang-stage2-coverage-R/clang-build/./lib/clang/9.0.0/include/vpclmulqdqintrin.h
[2963/4610] cd /Users/buildslave/jenkins/workspace/clang-stage2-coverage-R/clang-build/tools/clang/lib/Headers && /usr/local/Cellar/cmake/3.13.1/bin/cmake -E copy_if_different /Users/buildslave/jenkins/workspace/clang-stage2-coverage-R/llvm/tools/clang/lib/Headers/wbnoinvdintrin.h /Users/buildslave/jenkins/workspace/clang-stage2-coverage-R/clang-build/./lib/clang/9.0.0/include/wbnoinvdintrin.h
[2964/4610] cd /Users/buildslave/jenkins/workspace/clang-stage2-coverage-R/clang-build/tools/clang/lib/Headers && /usr/local/Cellar/cmake/3.13.1/bin/cmake -E copy_if_different /Users/buildslave/jenkins/workspace/clang-stage2-coverage-R/llvm/tools/clang/lib/Headers/waitpkgintrin.h /Users/buildslave/jenkins/workspace/clang-stage2-coverage-R/clang-build/./lib/clang/9.0.0/include/waitpkgintrin.h
[2965/4610] cd /Users/buildslave/jenkins/workspace/clang-stage2-coverage-R/clang-build/tools/clang/lib/Headers && /usr/local/Cellar/cmake/3.13.1/bin/cmake -E copy_if_different /Users/buildslave/jenkins/workspace/clang-stage2-coverage-R/llvm/tools/clang/lib/Headers/wmmintrin.h /Users/buildslave/jenkins/workspace/clang-stage2-coverage-R/clang-build/./lib/clang/9.0.0/include/wmmintrin.h
[2966/4610] cd /Users/buildslave/jenkins/workspace/clang-stage2-coverage-R/clang-build/tools/clang/lib/Headers && /usr/local/Cellar/cmake/3.13.1/bin/cmake -E copy_if_different /Users/buildslave/jenkins/workspace/clang-stage2-coverage-R/llvm/tools/clang/lib/Headers/__wmmintrin_aes.h /Users/buildslave/jenkins/workspace/clang-stage2-coverage-R/clang-build/./lib/clang/9.0.0/include/__wmmintrin_aes.h
[2967/4610] cd /Users/buildslave/jenkins/workspace/clang-stage2-coverage-R/clang-build/tools/clang/lib/Headers && /usr/local/Cellar/cmake/3.13.1/bin/cmake -E copy_if_different /Users/buildslave/jenkins/workspace/clang-stage2-coverage-R/llvm/tools/clang/lib/Headers/__wmmintrin_pclmul.h /Users/buildslave/jenkins/workspace/clang-stage2-coverage-R/clang-build/./lib/clang/9.0.0/include/__wmmintrin_pclmul.h
[2968/4610] cd /Users/buildslave/jenkins/workspace/clang-stage2-coverage-R/clang-build/tools/clang/lib/Headers && /usr/local/Cellar/cmake/3.13.1/bin/cmake -E copy_if_different /Users/buildslave/jenkins/workspace/clang-stage2-coverage-R/llvm/tools/clang/lib/Headers/xmmintrin.h /Users/buildslave/jenkins/workspace/clang-stage2-coverage-R/clang-build/./lib/clang/9.0.0/include/xmmintrin.h
[2969/4610] cd /Users/buildslave/jenkins/workspace/clang-stage2-coverage-R/clang-build/tools/clang/lib/Headers && /usr/local/Cellar/cmake/3.13.1/bin/cmake -E copy_if_different /Users/buildslave/jenkins/workspace/clang-stage2-coverage-R/llvm/tools/clang/lib/Headers/x86intrin.h /Users/buildslave/jenkins/workspace/clang-stage2-coverage-R/clang-build/./lib/clang/9.0.0/include/x86intrin.h
[2970/4610] cd /Users/buildslave/jenkins/workspace/clang-stage2-coverage-R/clang-build/tools/clang/lib/Headers && /usr/local/Cellar/cmake/3.13.1/bin/cmake -E copy_if_different /Users/buildslave/jenkins/workspace/clang-stage2-coverage-R/llvm/tools/clang/lib/Headers/xopintrin.h /Users/buildslave/jenkins/workspace/clang-stage2-coverage-R/clang-build/./lib/clang/9.0.0/include/xopintrin.h
[2971/4610] cd /Users/buildslave/jenkins/workspace/clang-stage2-coverage-R/clang-build/tools/clang/lib/Headers && /usr/local/Cellar/cmake/3.13.1/bin/cmake -E copy_if_different /Users/buildslave/jenkins/workspace/clang-stage2-coverage-R/llvm/tools/clang/lib/Headers/xsaveoptintrin.h /Users/buildslave/jenkins/workspace/clang-stage2-coverage-R/clang-build/./lib/clang/9.0.0/include/xsaveoptintrin.h
[2972/4610] cd /Users/buildslave/jenkins/workspace/clang-stage2-coverage-R/clang-build/tools/clang/lib/Headers && /usr/local/Cellar/cmake/3.13.1/bin/cmake -E copy_if_different /Users/buildslave/jenkins/workspace/clang-stage2-coverage-R/llvm/tools/clang/lib/Headers/xsavecintrin.h /Users/buildslave/jenkins/workspace/clang-stage2-coverage-R/clang-build/./lib/clang/9.0.0/include/xsavecintrin.h
[2973/4610] cd /Users/buildslave/jenkins/workspace/clang-stage2-coverage-R/clang-build/tools/clang/lib/Headers && /usr/local/Cellar/cmake/3.13.1/bin/cmake -E copy_if_different /Users/buildslave/jenkins/workspace/clang-stage2-coverage-R/llvm/tools/clang/lib/Headers/xsaveintrin.h /Users/buildslave/jenkins/workspace/clang-stage2-coverage-R/clang-build/./lib/clang/9.0.0/include/xsaveintrin.h
[2974/4610] cd /Users/buildslave/jenkins/workspace/clang-stage2-coverage-R/clang-build/tools/clang/lib/Headers && /usr/local/Cellar/cmake/3.13.1/bin/cmake -E copy_if_different /Users/buildslave/jenkins/workspace/clang-stage2-coverage-R/llvm/tools/clang/lib/Headers/xsavesintrin.h /Users/buildslave/jenkins/workspace/clang-stage2-coverage-R/clang-build/./lib/clang/9.0.0/include/xsavesintrin.h
[2975/4610] cd /Users/buildslave/jenkins/workspace/clang-stage2-coverage-R/clang-build/tools/clang/lib/Headers && /usr/local/Cellar/cmake/3.13.1/bin/cmake -E copy_if_different /Users/buildslave/jenkins/workspace/clang-stage2-coverage-R/llvm/tools/clang/lib/Headers/cuda_wrappers/algorithm /Users/buildslave/jenkins/workspace/clang-stage2-coverage-R/clang-build/./lib/clang/9.0.0/include/cuda_wrappers/algorithm
[2976/4610] cd /Users/buildslave/jenkins/workspace/clang-stage2-coverage-R/clang-build/tools/clang/lib/Headers && /usr/local/Cellar/cmake/3.13.1/bin/cmake -E copy_if_different /Users/buildslave/jenkins/workspace/clang-stage2-coverage-R/llvm/tools/clang/lib/Headers/xtestintrin.h /Users/buildslave/jenkins/workspace/clang-stage2-coverage-R/clang-build/./lib/clang/9.0.0/include/xtestintrin.h
[2977/4610] cd /Users/buildslave/jenkins/workspace/clang-stage2-coverage-R/clang-build/tools/clang/lib/Headers && /usr/local/Cellar/cmake/3.13.1/bin/cmake -E copy_if_different /Users/buildslave/jenkins/workspace/clang-stage2-coverage-R/llvm/tools/clang/lib/Headers/ppc_wrappers/mmintrin.h /Users/buildslave/jenkins/workspace/clang-stage2-coverage-R/clang-build/./lib/clang/9.0.0/include/ppc_wrappers/mmintrin.h
[2978/4610] cd /Users/buildslave/jenkins/workspace/clang-stage2-coverage-R/clang-build/tools/clang/lib/Headers && /usr/local/Cellar/cmake/3.13.1/bin/cmake -E copy_if_different /Users/buildslave/jenkins/workspace/clang-stage2-coverage-R/llvm/tools/clang/lib/Headers/cuda_wrappers/complex /Users/buildslave/jenkins/workspace/clang-stage2-coverage-R/clang-build/./lib/clang/9.0.0/include/cuda_wrappers/complex
[2979/4610] cd /Users/buildslave/jenkins/workspace/clang-stage2-coverage-R/clang-build/tools/clang/lib/Headers && /usr/local/Cellar/cmake/3.13.1/bin/cmake -E copy_if_different /Users/buildslave/jenkins/workspace/clang-stage2-coverage-R/llvm/tools/clang/lib/Headers/cuda_wrappers/new /Users/buildslave/jenkins/workspace/clang-stage2-coverage-R/clang-build/./lib/clang/9.0.0/include/cuda_wrappers/new
[2980/4610] cd /Users/buildslave/jenkins/workspace/clang-stage2-coverage-R/clang-build/tools/clang/lib/Headers && /usr/local/Cellar/cmake/3.13.1/bin/cmake -E copy_if_different /Users/buildslave/jenkins/workspace/clang-stage2-coverage-R/llvm/tools/clang/lib/Headers/ppc_wrappers/xmmintrin.h /Users/buildslave/jenkins/workspace/clang-stage2-coverage-R/clang-build/./lib/clang/9.0.0/include/ppc_wrappers/xmmintrin.h
[2981/4610] cd /Users/buildslave/jenkins/workspace/clang-stage2-coverage-R/clang-build/tools/clang/lib/Headers && /usr/local/Cellar/cmake/3.13.1/bin/cmake -E copy_if_different /Users/buildslave/jenkins/workspace/clang-stage2-coverage-R/llvm/tools/clang/lib/Headers/ppc_wrappers/mm_malloc.h /Users/buildslave/jenkins/workspace/clang-stage2-coverage-R/clang-build/./lib/clang/9.0.0/include/ppc_wrappers/mm_malloc.h
[2982/4610] cd /Users/buildslave/jenkins/workspace/clang-stage2-coverage-R/clang-build/tools/clang/lib/Headers && /usr/local/Cellar/cmake/3.13.1/bin/cmake -E copy_if_different /Users/buildslave/jenkins/workspace/clang-stage2-coverage-R/llvm/tools/clang/lib/Headers/ppc_wrappers/emmintrin.h /Users/buildslave/jenkins/workspace/clang-stage2-coverage-R/clang-build/./lib/clang/9.0.0/include/ppc_wrappers/emmintrin.h
[2983/4610] cd /Users/buildslave/jenkins/workspace/clang-stage2-coverage-R/clang-build/tools/clang/lib/Headers && /usr/local/Cellar/cmake/3.13.1/bin/cmake -E copy_if_different /Users/buildslave/jenkins/workspace/clang-stage2-coverage-R/llvm/tools/clang/lib/Headers/openmp_wrappers/__clang_openmp_math.h /Users/buildslave/jenkins/workspace/clang-stage2-coverage-R/clang-build/./lib/clang/9.0.0/include/openmp_wrappers/__clang_openmp_math.h
[2984/4610] cd /Users/buildslave/jenkins/workspace/clang-stage2-coverage-R/clang-build/tools/clang/lib/Headers && /usr/local/Cellar/cmake/3.13.1/bin/cmake -E copy_if_different /Users/buildslave/jenkins/workspace/clang-stage2-coverage-R/llvm/tools/clang/lib/Headers/openmp_wrappers/__clang_openmp_math_declares.h /Users/buildslave/jenkins/workspace/clang-stage2-coverage-R/clang-build/./lib/clang/9.0.0/include/openmp_wrappers/__clang_openmp_math_declares.h
[2985/4610] cd /Users/buildslave/jenkins/workspace/clang-stage2-coverage-R/clang-build/tools/clang/lib/Headers && /usr/local/Cellar/cmake/3.13.1/bin/cmake -E copy_if_different /Users/buildslave/jenkins/workspace/clang-stage2-coverage-R/llvm/tools/clang/lib/Headers/openmp_wrappers/math.h /Users/buildslave/jenkins/workspace/clang-stage2-coverage-R/clang-build/./lib/clang/9.0.0/include/openmp_wrappers/math.h
[2986/4610] cd /Users/buildslave/jenkins/workspace/clang-stage2-coverage-R/clang-build/tools/clang/lib/Headers && /usr/local/Cellar/cmake/3.13.1/bin/cmake -E copy_if_different /Users/buildslave/jenkins/workspace/clang-stage2-coverage-R/llvm/tools/clang/lib/Headers/openmp_wrappers/cmath /Users/buildslave/jenkins/workspace/clang-stage2-coverage-R/clang-build/./lib/clang/9.0.0/include/openmp_wrappers/cmath
[2987/4610] cd /Users/buildslave/jenkins/workspace/clang-stage2-coverage-R/clang-build && /Users/buildslave/jenkins/workspace/clang-stage2-coverage-R/clang-build/bin/clang-tblgen -gen-arm-fp16 -I /Users/buildslave/jenkins/workspace/clang-stage2-coverage-R/llvm/tools/clang/include/clang/Basic/ -I /Users/buildslave/jenkins/workspace/clang-stage2-coverage-R/llvm/tools/clang/lib/Headers -I /Users/buildslave/jenkins/workspace/clang-stage2-coverage-R/llvm/include /Users/buildslave/jenkins/workspace/clang-stage2-coverage-R/llvm/tools/clang/include/clang/Basic/arm_fp16.td -o tools/clang/lib/Headers/arm_fp16.h -d tools/clang/lib/Headers/arm_fp16.h.d
[2988/4610] cd /Users/buildslave/jenkins/workspace/clang-stage2-coverage-R/clang-build/tools/clang/lib/Headers && /usr/local/Cellar/cmake/3.13.1/bin/cmake -E copy_if_different /Users/buildslave/jenkins/workspace/clang-stage2-coverage-R/clang-build/tools/clang/lib/Headers/arm_fp16.h /Users/buildslave/jenkins/workspace/clang-stage2-coverage-R/clang-build/./lib/clang/9.0.0/include/arm_fp16.h
[2989/4610] cd /Users/buildslave/jenkins/workspace/clang-stage2-coverage-R/clang-build/tools/clang/lib/Basic && /usr/local/Cellar/cmake/3.13.1/bin/cmake -DNAMES="LLVM;CLANG" -DLLVM_SOURCE_DIR= -DCLANG_SOURCE_DIR= -DHEADER_FILE=/Users/buildslave/jenkins/workspace/clang-stage2-coverage-R/clang-build/tools/clang/lib/Basic/VCSVersion.inc -P /Users/buildslave/jenkins/workspace/clang-stage2-coverage-R/llvm/cmake/modules/GenerateVersionFromVCS.cmake
[2990/4610] cd /Users/buildslave/jenkins/workspace/clang-stage2-coverage-R/clang-build && /Users/buildslave/jenkins/workspace/clang-stage2-coverage-R/clang-build/bin/clang-tblgen -gen-arm-neon -I /Users/buildslave/jenkins/workspace/clang-stage2-coverage-R/llvm/tools/clang/include/clang/Basic/ -I /Users/buildslave/jenkins/workspace/clang-stage2-coverage-R/llvm/tools/clang/lib/Headers -I /Users/buildslave/jenkins/workspace/clang-stage2-coverage-R/llvm/include /Users/buildslave/jenkins/workspace/clang-stage2-coverage-R/llvm/tools/clang/include/clang/Basic/arm_neon.td -o tools/clang/lib/Headers/arm_neon.h -d tools/clang/lib/Headers/arm_neon.h.d
[2991/4610] cd /Users/buildslave/jenkins/workspace/clang-stage2-coverage-R/clang-build/tools/clang/lib/Headers && /usr/local/Cellar/cmake/3.13.1/bin/cmake -E copy_if_different /Users/buildslave/jenkins/workspace/clang-stage2-coverage-R/clang-build/tools/clang/lib/Headers/arm_neon.h /Users/buildslave/jenkins/workspace/clang-stage2-coverage-R/clang-build/./lib/clang/9.0.0/include/arm_neon.h
[2992/4610] /Users/buildslave/jenkins/workspace/clang-stage2-coverage-R/host-compiler/bin/clang++  -DGTEST_HAS_RTTI=0 -D_GNU_SOURCE -D__STDC_CONSTANT_MACROS -D__STDC_FORMAT_MACROS -D__STDC_LIMIT_MACROS -Itools/clang/lib/Basic -I/Users/buildslave/jenkins/workspace/clang-stage2-coverage-R/llvm/tools/clang/lib/Basic -I/Users/buildslave/jenkins/workspace/clang-stage2-coverage-R/llvm/tools/clang/include -Itools/clang/include -I/Applications/Xcode.app/Contents/Developer/Platforms/MacOSX.platform/Developer/SDKs/MacOSX10.14.sdk/usr/include/libxml2 -Iinclude -I/Users/buildslave/jenkins/workspace/clang-stage2-coverage-R/llvm/include -fPIC -fvisibility-inlines-hidden -Werror=date-time -Werror=unguarded-availability-new -std=c++11 -fmodules -fmodules-cache-path=/Users/buildslave/jenkins/workspace/clang-stage2-coverage-R/clang-build/module.cache -fcxx-modules -Wall -Wextra -Wno-unused-parameter -Wwrite-strings -Wcast-qual -Wmissing-field-initializers -pedantic -Wno-long-long -Wimplicit-fallthrough -Wcovered-switch-default -Wno-noexcept-type -Wnon-virtual-dtor -Wdelete-non-virtual-dtor -Wstring-conversion -fdiagnostics-color -fprofile-instr-generate='/Users/buildslave/jenkins/workspace/clang-stage2-coverage-R/clang-build/profiles/%6m.profraw' -fcoverage-mapping -fno-common -Woverloaded-virtual -Wno-nested-anon-types -O3 -DNDEBUG -isysroot /Applications/Xcode.app/Contents/Developer/Platforms/MacOSX.platform/Developer/SDKs/MacOSX10.14.sdk    -fno-exceptions -fno-rtti -MD -MT tools/clang/lib/Basic/CMakeFiles/obj.clangBasic.dir/Builtins.cpp.o -MF tools/clang/lib/Basic/CMakeFiles/obj.clangBasic.dir/Builtins.cpp.o.d -o tools/clang/lib/Basic/CMakeFiles/obj.clangBasic.dir/Builtins.cpp.o -c /Users/buildslave/jenkins/workspace/clang-stage2-coverage-R/llvm/tools/clang/lib/Basic/Builtins.cpp
[2993/4610] /Users/buildslave/jenkins/workspace/clang-stage2-coverage-R/host-compiler/bin/clang++  -DGTEST_HAS_RTTI=0 -D_GNU_SOURCE -D__STDC_CONSTANT_MACROS -D__STDC_FORMAT_MACROS -D__STDC_LIMIT_MACROS -Itools/clang/lib/Basic -I/Users/buildslave/jenkins/workspace/clang-stage2-coverage-R/llvm/tools/clang/lib/Basic -I/Users/buildslave/jenkins/workspace/clang-stage2-coverage-R/llvm/tools/clang/include -Itools/clang/include -I/Applications/Xcode.app/Contents/Developer/Platforms/MacOSX.platform/Developer/SDKs/MacOSX10.14.sdk/usr/include/libxml2 -Iinclude -I/Users/buildslave/jenkins/workspace/clang-stage2-coverage-R/llvm/include -fPIC -fvisibility-inlines-hidden -Werror=date-time -Werror=unguarded-availability-new -std=c++11 -fmodules -fmodules-cache-path=/Users/buildslave/jenkins/workspace/clang-stage2-coverage-R/clang-build/module.cache -fcxx-modules -Wall -Wextra -Wno-unused-parameter -Wwrite-strings -Wcast-qual -Wmissing-field-initializers -pedantic -Wno-long-long -Wimplicit-fallthrough -Wcovered-switch-default -Wno-noexcept-type -Wnon-virtual-dtor -Wdelete-non-virtual-dtor -Wstring-conversion -fdiagnostics-color -fprofile-instr-generate='/Users/buildslave/jenkins/workspace/clang-stage2-coverage-R/clang-build/profiles/%6m.profraw' -fcoverage-mapping -fno-common -Woverloaded-virtual -Wno-nested-anon-types -O3 -DNDEBUG -isysroot /Applications/Xcode.app/Contents/Developer/Platforms/MacOSX.platform/Developer/SDKs/MacOSX10.14.sdk    -fno-exceptions -fno-rtti -MD -MT tools/clang/lib/Basic/CMakeFiles/obj.clangBasic.dir/CharInfo.cpp.o -MF tools/clang/lib/Basic/CMakeFiles/obj.clangBasic.dir/CharInfo.cpp.o.d -o tools/clang/lib/Basic/CMakeFiles/obj.clangBasic.dir/CharInfo.cpp.o -c /Users/buildslave/jenkins/workspace/clang-stage2-coverage-R/llvm/tools/clang/lib/Basic/CharInfo.cpp
[2994/4610] /Users/buildslave/jenkins/workspace/clang-stage2-coverage-R/host-compiler/bin/clang++  -DGTEST_HAS_RTTI=0 -D_GNU_SOURCE -D__STDC_CONSTANT_MACROS -D__STDC_FORMAT_MACROS -D__STDC_LIMIT_MACROS -Itools/clang/lib/Basic -I/Users/buildslave/jenkins/workspace/clang-stage2-coverage-R/llvm/tools/clang/lib/Basic -I/Users/buildslave/jenkins/workspace/clang-stage2-coverage-R/llvm/tools/clang/include -Itools/clang/include -I/Applications/Xcode.app/Contents/Developer/Platforms/MacOSX.platform/Developer/SDKs/MacOSX10.14.sdk/usr/include/libxml2 -Iinclude -I/Users/buildslave/jenkins/workspace/clang-stage2-coverage-R/llvm/include -fPIC -fvisibility-inlines-hidden -Werror=date-time -Werror=unguarded-availability-new -std=c++11 -fmodules -fmodules-cache-path=/Users/buildslave/jenkins/workspace/clang-stage2-coverage-R/clang-build/module.cache -fcxx-modules -Wall -Wextra -Wno-unused-parameter -Wwrite-strings -Wcast-qual -Wmissing-field-initializers -pedantic -Wno-long-long -Wimplicit-fallthrough -Wcovered-switch-default -Wno-noexcept-type -Wnon-virtual-dtor -Wdelete-non-virtual-dtor -Wstring-conversion -fdiagnostics-color -fprofile-instr-generate='/Users/buildslave/jenkins/workspace/clang-stage2-coverage-R/clang-build/profiles/%6m.profraw' -fcoverage-mapping -fno-common -Woverloaded-virtual -Wno-nested-anon-types -O3 -DNDEBUG -isysroot /Applications/Xcode.app/Contents/Developer/Platforms/MacOSX.platform/Developer/SDKs/MacOSX10.14.sdk    -fno-exceptions -fno-rtti -MD -MT tools/clang/lib/Basic/CMakeFiles/obj.clangBasic.dir/Attributes.cpp.o -MF tools/clang/lib/Basic/CMakeFiles/obj.clangBasic.dir/Attributes.cpp.o.d -o tools/clang/lib/Basic/CMakeFiles/obj.clangBasic.dir/Attributes.cpp.o -c /Users/buildslave/jenkins/workspace/clang-stage2-coverage-R/llvm/tools/clang/lib/Basic/Attributes.cpp
[2995/4610] /Users/buildslave/jenkins/workspace/clang-stage2-coverage-R/host-compiler/bin/clang++  -DGTEST_HAS_RTTI=0 -D_GNU_SOURCE -D__STDC_CONSTANT_MACROS -D__STDC_FORMAT_MACROS -D__STDC_LIMIT_MACROS -Itools/clang/lib/Basic -I/Users/buildslave/jenkins/workspace/clang-stage2-coverage-R/llvm/tools/clang/lib/Basic -I/Users/buildslave/jenkins/workspace/clang-stage2-coverage-R/llvm/tools/clang/include -Itools/clang/include -I/Applications/Xcode.app/Contents/Developer/Platforms/MacOSX.platform/Developer/SDKs/MacOSX10.14.sdk/usr/include/libxml2 -Iinclude -I/Users/buildslave/jenkins/workspace/clang-stage2-coverage-R/llvm/include -fPIC -fvisibility-inlines-hidden -Werror=date-time -Werror=unguarded-availability-new -std=c++11 -fmodules -fmodules-cache-path=/Users/buildslave/jenkins/workspace/clang-stage2-coverage-R/clang-build/module.cache -fcxx-modules -Wall -Wextra -Wno-unused-parameter -Wwrite-strings -Wcast-qual -Wmissing-field-initializers -pedantic -Wno-long-long -Wimplicit-fallthrough -Wcovered-switch-default -Wno-noexcept-type -Wnon-virtual-dtor -Wdelete-non-virtual-dtor -Wstring-conversion -fdiagnostics-color -fprofile-instr-generate='/Users/buildslave/jenkins/workspace/clang-stage2-coverage-R/clang-build/profiles/%6m.profraw' -fcoverage-mapping -fno-common -Woverloaded-virtual -Wno-nested-anon-types -O3 -DNDEBUG -isysroot /Applications/Xcode.app/Contents/Developer/Platforms/MacOSX.platform/Developer/SDKs/MacOSX10.14.sdk    -fno-exceptions -fno-rtti -MD -MT tools/clang/lib/Basic/CMakeFiles/obj.clangBasic.dir/CodeGenOptions.cpp.o -MF tools/clang/lib/Basic/CMakeFiles/obj.clangBasic.dir/CodeGenOptions.cpp.o.d -o tools/clang/lib/Basic/CMakeFiles/obj.clangBasic.dir/CodeGenOptions.cpp.o -c /Users/buildslave/jenkins/workspace/clang-stage2-coverage-R/llvm/tools/clang/lib/Basic/CodeGenOptions.cpp
[2996/4610] /Users/buildslave/jenkins/workspace/clang-stage2-coverage-R/host-compiler/bin/clang++  -DGTEST_HAS_RTTI=0 -D_GNU_SOURCE -D__STDC_CONSTANT_MACROS -D__STDC_FORMAT_MACROS -D__STDC_LIMIT_MACROS -Itools/clang/lib/Basic -I/Users/buildslave/jenkins/workspace/clang-stage2-coverage-R/llvm/tools/clang/lib/Basic -I/Users/buildslave/jenkins/workspace/clang-stage2-coverage-R/llvm/tools/clang/include -Itools/clang/include -I/Applications/Xcode.app/Contents/Developer/Platforms/MacOSX.platform/Developer/SDKs/MacOSX10.14.sdk/usr/include/libxml2 -Iinclude -I/Users/buildslave/jenkins/workspace/clang-stage2-coverage-R/llvm/include -fPIC -fvisibility-inlines-hidden -Werror=date-time -Werror=unguarded-availability-new -std=c++11 -fmodules -fmodules-cache-path=/Users/buildslave/jenkins/workspace/clang-stage2-coverage-R/clang-build/module.cache -fcxx-modules -Wall -Wextra -Wno-unused-parameter -Wwrite-strings -Wcast-qual -Wmissing-field-initializers -pedantic -Wno-long-long -Wimplicit-fallthrough -Wcovered-switch-default -Wno-noexcept-type -Wnon-virtual-dtor -Wdelete-non-virtual-dtor -Wstring-conversion -fdiagnostics-color -fprofile-instr-generate='/Users/buildslave/jenkins/workspace/clang-stage2-coverage-R/clang-build/profiles/%6m.profraw' -fcoverage-mapping -fno-common -Woverloaded-virtual -Wno-nested-anon-types -O3 -DNDEBUG -isysroot /Applications/Xcode.app/Contents/Developer/Platforms/MacOSX.platform/Developer/SDKs/MacOSX10.14.sdk    -fno-exceptions -fno-rtti -MD -MT tools/clang/lib/Basic/CMakeFiles/obj.clangBasic.dir/Cuda.cpp.o -MF tools/clang/lib/Basic/CMakeFiles/obj.clangBasic.dir/Cuda.cpp.o.d -o tools/clang/lib/Basic/CMakeFiles/obj.clangBasic.dir/Cuda.cpp.o -c /Users/buildslave/jenkins/workspace/clang-stage2-coverage-R/llvm/tools/clang/lib/Basic/Cuda.cpp
[2997/4610] /Users/buildslave/jenkins/workspace/clang-stage2-coverage-R/host-compiler/bin/clang++  -DGTEST_HAS_RTTI=0 -D_GNU_SOURCE -D__STDC_CONSTANT_MACROS -D__STDC_FORMAT_MACROS -D__STDC_LIMIT_MACROS -Itools/clang/tools/extra/clangd -I/Users/buildslave/jenkins/workspace/clang-stage2-coverage-R/llvm/tools/clang/tools/extra/clangd -I/Users/buildslave/jenkins/workspace/clang-stage2-coverage-R/llvm/tools/clang/include -Itools/clang/include -I/Applications/Xcode.app/Contents/Developer/Platforms/MacOSX.platform/Developer/SDKs/MacOSX10.14.sdk/usr/include/libxml2 -Iinclude -I/Users/buildslave/jenkins/workspace/clang-stage2-coverage-R/llvm/include -fPIC -fvisibility-inlines-hidden -Werror=date-time -Werror=unguarded-availability-new -std=c++11 -fmodules -fmodules-cache-path=/Users/buildslave/jenkins/workspace/clang-stage2-coverage-R/clang-build/module.cache -fcxx-modules -Wall -Wextra -Wno-unused-parameter -Wwrite-strings -Wcast-qual -Wmissing-field-initializers -pedantic -Wno-long-long -Wimplicit-fallthrough -Wcovered-switch-default -Wno-noexcept-type -Wnon-virtual-dtor -Wdelete-non-virtual-dtor -Wstring-conversion -fdiagnostics-color -fprofile-instr-generate='/Users/buildslave/jenkins/workspace/clang-stage2-coverage-R/clang-build/profiles/%6m.profraw' -fcoverage-mapping -fno-common -Woverloaded-virtual -Wno-nested-anon-types -O3 -DNDEBUG -isysroot /Applications/Xcode.app/Contents/Developer/Platforms/MacOSX.platform/Developer/SDKs/MacOSX10.14.sdk    -fno-exceptions -fno-rtti -MD -MT tools/clang/tools/extra/clangd/CMakeFiles/obj.clangDaemon.dir/Quality.cpp.o -MF tools/clang/tools/extra/clangd/CMakeFiles/obj.clangDaemon.dir/Quality.cpp.o.d -o tools/clang/tools/extra/clangd/CMakeFiles/obj.clangDaemon.dir/Quality.cpp.o -c /Users/buildslave/jenkins/workspace/clang-stage2-coverage-R/llvm/tools/clang/tools/extra/clangd/Quality.cpp
[2998/4610] /Users/buildslave/jenkins/workspace/clang-stage2-coverage-R/host-compiler/bin/clang++  -DGTEST_HAS_RTTI=0 -D_GNU_SOURCE -D__STDC_CONSTANT_MACROS -D__STDC_FORMAT_MACROS -D__STDC_LIMIT_MACROS -Itools/clang/lib/Basic -I/Users/buildslave/jenkins/workspace/clang-stage2-coverage-R/llvm/tools/clang/lib/Basic -I/Users/buildslave/jenkins/workspace/clang-stage2-coverage-R/llvm/tools/clang/include -Itools/clang/include -I/Applications/Xcode.app/Contents/Developer/Platforms/MacOSX.platform/Developer/SDKs/MacOSX10.14.sdk/usr/include/libxml2 -Iinclude -I/Users/buildslave/jenkins/workspace/clang-stage2-coverage-R/llvm/include -fPIC -fvisibility-inlines-hidden -Werror=date-time -Werror=unguarded-availability-new -std=c++11 -fmodules -fmodules-cache-path=/Users/buildslave/jenkins/workspace/clang-stage2-coverage-R/clang-build/module.cache -fcxx-modules -Wall -Wextra -Wno-unused-parameter -Wwrite-strings -Wcast-qual -Wmissing-field-initializers -pedantic -Wno-long-long -Wimplicit-fallthrough -Wcovered-switch-default -Wno-noexcept-type -Wnon-virtual-dtor -Wdelete-non-virtual-dtor -Wstring-conversion -fdiagnostics-color -fprofile-instr-generate='/Users/buildslave/jenkins/workspace/clang-stage2-coverage-R/clang-build/profiles/%6m.profraw' -fcoverage-mapping -fno-common -Woverloaded-virtual -Wno-nested-anon-types -O3 -DNDEBUG -isysroot /Applications/Xcode.app/Contents/Developer/Platforms/MacOSX.platform/Developer/SDKs/MacOSX10.14.sdk    -fno-exceptions -fno-rtti -MD -MT tools/clang/lib/Basic/CMakeFiles/obj.clangBasic.dir/DiagnosticOptions.cpp.o -MF tools/clang/lib/Basic/CMakeFiles/obj.clangBasic.dir/DiagnosticOptions.cpp.o.d -o tools/clang/lib/Basic/CMakeFiles/obj.clangBasic.dir/DiagnosticOptions.cpp.o -c /Users/buildslave/jenkins/workspace/clang-stage2-coverage-R/llvm/tools/clang/lib/Basic/DiagnosticOptions.cpp
[2999/4610] /Users/buildslave/jenkins/workspace/clang-stage2-coverage-R/host-compiler/bin/clang++  -DGTEST_HAS_RTTI=0 -D_GNU_SOURCE -D__STDC_CONSTANT_MACROS -D__STDC_FORMAT_MACROS -D__STDC_LIMIT_MACROS -Itools/clang/lib/Basic -I/Users/buildslave/jenkins/workspace/clang-stage2-coverage-R/llvm/tools/clang/lib/Basic -I/Users/buildslave/jenkins/workspace/clang-stage2-coverage-R/llvm/tools/clang/include -Itools/clang/include -I/Applications/Xcode.app/Contents/Developer/Platforms/MacOSX.platform/Developer/SDKs/MacOSX10.14.sdk/usr/include/libxml2 -Iinclude -I/Users/buildslave/jenkins/workspace/clang-stage2-coverage-R/llvm/include -fPIC -fvisibility-inlines-hidden -Werror=date-time -Werror=unguarded-availability-new -std=c++11 -fmodules -fmodules-cache-path=/Users/buildslave/jenkins/workspace/clang-stage2-coverage-R/clang-build/module.cache -fcxx-modules -Wall -Wextra -Wno-unused-parameter -Wwrite-strings -Wcast-qual -Wmissing-field-initializers -pedantic -Wno-long-long -Wimplicit-fallthrough -Wcovered-switch-default -Wno-noexcept-type -Wnon-virtual-dtor -Wdelete-non-virtual-dtor -Wstring-conversion -fdiagnostics-color -fprofile-instr-generate='/Users/buildslave/jenkins/workspace/clang-stage2-coverage-R/clang-build/profiles/%6m.profraw' -fcoverage-mapping -fno-common -Woverloaded-virtual -Wno-nested-anon-types -O3 -DNDEBUG -isysroot /Applications/Xcode.app/Contents/Developer/Platforms/MacOSX.platform/Developer/SDKs/MacOSX10.14.sdk    -fno-exceptions -fno-rtti -MD -MT tools/clang/lib/Basic/CMakeFiles/obj.clangBasic.dir/DiagnosticIDs.cpp.o -MF tools/clang/lib/Basic/CMakeFiles/obj.clangBasic.dir/DiagnosticIDs.cpp.o.d -o tools/clang/lib/Basic/CMakeFiles/obj.clangBasic.dir/DiagnosticIDs.cpp.o -c /Users/buildslave/jenkins/workspace/clang-stage2-coverage-R/llvm/tools/clang/lib/Basic/DiagnosticIDs.cpp
[3000/4610] /Users/buildslave/jenkins/workspace/clang-stage2-coverage-R/host-compiler/bin/clang++  -DGTEST_HAS_RTTI=0 -D_GNU_SOURCE -D__STDC_CONSTANT_MACROS -D__STDC_FORMAT_MACROS -D__STDC_LIMIT_MACROS -Itools/clang/lib/Basic -I/Users/buildslave/jenkins/workspace/clang-stage2-coverage-R/llvm/tools/clang/lib/Basic -I/Users/buildslave/jenkins/workspace/clang-stage2-coverage-R/llvm/tools/clang/include -Itools/clang/include -I/Applications/Xcode.app/Contents/Developer/Platforms/MacOSX.platform/Developer/SDKs/MacOSX10.14.sdk/usr/include/libxml2 -Iinclude -I/Users/buildslave/jenkins/workspace/clang-stage2-coverage-R/llvm/include -fPIC -fvisibility-inlines-hidden -Werror=date-time -Werror=unguarded-availability-new -std=c++11 -fmodules -fmodules-cache-path=/Users/buildslave/jenkins/workspace/clang-stage2-coverage-R/clang-build/module.cache -fcxx-modules -Wall -Wextra -Wno-unused-parameter -Wwrite-strings -Wcast-qual -Wmissing-field-initializers -pedantic -Wno-long-long -Wimplicit-fallthrough -Wcovered-switch-default -Wno-noexcept-type -Wnon-virtual-dtor -Wdelete-non-virtual-dtor -Wstring-conversion -fdiagnostics-color -fprofile-instr-generate='/Users/buildslave/jenkins/workspace/clang-stage2-coverage-R/clang-build/profiles/%6m.profraw' -fcoverage-mapping -fno-common -Woverloaded-virtual -Wno-nested-anon-types -O3 -DNDEBUG -isysroot /Applications/Xcode.app/Contents/Developer/Platforms/MacOSX.platform/Developer/SDKs/MacOSX10.14.sdk    -fno-exceptions -fno-rtti -MD -MT tools/clang/lib/Basic/CMakeFiles/obj.clangBasic.dir/FileManager.cpp.o -MF tools/clang/lib/Basic/CMakeFiles/obj.clangBasic.dir/FileManager.cpp.o.d -o tools/clang/lib/Basic/CMakeFiles/obj.clangBasic.dir/FileManager.cpp.o -c /Users/buildslave/jenkins/workspace/clang-stage2-coverage-R/llvm/tools/clang/lib/Basic/FileManager.cpp
[3001/4610] /Users/buildslave/jenkins/workspace/clang-stage2-coverage-R/host-compiler/bin/clang++  -DGTEST_HAS_RTTI=0 -D_GNU_SOURCE -D__STDC_CONSTANT_MACROS -D__STDC_FORMAT_MACROS -D__STDC_LIMIT_MACROS -Itools/clang/lib/Basic -I/Users/buildslave/jenkins/workspace/clang-stage2-coverage-R/llvm/tools/clang/lib/Basic -I/Users/buildslave/jenkins/workspace/clang-stage2-coverage-R/llvm/tools/clang/include -Itools/clang/include -I/Applications/Xcode.app/Contents/Developer/Platforms/MacOSX.platform/Developer/SDKs/MacOSX10.14.sdk/usr/include/libxml2 -Iinclude -I/Users/buildslave/jenkins/workspace/clang-stage2-coverage-R/llvm/include -fPIC -fvisibility-inlines-hidden -Werror=date-time -Werror=unguarded-availability-new -std=c++11 -fmodules -fmodules-cache-path=/Users/buildslave/jenkins/workspace/clang-stage2-coverage-R/clang-build/module.cache -fcxx-modules -Wall -Wextra -Wno-unused-parameter -Wwrite-strings -Wcast-qual -Wmissing-field-initializers -pedantic -Wno-long-long -Wimplicit-fallthrough -Wcovered-switch-default -Wno-noexcept-type -Wnon-virtual-dtor -Wdelete-non-virtual-dtor -Wstring-conversion -fdiagnostics-color -fprofile-instr-generate='/Users/buildslave/jenkins/workspace/clang-stage2-coverage-R/clang-build/profiles/%6m.profraw' -fcoverage-mapping -fno-common -Woverloaded-virtual -Wno-nested-anon-types -O3 -DNDEBUG -isysroot /Applications/Xcode.app/Contents/Developer/Platforms/MacOSX.platform/Developer/SDKs/MacOSX10.14.sdk    -fno-exceptions -fno-rtti -MD -MT tools/clang/lib/Basic/CMakeFiles/obj.clangBasic.dir/Diagnostic.cpp.o -MF tools/clang/lib/Basic/CMakeFiles/obj.clangBasic.dir/Diagnostic.cpp.o.d -o tools/clang/lib/Basic/CMakeFiles/obj.clangBasic.dir/Diagnostic.cpp.o -c /Users/buildslave/jenkins/workspace/clang-stage2-coverage-R/llvm/tools/clang/lib/Basic/Diagnostic.cpp
[3002/4610] /Users/buildslave/jenkins/workspace/clang-stage2-coverage-R/host-compiler/bin/clang++  -DGTEST_HAS_RTTI=0 -D_GNU_SOURCE -D__STDC_CONSTANT_MACROS -D__STDC_FORMAT_MACROS -D__STDC_LIMIT_MACROS -Itools/clang/tools/extra/clangd -I/Users/buildslave/jenkins/workspace/clang-stage2-coverage-R/llvm/tools/clang/tools/extra/clangd -I/Users/buildslave/jenkins/workspace/clang-stage2-coverage-R/llvm/tools/clang/include -Itools/clang/include -I/Applications/Xcode.app/Contents/Developer/Platforms/MacOSX.platform/Developer/SDKs/MacOSX10.14.sdk/usr/include/libxml2 -Iinclude -I/Users/buildslave/jenkins/workspace/clang-stage2-coverage-R/llvm/include -fPIC -fvisibility-inlines-hidden -Werror=date-time -Werror=unguarded-availability-new -std=c++11 -fmodules -fmodules-cache-path=/Users/buildslave/jenkins/workspace/clang-stage2-coverage-R/clang-build/module.cache -fcxx-modules -Wall -Wextra -Wno-unused-parameter -Wwrite-strings -Wcast-qual -Wmissing-field-initializers -pedantic -Wno-long-long -Wimplicit-fallthrough -Wcovered-switch-default -Wno-noexcept-type -Wnon-virtual-dtor -Wdelete-non-virtual-dtor -Wstring-conversion -fdiagnostics-color -fprofile-instr-generate='/Users/buildslave/jenkins/workspace/clang-stage2-coverage-R/clang-build/profiles/%6m.profraw' -fcoverage-mapping -fno-common -Woverloaded-virtual -Wno-nested-anon-types -O3 -DNDEBUG -isysroot /Applications/Xcode.app/Contents/Developer/Platforms/MacOSX.platform/Developer/SDKs/MacOSX10.14.sdk    -fno-exceptions -fno-rtti -MD -MT tools/clang/tools/extra/clangd/CMakeFiles/obj.clangDaemon.dir/Protocol.cpp.o -MF tools/clang/tools/extra/clangd/CMakeFiles/obj.clangDaemon.dir/Protocol.cpp.o.d -o tools/clang/tools/extra/clangd/CMakeFiles/obj.clangDaemon.dir/Protocol.cpp.o -c /Users/buildslave/jenkins/workspace/clang-stage2-coverage-R/llvm/tools/clang/tools/extra/clangd/Protocol.cpp
[3003/4610] /Users/buildslave/jenkins/workspace/clang-stage2-coverage-R/host-compiler/bin/clang++  -DGTEST_HAS_RTTI=0 -D_GNU_SOURCE -D__STDC_CONSTANT_MACROS -D__STDC_FORMAT_MACROS -D__STDC_LIMIT_MACROS -Itools/clang/lib/Basic -I/Users/buildslave/jenkins/workspace/clang-stage2-coverage-R/llvm/tools/clang/lib/Basic -I/Users/buildslave/jenkins/workspace/clang-stage2-coverage-R/llvm/tools/clang/include -Itools/clang/include -I/Applications/Xcode.app/Contents/Developer/Platforms/MacOSX.platform/Developer/SDKs/MacOSX10.14.sdk/usr/include/libxml2 -Iinclude -I/Users/buildslave/jenkins/workspace/clang-stage2-coverage-R/llvm/include -fPIC -fvisibility-inlines-hidden -Werror=date-time -Werror=unguarded-availability-new -std=c++11 -fmodules -fmodules-cache-path=/Users/buildslave/jenkins/workspace/clang-stage2-coverage-R/clang-build/module.cache -fcxx-modules -Wall -Wextra -Wno-unused-parameter -Wwrite-strings -Wcast-qual -Wmissing-field-initializers -pedantic -Wno-long-long -Wimplicit-fallthrough -Wcovered-switch-default -Wno-noexcept-type -Wnon-virtual-dtor -Wdelete-non-virtual-dtor -Wstring-conversion -fdiagnostics-color -fprofile-instr-generate='/Users/buildslave/jenkins/workspace/clang-stage2-coverage-R/clang-build/profiles/%6m.profraw' -fcoverage-mapping -fno-common -Woverloaded-virtual -Wno-nested-anon-types -O3 -DNDEBUG -isysroot /Applications/Xcode.app/Contents/Developer/Platforms/MacOSX.platform/Developer/SDKs/MacOSX10.14.sdk    -fno-exceptions -fno-rtti -MD -MT tools/clang/lib/Basic/CMakeFiles/obj.clangBasic.dir/FixedPoint.cpp.o -MF tools/clang/lib/Basic/CMakeFiles/obj.clangBasic.dir/FixedPoint.cpp.o.d -o tools/clang/lib/Basic/CMakeFiles/obj.clangBasic.dir/FixedPoint.cpp.o -c /Users/buildslave/jenkins/workspace/clang-stage2-coverage-R/llvm/tools/clang/lib/Basic/FixedPoint.cpp
[3004/4610] /Users/buildslave/jenkins/workspace/clang-stage2-coverage-R/host-compiler/bin/clang++  -DGTEST_HAS_RTTI=0 -D_GNU_SOURCE -D__STDC_CONSTANT_MACROS -D__STDC_FORMAT_MACROS -D__STDC_LIMIT_MACROS -Itools/clang/lib/Basic -I/Users/buildslave/jenkins/workspace/clang-stage2-coverage-R/llvm/tools/clang/lib/Basic -I/Users/buildslave/jenkins/workspace/clang-stage2-coverage-R/llvm/tools/clang/include -Itools/clang/include -I/Applications/Xcode.app/Contents/Developer/Platforms/MacOSX.platform/Developer/SDKs/MacOSX10.14.sdk/usr/include/libxml2 -Iinclude -I/Users/buildslave/jenkins/workspace/clang-stage2-coverage-R/llvm/include -fPIC -fvisibility-inlines-hidden -Werror=date-time -Werror=unguarded-availability-new -std=c++11 -fmodules -fmodules-cache-path=/Users/buildslave/jenkins/workspace/clang-stage2-coverage-R/clang-build/module.cache -fcxx-modules -Wall -Wextra -Wno-unused-parameter -Wwrite-strings -Wcast-qual -Wmissing-field-initializers -pedantic -Wno-long-long -Wimplicit-fallthrough -Wcovered-switch-default -Wno-noexcept-type -Wnon-virtual-dtor -Wdelete-non-virtual-dtor -Wstring-conversion -fdiagnostics-color -fprofile-instr-generate='/Users/buildslave/jenkins/workspace/clang-stage2-coverage-R/clang-build/profiles/%6m.profraw' -fcoverage-mapping -fno-common -Woverloaded-virtual -Wno-nested-anon-types -O3 -DNDEBUG -isysroot /Applications/Xcode.app/Contents/Developer/Platforms/MacOSX.platform/Developer/SDKs/MacOSX10.14.sdk    -fno-exceptions -fno-rtti -MD -MT tools/clang/lib/Basic/CMakeFiles/obj.clangBasic.dir/FileSystemStatCache.cpp.o -MF tools/clang/lib/Basic/CMakeFiles/obj.clangBasic.dir/FileSystemStatCache.cpp.o.d -o tools/clang/lib/Basic/CMakeFiles/obj.clangBasic.dir/FileSystemStatCache.cpp.o -c /Users/buildslave/jenkins/workspace/clang-stage2-coverage-R/llvm/tools/clang/lib/Basic/FileSystemStatCache.cpp
[3005/4610] /Users/buildslave/jenkins/workspace/clang-stage2-coverage-R/host-compiler/bin/clang++  -DGTEST_HAS_RTTI=0 -D_GNU_SOURCE -D__STDC_CONSTANT_MACROS -D__STDC_FORMAT_MACROS -D__STDC_LIMIT_MACROS -Itools/clang/lib/Basic -I/Users/buildslave/jenkins/workspace/clang-stage2-coverage-R/llvm/tools/clang/lib/Basic -I/Users/buildslave/jenkins/workspace/clang-stage2-coverage-R/llvm/tools/clang/include -Itools/clang/include -I/Applications/Xcode.app/Contents/Developer/Platforms/MacOSX.platform/Developer/SDKs/MacOSX10.14.sdk/usr/include/libxml2 -Iinclude -I/Users/buildslave/jenkins/workspace/clang-stage2-coverage-R/llvm/include -fPIC -fvisibility-inlines-hidden -Werror=date-time -Werror=unguarded-availability-new -std=c++11 -fmodules -fmodules-cache-path=/Users/buildslave/jenkins/workspace/clang-stage2-coverage-R/clang-build/module.cache -fcxx-modules -Wall -Wextra -Wno-unused-parameter -Wwrite-strings -Wcast-qual -Wmissing-field-initializers -pedantic -Wno-long-long -Wimplicit-fallthrough -Wcovered-switch-default -Wno-noexcept-type -Wnon-virtual-dtor -Wdelete-non-virtual-dtor -Wstring-conversion -fdiagnostics-color -fprofile-instr-generate='/Users/buildslave/jenkins/workspace/clang-stage2-coverage-R/clang-build/profiles/%6m.profraw' -fcoverage-mapping -fno-common -Woverloaded-virtual -Wno-nested-anon-types -O3 -DNDEBUG -isysroot /Applications/Xcode.app/Contents/Developer/Platforms/MacOSX.platform/Developer/SDKs/MacOSX10.14.sdk    -fno-exceptions -fno-rtti -MD -MT tools/clang/lib/Basic/CMakeFiles/obj.clangBasic.dir/LangOptions.cpp.o -MF tools/clang/lib/Basic/CMakeFiles/obj.clangBasic.dir/LangOptions.cpp.o.d -o tools/clang/lib/Basic/CMakeFiles/obj.clangBasic.dir/LangOptions.cpp.o -c /Users/buildslave/jenkins/workspace/clang-stage2-coverage-R/llvm/tools/clang/lib/Basic/LangOptions.cpp
[3006/4610] /Users/buildslave/jenkins/workspace/clang-stage2-coverage-R/host-compiler/bin/clang++  -DGTEST_HAS_RTTI=0 -D_GNU_SOURCE -D__STDC_CONSTANT_MACROS -D__STDC_FORMAT_MACROS -D__STDC_LIMIT_MACROS -Itools/clang/lib/Basic -I/Users/buildslave/jenkins/workspace/clang-stage2-coverage-R/llvm/tools/clang/lib/Basic -I/Users/buildslave/jenkins/workspace/clang-stage2-coverage-R/llvm/tools/clang/include -Itools/clang/include -I/Applications/Xcode.app/Contents/Developer/Platforms/MacOSX.platform/Developer/SDKs/MacOSX10.14.sdk/usr/include/libxml2 -Iinclude -I/Users/buildslave/jenkins/workspace/clang-stage2-coverage-R/llvm/include -fPIC -fvisibility-inlines-hidden -Werror=date-time -Werror=unguarded-availability-new -std=c++11 -fmodules -fmodules-cache-path=/Users/buildslave/jenkins/workspace/clang-stage2-coverage-R/clang-build/module.cache -fcxx-modules -Wall -Wextra -Wno-unused-parameter -Wwrite-strings -Wcast-qual -Wmissing-field-initializers -pedantic -Wno-long-long -Wimplicit-fallthrough -Wcovered-switch-default -Wno-noexcept-type -Wnon-virtual-dtor -Wdelete-non-virtual-dtor -Wstring-conversion -fdiagnostics-color -fprofile-instr-generate='/Users/buildslave/jenkins/workspace/clang-stage2-coverage-R/clang-build/profiles/%6m.profraw' -fcoverage-mapping -fno-common -Woverloaded-virtual -Wno-nested-anon-types -O3 -DNDEBUG -isysroot /Applications/Xcode.app/Contents/Developer/Platforms/MacOSX.platform/Developer/SDKs/MacOSX10.14.sdk    -fno-exceptions -fno-rtti -MD -MT tools/clang/lib/Basic/CMakeFiles/obj.clangBasic.dir/ObjCRuntime.cpp.o -MF tools/clang/lib/Basic/CMakeFiles/obj.clangBasic.dir/ObjCRuntime.cpp.o.d -o tools/clang/lib/Basic/CMakeFiles/obj.clangBasic.dir/ObjCRuntime.cpp.o -c /Users/buildslave/jenkins/workspace/clang-stage2-coverage-R/llvm/tools/clang/lib/Basic/ObjCRuntime.cpp
[3007/4610] /Users/buildslave/jenkins/workspace/clang-stage2-coverage-R/host-compiler/bin/clang++  -DGTEST_HAS_RTTI=0 -D_GNU_SOURCE -D__STDC_CONSTANT_MACROS -D__STDC_FORMAT_MACROS -D__STDC_LIMIT_MACROS -Itools/clang/lib/Basic -I/Users/buildslave/jenkins/workspace/clang-stage2-coverage-R/llvm/tools/clang/lib/Basic -I/Users/buildslave/jenkins/workspace/clang-stage2-coverage-R/llvm/tools/clang/include -Itools/clang/include -I/Applications/Xcode.app/Contents/Developer/Platforms/MacOSX.platform/Developer/SDKs/MacOSX10.14.sdk/usr/include/libxml2 -Iinclude -I/Users/buildslave/jenkins/workspace/clang-stage2-coverage-R/llvm/include -fPIC -fvisibility-inlines-hidden -Werror=date-time -Werror=unguarded-availability-new -std=c++11 -fmodules -fmodules-cache-path=/Users/buildslave/jenkins/workspace/clang-stage2-coverage-R/clang-build/module.cache -fcxx-modules -Wall -Wextra -Wno-unused-parameter -Wwrite-strings -Wcast-qual -Wmissing-field-initializers -pedantic -Wno-long-long -Wimplicit-fallthrough -Wcovered-switch-default -Wno-noexcept-type -Wnon-virtual-dtor -Wdelete-non-virtual-dtor -Wstring-conversion -fdiagnostics-color -fprofile-instr-generate='/Users/buildslave/jenkins/workspace/clang-stage2-coverage-R/clang-build/profiles/%6m.profraw' -fcoverage-mapping -fno-common -Woverloaded-virtual -Wno-nested-anon-types -O3 -DNDEBUG -isysroot /Applications/Xcode.app/Contents/Developer/Platforms/MacOSX.platform/Developer/SDKs/MacOSX10.14.sdk    -fno-exceptions -fno-rtti -MD -MT tools/clang/lib/Basic/CMakeFiles/obj.clangBasic.dir/OperatorPrecedence.cpp.o -MF tools/clang/lib/Basic/CMakeFiles/obj.clangBasic.dir/OperatorPrecedence.cpp.o.d -o tools/clang/lib/Basic/CMakeFiles/obj.clangBasic.dir/OperatorPrecedence.cpp.o -c /Users/buildslave/jenkins/workspace/clang-stage2-coverage-R/llvm/tools/clang/lib/Basic/OperatorPrecedence.cpp
[3008/4610] /Users/buildslave/jenkins/workspace/clang-stage2-coverage-R/host-compiler/bin/clang++  -DGTEST_HAS_RTTI=0 -D_GNU_SOURCE -D__STDC_CONSTANT_MACROS -D__STDC_FORMAT_MACROS -D__STDC_LIMIT_MACROS -Itools/clang/lib/Basic -I/Users/buildslave/jenkins/workspace/clang-stage2-coverage-R/llvm/tools/clang/lib/Basic -I/Users/buildslave/jenkins/workspace/clang-stage2-coverage-R/llvm/tools/clang/include -Itools/clang/include -I/Applications/Xcode.app/Contents/Developer/Platforms/MacOSX.platform/Developer/SDKs/MacOSX10.14.sdk/usr/include/libxml2 -Iinclude -I/Users/buildslave/jenkins/workspace/clang-stage2-coverage-R/llvm/include -fPIC -fvisibility-inlines-hidden -Werror=date-time -Werror=unguarded-availability-new -std=c++11 -fmodules -fmodules-cache-path=/Users/buildslave/jenkins/workspace/clang-stage2-coverage-R/clang-build/module.cache -fcxx-modules -Wall -Wextra -Wno-unused-parameter -Wwrite-strings -Wcast-qual -Wmissing-field-initializers -pedantic -Wno-long-long -Wimplicit-fallthrough -Wcovered-switch-default -Wno-noexcept-type -Wnon-virtual-dtor -Wdelete-non-virtual-dtor -Wstring-conversion -fdiagnostics-color -fprofile-instr-generate='/Users/buildslave/jenkins/workspace/clang-stage2-coverage-R/clang-build/profiles/%6m.profraw' -fcoverage-mapping -fno-common -Woverloaded-virtual -Wno-nested-anon-types -O3 -DNDEBUG -isysroot /Applications/Xcode.app/Contents/Developer/Platforms/MacOSX.platform/Developer/SDKs/MacOSX10.14.sdk    -fno-exceptions -fno-rtti -MD -MT tools/clang/lib/Basic/CMakeFiles/obj.clangBasic.dir/SanitizerBlacklist.cpp.o -MF tools/clang/lib/Basic/CMakeFiles/obj.clangBasic.dir/SanitizerBlacklist.cpp.o.d -o tools/clang/lib/Basic/CMakeFiles/obj.clangBasic.dir/SanitizerBlacklist.cpp.o -c /Users/buildslave/jenkins/workspace/clang-stage2-coverage-R/llvm/tools/clang/lib/Basic/SanitizerBlacklist.cpp
[3009/4610] /Users/buildslave/jenkins/workspace/clang-stage2-coverage-R/host-compiler/bin/clang++  -DGTEST_HAS_RTTI=0 -D_GNU_SOURCE -D__STDC_CONSTANT_MACROS -D__STDC_FORMAT_MACROS -D__STDC_LIMIT_MACROS -Itools/clang/lib/Basic -I/Users/buildslave/jenkins/workspace/clang-stage2-coverage-R/llvm/tools/clang/lib/Basic -I/Users/buildslave/jenkins/workspace/clang-stage2-coverage-R/llvm/tools/clang/include -Itools/clang/include -I/Applications/Xcode.app/Contents/Developer/Platforms/MacOSX.platform/Developer/SDKs/MacOSX10.14.sdk/usr/include/libxml2 -Iinclude -I/Users/buildslave/jenkins/workspace/clang-stage2-coverage-R/llvm/include -fPIC -fvisibility-inlines-hidden -Werror=date-time -Werror=unguarded-availability-new -std=c++11 -fmodules -fmodules-cache-path=/Users/buildslave/jenkins/workspace/clang-stage2-coverage-R/clang-build/module.cache -fcxx-modules -Wall -Wextra -Wno-unused-parameter -Wwrite-strings -Wcast-qual -Wmissing-field-initializers -pedantic -Wno-long-long -Wimplicit-fallthrough -Wcovered-switch-default -Wno-noexcept-type -Wnon-virtual-dtor -Wdelete-non-virtual-dtor -Wstring-conversion -fdiagnostics-color -fprofile-instr-generate='/Users/buildslave/jenkins/workspace/clang-stage2-coverage-R/clang-build/profiles/%6m.profraw' -fcoverage-mapping -fno-common -Woverloaded-virtual -Wno-nested-anon-types -O3 -DNDEBUG -isysroot /Applications/Xcode.app/Contents/Developer/Platforms/MacOSX.platform/Developer/SDKs/MacOSX10.14.sdk    -fno-exceptions -fno-rtti -MD -MT tools/clang/lib/Basic/CMakeFiles/obj.clangBasic.dir/OpenMPKinds.cpp.o -MF tools/clang/lib/Basic/CMakeFiles/obj.clangBasic.dir/OpenMPKinds.cpp.o.d -o tools/clang/lib/Basic/CMakeFiles/obj.clangBasic.dir/OpenMPKinds.cpp.o -c /Users/buildslave/jenkins/workspace/clang-stage2-coverage-R/llvm/tools/clang/lib/Basic/OpenMPKinds.cpp
[3010/4610] /Users/buildslave/jenkins/workspace/clang-stage2-coverage-R/host-compiler/bin/clang++  -DGTEST_HAS_RTTI=0 -D_GNU_SOURCE -D__STDC_CONSTANT_MACROS -D__STDC_FORMAT_MACROS -D__STDC_LIMIT_MACROS -Itools/clang/lib/Basic -I/Users/buildslave/jenkins/workspace/clang-stage2-coverage-R/llvm/tools/clang/lib/Basic -I/Users/buildslave/jenkins/workspace/clang-stage2-coverage-R/llvm/tools/clang/include -Itools/clang/include -I/Applications/Xcode.app/Contents/Developer/Platforms/MacOSX.platform/Developer/SDKs/MacOSX10.14.sdk/usr/include/libxml2 -Iinclude -I/Users/buildslave/jenkins/workspace/clang-stage2-coverage-R/llvm/include -fPIC -fvisibility-inlines-hidden -Werror=date-time -Werror=unguarded-availability-new -std=c++11 -fmodules -fmodules-cache-path=/Users/buildslave/jenkins/workspace/clang-stage2-coverage-R/clang-build/module.cache -fcxx-modules -Wall -Wextra -Wno-unused-parameter -Wwrite-strings -Wcast-qual -Wmissing-field-initializers -pedantic -Wno-long-long -Wimplicit-fallthrough -Wcovered-switch-default -Wno-noexcept-type -Wnon-virtual-dtor -Wdelete-non-virtual-dtor -Wstring-conversion -fdiagnostics-color -fprofile-instr-generate='/Users/buildslave/jenkins/workspace/clang-stage2-coverage-R/clang-build/profiles/%6m.profraw' -fcoverage-mapping -fno-common -Woverloaded-virtual -Wno-nested-anon-types -O3 -DNDEBUG -isysroot /Applications/Xcode.app/Contents/Developer/Platforms/MacOSX.platform/Developer/SDKs/MacOSX10.14.sdk    -fno-exceptions -fno-rtti -MD -MT tools/clang/lib/Basic/CMakeFiles/obj.clangBasic.dir/IdentifierTable.cpp.o -MF tools/clang/lib/Basic/CMakeFiles/obj.clangBasic.dir/IdentifierTable.cpp.o.d -o tools/clang/lib/Basic/CMakeFiles/obj.clangBasic.dir/IdentifierTable.cpp.o -c /Users/buildslave/jenkins/workspace/clang-stage2-coverage-R/llvm/tools/clang/lib/Basic/IdentifierTable.cpp
[3011/4610] /Users/buildslave/jenkins/workspace/clang-stage2-coverage-R/host-compiler/bin/clang++  -DGTEST_HAS_RTTI=0 -D_GNU_SOURCE -D__STDC_CONSTANT_MACROS -D__STDC_FORMAT_MACROS -D__STDC_LIMIT_MACROS -Itools/clang/lib/Basic -I/Users/buildslave/jenkins/workspace/clang-stage2-coverage-R/llvm/tools/clang/lib/Basic -I/Users/buildslave/jenkins/workspace/clang-stage2-coverage-R/llvm/tools/clang/include -Itools/clang/include -I/Applications/Xcode.app/Contents/Developer/Platforms/MacOSX.platform/Developer/SDKs/MacOSX10.14.sdk/usr/include/libxml2 -Iinclude -I/Users/buildslave/jenkins/workspace/clang-stage2-coverage-R/llvm/include -fPIC -fvisibility-inlines-hidden -Werror=date-time -Werror=unguarded-availability-new -std=c++11 -fmodules -fmodules-cache-path=/Users/buildslave/jenkins/workspace/clang-stage2-coverage-R/clang-build/module.cache -fcxx-modules -Wall -Wextra -Wno-unused-parameter -Wwrite-strings -Wcast-qual -Wmissing-field-initializers -pedantic -Wno-long-long -Wimplicit-fallthrough -Wcovered-switch-default -Wno-noexcept-type -Wnon-virtual-dtor -Wdelete-non-virtual-dtor -Wstring-conversion -fdiagnostics-color -fprofile-instr-generate='/Users/buildslave/jenkins/workspace/clang-stage2-coverage-R/clang-build/profiles/%6m.profraw' -fcoverage-mapping -fno-common -Woverloaded-virtual -Wno-nested-anon-types -O3 -DNDEBUG -isysroot /Applications/Xcode.app/Contents/Developer/Platforms/MacOSX.platform/Developer/SDKs/MacOSX10.14.sdk    -fno-exceptions -fno-rtti -MD -MT tools/clang/lib/Basic/CMakeFiles/obj.clangBasic.dir/Sanitizers.cpp.o -MF tools/clang/lib/Basic/CMakeFiles/obj.clangBasic.dir/Sanitizers.cpp.o.d -o tools/clang/lib/Basic/CMakeFiles/obj.clangBasic.dir/Sanitizers.cpp.o -c /Users/buildslave/jenkins/workspace/clang-stage2-coverage-R/llvm/tools/clang/lib/Basic/Sanitizers.cpp
[3012/4610] /Users/buildslave/jenkins/workspace/clang-stage2-coverage-R/host-compiler/bin/clang++  -DGTEST_HAS_RTTI=0 -D_GNU_SOURCE -D__STDC_CONSTANT_MACROS -D__STDC_FORMAT_MACROS -D__STDC_LIMIT_MACROS -Itools/clang/lib/Basic -I/Users/buildslave/jenkins/workspace/clang-stage2-coverage-R/llvm/tools/clang/lib/Basic -I/Users/buildslave/jenkins/workspace/clang-stage2-coverage-R/llvm/tools/clang/include -Itools/clang/include -I/Applications/Xcode.app/Contents/Developer/Platforms/MacOSX.platform/Developer/SDKs/MacOSX10.14.sdk/usr/include/libxml2 -Iinclude -I/Users/buildslave/jenkins/workspace/clang-stage2-coverage-R/llvm/include -fPIC -fvisibility-inlines-hidden -Werror=date-time -Werror=unguarded-availability-new -std=c++11 -fmodules -fmodules-cache-path=/Users/buildslave/jenkins/workspace/clang-stage2-coverage-R/clang-build/module.cache -fcxx-modules -Wall -Wextra -Wno-unused-parameter -Wwrite-strings -Wcast-qual -Wmissing-field-initializers -pedantic -Wno-long-long -Wimplicit-fallthrough -Wcovered-switch-default -Wno-noexcept-type -Wnon-virtual-dtor -Wdelete-non-virtual-dtor -Wstring-conversion -fdiagnostics-color -fprofile-instr-generate='/Users/buildslave/jenkins/workspace/clang-stage2-coverage-R/clang-build/profiles/%6m.profraw' -fcoverage-mapping -fno-common -Woverloaded-virtual -Wno-nested-anon-types -O3 -DNDEBUG -isysroot /Applications/Xcode.app/Contents/Developer/Platforms/MacOSX.platform/Developer/SDKs/MacOSX10.14.sdk    -fno-exceptions -fno-rtti -MD -MT tools/clang/lib/Basic/CMakeFiles/obj.clangBasic.dir/SanitizerSpecialCaseList.cpp.o -MF tools/clang/lib/Basic/CMakeFiles/obj.clangBasic.dir/SanitizerSpecialCaseList.cpp.o.d -o tools/clang/lib/Basic/CMakeFiles/obj.clangBasic.dir/SanitizerSpecialCaseList.cpp.o -c /Users/buildslave/jenkins/workspace/clang-stage2-coverage-R/llvm/tools/clang/lib/Basic/SanitizerSpecialCaseList.cpp
[3013/4610] /Users/buildslave/jenkins/workspace/clang-stage2-coverage-R/host-compiler/bin/clang++  -DGTEST_HAS_RTTI=0 -D_GNU_SOURCE -D__STDC_CONSTANT_MACROS -D__STDC_FORMAT_MACROS -D__STDC_LIMIT_MACROS -Itools/clang/lib/Basic -I/Users/buildslave/jenkins/workspace/clang-stage2-coverage-R/llvm/tools/clang/lib/Basic -I/Users/buildslave/jenkins/workspace/clang-stage2-coverage-R/llvm/tools/clang/include -Itools/clang/include -I/Applications/Xcode.app/Contents/Developer/Platforms/MacOSX.platform/Developer/SDKs/MacOSX10.14.sdk/usr/include/libxml2 -Iinclude -I/Users/buildslave/jenkins/workspace/clang-stage2-coverage-R/llvm/include -fPIC -fvisibility-inlines-hidden -Werror=date-time -Werror=unguarded-availability-new -std=c++11 -fmodules -fmodules-cache-path=/Users/buildslave/jenkins/workspace/clang-stage2-coverage-R/clang-build/module.cache -fcxx-modules -Wall -Wextra -Wno-unused-parameter -Wwrite-strings -Wcast-qual -Wmissing-field-initializers -pedantic -Wno-long-long -Wimplicit-fallthrough -Wcovered-switch-default -Wno-noexcept-type -Wnon-virtual-dtor -Wdelete-non-virtual-dtor -Wstring-conversion -fdiagnostics-color -fprofile-instr-generate='/Users/buildslave/jenkins/workspace/clang-stage2-coverage-R/clang-build/profiles/%6m.profraw' -fcoverage-mapping -fno-common -Woverloaded-virtual -Wno-nested-anon-types -O3 -DNDEBUG -isysroot /Applications/Xcode.app/Contents/Developer/Platforms/MacOSX.platform/Developer/SDKs/MacOSX10.14.sdk    -fno-exceptions -fno-rtti -MD -MT tools/clang/lib/Basic/CMakeFiles/obj.clangBasic.dir/SourceLocation.cpp.o -MF tools/clang/lib/Basic/CMakeFiles/obj.clangBasic.dir/SourceLocation.cpp.o.d -o tools/clang/lib/Basic/CMakeFiles/obj.clangBasic.dir/SourceLocation.cpp.o -c /Users/buildslave/jenkins/workspace/clang-stage2-coverage-R/llvm/tools/clang/lib/Basic/SourceLocation.cpp
[3014/4610] /Users/buildslave/jenkins/workspace/clang-stage2-coverage-R/host-compiler/bin/clang++  -DGTEST_HAS_RTTI=0 -D_GNU_SOURCE -D__STDC_CONSTANT_MACROS -D__STDC_FORMAT_MACROS -D__STDC_LIMIT_MACROS -Itools/clang/lib/Basic -I/Users/buildslave/jenkins/workspace/clang-stage2-coverage-R/llvm/tools/clang/lib/Basic -I/Users/buildslave/jenkins/workspace/clang-stage2-coverage-R/llvm/tools/clang/include -Itools/clang/include -I/Applications/Xcode.app/Contents/Developer/Platforms/MacOSX.platform/Developer/SDKs/MacOSX10.14.sdk/usr/include/libxml2 -Iinclude -I/Users/buildslave/jenkins/workspace/clang-stage2-coverage-R/llvm/include -fPIC -fvisibility-inlines-hidden -Werror=date-time -Werror=unguarded-availability-new -std=c++11 -fmodules -fmodules-cache-path=/Users/buildslave/jenkins/workspace/clang-stage2-coverage-R/clang-build/module.cache -fcxx-modules -Wall -Wextra -Wno-unused-parameter -Wwrite-strings -Wcast-qual -Wmissing-field-initializers -pedantic -Wno-long-long -Wimplicit-fallthrough -Wcovered-switch-default -Wno-noexcept-type -Wnon-virtual-dtor -Wdelete-non-virtual-dtor -Wstring-conversion -fdiagnostics-color -fprofile-instr-generate='/Users/buildslave/jenkins/workspace/clang-stage2-coverage-R/clang-build/profiles/%6m.profraw' -fcoverage-mapping -fno-common -Woverloaded-virtual -Wno-nested-anon-types -O3 -DNDEBUG -isysroot /Applications/Xcode.app/Contents/Developer/Platforms/MacOSX.platform/Developer/SDKs/MacOSX10.14.sdk    -fno-exceptions -fno-rtti -MD -MT tools/clang/lib/Basic/CMakeFiles/obj.clangBasic.dir/Module.cpp.o -MF tools/clang/lib/Basic/CMakeFiles/obj.clangBasic.dir/Module.cpp.o.d -o tools/clang/lib/Basic/CMakeFiles/obj.clangBasic.dir/Module.cpp.o -c /Users/buildslave/jenkins/workspace/clang-stage2-coverage-R/llvm/tools/clang/lib/Basic/Module.cpp
[3015/4610] /Users/buildslave/jenkins/workspace/clang-stage2-coverage-R/host-compiler/bin/clang++  -DGTEST_HAS_RTTI=0 -D_GNU_SOURCE -D__STDC_CONSTANT_MACROS -D__STDC_FORMAT_MACROS -D__STDC_LIMIT_MACROS -Itools/clang/lib/Basic -I/Users/buildslave/jenkins/workspace/clang-stage2-coverage-R/llvm/tools/clang/lib/Basic -I/Users/buildslave/jenkins/workspace/clang-stage2-coverage-R/llvm/tools/clang/include -Itools/clang/include -I/Applications/Xcode.app/Contents/Developer/Platforms/MacOSX.platform/Developer/SDKs/MacOSX10.14.sdk/usr/include/libxml2 -Iinclude -I/Users/buildslave/jenkins/workspace/clang-stage2-coverage-R/llvm/include -fPIC -fvisibility-inlines-hidden -Werror=date-time -Werror=unguarded-availability-new -std=c++11 -fmodules -fmodules-cache-path=/Users/buildslave/jenkins/workspace/clang-stage2-coverage-R/clang-build/module.cache -fcxx-modules -Wall -Wextra -Wno-unused-parameter -Wwrite-strings -Wcast-qual -Wmissing-field-initializers -pedantic -Wno-long-long -Wimplicit-fallthrough -Wcovered-switch-default -Wno-noexcept-type -Wnon-virtual-dtor -Wdelete-non-virtual-dtor -Wstring-conversion -fdiagnostics-color -fprofile-instr-generate='/Users/buildslave/jenkins/workspace/clang-stage2-coverage-R/clang-build/profiles/%6m.profraw' -fcoverage-mapping -fno-common -Woverloaded-virtual -Wno-nested-anon-types -O3 -DNDEBUG -isysroot /Applications/Xcode.app/Contents/Developer/Platforms/MacOSX.platform/Developer/SDKs/MacOSX10.14.sdk    -fno-exceptions -fno-rtti -MD -MT tools/clang/lib/Basic/CMakeFiles/obj.clangBasic.dir/TargetInfo.cpp.o -MF tools/clang/lib/Basic/CMakeFiles/obj.clangBasic.dir/TargetInfo.cpp.o.d -o tools/clang/lib/Basic/CMakeFiles/obj.clangBasic.dir/TargetInfo.cpp.o -c /Users/buildslave/jenkins/workspace/clang-stage2-coverage-R/llvm/tools/clang/lib/Basic/TargetInfo.cpp
[3016/4610] /Users/buildslave/jenkins/workspace/clang-stage2-coverage-R/host-compiler/bin/clang++  -DGTEST_HAS_RTTI=0 -D_GNU_SOURCE -D__STDC_CONSTANT_MACROS -D__STDC_FORMAT_MACROS -D__STDC_LIMIT_MACROS -Itools/clang/lib/Basic -I/Users/buildslave/jenkins/workspace/clang-stage2-coverage-R/llvm/tools/clang/lib/Basic -I/Users/buildslave/jenkins/workspace/clang-stage2-coverage-R/llvm/tools/clang/include -Itools/clang/include -I/Applications/Xcode.app/Contents/Developer/Platforms/MacOSX.platform/Developer/SDKs/MacOSX10.14.sdk/usr/include/libxml2 -Iinclude -I/Users/buildslave/jenkins/workspace/clang-stage2-coverage-R/llvm/include -fPIC -fvisibility-inlines-hidden -Werror=date-time -Werror=unguarded-availability-new -std=c++11 -fmodules -fmodules-cache-path=/Users/buildslave/jenkins/workspace/clang-stage2-coverage-R/clang-build/module.cache -fcxx-modules -Wall -Wextra -Wno-unused-parameter -Wwrite-strings -Wcast-qual -Wmissing-field-initializers -pedantic -Wno-long-long -Wimplicit-fallthrough -Wcovered-switch-default -Wno-noexcept-type -Wnon-virtual-dtor -Wdelete-non-virtual-dtor -Wstring-conversion -fdiagnostics-color -fprofile-instr-generate='/Users/buildslave/jenkins/workspace/clang-stage2-coverage-R/clang-build/profiles/%6m.profraw' -fcoverage-mapping -fno-common -Woverloaded-virtual -Wno-nested-anon-types -O3 -DNDEBUG -isysroot /Applications/Xcode.app/Contents/Developer/Platforms/MacOSX.platform/Developer/SDKs/MacOSX10.14.sdk    -fno-exceptions -fno-rtti -MD -MT tools/clang/lib/Basic/CMakeFiles/obj.clangBasic.dir/Targets/AArch64.cpp.o -MF tools/clang/lib/Basic/CMakeFiles/obj.clangBasic.dir/Targets/AArch64.cpp.o.d -o tools/clang/lib/Basic/CMakeFiles/obj.clangBasic.dir/Targets/AArch64.cpp.o -c /Users/buildslave/jenkins/workspace/clang-stage2-coverage-R/llvm/tools/clang/lib/Basic/Targets/AArch64.cpp
[3017/4610] /Users/buildslave/jenkins/workspace/clang-stage2-coverage-R/host-compiler/bin/clang++  -DGTEST_HAS_RTTI=0 -D_GNU_SOURCE -D__STDC_CONSTANT_MACROS -D__STDC_FORMAT_MACROS -D__STDC_LIMIT_MACROS -Itools/clang/lib/Basic -I/Users/buildslave/jenkins/workspace/clang-stage2-coverage-R/llvm/tools/clang/lib/Basic -I/Users/buildslave/jenkins/workspace/clang-stage2-coverage-R/llvm/tools/clang/include -Itools/clang/include -I/Applications/Xcode.app/Contents/Developer/Platforms/MacOSX.platform/Developer/SDKs/MacOSX10.14.sdk/usr/include/libxml2 -Iinclude -I/Users/buildslave/jenkins/workspace/clang-stage2-coverage-R/llvm/include -fPIC -fvisibility-inlines-hidden -Werror=date-time -Werror=unguarded-availability-new -std=c++11 -fmodules -fmodules-cache-path=/Users/buildslave/jenkins/workspace/clang-stage2-coverage-R/clang-build/module.cache -fcxx-modules -Wall -Wextra -Wno-unused-parameter -Wwrite-strings -Wcast-qual -Wmissing-field-initializers -pedantic -Wno-long-long -Wimplicit-fallthrough -Wcovered-switch-default -Wno-noexcept-type -Wnon-virtual-dtor -Wdelete-non-virtual-dtor -Wstring-conversion -fdiagnostics-color -fprofile-instr-generate='/Users/buildslave/jenkins/workspace/clang-stage2-coverage-R/clang-build/profiles/%6m.profraw' -fcoverage-mapping -fno-common -Woverloaded-virtual -Wno-nested-anon-types -O3 -DNDEBUG -isysroot /Applications/Xcode.app/Contents/Developer/Platforms/MacOSX.platform/Developer/SDKs/MacOSX10.14.sdk    -fno-exceptions -fno-rtti -MD -MT tools/clang/lib/Basic/CMakeFiles/obj.clangBasic.dir/Targets/AMDGPU.cpp.o -MF tools/clang/lib/Basic/CMakeFiles/obj.clangBasic.dir/Targets/AMDGPU.cpp.o.d -o tools/clang/lib/Basic/CMakeFiles/obj.clangBasic.dir/Targets/AMDGPU.cpp.o -c /Users/buildslave/jenkins/workspace/clang-stage2-coverage-R/llvm/tools/clang/lib/Basic/Targets/AMDGPU.cpp
[3018/4610] /Users/buildslave/jenkins/workspace/clang-stage2-coverage-R/host-compiler/bin/clang++  -DGTEST_HAS_RTTI=0 -D_GNU_SOURCE -D__STDC_CONSTANT_MACROS -D__STDC_FORMAT_MACROS -D__STDC_LIMIT_MACROS -Itools/clang/lib/Basic -I/Users/buildslave/jenkins/workspace/clang-stage2-coverage-R/llvm/tools/clang/lib/Basic -I/Users/buildslave/jenkins/workspace/clang-stage2-coverage-R/llvm/tools/clang/include -Itools/clang/include -I/Applications/Xcode.app/Contents/Developer/Platforms/MacOSX.platform/Developer/SDKs/MacOSX10.14.sdk/usr/include/libxml2 -Iinclude -I/Users/buildslave/jenkins/workspace/clang-stage2-coverage-R/llvm/include -fPIC -fvisibility-inlines-hidden -Werror=date-time -Werror=unguarded-availability-new -std=c++11 -fmodules -fmodules-cache-path=/Users/buildslave/jenkins/workspace/clang-stage2-coverage-R/clang-build/module.cache -fcxx-modules -Wall -Wextra -Wno-unused-parameter -Wwrite-strings -Wcast-qual -Wmissing-field-initializers -pedantic -Wno-long-long -Wimplicit-fallthrough -Wcovered-switch-default -Wno-noexcept-type -Wnon-virtual-dtor -Wdelete-non-virtual-dtor -Wstring-conversion -fdiagnostics-color -fprofile-instr-generate='/Users/buildslave/jenkins/workspace/clang-stage2-coverage-R/clang-build/profiles/%6m.profraw' -fcoverage-mapping -fno-common -Woverloaded-virtual -Wno-nested-anon-types -O3 -DNDEBUG -isysroot /Applications/Xcode.app/Contents/Developer/Platforms/MacOSX.platform/Developer/SDKs/MacOSX10.14.sdk    -fno-exceptions -fno-rtti -MD -MT tools/clang/lib/Basic/CMakeFiles/obj.clangBasic.dir/Targets/ARC.cpp.o -MF tools/clang/lib/Basic/CMakeFiles/obj.clangBasic.dir/Targets/ARC.cpp.o.d -o tools/clang/lib/Basic/CMakeFiles/obj.clangBasic.dir/Targets/ARC.cpp.o -c /Users/buildslave/jenkins/workspace/clang-stage2-coverage-R/llvm/tools/clang/lib/Basic/Targets/ARC.cpp
[3019/4610] /Users/buildslave/jenkins/workspace/clang-stage2-coverage-R/host-compiler/bin/clang++  -DGTEST_HAS_RTTI=0 -D_GNU_SOURCE -D__STDC_CONSTANT_MACROS -D__STDC_FORMAT_MACROS -D__STDC_LIMIT_MACROS -Itools/clang/lib/Basic -I/Users/buildslave/jenkins/workspace/clang-stage2-coverage-R/llvm/tools/clang/lib/Basic -I/Users/buildslave/jenkins/workspace/clang-stage2-coverage-R/llvm/tools/clang/include -Itools/clang/include -I/Applications/Xcode.app/Contents/Developer/Platforms/MacOSX.platform/Developer/SDKs/MacOSX10.14.sdk/usr/include/libxml2 -Iinclude -I/Users/buildslave/jenkins/workspace/clang-stage2-coverage-R/llvm/include -fPIC -fvisibility-inlines-hidden -Werror=date-time -Werror=unguarded-availability-new -std=c++11 -fmodules -fmodules-cache-path=/Users/buildslave/jenkins/workspace/clang-stage2-coverage-R/clang-build/module.cache -fcxx-modules -Wall -Wextra -Wno-unused-parameter -Wwrite-strings -Wcast-qual -Wmissing-field-initializers -pedantic -Wno-long-long -Wimplicit-fallthrough -Wcovered-switch-default -Wno-noexcept-type -Wnon-virtual-dtor -Wdelete-non-virtual-dtor -Wstring-conversion -fdiagnostics-color -fprofile-instr-generate='/Users/buildslave/jenkins/workspace/clang-stage2-coverage-R/clang-build/profiles/%6m.profraw' -fcoverage-mapping -fno-common -Woverloaded-virtual -Wno-nested-anon-types -O3 -DNDEBUG -isysroot /Applications/Xcode.app/Contents/Developer/Platforms/MacOSX.platform/Developer/SDKs/MacOSX10.14.sdk    -fno-exceptions -fno-rtti -MD -MT tools/clang/lib/Basic/CMakeFiles/obj.clangBasic.dir/Targets/AVR.cpp.o -MF tools/clang/lib/Basic/CMakeFiles/obj.clangBasic.dir/Targets/AVR.cpp.o.d -o tools/clang/lib/Basic/CMakeFiles/obj.clangBasic.dir/Targets/AVR.cpp.o -c /Users/buildslave/jenkins/workspace/clang-stage2-coverage-R/llvm/tools/clang/lib/Basic/Targets/AVR.cpp
[3020/4610] /Users/buildslave/jenkins/workspace/clang-stage2-coverage-R/host-compiler/bin/clang++  -DGTEST_HAS_RTTI=0 -D_GNU_SOURCE -D__STDC_CONSTANT_MACROS -D__STDC_FORMAT_MACROS -D__STDC_LIMIT_MACROS -Itools/clang/lib/Basic -I/Users/buildslave/jenkins/workspace/clang-stage2-coverage-R/llvm/tools/clang/lib/Basic -I/Users/buildslave/jenkins/workspace/clang-stage2-coverage-R/llvm/tools/clang/include -Itools/clang/include -I/Applications/Xcode.app/Contents/Developer/Platforms/MacOSX.platform/Developer/SDKs/MacOSX10.14.sdk/usr/include/libxml2 -Iinclude -I/Users/buildslave/jenkins/workspace/clang-stage2-coverage-R/llvm/include -fPIC -fvisibility-inlines-hidden -Werror=date-time -Werror=unguarded-availability-new -std=c++11 -fmodules -fmodules-cache-path=/Users/buildslave/jenkins/workspace/clang-stage2-coverage-R/clang-build/module.cache -fcxx-modules -Wall -Wextra -Wno-unused-parameter -Wwrite-strings -Wcast-qual -Wmissing-field-initializers -pedantic -Wno-long-long -Wimplicit-fallthrough -Wcovered-switch-default -Wno-noexcept-type -Wnon-virtual-dtor -Wdelete-non-virtual-dtor -Wstring-conversion -fdiagnostics-color -fprofile-instr-generate='/Users/buildslave/jenkins/workspace/clang-stage2-coverage-R/clang-build/profiles/%6m.profraw' -fcoverage-mapping -fno-common -Woverloaded-virtual -Wno-nested-anon-types -O3 -DNDEBUG -isysroot /Applications/Xcode.app/Contents/Developer/Platforms/MacOSX.platform/Developer/SDKs/MacOSX10.14.sdk    -fno-exceptions -fno-rtti -MD -MT tools/clang/lib/Basic/CMakeFiles/obj.clangBasic.dir/Targets.cpp.o -MF tools/clang/lib/Basic/CMakeFiles/obj.clangBasic.dir/Targets.cpp.o.d -o tools/clang/lib/Basic/CMakeFiles/obj.clangBasic.dir/Targets.cpp.o -c /Users/buildslave/jenkins/workspace/clang-stage2-coverage-R/llvm/tools/clang/lib/Basic/Targets.cpp
[3021/4610] /Users/buildslave/jenkins/workspace/clang-stage2-coverage-R/host-compiler/bin/clang++  -DGTEST_HAS_RTTI=0 -D_GNU_SOURCE -D__STDC_CONSTANT_MACROS -D__STDC_FORMAT_MACROS -D__STDC_LIMIT_MACROS -Itools/clang/lib/Basic -I/Users/buildslave/jenkins/workspace/clang-stage2-coverage-R/llvm/tools/clang/lib/Basic -I/Users/buildslave/jenkins/workspace/clang-stage2-coverage-R/llvm/tools/clang/include -Itools/clang/include -I/Applications/Xcode.app/Contents/Developer/Platforms/MacOSX.platform/Developer/SDKs/MacOSX10.14.sdk/usr/include/libxml2 -Iinclude -I/Users/buildslave/jenkins/workspace/clang-stage2-coverage-R/llvm/include -fPIC -fvisibility-inlines-hidden -Werror=date-time -Werror=unguarded-availability-new -std=c++11 -fmodules -fmodules-cache-path=/Users/buildslave/jenkins/workspace/clang-stage2-coverage-R/clang-build/module.cache -fcxx-modules -Wall -Wextra -Wno-unused-parameter -Wwrite-strings -Wcast-qual -Wmissing-field-initializers -pedantic -Wno-long-long -Wimplicit-fallthrough -Wcovered-switch-default -Wno-noexcept-type -Wnon-virtual-dtor -Wdelete-non-virtual-dtor -Wstring-conversion -fdiagnostics-color -fprofile-instr-generate='/Users/buildslave/jenkins/workspace/clang-stage2-coverage-R/clang-build/profiles/%6m.profraw' -fcoverage-mapping -fno-common -Woverloaded-virtual -Wno-nested-anon-types -O3 -DNDEBUG -isysroot /Applications/Xcode.app/Contents/Developer/Platforms/MacOSX.platform/Developer/SDKs/MacOSX10.14.sdk    -fno-exceptions -fno-rtti -MD -MT tools/clang/lib/Basic/CMakeFiles/obj.clangBasic.dir/Targets/BPF.cpp.o -MF tools/clang/lib/Basic/CMakeFiles/obj.clangBasic.dir/Targets/BPF.cpp.o.d -o tools/clang/lib/Basic/CMakeFiles/obj.clangBasic.dir/Targets/BPF.cpp.o -c /Users/buildslave/jenkins/workspace/clang-stage2-coverage-R/llvm/tools/clang/lib/Basic/Targets/BPF.cpp
[3022/4610] /Users/buildslave/jenkins/workspace/clang-stage2-coverage-R/host-compiler/bin/clang++  -DGTEST_HAS_RTTI=0 -D_GNU_SOURCE -D__STDC_CONSTANT_MACROS -D__STDC_FORMAT_MACROS -D__STDC_LIMIT_MACROS -Itools/clang/lib/Basic -I/Users/buildslave/jenkins/workspace/clang-stage2-coverage-R/llvm/tools/clang/lib/Basic -I/Users/buildslave/jenkins/workspace/clang-stage2-coverage-R/llvm/tools/clang/include -Itools/clang/include -I/Applications/Xcode.app/Contents/Developer/Platforms/MacOSX.platform/Developer/SDKs/MacOSX10.14.sdk/usr/include/libxml2 -Iinclude -I/Users/buildslave/jenkins/workspace/clang-stage2-coverage-R/llvm/include -fPIC -fvisibility-inlines-hidden -Werror=date-time -Werror=unguarded-availability-new -std=c++11 -fmodules -fmodules-cache-path=/Users/buildslave/jenkins/workspace/clang-stage2-coverage-R/clang-build/module.cache -fcxx-modules -Wall -Wextra -Wno-unused-parameter -Wwrite-strings -Wcast-qual -Wmissing-field-initializers -pedantic -Wno-long-long -Wimplicit-fallthrough -Wcovered-switch-default -Wno-noexcept-type -Wnon-virtual-dtor -Wdelete-non-virtual-dtor -Wstring-conversion -fdiagnostics-color -fprofile-instr-generate='/Users/buildslave/jenkins/workspace/clang-stage2-coverage-R/clang-build/profiles/%6m.profraw' -fcoverage-mapping -fno-common -Woverloaded-virtual -Wno-nested-anon-types -O3 -DNDEBUG -isysroot /Applications/Xcode.app/Contents/Developer/Platforms/MacOSX.platform/Developer/SDKs/MacOSX10.14.sdk    -fno-exceptions -fno-rtti -MD -MT tools/clang/lib/Basic/CMakeFiles/obj.clangBasic.dir/SourceManager.cpp.o -MF tools/clang/lib/Basic/CMakeFiles/obj.clangBasic.dir/SourceManager.cpp.o.d -o tools/clang/lib/Basic/CMakeFiles/obj.clangBasic.dir/SourceManager.cpp.o -c /Users/buildslave/jenkins/workspace/clang-stage2-coverage-R/llvm/tools/clang/lib/Basic/SourceManager.cpp
[3023/4610] /Users/buildslave/jenkins/workspace/clang-stage2-coverage-R/host-compiler/bin/clang++  -DGTEST_HAS_RTTI=0 -D_GNU_SOURCE -D__STDC_CONSTANT_MACROS -D__STDC_FORMAT_MACROS -D__STDC_LIMIT_MACROS -Itools/clang/lib/Basic -I/Users/buildslave/jenkins/workspace/clang-stage2-coverage-R/llvm/tools/clang/lib/Basic -I/Users/buildslave/jenkins/workspace/clang-stage2-coverage-R/llvm/tools/clang/include -Itools/clang/include -I/Applications/Xcode.app/Contents/Developer/Platforms/MacOSX.platform/Developer/SDKs/MacOSX10.14.sdk/usr/include/libxml2 -Iinclude -I/Users/buildslave/jenkins/workspace/clang-stage2-coverage-R/llvm/include -fPIC -fvisibility-inlines-hidden -Werror=date-time -Werror=unguarded-availability-new -std=c++11 -fmodules -fmodules-cache-path=/Users/buildslave/jenkins/workspace/clang-stage2-coverage-R/clang-build/module.cache -fcxx-modules -Wall -Wextra -Wno-unused-parameter -Wwrite-strings -Wcast-qual -Wmissing-field-initializers -pedantic -Wno-long-long -Wimplicit-fallthrough -Wcovered-switch-default -Wno-noexcept-type -Wnon-virtual-dtor -Wdelete-non-virtual-dtor -Wstring-conversion -fdiagnostics-color -fprofile-instr-generate='/Users/buildslave/jenkins/workspace/clang-stage2-coverage-R/clang-build/profiles/%6m.profraw' -fcoverage-mapping -fno-common -Woverloaded-virtual -Wno-nested-anon-types -O3 -DNDEBUG -isysroot /Applications/Xcode.app/Contents/Developer/Platforms/MacOSX.platform/Developer/SDKs/MacOSX10.14.sdk    -fno-exceptions -fno-rtti -MD -MT tools/clang/lib/Basic/CMakeFiles/obj.clangBasic.dir/Targets/ARM.cpp.o -MF tools/clang/lib/Basic/CMakeFiles/obj.clangBasic.dir/Targets/ARM.cpp.o.d -o tools/clang/lib/Basic/CMakeFiles/obj.clangBasic.dir/Targets/ARM.cpp.o -c /Users/buildslave/jenkins/workspace/clang-stage2-coverage-R/llvm/tools/clang/lib/Basic/Targets/ARM.cpp
[3024/4610] /Users/buildslave/jenkins/workspace/clang-stage2-coverage-R/host-compiler/bin/clang++  -DGTEST_HAS_RTTI=0 -D_GNU_SOURCE -D__STDC_CONSTANT_MACROS -D__STDC_FORMAT_MACROS -D__STDC_LIMIT_MACROS -Itools/clang/lib/Basic -I/Users/buildslave/jenkins/workspace/clang-stage2-coverage-R/llvm/tools/clang/lib/Basic -I/Users/buildslave/jenkins/workspace/clang-stage2-coverage-R/llvm/tools/clang/include -Itools/clang/include -I/Applications/Xcode.app/Contents/Developer/Platforms/MacOSX.platform/Developer/SDKs/MacOSX10.14.sdk/usr/include/libxml2 -Iinclude -I/Users/buildslave/jenkins/workspace/clang-stage2-coverage-R/llvm/include -fPIC -fvisibility-inlines-hidden -Werror=date-time -Werror=unguarded-availability-new -std=c++11 -fmodules -fmodules-cache-path=/Users/buildslave/jenkins/workspace/clang-stage2-coverage-R/clang-build/module.cache -fcxx-modules -Wall -Wextra -Wno-unused-parameter -Wwrite-strings -Wcast-qual -Wmissing-field-initializers -pedantic -Wno-long-long -Wimplicit-fallthrough -Wcovered-switch-default -Wno-noexcept-type -Wnon-virtual-dtor -Wdelete-non-virtual-dtor -Wstring-conversion -fdiagnostics-color -fprofile-instr-generate='/Users/buildslave/jenkins/workspace/clang-stage2-coverage-R/clang-build/profiles/%6m.profraw' -fcoverage-mapping -fno-common -Woverloaded-virtual -Wno-nested-anon-types -O3 -DNDEBUG -isysroot /Applications/Xcode.app/Contents/Developer/Platforms/MacOSX.platform/Developer/SDKs/MacOSX10.14.sdk    -fno-exceptions -fno-rtti -MD -MT tools/clang/lib/Basic/CMakeFiles/obj.clangBasic.dir/Targets/Le64.cpp.o -MF tools/clang/lib/Basic/CMakeFiles/obj.clangBasic.dir/Targets/Le64.cpp.o.d -o tools/clang/lib/Basic/CMakeFiles/obj.clangBasic.dir/Targets/Le64.cpp.o -c /Users/buildslave/jenkins/workspace/clang-stage2-coverage-R/llvm/tools/clang/lib/Basic/Targets/Le64.cpp
[3025/4610] /Users/buildslave/jenkins/workspace/clang-stage2-coverage-R/host-compiler/bin/clang++  -DGTEST_HAS_RTTI=0 -D_GNU_SOURCE -D__STDC_CONSTANT_MACROS -D__STDC_FORMAT_MACROS -D__STDC_LIMIT_MACROS -Itools/clang/lib/Basic -I/Users/buildslave/jenkins/workspace/clang-stage2-coverage-R/llvm/tools/clang/lib/Basic -I/Users/buildslave/jenkins/workspace/clang-stage2-coverage-R/llvm/tools/clang/include -Itools/clang/include -I/Applications/Xcode.app/Contents/Developer/Platforms/MacOSX.platform/Developer/SDKs/MacOSX10.14.sdk/usr/include/libxml2 -Iinclude -I/Users/buildslave/jenkins/workspace/clang-stage2-coverage-R/llvm/include -fPIC -fvisibility-inlines-hidden -Werror=date-time -Werror=unguarded-availability-new -std=c++11 -fmodules -fmodules-cache-path=/Users/buildslave/jenkins/workspace/clang-stage2-coverage-R/clang-build/module.cache -fcxx-modules -Wall -Wextra -Wno-unused-parameter -Wwrite-strings -Wcast-qual -Wmissing-field-initializers -pedantic -Wno-long-long -Wimplicit-fallthrough -Wcovered-switch-default -Wno-noexcept-type -Wnon-virtual-dtor -Wdelete-non-virtual-dtor -Wstring-conversion -fdiagnostics-color -fprofile-instr-generate='/Users/buildslave/jenkins/workspace/clang-stage2-coverage-R/clang-build/profiles/%6m.profraw' -fcoverage-mapping -fno-common -Woverloaded-virtual -Wno-nested-anon-types -O3 -DNDEBUG -isysroot /Applications/Xcode.app/Contents/Developer/Platforms/MacOSX.platform/Developer/SDKs/MacOSX10.14.sdk    -fno-exceptions -fno-rtti -MD -MT tools/clang/lib/Basic/CMakeFiles/obj.clangBasic.dir/Targets/Hexagon.cpp.o -MF tools/clang/lib/Basic/CMakeFiles/obj.clangBasic.dir/Targets/Hexagon.cpp.o.d -o tools/clang/lib/Basic/CMakeFiles/obj.clangBasic.dir/Targets/Hexagon.cpp.o -c /Users/buildslave/jenkins/workspace/clang-stage2-coverage-R/llvm/tools/clang/lib/Basic/Targets/Hexagon.cpp
[3026/4610] /Users/buildslave/jenkins/workspace/clang-stage2-coverage-R/host-compiler/bin/clang++  -DGTEST_HAS_RTTI=0 -D_GNU_SOURCE -D__STDC_CONSTANT_MACROS -D__STDC_FORMAT_MACROS -D__STDC_LIMIT_MACROS -Itools/clang/lib/Basic -I/Users/buildslave/jenkins/workspace/clang-stage2-coverage-R/llvm/tools/clang/lib/Basic -I/Users/buildslave/jenkins/workspace/clang-stage2-coverage-R/llvm/tools/clang/include -Itools/clang/include -I/Applications/Xcode.app/Contents/Developer/Platforms/MacOSX.platform/Developer/SDKs/MacOSX10.14.sdk/usr/include/libxml2 -Iinclude -I/Users/buildslave/jenkins/workspace/clang-stage2-coverage-R/llvm/include -fPIC -fvisibility-inlines-hidden -Werror=date-time -Werror=unguarded-availability-new -std=c++11 -fmodules -fmodules-cache-path=/Users/buildslave/jenkins/workspace/clang-stage2-coverage-R/clang-build/module.cache -fcxx-modules -Wall -Wextra -Wno-unused-parameter -Wwrite-strings -Wcast-qual -Wmissing-field-initializers -pedantic -Wno-long-long -Wimplicit-fallthrough -Wcovered-switch-default -Wno-noexcept-type -Wnon-virtual-dtor -Wdelete-non-virtual-dtor -Wstring-conversion -fdiagnostics-color -fprofile-instr-generate='/Users/buildslave/jenkins/workspace/clang-stage2-coverage-R/clang-build/profiles/%6m.profraw' -fcoverage-mapping -fno-common -Woverloaded-virtual -Wno-nested-anon-types -O3 -DNDEBUG -isysroot /Applications/Xcode.app/Contents/Developer/Platforms/MacOSX.platform/Developer/SDKs/MacOSX10.14.sdk    -fno-exceptions -fno-rtti -MD -MT tools/clang/lib/Basic/CMakeFiles/obj.clangBasic.dir/Targets/Lanai.cpp.o -MF tools/clang/lib/Basic/CMakeFiles/obj.clangBasic.dir/Targets/Lanai.cpp.o.d -o tools/clang/lib/Basic/CMakeFiles/obj.clangBasic.dir/Targets/Lanai.cpp.o -c /Users/buildslave/jenkins/workspace/clang-stage2-coverage-R/llvm/tools/clang/lib/Basic/Targets/Lanai.cpp
[3027/4610] /Users/buildslave/jenkins/workspace/clang-stage2-coverage-R/host-compiler/bin/clang++  -DGTEST_HAS_RTTI=0 -D_GNU_SOURCE -D__STDC_CONSTANT_MACROS -D__STDC_FORMAT_MACROS -D__STDC_LIMIT_MACROS -Itools/clang/lib/Basic -I/Users/buildslave/jenkins/workspace/clang-stage2-coverage-R/llvm/tools/clang/lib/Basic -I/Users/buildslave/jenkins/workspace/clang-stage2-coverage-R/llvm/tools/clang/include -Itools/clang/include -I/Applications/Xcode.app/Contents/Developer/Platforms/MacOSX.platform/Developer/SDKs/MacOSX10.14.sdk/usr/include/libxml2 -Iinclude -I/Users/buildslave/jenkins/workspace/clang-stage2-coverage-R/llvm/include -fPIC -fvisibility-inlines-hidden -Werror=date-time -Werror=unguarded-availability-new -std=c++11 -fmodules -fmodules-cache-path=/Users/buildslave/jenkins/workspace/clang-stage2-coverage-R/clang-build/module.cache -fcxx-modules -Wall -Wextra -Wno-unused-parameter -Wwrite-strings -Wcast-qual -Wmissing-field-initializers -pedantic -Wno-long-long -Wimplicit-fallthrough -Wcovered-switch-default -Wno-noexcept-type -Wnon-virtual-dtor -Wdelete-non-virtual-dtor -Wstring-conversion -fdiagnostics-color -fprofile-instr-generate='/Users/buildslave/jenkins/workspace/clang-stage2-coverage-R/clang-build/profiles/%6m.profraw' -fcoverage-mapping -fno-common -Woverloaded-virtual -Wno-nested-anon-types -O3 -DNDEBUG -isysroot /Applications/Xcode.app/Contents/Developer/Platforms/MacOSX.platform/Developer/SDKs/MacOSX10.14.sdk    -fno-exceptions -fno-rtti -MD -MT tools/clang/lib/Basic/CMakeFiles/obj.clangBasic.dir/Targets/MSP430.cpp.o -MF tools/clang/lib/Basic/CMakeFiles/obj.clangBasic.dir/Targets/MSP430.cpp.o.d -o tools/clang/lib/Basic/CMakeFiles/obj.clangBasic.dir/Targets/MSP430.cpp.o -c /Users/buildslave/jenkins/workspace/clang-stage2-coverage-R/llvm/tools/clang/lib/Basic/Targets/MSP430.cpp
[3028/4610] /Users/buildslave/jenkins/workspace/clang-stage2-coverage-R/host-compiler/bin/clang++  -DGTEST_HAS_RTTI=0 -D_GNU_SOURCE -D__STDC_CONSTANT_MACROS -D__STDC_FORMAT_MACROS -D__STDC_LIMIT_MACROS -Itools/clang/lib/Basic -I/Users/buildslave/jenkins/workspace/clang-stage2-coverage-R/llvm/tools/clang/lib/Basic -I/Users/buildslave/jenkins/workspace/clang-stage2-coverage-R/llvm/tools/clang/include -Itools/clang/include -I/Applications/Xcode.app/Contents/Developer/Platforms/MacOSX.platform/Developer/SDKs/MacOSX10.14.sdk/usr/include/libxml2 -Iinclude -I/Users/buildslave/jenkins/workspace/clang-stage2-coverage-R/llvm/include -fPIC -fvisibility-inlines-hidden -Werror=date-time -Werror=unguarded-availability-new -std=c++11 -fmodules -fmodules-cache-path=/Users/buildslave/jenkins/workspace/clang-stage2-coverage-R/clang-build/module.cache -fcxx-modules -Wall -Wextra -Wno-unused-parameter -Wwrite-strings -Wcast-qual -Wmissing-field-initializers -pedantic -Wno-long-long -Wimplicit-fallthrough -Wcovered-switch-default -Wno-noexcept-type -Wnon-virtual-dtor -Wdelete-non-virtual-dtor -Wstring-conversion -fdiagnostics-color -fprofile-instr-generate='/Users/buildslave/jenkins/workspace/clang-stage2-coverage-R/clang-build/profiles/%6m.profraw' -fcoverage-mapping -fno-common -Woverloaded-virtual -Wno-nested-anon-types -O3 -DNDEBUG -isysroot /Applications/Xcode.app/Contents/Developer/Platforms/MacOSX.platform/Developer/SDKs/MacOSX10.14.sdk    -fno-exceptions -fno-rtti -MD -MT tools/clang/lib/Basic/CMakeFiles/obj.clangBasic.dir/Targets/OSTargets.cpp.o -MF tools/clang/lib/Basic/CMakeFiles/obj.clangBasic.dir/Targets/OSTargets.cpp.o.d -o tools/clang/lib/Basic/CMakeFiles/obj.clangBasic.dir/Targets/OSTargets.cpp.o -c /Users/buildslave/jenkins/workspace/clang-stage2-coverage-R/llvm/tools/clang/lib/Basic/Targets/OSTargets.cpp
[3029/4610] /Users/buildslave/jenkins/workspace/clang-stage2-coverage-R/host-compiler/bin/clang++  -DGTEST_HAS_RTTI=0 -D_GNU_SOURCE -D__STDC_CONSTANT_MACROS -D__STDC_FORMAT_MACROS -D__STDC_LIMIT_MACROS -Itools/clang/lib/Basic -I/Users/buildslave/jenkins/workspace/clang-stage2-coverage-R/llvm/tools/clang/lib/Basic -I/Users/buildslave/jenkins/workspace/clang-stage2-coverage-R/llvm/tools/clang/include -Itools/clang/include -I/Applications/Xcode.app/Contents/Developer/Platforms/MacOSX.platform/Developer/SDKs/MacOSX10.14.sdk/usr/include/libxml2 -Iinclude -I/Users/buildslave/jenkins/workspace/clang-stage2-coverage-R/llvm/include -fPIC -fvisibility-inlines-hidden -Werror=date-time -Werror=unguarded-availability-new -std=c++11 -fmodules -fmodules-cache-path=/Users/buildslave/jenkins/workspace/clang-stage2-coverage-R/clang-build/module.cache -fcxx-modules -Wall -Wextra -Wno-unused-parameter -Wwrite-strings -Wcast-qual -Wmissing-field-initializers -pedantic -Wno-long-long -Wimplicit-fallthrough -Wcovered-switch-default -Wno-noexcept-type -Wnon-virtual-dtor -Wdelete-non-virtual-dtor -Wstring-conversion -fdiagnostics-color -fprofile-instr-generate='/Users/buildslave/jenkins/workspace/clang-stage2-coverage-R/clang-build/profiles/%6m.profraw' -fcoverage-mapping -fno-common -Woverloaded-virtual -Wno-nested-anon-types -O3 -DNDEBUG -isysroot /Applications/Xcode.app/Contents/Developer/Platforms/MacOSX.platform/Developer/SDKs/MacOSX10.14.sdk    -fno-exceptions -fno-rtti -MD -MT tools/clang/lib/Basic/CMakeFiles/obj.clangBasic.dir/Targets/PNaCl.cpp.o -MF tools/clang/lib/Basic/CMakeFiles/obj.clangBasic.dir/Targets/PNaCl.cpp.o.d -o tools/clang/lib/Basic/CMakeFiles/obj.clangBasic.dir/Targets/PNaCl.cpp.o -c /Users/buildslave/jenkins/workspace/clang-stage2-coverage-R/llvm/tools/clang/lib/Basic/Targets/PNaCl.cpp
[3030/4610] /Users/buildslave/jenkins/workspace/clang-stage2-coverage-R/host-compiler/bin/clang++  -DGTEST_HAS_RTTI=0 -D_GNU_SOURCE -D__STDC_CONSTANT_MACROS -D__STDC_FORMAT_MACROS -D__STDC_LIMIT_MACROS -Itools/clang/lib/Basic -I/Users/buildslave/jenkins/workspace/clang-stage2-coverage-R/llvm/tools/clang/lib/Basic -I/Users/buildslave/jenkins/workspace/clang-stage2-coverage-R/llvm/tools/clang/include -Itools/clang/include -I/Applications/Xcode.app/Contents/Developer/Platforms/MacOSX.platform/Developer/SDKs/MacOSX10.14.sdk/usr/include/libxml2 -Iinclude -I/Users/buildslave/jenkins/workspace/clang-stage2-coverage-R/llvm/include -fPIC -fvisibility-inlines-hidden -Werror=date-time -Werror=unguarded-availability-new -std=c++11 -fmodules -fmodules-cache-path=/Users/buildslave/jenkins/workspace/clang-stage2-coverage-R/clang-build/module.cache -fcxx-modules -Wall -Wextra -Wno-unused-parameter -Wwrite-strings -Wcast-qual -Wmissing-field-initializers -pedantic -Wno-long-long -Wimplicit-fallthrough -Wcovered-switch-default -Wno-noexcept-type -Wnon-virtual-dtor -Wdelete-non-virtual-dtor -Wstring-conversion -fdiagnostics-color -fprofile-instr-generate='/Users/buildslave/jenkins/workspace/clang-stage2-coverage-R/clang-build/profiles/%6m.profraw' -fcoverage-mapping -fno-common -Woverloaded-virtual -Wno-nested-anon-types -O3 -DNDEBUG -isysroot /Applications/Xcode.app/Contents/Developer/Platforms/MacOSX.platform/Developer/SDKs/MacOSX10.14.sdk    -fno-exceptions -fno-rtti -MD -MT tools/clang/lib/Basic/CMakeFiles/obj.clangBasic.dir/Targets/NVPTX.cpp.o -MF tools/clang/lib/Basic/CMakeFiles/obj.clangBasic.dir/Targets/NVPTX.cpp.o.d -o tools/clang/lib/Basic/CMakeFiles/obj.clangBasic.dir/Targets/NVPTX.cpp.o -c /Users/buildslave/jenkins/workspace/clang-stage2-coverage-R/llvm/tools/clang/lib/Basic/Targets/NVPTX.cpp
[3031/4610] /Users/buildslave/jenkins/workspace/clang-stage2-coverage-R/host-compiler/bin/clang++  -DGTEST_HAS_RTTI=0 -D_GNU_SOURCE -D__STDC_CONSTANT_MACROS -D__STDC_FORMAT_MACROS -D__STDC_LIMIT_MACROS -Itools/clang/lib/Basic -I/Users/buildslave/jenkins/workspace/clang-stage2-coverage-R/llvm/tools/clang/lib/Basic -I/Users/buildslave/jenkins/workspace/clang-stage2-coverage-R/llvm/tools/clang/include -Itools/clang/include -I/Applications/Xcode.app/Contents/Developer/Platforms/MacOSX.platform/Developer/SDKs/MacOSX10.14.sdk/usr/include/libxml2 -Iinclude -I/Users/buildslave/jenkins/workspace/clang-stage2-coverage-R/llvm/include -fPIC -fvisibility-inlines-hidden -Werror=date-time -Werror=unguarded-availability-new -std=c++11 -fmodules -fmodules-cache-path=/Users/buildslave/jenkins/workspace/clang-stage2-coverage-R/clang-build/module.cache -fcxx-modules -Wall -Wextra -Wno-unused-parameter -Wwrite-strings -Wcast-qual -Wmissing-field-initializers -pedantic -Wno-long-long -Wimplicit-fallthrough -Wcovered-switch-default -Wno-noexcept-type -Wnon-virtual-dtor -Wdelete-non-virtual-dtor -Wstring-conversion -fdiagnostics-color -fprofile-instr-generate='/Users/buildslave/jenkins/workspace/clang-stage2-coverage-R/clang-build/profiles/%6m.profraw' -fcoverage-mapping -fno-common -Woverloaded-virtual -Wno-nested-anon-types -O3 -DNDEBUG -isysroot /Applications/Xcode.app/Contents/Developer/Platforms/MacOSX.platform/Developer/SDKs/MacOSX10.14.sdk    -fno-exceptions -fno-rtti -MD -MT tools/clang/lib/Basic/CMakeFiles/obj.clangBasic.dir/Targets/Mips.cpp.o -MF tools/clang/lib/Basic/CMakeFiles/obj.clangBasic.dir/Targets/Mips.cpp.o.d -o tools/clang/lib/Basic/CMakeFiles/obj.clangBasic.dir/Targets/Mips.cpp.o -c /Users/buildslave/jenkins/workspace/clang-stage2-coverage-R/llvm/tools/clang/lib/Basic/Targets/Mips.cpp
[3032/4610] /Users/buildslave/jenkins/workspace/clang-stage2-coverage-R/host-compiler/bin/clang++  -DGTEST_HAS_RTTI=0 -D_GNU_SOURCE -D__STDC_CONSTANT_MACROS -D__STDC_FORMAT_MACROS -D__STDC_LIMIT_MACROS -Itools/clang/lib/Basic -I/Users/buildslave/jenkins/workspace/clang-stage2-coverage-R/llvm/tools/clang/lib/Basic -I/Users/buildslave/jenkins/workspace/clang-stage2-coverage-R/llvm/tools/clang/include -Itools/clang/include -I/Applications/Xcode.app/Contents/Developer/Platforms/MacOSX.platform/Developer/SDKs/MacOSX10.14.sdk/usr/include/libxml2 -Iinclude -I/Users/buildslave/jenkins/workspace/clang-stage2-coverage-R/llvm/include -fPIC -fvisibility-inlines-hidden -Werror=date-time -Werror=unguarded-availability-new -std=c++11 -fmodules -fmodules-cache-path=/Users/buildslave/jenkins/workspace/clang-stage2-coverage-R/clang-build/module.cache -fcxx-modules -Wall -Wextra -Wno-unused-parameter -Wwrite-strings -Wcast-qual -Wmissing-field-initializers -pedantic -Wno-long-long -Wimplicit-fallthrough -Wcovered-switch-default -Wno-noexcept-type -Wnon-virtual-dtor -Wdelete-non-virtual-dtor -Wstring-conversion -fdiagnostics-color -fprofile-instr-generate='/Users/buildslave/jenkins/workspace/clang-stage2-coverage-R/clang-build/profiles/%6m.profraw' -fcoverage-mapping -fno-common -Woverloaded-virtual -Wno-nested-anon-types -O3 -DNDEBUG -isysroot /Applications/Xcode.app/Contents/Developer/Platforms/MacOSX.platform/Developer/SDKs/MacOSX10.14.sdk    -fno-exceptions -fno-rtti -MD -MT tools/clang/lib/Basic/CMakeFiles/obj.clangBasic.dir/Targets/SPIR.cpp.o -MF tools/clang/lib/Basic/CMakeFiles/obj.clangBasic.dir/Targets/SPIR.cpp.o.d -o tools/clang/lib/Basic/CMakeFiles/obj.clangBasic.dir/Targets/SPIR.cpp.o -c /Users/buildslave/jenkins/workspace/clang-stage2-coverage-R/llvm/tools/clang/lib/Basic/Targets/SPIR.cpp
[3033/4610] /Users/buildslave/jenkins/workspace/clang-stage2-coverage-R/host-compiler/bin/clang++  -DGTEST_HAS_RTTI=0 -D_GNU_SOURCE -D__STDC_CONSTANT_MACROS -D__STDC_FORMAT_MACROS -D__STDC_LIMIT_MACROS -Itools/clang/lib/Basic -I/Users/buildslave/jenkins/workspace/clang-stage2-coverage-R/llvm/tools/clang/lib/Basic -I/Users/buildslave/jenkins/workspace/clang-stage2-coverage-R/llvm/tools/clang/include -Itools/clang/include -I/Applications/Xcode.app/Contents/Developer/Platforms/MacOSX.platform/Developer/SDKs/MacOSX10.14.sdk/usr/include/libxml2 -Iinclude -I/Users/buildslave/jenkins/workspace/clang-stage2-coverage-R/llvm/include -fPIC -fvisibility-inlines-hidden -Werror=date-time -Werror=unguarded-availability-new -std=c++11 -fmodules -fmodules-cache-path=/Users/buildslave/jenkins/workspace/clang-stage2-coverage-R/clang-build/module.cache -fcxx-modules -Wall -Wextra -Wno-unused-parameter -Wwrite-strings -Wcast-qual -Wmissing-field-initializers -pedantic -Wno-long-long -Wimplicit-fallthrough -Wcovered-switch-default -Wno-noexcept-type -Wnon-virtual-dtor -Wdelete-non-virtual-dtor -Wstring-conversion -fdiagnostics-color -fprofile-instr-generate='/Users/buildslave/jenkins/workspace/clang-stage2-coverage-R/clang-build/profiles/%6m.profraw' -fcoverage-mapping -fno-common -Woverloaded-virtual -Wno-nested-anon-types -O3 -DNDEBUG -isysroot /Applications/Xcode.app/Contents/Developer/Platforms/MacOSX.platform/Developer/SDKs/MacOSX10.14.sdk    -fno-exceptions -fno-rtti -MD -MT tools/clang/lib/Basic/CMakeFiles/obj.clangBasic.dir/Targets/RISCV.cpp.o -MF tools/clang/lib/Basic/CMakeFiles/obj.clangBasic.dir/Targets/RISCV.cpp.o.d -o tools/clang/lib/Basic/CMakeFiles/obj.clangBasic.dir/Targets/RISCV.cpp.o -c /Users/buildslave/jenkins/workspace/clang-stage2-coverage-R/llvm/tools/clang/lib/Basic/Targets/RISCV.cpp
[3034/4610] /Users/buildslave/jenkins/workspace/clang-stage2-coverage-R/host-compiler/bin/clang++  -DGTEST_HAS_RTTI=0 -D_GNU_SOURCE -D__STDC_CONSTANT_MACROS -D__STDC_FORMAT_MACROS -D__STDC_LIMIT_MACROS -Itools/clang/lib/Basic -I/Users/buildslave/jenkins/workspace/clang-stage2-coverage-R/llvm/tools/clang/lib/Basic -I/Users/buildslave/jenkins/workspace/clang-stage2-coverage-R/llvm/tools/clang/include -Itools/clang/include -I/Applications/Xcode.app/Contents/Developer/Platforms/MacOSX.platform/Developer/SDKs/MacOSX10.14.sdk/usr/include/libxml2 -Iinclude -I/Users/buildslave/jenkins/workspace/clang-stage2-coverage-R/llvm/include -fPIC -fvisibility-inlines-hidden -Werror=date-time -Werror=unguarded-availability-new -std=c++11 -fmodules -fmodules-cache-path=/Users/buildslave/jenkins/workspace/clang-stage2-coverage-R/clang-build/module.cache -fcxx-modules -Wall -Wextra -Wno-unused-parameter -Wwrite-strings -Wcast-qual -Wmissing-field-initializers -pedantic -Wno-long-long -Wimplicit-fallthrough -Wcovered-switch-default -Wno-noexcept-type -Wnon-virtual-dtor -Wdelete-non-virtual-dtor -Wstring-conversion -fdiagnostics-color -fprofile-instr-generate='/Users/buildslave/jenkins/workspace/clang-stage2-coverage-R/clang-build/profiles/%6m.profraw' -fcoverage-mapping -fno-common -Woverloaded-virtual -Wno-nested-anon-types -O3 -DNDEBUG -isysroot /Applications/Xcode.app/Contents/Developer/Platforms/MacOSX.platform/Developer/SDKs/MacOSX10.14.sdk    -fno-exceptions -fno-rtti -MD -MT tools/clang/lib/Basic/CMakeFiles/obj.clangBasic.dir/Targets/PPC.cpp.o -MF tools/clang/lib/Basic/CMakeFiles/obj.clangBasic.dir/Targets/PPC.cpp.o.d -o tools/clang/lib/Basic/CMakeFiles/obj.clangBasic.dir/Targets/PPC.cpp.o -c /Users/buildslave/jenkins/workspace/clang-stage2-coverage-R/llvm/tools/clang/lib/Basic/Targets/PPC.cpp
[3035/4610] /Users/buildslave/jenkins/workspace/clang-stage2-coverage-R/host-compiler/bin/clang++  -DGTEST_HAS_RTTI=0 -D_GNU_SOURCE -D__STDC_CONSTANT_MACROS -D__STDC_FORMAT_MACROS -D__STDC_LIMIT_MACROS -Itools/clang/lib/Basic -I/Users/buildslave/jenkins/workspace/clang-stage2-coverage-R/llvm/tools/clang/lib/Basic -I/Users/buildslave/jenkins/workspace/clang-stage2-coverage-R/llvm/tools/clang/include -Itools/clang/include -I/Applications/Xcode.app/Contents/Developer/Platforms/MacOSX.platform/Developer/SDKs/MacOSX10.14.sdk/usr/include/libxml2 -Iinclude -I/Users/buildslave/jenkins/workspace/clang-stage2-coverage-R/llvm/include -fPIC -fvisibility-inlines-hidden -Werror=date-time -Werror=unguarded-availability-new -std=c++11 -fmodules -fmodules-cache-path=/Users/buildslave/jenkins/workspace/clang-stage2-coverage-R/clang-build/module.cache -fcxx-modules -Wall -Wextra -Wno-unused-parameter -Wwrite-strings -Wcast-qual -Wmissing-field-initializers -pedantic -Wno-long-long -Wimplicit-fallthrough -Wcovered-switch-default -Wno-noexcept-type -Wnon-virtual-dtor -Wdelete-non-virtual-dtor -Wstring-conversion -fdiagnostics-color -fprofile-instr-generate='/Users/buildslave/jenkins/workspace/clang-stage2-coverage-R/clang-build/profiles/%6m.profraw' -fcoverage-mapping -fno-common -Woverloaded-virtual -Wno-nested-anon-types -O3 -DNDEBUG -isysroot /Applications/Xcode.app/Contents/Developer/Platforms/MacOSX.platform/Developer/SDKs/MacOSX10.14.sdk    -fno-exceptions -fno-rtti -MD -MT tools/clang/lib/Basic/CMakeFiles/obj.clangBasic.dir/Targets/TCE.cpp.o -MF tools/clang/lib/Basic/CMakeFiles/obj.clangBasic.dir/Targets/TCE.cpp.o.d -o tools/clang/lib/Basic/CMakeFiles/obj.clangBasic.dir/Targets/TCE.cpp.o -c /Users/buildslave/jenkins/workspace/clang-stage2-coverage-R/llvm/tools/clang/lib/Basic/Targets/TCE.cpp
[3036/4610] /Users/buildslave/jenkins/workspace/clang-stage2-coverage-R/host-compiler/bin/clang++  -DGTEST_HAS_RTTI=0 -D_GNU_SOURCE -D__STDC_CONSTANT_MACROS -D__STDC_FORMAT_MACROS -D__STDC_LIMIT_MACROS -Itools/clang/lib/Basic -I/Users/buildslave/jenkins/workspace/clang-stage2-coverage-R/llvm/tools/clang/lib/Basic -I/Users/buildslave/jenkins/workspace/clang-stage2-coverage-R/llvm/tools/clang/include -Itools/clang/include -I/Applications/Xcode.app/Contents/Developer/Platforms/MacOSX.platform/Developer/SDKs/MacOSX10.14.sdk/usr/include/libxml2 -Iinclude -I/Users/buildslave/jenkins/workspace/clang-stage2-coverage-R/llvm/include -fPIC -fvisibility-inlines-hidden -Werror=date-time -Werror=unguarded-availability-new -std=c++11 -fmodules -fmodules-cache-path=/Users/buildslave/jenkins/workspace/clang-stage2-coverage-R/clang-build/module.cache -fcxx-modules -Wall -Wextra -Wno-unused-parameter -Wwrite-strings -Wcast-qual -Wmissing-field-initializers -pedantic -Wno-long-long -Wimplicit-fallthrough -Wcovered-switch-default -Wno-noexcept-type -Wnon-virtual-dtor -Wdelete-non-virtual-dtor -Wstring-conversion -fdiagnostics-color -fprofile-instr-generate='/Users/buildslave/jenkins/workspace/clang-stage2-coverage-R/clang-build/profiles/%6m.profraw' -fcoverage-mapping -fno-common -Woverloaded-virtual -Wno-nested-anon-types -O3 -DNDEBUG -isysroot /Applications/Xcode.app/Contents/Developer/Platforms/MacOSX.platform/Developer/SDKs/MacOSX10.14.sdk    -fno-exceptions -fno-rtti -MD -MT tools/clang/lib/Basic/CMakeFiles/obj.clangBasic.dir/Targets/Sparc.cpp.o -MF tools/clang/lib/Basic/CMakeFiles/obj.clangBasic.dir/Targets/Sparc.cpp.o.d -o tools/clang/lib/Basic/CMakeFiles/obj.clangBasic.dir/Targets/Sparc.cpp.o -c /Users/buildslave/jenkins/workspace/clang-stage2-coverage-R/llvm/tools/clang/lib/Basic/Targets/Sparc.cpp
[3037/4610] /Users/buildslave/jenkins/workspace/clang-stage2-coverage-R/host-compiler/bin/clang++  -DGTEST_HAS_RTTI=0 -D_GNU_SOURCE -D__STDC_CONSTANT_MACROS -D__STDC_FORMAT_MACROS -D__STDC_LIMIT_MACROS -Itools/clang/lib/Basic -I/Users/buildslave/jenkins/workspace/clang-stage2-coverage-R/llvm/tools/clang/lib/Basic -I/Users/buildslave/jenkins/workspace/clang-stage2-coverage-R/llvm/tools/clang/include -Itools/clang/include -I/Applications/Xcode.app/Contents/Developer/Platforms/MacOSX.platform/Developer/SDKs/MacOSX10.14.sdk/usr/include/libxml2 -Iinclude -I/Users/buildslave/jenkins/workspace/clang-stage2-coverage-R/llvm/include -fPIC -fvisibility-inlines-hidden -Werror=date-time -Werror=unguarded-availability-new -std=c++11 -fmodules -fmodules-cache-path=/Users/buildslave/jenkins/workspace/clang-stage2-coverage-R/clang-build/module.cache -fcxx-modules -Wall -Wextra -Wno-unused-parameter -Wwrite-strings -Wcast-qual -Wmissing-field-initializers -pedantic -Wno-long-long -Wimplicit-fallthrough -Wcovered-switch-default -Wno-noexcept-type -Wnon-virtual-dtor -Wdelete-non-virtual-dtor -Wstring-conversion -fdiagnostics-color -fprofile-instr-generate='/Users/buildslave/jenkins/workspace/clang-stage2-coverage-R/clang-build/profiles/%6m.profraw' -fcoverage-mapping -fno-common -Woverloaded-virtual -Wno-nested-anon-types -O3 -DNDEBUG -isysroot /Applications/Xcode.app/Contents/Developer/Platforms/MacOSX.platform/Developer/SDKs/MacOSX10.14.sdk    -fno-exceptions -fno-rtti -MD -MT tools/clang/lib/Basic/CMakeFiles/obj.clangBasic.dir/Targets/SystemZ.cpp.o -MF tools/clang/lib/Basic/CMakeFiles/obj.clangBasic.dir/Targets/SystemZ.cpp.o.d -o tools/clang/lib/Basic/CMakeFiles/obj.clangBasic.dir/Targets/SystemZ.cpp.o -c /Users/buildslave/jenkins/workspace/clang-stage2-coverage-R/llvm/tools/clang/lib/Basic/Targets/SystemZ.cpp
[3038/4610] /Users/buildslave/jenkins/workspace/clang-stage2-coverage-R/host-compiler/bin/clang++  -DGTEST_HAS_RTTI=0 -D_GNU_SOURCE -D__STDC_CONSTANT_MACROS -D__STDC_FORMAT_MACROS -D__STDC_LIMIT_MACROS -Itools/clang/lib/Basic -I/Users/buildslave/jenkins/workspace/clang-stage2-coverage-R/llvm/tools/clang/lib/Basic -I/Users/buildslave/jenkins/workspace/clang-stage2-coverage-R/llvm/tools/clang/include -Itools/clang/include -I/Applications/Xcode.app/Contents/Developer/Platforms/MacOSX.platform/Developer/SDKs/MacOSX10.14.sdk/usr/include/libxml2 -Iinclude -I/Users/buildslave/jenkins/workspace/clang-stage2-coverage-R/llvm/include -fPIC -fvisibility-inlines-hidden -Werror=date-time -Werror=unguarded-availability-new -std=c++11 -fmodules -fmodules-cache-path=/Users/buildslave/jenkins/workspace/clang-stage2-coverage-R/clang-build/module.cache -fcxx-modules -Wall -Wextra -Wno-unused-parameter -Wwrite-strings -Wcast-qual -Wmissing-field-initializers -pedantic -Wno-long-long -Wimplicit-fallthrough -Wcovered-switch-default -Wno-noexcept-type -Wnon-virtual-dtor -Wdelete-non-virtual-dtor -Wstring-conversion -fdiagnostics-color -fprofile-instr-generate='/Users/buildslave/jenkins/workspace/clang-stage2-coverage-R/clang-build/profiles/%6m.profraw' -fcoverage-mapping -fno-common -Woverloaded-virtual -Wno-nested-anon-types -O3 -DNDEBUG -isysroot /Applications/Xcode.app/Contents/Developer/Platforms/MacOSX.platform/Developer/SDKs/MacOSX10.14.sdk    -fno-exceptions -fno-rtti -MD -MT tools/clang/lib/Basic/CMakeFiles/obj.clangBasic.dir/TokenKinds.cpp.o -MF tools/clang/lib/Basic/CMakeFiles/obj.clangBasic.dir/TokenKinds.cpp.o.d -o tools/clang/lib/Basic/CMakeFiles/obj.clangBasic.dir/TokenKinds.cpp.o -c /Users/buildslave/jenkins/workspace/clang-stage2-coverage-R/llvm/tools/clang/lib/Basic/TokenKinds.cpp
[3039/4610] /Users/buildslave/jenkins/workspace/clang-stage2-coverage-R/host-compiler/bin/clang++  -DGTEST_HAS_RTTI=0 -D_GNU_SOURCE -D__STDC_CONSTANT_MACROS -D__STDC_FORMAT_MACROS -D__STDC_LIMIT_MACROS -Itools/clang/lib/Basic -I/Users/buildslave/jenkins/workspace/clang-stage2-coverage-R/llvm/tools/clang/lib/Basic -I/Users/buildslave/jenkins/workspace/clang-stage2-coverage-R/llvm/tools/clang/include -Itools/clang/include -I/Applications/Xcode.app/Contents/Developer/Platforms/MacOSX.platform/Developer/SDKs/MacOSX10.14.sdk/usr/include/libxml2 -Iinclude -I/Users/buildslave/jenkins/workspace/clang-stage2-coverage-R/llvm/include -fPIC -fvisibility-inlines-hidden -Werror=date-time -Werror=unguarded-availability-new -std=c++11 -fmodules -fmodules-cache-path=/Users/buildslave/jenkins/workspace/clang-stage2-coverage-R/clang-build/module.cache -fcxx-modules -Wall -Wextra -Wno-unused-parameter -Wwrite-strings -Wcast-qual -Wmissing-field-initializers -pedantic -Wno-long-long -Wimplicit-fallthrough -Wcovered-switch-default -Wno-noexcept-type -Wnon-virtual-dtor -Wdelete-non-virtual-dtor -Wstring-conversion -fdiagnostics-color -fprofile-instr-generate='/Users/buildslave/jenkins/workspace/clang-stage2-coverage-R/clang-build/profiles/%6m.profraw' -fcoverage-mapping -fno-common -Woverloaded-virtual -Wno-nested-anon-types -O3 -DNDEBUG -isysroot /Applications/Xcode.app/Contents/Developer/Platforms/MacOSX.platform/Developer/SDKs/MacOSX10.14.sdk    -fno-exceptions -fno-rtti -MD -MT tools/clang/lib/Basic/CMakeFiles/obj.clangBasic.dir/Targets/WebAssembly.cpp.o -MF tools/clang/lib/Basic/CMakeFiles/obj.clangBasic.dir/Targets/WebAssembly.cpp.o.d -o tools/clang/lib/Basic/CMakeFiles/obj.clangBasic.dir/Targets/WebAssembly.cpp.o -c /Users/buildslave/jenkins/workspace/clang-stage2-coverage-R/llvm/tools/clang/lib/Basic/Targets/WebAssembly.cpp
[3040/4610] /Users/buildslave/jenkins/workspace/clang-stage2-coverage-R/host-compiler/bin/clang++  -DGTEST_HAS_RTTI=0 -D_GNU_SOURCE -D__STDC_CONSTANT_MACROS -D__STDC_FORMAT_MACROS -D__STDC_LIMIT_MACROS -Itools/clang/lib/Basic -I/Users/buildslave/jenkins/workspace/clang-stage2-coverage-R/llvm/tools/clang/lib/Basic -I/Users/buildslave/jenkins/workspace/clang-stage2-coverage-R/llvm/tools/clang/include -Itools/clang/include -I/Applications/Xcode.app/Contents/Developer/Platforms/MacOSX.platform/Developer/SDKs/MacOSX10.14.sdk/usr/include/libxml2 -Iinclude -I/Users/buildslave/jenkins/workspace/clang-stage2-coverage-R/llvm/include -fPIC -fvisibility-inlines-hidden -Werror=date-time -Werror=unguarded-availability-new -std=c++11 -fmodules -fmodules-cache-path=/Users/buildslave/jenkins/workspace/clang-stage2-coverage-R/clang-build/module.cache -fcxx-modules -Wall -Wextra -Wno-unused-parameter -Wwrite-strings -Wcast-qual -Wmissing-field-initializers -pedantic -Wno-long-long -Wimplicit-fallthrough -Wcovered-switch-default -Wno-noexcept-type -Wnon-virtual-dtor -Wdelete-non-virtual-dtor -Wstring-conversion -fdiagnostics-color -fprofile-instr-generate='/Users/buildslave/jenkins/workspace/clang-stage2-coverage-R/clang-build/profiles/%6m.profraw' -fcoverage-mapping -fno-common -Woverloaded-virtual -Wno-nested-anon-types -O3 -DNDEBUG -isysroot /Applications/Xcode.app/Contents/Developer/Platforms/MacOSX.platform/Developer/SDKs/MacOSX10.14.sdk    -fno-exceptions -fno-rtti -MD -MT tools/clang/lib/Basic/CMakeFiles/obj.clangBasic.dir/Targets/XCore.cpp.o -MF tools/clang/lib/Basic/CMakeFiles/obj.clangBasic.dir/Targets/XCore.cpp.o.d -o tools/clang/lib/Basic/CMakeFiles/obj.clangBasic.dir/Targets/XCore.cpp.o -c /Users/buildslave/jenkins/workspace/clang-stage2-coverage-R/llvm/tools/clang/lib/Basic/Targets/XCore.cpp
[3041/4610] /Users/buildslave/jenkins/workspace/clang-stage2-coverage-R/host-compiler/bin/clang++  -DGTEST_HAS_RTTI=0 -D_GNU_SOURCE -D__STDC_CONSTANT_MACROS -D__STDC_FORMAT_MACROS -D__STDC_LIMIT_MACROS -Itools/clang/lib/Basic -I/Users/buildslave/jenkins/workspace/clang-stage2-coverage-R/llvm/tools/clang/lib/Basic -I/Users/buildslave/jenkins/workspace/clang-stage2-coverage-R/llvm/tools/clang/include -Itools/clang/include -I/Applications/Xcode.app/Contents/Developer/Platforms/MacOSX.platform/Developer/SDKs/MacOSX10.14.sdk/usr/include/libxml2 -Iinclude -I/Users/buildslave/jenkins/workspace/clang-stage2-coverage-R/llvm/include -fPIC -fvisibility-inlines-hidden -Werror=date-time -Werror=unguarded-availability-new -std=c++11 -fmodules -fmodules-cache-path=/Users/buildslave/jenkins/workspace/clang-stage2-coverage-R/clang-build/module.cache -fcxx-modules -Wall -Wextra -Wno-unused-parameter -Wwrite-strings -Wcast-qual -Wmissing-field-initializers -pedantic -Wno-long-long -Wimplicit-fallthrough -Wcovered-switch-default -Wno-noexcept-type -Wnon-virtual-dtor -Wdelete-non-virtual-dtor -Wstring-conversion -fdiagnostics-color -fprofile-instr-generate='/Users/buildslave/jenkins/workspace/clang-stage2-coverage-R/clang-build/profiles/%6m.profraw' -fcoverage-mapping -fno-common -Woverloaded-virtual -Wno-nested-anon-types -O3 -DNDEBUG -isysroot /Applications/Xcode.app/Contents/Developer/Platforms/MacOSX.platform/Developer/SDKs/MacOSX10.14.sdk    -fno-exceptions -fno-rtti -MD -MT tools/clang/lib/Basic/CMakeFiles/obj.clangBasic.dir/XRayInstr.cpp.o -MF tools/clang/lib/Basic/CMakeFiles/obj.clangBasic.dir/XRayInstr.cpp.o.d -o tools/clang/lib/Basic/CMakeFiles/obj.clangBasic.dir/XRayInstr.cpp.o -c /Users/buildslave/jenkins/workspace/clang-stage2-coverage-R/llvm/tools/clang/lib/Basic/XRayInstr.cpp
[3042/4610] /Users/buildslave/jenkins/workspace/clang-stage2-coverage-R/host-compiler/bin/clang++  -DGTEST_HAS_RTTI=0 -D_GNU_SOURCE -D__STDC_CONSTANT_MACROS -D__STDC_FORMAT_MACROS -D__STDC_LIMIT_MACROS -Itools/clang/lib/Basic -I/Users/buildslave/jenkins/workspace/clang-stage2-coverage-R/llvm/tools/clang/lib/Basic -I/Users/buildslave/jenkins/workspace/clang-stage2-coverage-R/llvm/tools/clang/include -Itools/clang/include -I/Applications/Xcode.app/Contents/Developer/Platforms/MacOSX.platform/Developer/SDKs/MacOSX10.14.sdk/usr/include/libxml2 -Iinclude -I/Users/buildslave/jenkins/workspace/clang-stage2-coverage-R/llvm/include -fPIC -fvisibility-inlines-hidden -Werror=date-time -Werror=unguarded-availability-new -std=c++11 -fmodules -fmodules-cache-path=/Users/buildslave/jenkins/workspace/clang-stage2-coverage-R/clang-build/module.cache -fcxx-modules -Wall -Wextra -Wno-unused-parameter -Wwrite-strings -Wcast-qual -Wmissing-field-initializers -pedantic -Wno-long-long -Wimplicit-fallthrough -Wcovered-switch-default -Wno-noexcept-type -Wnon-virtual-dtor -Wdelete-non-virtual-dtor -Wstring-conversion -fdiagnostics-color -fprofile-instr-generate='/Users/buildslave/jenkins/workspace/clang-stage2-coverage-R/clang-build/profiles/%6m.profraw' -fcoverage-mapping -fno-common -Woverloaded-virtual -Wno-nested-anon-types -O3 -DNDEBUG -isysroot /Applications/Xcode.app/Contents/Developer/Platforms/MacOSX.platform/Developer/SDKs/MacOSX10.14.sdk    -fno-exceptions -fno-rtti -MD -MT tools/clang/lib/Basic/CMakeFiles/obj.clangBasic.dir/XRayLists.cpp.o -MF tools/clang/lib/Basic/CMakeFiles/obj.clangBasic.dir/XRayLists.cpp.o.d -o tools/clang/lib/Basic/CMakeFiles/obj.clangBasic.dir/XRayLists.cpp.o -c /Users/buildslave/jenkins/workspace/clang-stage2-coverage-R/llvm/tools/clang/lib/Basic/XRayLists.cpp
[3043/4610] /Users/buildslave/jenkins/workspace/clang-stage2-coverage-R/host-compiler/bin/clang++  -DGTEST_HAS_RTTI=0 -D_GNU_SOURCE -D__STDC_CONSTANT_MACROS -D__STDC_FORMAT_MACROS -D__STDC_LIMIT_MACROS -Itools/clang/lib/Basic -I/Users/buildslave/jenkins/workspace/clang-stage2-coverage-R/llvm/tools/clang/lib/Basic -I/Users/buildslave/jenkins/workspace/clang-stage2-coverage-R/llvm/tools/clang/include -Itools/clang/include -I/Applications/Xcode.app/Contents/Developer/Platforms/MacOSX.platform/Developer/SDKs/MacOSX10.14.sdk/usr/include/libxml2 -Iinclude -I/Users/buildslave/jenkins/workspace/clang-stage2-coverage-R/llvm/include -fPIC -fvisibility-inlines-hidden -Werror=date-time -Werror=unguarded-availability-new -std=c++11 -fmodules -fmodules-cache-path=/Users/buildslave/jenkins/workspace/clang-stage2-coverage-R/clang-build/module.cache -fcxx-modules -Wall -Wextra -Wno-unused-parameter -Wwrite-strings -Wcast-qual -Wmissing-field-initializers -pedantic -Wno-long-long -Wimplicit-fallthrough -Wcovered-switch-default -Wno-noexcept-type -Wnon-virtual-dtor -Wdelete-non-virtual-dtor -Wstring-conversion -fdiagnostics-color -fprofile-instr-generate='/Users/buildslave/jenkins/workspace/clang-stage2-coverage-R/clang-build/profiles/%6m.profraw' -fcoverage-mapping -fno-common -Woverloaded-virtual -Wno-nested-anon-types -O3 -DNDEBUG -isysroot /Applications/Xcode.app/Contents/Developer/Platforms/MacOSX.platform/Developer/SDKs/MacOSX10.14.sdk    -fno-exceptions -fno-rtti -MD -MT tools/clang/lib/Basic/CMakeFiles/obj.clangBasic.dir/Warnings.cpp.o -MF tools/clang/lib/Basic/CMakeFiles/obj.clangBasic.dir/Warnings.cpp.o.d -o tools/clang/lib/Basic/CMakeFiles/obj.clangBasic.dir/Warnings.cpp.o -c /Users/buildslave/jenkins/workspace/clang-stage2-coverage-R/llvm/tools/clang/lib/Basic/Warnings.cpp
[3044/4610] /Users/buildslave/jenkins/workspace/clang-stage2-coverage-R/host-compiler/bin/clang++  -DGTEST_HAS_RTTI=0 -D_GNU_SOURCE -D__STDC_CONSTANT_MACROS -D__STDC_FORMAT_MACROS -D__STDC_LIMIT_MACROS -Itools/clang/lib/Lex -I/Users/buildslave/jenkins/workspace/clang-stage2-coverage-R/llvm/tools/clang/lib/Lex -I/Users/buildslave/jenkins/workspace/clang-stage2-coverage-R/llvm/tools/clang/include -Itools/clang/include -I/Applications/Xcode.app/Contents/Developer/Platforms/MacOSX.platform/Developer/SDKs/MacOSX10.14.sdk/usr/include/libxml2 -Iinclude -I/Users/buildslave/jenkins/workspace/clang-stage2-coverage-R/llvm/include -fPIC -fvisibility-inlines-hidden -Werror=date-time -Werror=unguarded-availability-new -std=c++11 -fmodules -fmodules-cache-path=/Users/buildslave/jenkins/workspace/clang-stage2-coverage-R/clang-build/module.cache -fcxx-modules -Wall -Wextra -Wno-unused-parameter -Wwrite-strings -Wcast-qual -Wmissing-field-initializers -pedantic -Wno-long-long -Wimplicit-fallthrough -Wcovered-switch-default -Wno-noexcept-type -Wnon-virtual-dtor -Wdelete-non-virtual-dtor -Wstring-conversion -fdiagnostics-color -fprofile-instr-generate='/Users/buildslave/jenkins/workspace/clang-stage2-coverage-R/clang-build/profiles/%6m.profraw' -fcoverage-mapping -fno-common -Woverloaded-virtual -Wno-nested-anon-types -O3 -DNDEBUG -isysroot /Applications/Xcode.app/Contents/Developer/Platforms/MacOSX.platform/Developer/SDKs/MacOSX10.14.sdk    -fno-exceptions -fno-rtti -MD -MT tools/clang/lib/Lex/CMakeFiles/obj.clangLex.dir/HeaderMap.cpp.o -MF tools/clang/lib/Lex/CMakeFiles/obj.clangLex.dir/HeaderMap.cpp.o.d -o tools/clang/lib/Lex/CMakeFiles/obj.clangLex.dir/HeaderMap.cpp.o -c /Users/buildslave/jenkins/workspace/clang-stage2-coverage-R/llvm/tools/clang/lib/Lex/HeaderMap.cpp
[3045/4610] /Users/buildslave/jenkins/workspace/clang-stage2-coverage-R/host-compiler/bin/clang++  -DGTEST_HAS_RTTI=0 -D_GNU_SOURCE -D__STDC_CONSTANT_MACROS -D__STDC_FORMAT_MACROS -D__STDC_LIMIT_MACROS -Itools/clang/lib/Lex -I/Users/buildslave/jenkins/workspace/clang-stage2-coverage-R/llvm/tools/clang/lib/Lex -I/Users/buildslave/jenkins/workspace/clang-stage2-coverage-R/llvm/tools/clang/include -Itools/clang/include -I/Applications/Xcode.app/Contents/Developer/Platforms/MacOSX.platform/Developer/SDKs/MacOSX10.14.sdk/usr/include/libxml2 -Iinclude -I/Users/buildslave/jenkins/workspace/clang-stage2-coverage-R/llvm/include -fPIC -fvisibility-inlines-hidden -Werror=date-time -Werror=unguarded-availability-new -std=c++11 -fmodules -fmodules-cache-path=/Users/buildslave/jenkins/workspace/clang-stage2-coverage-R/clang-build/module.cache -fcxx-modules -Wall -Wextra -Wno-unused-parameter -Wwrite-strings -Wcast-qual -Wmissing-field-initializers -pedantic -Wno-long-long -Wimplicit-fallthrough -Wcovered-switch-default -Wno-noexcept-type -Wnon-virtual-dtor -Wdelete-non-virtual-dtor -Wstring-conversion -fdiagnostics-color -fprofile-instr-generate='/Users/buildslave/jenkins/workspace/clang-stage2-coverage-R/clang-build/profiles/%6m.profraw' -fcoverage-mapping -fno-common -Woverloaded-virtual -Wno-nested-anon-types -O3 -DNDEBUG -isysroot /Applications/Xcode.app/Contents/Developer/Platforms/MacOSX.platform/Developer/SDKs/MacOSX10.14.sdk    -fno-exceptions -fno-rtti -MD -MT tools/clang/lib/Lex/CMakeFiles/obj.clangLex.dir/DependencyDirectivesSourceMinimizer.cpp.o -MF tools/clang/lib/Lex/CMakeFiles/obj.clangLex.dir/DependencyDirectivesSourceMinimizer.cpp.o.d -o tools/clang/lib/Lex/CMakeFiles/obj.clangLex.dir/DependencyDirectivesSourceMinimizer.cpp.o -c /Users/buildslave/jenkins/workspace/clang-stage2-coverage-R/llvm/tools/clang/lib/Lex/DependencyDirectivesSourceMinimizer.cpp
[3046/4610] /Users/buildslave/jenkins/workspace/clang-stage2-coverage-R/host-compiler/bin/clang++  -DGTEST_HAS_RTTI=0 -D_GNU_SOURCE -D__STDC_CONSTANT_MACROS -D__STDC_FORMAT_MACROS -D__STDC_LIMIT_MACROS -Itools/clang/lib/Basic -I/Users/buildslave/jenkins/workspace/clang-stage2-coverage-R/llvm/tools/clang/lib/Basic -I/Users/buildslave/jenkins/workspace/clang-stage2-coverage-R/llvm/tools/clang/include -Itools/clang/include -I/Applications/Xcode.app/Contents/Developer/Platforms/MacOSX.platform/Developer/SDKs/MacOSX10.14.sdk/usr/include/libxml2 -Iinclude -I/Users/buildslave/jenkins/workspace/clang-stage2-coverage-R/llvm/include -fPIC -fvisibility-inlines-hidden -Werror=date-time -Werror=unguarded-availability-new -std=c++11 -fmodules -fmodules-cache-path=/Users/buildslave/jenkins/workspace/clang-stage2-coverage-R/clang-build/module.cache -fcxx-modules -Wall -Wextra -Wno-unused-parameter -Wwrite-strings -Wcast-qual -Wmissing-field-initializers -pedantic -Wno-long-long -Wimplicit-fallthrough -Wcovered-switch-default -Wno-noexcept-type -Wnon-virtual-dtor -Wdelete-non-virtual-dtor -Wstring-conversion -fdiagnostics-color -fprofile-instr-generate='/Users/buildslave/jenkins/workspace/clang-stage2-coverage-R/clang-build/profiles/%6m.profraw' -fcoverage-mapping -fno-common -Woverloaded-virtual -Wno-nested-anon-types -O3 -DNDEBUG -isysroot /Applications/Xcode.app/Contents/Developer/Platforms/MacOSX.platform/Developer/SDKs/MacOSX10.14.sdk    -fno-exceptions -fno-rtti -MD -MT tools/clang/lib/Basic/CMakeFiles/obj.clangBasic.dir/Targets/X86.cpp.o -MF tools/clang/lib/Basic/CMakeFiles/obj.clangBasic.dir/Targets/X86.cpp.o.d -o tools/clang/lib/Basic/CMakeFiles/obj.clangBasic.dir/Targets/X86.cpp.o -c /Users/buildslave/jenkins/workspace/clang-stage2-coverage-R/llvm/tools/clang/lib/Basic/Targets/X86.cpp
[3047/4610] /Users/buildslave/jenkins/workspace/clang-stage2-coverage-R/host-compiler/bin/clang++  -DGTEST_HAS_RTTI=0 -D_GNU_SOURCE -D__STDC_CONSTANT_MACROS -D__STDC_FORMAT_MACROS -D__STDC_LIMIT_MACROS -Itools/clang/lib/Lex -I/Users/buildslave/jenkins/workspace/clang-stage2-coverage-R/llvm/tools/clang/lib/Lex -I/Users/buildslave/jenkins/workspace/clang-stage2-coverage-R/llvm/tools/clang/include -Itools/clang/include -I/Applications/Xcode.app/Contents/Developer/Platforms/MacOSX.platform/Developer/SDKs/MacOSX10.14.sdk/usr/include/libxml2 -Iinclude -I/Users/buildslave/jenkins/workspace/clang-stage2-coverage-R/llvm/include -fPIC -fvisibility-inlines-hidden -Werror=date-time -Werror=unguarded-availability-new -std=c++11 -fmodules -fmodules-cache-path=/Users/buildslave/jenkins/workspace/clang-stage2-coverage-R/clang-build/module.cache -fcxx-modules -Wall -Wextra -Wno-unused-parameter -Wwrite-strings -Wcast-qual -Wmissing-field-initializers -pedantic -Wno-long-long -Wimplicit-fallthrough -Wcovered-switch-default -Wno-noexcept-type -Wnon-virtual-dtor -Wdelete-non-virtual-dtor -Wstring-conversion -fdiagnostics-color -fprofile-instr-generate='/Users/buildslave/jenkins/workspace/clang-stage2-coverage-R/clang-build/profiles/%6m.profraw' -fcoverage-mapping -fno-common -Woverloaded-virtual -Wno-nested-anon-types -O3 -DNDEBUG -isysroot /Applications/Xcode.app/Contents/Developer/Platforms/MacOSX.platform/Developer/SDKs/MacOSX10.14.sdk    -fno-exceptions -fno-rtti -MD -MT tools/clang/lib/Lex/CMakeFiles/obj.clangLex.dir/LiteralSupport.cpp.o -MF tools/clang/lib/Lex/CMakeFiles/obj.clangLex.dir/LiteralSupport.cpp.o.d -o tools/clang/lib/Lex/CMakeFiles/obj.clangLex.dir/LiteralSupport.cpp.o -c /Users/buildslave/jenkins/workspace/clang-stage2-coverage-R/llvm/tools/clang/lib/Lex/LiteralSupport.cpp
[3048/4610] /Users/buildslave/jenkins/workspace/clang-stage2-coverage-R/host-compiler/bin/clang++  -DGTEST_HAS_RTTI=0 -D_GNU_SOURCE -D__STDC_CONSTANT_MACROS -D__STDC_FORMAT_MACROS -D__STDC_LIMIT_MACROS -Itools/clang/tools/extra/clangd -I/Users/buildslave/jenkins/workspace/clang-stage2-coverage-R/llvm/tools/clang/tools/extra/clangd -I/Users/buildslave/jenkins/workspace/clang-stage2-coverage-R/llvm/tools/clang/include -Itools/clang/include -I/Applications/Xcode.app/Contents/Developer/Platforms/MacOSX.platform/Developer/SDKs/MacOSX10.14.sdk/usr/include/libxml2 -Iinclude -I/Users/buildslave/jenkins/workspace/clang-stage2-coverage-R/llvm/include -fPIC -fvisibility-inlines-hidden -Werror=date-time -Werror=unguarded-availability-new -std=c++11 -fmodules -fmodules-cache-path=/Users/buildslave/jenkins/workspace/clang-stage2-coverage-R/clang-build/module.cache -fcxx-modules -Wall -Wextra -Wno-unused-parameter -Wwrite-strings -Wcast-qual -Wmissing-field-initializers -pedantic -Wno-long-long -Wimplicit-fallthrough -Wcovered-switch-default -Wno-noexcept-type -Wnon-virtual-dtor -Wdelete-non-virtual-dtor -Wstring-conversion -fdiagnostics-color -fprofile-instr-generate='/Users/buildslave/jenkins/workspace/clang-stage2-coverage-R/clang-build/profiles/%6m.profraw' -fcoverage-mapping -fno-common -Woverloaded-virtual -Wno-nested-anon-types -O3 -DNDEBUG -isysroot /Applications/Xcode.app/Contents/Developer/Platforms/MacOSX.platform/Developer/SDKs/MacOSX10.14.sdk    -fno-exceptions -fno-rtti -MD -MT tools/clang/tools/extra/clangd/CMakeFiles/obj.clangDaemon.dir/FindSymbols.cpp.o -MF tools/clang/tools/extra/clangd/CMakeFiles/obj.clangDaemon.dir/FindSymbols.cpp.o.d -o tools/clang/tools/extra/clangd/CMakeFiles/obj.clangDaemon.dir/FindSymbols.cpp.o -c /Users/buildslave/jenkins/workspace/clang-stage2-coverage-R/llvm/tools/clang/tools/extra/clangd/FindSymbols.cpp
FAILED: tools/clang/tools/extra/clangd/CMakeFiles/obj.clangDaemon.dir/FindSymbols.cpp.o 
/Users/buildslave/jenkins/workspace/clang-stage2-coverage-R/host-compiler/bin/clang++  -DGTEST_HAS_RTTI=0 -D_GNU_SOURCE -D__STDC_CONSTANT_MACROS -D__STDC_FORMAT_MACROS -D__STDC_LIMIT_MACROS -Itools/clang/tools/extra/clangd -I/Users/buildslave/jenkins/workspace/clang-stage2-coverage-R/llvm/tools/clang/tools/extra/clangd -I/Users/buildslave/jenkins/workspace/clang-stage2-coverage-R/llvm/tools/clang/include -Itools/clang/include -I/Applications/Xcode.app/Contents/Developer/Platforms/MacOSX.platform/Developer/SDKs/MacOSX10.14.sdk/usr/include/libxml2 -Iinclude -I/Users/buildslave/jenkins/workspace/clang-stage2-coverage-R/llvm/include -fPIC -fvisibility-inlines-hidden -Werror=date-time -Werror=unguarded-availability-new -std=c++11 -fmodules -fmodules-cache-path=/Users/buildslave/jenkins/workspace/clang-stage2-coverage-R/clang-build/module.cache -fcxx-modules -Wall -Wextra -Wno-unused-parameter -Wwrite-strings -Wcast-qual -Wmissing-field-initializers -pedantic -Wno-long-long -Wimplicit-fallthrough -Wcovered-switch-default -Wno-noexcept-type -Wnon-virtual-dtor -Wdelete-non-virtual-dtor -Wstring-conversion -fdiagnostics-color -fprofile-instr-generate='/Users/buildslave/jenkins/workspace/clang-stage2-coverage-R/clang-build/profiles/%6m.profraw' -fcoverage-mapping -fno-common -Woverloaded-virtual -Wno-nested-anon-types -O3 -DNDEBUG -isysroot /Applications/Xcode.app/Contents/Developer/Platforms/MacOSX.platform/Developer/SDKs/MacOSX10.14.sdk    -fno-exceptions -fno-rtti -MD -MT tools/clang/tools/extra/clangd/CMakeFiles/obj.clangDaemon.dir/FindSymbols.cpp.o -MF tools/clang/tools/extra/clangd/CMakeFiles/obj.clangDaemon.dir/FindSymbols.cpp.o.d -o tools/clang/tools/extra/clangd/CMakeFiles/obj.clangDaemon.dir/FindSymbols.cpp.o -c /Users/buildslave/jenkins/workspace/clang-stage2-coverage-R/llvm/tools/clang/tools/extra/clangd/FindSymbols.cpp
Assertion failed: (CachedFieldIndex && "failed to find field in parent"), function getFieldIndex, file /Users/buildslave/jenkins/workspace/clang-stage1-configure-RA/llvm/tools/clang/lib/AST/Decl.cpp, line 3965.
Stack dump:
0.	Program arguments: /Users/buildslave/jenkins/workspace/clang-stage2-coverage-R/host-compiler/bin/clang-9 -cc1 -triple x86_64-apple-macosx10.14.0 -Wdeprecated-objc-isa-usage -Werror=deprecated-objc-isa-usage -emit-obj -disable-free -main-file-name FindSymbols.cpp -mrelocation-model pic -pic-level 2 -mthread-model posix -mdisable-fp-elim -masm-verbose -munwind-tables -target-sdk-version=10.14 -target-cpu penryn -dwarf-column-info -debugger-tuning=lldb -ggnu-pubnames -target-linker-version 409.12 -fprofile-instrument-path=/Users/buildslave/jenkins/workspace/clang-stage2-coverage-R/clang-build/profiles/%6m.profraw -fprofile-instrument=clang -fcoverage-mapping -coverage-notes-file /Users/buildslave/jenkins/workspace/clang-stage2-coverage-R/clang-build/tools/clang/tools/extra/clangd/CMakeFiles/obj.clangDaemon.dir/FindSymbols.cpp.gcno -resource-dir /Users/buildslave/jenkins/workspace/clang-stage2-coverage-R/host-compiler/lib/clang/9.0.0 -dependency-file tools/clang/tools/extra/clangd/CMakeFiles/obj.clangDaemon.dir/FindSymbols.cpp.o.d -sys-header-deps -MT tools/clang/tools/extra/clangd/CMakeFiles/obj.clangDaemon.dir/FindSymbols.cpp.o -isysroot /Applications/Xcode.app/Contents/Developer/Platforms/MacOSX.platform/Developer/SDKs/MacOSX10.14.sdk -D GTEST_HAS_RTTI=0 -D _GNU_SOURCE -D __STDC_CONSTANT_MACROS -D __STDC_FORMAT_MACROS -D __STDC_LIMIT_MACROS -I tools/clang/tools/extra/clangd -I /Users/buildslave/jenkins/workspace/clang-stage2-coverage-R/llvm/tools/clang/tools/extra/clangd -I /Users/buildslave/jenkins/workspace/clang-stage2-coverage-R/llvm/tools/clang/include -I tools/clang/include -I /Applications/Xcode.app/Contents/Developer/Platforms/MacOSX.platform/Developer/SDKs/MacOSX10.14.sdk/usr/include/libxml2 -I include -I /Users/buildslave/jenkins/workspace/clang-stage2-coverage-R/llvm/include -D NDEBUG -stdlib=libc++ -internal-isystem /Users/buildslave/jenkins/workspace/clang-stage2-coverage-R/host-compiler/bin/../include/c++/v1 -internal-isystem /Applications/Xcode.app/Contents/Developer/Platforms/MacOSX.platform/Developer/SDKs/MacOSX10.14.sdk/usr/include/c++/v1 -internal-isystem /Applications/Xcode.app/Contents/Developer/Platforms/MacOSX.platform/Developer/SDKs/MacOSX10.14.sdk/usr/local/include -internal-isystem /Users/buildslave/jenkins/workspace/clang-stage2-coverage-R/host-compiler/lib/clang/9.0.0/include -internal-externc-isystem /Applications/Xcode.app/Contents/Developer/Platforms/MacOSX.platform/Developer/SDKs/MacOSX10.14.sdk/usr/include -O3 -Werror=date-time -Werror=unguarded-availability-new -Wall -Wextra -Wno-unused-parameter -Wwrite-strings -Wcast-qual -Wmissing-field-initializers -Wno-long-long -Wimplicit-fallthrough -Wcovered-switch-default -Wno-noexcept-type -Wnon-virtual-dtor -Wdelete-non-virtual-dtor -Wstring-conversion -Woverloaded-virtual -Wno-nested-anon-types -pedantic -std=c++11 -fdeprecated-macro -fdebug-compilation-dir /Users/buildslave/jenkins/workspace/clang-stage2-coverage-R/clang-build -ferror-limit 19 -fmessage-length 0 -fvisibility-inlines-hidden -stack-protector 1 -fblocks -fencode-extended-block-signature -fno-rtti -fregister-global-dtors-with-atexit -fmodules -fimplicit-module-maps -fmodules-cache-path=/Users/buildslave/jenkins/workspace/clang-stage2-coverage-R/clang-build/module.cache -fmodules-validate-system-headers -fobjc-runtime=macosx-10.14.0 -fmax-type-align=16 -fno-common -fdiagnostics-show-option -fcolor-diagnostics -vectorize-loops -vectorize-slp -o tools/clang/tools/extra/clangd/CMakeFiles/obj.clangDaemon.dir/FindSymbols.cpp.o -x c++ /Users/buildslave/jenkins/workspace/clang-stage2-coverage-R/llvm/tools/clang/tools/extra/clangd/FindSymbols.cpp 
1.	<eof> parser at end of file
2.	Per-file LLVM IR generation
3.	/Users/buildslave/jenkins/workspace/clang-stage2-coverage-R/llvm/include/llvm/Support/Error.h:625:17: Generating code for declaration 'llvm::Expected<std::__1::basic_string<char> >::getStorage'
0  clang-9                  0x000000011072e498 llvm::sys::PrintStackTrace(llvm::raw_ostream&) + 40
1  clang-9                  0x000000011072d645 llvm::sys::RunSignalHandlers() + 85
2  clang-9                  0x000000011072eaa8 SignalHandler(int) + 264
3  libsystem_platform.dylib 0x00007fff7de97b3d _sigtramp + 29
4  clang-9                  0x000000011068f7a6 llvm::FoldingSetBase::FindNodeOrInsertPos(llvm::FoldingSetNodeID const&, void*&) + 182
5  libsystem_c.dylib        0x00007fff7dd561c9 abort + 127
6  libsystem_c.dylib        0x00007fff7dd1e868 basename_r + 0
7  clang-9                  0x00000001124b16e6 clang::FieldDecl::getFieldIndex() const + 694
8  clang-9                  0x0000000110a20e55 clang::CodeGen::CodeGenFunction::EmitLValueForField(clang::CodeGen::LValue, clang::FieldDecl const*) + 1413
9  clang-9                  0x0000000110a2bb7f clang::CodeGen::CodeGenFunction::EmitMemberExpr(clang::MemberExpr const*) + 1247
10 clang-9                  0x0000000110a1d7ea clang::CodeGen::CodeGenFunction::EmitLValue(clang::Expr const*) + 1018
11 clang-9                  0x0000000110a25cdd clang::CodeGen::CodeGenFunction::EmitCheckedLValue(clang::Expr const*, clang::CodeGen::CodeGenFunction::TypeCheckKind) + 173
12 clang-9                  0x0000000110a2b7d6 clang::CodeGen::CodeGenFunction::EmitMemberExpr(clang::MemberExpr const*) + 310
13 clang-9                  0x0000000110a1d7ea clang::CodeGen::CodeGenFunction::EmitLValue(clang::Expr const*) + 1018
14 clang-9                  0x0000000110a2cd9c clang::CodeGen::CodeGenFunction::EmitCastLValue(clang::CastExpr const*) + 1372
15 clang-9                  0x0000000110a1d46f clang::CodeGen::CodeGenFunction::EmitLValue(clang::Expr const*) + 127
16 clang-9                  0x0000000110a25cdd clang::CodeGen::CodeGenFunction::EmitCheckedLValue(clang::Expr const*, clang::CodeGen::CodeGenFunction::TypeCheckKind) + 173
17 clang-9                  0x0000000110a2b7d6 clang::CodeGen::CodeGenFunction::EmitMemberExpr(clang::MemberExpr const*) + 310
18 clang-9                  0x0000000110a1d7ea clang::CodeGen::CodeGenFunction::EmitLValue(clang::Expr const*) + 1018
19 clang-9                  0x0000000110a255e7 clang::CodeGen::CodeGenFunction::EmitArrayToPointerDecay(clang::Expr const*, clang::CodeGen::LValueBaseInfo*, clang::CodeGen::TBAAAccessInfo*) + 119
20 clang-9                  0x0000000110a76348 (anonymous namespace)::ScalarExprEmitter::VisitCastExpr(clang::CastExpr*) + 3896
21 clang-9                  0x0000000110a754b4 (anonymous namespace)::ScalarExprEmitter::VisitCastExpr(clang::CastExpr*) + 164
22 clang-9                  0x0000000110a63538 clang::CodeGen::CodeGenFunction::EmitScalarExpr(clang::Expr const*, bool) + 104
23 clang-9                  0x0000000110b57f16 clang::CodeGen::CodeGenFunction::EmitReturnStmt(clang::ReturnStmt const&) + 1430
24 clang-9                  0x0000000110b55122 clang::CodeGen::CodeGenFunction::EmitStmt(clang::Stmt const*, llvm::ArrayRef<clang::Attr const*>) + 2482
25 clang-9                  0x0000000110b5d4fa clang::CodeGen::CodeGenFunction::EmitCompoundStmtWithoutScope(clang::CompoundStmt const&, bool, clang::CodeGen::AggValueSlot) + 186
26 clang-9                  0x0000000110b9d1f7 clang::CodeGen::CodeGenFunction::GenerateCode(clang::GlobalDecl, llvm::Function*, clang::CodeGen::CGFunctionInfo const&) + 791
27 clang-9                  0x0000000110bb7f97 clang::CodeGen::CodeGenModule::EmitGlobalFunctionDefinition(clang::GlobalDecl, llvm::GlobalValue*) + 503
28 clang-9                  0x0000000110bb1eb6 clang::CodeGen::CodeGenModule::EmitGlobalDefinition(clang::GlobalDecl, llvm::GlobalValue*) + 486
29 clang-9                  0x0000000110ba7ea1 clang::CodeGen::CodeGenModule::EmitDeferred() + 289
30 clang-9                  0x0000000110ba7ec9 clang::CodeGen::CodeGenModule::EmitDeferred() + 329
31 clang-9                  0x0000000110ba7ec9 clang::CodeGen::CodeGenModule::EmitDeferred() + 329
32 clang-9                  0x0000000110ba719a clang::CodeGen::CodeGenModule::Release() + 42
33 clang-9                  0x0000000110c2ef74 (anonymous namespace)::CodeGeneratorImpl::HandleTranslationUnit(clang::ASTContext&) + 100
34 clang-9                  0x0000000110b93c26 clang::BackendConsumer::HandleTranslationUnit(clang::ASTContext&) + 134
35 clang-9                  0x0000000111a930e3 clang::ParseAST(clang::Sema&, bool, bool) + 611
36 clang-9                  0x0000000110e137d4 clang::FrontendAction::Execute() + 84
37 clang-9                  0x0000000110dc5178 clang::CompilerInstance::ExecuteAction(clang::FrontendAction&) + 1544
38 clang-9                  0x0000000110e8bed0 clang::ExecuteCompilerInvocation(clang::CompilerInstance*) + 1808
39 clang-9                  0x000000010eb23c44 cc1_main(llvm::ArrayRef<char const*>, char const*, void*) + 2356
40 clang-9                  0x000000010eb212c3 main + 10851
41 libdyld.dylib            0x00007fff7dcae085 start + 1
clang-9: error: unable to execute command: Abort trap: 6
clang-9: error: clang frontend command failed due to signal (use -v to see invocation)
clang version 9.0.0 (trunk)
Target: x86_64-apple-darwin18.0.0
Thread model: posix
InstalledDir: /Users/buildslave/jenkins/workspace/clang-stage2-coverage-R/host-compiler/bin
clang-9: note: diagnostic msg: PLEASE submit a bug report to https://bugs.llvm.org/ and include the crash backtrace, preprocessed source, and associated run script.
clang-9: note: diagnostic msg: 
********************

Hide Details

PLEASE ATTACH THE FOLLOWING FILES TO THE BUG REPORT: Preprocessed source(s) and associated run script(s) are located at: clang-9: note: diagnostic msg: /var/folders/09/r4vw4v8n5kb67jl66zvlbljw0000gn/T/FindSymbols-8c21c9.cpp clang-9: note: diagnostic msg: /var/folders/09/r4vw4v8n5kb67jl66zvlbljw0000gn/T/FindSymbols-8c21c9.cache clang-9: note: diagnostic msg: /var/folders/09/r4vw4v8n5kb67jl66zvlbljw0000gn/T/FindSymbols-8c21c9.sh clang-9: note: diagnostic msg: Crash backtrace is located in clang-9: note: diagnostic msg: /Users/buildslave/Library/Logs/DiagnosticReports/clang-9_<YYYY-MM-DD-HHMMSS>_<hostname>.crash clang-9: note: diagnostic msg: (choose the .crash file that corresponds to your crash) clang-9: note: diagnostic msg:

Hide Details

******************** [3049/4610] /Users/buildslave/jenkins/workspace/clang-stage2-coverage-R/host-compiler/bin/clang++ -DGTEST_HAS_RTTI=0 -D_GNU_SOURCE -D__STDC_CONSTANT_MACROS -D__STDC_FORMAT_MACROS -D__STDC_LIMIT_MACROS -Itools/clang/lib/Lex -I/Users/buildslave/jenkins/workspace/clang-stage2-coverage-R/llvm/tools/clang/lib/Lex -I/Users/buildslave/jenkins/workspace/clang-stage2-coverage-R/llvm/tools/clang/include -Itools/clang/include -I/Applications/Xcode.app/Contents/Developer/Platforms/MacOSX.platform/Developer/SDKs/MacOSX10.14.sdk/usr/include/libxml2 -Iinclude -I/Users/buildslave/jenkins/workspace/clang-stage2-coverage-R/llvm/include -fPIC -fvisibility-inlines-hidden -Werror=date-time -Werror=unguarded-availability-new -std=c++11 -fmodules -fmodules-cache-path=/Users/buildslave/jenkins/workspace/clang-stage2-coverage-R/clang-build/module.cache -fcxx-modules -Wall -Wextra -Wno-unused-parameter -Wwrite-strings -Wcast-qual -Wmissing-field-initializers -pedantic -Wno-long-long -Wimplicit-fallthrough -Wcovered-switch-default -Wno-noexcept-type -Wnon-virtual-dtor -Wdelete-non-virtual-dtor -Wstring-conversion -fdiagnostics-color -fprofile-instr-generate='/Users/buildslave/jenkins/workspace/clang-stage2-coverage-R/clang-build/profiles/%6m.profraw' -fcoverage-mapping -fno-common -Woverloaded-virtual -Wno-nested-anon-types -O3 -DNDEBUG -isysroot /Applications/Xcode.app/Contents/Developer/Platforms/MacOSX.platform/Developer/SDKs/MacOSX10.14.sdk -fno-exceptions -fno-rtti -MD -MT tools/clang/lib/Lex/CMakeFiles/obj.clangLex.dir/HeaderSearch.cpp.o -MF tools/clang/lib/Lex/CMakeFiles/obj.clangLex.dir/HeaderSearch.cpp.o.d -o tools/clang/lib/Lex/CMakeFiles/obj.clangLex.dir/HeaderSearch.cpp.o -c /Users/buildslave/jenkins/workspace/clang-stage2-coverage-R/llvm/tools/clang/lib/Lex/HeaderSearch.cpp [3050/4610] /Users/buildslave/jenkins/workspace/clang-stage2-coverage-R/host-compiler/bin/clang++ -DGTEST_HAS_RTTI=0 -D_GNU_SOURCE -D__STDC_CONSTANT_MACROS -D__STDC_FORMAT_MACROS -D__STDC_LIMIT_MACROS -Itools/clang/lib/Lex -I/Users/buildslave/jenkins/workspace/clang-stage2-coverage-R/llvm/tools/clang/lib/Lex -I/Users/buildslave/jenkins/workspace/clang-stage2-coverage-R/llvm/tools/clang/include -Itools/clang/include -I/Applications/Xcode.app/Contents/Developer/Platforms/MacOSX.platform/Developer/SDKs/MacOSX10.14.sdk/usr/include/libxml2 -Iinclude -I/Users/buildslave/jenkins/workspace/clang-stage2-coverage-R/llvm/include -fPIC -fvisibility-inlines-hidden -Werror=date-time -Werror=unguarded-availability-new -std=c++11 -fmodules -fmodules-cache-path=/Users/buildslave/jenkins/workspace/clang-stage2-coverage-R/clang-build/module.cache -fcxx-modules -Wall -Wextra -Wno-unused-parameter -Wwrite-strings -Wcast-qual -Wmissing-field-initializers -pedantic -Wno-long-long -Wimplicit-fallthrough -Wcovered-switch-default -Wno-noexcept-type -Wnon-virtual-dtor -Wdelete-non-virtual-dtor -Wstring-conversion -fdiagnostics-color -fprofile-instr-generate='/Users/buildslave/jenkins/workspace/clang-stage2-coverage-R/clang-build/profiles/%6m.profraw' -fcoverage-mapping -fno-common -Woverloaded-virtual -Wno-nested-anon-types -O3 -DNDEBUG -isysroot /Applications/Xcode.app/Contents/Developer/Platforms/MacOSX.platform/Developer/SDKs/MacOSX10.14.sdk -fno-exceptions -fno-rtti -MD -MT tools/clang/lib/Lex/CMakeFiles/obj.clangLex.dir/MacroArgs.cpp.o -MF tools/clang/lib/Lex/CMakeFiles/obj.clangLex.dir/MacroArgs.cpp.o.d -o tools/clang/lib/Lex/CMakeFiles/obj.clangLex.dir/MacroArgs.cpp.o -c /Users/buildslave/jenkins/workspace/clang-stage2-coverage-R/llvm/tools/clang/lib/Lex/MacroArgs.cpp [3051/4610] /Users/buildslave/jenkins/workspace/clang-stage2-coverage-R/host-compiler/bin/clang++ -DGTEST_HAS_RTTI=0 -D_GNU_SOURCE -D__STDC_CONSTANT_MACROS -D__STDC_FORMAT_MACROS -D__STDC_LIMIT_MACROS -Itools/clang/lib/Lex -I/Users/buildslave/jenkins/workspace/clang-stage2-coverage-R/llvm/tools/clang/lib/Lex -I/Users/buildslave/jenkins/workspace/clang-stage2-coverage-R/llvm/tools/clang/include -Itools/clang/include -I/Applications/Xcode.app/Contents/Developer/Platforms/MacOSX.platform/Developer/SDKs/MacOSX10.14.sdk/usr/include/libxml2 -Iinclude -I/Users/buildslave/jenkins/workspace/clang-stage2-coverage-R/llvm/include -fPIC -fvisibility-inlines-hidden -Werror=date-time -Werror=unguarded-availability-new -std=c++11 -fmodules -fmodules-cache-path=/Users/buildslave/jenkins/workspace/clang-stage2-coverage-R/clang-build/module.cache -fcxx-modules -Wall -Wextra -Wno-unused-parameter -Wwrite-strings -Wcast-qual -Wmissing-field-initializers -pedantic -Wno-long-long -Wimplicit-fallthrough -Wcovered-switch-default -Wno-noexcept-type -Wnon-virtual-dtor -Wdelete-non-virtual-dtor -Wstring-conversion -fdiagnostics-color -fprofile-instr-generate='/Users/buildslave/jenkins/workspace/clang-stage2-coverage-R/clang-build/profiles/%6m.profraw' -fcoverage-mapping -fno-common -Woverloaded-virtual -Wno-nested-anon-types -O3 -DNDEBUG -isysroot /Applications/Xcode.app/Contents/Developer/Platforms/MacOSX.platform/Developer/SDKs/MacOSX10.14.sdk -fno-exceptions -fno-rtti -MD -MT tools/clang/lib/Lex/CMakeFiles/obj.clangLex.dir/Lexer.cpp.o -MF tools/clang/lib/Lex/CMakeFiles/obj.clangLex.dir/Lexer.cpp.o.d -o tools/clang/lib/Lex/CMakeFiles/obj.clangLex.dir/Lexer.cpp.o -c /Users/buildslave/jenkins/workspace/clang-stage2-coverage-R/llvm/tools/clang/lib/Lex/Lexer.cpp [3052/4610] /Users/buildslave/jenkins/workspace/clang-stage2-coverage-R/host-compiler/bin/clang++ -DGTEST_HAS_RTTI=0 -D_GNU_SOURCE -D__STDC_CONSTANT_MACROS -D__STDC_FORMAT_MACROS -D__STDC_LIMIT_MACROS -DHAVE_VCS_VERSION_INC -Itools/clang/lib/Basic -I/Users/buildslave/jenkins/workspace/clang-stage2-coverage-R/llvm/tools/clang/lib/Basic -I/Users/buildslave/jenkins/workspace/clang-stage2-coverage-R/llvm/tools/clang/include -Itools/clang/include -I/Applications/Xcode.app/Contents/Developer/Platforms/MacOSX.platform/Developer/SDKs/MacOSX10.14.sdk/usr/include/libxml2 -Iinclude -I/Users/buildslave/jenkins/workspace/clang-stage2-coverage-R/llvm/include -fPIC -fvisibility-inlines-hidden -Werror=date-time -Werror=unguarded-availability-new -std=c++11 -fmodules -fmodules-cache-path=/Users/buildslave/jenkins/workspace/clang-stage2-coverage-R/clang-build/module.cache -fcxx-modules -Wall -Wextra -Wno-unused-parameter -Wwrite-strings -Wcast-qual -Wmissing-field-initializers -pedantic -Wno-long-long -Wimplicit-fallthrough -Wcovered-switch-default -Wno-noexcept-type -Wnon-virtual-dtor -Wdelete-non-virtual-dtor -Wstring-conversion -fdiagnostics-color -fprofile-instr-generate='/Users/buildslave/jenkins/workspace/clang-stage2-coverage-R/clang-build/profiles/%6m.profraw' -fcoverage-mapping -fno-common -Woverloaded-virtual -Wno-nested-anon-types -O3 -DNDEBUG -isysroot /Applications/Xcode.app/Contents/Developer/Platforms/MacOSX.platform/Developer/SDKs/MacOSX10.14.sdk -fno-exceptions -fno-rtti -MD -MT tools/clang/lib/Basic/CMakeFiles/obj.clangBasic.dir/Version.cpp.o -MF tools/clang/lib/Basic/CMakeFiles/obj.clangBasic.dir/Version.cpp.o.d -o tools/clang/lib/Basic/CMakeFiles/obj.clangBasic.dir/Version.cpp.o -c /Users/buildslave/jenkins/workspace/clang-stage2-coverage-R/llvm/tools/clang/lib/Basic/Version.cpp [3053/4610] /Users/buildslave/jenkins/workspace/clang-stage2-coverage-R/host-compiler/bin/clang++ -DGTEST_HAS_RTTI=0 -D_GNU_SOURCE -D__STDC_CONSTANT_MACROS -D__STDC_FORMAT_MACROS -D__STDC_LIMIT_MACROS -Itools/clang/tools/extra/clangd -I/Users/buildslave/jenkins/workspace/clang-stage2-coverage-R/llvm/tools/clang/tools/extra/clangd -I/Users/buildslave/jenkins/workspace/clang-stage2-coverage-R/llvm/tools/clang/include -Itools/clang/include -I/Applications/Xcode.app/Contents/Developer/Platforms/MacOSX.platform/Developer/SDKs/MacOSX10.14.sdk/usr/include/libxml2 -Iinclude -I/Users/buildslave/jenkins/workspace/clang-stage2-coverage-R/llvm/include -fPIC -fvisibility-inlines-hidden -Werror=date-time -Werror=unguarded-availability-new -std=c++11 -fmodules -fmodules-cache-path=/Users/buildslave/jenkins/workspace/clang-stage2-coverage-R/clang-build/module.cache -fcxx-modules -Wall -Wextra -Wno-unused-parameter -Wwrite-strings -Wcast-qual -Wmissing-field-initializers -pedantic -Wno-long-long -Wimplicit-fallthrough -Wcovered-switch-default -Wno-noexcept-type -Wnon-virtual-dtor -Wdelete-non-virtual-dtor -Wstring-conversion -fdiagnostics-color -fprofile-instr-generate='/Users/buildslave/jenkins/workspace/clang-stage2-coverage-R/clang-build/profiles/%6m.profraw' -fcoverage-mapping -fno-common -Woverloaded-virtual -Wno-nested-anon-types -O3 -DNDEBUG -isysroot /Applications/Xcode.app/Contents/Developer/Platforms/MacOSX.platform/Developer/SDKs/MacOSX10.14.sdk -fno-exceptions -fno-rtti -MD -MT tools/clang/tools/extra/clangd/CMakeFiles/obj.clangDaemon.dir/Headers.cpp.o -MF tools/clang/tools/extra/clangd/CMakeFiles/obj.clangDaemon.dir/Headers.cpp.o.d -o tools/clang/tools/extra/clangd/CMakeFiles/obj.clangDaemon.dir/Headers.cpp.o -c /Users/buildslave/jenkins/workspace/clang-stage2-coverage-R/llvm/tools/clang/tools/extra/clangd/Headers.cpp FAILED: tools/clang/tools/extra/clangd/CMakeFiles/obj.clangDaemon.dir/Headers.cpp.o /Users/buildslave/jenkins/workspace/clang-stage2-coverage-R/host-compiler/bin/clang++ -DGTEST_HAS_RTTI=0 -D_GNU_SOURCE -D__STDC_CONSTANT_MACROS -D__STDC_FORMAT_MACROS -D__STDC_LIMIT_MACROS -Itools/clang/tools/extra/clangd -I/Users/buildslave/jenkins/workspace/clang-stage2-coverage-R/llvm/tools/clang/tools/extra/clangd -I/Users/buildslave/jenkins/workspace/clang-stage2-coverage-R/llvm/tools/clang/include -Itools/clang/include -I/Applications/Xcode.app/Contents/Developer/Platforms/MacOSX.platform/Developer/SDKs/MacOSX10.14.sdk/usr/include/libxml2 -Iinclude -I/Users/buildslave/jenkins/workspace/clang-stage2-coverage-R/llvm/include -fPIC -fvisibility-inlines-hidden -Werror=date-time -Werror=unguarded-availability-new -std=c++11 -fmodules -fmodules-cache-path=/Users/buildslave/jenkins/workspace/clang-stage2-coverage-R/clang-build/module.cache -fcxx-modules -Wall -Wextra -Wno-unused-parameter -Wwrite-strings -Wcast-qual -Wmissing-field-initializers -pedantic -Wno-long-long -Wimplicit-fallthrough -Wcovered-switch-default -Wno-noexcept-type -Wnon-virtual-dtor -Wdelete-non-virtual-dtor -Wstring-conversion -fdiagnostics-color -fprofile-instr-generate='/Users/buildslave/jenkins/workspace/clang-stage2-coverage-R/clang-build/profiles/%6m.profraw' -fcoverage-mapping -fno-common -Woverloaded-virtual -Wno-nested-anon-types -O3 -DNDEBUG -isysroot /Applications/Xcode.app/Contents/Developer/Platforms/MacOSX.platform/Developer/SDKs/MacOSX10.14.sdk -fno-exceptions -fno-rtti -MD -MT tools/clang/tools/extra/clangd/CMakeFiles/obj.clangDaemon.dir/Headers.cpp.o -MF tools/clang/tools/extra/clangd/CMakeFiles/obj.clangDaemon.dir/Headers.cpp.o.d -o tools/clang/tools/extra/clangd/CMakeFiles/obj.clangDaemon.dir/Headers.cpp.o -c /Users/buildslave/jenkins/workspace/clang-stage2-coverage-R/llvm/tools/clang/tools/extra/clangd/Headers.cpp Assertion failed: (CachedFieldIndex && "failed to find field in parent"), function getFieldIndex, file /Users/buildslave/jenkins/workspace/clang-stage1-configure-RA/llvm/tools/clang/lib/AST/Decl.cpp, line 3965. Stack dump: 0. Program arguments: /Users/buildslave/jenkins/workspace/clang-stage2-coverage-R/host-compiler/bin/clang-9 -cc1 -triple x86_64-apple-macosx10.14.0 -Wdeprecated-objc-isa-usage -Werror=deprecated-objc-isa-usage -emit-obj -disable-free -main-file-name Headers.cpp -mrelocation-model pic -pic-level 2 -mthread-model posix -mdisable-fp-elim -masm-verbose -munwind-tables -target-sdk-version=10.14 -target-cpu penryn -dwarf-column-info -debugger-tuning=lldb -ggnu-pubnames -target-linker-version 409.12 -fprofile-instrument-path=/Users/buildslave/jenkins/workspace/clang-stage2-coverage-R/clang-build/profiles/%6m.profraw -fprofile-instrument=clang -fcoverage-mapping -coverage-notes-file /Users/buildslave/jenkins/workspace/clang-stage2-coverage-R/clang-build/tools/clang/tools/extra/clangd/CMakeFiles/obj.clangDaemon.dir/Headers.cpp.gcno -resource-dir /Users/buildslave/jenkins/workspace/clang-stage2-coverage-R/host-compiler/lib/clang/9.0.0 -dependency-file tools/clang/tools/extra/clangd/CMakeFiles/obj.clangDaemon.dir/Headers.cpp.o.d -sys-header-deps -MT tools/clang/tools/extra/clangd/CMakeFiles/obj.clangDaemon.dir/Headers.cpp.o -isysroot /Applications/Xcode.app/Contents/Developer/Platforms/MacOSX.platform/Developer/SDKs/MacOSX10.14.sdk -D GTEST_HAS_RTTI=0 -D _GNU_SOURCE -D __STDC_CONSTANT_MACROS -D __STDC_FORMAT_MACROS -D __STDC_LIMIT_MACROS -I tools/clang/tools/extra/clangd -I /Users/buildslave/jenkins/workspace/clang-stage2-coverage-R/llvm/tools/clang/tools/extra/clangd -I /Users/buildslave/jenkins/workspace/clang-stage2-coverage-R/llvm/tools/clang/include -I tools/clang/include -I /Applications/Xcode.app/Contents/Developer/Platforms/MacOSX.platform/Developer/SDKs/MacOSX10.14.sdk/usr/include/libxml2 -I include -I /Users/buildslave/jenkins/workspace/clang-stage2-coverage-R/llvm/include -D NDEBUG -stdlib=libc++ -internal-isystem /Users/buildslave/jenkins/workspace/clang-stage2-coverage-R/host-compiler/bin/../include/c++/v1 -internal-isystem /Applications/Xcode.app/Contents/Developer/Platforms/MacOSX.platform/Developer/SDKs/MacOSX10.14.sdk/usr/include/c++/v1 -internal-isystem /Applications/Xcode.app/Contents/Developer/Platforms/MacOSX.platform/Developer/SDKs/MacOSX10.14.sdk/usr/local/include -internal-isystem /Users/buildslave/jenkins/workspace/clang-stage2-coverage-R/host-compiler/lib/clang/9.0.0/include -internal-externc-isystem /Applications/Xcode.app/Contents/Developer/Platforms/MacOSX.platform/Developer/SDKs/MacOSX10.14.sdk/usr/include -O3 -Werror=date-time -Werror=unguarded-availability-new -Wall -Wextra -Wno-unused-parameter -Wwrite-strings -Wcast-qual -Wmissing-field-initializers -Wno-long-long -Wimplicit-fallthrough -Wcovered-switch-default -Wno-noexcept-type -Wnon-virtual-dtor -Wdelete-non-virtual-dtor -Wstring-conversion -Woverloaded-virtual -Wno-nested-anon-types -pedantic -std=c++11 -fdeprecated-macro -fdebug-compilation-dir /Users/buildslave/jenkins/workspace/clang-stage2-coverage-R/clang-build -ferror-limit 19 -fmessage-length 0 -fvisibility-inlines-hidden -stack-protector 1 -fblocks -fencode-extended-block-signature -fno-rtti -fregister-global-dtors-with-atexit -fmodules -fimplicit-module-maps -fmodules-cache-path=/Users/buildslave/jenkins/workspace/clang-stage2-coverage-R/clang-build/module.cache -fmodules-validate-system-headers -fobjc-runtime=macosx-10.14.0 -fmax-type-align=16 -fno-common -fdiagnostics-show-option -fcolor-diagnostics -vectorize-loops -vectorize-slp -o tools/clang/tools/extra/clangd/CMakeFiles/obj.clangDaemon.dir/Headers.cpp.o -x c++ /Users/buildslave/jenkins/workspace/clang-stage2-coverage-R/llvm/tools/clang/tools/extra/clangd/Headers.cpp 1. <eof> parser at end of file 2. Per-file LLVM IR generation 3. /Users/buildslave/jenkins/workspace/clang-stage2-coverage-R/llvm/include/llvm/Support/Error.h:625:17: Generating code for declaration 'llvm::Expected<std::__1::basic_string<char> >::getStorage' 0 clang-9 0x0000000107e92498 llvm::sys::PrintStackTrace(llvm::raw_ostream&) + 40 1 clang-9 0x0000000107e91645 llvm::sys::RunSignalHandlers() + 85 2 clang-9 0x0000000107e92aa8 SignalHandler(int) + 264 3 libsystem_platform.dylib 0x00007fff7de97b3d _sigtramp + 29 4 clang-9 0x0000000107df37a6 llvm::FoldingSetBase::FindNodeOrInsertPos(llvm::FoldingSetNodeID const&, void*&) + 182 5 libsystem_c.dylib 0x00007fff7dd561c9 abort + 127 6 libsystem_c.dylib 0x00007fff7dd1e868 basename_r + 0 7 clang-9 0x0000000109c156e6 clang::FieldDecl::getFieldIndex() const + 694 8 clang-9 0x0000000108184e55 clang::CodeGen::CodeGenFunction::EmitLValueForField(clang::CodeGen::LValue, clang::FieldDecl const*) + 1413 9 clang-9 0x000000010818fb7f clang::CodeGen::CodeGenFunction::EmitMemberExpr(clang::MemberExpr const*) + 1247 10 clang-9 0x00000001081817ea clang::CodeGen::CodeGenFunction::EmitLValue(clang::Expr const*) + 1018 11 clang-9 0x0000000108189cdd clang::CodeGen::CodeGenFunction::EmitCheckedLValue(clang::Expr const*, clang::CodeGen::CodeGenFunction::TypeCheckKind) + 173 12 clang-9 0x000000010818f7d6 clang::CodeGen::CodeGenFunction::EmitMemberExpr(clang::MemberExpr const*) + 310 13 clang-9 0x00000001081817ea clang::CodeGen::CodeGenFunction::EmitLValue(clang::Expr const*) + 1018 14 clang-9 0x0000000108190d9c clang::CodeGen::CodeGenFunction::EmitCastLValue(clang::CastExpr const*) + 1372 15 clang-9 0x000000010818146f clang::CodeGen::CodeGenFunction::EmitLValue(clang::Expr const*) + 127 16 clang-9 0x0000000108189cdd clang::CodeGen::CodeGenFunction::EmitCheckedLValue(clang::Expr const*, clang::CodeGen::CodeGenFunction::TypeCheckKind) + 173 17 clang-9 0x000000010818f7d6 clang::CodeGen::CodeGenFunction::EmitMemberExpr(clang::MemberExpr const*) + 310 18 clang-9 0x00000001081817ea clang::CodeGen::CodeGenFunction::EmitLValue(clang::Expr const*) + 1018 19 clang-9 0x00000001081895e7 clang::CodeGen::CodeGenFunction::EmitArrayToPointerDecay(clang::Expr const*, clang::CodeGen::LValueBaseInfo*, clang::CodeGen::TBAAAccessInfo*) + 119 20 clang-9 0x00000001081da348 (anonymous namespace)::ScalarExprEmitter::VisitCastExpr(clang::CastExpr*) + 3896 21 clang-9 0x00000001081d94b4 (anonymous namespace)::ScalarExprEmitter::VisitCastExpr(clang::CastExpr*) + 164 22 clang-9 0x00000001081c7538 clang::CodeGen::CodeGenFunction::EmitScalarExpr(clang::Expr const*, bool) + 104 23 clang-9 0x00000001082bbf16 clang::CodeGen::CodeGenFunction::EmitReturnStmt(clang::ReturnStmt const&) + 1430 24 clang-9 0x00000001082b9122 clang::CodeGen::CodeGenFunction::EmitStmt(clang::Stmt const*, llvm::ArrayRef<clang::Attr const*>) + 2482 25 clang-9 0x00000001082c14fa clang::CodeGen::CodeGenFunction::EmitCompoundStmtWithoutScope(clang::CompoundStmt const&, bool, clang::CodeGen::AggValueSlot) + 186 26 clang-9 0x00000001083011f7 clang::CodeGen::CodeGenFunction::GenerateCode(clang::GlobalDecl, llvm::Function*, clang::CodeGen::CGFunctionInfo const&) + 791 27 clang-9 0x000000010831bf97 clang::CodeGen::CodeGenModule::EmitGlobalFunctionDefinition(clang::GlobalDecl, llvm::GlobalValue*) + 503 28 clang-9 0x0000000108315eb6 clang::CodeGen::CodeGenModule::EmitGlobalDefinition(clang::GlobalDecl, llvm::GlobalValue*) + 486 29 clang-9 0x000000010830bea1 clang::CodeGen::CodeGenModule::EmitDeferred() + 289 30 clang-9 0x000000010830bec9 clang::CodeGen::CodeGenModule::EmitDeferred() + 329 31 clang-9 0x000000010830bec9 clang::CodeGen::CodeGenModule::EmitDeferred() + 329 32 clang-9 0x000000010830b19a clang::CodeGen::CodeGenModule::Release() + 42 33 clang-9 0x0000000108392f74 (anonymous namespace)::CodeGeneratorImpl::HandleTranslationUnit(clang::ASTContext&) + 100 34 clang-9 0x00000001082f7c26 clang::BackendConsumer::HandleTranslationUnit(clang::ASTContext&) + 134 35 clang-9 0x00000001091f70e3 clang::ParseAST(clang::Sema&, bool, bool) + 611 36 clang-9 0x00000001085777d4 clang::FrontendAction::Execute() + 84 37 clang-9 0x0000000108529178 clang::CompilerInstance::ExecuteAction(clang::FrontendAction&) + 1544 38 clang-9 0x00000001085efed0 clang::ExecuteCompilerInvocation(clang::CompilerInstance*) + 1808 39 clang-9 0x0000000106287c44 cc1_main(llvm::ArrayRef<char const*>, char const*, void*) + 2356 40 clang-9 0x00000001062852c3 main + 10851 41 libdyld.dylib 0x00007fff7dcae085 start + 1 42 libdyld.dylib 0x0000000000000080 start + 18446603338405715964 clang-9: error: unable to execute command: Abort trap: 6 clang-9: error: clang frontend command failed due to signal (use -v to see invocation) clang version 9.0.0 (trunk) Target: x86_64-apple-darwin18.0.0 Thread model: posix InstalledDir: /Users/buildslave/jenkins/workspace/clang-stage2-coverage-R/host-compiler/bin clang-9: note: diagnostic msg: PLEASE submit a bug report to https://bugs.llvm.org/ and include the crash backtrace, preprocessed source, and associated run script. clang-9: note: diagnostic msg: ********************

Hide Details

PLEASE ATTACH THE FOLLOWING FILES TO THE BUG REPORT: Preprocessed source(s) and associated run script(s) are located at: clang-9: note: diagnostic msg: /var/folders/09/r4vw4v8n5kb67jl66zvlbljw0000gn/T/Headers-90c7a2.cpp clang-9: note: diagnostic msg: /var/folders/09/r4vw4v8n5kb67jl66zvlbljw0000gn/T/Headers-90c7a2.cache clang-9: note: diagnostic msg: /var/folders/09/r4vw4v8n5kb67jl66zvlbljw0000gn/T/Headers-90c7a2.sh clang-9: note: diagnostic msg: Crash backtrace is located in clang-9: note: diagnostic msg: /Users/buildslave/Library/Logs/DiagnosticReports/clang-9_<YYYY-MM-DD-HHMMSS>_<hostname>.crash clang-9: note: diagnostic msg: (choose the .crash file that corresponds to your crash) clang-9: note: diagnostic msg:

Hide Details

******************** ninja: build stopped: subcommand failed. Command failed Command: ['/usr/local/bin/ninja', '-v', 'all'] Build step 'Execute shell' marked build as failure [WARNINGS] Skipping publisher since build result is FAILURE [BFA] Scanning build for known causes... [BFA] Found failure cause(s): [BFA] Assertion failure from category Assert [BFA] Ninja target failed from category Compile [BFA] Compile Error from category Compile [BFA] Done. 1s Email was triggered for: Failure - Any Sending email for trigger: Failure - Any

Hide Details

Begin Pre-Send Script... Username Vedant not found in auth.groovy. This may indicate a problem with the svn-mailer.conf update process. Please check this job: http://green.lab.llvm.org/green/view/Infrastructure/job/Update%20SVN%20email%20list/ User Vedant will need to be notified of the build failure manually.

Hide Details

Username Kumar not found in auth.groovy. This may indicate a problem with the svn-mailer.conf update process. Please check this job: http://green.lab.llvm.org/green/view/Infrastructure/job/Update%20SVN%20email%20list/ User Kumar will need to be notified of the build failure manually.

Hide Details

Sending email to: vsk@apple.com JF Bastien <jfbastien@apple.com> Andi Bergen <abergen@apple.com> Azhar Mohammed <azhar@apple.com> Finished: FAILURE