FailedConsole Output

Skipping 8,351 KB.. Full Log
nused-parameter -Wwrite-strings -Wcast-qual -Wmissing-field-initializers -pedantic -Wno-long-long -Wimplicit-fallthrough -Wcovered-switch-default -Wno-noexcept-type -Wnon-virtual-dtor -Wdelete-non-virtual-dtor -Wstring-conversion -fdiagnostics-color -fprofile-instr-generate='/Users/buildslave/jenkins/workspace/clang-stage2-coverage-R/clang-build/profiles/%6m.profraw' -fcoverage-mapping -fno-common -Woverloaded-virtual -Wno-nested-anon-types -O3 -DNDEBUG -isysroot /Applications/Xcode.app/Contents/Developer/Platforms/MacOSX.platform/Developer/SDKs/MacOSX10.14.sdk -Wl,-search_paths_first -Wl,-headerpad_max_install_names -fprofile-instr-generate='/Users/buildslave/jenkins/workspace/clang-stage2-coverage-R/clang-build/profiles/%6m.profraw' -fcoverage-mapping    -Wl,-dead_strip tools/clang/tools/extra/clang-doc/tool/CMakeFiles/clang-doc.dir/ClangDocMain.cpp.o  -o bin/clang-doc  -Wl,-rpath,@loader_path/../lib lib/libLLVMSupport.a lib/libLLVMBitstreamReader.a lib/libclangAST.a lib/libclangASTMatchers.a lib/libclangBasic.a lib/libclangFrontend.a lib/libclangDoc.a lib/libclangTooling.a lib/libclangToolingCore.a lib/libclangIndex.a lib/libclangFrontend.a lib/libclangDriver.a lib/libclangParse.a lib/libLLVMMCParser.a lib/libLLVMOption.a lib/libLLVMProfileData.a lib/libclangSerialization.a lib/libclangSema.a lib/libclangEdit.a lib/libclangAnalysis.a lib/libclangASTMatchers.a lib/libLLVMBitReader.a lib/libLLVMBitstreamReader.a lib/libclangFormat.a lib/libclangToolingInclusions.a lib/libclangToolingCore.a lib/libclangAST.a lib/libclangRewrite.a lib/libclangLex.a lib/libclangBasic.a lib/libLLVMCore.a lib/libLLVMRemarks.a lib/libLLVMMC.a lib/libLLVMBinaryFormat.a lib/libLLVMDebugInfoCodeView.a lib/libLLVMDebugInfoMSF.a lib/libLLVMSupport.a -lz -lcurses -lm lib/libLLVMDemangle.a && :
[3989/4610] /Users/buildslave/jenkins/workspace/clang-stage2-coverage-R/host-compiler/bin/clang++  -DGTEST_HAS_RTTI=0 -D_GNU_SOURCE -D__STDC_CONSTANT_MACROS -D__STDC_FORMAT_MACROS -D__STDC_LIMIT_MACROS -Itools/clang/tools/extra/clang-include-fixer/find-all-symbols -I/Users/buildslave/jenkins/workspace/clang-stage2-coverage-R/llvm/tools/clang/tools/extra/clang-include-fixer/find-all-symbols -I/Users/buildslave/jenkins/workspace/clang-stage2-coverage-R/llvm/tools/clang/include -Itools/clang/include -I/Applications/Xcode.app/Contents/Developer/Platforms/MacOSX.platform/Developer/SDKs/MacOSX10.14.sdk/usr/include/libxml2 -Iinclude -I/Users/buildslave/jenkins/workspace/clang-stage2-coverage-R/llvm/include -fPIC -fvisibility-inlines-hidden -Werror=date-time -Werror=unguarded-availability-new -std=c++11 -fmodules -fmodules-cache-path=/Users/buildslave/jenkins/workspace/clang-stage2-coverage-R/clang-build/module.cache -fcxx-modules -Wall -Wextra -Wno-unused-parameter -Wwrite-strings -Wcast-qual -Wmissing-field-initializers -pedantic -Wno-long-long -Wimplicit-fallthrough -Wcovered-switch-default -Wno-noexcept-type -Wnon-virtual-dtor -Wdelete-non-virtual-dtor -Wstring-conversion -fdiagnostics-color -fprofile-instr-generate='/Users/buildslave/jenkins/workspace/clang-stage2-coverage-R/clang-build/profiles/%6m.profraw' -fcoverage-mapping -fno-common -Woverloaded-virtual -Wno-nested-anon-types -O3 -DNDEBUG -isysroot /Applications/Xcode.app/Contents/Developer/Platforms/MacOSX.platform/Developer/SDKs/MacOSX10.14.sdk    -fno-exceptions -fno-rtti -MD -MT tools/clang/tools/extra/clang-include-fixer/find-all-symbols/CMakeFiles/obj.findAllSymbols.dir/SymbolInfo.cpp.o -MF tools/clang/tools/extra/clang-include-fixer/find-all-symbols/CMakeFiles/obj.findAllSymbols.dir/SymbolInfo.cpp.o.d -o tools/clang/tools/extra/clang-include-fixer/find-all-symbols/CMakeFiles/obj.findAllSymbols.dir/SymbolInfo.cpp.o -c /Users/buildslave/jenkins/workspace/clang-stage2-coverage-R/llvm/tools/clang/tools/extra/clang-include-fixer/find-all-symbols/SymbolInfo.cpp
[3990/4610] /Users/buildslave/jenkins/workspace/clang-stage2-coverage-R/host-compiler/bin/clang++  -DGTEST_HAS_RTTI=0 -D_GNU_SOURCE -D__STDC_CONSTANT_MACROS -D__STDC_FORMAT_MACROS -D__STDC_LIMIT_MACROS -Itools/clang/tools/extra/clang-include-fixer/tool -I/Users/buildslave/jenkins/workspace/clang-stage2-coverage-R/llvm/tools/clang/tools/extra/clang-include-fixer/tool -I/Users/buildslave/jenkins/workspace/clang-stage2-coverage-R/llvm/tools/clang/include -Itools/clang/include -I/Applications/Xcode.app/Contents/Developer/Platforms/MacOSX.platform/Developer/SDKs/MacOSX10.14.sdk/usr/include/libxml2 -Iinclude -I/Users/buildslave/jenkins/workspace/clang-stage2-coverage-R/llvm/include -I/Users/buildslave/jenkins/workspace/clang-stage2-coverage-R/llvm/tools/clang/tools/extra/clang-include-fixer/tool/.. -fPIC -fvisibility-inlines-hidden -Werror=date-time -Werror=unguarded-availability-new -std=c++11 -fmodules -fmodules-cache-path=/Users/buildslave/jenkins/workspace/clang-stage2-coverage-R/clang-build/module.cache -fcxx-modules -Wall -Wextra -Wno-unused-parameter -Wwrite-strings -Wcast-qual -Wmissing-field-initializers -pedantic -Wno-long-long -Wimplicit-fallthrough -Wcovered-switch-default -Wno-noexcept-type -Wnon-virtual-dtor -Wdelete-non-virtual-dtor -Wstring-conversion -fdiagnostics-color -fprofile-instr-generate='/Users/buildslave/jenkins/workspace/clang-stage2-coverage-R/clang-build/profiles/%6m.profraw' -fcoverage-mapping -fno-common -Woverloaded-virtual -Wno-nested-anon-types -O3 -DNDEBUG -isysroot /Applications/Xcode.app/Contents/Developer/Platforms/MacOSX.platform/Developer/SDKs/MacOSX10.14.sdk    -fno-exceptions -fno-rtti -MD -MT tools/clang/tools/extra/clang-include-fixer/tool/CMakeFiles/clang-include-fixer.dir/ClangIncludeFixer.cpp.o -MF tools/clang/tools/extra/clang-include-fixer/tool/CMakeFiles/clang-include-fixer.dir/ClangIncludeFixer.cpp.o.d -o tools/clang/tools/extra/clang-include-fixer/tool/CMakeFiles/clang-include-fixer.dir/ClangIncludeFixer.cpp.o -c /Users/buildslave/jenkins/workspace/clang-stage2-coverage-R/llvm/tools/clang/tools/extra/clang-include-fixer/tool/ClangIncludeFixer.cpp
[3991/4610] /Users/buildslave/jenkins/workspace/clang-stage2-coverage-R/host-compiler/bin/clang++  -DGTEST_HAS_RTTI=0 -D_GNU_SOURCE -D__STDC_CONSTANT_MACROS -D__STDC_FORMAT_MACROS -D__STDC_LIMIT_MACROS -Itools/clang/tools/extra/clang-include-fixer/find-all-symbols -I/Users/buildslave/jenkins/workspace/clang-stage2-coverage-R/llvm/tools/clang/tools/extra/clang-include-fixer/find-all-symbols -I/Users/buildslave/jenkins/workspace/clang-stage2-coverage-R/llvm/tools/clang/include -Itools/clang/include -I/Applications/Xcode.app/Contents/Developer/Platforms/MacOSX.platform/Developer/SDKs/MacOSX10.14.sdk/usr/include/libxml2 -Iinclude -I/Users/buildslave/jenkins/workspace/clang-stage2-coverage-R/llvm/include -fPIC -fvisibility-inlines-hidden -Werror=date-time -Werror=unguarded-availability-new -std=c++11 -fmodules -fmodules-cache-path=/Users/buildslave/jenkins/workspace/clang-stage2-coverage-R/clang-build/module.cache -fcxx-modules -Wall -Wextra -Wno-unused-parameter -Wwrite-strings -Wcast-qual -Wmissing-field-initializers -pedantic -Wno-long-long -Wimplicit-fallthrough -Wcovered-switch-default -Wno-noexcept-type -Wnon-virtual-dtor -Wdelete-non-virtual-dtor -Wstring-conversion -fdiagnostics-color -fprofile-instr-generate='/Users/buildslave/jenkins/workspace/clang-stage2-coverage-R/clang-build/profiles/%6m.profraw' -fcoverage-mapping -fno-common -Woverloaded-virtual -Wno-nested-anon-types -O3 -DNDEBUG -isysroot /Applications/Xcode.app/Contents/Developer/Platforms/MacOSX.platform/Developer/SDKs/MacOSX10.14.sdk    -fno-exceptions -fno-rtti -MD -MT tools/clang/tools/extra/clang-include-fixer/find-all-symbols/CMakeFiles/obj.findAllSymbols.dir/PragmaCommentHandler.cpp.o -MF tools/clang/tools/extra/clang-include-fixer/find-all-symbols/CMakeFiles/obj.findAllSymbols.dir/PragmaCommentHandler.cpp.o.d -o tools/clang/tools/extra/clang-include-fixer/find-all-symbols/CMakeFiles/obj.findAllSymbols.dir/PragmaCommentHandler.cpp.o -c /Users/buildslave/jenkins/workspace/clang-stage2-coverage-R/llvm/tools/clang/tools/extra/clang-include-fixer/find-all-symbols/PragmaCommentHandler.cpp
[3992/4610] /Users/buildslave/jenkins/workspace/clang-stage2-coverage-R/host-compiler/bin/clang++  -DGTEST_HAS_RTTI=0 -D_GNU_SOURCE -D__STDC_CONSTANT_MACROS -D__STDC_FORMAT_MACROS -D__STDC_LIMIT_MACROS -Itools/clang/tools/extra/clang-include-fixer/find-all-symbols -I/Users/buildslave/jenkins/workspace/clang-stage2-coverage-R/llvm/tools/clang/tools/extra/clang-include-fixer/find-all-symbols -I/Users/buildslave/jenkins/workspace/clang-stage2-coverage-R/llvm/tools/clang/include -Itools/clang/include -I/Applications/Xcode.app/Contents/Developer/Platforms/MacOSX.platform/Developer/SDKs/MacOSX10.14.sdk/usr/include/libxml2 -Iinclude -I/Users/buildslave/jenkins/workspace/clang-stage2-coverage-R/llvm/include -fPIC -fvisibility-inlines-hidden -Werror=date-time -Werror=unguarded-availability-new -std=c++11 -fmodules -fmodules-cache-path=/Users/buildslave/jenkins/workspace/clang-stage2-coverage-R/clang-build/module.cache -fcxx-modules -Wall -Wextra -Wno-unused-parameter -Wwrite-strings -Wcast-qual -Wmissing-field-initializers -pedantic -Wno-long-long -Wimplicit-fallthrough -Wcovered-switch-default -Wno-noexcept-type -Wnon-virtual-dtor -Wdelete-non-virtual-dtor -Wstring-conversion -fdiagnostics-color -fprofile-instr-generate='/Users/buildslave/jenkins/workspace/clang-stage2-coverage-R/clang-build/profiles/%6m.profraw' -fcoverage-mapping -fno-common -Woverloaded-virtual -Wno-nested-anon-types -O3 -DNDEBUG -isysroot /Applications/Xcode.app/Contents/Developer/Platforms/MacOSX.platform/Developer/SDKs/MacOSX10.14.sdk    -fno-exceptions -fno-rtti -MD -MT tools/clang/tools/extra/clang-include-fixer/find-all-symbols/CMakeFiles/obj.findAllSymbols.dir/FindAllSymbols.cpp.o -MF tools/clang/tools/extra/clang-include-fixer/find-all-symbols/CMakeFiles/obj.findAllSymbols.dir/FindAllSymbols.cpp.o.d -o tools/clang/tools/extra/clang-include-fixer/find-all-symbols/CMakeFiles/obj.findAllSymbols.dir/FindAllSymbols.cpp.o -c /Users/buildslave/jenkins/workspace/clang-stage2-coverage-R/llvm/tools/clang/tools/extra/clang-include-fixer/find-all-symbols/FindAllSymbols.cpp
[3993/4610] : && "/Applications/Xcode.app/Contents/Developer/Toolchains/XcodeDefault.xctoolchain/usr/bin/libtool" -static -no_warning_for_no_symbols -o lib/libfindAllSymbols.a  tools/clang/tools/extra/clang-include-fixer/find-all-symbols/CMakeFiles/obj.findAllSymbols.dir/FindAllSymbols.cpp.o tools/clang/tools/extra/clang-include-fixer/find-all-symbols/CMakeFiles/obj.findAllSymbols.dir/FindAllSymbolsAction.cpp.o tools/clang/tools/extra/clang-include-fixer/find-all-symbols/CMakeFiles/obj.findAllSymbols.dir/FindAllMacros.cpp.o tools/clang/tools/extra/clang-include-fixer/find-all-symbols/CMakeFiles/obj.findAllSymbols.dir/HeaderMapCollector.cpp.o tools/clang/tools/extra/clang-include-fixer/find-all-symbols/CMakeFiles/obj.findAllSymbols.dir/PathConfig.cpp.o tools/clang/tools/extra/clang-include-fixer/find-all-symbols/CMakeFiles/obj.findAllSymbols.dir/PragmaCommentHandler.cpp.o tools/clang/tools/extra/clang-include-fixer/find-all-symbols/CMakeFiles/obj.findAllSymbols.dir/STLPostfixHeaderMap.cpp.o tools/clang/tools/extra/clang-include-fixer/find-all-symbols/CMakeFiles/obj.findAllSymbols.dir/SymbolInfo.cpp.o && :
[3994/4610] /Users/buildslave/jenkins/workspace/clang-stage2-coverage-R/host-compiler/bin/clang++  -DGTEST_HAS_RTTI=0 -D_GNU_SOURCE -D__STDC_CONSTANT_MACROS -D__STDC_FORMAT_MACROS -D__STDC_LIMIT_MACROS -Itools/clang/tools/extra/clang-include-fixer/find-all-symbols/tool -I/Users/buildslave/jenkins/workspace/clang-stage2-coverage-R/llvm/tools/clang/tools/extra/clang-include-fixer/find-all-symbols/tool -I/Users/buildslave/jenkins/workspace/clang-stage2-coverage-R/llvm/tools/clang/include -Itools/clang/include -I/Applications/Xcode.app/Contents/Developer/Platforms/MacOSX.platform/Developer/SDKs/MacOSX10.14.sdk/usr/include/libxml2 -Iinclude -I/Users/buildslave/jenkins/workspace/clang-stage2-coverage-R/llvm/include -I/Users/buildslave/jenkins/workspace/clang-stage2-coverage-R/llvm/tools/clang/tools/extra/clang-include-fixer/find-all-symbols/tool/.. -fPIC -fvisibility-inlines-hidden -Werror=date-time -Werror=unguarded-availability-new -std=c++11 -fmodules -fmodules-cache-path=/Users/buildslave/jenkins/workspace/clang-stage2-coverage-R/clang-build/module.cache -fcxx-modules -Wall -Wextra -Wno-unused-parameter -Wwrite-strings -Wcast-qual -Wmissing-field-initializers -pedantic -Wno-long-long -Wimplicit-fallthrough -Wcovered-switch-default -Wno-noexcept-type -Wnon-virtual-dtor -Wdelete-non-virtual-dtor -Wstring-conversion -fdiagnostics-color -fprofile-instr-generate='/Users/buildslave/jenkins/workspace/clang-stage2-coverage-R/clang-build/profiles/%6m.profraw' -fcoverage-mapping -fno-common -Woverloaded-virtual -Wno-nested-anon-types -O3 -DNDEBUG -isysroot /Applications/Xcode.app/Contents/Developer/Platforms/MacOSX.platform/Developer/SDKs/MacOSX10.14.sdk    -fno-exceptions -fno-rtti -MD -MT tools/clang/tools/extra/clang-include-fixer/find-all-symbols/tool/CMakeFiles/find-all-symbols.dir/FindAllSymbolsMain.cpp.o -MF tools/clang/tools/extra/clang-include-fixer/find-all-symbols/tool/CMakeFiles/find-all-symbols.dir/FindAllSymbolsMain.cpp.o.d -o tools/clang/tools/extra/clang-include-fixer/find-all-symbols/tool/CMakeFiles/find-all-symbols.dir/FindAllSymbolsMain.cpp.o -c /Users/buildslave/jenkins/workspace/clang-stage2-coverage-R/llvm/tools/clang/tools/extra/clang-include-fixer/find-all-symbols/tool/FindAllSymbolsMain.cpp
[3995/4610] /Users/buildslave/jenkins/workspace/clang-stage2-coverage-R/host-compiler/bin/clang++  -DGTEST_HAS_RTTI=0 -D_GNU_SOURCE -D__STDC_CONSTANT_MACROS -D__STDC_FORMAT_MACROS -D__STDC_LIMIT_MACROS -Itools/clang/tools/extra/clang-move -I/Users/buildslave/jenkins/workspace/clang-stage2-coverage-R/llvm/tools/clang/tools/extra/clang-move -I/Users/buildslave/jenkins/workspace/clang-stage2-coverage-R/llvm/tools/clang/include -Itools/clang/include -I/Applications/Xcode.app/Contents/Developer/Platforms/MacOSX.platform/Developer/SDKs/MacOSX10.14.sdk/usr/include/libxml2 -Iinclude -I/Users/buildslave/jenkins/workspace/clang-stage2-coverage-R/llvm/include -fPIC -fvisibility-inlines-hidden -Werror=date-time -Werror=unguarded-availability-new -std=c++11 -fmodules -fmodules-cache-path=/Users/buildslave/jenkins/workspace/clang-stage2-coverage-R/clang-build/module.cache -fcxx-modules -Wall -Wextra -Wno-unused-parameter -Wwrite-strings -Wcast-qual -Wmissing-field-initializers -pedantic -Wno-long-long -Wimplicit-fallthrough -Wcovered-switch-default -Wno-noexcept-type -Wnon-virtual-dtor -Wdelete-non-virtual-dtor -Wstring-conversion -fdiagnostics-color -fprofile-instr-generate='/Users/buildslave/jenkins/workspace/clang-stage2-coverage-R/clang-build/profiles/%6m.profraw' -fcoverage-mapping -fno-common -Woverloaded-virtual -Wno-nested-anon-types -O3 -DNDEBUG -isysroot /Applications/Xcode.app/Contents/Developer/Platforms/MacOSX.platform/Developer/SDKs/MacOSX10.14.sdk    -fno-exceptions -fno-rtti -MD -MT tools/clang/tools/extra/clang-move/CMakeFiles/obj.clangMove.dir/HelperDeclRefGraph.cpp.o -MF tools/clang/tools/extra/clang-move/CMakeFiles/obj.clangMove.dir/HelperDeclRefGraph.cpp.o.d -o tools/clang/tools/extra/clang-move/CMakeFiles/obj.clangMove.dir/HelperDeclRefGraph.cpp.o -c /Users/buildslave/jenkins/workspace/clang-stage2-coverage-R/llvm/tools/clang/tools/extra/clang-move/HelperDeclRefGraph.cpp
[3996/4610] : && /Users/buildslave/jenkins/workspace/clang-stage2-coverage-R/host-compiler/bin/clang++  -fPIC -fvisibility-inlines-hidden -Werror=date-time -Werror=unguarded-availability-new -std=c++11 -fmodules -fmodules-cache-path=/Users/buildslave/jenkins/workspace/clang-stage2-coverage-R/clang-build/module.cache -fcxx-modules -Wall -Wextra -Wno-unused-parameter -Wwrite-strings -Wcast-qual -Wmissing-field-initializers -pedantic -Wno-long-long -Wimplicit-fallthrough -Wcovered-switch-default -Wno-noexcept-type -Wnon-virtual-dtor -Wdelete-non-virtual-dtor -Wstring-conversion -fdiagnostics-color -fprofile-instr-generate='/Users/buildslave/jenkins/workspace/clang-stage2-coverage-R/clang-build/profiles/%6m.profraw' -fcoverage-mapping -fno-common -Woverloaded-virtual -Wno-nested-anon-types -O3 -DNDEBUG -isysroot /Applications/Xcode.app/Contents/Developer/Platforms/MacOSX.platform/Developer/SDKs/MacOSX10.14.sdk -Wl,-search_paths_first -Wl,-headerpad_max_install_names -fprofile-instr-generate='/Users/buildslave/jenkins/workspace/clang-stage2-coverage-R/clang-build/profiles/%6m.profraw' -fcoverage-mapping    -Wl,-dead_strip tools/clang/tools/extra/clang-include-fixer/tool/CMakeFiles/clang-include-fixer.dir/ClangIncludeFixer.cpp.o  -o bin/clang-include-fixer  -Wl,-rpath,@loader_path/../lib lib/libLLVMSupport.a lib/libclangBasic.a lib/libclangFormat.a lib/libclangFrontend.a lib/libclangIncludeFixer.a lib/libclangRewrite.a lib/libclangSerialization.a lib/libclangTooling.a lib/libclangToolingCore.a lib/libfindAllSymbols.a lib/libclangTooling.a lib/libclangFormat.a lib/libclangToolingInclusions.a lib/libclangFrontend.a lib/libLLVMProfileData.a lib/libclangSerialization.a lib/libLLVMBitReader.a lib/libLLVMBitstreamReader.a lib/libclangToolingCore.a lib/libclangRewrite.a lib/libclangDriver.a lib/libLLVMOption.a lib/libclangParse.a lib/libLLVMMCParser.a lib/libclangSema.a lib/libclangEdit.a lib/libclangAnalysis.a lib/libclangASTMatchers.a lib/libclangAST.a lib/libclangLex.a lib/libclangBasic.a lib/libLLVMCore.a lib/libLLVMRemarks.a lib/libLLVMMC.a lib/libLLVMDebugInfoCodeView.a lib/libLLVMDebugInfoMSF.a lib/libLLVMBinaryFormat.a lib/libLLVMSupport.a -lz -lcurses -lm lib/libLLVMDemangle.a && :
[3997/4610] /Users/buildslave/jenkins/workspace/clang-stage2-coverage-R/host-compiler/bin/clang++  -DGTEST_HAS_RTTI=0 -D_GNU_SOURCE -D__STDC_CONSTANT_MACROS -D__STDC_FORMAT_MACROS -D__STDC_LIMIT_MACROS -Itools/clang/tools/extra/clang-query -I/Users/buildslave/jenkins/workspace/clang-stage2-coverage-R/llvm/tools/clang/tools/extra/clang-query -I/Users/buildslave/jenkins/workspace/clang-stage2-coverage-R/llvm/tools/clang/include -Itools/clang/include -I/Applications/Xcode.app/Contents/Developer/Platforms/MacOSX.platform/Developer/SDKs/MacOSX10.14.sdk/usr/include/libxml2 -Iinclude -I/Users/buildslave/jenkins/workspace/clang-stage2-coverage-R/llvm/include -fPIC -fvisibility-inlines-hidden -Werror=date-time -Werror=unguarded-availability-new -std=c++11 -fmodules -fmodules-cache-path=/Users/buildslave/jenkins/workspace/clang-stage2-coverage-R/clang-build/module.cache -fcxx-modules -Wall -Wextra -Wno-unused-parameter -Wwrite-strings -Wcast-qual -Wmissing-field-initializers -pedantic -Wno-long-long -Wimplicit-fallthrough -Wcovered-switch-default -Wno-noexcept-type -Wnon-virtual-dtor -Wdelete-non-virtual-dtor -Wstring-conversion -fdiagnostics-color -fprofile-instr-generate='/Users/buildslave/jenkins/workspace/clang-stage2-coverage-R/clang-build/profiles/%6m.profraw' -fcoverage-mapping -fno-common -Woverloaded-virtual -Wno-nested-anon-types -O3 -DNDEBUG -isysroot /Applications/Xcode.app/Contents/Developer/Platforms/MacOSX.platform/Developer/SDKs/MacOSX10.14.sdk    -fno-exceptions -fno-rtti -MD -MT tools/clang/tools/extra/clang-query/CMakeFiles/obj.clangQuery.dir/Query.cpp.o -MF tools/clang/tools/extra/clang-query/CMakeFiles/obj.clangQuery.dir/Query.cpp.o.d -o tools/clang/tools/extra/clang-query/CMakeFiles/obj.clangQuery.dir/Query.cpp.o -c /Users/buildslave/jenkins/workspace/clang-stage2-coverage-R/llvm/tools/clang/tools/extra/clang-query/Query.cpp
[3998/4610] /Users/buildslave/jenkins/workspace/clang-stage2-coverage-R/host-compiler/bin/clang++  -DGTEST_HAS_RTTI=0 -D_GNU_SOURCE -D__STDC_CONSTANT_MACROS -D__STDC_FORMAT_MACROS -D__STDC_LIMIT_MACROS -Itools/clang/tools/extra/clang-move/tool -I/Users/buildslave/jenkins/workspace/clang-stage2-coverage-R/llvm/tools/clang/tools/extra/clang-move/tool -I/Users/buildslave/jenkins/workspace/clang-stage2-coverage-R/llvm/tools/clang/include -Itools/clang/include -I/Applications/Xcode.app/Contents/Developer/Platforms/MacOSX.platform/Developer/SDKs/MacOSX10.14.sdk/usr/include/libxml2 -Iinclude -I/Users/buildslave/jenkins/workspace/clang-stage2-coverage-R/llvm/include -I/Users/buildslave/jenkins/workspace/clang-stage2-coverage-R/llvm/tools/clang/tools/extra/clang-move/tool/.. -fPIC -fvisibility-inlines-hidden -Werror=date-time -Werror=unguarded-availability-new -std=c++11 -fmodules -fmodules-cache-path=/Users/buildslave/jenkins/workspace/clang-stage2-coverage-R/clang-build/module.cache -fcxx-modules -Wall -Wextra -Wno-unused-parameter -Wwrite-strings -Wcast-qual -Wmissing-field-initializers -pedantic -Wno-long-long -Wimplicit-fallthrough -Wcovered-switch-default -Wno-noexcept-type -Wnon-virtual-dtor -Wdelete-non-virtual-dtor -Wstring-conversion -fdiagnostics-color -fprofile-instr-generate='/Users/buildslave/jenkins/workspace/clang-stage2-coverage-R/clang-build/profiles/%6m.profraw' -fcoverage-mapping -fno-common -Woverloaded-virtual -Wno-nested-anon-types -O3 -DNDEBUG -isysroot /Applications/Xcode.app/Contents/Developer/Platforms/MacOSX.platform/Developer/SDKs/MacOSX10.14.sdk    -fno-exceptions -fno-rtti -MD -MT tools/clang/tools/extra/clang-move/tool/CMakeFiles/clang-move.dir/ClangMove.cpp.o -MF tools/clang/tools/extra/clang-move/tool/CMakeFiles/clang-move.dir/ClangMove.cpp.o.d -o tools/clang/tools/extra/clang-move/tool/CMakeFiles/clang-move.dir/ClangMove.cpp.o -c /Users/buildslave/jenkins/workspace/clang-stage2-coverage-R/llvm/tools/clang/tools/extra/clang-move/tool/ClangMove.cpp
[3999/4610] /Users/buildslave/jenkins/workspace/clang-stage2-coverage-R/host-compiler/bin/clang++  -DGTEST_HAS_RTTI=0 -D_GNU_SOURCE -D__STDC_CONSTANT_MACROS -D__STDC_FORMAT_MACROS -D__STDC_LIMIT_MACROS -Itools/clang/tools/extra/pp-trace -I/Users/buildslave/jenkins/workspace/clang-stage2-coverage-R/llvm/tools/clang/tools/extra/pp-trace -I/Users/buildslave/jenkins/workspace/clang-stage2-coverage-R/llvm/tools/clang/include -Itools/clang/include -I/Applications/Xcode.app/Contents/Developer/Platforms/MacOSX.platform/Developer/SDKs/MacOSX10.14.sdk/usr/include/libxml2 -Iinclude -I/Users/buildslave/jenkins/workspace/clang-stage2-coverage-R/llvm/include -fPIC -fvisibility-inlines-hidden -Werror=date-time -Werror=unguarded-availability-new -std=c++11 -fmodules -fmodules-cache-path=/Users/buildslave/jenkins/workspace/clang-stage2-coverage-R/clang-build/module.cache -fcxx-modules -Wall -Wextra -Wno-unused-parameter -Wwrite-strings -Wcast-qual -Wmissing-field-initializers -pedantic -Wno-long-long -Wimplicit-fallthrough -Wcovered-switch-default -Wno-noexcept-type -Wnon-virtual-dtor -Wdelete-non-virtual-dtor -Wstring-conversion -fdiagnostics-color -fprofile-instr-generate='/Users/buildslave/jenkins/workspace/clang-stage2-coverage-R/clang-build/profiles/%6m.profraw' -fcoverage-mapping -fno-common -Woverloaded-virtual -Wno-nested-anon-types -O3 -DNDEBUG -isysroot /Applications/Xcode.app/Contents/Developer/Platforms/MacOSX.platform/Developer/SDKs/MacOSX10.14.sdk    -fno-exceptions -fno-rtti -MD -MT tools/clang/tools/extra/pp-trace/CMakeFiles/pp-trace.dir/PPCallbacksTracker.cpp.o -MF tools/clang/tools/extra/pp-trace/CMakeFiles/pp-trace.dir/PPCallbacksTracker.cpp.o.d -o tools/clang/tools/extra/pp-trace/CMakeFiles/pp-trace.dir/PPCallbacksTracker.cpp.o -c /Users/buildslave/jenkins/workspace/clang-stage2-coverage-R/llvm/tools/clang/tools/extra/pp-trace/PPCallbacksTracker.cpp
[4000/4610] : && /Users/buildslave/jenkins/workspace/clang-stage2-coverage-R/host-compiler/bin/clang++  -fPIC -fvisibility-inlines-hidden -Werror=date-time -Werror=unguarded-availability-new -std=c++11 -fmodules -fmodules-cache-path=/Users/buildslave/jenkins/workspace/clang-stage2-coverage-R/clang-build/module.cache -fcxx-modules -Wall -Wextra -Wno-unused-parameter -Wwrite-strings -Wcast-qual -Wmissing-field-initializers -pedantic -Wno-long-long -Wimplicit-fallthrough -Wcovered-switch-default -Wno-noexcept-type -Wnon-virtual-dtor -Wdelete-non-virtual-dtor -Wstring-conversion -fdiagnostics-color -fprofile-instr-generate='/Users/buildslave/jenkins/workspace/clang-stage2-coverage-R/clang-build/profiles/%6m.profraw' -fcoverage-mapping -fno-common -Woverloaded-virtual -Wno-nested-anon-types -O3 -DNDEBUG -isysroot /Applications/Xcode.app/Contents/Developer/Platforms/MacOSX.platform/Developer/SDKs/MacOSX10.14.sdk -Wl,-search_paths_first -Wl,-headerpad_max_install_names -fprofile-instr-generate='/Users/buildslave/jenkins/workspace/clang-stage2-coverage-R/clang-build/profiles/%6m.profraw' -fcoverage-mapping    -Wl,-dead_strip tools/clang/tools/extra/clang-include-fixer/find-all-symbols/tool/CMakeFiles/find-all-symbols.dir/FindAllSymbolsMain.cpp.o  -o bin/find-all-symbols  -Wl,-rpath,@loader_path/../lib lib/libLLVMSupport.a lib/libclangAST.a lib/libclangASTMatchers.a lib/libclangBasic.a lib/libclangFrontend.a lib/libclangLex.a lib/libclangSerialization.a lib/libclangTooling.a lib/libfindAllSymbols.a lib/libclangTooling.a lib/libclangFrontend.a lib/libclangParse.a lib/libLLVMMCParser.a lib/libLLVMProfileData.a lib/libclangSerialization.a lib/libclangSema.a lib/libclangEdit.a lib/libclangAnalysis.a lib/libclangASTMatchers.a lib/libLLVMBitReader.a lib/libLLVMBitstreamReader.a lib/libclangDriver.a lib/libLLVMOption.a lib/libclangFormat.a lib/libclangToolingInclusions.a lib/libclangToolingCore.a lib/libclangAST.a lib/libclangRewrite.a lib/libclangLex.a lib/libclangBasic.a lib/libLLVMCore.a lib/libLLVMRemarks.a lib/libLLVMMC.a lib/libLLVMBinaryFormat.a lib/libLLVMDebugInfoCodeView.a lib/libLLVMDebugInfoMSF.a lib/libLLVMSupport.a -lz -lcurses -lm lib/libLLVMDemangle.a && :
[4001/4610] /Users/buildslave/jenkins/workspace/clang-stage2-coverage-R/host-compiler/bin/clang++  -DGTEST_HAS_RTTI=0 -D_GNU_SOURCE -D__STDC_CONSTANT_MACROS -D__STDC_FORMAT_MACROS -D__STDC_LIMIT_MACROS -Itools/clang/tools/extra/clang-query -I/Users/buildslave/jenkins/workspace/clang-stage2-coverage-R/llvm/tools/clang/tools/extra/clang-query -I/Users/buildslave/jenkins/workspace/clang-stage2-coverage-R/llvm/tools/clang/include -Itools/clang/include -I/Applications/Xcode.app/Contents/Developer/Platforms/MacOSX.platform/Developer/SDKs/MacOSX10.14.sdk/usr/include/libxml2 -Iinclude -I/Users/buildslave/jenkins/workspace/clang-stage2-coverage-R/llvm/include -fPIC -fvisibility-inlines-hidden -Werror=date-time -Werror=unguarded-availability-new -std=c++11 -fmodules -fmodules-cache-path=/Users/buildslave/jenkins/workspace/clang-stage2-coverage-R/clang-build/module.cache -fcxx-modules -Wall -Wextra -Wno-unused-parameter -Wwrite-strings -Wcast-qual -Wmissing-field-initializers -pedantic -Wno-long-long -Wimplicit-fallthrough -Wcovered-switch-default -Wno-noexcept-type -Wnon-virtual-dtor -Wdelete-non-virtual-dtor -Wstring-conversion -fdiagnostics-color -fprofile-instr-generate='/Users/buildslave/jenkins/workspace/clang-stage2-coverage-R/clang-build/profiles/%6m.profraw' -fcoverage-mapping -fno-common -Woverloaded-virtual -Wno-nested-anon-types -O3 -DNDEBUG -isysroot /Applications/Xcode.app/Contents/Developer/Platforms/MacOSX.platform/Developer/SDKs/MacOSX10.14.sdk    -fno-exceptions -fno-rtti -MD -MT tools/clang/tools/extra/clang-query/CMakeFiles/obj.clangQuery.dir/QueryParser.cpp.o -MF tools/clang/tools/extra/clang-query/CMakeFiles/obj.clangQuery.dir/QueryParser.cpp.o.d -o tools/clang/tools/extra/clang-query/CMakeFiles/obj.clangQuery.dir/QueryParser.cpp.o -c /Users/buildslave/jenkins/workspace/clang-stage2-coverage-R/llvm/tools/clang/tools/extra/clang-query/QueryParser.cpp
[4002/4610] : && "/Applications/Xcode.app/Contents/Developer/Toolchains/XcodeDefault.xctoolchain/usr/bin/libtool" -static -no_warning_for_no_symbols -o lib/libclangQuery.a  tools/clang/tools/extra/clang-query/CMakeFiles/obj.clangQuery.dir/Query.cpp.o tools/clang/tools/extra/clang-query/CMakeFiles/obj.clangQuery.dir/QueryParser.cpp.o && :
[4003/4610] /Users/buildslave/jenkins/workspace/clang-stage2-coverage-R/host-compiler/bin/clang++  -DGTEST_HAS_RTTI=0 -D_GNU_SOURCE -D__STDC_CONSTANT_MACROS -D__STDC_FORMAT_MACROS -D__STDC_LIMIT_MACROS -Itools/clang/tools/extra/clangd -I/Users/buildslave/jenkins/workspace/clang-stage2-coverage-R/llvm/tools/clang/tools/extra/clangd -I/Users/buildslave/jenkins/workspace/clang-stage2-coverage-R/llvm/tools/clang/include -Itools/clang/include -I/Applications/Xcode.app/Contents/Developer/Platforms/MacOSX.platform/Developer/SDKs/MacOSX10.14.sdk/usr/include/libxml2 -Iinclude -I/Users/buildslave/jenkins/workspace/clang-stage2-coverage-R/llvm/include -fPIC -fvisibility-inlines-hidden -Werror=date-time -Werror=unguarded-availability-new -std=c++11 -fmodules -fmodules-cache-path=/Users/buildslave/jenkins/workspace/clang-stage2-coverage-R/clang-build/module.cache -fcxx-modules -Wall -Wextra -Wno-unused-parameter -Wwrite-strings -Wcast-qual -Wmissing-field-initializers -pedantic -Wno-long-long -Wimplicit-fallthrough -Wcovered-switch-default -Wno-noexcept-type -Wnon-virtual-dtor -Wdelete-non-virtual-dtor -Wstring-conversion -fdiagnostics-color -fprofile-instr-generate='/Users/buildslave/jenkins/workspace/clang-stage2-coverage-R/clang-build/profiles/%6m.profraw' -fcoverage-mapping -fno-common -Woverloaded-virtual -Wno-nested-anon-types -O3 -DNDEBUG -isysroot /Applications/Xcode.app/Contents/Developer/Platforms/MacOSX.platform/Developer/SDKs/MacOSX10.14.sdk    -fno-exceptions -fno-rtti -MD -MT tools/clang/tools/extra/clangd/CMakeFiles/obj.clangDaemon.dir/Cancellation.cpp.o -MF tools/clang/tools/extra/clangd/CMakeFiles/obj.clangDaemon.dir/Cancellation.cpp.o.d -o tools/clang/tools/extra/clangd/CMakeFiles/obj.clangDaemon.dir/Cancellation.cpp.o -c /Users/buildslave/jenkins/workspace/clang-stage2-coverage-R/llvm/tools/clang/tools/extra/clangd/Cancellation.cpp
[4004/4610] /Users/buildslave/jenkins/workspace/clang-stage2-coverage-R/host-compiler/bin/clang++  -DGTEST_HAS_RTTI=0 -D_GNU_SOURCE -D__STDC_CONSTANT_MACROS -D__STDC_FORMAT_MACROS -D__STDC_LIMIT_MACROS -Itools/clang/tools/extra/clang-move -I/Users/buildslave/jenkins/workspace/clang-stage2-coverage-R/llvm/tools/clang/tools/extra/clang-move -I/Users/buildslave/jenkins/workspace/clang-stage2-coverage-R/llvm/tools/clang/include -Itools/clang/include -I/Applications/Xcode.app/Contents/Developer/Platforms/MacOSX.platform/Developer/SDKs/MacOSX10.14.sdk/usr/include/libxml2 -Iinclude -I/Users/buildslave/jenkins/workspace/clang-stage2-coverage-R/llvm/include -fPIC -fvisibility-inlines-hidden -Werror=date-time -Werror=unguarded-availability-new -std=c++11 -fmodules -fmodules-cache-path=/Users/buildslave/jenkins/workspace/clang-stage2-coverage-R/clang-build/module.cache -fcxx-modules -Wall -Wextra -Wno-unused-parameter -Wwrite-strings -Wcast-qual -Wmissing-field-initializers -pedantic -Wno-long-long -Wimplicit-fallthrough -Wcovered-switch-default -Wno-noexcept-type -Wnon-virtual-dtor -Wdelete-non-virtual-dtor -Wstring-conversion -fdiagnostics-color -fprofile-instr-generate='/Users/buildslave/jenkins/workspace/clang-stage2-coverage-R/clang-build/profiles/%6m.profraw' -fcoverage-mapping -fno-common -Woverloaded-virtual -Wno-nested-anon-types -O3 -DNDEBUG -isysroot /Applications/Xcode.app/Contents/Developer/Platforms/MacOSX.platform/Developer/SDKs/MacOSX10.14.sdk    -fno-exceptions -fno-rtti -MD -MT tools/clang/tools/extra/clang-move/CMakeFiles/obj.clangMove.dir/Move.cpp.o -MF tools/clang/tools/extra/clang-move/CMakeFiles/obj.clangMove.dir/Move.cpp.o.d -o tools/clang/tools/extra/clang-move/CMakeFiles/obj.clangMove.dir/Move.cpp.o -c /Users/buildslave/jenkins/workspace/clang-stage2-coverage-R/llvm/tools/clang/tools/extra/clang-move/Move.cpp
[4005/4610] : && "/Applications/Xcode.app/Contents/Developer/Toolchains/XcodeDefault.xctoolchain/usr/bin/libtool" -static -no_warning_for_no_symbols -o lib/libclangMove.a  tools/clang/tools/extra/clang-move/CMakeFiles/obj.clangMove.dir/Move.cpp.o tools/clang/tools/extra/clang-move/CMakeFiles/obj.clangMove.dir/HelperDeclRefGraph.cpp.o && :
[4006/4610] /Users/buildslave/jenkins/workspace/clang-stage2-coverage-R/host-compiler/bin/clang++  -DGTEST_HAS_RTTI=0 -D_GNU_SOURCE -D__STDC_CONSTANT_MACROS -D__STDC_FORMAT_MACROS -D__STDC_LIMIT_MACROS -Itools/clang/tools/extra/clangd -I/Users/buildslave/jenkins/workspace/clang-stage2-coverage-R/llvm/tools/clang/tools/extra/clangd -I/Users/buildslave/jenkins/workspace/clang-stage2-coverage-R/llvm/tools/clang/include -Itools/clang/include -I/Applications/Xcode.app/Contents/Developer/Platforms/MacOSX.platform/Developer/SDKs/MacOSX10.14.sdk/usr/include/libxml2 -Iinclude -I/Users/buildslave/jenkins/workspace/clang-stage2-coverage-R/llvm/include -fPIC -fvisibility-inlines-hidden -Werror=date-time -Werror=unguarded-availability-new -std=c++11 -fmodules -fmodules-cache-path=/Users/buildslave/jenkins/workspace/clang-stage2-coverage-R/clang-build/module.cache -fcxx-modules -Wall -Wextra -Wno-unused-parameter -Wwrite-strings -Wcast-qual -Wmissing-field-initializers -pedantic -Wno-long-long -Wimplicit-fallthrough -Wcovered-switch-default -Wno-noexcept-type -Wnon-virtual-dtor -Wdelete-non-virtual-dtor -Wstring-conversion -fdiagnostics-color -fprofile-instr-generate='/Users/buildslave/jenkins/workspace/clang-stage2-coverage-R/clang-build/profiles/%6m.profraw' -fcoverage-mapping -fno-common -Woverloaded-virtual -Wno-nested-anon-types -O3 -DNDEBUG -isysroot /Applications/Xcode.app/Contents/Developer/Platforms/MacOSX.platform/Developer/SDKs/MacOSX10.14.sdk    -fno-exceptions -fno-rtti -MD -MT tools/clang/tools/extra/clangd/CMakeFiles/obj.clangDaemon.dir/AST.cpp.o -MF tools/clang/tools/extra/clangd/CMakeFiles/obj.clangDaemon.dir/AST.cpp.o.d -o tools/clang/tools/extra/clangd/CMakeFiles/obj.clangDaemon.dir/AST.cpp.o -c /Users/buildslave/jenkins/workspace/clang-stage2-coverage-R/llvm/tools/clang/tools/extra/clangd/AST.cpp
[4007/4610] /Users/buildslave/jenkins/workspace/clang-stage2-coverage-R/host-compiler/bin/clang++  -DGTEST_HAS_RTTI=0 -D_GNU_SOURCE -D__STDC_CONSTANT_MACROS -D__STDC_FORMAT_MACROS -D__STDC_LIMIT_MACROS -Itools/clang/tools/extra/clang-query/tool -I/Users/buildslave/jenkins/workspace/clang-stage2-coverage-R/llvm/tools/clang/tools/extra/clang-query/tool -I/Users/buildslave/jenkins/workspace/clang-stage2-coverage-R/llvm/tools/clang/include -Itools/clang/include -I/Applications/Xcode.app/Contents/Developer/Platforms/MacOSX.platform/Developer/SDKs/MacOSX10.14.sdk/usr/include/libxml2 -Iinclude -I/Users/buildslave/jenkins/workspace/clang-stage2-coverage-R/llvm/include -I/Users/buildslave/jenkins/workspace/clang-stage2-coverage-R/llvm/tools/clang/tools/extra/clang-query/tool/.. -fPIC -fvisibility-inlines-hidden -Werror=date-time -Werror=unguarded-availability-new -std=c++11 -fmodules -fmodules-cache-path=/Users/buildslave/jenkins/workspace/clang-stage2-coverage-R/clang-build/module.cache -fcxx-modules -Wall -Wextra -Wno-unused-parameter -Wwrite-strings -Wcast-qual -Wmissing-field-initializers -pedantic -Wno-long-long -Wimplicit-fallthrough -Wcovered-switch-default -Wno-noexcept-type -Wnon-virtual-dtor -Wdelete-non-virtual-dtor -Wstring-conversion -fdiagnostics-color -fprofile-instr-generate='/Users/buildslave/jenkins/workspace/clang-stage2-coverage-R/clang-build/profiles/%6m.profraw' -fcoverage-mapping -fno-common -Woverloaded-virtual -Wno-nested-anon-types -O3 -DNDEBUG -isysroot /Applications/Xcode.app/Contents/Developer/Platforms/MacOSX.platform/Developer/SDKs/MacOSX10.14.sdk    -fno-exceptions -fno-rtti -MD -MT tools/clang/tools/extra/clang-query/tool/CMakeFiles/clang-query.dir/ClangQuery.cpp.o -MF tools/clang/tools/extra/clang-query/tool/CMakeFiles/clang-query.dir/ClangQuery.cpp.o.d -o tools/clang/tools/extra/clang-query/tool/CMakeFiles/clang-query.dir/ClangQuery.cpp.o -c /Users/buildslave/jenkins/workspace/clang-stage2-coverage-R/llvm/tools/clang/tools/extra/clang-query/tool/ClangQuery.cpp
[4008/4610] /Users/buildslave/jenkins/workspace/clang-stage2-coverage-R/host-compiler/bin/clang++  -DGTEST_HAS_RTTI=0 -D_GNU_SOURCE -D__STDC_CONSTANT_MACROS -D__STDC_FORMAT_MACROS -D__STDC_LIMIT_MACROS -Itools/clang/tools/extra/pp-trace -I/Users/buildslave/jenkins/workspace/clang-stage2-coverage-R/llvm/tools/clang/tools/extra/pp-trace -I/Users/buildslave/jenkins/workspace/clang-stage2-coverage-R/llvm/tools/clang/include -Itools/clang/include -I/Applications/Xcode.app/Contents/Developer/Platforms/MacOSX.platform/Developer/SDKs/MacOSX10.14.sdk/usr/include/libxml2 -Iinclude -I/Users/buildslave/jenkins/workspace/clang-stage2-coverage-R/llvm/include -fPIC -fvisibility-inlines-hidden -Werror=date-time -Werror=unguarded-availability-new -std=c++11 -fmodules -fmodules-cache-path=/Users/buildslave/jenkins/workspace/clang-stage2-coverage-R/clang-build/module.cache -fcxx-modules -Wall -Wextra -Wno-unused-parameter -Wwrite-strings -Wcast-qual -Wmissing-field-initializers -pedantic -Wno-long-long -Wimplicit-fallthrough -Wcovered-switch-default -Wno-noexcept-type -Wnon-virtual-dtor -Wdelete-non-virtual-dtor -Wstring-conversion -fdiagnostics-color -fprofile-instr-generate='/Users/buildslave/jenkins/workspace/clang-stage2-coverage-R/clang-build/profiles/%6m.profraw' -fcoverage-mapping -fno-common -Woverloaded-virtual -Wno-nested-anon-types -O3 -DNDEBUG -isysroot /Applications/Xcode.app/Contents/Developer/Platforms/MacOSX.platform/Developer/SDKs/MacOSX10.14.sdk    -fno-exceptions -fno-rtti -MD -MT tools/clang/tools/extra/pp-trace/CMakeFiles/pp-trace.dir/PPTrace.cpp.o -MF tools/clang/tools/extra/pp-trace/CMakeFiles/pp-trace.dir/PPTrace.cpp.o.d -o tools/clang/tools/extra/pp-trace/CMakeFiles/pp-trace.dir/PPTrace.cpp.o -c /Users/buildslave/jenkins/workspace/clang-stage2-coverage-R/llvm/tools/clang/tools/extra/pp-trace/PPTrace.cpp
[4009/4610] /Users/buildslave/jenkins/workspace/clang-stage2-coverage-R/host-compiler/bin/clang++  -DGTEST_HAS_RTTI=0 -D_GNU_SOURCE -D__STDC_CONSTANT_MACROS -D__STDC_FORMAT_MACROS -D__STDC_LIMIT_MACROS -Itools/clang/tools/extra/tool-template -I/Users/buildslave/jenkins/workspace/clang-stage2-coverage-R/llvm/tools/clang/tools/extra/tool-template -I/Users/buildslave/jenkins/workspace/clang-stage2-coverage-R/llvm/tools/clang/include -Itools/clang/include -I/Applications/Xcode.app/Contents/Developer/Platforms/MacOSX.platform/Developer/SDKs/MacOSX10.14.sdk/usr/include/libxml2 -Iinclude -I/Users/buildslave/jenkins/workspace/clang-stage2-coverage-R/llvm/include -fPIC -fvisibility-inlines-hidden -Werror=date-time -Werror=unguarded-availability-new -std=c++11 -fmodules -fmodules-cache-path=/Users/buildslave/jenkins/workspace/clang-stage2-coverage-R/clang-build/module.cache -fcxx-modules -Wall -Wextra -Wno-unused-parameter -Wwrite-strings -Wcast-qual -Wmissing-field-initializers -pedantic -Wno-long-long -Wimplicit-fallthrough -Wcovered-switch-default -Wno-noexcept-type -Wnon-virtual-dtor -Wdelete-non-virtual-dtor -Wstring-conversion -fdiagnostics-color -fprofile-instr-generate='/Users/buildslave/jenkins/workspace/clang-stage2-coverage-R/clang-build/profiles/%6m.profraw' -fcoverage-mapping -fno-common -Woverloaded-virtual -Wno-nested-anon-types -O3 -DNDEBUG -isysroot /Applications/Xcode.app/Contents/Developer/Platforms/MacOSX.platform/Developer/SDKs/MacOSX10.14.sdk    -fno-exceptions -fno-rtti -MD -MT tools/clang/tools/extra/tool-template/CMakeFiles/tool-template.dir/ToolTemplate.cpp.o -MF tools/clang/tools/extra/tool-template/CMakeFiles/tool-template.dir/ToolTemplate.cpp.o.d -o tools/clang/tools/extra/tool-template/CMakeFiles/tool-template.dir/ToolTemplate.cpp.o -c /Users/buildslave/jenkins/workspace/clang-stage2-coverage-R/llvm/tools/clang/tools/extra/tool-template/ToolTemplate.cpp
[4010/4610] : && /Users/buildslave/jenkins/workspace/clang-stage2-coverage-R/host-compiler/bin/clang++  -fPIC -fvisibility-inlines-hidden -Werror=date-time -Werror=unguarded-availability-new -std=c++11 -fmodules -fmodules-cache-path=/Users/buildslave/jenkins/workspace/clang-stage2-coverage-R/clang-build/module.cache -fcxx-modules -Wall -Wextra -Wno-unused-parameter -Wwrite-strings -Wcast-qual -Wmissing-field-initializers -pedantic -Wno-long-long -Wimplicit-fallthrough -Wcovered-switch-default -Wno-noexcept-type -Wnon-virtual-dtor -Wdelete-non-virtual-dtor -Wstring-conversion -fdiagnostics-color -fprofile-instr-generate='/Users/buildslave/jenkins/workspace/clang-stage2-coverage-R/clang-build/profiles/%6m.profraw' -fcoverage-mapping -fno-common -Woverloaded-virtual -Wno-nested-anon-types -O3 -DNDEBUG -isysroot /Applications/Xcode.app/Contents/Developer/Platforms/MacOSX.platform/Developer/SDKs/MacOSX10.14.sdk -Wl,-search_paths_first -Wl,-headerpad_max_install_names -fprofile-instr-generate='/Users/buildslave/jenkins/workspace/clang-stage2-coverage-R/clang-build/profiles/%6m.profraw' -fcoverage-mapping    -Wl,-dead_strip tools/clang/tools/extra/clang-move/tool/CMakeFiles/clang-move.dir/ClangMove.cpp.o  -o bin/clang-move  -Wl,-rpath,@loader_path/../lib lib/libLLVMSupport.a lib/libclangAST.a lib/libclangASTMatchers.a lib/libclangBasic.a lib/libclangFormat.a lib/libclangFrontend.a lib/libclangMove.a lib/libclangRewrite.a lib/libclangSerialization.a lib/libclangTooling.a lib/libclangToolingCore.a lib/libclangFormat.a lib/libclangToolingInclusions.a lib/libclangFrontend.a lib/libclangParse.a lib/libLLVMMCParser.a lib/libLLVMProfileData.a lib/libclangSerialization.a lib/libclangSema.a lib/libclangEdit.a lib/libLLVMBitReader.a lib/libLLVMBitstreamReader.a lib/libclangDriver.a lib/libLLVMOption.a lib/libclangToolingCore.a lib/libclangRewrite.a lib/libclangAnalysis.a lib/libclangASTMatchers.a lib/libclangAST.a lib/libclangLex.a lib/libclangBasic.a lib/libLLVMCore.a lib/libLLVMRemarks.a lib/libLLVMMC.a lib/libLLVMBinaryFormat.a lib/libLLVMDebugInfoCodeView.a lib/libLLVMDebugInfoMSF.a lib/libLLVMSupport.a -lz -lcurses -lm lib/libLLVMDemangle.a && :
[4011/4610] : && /Users/buildslave/jenkins/workspace/clang-stage2-coverage-R/host-compiler/bin/clang++  -fPIC -fvisibility-inlines-hidden -Werror=date-time -Werror=unguarded-availability-new -std=c++11 -fmodules -fmodules-cache-path=/Users/buildslave/jenkins/workspace/clang-stage2-coverage-R/clang-build/module.cache -fcxx-modules -Wall -Wextra -Wno-unused-parameter -Wwrite-strings -Wcast-qual -Wmissing-field-initializers -pedantic -Wno-long-long -Wimplicit-fallthrough -Wcovered-switch-default -Wno-noexcept-type -Wnon-virtual-dtor -Wdelete-non-virtual-dtor -Wstring-conversion -fdiagnostics-color -fprofile-instr-generate='/Users/buildslave/jenkins/workspace/clang-stage2-coverage-R/clang-build/profiles/%6m.profraw' -fcoverage-mapping -fno-common -Woverloaded-virtual -Wno-nested-anon-types -O3 -DNDEBUG -isysroot /Applications/Xcode.app/Contents/Developer/Platforms/MacOSX.platform/Developer/SDKs/MacOSX10.14.sdk -Wl,-search_paths_first -Wl,-headerpad_max_install_names -fprofile-instr-generate='/Users/buildslave/jenkins/workspace/clang-stage2-coverage-R/clang-build/profiles/%6m.profraw' -fcoverage-mapping    -Wl,-dead_strip tools/clang/tools/extra/clang-query/tool/CMakeFiles/clang-query.dir/ClangQuery.cpp.o  -o bin/clang-query  -Wl,-rpath,@loader_path/../lib lib/libLLVMLineEditor.a lib/libLLVMSupport.a lib/libclangAST.a lib/libclangASTMatchers.a lib/libclangBasic.a lib/libclangDynamicASTMatchers.a lib/libclangFrontend.a lib/libclangQuery.a lib/libclangSerialization.a lib/libclangTooling.a lib/libLLVMLineEditor.a -ledit lib/libclangDynamicASTMatchers.a lib/libclangFrontend.a lib/libclangParse.a lib/libLLVMMCParser.a lib/libLLVMProfileData.a lib/libclangSerialization.a lib/libclangSema.a lib/libclangEdit.a lib/libclangAnalysis.a lib/libclangASTMatchers.a lib/libLLVMBitReader.a lib/libLLVMBitstreamReader.a lib/libclangDriver.a lib/libLLVMOption.a lib/libclangFormat.a lib/libclangToolingInclusions.a lib/libclangToolingCore.a lib/libclangAST.a lib/libclangRewrite.a lib/libclangLex.a lib/libclangBasic.a lib/libLLVMCore.a lib/libLLVMRemarks.a lib/libLLVMMC.a lib/libLLVMBinaryFormat.a lib/libLLVMDebugInfoCodeView.a lib/libLLVMDebugInfoMSF.a lib/libLLVMSupport.a -lz -lcurses -lm lib/libLLVMDemangle.a && :
[4012/4610] : && /Users/buildslave/jenkins/workspace/clang-stage2-coverage-R/host-compiler/bin/clang++  -fPIC -fvisibility-inlines-hidden -Werror=date-time -Werror=unguarded-availability-new -std=c++11 -fmodules -fmodules-cache-path=/Users/buildslave/jenkins/workspace/clang-stage2-coverage-R/clang-build/module.cache -fcxx-modules -Wall -Wextra -Wno-unused-parameter -Wwrite-strings -Wcast-qual -Wmissing-field-initializers -pedantic -Wno-long-long -Wimplicit-fallthrough -Wcovered-switch-default -Wno-noexcept-type -Wnon-virtual-dtor -Wdelete-non-virtual-dtor -Wstring-conversion -fdiagnostics-color -fprofile-instr-generate='/Users/buildslave/jenkins/workspace/clang-stage2-coverage-R/clang-build/profiles/%6m.profraw' -fcoverage-mapping -fno-common -Woverloaded-virtual -Wno-nested-anon-types -O3 -DNDEBUG -isysroot /Applications/Xcode.app/Contents/Developer/Platforms/MacOSX.platform/Developer/SDKs/MacOSX10.14.sdk -Wl,-search_paths_first -Wl,-headerpad_max_install_names -fprofile-instr-generate='/Users/buildslave/jenkins/workspace/clang-stage2-coverage-R/clang-build/profiles/%6m.profraw' -fcoverage-mapping    -Wl,-dead_strip tools/clang/tools/extra/pp-trace/CMakeFiles/pp-trace.dir/PPTrace.cpp.o tools/clang/tools/extra/pp-trace/CMakeFiles/pp-trace.dir/PPCallbacksTracker.cpp.o  -o bin/pp-trace  -Wl,-rpath,@loader_path/../lib lib/libLLVMSupport.a lib/libclangAST.a lib/libclangBasic.a lib/libclangFrontend.a lib/libclangLex.a lib/libclangSerialization.a lib/libclangTooling.a lib/libclangFrontend.a lib/libclangParse.a lib/libLLVMMCParser.a lib/libLLVMProfileData.a lib/libclangSerialization.a lib/libclangSema.a lib/libclangEdit.a lib/libclangAnalysis.a lib/libLLVMBitReader.a lib/libLLVMBitstreamReader.a lib/libclangDriver.a lib/libLLVMOption.a lib/libclangASTMatchers.a lib/libclangFormat.a lib/libclangToolingInclusions.a lib/libclangToolingCore.a lib/libclangAST.a lib/libclangRewrite.a lib/libclangLex.a lib/libclangBasic.a lib/libLLVMCore.a lib/libLLVMRemarks.a lib/libLLVMMC.a lib/libLLVMBinaryFormat.a lib/libLLVMDebugInfoCodeView.a lib/libLLVMDebugInfoMSF.a lib/libLLVMSupport.a -lz -lcurses -lm lib/libLLVMDemangle.a && :
[4013/4610] /Users/buildslave/jenkins/workspace/clang-stage2-coverage-R/host-compiler/bin/clang++  -DGTEST_HAS_RTTI=0 -D_GNU_SOURCE -D__STDC_CONSTANT_MACROS -D__STDC_FORMAT_MACROS -D__STDC_LIMIT_MACROS -Itools/clang/tools/extra/clangd -I/Users/buildslave/jenkins/workspace/clang-stage2-coverage-R/llvm/tools/clang/tools/extra/clangd -I/Users/buildslave/jenkins/workspace/clang-stage2-coverage-R/llvm/tools/clang/include -Itools/clang/include -I/Applications/Xcode.app/Contents/Developer/Platforms/MacOSX.platform/Developer/SDKs/MacOSX10.14.sdk/usr/include/libxml2 -Iinclude -I/Users/buildslave/jenkins/workspace/clang-stage2-coverage-R/llvm/include -fPIC -fvisibility-inlines-hidden -Werror=date-time -Werror=unguarded-availability-new -std=c++11 -fmodules -fmodules-cache-path=/Users/buildslave/jenkins/workspace/clang-stage2-coverage-R/clang-build/module.cache -fcxx-modules -Wall -Wextra -Wno-unused-parameter -Wwrite-strings -Wcast-qual -Wmissing-field-initializers -pedantic -Wno-long-long -Wimplicit-fallthrough -Wcovered-switch-default -Wno-noexcept-type -Wnon-virtual-dtor -Wdelete-non-virtual-dtor -Wstring-conversion -fdiagnostics-color -fprofile-instr-generate='/Users/buildslave/jenkins/workspace/clang-stage2-coverage-R/clang-build/profiles/%6m.profraw' -fcoverage-mapping -fno-common -Woverloaded-virtual -Wno-nested-anon-types -O3 -DNDEBUG -isysroot /Applications/Xcode.app/Contents/Developer/Platforms/MacOSX.platform/Developer/SDKs/MacOSX10.14.sdk    -fno-exceptions -fno-rtti -MD -MT tools/clang/tools/extra/clangd/CMakeFiles/obj.clangDaemon.dir/CodeCompletionStrings.cpp.o -MF tools/clang/tools/extra/clangd/CMakeFiles/obj.clangDaemon.dir/CodeCompletionStrings.cpp.o.d -o tools/clang/tools/extra/clangd/CMakeFiles/obj.clangDaemon.dir/CodeCompletionStrings.cpp.o -c /Users/buildslave/jenkins/workspace/clang-stage2-coverage-R/llvm/tools/clang/tools/extra/clangd/CodeCompletionStrings.cpp
[4014/4610] : && /Users/buildslave/jenkins/workspace/clang-stage2-coverage-R/host-compiler/bin/clang++  -fPIC -fvisibility-inlines-hidden -Werror=date-time -Werror=unguarded-availability-new -std=c++11 -fmodules -fmodules-cache-path=/Users/buildslave/jenkins/workspace/clang-stage2-coverage-R/clang-build/module.cache -fcxx-modules -Wall -Wextra -Wno-unused-parameter -Wwrite-strings -Wcast-qual -Wmissing-field-initializers -pedantic -Wno-long-long -Wimplicit-fallthrough -Wcovered-switch-default -Wno-noexcept-type -Wnon-virtual-dtor -Wdelete-non-virtual-dtor -Wstring-conversion -fdiagnostics-color -fprofile-instr-generate='/Users/buildslave/jenkins/workspace/clang-stage2-coverage-R/clang-build/profiles/%6m.profraw' -fcoverage-mapping -fno-common -Woverloaded-virtual -Wno-nested-anon-types -O3 -DNDEBUG -isysroot /Applications/Xcode.app/Contents/Developer/Platforms/MacOSX.platform/Developer/SDKs/MacOSX10.14.sdk -Wl,-search_paths_first -Wl,-headerpad_max_install_names -fprofile-instr-generate='/Users/buildslave/jenkins/workspace/clang-stage2-coverage-R/clang-build/profiles/%6m.profraw' -fcoverage-mapping    -Wl,-dead_strip tools/clang/tools/extra/tool-template/CMakeFiles/tool-template.dir/ToolTemplate.cpp.o  -o bin/tool-template  -Wl,-rpath,@loader_path/../lib lib/libLLVMSupport.a lib/libclangAST.a lib/libclangASTMatchers.a lib/libclangBasic.a lib/libclangFrontend.a lib/libclangTooling.a lib/libclangToolingRefactoring.a lib/libclangIndex.a lib/libclangFrontend.a lib/libclangDriver.a lib/libclangParse.a lib/libLLVMMCParser.a lib/libLLVMOption.a lib/libLLVMProfileData.a lib/libclangSerialization.a lib/libclangSema.a lib/libclangEdit.a lib/libclangAnalysis.a lib/libclangASTMatchers.a lib/libLLVMBitReader.a lib/libLLVMBitstreamReader.a lib/libclangFormat.a lib/libclangToolingInclusions.a lib/libclangToolingCore.a lib/libclangAST.a lib/libclangRewrite.a lib/libclangLex.a lib/libclangBasic.a lib/libLLVMCore.a lib/libLLVMRemarks.a lib/libLLVMMC.a lib/libLLVMBinaryFormat.a lib/libLLVMDebugInfoCodeView.a lib/libLLVMDebugInfoMSF.a lib/libLLVMSupport.a -lz -lcurses -lm lib/libLLVMDemangle.a && :
[4015/4610] /Users/buildslave/jenkins/workspace/clang-stage2-coverage-R/host-compiler/bin/clang++  -DGTEST_HAS_RTTI=0 -D_GNU_SOURCE -D__STDC_CONSTANT_MACROS -D__STDC_FORMAT_MACROS -D__STDC_LIMIT_MACROS -Itools/clang/tools/extra/clangd -I/Users/buildslave/jenkins/workspace/clang-stage2-coverage-R/llvm/tools/clang/tools/extra/clangd -I/Users/buildslave/jenkins/workspace/clang-stage2-coverage-R/llvm/tools/clang/include -Itools/clang/include -I/Applications/Xcode.app/Contents/Developer/Platforms/MacOSX.platform/Developer/SDKs/MacOSX10.14.sdk/usr/include/libxml2 -Iinclude -I/Users/buildslave/jenkins/workspace/clang-stage2-coverage-R/llvm/include -fPIC -fvisibility-inlines-hidden -Werror=date-time -Werror=unguarded-availability-new -std=c++11 -fmodules -fmodules-cache-path=/Users/buildslave/jenkins/workspace/clang-stage2-coverage-R/clang-build/module.cache -fcxx-modules -Wall -Wextra -Wno-unused-parameter -Wwrite-strings -Wcast-qual -Wmissing-field-initializers -pedantic -Wno-long-long -Wimplicit-fallthrough -Wcovered-switch-default -Wno-noexcept-type -Wnon-virtual-dtor -Wdelete-non-virtual-dtor -Wstring-conversion -fdiagnostics-color -fprofile-instr-generate='/Users/buildslave/jenkins/workspace/clang-stage2-coverage-R/clang-build/profiles/%6m.profraw' -fcoverage-mapping -fno-common -Woverloaded-virtual -Wno-nested-anon-types -O3 -DNDEBUG -isysroot /Applications/Xcode.app/Contents/Developer/Platforms/MacOSX.platform/Developer/SDKs/MacOSX10.14.sdk    -fno-exceptions -fno-rtti -MD -MT tools/clang/tools/extra/clangd/CMakeFiles/obj.clangDaemon.dir/Context.cpp.o -MF tools/clang/tools/extra/clangd/CMakeFiles/obj.clangDaemon.dir/Context.cpp.o.d -o tools/clang/tools/extra/clangd/CMakeFiles/obj.clangDaemon.dir/Context.cpp.o -c /Users/buildslave/jenkins/workspace/clang-stage2-coverage-R/llvm/tools/clang/tools/extra/clangd/Context.cpp
[4016/4610] /Users/buildslave/jenkins/workspace/clang-stage2-coverage-R/host-compiler/bin/clang++  -DGTEST_HAS_RTTI=0 -D_GNU_SOURCE -D__STDC_CONSTANT_MACROS -D__STDC_FORMAT_MACROS -D__STDC_LIMIT_MACROS -Itools/clang/tools/extra/clangd -I/Users/buildslave/jenkins/workspace/clang-stage2-coverage-R/llvm/tools/clang/tools/extra/clangd -I/Users/buildslave/jenkins/workspace/clang-stage2-coverage-R/llvm/tools/clang/include -Itools/clang/include -I/Applications/Xcode.app/Contents/Developer/Platforms/MacOSX.platform/Developer/SDKs/MacOSX10.14.sdk/usr/include/libxml2 -Iinclude -I/Users/buildslave/jenkins/workspace/clang-stage2-coverage-R/llvm/include -fPIC -fvisibility-inlines-hidden -Werror=date-time -Werror=unguarded-availability-new -std=c++11 -fmodules -fmodules-cache-path=/Users/buildslave/jenkins/workspace/clang-stage2-coverage-R/clang-build/module.cache -fcxx-modules -Wall -Wextra -Wno-unused-parameter -Wwrite-strings -Wcast-qual -Wmissing-field-initializers -pedantic -Wno-long-long -Wimplicit-fallthrough -Wcovered-switch-default -Wno-noexcept-type -Wnon-virtual-dtor -Wdelete-non-virtual-dtor -Wstring-conversion -fdiagnostics-color -fprofile-instr-generate='/Users/buildslave/jenkins/workspace/clang-stage2-coverage-R/clang-build/profiles/%6m.profraw' -fcoverage-mapping -fno-common -Woverloaded-virtual -Wno-nested-anon-types -O3 -DNDEBUG -isysroot /Applications/Xcode.app/Contents/Developer/Platforms/MacOSX.platform/Developer/SDKs/MacOSX10.14.sdk    -fno-exceptions -fno-rtti -MD -MT tools/clang/tools/extra/clangd/CMakeFiles/obj.clangDaemon.dir/ClangdServer.cpp.o -MF tools/clang/tools/extra/clangd/CMakeFiles/obj.clangDaemon.dir/ClangdServer.cpp.o.d -o tools/clang/tools/extra/clangd/CMakeFiles/obj.clangDaemon.dir/ClangdServer.cpp.o -c /Users/buildslave/jenkins/workspace/clang-stage2-coverage-R/llvm/tools/clang/tools/extra/clangd/ClangdServer.cpp
[4017/4610] /Users/buildslave/jenkins/workspace/clang-stage2-coverage-R/host-compiler/bin/clang++  -DGTEST_HAS_RTTI=0 -D_GNU_SOURCE -D__STDC_CONSTANT_MACROS -D__STDC_FORMAT_MACROS -D__STDC_LIMIT_MACROS -Itools/clang/tools/extra/clangd -I/Users/buildslave/jenkins/workspace/clang-stage2-coverage-R/llvm/tools/clang/tools/extra/clangd -I/Users/buildslave/jenkins/workspace/clang-stage2-coverage-R/llvm/tools/clang/include -Itools/clang/include -I/Applications/Xcode.app/Contents/Developer/Platforms/MacOSX.platform/Developer/SDKs/MacOSX10.14.sdk/usr/include/libxml2 -Iinclude -I/Users/buildslave/jenkins/workspace/clang-stage2-coverage-R/llvm/include -fPIC -fvisibility-inlines-hidden -Werror=date-time -Werror=unguarded-availability-new -std=c++11 -fmodules -fmodules-cache-path=/Users/buildslave/jenkins/workspace/clang-stage2-coverage-R/clang-build/module.cache -fcxx-modules -Wall -Wextra -Wno-unused-parameter -Wwrite-strings -Wcast-qual -Wmissing-field-initializers -pedantic -Wno-long-long -Wimplicit-fallthrough -Wcovered-switch-default -Wno-noexcept-type -Wnon-virtual-dtor -Wdelete-non-virtual-dtor -Wstring-conversion -fdiagnostics-color -fprofile-instr-generate='/Users/buildslave/jenkins/workspace/clang-stage2-coverage-R/clang-build/profiles/%6m.profraw' -fcoverage-mapping -fno-common -Woverloaded-virtual -Wno-nested-anon-types -O3 -DNDEBUG -isysroot /Applications/Xcode.app/Contents/Developer/Platforms/MacOSX.platform/Developer/SDKs/MacOSX10.14.sdk    -fno-exceptions -fno-rtti -MD -MT tools/clang/tools/extra/clangd/CMakeFiles/obj.clangDaemon.dir/Compiler.cpp.o -MF tools/clang/tools/extra/clangd/CMakeFiles/obj.clangDaemon.dir/Compiler.cpp.o.d -o tools/clang/tools/extra/clangd/CMakeFiles/obj.clangDaemon.dir/Compiler.cpp.o -c /Users/buildslave/jenkins/workspace/clang-stage2-coverage-R/llvm/tools/clang/tools/extra/clangd/Compiler.cpp
[4018/4610] /Users/buildslave/jenkins/workspace/clang-stage2-coverage-R/host-compiler/bin/clang++  -DGTEST_HAS_RTTI=0 -D_GNU_SOURCE -D__STDC_CONSTANT_MACROS -D__STDC_FORMAT_MACROS -D__STDC_LIMIT_MACROS -Itools/clang/tools/extra/clangd -I/Users/buildslave/jenkins/workspace/clang-stage2-coverage-R/llvm/tools/clang/tools/extra/clangd -I/Users/buildslave/jenkins/workspace/clang-stage2-coverage-R/llvm/tools/clang/include -Itools/clang/include -I/Applications/Xcode.app/Contents/Developer/Platforms/MacOSX.platform/Developer/SDKs/MacOSX10.14.sdk/usr/include/libxml2 -Iinclude -I/Users/buildslave/jenkins/workspace/clang-stage2-coverage-R/llvm/include -fPIC -fvisibility-inlines-hidden -Werror=date-time -Werror=unguarded-availability-new -std=c++11 -fmodules -fmodules-cache-path=/Users/buildslave/jenkins/workspace/clang-stage2-coverage-R/clang-build/module.cache -fcxx-modules -Wall -Wextra -Wno-unused-parameter -Wwrite-strings -Wcast-qual -Wmissing-field-initializers -pedantic -Wno-long-long -Wimplicit-fallthrough -Wcovered-switch-default -Wno-noexcept-type -Wnon-virtual-dtor -Wdelete-non-virtual-dtor -Wstring-conversion -fdiagnostics-color -fprofile-instr-generate='/Users/buildslave/jenkins/workspace/clang-stage2-coverage-R/clang-build/profiles/%6m.profraw' -fcoverage-mapping -fno-common -Woverloaded-virtual -Wno-nested-anon-types -O3 -DNDEBUG -isysroot /Applications/Xcode.app/Contents/Developer/Platforms/MacOSX.platform/Developer/SDKs/MacOSX10.14.sdk    -fno-exceptions -fno-rtti -MD -MT tools/clang/tools/extra/clangd/CMakeFiles/obj.clangDaemon.dir/DraftStore.cpp.o -MF tools/clang/tools/extra/clangd/CMakeFiles/obj.clangDaemon.dir/DraftStore.cpp.o.d -o tools/clang/tools/extra/clangd/CMakeFiles/obj.clangDaemon.dir/DraftStore.cpp.o -c /Users/buildslave/jenkins/workspace/clang-stage2-coverage-R/llvm/tools/clang/tools/extra/clangd/DraftStore.cpp
[4019/4610] /Users/buildslave/jenkins/workspace/clang-stage2-coverage-R/host-compiler/bin/clang++  -DGTEST_HAS_RTTI=0 -D_GNU_SOURCE -D__STDC_CONSTANT_MACROS -D__STDC_FORMAT_MACROS -D__STDC_LIMIT_MACROS -Itools/clang/tools/extra/clangd -I/Users/buildslave/jenkins/workspace/clang-stage2-coverage-R/llvm/tools/clang/tools/extra/clangd -I/Users/buildslave/jenkins/workspace/clang-stage2-coverage-R/llvm/tools/clang/include -Itools/clang/include -I/Applications/Xcode.app/Contents/Developer/Platforms/MacOSX.platform/Developer/SDKs/MacOSX10.14.sdk/usr/include/libxml2 -Iinclude -I/Users/buildslave/jenkins/workspace/clang-stage2-coverage-R/llvm/include -fPIC -fvisibility-inlines-hidden -Werror=date-time -Werror=unguarded-availability-new -std=c++11 -fmodules -fmodules-cache-path=/Users/buildslave/jenkins/workspace/clang-stage2-coverage-R/clang-build/module.cache -fcxx-modules -Wall -Wextra -Wno-unused-parameter -Wwrite-strings -Wcast-qual -Wmissing-field-initializers -pedantic -Wno-long-long -Wimplicit-fallthrough -Wcovered-switch-default -Wno-noexcept-type -Wnon-virtual-dtor -Wdelete-non-virtual-dtor -Wstring-conversion -fdiagnostics-color -fprofile-instr-generate='/Users/buildslave/jenkins/workspace/clang-stage2-coverage-R/clang-build/profiles/%6m.profraw' -fcoverage-mapping -fno-common -Woverloaded-virtual -Wno-nested-anon-types -O3 -DNDEBUG -isysroot /Applications/Xcode.app/Contents/Developer/Platforms/MacOSX.platform/Developer/SDKs/MacOSX10.14.sdk    -fno-exceptions -fno-rtti -MD -MT tools/clang/tools/extra/clangd/CMakeFiles/obj.clangDaemon.dir/ExpectedTypes.cpp.o -MF tools/clang/tools/extra/clangd/CMakeFiles/obj.clangDaemon.dir/ExpectedTypes.cpp.o.d -o tools/clang/tools/extra/clangd/CMakeFiles/obj.clangDaemon.dir/ExpectedTypes.cpp.o -c /Users/buildslave/jenkins/workspace/clang-stage2-coverage-R/llvm/tools/clang/tools/extra/clangd/ExpectedTypes.cpp
[4020/4610] /Users/buildslave/jenkins/workspace/clang-stage2-coverage-R/host-compiler/bin/clang++  -DGTEST_HAS_RTTI=0 -D_GNU_SOURCE -D__STDC_CONSTANT_MACROS -D__STDC_FORMAT_MACROS -D__STDC_LIMIT_MACROS -Itools/clang/tools/extra/clangd -I/Users/buildslave/jenkins/workspace/clang-stage2-coverage-R/llvm/tools/clang/tools/extra/clangd -I/Users/buildslave/jenkins/workspace/clang-stage2-coverage-R/llvm/tools/clang/include -Itools/clang/include -I/Applications/Xcode.app/Contents/Developer/Platforms/MacOSX.platform/Developer/SDKs/MacOSX10.14.sdk/usr/include/libxml2 -Iinclude -I/Users/buildslave/jenkins/workspace/clang-stage2-coverage-R/llvm/include -fPIC -fvisibility-inlines-hidden -Werror=date-time -Werror=unguarded-availability-new -std=c++11 -fmodules -fmodules-cache-path=/Users/buildslave/jenkins/workspace/clang-stage2-coverage-R/clang-build/module.cache -fcxx-modules -Wall -Wextra -Wno-unused-parameter -Wwrite-strings -Wcast-qual -Wmissing-field-initializers -pedantic -Wno-long-long -Wimplicit-fallthrough -Wcovered-switch-default -Wno-noexcept-type -Wnon-virtual-dtor -Wdelete-non-virtual-dtor -Wstring-conversion -fdiagnostics-color -fprofile-instr-generate='/Users/buildslave/jenkins/workspace/clang-stage2-coverage-R/clang-build/profiles/%6m.profraw' -fcoverage-mapping -fno-common -Woverloaded-virtual -Wno-nested-anon-types -O3 -DNDEBUG -isysroot /Applications/Xcode.app/Contents/Developer/Platforms/MacOSX.platform/Developer/SDKs/MacOSX10.14.sdk    -fno-exceptions -fno-rtti -MD -MT tools/clang/tools/extra/clangd/CMakeFiles/obj.clangDaemon.dir/ClangdUnit.cpp.o -MF tools/clang/tools/extra/clangd/CMakeFiles/obj.clangDaemon.dir/ClangdUnit.cpp.o.d -o tools/clang/tools/extra/clangd/CMakeFiles/obj.clangDaemon.dir/ClangdUnit.cpp.o -c /Users/buildslave/jenkins/workspace/clang-stage2-coverage-R/llvm/tools/clang/tools/extra/clangd/ClangdUnit.cpp
[4021/4610] /Users/buildslave/jenkins/workspace/clang-stage2-coverage-R/host-compiler/bin/clang++  -DGTEST_HAS_RTTI=0 -D_GNU_SOURCE -D__STDC_CONSTANT_MACROS -D__STDC_FORMAT_MACROS -D__STDC_LIMIT_MACROS -Itools/clang/tools/extra/clangd -I/Users/buildslave/jenkins/workspace/clang-stage2-coverage-R/llvm/tools/clang/tools/extra/clangd -I/Users/buildslave/jenkins/workspace/clang-stage2-coverage-R/llvm/tools/clang/include -Itools/clang/include -I/Applications/Xcode.app/Contents/Developer/Platforms/MacOSX.platform/Developer/SDKs/MacOSX10.14.sdk/usr/include/libxml2 -Iinclude -I/Users/buildslave/jenkins/workspace/clang-stage2-coverage-R/llvm/include -fPIC -fvisibility-inlines-hidden -Werror=date-time -Werror=unguarded-availability-new -std=c++11 -fmodules -fmodules-cache-path=/Users/buildslave/jenkins/workspace/clang-stage2-coverage-R/clang-build/module.cache -fcxx-modules -Wall -Wextra -Wno-unused-parameter -Wwrite-strings -Wcast-qual -Wmissing-field-initializers -pedantic -Wno-long-long -Wimplicit-fallthrough -Wcovered-switch-default -Wno-noexcept-type -Wnon-virtual-dtor -Wdelete-non-virtual-dtor -Wstring-conversion -fdiagnostics-color -fprofile-instr-generate='/Users/buildslave/jenkins/workspace/clang-stage2-coverage-R/clang-build/profiles/%6m.profraw' -fcoverage-mapping -fno-common -Woverloaded-virtual -Wno-nested-anon-types -O3 -DNDEBUG -isysroot /Applications/Xcode.app/Contents/Developer/Platforms/MacOSX.platform/Developer/SDKs/MacOSX10.14.sdk    -fno-exceptions -fno-rtti -MD -MT tools/clang/tools/extra/clangd/CMakeFiles/obj.clangDaemon.dir/FileDistance.cpp.o -MF tools/clang/tools/extra/clangd/CMakeFiles/obj.clangDaemon.dir/FileDistance.cpp.o.d -o tools/clang/tools/extra/clangd/CMakeFiles/obj.clangDaemon.dir/FileDistance.cpp.o -c /Users/buildslave/jenkins/workspace/clang-stage2-coverage-R/llvm/tools/clang/tools/extra/clangd/FileDistance.cpp
[4022/4610] /Users/buildslave/jenkins/workspace/clang-stage2-coverage-R/host-compiler/bin/clang++  -DGTEST_HAS_RTTI=0 -D_GNU_SOURCE -D__STDC_CONSTANT_MACROS -D__STDC_FORMAT_MACROS -D__STDC_LIMIT_MACROS -Itools/clang/tools/extra/clangd -I/Users/buildslave/jenkins/workspace/clang-stage2-coverage-R/llvm/tools/clang/tools/extra/clangd -I/Users/buildslave/jenkins/workspace/clang-stage2-coverage-R/llvm/tools/clang/include -Itools/clang/include -I/Applications/Xcode.app/Contents/Developer/Platforms/MacOSX.platform/Developer/SDKs/MacOSX10.14.sdk/usr/include/libxml2 -Iinclude -I/Users/buildslave/jenkins/workspace/clang-stage2-coverage-R/llvm/include -fPIC -fvisibility-inlines-hidden -Werror=date-time -Werror=unguarded-availability-new -std=c++11 -fmodules -fmodules-cache-path=/Users/buildslave/jenkins/workspace/clang-stage2-coverage-R/clang-build/module.cache -fcxx-modules -Wall -Wextra -Wno-unused-parameter -Wwrite-strings -Wcast-qual -Wmissing-field-initializers -pedantic -Wno-long-long -Wimplicit-fallthrough -Wcovered-switch-default -Wno-noexcept-type -Wnon-virtual-dtor -Wdelete-non-virtual-dtor -Wstring-conversion -fdiagnostics-color -fprofile-instr-generate='/Users/buildslave/jenkins/workspace/clang-stage2-coverage-R/clang-build/profiles/%6m.profraw' -fcoverage-mapping -fno-common -Woverloaded-virtual -Wno-nested-anon-types -O3 -DNDEBUG -isysroot /Applications/Xcode.app/Contents/Developer/Platforms/MacOSX.platform/Developer/SDKs/MacOSX10.14.sdk    -fno-exceptions -fno-rtti -MD -MT tools/clang/tools/extra/clangd/CMakeFiles/obj.clangDaemon.dir/FS.cpp.o -MF tools/clang/tools/extra/clangd/CMakeFiles/obj.clangDaemon.dir/FS.cpp.o.d -o tools/clang/tools/extra/clangd/CMakeFiles/obj.clangDaemon.dir/FS.cpp.o -c /Users/buildslave/jenkins/workspace/clang-stage2-coverage-R/llvm/tools/clang/tools/extra/clangd/FS.cpp
[4023/4610] /Users/buildslave/jenkins/workspace/clang-stage2-coverage-R/host-compiler/bin/clang++  -DGTEST_HAS_RTTI=0 -D_GNU_SOURCE -D__STDC_CONSTANT_MACROS -D__STDC_FORMAT_MACROS -D__STDC_LIMIT_MACROS -Itools/clang/tools/extra/clangd -I/Users/buildslave/jenkins/workspace/clang-stage2-coverage-R/llvm/tools/clang/tools/extra/clangd -I/Users/buildslave/jenkins/workspace/clang-stage2-coverage-R/llvm/tools/clang/include -Itools/clang/include -I/Applications/Xcode.app/Contents/Developer/Platforms/MacOSX.platform/Developer/SDKs/MacOSX10.14.sdk/usr/include/libxml2 -Iinclude -I/Users/buildslave/jenkins/workspace/clang-stage2-coverage-R/llvm/include -fPIC -fvisibility-inlines-hidden -Werror=date-time -Werror=unguarded-availability-new -std=c++11 -fmodules -fmodules-cache-path=/Users/buildslave/jenkins/workspace/clang-stage2-coverage-R/clang-build/module.cache -fcxx-modules -Wall -Wextra -Wno-unused-parameter -Wwrite-strings -Wcast-qual -Wmissing-field-initializers -pedantic -Wno-long-long -Wimplicit-fallthrough -Wcovered-switch-default -Wno-noexcept-type -Wnon-virtual-dtor -Wdelete-non-virtual-dtor -Wstring-conversion -fdiagnostics-color -fprofile-instr-generate='/Users/buildslave/jenkins/workspace/clang-stage2-coverage-R/clang-build/profiles/%6m.profraw' -fcoverage-mapping -fno-common -Woverloaded-virtual -Wno-nested-anon-types -O3 -DNDEBUG -isysroot /Applications/Xcode.app/Contents/Developer/Platforms/MacOSX.platform/Developer/SDKs/MacOSX10.14.sdk    -fno-exceptions -fno-rtti -MD -MT tools/clang/tools/extra/clangd/CMakeFiles/obj.clangDaemon.dir/Diagnostics.cpp.o -MF tools/clang/tools/extra/clangd/CMakeFiles/obj.clangDaemon.dir/Diagnostics.cpp.o.d -o tools/clang/tools/extra/clangd/CMakeFiles/obj.clangDaemon.dir/Diagnostics.cpp.o -c /Users/buildslave/jenkins/workspace/clang-stage2-coverage-R/llvm/tools/clang/tools/extra/clangd/Diagnostics.cpp
[4024/4610] /Users/buildslave/jenkins/workspace/clang-stage2-coverage-R/host-compiler/bin/clang++  -DGTEST_HAS_RTTI=0 -D_GNU_SOURCE -D__STDC_CONSTANT_MACROS -D__STDC_FORMAT_MACROS -D__STDC_LIMIT_MACROS -Itools/clang/tools/extra/clangd -I/Users/buildslave/jenkins/workspace/clang-stage2-coverage-R/llvm/tools/clang/tools/extra/clangd -I/Users/buildslave/jenkins/workspace/clang-stage2-coverage-R/llvm/tools/clang/include -Itools/clang/include -I/Applications/Xcode.app/Contents/Developer/Platforms/MacOSX.platform/Developer/SDKs/MacOSX10.14.sdk/usr/include/libxml2 -Iinclude -I/Users/buildslave/jenkins/workspace/clang-stage2-coverage-R/llvm/include -fPIC -fvisibility-inlines-hidden -Werror=date-time -Werror=unguarded-availability-new -std=c++11 -fmodules -fmodules-cache-path=/Users/buildslave/jenkins/workspace/clang-stage2-coverage-R/clang-build/module.cache -fcxx-modules -Wall -Wextra -Wno-unused-parameter -Wwrite-strings -Wcast-qual -Wmissing-field-initializers -pedantic -Wno-long-long -Wimplicit-fallthrough -Wcovered-switch-default -Wno-noexcept-type -Wnon-virtual-dtor -Wdelete-non-virtual-dtor -Wstring-conversion -fdiagnostics-color -fprofile-instr-generate='/Users/buildslave/jenkins/workspace/clang-stage2-coverage-R/clang-build/profiles/%6m.profraw' -fcoverage-mapping -fno-common -Woverloaded-virtual -Wno-nested-anon-types -O3 -DNDEBUG -isysroot /Applications/Xcode.app/Contents/Developer/Platforms/MacOSX.platform/Developer/SDKs/MacOSX10.14.sdk    -fno-exceptions -fno-rtti -MD -MT tools/clang/tools/extra/clangd/CMakeFiles/obj.clangDaemon.dir/FSProvider.cpp.o -MF tools/clang/tools/extra/clangd/CMakeFiles/obj.clangDaemon.dir/FSProvider.cpp.o.d -o tools/clang/tools/extra/clangd/CMakeFiles/obj.clangDaemon.dir/FSProvider.cpp.o -c /Users/buildslave/jenkins/workspace/clang-stage2-coverage-R/llvm/tools/clang/tools/extra/clangd/FSProvider.cpp
[4025/4610] /Users/buildslave/jenkins/workspace/clang-stage2-coverage-R/host-compiler/bin/clang++  -DGTEST_HAS_RTTI=0 -D_GNU_SOURCE -D__STDC_CONSTANT_MACROS -D__STDC_FORMAT_MACROS -D__STDC_LIMIT_MACROS -Itools/clang/tools/extra/clangd -I/Users/buildslave/jenkins/workspace/clang-stage2-coverage-R/llvm/tools/clang/tools/extra/clangd -I/Users/buildslave/jenkins/workspace/clang-stage2-coverage-R/llvm/tools/clang/include -Itools/clang/include -I/Applications/Xcode.app/Contents/Developer/Platforms/MacOSX.platform/Developer/SDKs/MacOSX10.14.sdk/usr/include/libxml2 -Iinclude -I/Users/buildslave/jenkins/workspace/clang-stage2-coverage-R/llvm/include -fPIC -fvisibility-inlines-hidden -Werror=date-time -Werror=unguarded-availability-new -std=c++11 -fmodules -fmodules-cache-path=/Users/buildslave/jenkins/workspace/clang-stage2-coverage-R/clang-build/module.cache -fcxx-modules -Wall -Wextra -Wno-unused-parameter -Wwrite-strings -Wcast-qual -Wmissing-field-initializers -pedantic -Wno-long-long -Wimplicit-fallthrough -Wcovered-switch-default -Wno-noexcept-type -Wnon-virtual-dtor -Wdelete-non-virtual-dtor -Wstring-conversion -fdiagnostics-color -fprofile-instr-generate='/Users/buildslave/jenkins/workspace/clang-stage2-coverage-R/clang-build/profiles/%6m.profraw' -fcoverage-mapping -fno-common -Woverloaded-virtual -Wno-nested-anon-types -O3 -DNDEBUG -isysroot /Applications/Xcode.app/Contents/Developer/Platforms/MacOSX.platform/Developer/SDKs/MacOSX10.14.sdk    -fno-exceptions -fno-rtti -MD -MT tools/clang/tools/extra/clangd/CMakeFiles/obj.clangDaemon.dir/FuzzyMatch.cpp.o -MF tools/clang/tools/extra/clangd/CMakeFiles/obj.clangDaemon.dir/FuzzyMatch.cpp.o.d -o tools/clang/tools/extra/clangd/CMakeFiles/obj.clangDaemon.dir/FuzzyMatch.cpp.o -c /Users/buildslave/jenkins/workspace/clang-stage2-coverage-R/llvm/tools/clang/tools/extra/clangd/FuzzyMatch.cpp
[4026/4610] /Users/buildslave/jenkins/workspace/clang-stage2-coverage-R/host-compiler/bin/clang++  -DGTEST_HAS_RTTI=0 -D_GNU_SOURCE -D__STDC_CONSTANT_MACROS -D__STDC_FORMAT_MACROS -D__STDC_LIMIT_MACROS -Itools/clang/tools/extra/clangd -I/Users/buildslave/jenkins/workspace/clang-stage2-coverage-R/llvm/tools/clang/tools/extra/clangd -I/Users/buildslave/jenkins/workspace/clang-stage2-coverage-R/llvm/tools/clang/include -Itools/clang/include -I/Applications/Xcode.app/Contents/Developer/Platforms/MacOSX.platform/Developer/SDKs/MacOSX10.14.sdk/usr/include/libxml2 -Iinclude -I/Users/buildslave/jenkins/workspace/clang-stage2-coverage-R/llvm/include -fPIC -fvisibility-inlines-hidden -Werror=date-time -Werror=unguarded-availability-new -std=c++11 -fmodules -fmodules-cache-path=/Users/buildslave/jenkins/workspace/clang-stage2-coverage-R/clang-build/module.cache -fcxx-modules -Wall -Wextra -Wno-unused-parameter -Wwrite-strings -Wcast-qual -Wmissing-field-initializers -pedantic -Wno-long-long -Wimplicit-fallthrough -Wcovered-switch-default -Wno-noexcept-type -Wnon-virtual-dtor -Wdelete-non-virtual-dtor -Wstring-conversion -fdiagnostics-color -fprofile-instr-generate='/Users/buildslave/jenkins/workspace/clang-stage2-coverage-R/clang-build/profiles/%6m.profraw' -fcoverage-mapping -fno-common -Woverloaded-virtual -Wno-nested-anon-types -O3 -DNDEBUG -isysroot /Applications/Xcode.app/Contents/Developer/Platforms/MacOSX.platform/Developer/SDKs/MacOSX10.14.sdk    -fno-exceptions -fno-rtti -MD -MT tools/clang/tools/extra/clangd/CMakeFiles/obj.clangDaemon.dir/FormattedString.cpp.o -MF tools/clang/tools/extra/clangd/CMakeFiles/obj.clangDaemon.dir/FormattedString.cpp.o.d -o tools/clang/tools/extra/clangd/CMakeFiles/obj.clangDaemon.dir/FormattedString.cpp.o -c /Users/buildslave/jenkins/workspace/clang-stage2-coverage-R/llvm/tools/clang/tools/extra/clangd/FormattedString.cpp
[4027/4610] /Users/buildslave/jenkins/workspace/clang-stage2-coverage-R/host-compiler/bin/clang++  -DGTEST_HAS_RTTI=0 -D_GNU_SOURCE -D__STDC_CONSTANT_MACROS -D__STDC_FORMAT_MACROS -D__STDC_LIMIT_MACROS -Itools/clang/tools/extra/clangd -I/Users/buildslave/jenkins/workspace/clang-stage2-coverage-R/llvm/tools/clang/tools/extra/clangd -I/Users/buildslave/jenkins/workspace/clang-stage2-coverage-R/llvm/tools/clang/include -Itools/clang/include -I/Applications/Xcode.app/Contents/Developer/Platforms/MacOSX.platform/Developer/SDKs/MacOSX10.14.sdk/usr/include/libxml2 -Iinclude -I/Users/buildslave/jenkins/workspace/clang-stage2-coverage-R/llvm/include -fPIC -fvisibility-inlines-hidden -Werror=date-time -Werror=unguarded-availability-new -std=c++11 -fmodules -fmodules-cache-path=/Users/buildslave/jenkins/workspace/clang-stage2-coverage-R/clang-build/module.cache -fcxx-modules -Wall -Wextra -Wno-unused-parameter -Wwrite-strings -Wcast-qual -Wmissing-field-initializers -pedantic -Wno-long-long -Wimplicit-fallthrough -Wcovered-switch-default -Wno-noexcept-type -Wnon-virtual-dtor -Wdelete-non-virtual-dtor -Wstring-conversion -fdiagnostics-color -fprofile-instr-generate='/Users/buildslave/jenkins/workspace/clang-stage2-coverage-R/clang-build/profiles/%6m.profraw' -fcoverage-mapping -fno-common -Woverloaded-virtual -Wno-nested-anon-types -O3 -DNDEBUG -isysroot /Applications/Xcode.app/Contents/Developer/Platforms/MacOSX.platform/Developer/SDKs/MacOSX10.14.sdk    -fno-exceptions -fno-rtti -MD -MT tools/clang/tools/extra/clangd/CMakeFiles/obj.clangDaemon.dir/Format.cpp.o -MF tools/clang/tools/extra/clangd/CMakeFiles/obj.clangDaemon.dir/Format.cpp.o.d -o tools/clang/tools/extra/clangd/CMakeFiles/obj.clangDaemon.dir/Format.cpp.o -c /Users/buildslave/jenkins/workspace/clang-stage2-coverage-R/llvm/tools/clang/tools/extra/clangd/Format.cpp
[4028/4610] /Users/buildslave/jenkins/workspace/clang-stage2-coverage-R/host-compiler/bin/clang++  -DGTEST_HAS_RTTI=0 -D_GNU_SOURCE -D__STDC_CONSTANT_MACROS -D__STDC_FORMAT_MACROS -D__STDC_LIMIT_MACROS -Itools/clang/tools/extra/clangd -I/Users/buildslave/jenkins/workspace/clang-stage2-coverage-R/llvm/tools/clang/tools/extra/clangd -I/Users/buildslave/jenkins/workspace/clang-stage2-coverage-R/llvm/tools/clang/include -Itools/clang/include -I/Applications/Xcode.app/Contents/Developer/Platforms/MacOSX.platform/Developer/SDKs/MacOSX10.14.sdk/usr/include/libxml2 -Iinclude -I/Users/buildslave/jenkins/workspace/clang-stage2-coverage-R/llvm/include -fPIC -fvisibility-inlines-hidden -Werror=date-time -Werror=unguarded-availability-new -std=c++11 -fmodules -fmodules-cache-path=/Users/buildslave/jenkins/workspace/clang-stage2-coverage-R/clang-build/module.cache -fcxx-modules -Wall -Wextra -Wno-unused-parameter -Wwrite-strings -Wcast-qual -Wmissing-field-initializers -pedantic -Wno-long-long -Wimplicit-fallthrough -Wcovered-switch-default -Wno-noexcept-type -Wnon-virtual-dtor -Wdelete-non-virtual-dtor -Wstring-conversion -fdiagnostics-color -fprofile-instr-generate='/Users/buildslave/jenkins/workspace/clang-stage2-coverage-R/clang-build/profiles/%6m.profraw' -fcoverage-mapping -fno-common -Woverloaded-virtual -Wno-nested-anon-types -O3 -DNDEBUG -isysroot /Applications/Xcode.app/Contents/Developer/Platforms/MacOSX.platform/Developer/SDKs/MacOSX10.14.sdk    -fno-exceptions -fno-rtti -MD -MT tools/clang/tools/extra/clangd/CMakeFiles/obj.clangDaemon.dir/ClangdLSPServer.cpp.o -MF tools/clang/tools/extra/clangd/CMakeFiles/obj.clangDaemon.dir/ClangdLSPServer.cpp.o.d -o tools/clang/tools/extra/clangd/CMakeFiles/obj.clangDaemon.dir/ClangdLSPServer.cpp.o -c /Users/buildslave/jenkins/workspace/clang-stage2-coverage-R/llvm/tools/clang/tools/extra/clangd/ClangdLSPServer.cpp
[4029/4610] /Users/buildslave/jenkins/workspace/clang-stage2-coverage-R/host-compiler/bin/clang++  -DGTEST_HAS_RTTI=0 -D_GNU_SOURCE -D__STDC_CONSTANT_MACROS -D__STDC_FORMAT_MACROS -D__STDC_LIMIT_MACROS -Itools/clang/tools/extra/clangd -I/Users/buildslave/jenkins/workspace/clang-stage2-coverage-R/llvm/tools/clang/tools/extra/clangd -I/Users/buildslave/jenkins/workspace/clang-stage2-coverage-R/llvm/tools/clang/include -Itools/clang/include -I/Applications/Xcode.app/Contents/Developer/Platforms/MacOSX.platform/Developer/SDKs/MacOSX10.14.sdk/usr/include/libxml2 -Iinclude -I/Users/buildslave/jenkins/workspace/clang-stage2-coverage-R/llvm/include -fPIC -fvisibility-inlines-hidden -Werror=date-time -Werror=unguarded-availability-new -std=c++11 -fmodules -fmodules-cache-path=/Users/buildslave/jenkins/workspace/clang-stage2-coverage-R/clang-build/module.cache -fcxx-modules -Wall -Wextra -Wno-unused-parameter -Wwrite-strings -Wcast-qual -Wmissing-field-initializers -pedantic -Wno-long-long -Wimplicit-fallthrough -Wcovered-switch-default -Wno-noexcept-type -Wnon-virtual-dtor -Wdelete-non-virtual-dtor -Wstring-conversion -fdiagnostics-color -fprofile-instr-generate='/Users/buildslave/jenkins/workspace/clang-stage2-coverage-R/clang-build/profiles/%6m.profraw' -fcoverage-mapping -fno-common -Woverloaded-virtual -Wno-nested-anon-types -O3 -DNDEBUG -isysroot /Applications/Xcode.app/Contents/Developer/Platforms/MacOSX.platform/Developer/SDKs/MacOSX10.14.sdk    -fno-exceptions -fno-rtti -MD -MT tools/clang/tools/extra/clangd/CMakeFiles/obj.clangDaemon.dir/CodeComplete.cpp.o -MF tools/clang/tools/extra/clangd/CMakeFiles/obj.clangDaemon.dir/CodeComplete.cpp.o.d -o tools/clang/tools/extra/clangd/CMakeFiles/obj.clangDaemon.dir/CodeComplete.cpp.o -c /Users/buildslave/jenkins/workspace/clang-stage2-coverage-R/llvm/tools/clang/tools/extra/clangd/CodeComplete.cpp
[4030/4610] /Users/buildslave/jenkins/workspace/clang-stage2-coverage-R/host-compiler/bin/clang++  -DGTEST_HAS_RTTI=0 -D_GNU_SOURCE -D__STDC_CONSTANT_MACROS -D__STDC_FORMAT_MACROS -D__STDC_LIMIT_MACROS -Itools/clang/tools/extra/clangd -I/Users/buildslave/jenkins/workspace/clang-stage2-coverage-R/llvm/tools/clang/tools/extra/clangd -I/Users/buildslave/jenkins/workspace/clang-stage2-coverage-R/llvm/tools/clang/include -Itools/clang/include -I/Applications/Xcode.app/Contents/Developer/Platforms/MacOSX.platform/Developer/SDKs/MacOSX10.14.sdk/usr/include/libxml2 -Iinclude -I/Users/buildslave/jenkins/workspace/clang-stage2-coverage-R/llvm/include -fPIC -fvisibility-inlines-hidden -Werror=date-time -Werror=unguarded-availability-new -std=c++11 -fmodules -fmodules-cache-path=/Users/buildslave/jenkins/workspace/clang-stage2-coverage-R/clang-build/module.cache -fcxx-modules -Wall -Wextra -Wno-unused-parameter -Wwrite-strings -Wcast-qual -Wmissing-field-initializers -pedantic -Wno-long-long -Wimplicit-fallthrough -Wcovered-switch-default -Wno-noexcept-type -Wnon-virtual-dtor -Wdelete-non-virtual-dtor -Wstring-conversion -fdiagnostics-color -fprofile-instr-generate='/Users/buildslave/jenkins/workspace/clang-stage2-coverage-R/clang-build/profiles/%6m.profraw' -fcoverage-mapping -fno-common -Woverloaded-virtual -Wno-nested-anon-types -O3 -DNDEBUG -isysroot /Applications/Xcode.app/Contents/Developer/Platforms/MacOSX.platform/Developer/SDKs/MacOSX10.14.sdk    -fno-exceptions -fno-rtti -MD -MT tools/clang/tools/extra/clangd/CMakeFiles/obj.clangDaemon.dir/JSONTransport.cpp.o -MF tools/clang/tools/extra/clangd/CMakeFiles/obj.clangDaemon.dir/JSONTransport.cpp.o.d -o tools/clang/tools/extra/clangd/CMakeFiles/obj.clangDaemon.dir/JSONTransport.cpp.o -c /Users/buildslave/jenkins/workspace/clang-stage2-coverage-R/llvm/tools/clang/tools/extra/clangd/JSONTransport.cpp
[4031/4610] /Users/buildslave/jenkins/workspace/clang-stage2-coverage-R/host-compiler/bin/clang++  -DGTEST_HAS_RTTI=0 -D_GNU_SOURCE -D__STDC_CONSTANT_MACROS -D__STDC_FORMAT_MACROS -D__STDC_LIMIT_MACROS -Itools/clang/tools/extra/clangd -I/Users/buildslave/jenkins/workspace/clang-stage2-coverage-R/llvm/tools/clang/tools/extra/clangd -I/Users/buildslave/jenkins/workspace/clang-stage2-coverage-R/llvm/tools/clang/include -Itools/clang/include -I/Applications/Xcode.app/Contents/Developer/Platforms/MacOSX.platform/Developer/SDKs/MacOSX10.14.sdk/usr/include/libxml2 -Iinclude -I/Users/buildslave/jenkins/workspace/clang-stage2-coverage-R/llvm/include -fPIC -fvisibility-inlines-hidden -Werror=date-time -Werror=unguarded-availability-new -std=c++11 -fmodules -fmodules-cache-path=/Users/buildslave/jenkins/workspace/clang-stage2-coverage-R/clang-build/module.cache -fcxx-modules -Wall -Wextra -Wno-unused-parameter -Wwrite-strings -Wcast-qual -Wmissing-field-initializers -pedantic -Wno-long-long -Wimplicit-fallthrough -Wcovered-switch-default -Wno-noexcept-type -Wnon-virtual-dtor -Wdelete-non-virtual-dtor -Wstring-conversion -fdiagnostics-color -fprofile-instr-generate='/Users/buildslave/jenkins/workspace/clang-stage2-coverage-R/clang-build/profiles/%6m.profraw' -fcoverage-mapping -fno-common -Woverloaded-virtual -Wno-nested-anon-types -O3 -DNDEBUG -isysroot /Applications/Xcode.app/Contents/Developer/Platforms/MacOSX.platform/Developer/SDKs/MacOSX10.14.sdk    -fno-exceptions -fno-rtti -MD -MT tools/clang/tools/extra/clangd/CMakeFiles/obj.clangDaemon.dir/Logger.cpp.o -MF tools/clang/tools/extra/clangd/CMakeFiles/obj.clangDaemon.dir/Logger.cpp.o.d -o tools/clang/tools/extra/clangd/CMakeFiles/obj.clangDaemon.dir/Logger.cpp.o -c /Users/buildslave/jenkins/workspace/clang-stage2-coverage-R/llvm/tools/clang/tools/extra/clangd/Logger.cpp
[4032/4610] /Users/buildslave/jenkins/workspace/clang-stage2-coverage-R/host-compiler/bin/clang++  -DGTEST_HAS_RTTI=0 -D_GNU_SOURCE -D__STDC_CONSTANT_MACROS -D__STDC_FORMAT_MACROS -D__STDC_LIMIT_MACROS -Itools/clang/tools/extra/clangd -I/Users/buildslave/jenkins/workspace/clang-stage2-coverage-R/llvm/tools/clang/tools/extra/clangd -I/Users/buildslave/jenkins/workspace/clang-stage2-coverage-R/llvm/tools/clang/include -Itools/clang/include -I/Applications/Xcode.app/Contents/Developer/Platforms/MacOSX.platform/Developer/SDKs/MacOSX10.14.sdk/usr/include/libxml2 -Iinclude -I/Users/buildslave/jenkins/workspace/clang-stage2-coverage-R/llvm/include -fPIC -fvisibility-inlines-hidden -Werror=date-time -Werror=unguarded-availability-new -std=c++11 -fmodules -fmodules-cache-path=/Users/buildslave/jenkins/workspace/clang-stage2-coverage-R/clang-build/module.cache -fcxx-modules -Wall -Wextra -Wno-unused-parameter -Wwrite-strings -Wcast-qual -Wmissing-field-initializers -pedantic -Wno-long-long -Wimplicit-fallthrough -Wcovered-switch-default -Wno-noexcept-type -Wnon-virtual-dtor -Wdelete-non-virtual-dtor -Wstring-conversion -fdiagnostics-color -fprofile-instr-generate='/Users/buildslave/jenkins/workspace/clang-stage2-coverage-R/clang-build/profiles/%6m.profraw' -fcoverage-mapping -fno-common -Woverloaded-virtual -Wno-nested-anon-types -O3 -DNDEBUG -isysroot /Applications/Xcode.app/Contents/Developer/Platforms/MacOSX.platform/Developer/SDKs/MacOSX10.14.sdk    -fno-exceptions -fno-rtti -MD -MT tools/clang/tools/extra/clangd/CMakeFiles/obj.clangDaemon.dir/IncludeFixer.cpp.o -MF tools/clang/tools/extra/clangd/CMakeFiles/obj.clangDaemon.dir/IncludeFixer.cpp.o.d -o tools/clang/tools/extra/clangd/CMakeFiles/obj.clangDaemon.dir/IncludeFixer.cpp.o -c /Users/buildslave/jenkins/workspace/clang-stage2-coverage-R/llvm/tools/clang/tools/extra/clangd/IncludeFixer.cpp
[4033/4610] /Users/buildslave/jenkins/workspace/clang-stage2-coverage-R/host-compiler/bin/clang++  -DGTEST_HAS_RTTI=0 -D_GNU_SOURCE -D__STDC_CONSTANT_MACROS -D__STDC_FORMAT_MACROS -D__STDC_LIMIT_MACROS -Itools/clang/tools/extra/clangd -I/Users/buildslave/jenkins/workspace/clang-stage2-coverage-R/llvm/tools/clang/tools/extra/clangd -I/Users/buildslave/jenkins/workspace/clang-stage2-coverage-R/llvm/tools/clang/include -Itools/clang/include -I/Applications/Xcode.app/Contents/Developer/Platforms/MacOSX.platform/Developer/SDKs/MacOSX10.14.sdk/usr/include/libxml2 -Iinclude -I/Users/buildslave/jenkins/workspace/clang-stage2-coverage-R/llvm/include -fPIC -fvisibility-inlines-hidden -Werror=date-time -Werror=unguarded-availability-new -std=c++11 -fmodules -fmodules-cache-path=/Users/buildslave/jenkins/workspace/clang-stage2-coverage-R/clang-build/module.cache -fcxx-modules -Wall -Wextra -Wno-unused-parameter -Wwrite-strings -Wcast-qual -Wmissing-field-initializers -pedantic -Wno-long-long -Wimplicit-fallthrough -Wcovered-switch-default -Wno-noexcept-type -Wnon-virtual-dtor -Wdelete-non-virtual-dtor -Wstring-conversion -fdiagnostics-color -fprofile-instr-generate='/Users/buildslave/jenkins/workspace/clang-stage2-coverage-R/clang-build/profiles/%6m.profraw' -fcoverage-mapping -fno-common -Woverloaded-virtual -Wno-nested-anon-types -O3 -DNDEBUG -isysroot /Applications/Xcode.app/Contents/Developer/Platforms/MacOSX.platform/Developer/SDKs/MacOSX10.14.sdk    -fno-exceptions -fno-rtti -MD -MT tools/clang/tools/extra/clangd/CMakeFiles/obj.clangDaemon.dir/GlobalCompilationDatabase.cpp.o -MF tools/clang/tools/extra/clangd/CMakeFiles/obj.clangDaemon.dir/GlobalCompilationDatabase.cpp.o.d -o tools/clang/tools/extra/clangd/CMakeFiles/obj.clangDaemon.dir/GlobalCompilationDatabase.cpp.o -c /Users/buildslave/jenkins/workspace/clang-stage2-coverage-R/llvm/tools/clang/tools/extra/clangd/GlobalCompilationDatabase.cpp
[4034/4610] /Users/buildslave/jenkins/workspace/clang-stage2-coverage-R/host-compiler/bin/clang++  -DGTEST_HAS_RTTI=0 -D_GNU_SOURCE -D__STDC_CONSTANT_MACROS -D__STDC_FORMAT_MACROS -D__STDC_LIMIT_MACROS -Itools/clang/tools/extra/clangd -I/Users/buildslave/jenkins/workspace/clang-stage2-coverage-R/llvm/tools/clang/tools/extra/clangd -I/Users/buildslave/jenkins/workspace/clang-stage2-coverage-R/llvm/tools/clang/include -Itools/clang/include -I/Applications/Xcode.app/Contents/Developer/Platforms/MacOSX.platform/Developer/SDKs/MacOSX10.14.sdk/usr/include/libxml2 -Iinclude -I/Users/buildslave/jenkins/workspace/clang-stage2-coverage-R/llvm/include -fPIC -fvisibility-inlines-hidden -Werror=date-time -Werror=unguarded-availability-new -std=c++11 -fmodules -fmodules-cache-path=/Users/buildslave/jenkins/workspace/clang-stage2-coverage-R/clang-build/module.cache -fcxx-modules -Wall -Wextra -Wno-unused-parameter -Wwrite-strings -Wcast-qual -Wmissing-field-initializers -pedantic -Wno-long-long -Wimplicit-fallthrough -Wcovered-switch-default -Wno-noexcept-type -Wnon-virtual-dtor -Wdelete-non-virtual-dtor -Wstring-conversion -fdiagnostics-color -fprofile-instr-generate='/Users/buildslave/jenkins/workspace/clang-stage2-coverage-R/clang-build/profiles/%6m.profraw' -fcoverage-mapping -fno-common -Woverloaded-virtual -Wno-nested-anon-types -O3 -DNDEBUG -isysroot /Applications/Xcode.app/Contents/Developer/Platforms/MacOSX.platform/Developer/SDKs/MacOSX10.14.sdk    -fno-exceptions -fno-rtti -MD -MT tools/clang/tools/extra/clangd/CMakeFiles/obj.clangDaemon.dir/RIFF.cpp.o -MF tools/clang/tools/extra/clangd/CMakeFiles/obj.clangDaemon.dir/RIFF.cpp.o.d -o tools/clang/tools/extra/clangd/CMakeFiles/obj.clangDaemon.dir/RIFF.cpp.o -c /Users/buildslave/jenkins/workspace/clang-stage2-coverage-R/llvm/tools/clang/tools/extra/clangd/RIFF.cpp
[4035/4610] /Users/buildslave/jenkins/workspace/clang-stage2-coverage-R/host-compiler/bin/clang++  -DGTEST_HAS_RTTI=0 -D_GNU_SOURCE -D__STDC_CONSTANT_MACROS -D__STDC_FORMAT_MACROS -D__STDC_LIMIT_MACROS -Itools/clang/tools/extra/clangd -I/Users/buildslave/jenkins/workspace/clang-stage2-coverage-R/llvm/tools/clang/tools/extra/clangd -I/Users/buildslave/jenkins/workspace/clang-stage2-coverage-R/llvm/tools/clang/include -Itools/clang/include -I/Applications/Xcode.app/Contents/Developer/Platforms/MacOSX.platform/Developer/SDKs/MacOSX10.14.sdk/usr/include/libxml2 -Iinclude -I/Users/buildslave/jenkins/workspace/clang-stage2-coverage-R/llvm/include -fPIC -fvisibility-inlines-hidden -Werror=date-time -Werror=unguarded-availability-new -std=c++11 -fmodules -fmodules-cache-path=/Users/buildslave/jenkins/workspace/clang-stage2-coverage-R/clang-build/module.cache -fcxx-modules -Wall -Wextra -Wno-unused-parameter -Wwrite-strings -Wcast-qual -Wmissing-field-initializers -pedantic -Wno-long-long -Wimplicit-fallthrough -Wcovered-switch-default -Wno-noexcept-type -Wnon-virtual-dtor -Wdelete-non-virtual-dtor -Wstring-conversion -fdiagnostics-color -fprofile-instr-generate='/Users/buildslave/jenkins/workspace/clang-stage2-coverage-R/clang-build/profiles/%6m.profraw' -fcoverage-mapping -fno-common -Woverloaded-virtual -Wno-nested-anon-types -O3 -DNDEBUG -isysroot /Applications/Xcode.app/Contents/Developer/Platforms/MacOSX.platform/Developer/SDKs/MacOSX10.14.sdk    -fno-exceptions -fno-rtti -MD -MT tools/clang/tools/extra/clangd/CMakeFiles/obj.clangDaemon.dir/Quality.cpp.o -MF tools/clang/tools/extra/clangd/CMakeFiles/obj.clangDaemon.dir/Quality.cpp.o.d -o tools/clang/tools/extra/clangd/CMakeFiles/obj.clangDaemon.dir/Quality.cpp.o -c /Users/buildslave/jenkins/workspace/clang-stage2-coverage-R/llvm/tools/clang/tools/extra/clangd/Quality.cpp
[4036/4610] /Users/buildslave/jenkins/workspace/clang-stage2-coverage-R/host-compiler/bin/clang++  -DGTEST_HAS_RTTI=0 -D_GNU_SOURCE -D__STDC_CONSTANT_MACROS -D__STDC_FORMAT_MACROS -D__STDC_LIMIT_MACROS -Itools/clang/tools/extra/clangd -I/Users/buildslave/jenkins/workspace/clang-stage2-coverage-R/llvm/tools/clang/tools/extra/clangd -I/Users/buildslave/jenkins/workspace/clang-stage2-coverage-R/llvm/tools/clang/include -Itools/clang/include -I/Applications/Xcode.app/Contents/Developer/Platforms/MacOSX.platform/Developer/SDKs/MacOSX10.14.sdk/usr/include/libxml2 -Iinclude -I/Users/buildslave/jenkins/workspace/clang-stage2-coverage-R/llvm/include -fPIC -fvisibility-inlines-hidden -Werror=date-time -Werror=unguarded-availability-new -std=c++11 -fmodules -fmodules-cache-path=/Users/buildslave/jenkins/workspace/clang-stage2-coverage-R/clang-build/module.cache -fcxx-modules -Wall -Wextra -Wno-unused-parameter -Wwrite-strings -Wcast-qual -Wmissing-field-initializers -pedantic -Wno-long-long -Wimplicit-fallthrough -Wcovered-switch-default -Wno-noexcept-type -Wnon-virtual-dtor -Wdelete-non-virtual-dtor -Wstring-conversion -fdiagnostics-color -fprofile-instr-generate='/Users/buildslave/jenkins/workspace/clang-stage2-coverage-R/clang-build/profiles/%6m.profraw' -fcoverage-mapping -fno-common -Woverloaded-virtual -Wno-nested-anon-types -O3 -DNDEBUG -isysroot /Applications/Xcode.app/Contents/Developer/Platforms/MacOSX.platform/Developer/SDKs/MacOSX10.14.sdk    -fno-exceptions -fno-rtti -MD -MT tools/clang/tools/extra/clangd/CMakeFiles/obj.clangDaemon.dir/Protocol.cpp.o -MF tools/clang/tools/extra/clangd/CMakeFiles/obj.clangDaemon.dir/Protocol.cpp.o.d -o tools/clang/tools/extra/clangd/CMakeFiles/obj.clangDaemon.dir/Protocol.cpp.o -c /Users/buildslave/jenkins/workspace/clang-stage2-coverage-R/llvm/tools/clang/tools/extra/clangd/Protocol.cpp
[4037/4610] /Users/buildslave/jenkins/workspace/clang-stage2-coverage-R/host-compiler/bin/clang++  -DGTEST_HAS_RTTI=0 -D_GNU_SOURCE -D__STDC_CONSTANT_MACROS -D__STDC_FORMAT_MACROS -D__STDC_LIMIT_MACROS -Itools/clang/tools/extra/clangd -I/Users/buildslave/jenkins/workspace/clang-stage2-coverage-R/llvm/tools/clang/tools/extra/clangd -I/Users/buildslave/jenkins/workspace/clang-stage2-coverage-R/llvm/tools/clang/include -Itools/clang/include -I/Applications/Xcode.app/Contents/Developer/Platforms/MacOSX.platform/Developer/SDKs/MacOSX10.14.sdk/usr/include/libxml2 -Iinclude -I/Users/buildslave/jenkins/workspace/clang-stage2-coverage-R/llvm/include -fPIC -fvisibility-inlines-hidden -Werror=date-time -Werror=unguarded-availability-new -std=c++11 -fmodules -fmodules-cache-path=/Users/buildslave/jenkins/workspace/clang-stage2-coverage-R/clang-build/module.cache -fcxx-modules -Wall -Wextra -Wno-unused-parameter -Wwrite-strings -Wcast-qual -Wmissing-field-initializers -pedantic -Wno-long-long -Wimplicit-fallthrough -Wcovered-switch-default -Wno-noexcept-type -Wnon-virtual-dtor -Wdelete-non-virtual-dtor -Wstring-conversion -fdiagnostics-color -fprofile-instr-generate='/Users/buildslave/jenkins/workspace/clang-stage2-coverage-R/clang-build/profiles/%6m.profraw' -fcoverage-mapping -fno-common -Woverloaded-virtual -Wno-nested-anon-types -O3 -DNDEBUG -isysroot /Applications/Xcode.app/Contents/Developer/Platforms/MacOSX.platform/Developer/SDKs/MacOSX10.14.sdk    -fno-exceptions -fno-rtti -MD -MT tools/clang/tools/extra/clangd/CMakeFiles/obj.clangDaemon.dir/SourceCode.cpp.o -MF tools/clang/tools/extra/clangd/CMakeFiles/obj.clangDaemon.dir/SourceCode.cpp.o.d -o tools/clang/tools/extra/clangd/CMakeFiles/obj.clangDaemon.dir/SourceCode.cpp.o -c /Users/buildslave/jenkins/workspace/clang-stage2-coverage-R/llvm/tools/clang/tools/extra/clangd/SourceCode.cpp
[4038/4610] /Users/buildslave/jenkins/workspace/clang-stage2-coverage-R/host-compiler/bin/clang++  -DGTEST_HAS_RTTI=0 -D_GNU_SOURCE -D__STDC_CONSTANT_MACROS -D__STDC_FORMAT_MACROS -D__STDC_LIMIT_MACROS -Itools/clang/tools/extra/clangd -I/Users/buildslave/jenkins/workspace/clang-stage2-coverage-R/llvm/tools/clang/tools/extra/clangd -I/Users/buildslave/jenkins/workspace/clang-stage2-coverage-R/llvm/tools/clang/include -Itools/clang/include -I/Applications/Xcode.app/Contents/Developer/Platforms/MacOSX.platform/Developer/SDKs/MacOSX10.14.sdk/usr/include/libxml2 -Iinclude -I/Users/buildslave/jenkins/workspace/clang-stage2-coverage-R/llvm/include -fPIC -fvisibility-inlines-hidden -Werror=date-time -Werror=unguarded-availability-new -std=c++11 -fmodules -fmodules-cache-path=/Users/buildslave/jenkins/workspace/clang-stage2-coverage-R/clang-build/module.cache -fcxx-modules -Wall -Wextra -Wno-unused-parameter -Wwrite-strings -Wcast-qual -Wmissing-field-initializers -pedantic -Wno-long-long -Wimplicit-fallthrough -Wcovered-switch-default -Wno-noexcept-type -Wnon-virtual-dtor -Wdelete-non-virtual-dtor -Wstring-conversion -fdiagnostics-color -fprofile-instr-generate='/Users/buildslave/jenkins/workspace/clang-stage2-coverage-R/clang-build/profiles/%6m.profraw' -fcoverage-mapping -fno-common -Woverloaded-virtual -Wno-nested-anon-types -O3 -DNDEBUG -isysroot /Applications/Xcode.app/Contents/Developer/Platforms/MacOSX.platform/Developer/SDKs/MacOSX10.14.sdk    -fno-exceptions -fno-rtti -MD -MT tools/clang/tools/extra/clangd/CMakeFiles/obj.clangDaemon.dir/Threading.cpp.o -MF tools/clang/tools/extra/clangd/CMakeFiles/obj.clangDaemon.dir/Threading.cpp.o.d -o tools/clang/tools/extra/clangd/CMakeFiles/obj.clangDaemon.dir/Threading.cpp.o -c /Users/buildslave/jenkins/workspace/clang-stage2-coverage-R/llvm/tools/clang/tools/extra/clangd/Threading.cpp
[4039/4610] /Users/buildslave/jenkins/workspace/clang-stage2-coverage-R/host-compiler/bin/clang++  -DGTEST_HAS_RTTI=0 -D_GNU_SOURCE -D__STDC_CONSTANT_MACROS -D__STDC_FORMAT_MACROS -D__STDC_LIMIT_MACROS -Itools/clang/tools/extra/clangd -I/Users/buildslave/jenkins/workspace/clang-stage2-coverage-R/llvm/tools/clang/tools/extra/clangd -I/Users/buildslave/jenkins/workspace/clang-stage2-coverage-R/llvm/tools/clang/include -Itools/clang/include -I/Applications/Xcode.app/Contents/Developer/Platforms/MacOSX.platform/Developer/SDKs/MacOSX10.14.sdk/usr/include/libxml2 -Iinclude -I/Users/buildslave/jenkins/workspace/clang-stage2-coverage-R/llvm/include -fPIC -fvisibility-inlines-hidden -Werror=date-time -Werror=unguarded-availability-new -std=c++11 -fmodules -fmodules-cache-path=/Users/buildslave/jenkins/workspace/clang-stage2-coverage-R/clang-build/module.cache -fcxx-modules -Wall -Wextra -Wno-unused-parameter -Wwrite-strings -Wcast-qual -Wmissing-field-initializers -pedantic -Wno-long-long -Wimplicit-fallthrough -Wcovered-switch-default -Wno-noexcept-type -Wnon-virtual-dtor -Wdelete-non-virtual-dtor -Wstring-conversion -fdiagnostics-color -fprofile-instr-generate='/Users/buildslave/jenkins/workspace/clang-stage2-coverage-R/clang-build/profiles/%6m.profraw' -fcoverage-mapping -fno-common -Woverloaded-virtual -Wno-nested-anon-types -O3 -DNDEBUG -isysroot /Applications/Xcode.app/Contents/Developer/Platforms/MacOSX.platform/Developer/SDKs/MacOSX10.14.sdk    -fno-exceptions -fno-rtti -MD -MT tools/clang/tools/extra/clangd/CMakeFiles/obj.clangDaemon.dir/Trace.cpp.o -MF tools/clang/tools/extra/clangd/CMakeFiles/obj.clangDaemon.dir/Trace.cpp.o.d -o tools/clang/tools/extra/clangd/CMakeFiles/obj.clangDaemon.dir/Trace.cpp.o -c /Users/buildslave/jenkins/workspace/clang-stage2-coverage-R/llvm/tools/clang/tools/extra/clangd/Trace.cpp
[4040/4610] /Users/buildslave/jenkins/workspace/clang-stage2-coverage-R/host-compiler/bin/clang++  -DGTEST_HAS_RTTI=0 -D_GNU_SOURCE -D__STDC_CONSTANT_MACROS -D__STDC_FORMAT_MACROS -D__STDC_LIMIT_MACROS -Itools/clang/tools/extra/clangd -I/Users/buildslave/jenkins/workspace/clang-stage2-coverage-R/llvm/tools/clang/tools/extra/clangd -I/Users/buildslave/jenkins/workspace/clang-stage2-coverage-R/llvm/tools/clang/include -Itools/clang/include -I/Applications/Xcode.app/Contents/Developer/Platforms/MacOSX.platform/Developer/SDKs/MacOSX10.14.sdk/usr/include/libxml2 -Iinclude -I/Users/buildslave/jenkins/workspace/clang-stage2-coverage-R/llvm/include -fPIC -fvisibility-inlines-hidden -Werror=date-time -Werror=unguarded-availability-new -std=c++11 -fmodules -fmodules-cache-path=/Users/buildslave/jenkins/workspace/clang-stage2-coverage-R/clang-build/module.cache -fcxx-modules -Wall -Wextra -Wno-unused-parameter -Wwrite-strings -Wcast-qual -Wmissing-field-initializers -pedantic -Wno-long-long -Wimplicit-fallthrough -Wcovered-switch-default -Wno-noexcept-type -Wnon-virtual-dtor -Wdelete-non-virtual-dtor -Wstring-conversion -fdiagnostics-color -fprofile-instr-generate='/Users/buildslave/jenkins/workspace/clang-stage2-coverage-R/clang-build/profiles/%6m.profraw' -fcoverage-mapping -fno-common -Woverloaded-virtual -Wno-nested-anon-types -O3 -DNDEBUG -isysroot /Applications/Xcode.app/Contents/Developer/Platforms/MacOSX.platform/Developer/SDKs/MacOSX10.14.sdk    -fno-exceptions -fno-rtti -MD -MT tools/clang/tools/extra/clangd/CMakeFiles/obj.clangDaemon.dir/QueryDriverDatabase.cpp.o -MF tools/clang/tools/extra/clangd/CMakeFiles/obj.clangDaemon.dir/QueryDriverDatabase.cpp.o.d -o tools/clang/tools/extra/clangd/CMakeFiles/obj.clangDaemon.dir/QueryDriverDatabase.cpp.o -c /Users/buildslave/jenkins/workspace/clang-stage2-coverage-R/llvm/tools/clang/tools/extra/clangd/QueryDriverDatabase.cpp
[4041/4610] /Users/buildslave/jenkins/workspace/clang-stage2-coverage-R/host-compiler/bin/clang++  -DGTEST_HAS_RTTI=0 -D_GNU_SOURCE -D__STDC_CONSTANT_MACROS -D__STDC_FORMAT_MACROS -D__STDC_LIMIT_MACROS -Itools/clang/tools/extra/clangd -I/Users/buildslave/jenkins/workspace/clang-stage2-coverage-R/llvm/tools/clang/tools/extra/clangd -I/Users/buildslave/jenkins/workspace/clang-stage2-coverage-R/llvm/tools/clang/include -Itools/clang/include -I/Applications/Xcode.app/Contents/Developer/Platforms/MacOSX.platform/Developer/SDKs/MacOSX10.14.sdk/usr/include/libxml2 -Iinclude -I/Users/buildslave/jenkins/workspace/clang-stage2-coverage-R/llvm/include -fPIC -fvisibility-inlines-hidden -Werror=date-time -Werror=unguarded-availability-new -std=c++11 -fmodules -fmodules-cache-path=/Users/buildslave/jenkins/workspace/clang-stage2-coverage-R/clang-build/module.cache -fcxx-modules -Wall -Wextra -Wno-unused-parameter -Wwrite-strings -Wcast-qual -Wmissing-field-initializers -pedantic -Wno-long-long -Wimplicit-fallthrough -Wcovered-switch-default -Wno-noexcept-type -Wnon-virtual-dtor -Wdelete-non-virtual-dtor -Wstring-conversion -fdiagnostics-color -fprofile-instr-generate='/Users/buildslave/jenkins/workspace/clang-stage2-coverage-R/clang-build/profiles/%6m.profraw' -fcoverage-mapping -fno-common -Woverloaded-virtual -Wno-nested-anon-types -O3 -DNDEBUG -isysroot /Applications/Xcode.app/Contents/Developer/Platforms/MacOSX.platform/Developer/SDKs/MacOSX10.14.sdk    -fno-exceptions -fno-rtti -MD -MT tools/clang/tools/extra/clangd/CMakeFiles/obj.clangDaemon.dir/URI.cpp.o -MF tools/clang/tools/extra/clangd/CMakeFiles/obj.clangDaemon.dir/URI.cpp.o.d -o tools/clang/tools/extra/clangd/CMakeFiles/obj.clangDaemon.dir/URI.cpp.o -c /Users/buildslave/jenkins/workspace/clang-stage2-coverage-R/llvm/tools/clang/tools/extra/clangd/URI.cpp
[4042/4610] /Users/buildslave/jenkins/workspace/clang-stage2-coverage-R/host-compiler/bin/clang++  -DGTEST_HAS_RTTI=0 -D_GNU_SOURCE -D__STDC_CONSTANT_MACROS -D__STDC_FORMAT_MACROS -D__STDC_LIMIT_MACROS -Itools/clang/tools/extra/clangd -I/Users/buildslave/jenkins/workspace/clang-stage2-coverage-R/llvm/tools/clang/tools/extra/clangd -I/Users/buildslave/jenkins/workspace/clang-stage2-coverage-R/llvm/tools/clang/include -Itools/clang/include -I/Applications/Xcode.app/Contents/Developer/Platforms/MacOSX.platform/Developer/SDKs/MacOSX10.14.sdk/usr/include/libxml2 -Iinclude -I/Users/buildslave/jenkins/workspace/clang-stage2-coverage-R/llvm/include -fPIC -fvisibility-inlines-hidden -Werror=date-time -Werror=unguarded-availability-new -std=c++11 -fmodules -fmodules-cache-path=/Users/buildslave/jenkins/workspace/clang-stage2-coverage-R/clang-build/module.cache -fcxx-modules -Wall -Wextra -Wno-unused-parameter -Wwrite-strings -Wcast-qual -Wmissing-field-initializers -pedantic -Wno-long-long -Wimplicit-fallthrough -Wcovered-switch-default -Wno-noexcept-type -Wnon-virtual-dtor -Wdelete-non-virtual-dtor -Wstring-conversion -fdiagnostics-color -fprofile-instr-generate='/Users/buildslave/jenkins/workspace/clang-stage2-coverage-R/clang-build/profiles/%6m.profraw' -fcoverage-mapping -fno-common -Woverloaded-virtual -Wno-nested-anon-types -O3 -DNDEBUG -isysroot /Applications/Xcode.app/Contents/Developer/Platforms/MacOSX.platform/Developer/SDKs/MacOSX10.14.sdk    -fno-exceptions -fno-rtti -MD -MT tools/clang/tools/extra/clangd/CMakeFiles/obj.clangDaemon.dir/Selection.cpp.o -MF tools/clang/tools/extra/clangd/CMakeFiles/obj.clangDaemon.dir/Selection.cpp.o.d -o tools/clang/tools/extra/clangd/CMakeFiles/obj.clangDaemon.dir/Selection.cpp.o -c /Users/buildslave/jenkins/workspace/clang-stage2-coverage-R/llvm/tools/clang/tools/extra/clangd/Selection.cpp
[4043/4610] /Users/buildslave/jenkins/workspace/clang-stage2-coverage-R/host-compiler/bin/clang++  -DGTEST_HAS_RTTI=0 -D_GNU_SOURCE -D__STDC_CONSTANT_MACROS -D__STDC_FORMAT_MACROS -D__STDC_LIMIT_MACROS -Itools/clang/tools/extra/clangd -I/Users/buildslave/jenkins/workspace/clang-stage2-coverage-R/llvm/tools/clang/tools/extra/clangd -I/Users/buildslave/jenkins/workspace/clang-stage2-coverage-R/llvm/tools/clang/include -Itools/clang/include -I/Applications/Xcode.app/Contents/Developer/Platforms/MacOSX.platform/Developer/SDKs/MacOSX10.14.sdk/usr/include/libxml2 -Iinclude -I/Users/buildslave/jenkins/workspace/clang-stage2-coverage-R/llvm/include -fPIC -fvisibility-inlines-hidden -Werror=date-time -Werror=unguarded-availability-new -std=c++11 -fmodules -fmodules-cache-path=/Users/buildslave/jenkins/workspace/clang-stage2-coverage-R/clang-build/module.cache -fcxx-modules -Wall -Wextra -Wno-unused-parameter -Wwrite-strings -Wcast-qual -Wmissing-field-initializers -pedantic -Wno-long-long -Wimplicit-fallthrough -Wcovered-switch-default -Wno-noexcept-type -Wnon-virtual-dtor -Wdelete-non-virtual-dtor -Wstring-conversion -fdiagnostics-color -fprofile-instr-generate='/Users/buildslave/jenkins/workspace/clang-stage2-coverage-R/clang-build/profiles/%6m.profraw' -fcoverage-mapping -fno-common -Woverloaded-virtual -Wno-nested-anon-types -O3 -DNDEBUG -isysroot /Applications/Xcode.app/Contents/Developer/Platforms/MacOSX.platform/Developer/SDKs/MacOSX10.14.sdk    -fno-exceptions -fno-rtti -MD -MT tools/clang/tools/extra/clangd/CMakeFiles/obj.clangDaemon.dir/SemanticHighlighting.cpp.o -MF tools/clang/tools/extra/clangd/CMakeFiles/obj.clangDaemon.dir/SemanticHighlighting.cpp.o.d -o tools/clang/tools/extra/clangd/CMakeFiles/obj.clangDaemon.dir/SemanticHighlighting.cpp.o -c /Users/buildslave/jenkins/workspace/clang-stage2-coverage-R/llvm/tools/clang/tools/extra/clangd/SemanticHighlighting.cpp
[4044/4610] /Users/buildslave/jenkins/workspace/clang-stage2-coverage-R/host-compiler/bin/clang++  -DGTEST_HAS_RTTI=0 -D_GNU_SOURCE -D__STDC_CONSTANT_MACROS -D__STDC_FORMAT_MACROS -D__STDC_LIMIT_MACROS -Itools/clang/tools/extra/clangd -I/Users/buildslave/jenkins/workspace/clang-stage2-coverage-R/llvm/tools/clang/tools/extra/clangd -I/Users/buildslave/jenkins/workspace/clang-stage2-coverage-R/llvm/tools/clang/include -Itools/clang/include -I/Applications/Xcode.app/Contents/Developer/Platforms/MacOSX.platform/Developer/SDKs/MacOSX10.14.sdk/usr/include/libxml2 -Iinclude -I/Users/buildslave/jenkins/workspace/clang-stage2-coverage-R/llvm/include -fPIC -fvisibility-inlines-hidden -Werror=date-time -Werror=unguarded-availability-new -std=c++11 -fmodules -fmodules-cache-path=/Users/buildslave/jenkins/workspace/clang-stage2-coverage-R/clang-build/module.cache -fcxx-modules -Wall -Wextra -Wno-unused-parameter -Wwrite-strings -Wcast-qual -Wmissing-field-initializers -pedantic -Wno-long-long -Wimplicit-fallthrough -Wcovered-switch-default -Wno-noexcept-type -Wnon-virtual-dtor -Wdelete-non-virtual-dtor -Wstring-conversion -fdiagnostics-color -fprofile-instr-generate='/Users/buildslave/jenkins/workspace/clang-stage2-coverage-R/clang-build/profiles/%6m.profraw' -fcoverage-mapping -fno-common -Woverloaded-virtual -Wno-nested-anon-types -O3 -DNDEBUG -isysroot /Applications/Xcode.app/Contents/Developer/Platforms/MacOSX.platform/Developer/SDKs/MacOSX10.14.sdk    -fno-exceptions -fno-rtti -MD -MT tools/clang/tools/extra/clangd/CMakeFiles/obj.clangDaemon.dir/FindSymbols.cpp.o -MF tools/clang/tools/extra/clangd/CMakeFiles/obj.clangDaemon.dir/FindSymbols.cpp.o.d -o tools/clang/tools/extra/clangd/CMakeFiles/obj.clangDaemon.dir/FindSymbols.cpp.o -c /Users/buildslave/jenkins/workspace/clang-stage2-coverage-R/llvm/tools/clang/tools/extra/clangd/FindSymbols.cpp
FAILED: tools/clang/tools/extra/clangd/CMakeFiles/obj.clangDaemon.dir/FindSymbols.cpp.o 
/Users/buildslave/jenkins/workspace/clang-stage2-coverage-R/host-compiler/bin/clang++  -DGTEST_HAS_RTTI=0 -D_GNU_SOURCE -D__STDC_CONSTANT_MACROS -D__STDC_FORMAT_MACROS -D__STDC_LIMIT_MACROS -Itools/clang/tools/extra/clangd -I/Users/buildslave/jenkins/workspace/clang-stage2-coverage-R/llvm/tools/clang/tools/extra/clangd -I/Users/buildslave/jenkins/workspace/clang-stage2-coverage-R/llvm/tools/clang/include -Itools/clang/include -I/Applications/Xcode.app/Contents/Developer/Platforms/MacOSX.platform/Developer/SDKs/MacOSX10.14.sdk/usr/include/libxml2 -Iinclude -I/Users/buildslave/jenkins/workspace/clang-stage2-coverage-R/llvm/include -fPIC -fvisibility-inlines-hidden -Werror=date-time -Werror=unguarded-availability-new -std=c++11 -fmodules -fmodules-cache-path=/Users/buildslave/jenkins/workspace/clang-stage2-coverage-R/clang-build/module.cache -fcxx-modules -Wall -Wextra -Wno-unused-parameter -Wwrite-strings -Wcast-qual -Wmissing-field-initializers -pedantic -Wno-long-long -Wimplicit-fallthrough -Wcovered-switch-default -Wno-noexcept-type -Wnon-virtual-dtor -Wdelete-non-virtual-dtor -Wstring-conversion -fdiagnostics-color -fprofile-instr-generate='/Users/buildslave/jenkins/workspace/clang-stage2-coverage-R/clang-build/profiles/%6m.profraw' -fcoverage-mapping -fno-common -Woverloaded-virtual -Wno-nested-anon-types -O3 -DNDEBUG -isysroot /Applications/Xcode.app/Contents/Developer/Platforms/MacOSX.platform/Developer/SDKs/MacOSX10.14.sdk    -fno-exceptions -fno-rtti -MD -MT tools/clang/tools/extra/clangd/CMakeFiles/obj.clangDaemon.dir/FindSymbols.cpp.o -MF tools/clang/tools/extra/clangd/CMakeFiles/obj.clangDaemon.dir/FindSymbols.cpp.o.d -o tools/clang/tools/extra/clangd/CMakeFiles/obj.clangDaemon.dir/FindSymbols.cpp.o -c /Users/buildslave/jenkins/workspace/clang-stage2-coverage-R/llvm/tools/clang/tools/extra/clangd/FindSymbols.cpp
Assertion failed: (CachedFieldIndex && "failed to find field in parent"), function getFieldIndex, file /Users/buildslave/jenkins/workspace/clang-stage1-configure-RA/llvm/tools/clang/lib/AST/Decl.cpp, line 3965.
Stack dump:
0.	Program arguments: /Users/buildslave/jenkins/workspace/clang-stage2-coverage-R/host-compiler/bin/clang-9 -cc1 -triple x86_64-apple-macosx10.14.0 -Wdeprecated-objc-isa-usage -Werror=deprecated-objc-isa-usage -emit-obj -disable-free -main-file-name FindSymbols.cpp -mrelocation-model pic -pic-level 2 -mthread-model posix -mdisable-fp-elim -masm-verbose -munwind-tables -target-sdk-version=10.14 -target-cpu penryn -dwarf-column-info -debugger-tuning=lldb -ggnu-pubnames -target-linker-version 409.12 -fprofile-instrument-path=/Users/buildslave/jenkins/workspace/clang-stage2-coverage-R/clang-build/profiles/%6m.profraw -fprofile-instrument=clang -fcoverage-mapping -coverage-notes-file /Users/buildslave/jenkins/workspace/clang-stage2-coverage-R/clang-build/tools/clang/tools/extra/clangd/CMakeFiles/obj.clangDaemon.dir/FindSymbols.cpp.gcno -resource-dir /Users/buildslave/jenkins/workspace/clang-stage2-coverage-R/host-compiler/lib/clang/9.0.0 -dependency-file tools/clang/tools/extra/clangd/CMakeFiles/obj.clangDaemon.dir/FindSymbols.cpp.o.d -sys-header-deps -MT tools/clang/tools/extra/clangd/CMakeFiles/obj.clangDaemon.dir/FindSymbols.cpp.o -isysroot /Applications/Xcode.app/Contents/Developer/Platforms/MacOSX.platform/Developer/SDKs/MacOSX10.14.sdk -D GTEST_HAS_RTTI=0 -D _GNU_SOURCE -D __STDC_CONSTANT_MACROS -D __STDC_FORMAT_MACROS -D __STDC_LIMIT_MACROS -I tools/clang/tools/extra/clangd -I /Users/buildslave/jenkins/workspace/clang-stage2-coverage-R/llvm/tools/clang/tools/extra/clangd -I /Users/buildslave/jenkins/workspace/clang-stage2-coverage-R/llvm/tools/clang/include -I tools/clang/include -I /Applications/Xcode.app/Contents/Developer/Platforms/MacOSX.platform/Developer/SDKs/MacOSX10.14.sdk/usr/include/libxml2 -I include -I /Users/buildslave/jenkins/workspace/clang-stage2-coverage-R/llvm/include -D NDEBUG -stdlib=libc++ -internal-isystem /Users/buildslave/jenkins/workspace/clang-stage2-coverage-R/host-compiler/bin/../include/c++/v1 -internal-isystem /Applications/Xcode.app/Contents/Developer/Platforms/MacOSX.platform/Developer/SDKs/MacOSX10.14.sdk/usr/include/c++/v1 -internal-isystem /Applications/Xcode.app/Contents/Developer/Platforms/MacOSX.platform/Developer/SDKs/MacOSX10.14.sdk/usr/local/include -internal-isystem /Users/buildslave/jenkins/workspace/clang-stage2-coverage-R/host-compiler/lib/clang/9.0.0/include -internal-externc-isystem /Applications/Xcode.app/Contents/Developer/Platforms/MacOSX.platform/Developer/SDKs/MacOSX10.14.sdk/usr/include -O3 -Werror=date-time -Werror=unguarded-availability-new -Wall -Wextra -Wno-unused-parameter -Wwrite-strings -Wcast-qual -Wmissing-field-initializers -Wno-long-long -Wimplicit-fallthrough -Wcovered-switch-default -Wno-noexcept-type -Wnon-virtual-dtor -Wdelete-non-virtual-dtor -Wstring-conversion -Woverloaded-virtual -Wno-nested-anon-types -pedantic -std=c++11 -fdeprecated-macro -fdebug-compilation-dir /Users/buildslave/jenkins/workspace/clang-stage2-coverage-R/clang-build -ferror-limit 19 -fmessage-length 0 -fvisibility-inlines-hidden -stack-protector 1 -fblocks -fencode-extended-block-signature -fno-rtti -fregister-global-dtors-with-atexit -fmodules -fimplicit-module-maps -fmodules-cache-path=/Users/buildslave/jenkins/workspace/clang-stage2-coverage-R/clang-build/module.cache -fmodules-validate-system-headers -fobjc-runtime=macosx-10.14.0 -fmax-type-align=16 -fno-common -fdiagnostics-show-option -fcolor-diagnostics -vectorize-loops -vectorize-slp -o tools/clang/tools/extra/clangd/CMakeFiles/obj.clangDaemon.dir/FindSymbols.cpp.o -x c++ /Users/buildslave/jenkins/workspace/clang-stage2-coverage-R/llvm/tools/clang/tools/extra/clangd/FindSymbols.cpp 
1.	<eof> parser at end of file
2.	Per-file LLVM IR generation
3.	/Users/buildslave/jenkins/workspace/clang-stage2-coverage-R/llvm/include/llvm/Support/Error.h:625:17: Generating code for declaration 'llvm::Expected<std::__1::basic_string<char> >::getStorage'
0  clang-9                  0x000000010b155498 llvm::sys::PrintStackTrace(llvm::raw_ostream&) + 40
1  clang-9                  0x000000010b154645 llvm::sys::RunSignalHandlers() + 85
2  clang-9                  0x000000010b155aa8 SignalHandler(int) + 264
3  libsystem_platform.dylib 0x00007fff7de97b3d _sigtramp + 29
4  clang-9                  0x000000010b0b67a6 llvm::FoldingSetBase::FindNodeOrInsertPos(llvm::FoldingSetNodeID const&, void*&) + 182
5  libsystem_c.dylib        0x00007fff7dd561c9 abort + 127
6  libsystem_c.dylib        0x00007fff7dd1e868 basename_r + 0
7  clang-9                  0x000000010ced86e6 clang::FieldDecl::getFieldIndex() const + 694
8  clang-9                  0x000000010b447e55 clang::CodeGen::CodeGenFunction::EmitLValueForField(clang::CodeGen::LValue, clang::FieldDecl const*) + 1413
9  clang-9                  0x000000010b452b7f clang::CodeGen::CodeGenFunction::EmitMemberExpr(clang::MemberExpr const*) + 1247
10 clang-9                  0x000000010b4447ea clang::CodeGen::CodeGenFunction::EmitLValue(clang::Expr const*) + 1018
11 clang-9                  0x000000010b44ccdd clang::CodeGen::CodeGenFunction::EmitCheckedLValue(clang::Expr const*, clang::CodeGen::CodeGenFunction::TypeCheckKind) + 173
12 clang-9                  0x000000010b4527d6 clang::CodeGen::CodeGenFunction::EmitMemberExpr(clang::MemberExpr const*) + 310
13 clang-9                  0x000000010b4447ea clang::CodeGen::CodeGenFunction::EmitLValue(clang::Expr const*) + 1018
14 clang-9                  0x000000010b453d9c clang::CodeGen::CodeGenFunction::EmitCastLValue(clang::CastExpr const*) + 1372
15 clang-9                  0x000000010b44446f clang::CodeGen::CodeGenFunction::EmitLValue(clang::Expr const*) + 127
16 clang-9                  0x000000010b44ccdd clang::CodeGen::CodeGenFunction::EmitCheckedLValue(clang::Expr const*, clang::CodeGen::CodeGenFunction::TypeCheckKind) + 173
17 clang-9                  0x000000010b4527d6 clang::CodeGen::CodeGenFunction::EmitMemberExpr(clang::MemberExpr const*) + 310
18 clang-9                  0x000000010b4447ea clang::CodeGen::CodeGenFunction::EmitLValue(clang::Expr const*) + 1018
19 clang-9                  0x000000010b44c5e7 clang::CodeGen::CodeGenFunction::EmitArrayToPointerDecay(clang::Expr const*, clang::CodeGen::LValueBaseInfo*, clang::CodeGen::TBAAAccessInfo*) + 119
20 clang-9                  0x000000010b49d348 (anonymous namespace)::ScalarExprEmitter::VisitCastExpr(clang::CastExpr*) + 3896
21 clang-9                  0x000000010b49c4b4 (anonymous namespace)::ScalarExprEmitter::VisitCastExpr(clang::CastExpr*) + 164
22 clang-9                  0x000000010b48a538 clang::CodeGen::CodeGenFunction::EmitScalarExpr(clang::Expr const*, bool) + 104
23 clang-9                  0x000000010b57ef16 clang::CodeGen::CodeGenFunction::EmitReturnStmt(clang::ReturnStmt const&) + 1430
24 clang-9                  0x000000010b57c122 clang::CodeGen::CodeGenFunction::EmitStmt(clang::Stmt const*, llvm::ArrayRef<clang::Attr const*>) + 2482
25 clang-9                  0x000000010b5844fa clang::CodeGen::CodeGenFunction::EmitCompoundStmtWithoutScope(clang::CompoundStmt const&, bool, clang::CodeGen::AggValueSlot) + 186
26 clang-9                  0x000000010b5c41f7 clang::CodeGen::CodeGenFunction::GenerateCode(clang::GlobalDecl, llvm::Function*, clang::CodeGen::CGFunctionInfo const&) + 791
27 clang-9                  0x000000010b5def97 clang::CodeGen::CodeGenModule::EmitGlobalFunctionDefinition(clang::GlobalDecl, llvm::GlobalValue*) + 503
28 clang-9                  0x000000010b5d8eb6 clang::CodeGen::CodeGenModule::EmitGlobalDefinition(clang::GlobalDecl, llvm::GlobalValue*) + 486
29 clang-9                  0x000000010b5ceea1 clang::CodeGen::CodeGenModule::EmitDeferred() + 289
30 clang-9                  0x000000010b5ceec9 clang::CodeGen::CodeGenModule::EmitDeferred() + 329
31 clang-9                  0x000000010b5ceec9 clang::CodeGen::CodeGenModule::EmitDeferred() + 329
32 clang-9                  0x000000010b5ce19a clang::CodeGen::CodeGenModule::Release() + 42
33 clang-9                  0x000000010b655f74 (anonymous namespace)::CodeGeneratorImpl::HandleTranslationUnit(clang::ASTContext&) + 100
34 clang-9                  0x000000010b5bac26 clang::BackendConsumer::HandleTranslationUnit(clang::ASTContext&) + 134
35 clang-9                  0x000000010c4ba0e3 clang::ParseAST(clang::Sema&, bool, bool) + 611
36 clang-9                  0x000000010b83a7d4 clang::FrontendAction::Execute() + 84
37 clang-9                  0x000000010b7ec178 clang::CompilerInstance::ExecuteAction(clang::FrontendAction&) + 1544
38 clang-9                  0x000000010b8b2ed0 clang::ExecuteCompilerInvocation(clang::CompilerInstance*) + 1808
39 clang-9                  0x000000010954ac44 cc1_main(llvm::ArrayRef<char const*>, char const*, void*) + 2356
40 clang-9                  0x00000001095482c3 main + 10851
41 libdyld.dylib            0x00007fff7dcae085 start + 1
clang-9: error: unable to execute command: Abort trap: 6
clang-9: error: clang frontend command failed due to signal (use -v to see invocation)
clang version 9.0.0 (trunk)
Target: x86_64-apple-darwin18.0.0
Thread model: posix
InstalledDir: /Users/buildslave/jenkins/workspace/clang-stage2-coverage-R/host-compiler/bin
clang-9: note: diagnostic msg: PLEASE submit a bug report to https://bugs.llvm.org/ and include the crash backtrace, preprocessed source, and associated run script.
clang-9: note: diagnostic msg: 
********************

Hide Details

PLEASE ATTACH THE FOLLOWING FILES TO THE BUG REPORT: Preprocessed source(s) and associated run script(s) are located at: clang-9: note: diagnostic msg: /var/folders/09/r4vw4v8n5kb67jl66zvlbljw0000gn/T/FindSymbols-b4c5f9.cpp clang-9: note: diagnostic msg: /var/folders/09/r4vw4v8n5kb67jl66zvlbljw0000gn/T/FindSymbols-b4c5f9.cache clang-9: note: diagnostic msg: /var/folders/09/r4vw4v8n5kb67jl66zvlbljw0000gn/T/FindSymbols-b4c5f9.sh clang-9: note: diagnostic msg: Crash backtrace is located in clang-9: note: diagnostic msg: /Users/buildslave/Library/Logs/DiagnosticReports/clang-9_<YYYY-MM-DD-HHMMSS>_<hostname>.crash clang-9: note: diagnostic msg: (choose the .crash file that corresponds to your crash) clang-9: note: diagnostic msg:

Hide Details

******************** [4045/4610] /Users/buildslave/jenkins/workspace/clang-stage2-coverage-R/host-compiler/bin/clang++ -DGTEST_HAS_RTTI=0 -D_GNU_SOURCE -D__STDC_CONSTANT_MACROS -D__STDC_FORMAT_MACROS -D__STDC_LIMIT_MACROS -Itools/clang/tools/extra/clangd -I/Users/buildslave/jenkins/workspace/clang-stage2-coverage-R/llvm/tools/clang/tools/extra/clangd -I/Users/buildslave/jenkins/workspace/clang-stage2-coverage-R/llvm/tools/clang/include -Itools/clang/include -I/Applications/Xcode.app/Contents/Developer/Platforms/MacOSX.platform/Developer/SDKs/MacOSX10.14.sdk/usr/include/libxml2 -Iinclude -I/Users/buildslave/jenkins/workspace/clang-stage2-coverage-R/llvm/include -fPIC -fvisibility-inlines-hidden -Werror=date-time -Werror=unguarded-availability-new -std=c++11 -fmodules -fmodules-cache-path=/Users/buildslave/jenkins/workspace/clang-stage2-coverage-R/clang-build/module.cache -fcxx-modules -Wall -Wextra -Wno-unused-parameter -Wwrite-strings -Wcast-qual -Wmissing-field-initializers -pedantic -Wno-long-long -Wimplicit-fallthrough -Wcovered-switch-default -Wno-noexcept-type -Wnon-virtual-dtor -Wdelete-non-virtual-dtor -Wstring-conversion -fdiagnostics-color -fprofile-instr-generate='/Users/buildslave/jenkins/workspace/clang-stage2-coverage-R/clang-build/profiles/%6m.profraw' -fcoverage-mapping -fno-common -Woverloaded-virtual -Wno-nested-anon-types -O3 -DNDEBUG -isysroot /Applications/Xcode.app/Contents/Developer/Platforms/MacOSX.platform/Developer/SDKs/MacOSX10.14.sdk -fno-exceptions -fno-rtti -MD -MT tools/clang/tools/extra/clangd/CMakeFiles/obj.clangDaemon.dir/TUScheduler.cpp.o -MF tools/clang/tools/extra/clangd/CMakeFiles/obj.clangDaemon.dir/TUScheduler.cpp.o.d -o tools/clang/tools/extra/clangd/CMakeFiles/obj.clangDaemon.dir/TUScheduler.cpp.o -c /Users/buildslave/jenkins/workspace/clang-stage2-coverage-R/llvm/tools/clang/tools/extra/clangd/TUScheduler.cpp [4046/4610] /Users/buildslave/jenkins/workspace/clang-stage2-coverage-R/host-compiler/bin/clang++ -DGTEST_HAS_RTTI=0 -D_GNU_SOURCE -D__STDC_CONSTANT_MACROS -D__STDC_FORMAT_MACROS -D__STDC_LIMIT_MACROS -Itools/clang/tools/extra/clangd -I/Users/buildslave/jenkins/workspace/clang-stage2-coverage-R/llvm/tools/clang/tools/extra/clangd -I/Users/buildslave/jenkins/workspace/clang-stage2-coverage-R/llvm/tools/clang/include -Itools/clang/include -I/Applications/Xcode.app/Contents/Developer/Platforms/MacOSX.platform/Developer/SDKs/MacOSX10.14.sdk/usr/include/libxml2 -Iinclude -I/Users/buildslave/jenkins/workspace/clang-stage2-coverage-R/llvm/include -fPIC -fvisibility-inlines-hidden -Werror=date-time -Werror=unguarded-availability-new -std=c++11 -fmodules -fmodules-cache-path=/Users/buildslave/jenkins/workspace/clang-stage2-coverage-R/clang-build/module.cache -fcxx-modules -Wall -Wextra -Wno-unused-parameter -Wwrite-strings -Wcast-qual -Wmissing-field-initializers -pedantic -Wno-long-long -Wimplicit-fallthrough -Wcovered-switch-default -Wno-noexcept-type -Wnon-virtual-dtor -Wdelete-non-virtual-dtor -Wstring-conversion -fdiagnostics-color -fprofile-instr-generate='/Users/buildslave/jenkins/workspace/clang-stage2-coverage-R/clang-build/profiles/%6m.profraw' -fcoverage-mapping -fno-common -Woverloaded-virtual -Wno-nested-anon-types -O3 -DNDEBUG -isysroot /Applications/Xcode.app/Contents/Developer/Platforms/MacOSX.platform/Developer/SDKs/MacOSX10.14.sdk -fno-exceptions -fno-rtti -MD -MT tools/clang/tools/extra/clangd/CMakeFiles/obj.clangDaemon.dir/Headers.cpp.o -MF tools/clang/tools/extra/clangd/CMakeFiles/obj.clangDaemon.dir/Headers.cpp.o.d -o tools/clang/tools/extra/clangd/CMakeFiles/obj.clangDaemon.dir/Headers.cpp.o -c /Users/buildslave/jenkins/workspace/clang-stage2-coverage-R/llvm/tools/clang/tools/extra/clangd/Headers.cpp FAILED: tools/clang/tools/extra/clangd/CMakeFiles/obj.clangDaemon.dir/Headers.cpp.o /Users/buildslave/jenkins/workspace/clang-stage2-coverage-R/host-compiler/bin/clang++ -DGTEST_HAS_RTTI=0 -D_GNU_SOURCE -D__STDC_CONSTANT_MACROS -D__STDC_FORMAT_MACROS -D__STDC_LIMIT_MACROS -Itools/clang/tools/extra/clangd -I/Users/buildslave/jenkins/workspace/clang-stage2-coverage-R/llvm/tools/clang/tools/extra/clangd -I/Users/buildslave/jenkins/workspace/clang-stage2-coverage-R/llvm/tools/clang/include -Itools/clang/include -I/Applications/Xcode.app/Contents/Developer/Platforms/MacOSX.platform/Developer/SDKs/MacOSX10.14.sdk/usr/include/libxml2 -Iinclude -I/Users/buildslave/jenkins/workspace/clang-stage2-coverage-R/llvm/include -fPIC -fvisibility-inlines-hidden -Werror=date-time -Werror=unguarded-availability-new -std=c++11 -fmodules -fmodules-cache-path=/Users/buildslave/jenkins/workspace/clang-stage2-coverage-R/clang-build/module.cache -fcxx-modules -Wall -Wextra -Wno-unused-parameter -Wwrite-strings -Wcast-qual -Wmissing-field-initializers -pedantic -Wno-long-long -Wimplicit-fallthrough -Wcovered-switch-default -Wno-noexcept-type -Wnon-virtual-dtor -Wdelete-non-virtual-dtor -Wstring-conversion -fdiagnostics-color -fprofile-instr-generate='/Users/buildslave/jenkins/workspace/clang-stage2-coverage-R/clang-build/profiles/%6m.profraw' -fcoverage-mapping -fno-common -Woverloaded-virtual -Wno-nested-anon-types -O3 -DNDEBUG -isysroot /Applications/Xcode.app/Contents/Developer/Platforms/MacOSX.platform/Developer/SDKs/MacOSX10.14.sdk -fno-exceptions -fno-rtti -MD -MT tools/clang/tools/extra/clangd/CMakeFiles/obj.clangDaemon.dir/Headers.cpp.o -MF tools/clang/tools/extra/clangd/CMakeFiles/obj.clangDaemon.dir/Headers.cpp.o.d -o tools/clang/tools/extra/clangd/CMakeFiles/obj.clangDaemon.dir/Headers.cpp.o -c /Users/buildslave/jenkins/workspace/clang-stage2-coverage-R/llvm/tools/clang/tools/extra/clangd/Headers.cpp Assertion failed: (CachedFieldIndex && "failed to find field in parent"), function getFieldIndex, file /Users/buildslave/jenkins/workspace/clang-stage1-configure-RA/llvm/tools/clang/lib/AST/Decl.cpp, line 3965. Stack dump: 0. Program arguments: /Users/buildslave/jenkins/workspace/clang-stage2-coverage-R/host-compiler/bin/clang-9 -cc1 -triple x86_64-apple-macosx10.14.0 -Wdeprecated-objc-isa-usage -Werror=deprecated-objc-isa-usage -emit-obj -disable-free -main-file-name Headers.cpp -mrelocation-model pic -pic-level 2 -mthread-model posix -mdisable-fp-elim -masm-verbose -munwind-tables -target-sdk-version=10.14 -target-cpu penryn -dwarf-column-info -debugger-tuning=lldb -ggnu-pubnames -target-linker-version 409.12 -fprofile-instrument-path=/Users/buildslave/jenkins/workspace/clang-stage2-coverage-R/clang-build/profiles/%6m.profraw -fprofile-instrument=clang -fcoverage-mapping -coverage-notes-file /Users/buildslave/jenkins/workspace/clang-stage2-coverage-R/clang-build/tools/clang/tools/extra/clangd/CMakeFiles/obj.clangDaemon.dir/Headers.cpp.gcno -resource-dir /Users/buildslave/jenkins/workspace/clang-stage2-coverage-R/host-compiler/lib/clang/9.0.0 -dependency-file tools/clang/tools/extra/clangd/CMakeFiles/obj.clangDaemon.dir/Headers.cpp.o.d -sys-header-deps -MT tools/clang/tools/extra/clangd/CMakeFiles/obj.clangDaemon.dir/Headers.cpp.o -isysroot /Applications/Xcode.app/Contents/Developer/Platforms/MacOSX.platform/Developer/SDKs/MacOSX10.14.sdk -D GTEST_HAS_RTTI=0 -D _GNU_SOURCE -D __STDC_CONSTANT_MACROS -D __STDC_FORMAT_MACROS -D __STDC_LIMIT_MACROS -I tools/clang/tools/extra/clangd -I /Users/buildslave/jenkins/workspace/clang-stage2-coverage-R/llvm/tools/clang/tools/extra/clangd -I /Users/buildslave/jenkins/workspace/clang-stage2-coverage-R/llvm/tools/clang/include -I tools/clang/include -I /Applications/Xcode.app/Contents/Developer/Platforms/MacOSX.platform/Developer/SDKs/MacOSX10.14.sdk/usr/include/libxml2 -I include -I /Users/buildslave/jenkins/workspace/clang-stage2-coverage-R/llvm/include -D NDEBUG -stdlib=libc++ -internal-isystem /Users/buildslave/jenkins/workspace/clang-stage2-coverage-R/host-compiler/bin/../include/c++/v1 -internal-isystem /Applications/Xcode.app/Contents/Developer/Platforms/MacOSX.platform/Developer/SDKs/MacOSX10.14.sdk/usr/include/c++/v1 -internal-isystem /Applications/Xcode.app/Contents/Developer/Platforms/MacOSX.platform/Developer/SDKs/MacOSX10.14.sdk/usr/local/include -internal-isystem /Users/buildslave/jenkins/workspace/clang-stage2-coverage-R/host-compiler/lib/clang/9.0.0/include -internal-externc-isystem /Applications/Xcode.app/Contents/Developer/Platforms/MacOSX.platform/Developer/SDKs/MacOSX10.14.sdk/usr/include -O3 -Werror=date-time -Werror=unguarded-availability-new -Wall -Wextra -Wno-unused-parameter -Wwrite-strings -Wcast-qual -Wmissing-field-initializers -Wno-long-long -Wimplicit-fallthrough -Wcovered-switch-default -Wno-noexcept-type -Wnon-virtual-dtor -Wdelete-non-virtual-dtor -Wstring-conversion -Woverloaded-virtual -Wno-nested-anon-types -pedantic -std=c++11 -fdeprecated-macro -fdebug-compilation-dir /Users/buildslave/jenkins/workspace/clang-stage2-coverage-R/clang-build -ferror-limit 19 -fmessage-length 0 -fvisibility-inlines-hidden -stack-protector 1 -fblocks -fencode-extended-block-signature -fno-rtti -fregister-global-dtors-with-atexit -fmodules -fimplicit-module-maps -fmodules-cache-path=/Users/buildslave/jenkins/workspace/clang-stage2-coverage-R/clang-build/module.cache -fmodules-validate-system-headers -fobjc-runtime=macosx-10.14.0 -fmax-type-align=16 -fno-common -fdiagnostics-show-option -fcolor-diagnostics -vectorize-loops -vectorize-slp -o tools/clang/tools/extra/clangd/CMakeFiles/obj.clangDaemon.dir/Headers.cpp.o -x c++ /Users/buildslave/jenkins/workspace/clang-stage2-coverage-R/llvm/tools/clang/tools/extra/clangd/Headers.cpp 1. <eof> parser at end of file 2. Per-file LLVM IR generation 3. /Users/buildslave/jenkins/workspace/clang-stage2-coverage-R/llvm/include/llvm/Support/Error.h:625:17: Generating code for declaration 'llvm::Expected<std::__1::basic_string<char> >::getStorage' 0 clang-9 0x000000010e3d8498 llvm::sys::PrintStackTrace(llvm::raw_ostream&) + 40 1 clang-9 0x000000010e3d7645 llvm::sys::RunSignalHandlers() + 85 2 clang-9 0x000000010e3d8aa8 SignalHandler(int) + 264 3 libsystem_platform.dylib 0x00007fff7de97b3d _sigtramp + 29 4 clang-9 0x000000010e3397a6 llvm::FoldingSetBase::FindNodeOrInsertPos(llvm::FoldingSetNodeID const&, void*&) + 182 5 libsystem_c.dylib 0x00007fff7dd561c9 abort + 127 6 libsystem_c.dylib 0x00007fff7dd1e868 basename_r + 0 7 clang-9 0x000000011015b6e6 clang::FieldDecl::getFieldIndex() const + 694 8 clang-9 0x000000010e6cae55 clang::CodeGen::CodeGenFunction::EmitLValueForField(clang::CodeGen::LValue, clang::FieldDecl const*) + 1413 9 clang-9 0x000000010e6d5b7f clang::CodeGen::CodeGenFunction::EmitMemberExpr(clang::MemberExpr const*) + 1247 10 clang-9 0x000000010e6c77ea clang::CodeGen::CodeGenFunction::EmitLValue(clang::Expr const*) + 1018 11 clang-9 0x000000010e6cfcdd clang::CodeGen::CodeGenFunction::EmitCheckedLValue(clang::Expr const*, clang::CodeGen::CodeGenFunction::TypeCheckKind) + 173 12 clang-9 0x000000010e6d57d6 clang::CodeGen::CodeGenFunction::EmitMemberExpr(clang::MemberExpr const*) + 310 13 clang-9 0x000000010e6c77ea clang::CodeGen::CodeGenFunction::EmitLValue(clang::Expr const*) + 1018 14 clang-9 0x000000010e6d6d9c clang::CodeGen::CodeGenFunction::EmitCastLValue(clang::CastExpr const*) + 1372 15 clang-9 0x000000010e6c746f clang::CodeGen::CodeGenFunction::EmitLValue(clang::Expr const*) + 127 16 clang-9 0x000000010e6cfcdd clang::CodeGen::CodeGenFunction::EmitCheckedLValue(clang::Expr const*, clang::CodeGen::CodeGenFunction::TypeCheckKind) + 173 17 clang-9 0x000000010e6d57d6 clang::CodeGen::CodeGenFunction::EmitMemberExpr(clang::MemberExpr const*) + 310 18 clang-9 0x000000010e6c77ea clang::CodeGen::CodeGenFunction::EmitLValue(clang::Expr const*) + 1018 19 clang-9 0x000000010e6cf5e7 clang::CodeGen::CodeGenFunction::EmitArrayToPointerDecay(clang::Expr const*, clang::CodeGen::LValueBaseInfo*, clang::CodeGen::TBAAAccessInfo*) + 119 20 clang-9 0x000000010e720348 (anonymous namespace)::ScalarExprEmitter::VisitCastExpr(clang::CastExpr*) + 3896 21 clang-9 0x000000010e71f4b4 (anonymous namespace)::ScalarExprEmitter::VisitCastExpr(clang::CastExpr*) + 164 22 clang-9 0x000000010e70d538 clang::CodeGen::CodeGenFunction::EmitScalarExpr(clang::Expr const*, bool) + 104 23 clang-9 0x000000010e801f16 clang::CodeGen::CodeGenFunction::EmitReturnStmt(clang::ReturnStmt const&) + 1430 24 clang-9 0x000000010e7ff122 clang::CodeGen::CodeGenFunction::EmitStmt(clang::Stmt const*, llvm::ArrayRef<clang::Attr const*>) + 2482 25 clang-9 0x000000010e8074fa clang::CodeGen::CodeGenFunction::EmitCompoundStmtWithoutScope(clang::CompoundStmt const&, bool, clang::CodeGen::AggValueSlot) + 186 26 clang-9 0x000000010e8471f7 clang::CodeGen::CodeGenFunction::GenerateCode(clang::GlobalDecl, llvm::Function*, clang::CodeGen::CGFunctionInfo const&) + 791 27 clang-9 0x000000010e861f97 clang::CodeGen::CodeGenModule::EmitGlobalFunctionDefinition(clang::GlobalDecl, llvm::GlobalValue*) + 503 28 clang-9 0x000000010e85beb6 clang::CodeGen::CodeGenModule::EmitGlobalDefinition(clang::GlobalDecl, llvm::GlobalValue*) + 486 29 clang-9 0x000000010e851ea1 clang::CodeGen::CodeGenModule::EmitDeferred() + 289 30 clang-9 0x000000010e851ec9 clang::CodeGen::CodeGenModule::EmitDeferred() + 329 31 clang-9 0x000000010e851ec9 clang::CodeGen::CodeGenModule::EmitDeferred() + 329 32 clang-9 0x000000010e85119a clang::CodeGen::CodeGenModule::Release() + 42 33 clang-9 0x000000010e8d8f74 (anonymous namespace)::CodeGeneratorImpl::HandleTranslationUnit(clang::ASTContext&) + 100 34 clang-9 0x000000010e83dc26 clang::BackendConsumer::HandleTranslationUnit(clang::ASTContext&) + 134 35 clang-9 0x000000010f73d0e3 clang::ParseAST(clang::Sema&, bool, bool) + 611 36 clang-9 0x000000010eabd7d4 clang::FrontendAction::Execute() + 84 37 clang-9 0x000000010ea6f178 clang::CompilerInstance::ExecuteAction(clang::FrontendAction&) + 1544 38 clang-9 0x000000010eb35ed0 clang::ExecuteCompilerInvocation(clang::CompilerInstance*) + 1808 39 clang-9 0x000000010c7cdc44 cc1_main(llvm::ArrayRef<char const*>, char const*, void*) + 2356 40 clang-9 0x000000010c7cb2c3 main + 10851 41 libdyld.dylib 0x00007fff7dcae085 start + 1 42 libdyld.dylib 0x0000000000000080 start + 18446603338405715964 clang-9: error: unable to execute command: Abort trap: 6 clang-9: error: clang frontend command failed due to signal (use -v to see invocation) clang version 9.0.0 (trunk) Target: x86_64-apple-darwin18.0.0 Thread model: posix InstalledDir: /Users/buildslave/jenkins/workspace/clang-stage2-coverage-R/host-compiler/bin clang-9: note: diagnostic msg: PLEASE submit a bug report to https://bugs.llvm.org/ and include the crash backtrace, preprocessed source, and associated run script. clang-9: note: diagnostic msg: ********************

Hide Details

PLEASE ATTACH THE FOLLOWING FILES TO THE BUG REPORT: Preprocessed source(s) and associated run script(s) are located at: clang-9: note: diagnostic msg: /var/folders/09/r4vw4v8n5kb67jl66zvlbljw0000gn/T/Headers-f455ec.cpp clang-9: note: diagnostic msg: /var/folders/09/r4vw4v8n5kb67jl66zvlbljw0000gn/T/Headers-f455ec.cache clang-9: note: diagnostic msg: /var/folders/09/r4vw4v8n5kb67jl66zvlbljw0000gn/T/Headers-f455ec.sh clang-9: note: diagnostic msg: Crash backtrace is located in clang-9: note: diagnostic msg: /Users/buildslave/Library/Logs/DiagnosticReports/clang-9_<YYYY-MM-DD-HHMMSS>_<hostname>.crash clang-9: note: diagnostic msg: (choose the .crash file that corresponds to your crash) clang-9: note: diagnostic msg:

Hide Details

******************** [4047/4610] /Users/buildslave/jenkins/workspace/clang-stage2-coverage-R/host-compiler/bin/clang++ -DGTEST_HAS_RTTI=0 -D_GNU_SOURCE -D__STDC_CONSTANT_MACROS -D__STDC_FORMAT_MACROS -D__STDC_LIMIT_MACROS -Itools/clang/tools/extra/clangd -I/Users/buildslave/jenkins/workspace/clang-stage2-coverage-R/llvm/tools/clang/tools/extra/clangd -I/Users/buildslave/jenkins/workspace/clang-stage2-coverage-R/llvm/tools/clang/include -Itools/clang/include -I/Applications/Xcode.app/Contents/Developer/Platforms/MacOSX.platform/Developer/SDKs/MacOSX10.14.sdk/usr/include/libxml2 -Iinclude -I/Users/buildslave/jenkins/workspace/clang-stage2-coverage-R/llvm/include -fPIC -fvisibility-inlines-hidden -Werror=date-time -Werror=unguarded-availability-new -std=c++11 -fmodules -fmodules-cache-path=/Users/buildslave/jenkins/workspace/clang-stage2-coverage-R/clang-build/module.cache -fcxx-modules -Wall -Wextra -Wno-unused-parameter -Wwrite-strings -Wcast-qual -Wmissing-field-initializers -pedantic -Wno-long-long -Wimplicit-fallthrough -Wcovered-switch-default -Wno-noexcept-type -Wnon-virtual-dtor -Wdelete-non-virtual-dtor -Wstring-conversion -fdiagnostics-color -fprofile-instr-generate='/Users/buildslave/jenkins/workspace/clang-stage2-coverage-R/clang-build/profiles/%6m.profraw' -fcoverage-mapping -fno-common -Woverloaded-virtual -Wno-nested-anon-types -O3 -DNDEBUG -isysroot /Applications/Xcode.app/Contents/Developer/Platforms/MacOSX.platform/Developer/SDKs/MacOSX10.14.sdk -fno-exceptions -fno-rtti -MD -MT tools/clang/tools/extra/clangd/CMakeFiles/obj.clangDaemon.dir/index/BackgroundRebuild.cpp.o -MF tools/clang/tools/extra/clangd/CMakeFiles/obj.clangDaemon.dir/index/BackgroundRebuild.cpp.o.d -o tools/clang/tools/extra/clangd/CMakeFiles/obj.clangDaemon.dir/index/BackgroundRebuild.cpp.o -c /Users/buildslave/jenkins/workspace/clang-stage2-coverage-R/llvm/tools/clang/tools/extra/clangd/index/BackgroundRebuild.cpp [4048/4610] /Users/buildslave/jenkins/workspace/clang-stage2-coverage-R/host-compiler/bin/clang++ -DGTEST_HAS_RTTI=0 -D_GNU_SOURCE -D__STDC_CONSTANT_MACROS -D__STDC_FORMAT_MACROS -D__STDC_LIMIT_MACROS -Itools/clang/tools/extra/clangd -I/Users/buildslave/jenkins/workspace/clang-stage2-coverage-R/llvm/tools/clang/tools/extra/clangd -I/Users/buildslave/jenkins/workspace/clang-stage2-coverage-R/llvm/tools/clang/include -Itools/clang/include -I/Applications/Xcode.app/Contents/Developer/Platforms/MacOSX.platform/Developer/SDKs/MacOSX10.14.sdk/usr/include/libxml2 -Iinclude -I/Users/buildslave/jenkins/workspace/clang-stage2-coverage-R/llvm/include -fPIC -fvisibility-inlines-hidden -Werror=date-time -Werror=unguarded-availability-new -std=c++11 -fmodules -fmodules-cache-path=/Users/buildslave/jenkins/workspace/clang-stage2-coverage-R/clang-build/module.cache -fcxx-modules -Wall -Wextra -Wno-unused-parameter -Wwrite-strings -Wcast-qual -Wmissing-field-initializers -pedantic -Wno-long-long -Wimplicit-fallthrough -Wcovered-switch-default -Wno-noexcept-type -Wnon-virtual-dtor -Wdelete-non-virtual-dtor -Wstring-conversion -fdiagnostics-color -fprofile-instr-generate='/Users/buildslave/jenkins/workspace/clang-stage2-coverage-R/clang-build/profiles/%6m.profraw' -fcoverage-mapping -fno-common -Woverloaded-virtual -Wno-nested-anon-types -O3 -DNDEBUG -isysroot /Applications/Xcode.app/Contents/Developer/Platforms/MacOSX.platform/Developer/SDKs/MacOSX10.14.sdk -fno-exceptions -fno-rtti -MD -MT tools/clang/tools/extra/clangd/CMakeFiles/obj.clangDaemon.dir/XRefs.cpp.o -MF tools/clang/tools/extra/clangd/CMakeFiles/obj.clangDaemon.dir/XRefs.cpp.o.d -o tools/clang/tools/extra/clangd/CMakeFiles/obj.clangDaemon.dir/XRefs.cpp.o -c /Users/buildslave/jenkins/workspace/clang-stage2-coverage-R/llvm/tools/clang/tools/extra/clangd/XRefs.cpp [4049/4610] /Users/buildslave/jenkins/workspace/clang-stage2-coverage-R/host-compiler/bin/clang++ -DGTEST_HAS_RTTI=0 -D_GNU_SOURCE -D__STDC_CONSTANT_MACROS -D__STDC_FORMAT_MACROS -D__STDC_LIMIT_MACROS -Itools/clang/tools/extra/clangd -I/Users/buildslave/jenkins/workspace/clang-stage2-coverage-R/llvm/tools/clang/tools/extra/clangd -I/Users/buildslave/jenkins/workspace/clang-stage2-coverage-R/llvm/tools/clang/include -Itools/clang/include -I/Applications/Xcode.app/Contents/Developer/Platforms/MacOSX.platform/Developer/SDKs/MacOSX10.14.sdk/usr/include/libxml2 -Iinclude -I/Users/buildslave/jenkins/workspace/clang-stage2-coverage-R/llvm/include -fPIC -fvisibility-inlines-hidden -Werror=date-time -Werror=unguarded-availability-new -std=c++11 -fmodules -fmodules-cache-path=/Users/buildslave/jenkins/workspace/clang-stage2-coverage-R/clang-build/module.cache -fcxx-modules -Wall -Wextra -Wno-unused-parameter -Wwrite-strings -Wcast-qual -Wmissing-field-initializers -pedantic -Wno-long-long -Wimplicit-fallthrough -Wcovered-switch-default -Wno-noexcept-type -Wnon-virtual-dtor -Wdelete-non-virtual-dtor -Wstring-conversion -fdiagnostics-color -fprofile-instr-generate='/Users/buildslave/jenkins/workspace/clang-stage2-coverage-R/clang-build/profiles/%6m.profraw' -fcoverage-mapping -fno-common -Woverloaded-virtual -Wno-nested-anon-types -O3 -DNDEBUG -isysroot /Applications/Xcode.app/Contents/Developer/Platforms/MacOSX.platform/Developer/SDKs/MacOSX10.14.sdk -fno-exceptions -fno-rtti -MD -MT tools/clang/tools/extra/clangd/CMakeFiles/obj.clangDaemon.dir/index/Background.cpp.o -MF tools/clang/tools/extra/clangd/CMakeFiles/obj.clangDaemon.dir/index/Background.cpp.o.d -o tools/clang/tools/extra/clangd/CMakeFiles/obj.clangDaemon.dir/index/Background.cpp.o -c /Users/buildslave/jenkins/workspace/clang-stage2-coverage-R/llvm/tools/clang/tools/extra/clangd/index/Background.cpp FAILED: tools/clang/tools/extra/clangd/CMakeFiles/obj.clangDaemon.dir/index/Background.cpp.o /Users/buildslave/jenkins/workspace/clang-stage2-coverage-R/host-compiler/bin/clang++ -DGTEST_HAS_RTTI=0 -D_GNU_SOURCE -D__STDC_CONSTANT_MACROS -D__STDC_FORMAT_MACROS -D__STDC_LIMIT_MACROS -Itools/clang/tools/extra/clangd -I/Users/buildslave/jenkins/workspace/clang-stage2-coverage-R/llvm/tools/clang/tools/extra/clangd -I/Users/buildslave/jenkins/workspace/clang-stage2-coverage-R/llvm/tools/clang/include -Itools/clang/include -I/Applications/Xcode.app/Contents/Developer/Platforms/MacOSX.platform/Developer/SDKs/MacOSX10.14.sdk/usr/include/libxml2 -Iinclude -I/Users/buildslave/jenkins/workspace/clang-stage2-coverage-R/llvm/include -fPIC -fvisibility-inlines-hidden -Werror=date-time -Werror=unguarded-availability-new -std=c++11 -fmodules -fmodules-cache-path=/Users/buildslave/jenkins/workspace/clang-stage2-coverage-R/clang-build/module.cache -fcxx-modules -Wall -Wextra -Wno-unused-parameter -Wwrite-strings -Wcast-qual -Wmissing-field-initializers -pedantic -Wno-long-long -Wimplicit-fallthrough -Wcovered-switch-default -Wno-noexcept-type -Wnon-virtual-dtor -Wdelete-non-virtual-dtor -Wstring-conversion -fdiagnostics-color -fprofile-instr-generate='/Users/buildslave/jenkins/workspace/clang-stage2-coverage-R/clang-build/profiles/%6m.profraw' -fcoverage-mapping -fno-common -Woverloaded-virtual -Wno-nested-anon-types -O3 -DNDEBUG -isysroot /Applications/Xcode.app/Contents/Developer/Platforms/MacOSX.platform/Developer/SDKs/MacOSX10.14.sdk -fno-exceptions -fno-rtti -MD -MT tools/clang/tools/extra/clangd/CMakeFiles/obj.clangDaemon.dir/index/Background.cpp.o -MF tools/clang/tools/extra/clangd/CMakeFiles/obj.clangDaemon.dir/index/Background.cpp.o.d -o tools/clang/tools/extra/clangd/CMakeFiles/obj.clangDaemon.dir/index/Background.cpp.o -c /Users/buildslave/jenkins/workspace/clang-stage2-coverage-R/llvm/tools/clang/tools/extra/clangd/index/Background.cpp Assertion failed: (CachedFieldIndex && "failed to find field in parent"), function getFieldIndex, file /Users/buildslave/jenkins/workspace/clang-stage1-configure-RA/llvm/tools/clang/lib/AST/Decl.cpp, line 3965. Stack dump: 0. Program arguments: /Users/buildslave/jenkins/workspace/clang-stage2-coverage-R/host-compiler/bin/clang-9 -cc1 -triple x86_64-apple-macosx10.14.0 -Wdeprecated-objc-isa-usage -Werror=deprecated-objc-isa-usage -emit-obj -disable-free -main-file-name Background.cpp -mrelocation-model pic -pic-level 2 -mthread-model posix -mdisable-fp-elim -masm-verbose -munwind-tables -target-sdk-version=10.14 -target-cpu penryn -dwarf-column-info -debugger-tuning=lldb -ggnu-pubnames -target-linker-version 409.12 -fprofile-instrument-path=/Users/buildslave/jenkins/workspace/clang-stage2-coverage-R/clang-build/profiles/%6m.profraw -fprofile-instrument=clang -fcoverage-mapping -coverage-notes-file /Users/buildslave/jenkins/workspace/clang-stage2-coverage-R/clang-build/tools/clang/tools/extra/clangd/CMakeFiles/obj.clangDaemon.dir/index/Background.cpp.gcno -resource-dir /Users/buildslave/jenkins/workspace/clang-stage2-coverage-R/host-compiler/lib/clang/9.0.0 -dependency-file tools/clang/tools/extra/clangd/CMakeFiles/obj.clangDaemon.dir/index/Background.cpp.o.d -sys-header-deps -MT tools/clang/tools/extra/clangd/CMakeFiles/obj.clangDaemon.dir/index/Background.cpp.o -isysroot /Applications/Xcode.app/Contents/Developer/Platforms/MacOSX.platform/Developer/SDKs/MacOSX10.14.sdk -D GTEST_HAS_RTTI=0 -D _GNU_SOURCE -D __STDC_CONSTANT_MACROS -D __STDC_FORMAT_MACROS -D __STDC_LIMIT_MACROS -I tools/clang/tools/extra/clangd -I /Users/buildslave/jenkins/workspace/clang-stage2-coverage-R/llvm/tools/clang/tools/extra/clangd -I /Users/buildslave/jenkins/workspace/clang-stage2-coverage-R/llvm/tools/clang/include -I tools/clang/include -I /Applications/Xcode.app/Contents/Developer/Platforms/MacOSX.platform/Developer/SDKs/MacOSX10.14.sdk/usr/include/libxml2 -I include -I /Users/buildslave/jenkins/workspace/clang-stage2-coverage-R/llvm/include -D NDEBUG -stdlib=libc++ -internal-isystem /Users/buildslave/jenkins/workspace/clang-stage2-coverage-R/host-compiler/bin/../include/c++/v1 -internal-isystem /Applications/Xcode.app/Contents/Developer/Platforms/MacOSX.platform/Developer/SDKs/MacOSX10.14.sdk/usr/include/c++/v1 -internal-isystem /Applications/Xcode.app/Contents/Developer/Platforms/MacOSX.platform/Developer/SDKs/MacOSX10.14.sdk/usr/local/include -internal-isystem /Users/buildslave/jenkins/workspace/clang-stage2-coverage-R/host-compiler/lib/clang/9.0.0/include -internal-externc-isystem /Applications/Xcode.app/Contents/Developer/Platforms/MacOSX.platform/Developer/SDKs/MacOSX10.14.sdk/usr/include -O3 -Werror=date-time -Werror=unguarded-availability-new -Wall -Wextra -Wno-unused-parameter -Wwrite-strings -Wcast-qual -Wmissing-field-initializers -Wno-long-long -Wimplicit-fallthrough -Wcovered-switch-default -Wno-noexcept-type -Wnon-virtual-dtor -Wdelete-non-virtual-dtor -Wstring-conversion -Woverloaded-virtual -Wno-nested-anon-types -pedantic -std=c++11 -fdeprecated-macro -fdebug-compilation-dir /Users/buildslave/jenkins/workspace/clang-stage2-coverage-R/clang-build -ferror-limit 19 -fmessage-length 0 -fvisibility-inlines-hidden -stack-protector 1 -fblocks -fencode-extended-block-signature -fno-rtti -fregister-global-dtors-with-atexit -fmodules -fimplicit-module-maps -fmodules-cache-path=/Users/buildslave/jenkins/workspace/clang-stage2-coverage-R/clang-build/module.cache -fmodules-validate-system-headers -fobjc-runtime=macosx-10.14.0 -fmax-type-align=16 -fno-common -fdiagnostics-show-option -fcolor-diagnostics -vectorize-loops -vectorize-slp -o tools/clang/tools/extra/clangd/CMakeFiles/obj.clangDaemon.dir/index/Background.cpp.o -x c++ /Users/buildslave/jenkins/workspace/clang-stage2-coverage-R/llvm/tools/clang/tools/extra/clangd/index/Background.cpp 1. <eof> parser at end of file 2. Per-file LLVM IR generation 3. /Users/buildslave/jenkins/workspace/clang-stage2-coverage-R/llvm/include/llvm/Support/Error.h:635:15: Generating code for declaration 'llvm::Expected<std::__1::basic_string<char> >::getErrorStorage' 0 clang-9 0x000000010eb91498 llvm::sys::PrintStackTrace(llvm::raw_ostream&) + 40 1 clang-9 0x000000010eb90645 llvm::sys::RunSignalHandlers() + 85 2 clang-9 0x000000010eb91aa8 SignalHandler(int) + 264 3 libsystem_platform.dylib 0x00007fff7de97b3d _sigtramp + 29 4 libsystem_platform.dylib 0x0000000000000040 _sigtramp + 18446603338403710240 5 libsystem_c.dylib 0x00007fff7dd561c9 abort + 127 6 libsystem_c.dylib 0x00007fff7dd1e868 basename_r + 0 7 clang-9 0x00000001109146e6 clang::FieldDecl::getFieldIndex() const + 694 8 clang-9 0x000000010ee83e55 clang::CodeGen::CodeGenFunction::EmitLValueForField(clang::CodeGen::LValue, clang::FieldDecl const*) + 1413 9 clang-9 0x000000010ee8eb7f clang::CodeGen::CodeGenFunction::EmitMemberExpr(clang::MemberExpr const*) + 1247 10 clang-9 0x000000010ee807ea clang::CodeGen::CodeGenFunction::EmitLValue(clang::Expr const*) + 1018 11 clang-9 0x000000010ee88cdd clang::CodeGen::CodeGenFunction::EmitCheckedLValue(clang::Expr const*, clang::CodeGen::CodeGenFunction::TypeCheckKind) + 173 12 clang-9 0x000000010ee8e7d6 clang::CodeGen::CodeGenFunction::EmitMemberExpr(clang::MemberExpr const*) + 310 13 clang-9 0x000000010ee807ea clang::CodeGen::CodeGenFunction::EmitLValue(clang::Expr const*) + 1018 14 clang-9 0x000000010ee8fd9c clang::CodeGen::CodeGenFunction::EmitCastLValue(clang::CastExpr const*) + 1372 15 clang-9 0x000000010ee8046f clang::CodeGen::CodeGenFunction::EmitLValue(clang::Expr const*) + 127 16 clang-9 0x000000010ee88cdd clang::CodeGen::CodeGenFunction::EmitCheckedLValue(clang::Expr const*, clang::CodeGen::CodeGenFunction::TypeCheckKind) + 173 17 clang-9 0x000000010ee8e7d6 clang::CodeGen::CodeGenFunction::EmitMemberExpr(clang::MemberExpr const*) + 310 18 clang-9 0x000000010ee807ea clang::CodeGen::CodeGenFunction::EmitLValue(clang::Expr const*) + 1018 19 clang-9 0x000000010ee885e7 clang::CodeGen::CodeGenFunction::EmitArrayToPointerDecay(clang::Expr const*, clang::CodeGen::LValueBaseInfo*, clang::CodeGen::TBAAAccessInfo*) + 119 20 clang-9 0x000000010eed9348 (anonymous namespace)::ScalarExprEmitter::VisitCastExpr(clang::CastExpr*) + 3896 21 clang-9 0x000000010eed84b4 (anonymous namespace)::ScalarExprEmitter::VisitCastExpr(clang::CastExpr*) + 164 22 clang-9 0x000000010eec6538 clang::CodeGen::CodeGenFunction::EmitScalarExpr(clang::Expr const*, bool) + 104 23 clang-9 0x000000010efbaf16 clang::CodeGen::CodeGenFunction::EmitReturnStmt(clang::ReturnStmt const&) + 1430 24 clang-9 0x000000010efb8122 clang::CodeGen::CodeGenFunction::EmitStmt(clang::Stmt const*, llvm::ArrayRef<clang::Attr const*>) + 2482 25 clang-9 0x000000010efc04fa clang::CodeGen::CodeGenFunction::EmitCompoundStmtWithoutScope(clang::CompoundStmt const&, bool, clang::CodeGen::AggValueSlot) + 186 26 clang-9 0x000000010f0001f7 clang::CodeGen::CodeGenFunction::GenerateCode(clang::GlobalDecl, llvm::Function*, clang::CodeGen::CGFunctionInfo const&) + 791 27 clang-9 0x000000010f01af97 clang::CodeGen::CodeGenModule::EmitGlobalFunctionDefinition(clang::GlobalDecl, llvm::GlobalValue*) + 503 28 clang-9 0x000000010f014eb6 clang::CodeGen::CodeGenModule::EmitGlobalDefinition(clang::GlobalDecl, llvm::GlobalValue*) + 486 29 clang-9 0x000000010f00aea1 clang::CodeGen::CodeGenModule::EmitDeferred() + 289 30 clang-9 0x000000010f00aec9 clang::CodeGen::CodeGenModule::EmitDeferred() + 329 31 clang-9 0x000000010f00aec9 clang::CodeGen::CodeGenModule::EmitDeferred() + 329 32 clang-9 0x000000010f00a19a clang::CodeGen::CodeGenModule::Release() + 42 33 clang-9 0x000000010f091f74 (anonymous namespace)::CodeGeneratorImpl::HandleTranslationUnit(clang::ASTContext&) + 100 34 clang-9 0x000000010eff6c26 clang::BackendConsumer::HandleTranslationUnit(clang::ASTContext&) + 134 35 clang-9 0x000000010fef60e3 clang::ParseAST(clang::Sema&, bool, bool) + 611 36 clang-9 0x000000010f2767d4 clang::FrontendAction::Execute() + 84 37 clang-9 0x000000010f228178 clang::CompilerInstance::ExecuteAction(clang::FrontendAction&) + 1544 38 clang-9 0x000000010f2eeed0 clang::ExecuteCompilerInvocation(clang::CompilerInstance*) + 1808 39 clang-9 0x000000010cf86c44 cc1_main(llvm::ArrayRef<char const*>, char const*, void*) + 2356 40 clang-9 0x000000010cf842c3 main + 10851 41 libdyld.dylib 0x00007fff7dcae085 start + 1 42 libdyld.dylib 0x0000000000000080 start + 18446603338405715964 clang-9: error: unable to execute command: Abort trap: 6 clang-9: error: clang frontend command failed due to signal (use -v to see invocation) clang version 9.0.0 (trunk) Target: x86_64-apple-darwin18.0.0 Thread model: posix InstalledDir: /Users/buildslave/jenkins/workspace/clang-stage2-coverage-R/host-compiler/bin clang-9: note: diagnostic msg: PLEASE submit a bug report to https://bugs.llvm.org/ and include the crash backtrace, preprocessed source, and associated run script. clang-9: note: diagnostic msg: ********************

Hide Details

PLEASE ATTACH THE FOLLOWING FILES TO THE BUG REPORT: Preprocessed source(s) and associated run script(s) are located at: clang-9: note: diagnostic msg: /var/folders/09/r4vw4v8n5kb67jl66zvlbljw0000gn/T/Background-714432.cpp clang-9: note: diagnostic msg: /var/folders/09/r4vw4v8n5kb67jl66zvlbljw0000gn/T/Background-714432.cache clang-9: note: diagnostic msg: /var/folders/09/r4vw4v8n5kb67jl66zvlbljw0000gn/T/Background-714432.sh clang-9: note: diagnostic msg: Crash backtrace is located in clang-9: note: diagnostic msg: /Users/buildslave/Library/Logs/DiagnosticReports/clang-9_<YYYY-MM-DD-HHMMSS>_<hostname>.crash clang-9: note: diagnostic msg: (choose the .crash file that corresponds to your crash) clang-9: note: diagnostic msg:

Hide Details

******************** ninja: build stopped: subcommand failed. Command failed Command: ['/usr/local/bin/ninja', '-v', 'all'] Build step 'Execute shell' marked build as failure [WARNINGS] Skipping publisher since build result is FAILURE [BFA] Scanning build for known causes... [BFA] Found failure cause(s): [BFA] Assertion failure from category Assert [BFA] Ninja target failed from category Compile [BFA] Compile Error from category Compile [BFA] Done. 1s Email was triggered for: Failure - Any Sending email for trigger: Failure - Any

Hide Details

Begin Pre-Send Script... Username Vedant not found in auth.groovy. This may indicate a problem with the svn-mailer.conf update process. Please check this job: http://green.lab.llvm.org/green/view/Infrastructure/job/Update%20SVN%20email%20list/ User Vedant will need to be notified of the build failure manually.

Hide Details

Username Kumar not found in auth.groovy. This may indicate a problem with the svn-mailer.conf update process. Please check this job: http://green.lab.llvm.org/green/view/Infrastructure/job/Update%20SVN%20email%20list/ User Kumar will need to be notified of the build failure manually.

Hide Details

Sending email to: vsk@apple.com JF Bastien <jfbastien@apple.com> Andi Bergen <abergen@apple.com> Azhar Mohammed <azhar@apple.com> Finished: FAILURE