FailedConsole Output

Skipping 8,536 KB.. Full Log
S_RTTI=0 -D_GNU_SOURCE -D__STDC_CONSTANT_MACROS -D__STDC_FORMAT_MACROS -D__STDC_LIMIT_MACROS -Itools/clang/tools/extra/clang-include-fixer/find-all-symbols -I/Users/buildslave/jenkins/workspace/clang-stage2-coverage-R/llvm/tools/clang/tools/extra/clang-include-fixer/find-all-symbols -I/Users/buildslave/jenkins/workspace/clang-stage2-coverage-R/llvm/tools/clang/include -Itools/clang/include -I/Applications/Xcode.app/Contents/Developer/Platforms/MacOSX.platform/Developer/SDKs/MacOSX10.14.sdk/usr/include/libxml2 -Iinclude -I/Users/buildslave/jenkins/workspace/clang-stage2-coverage-R/llvm/include -fPIC -fvisibility-inlines-hidden -Werror=date-time -Werror=unguarded-availability-new -std=c++11 -fmodules -fmodules-cache-path=/Users/buildslave/jenkins/workspace/clang-stage2-coverage-R/clang-build/module.cache -fcxx-modules -Wall -Wextra -Wno-unused-parameter -Wwrite-strings -Wcast-qual -Wmissing-field-initializers -pedantic -Wno-long-long -Wimplicit-fallthrough -Wcovered-switch-default -Wno-noexcept-type -Wnon-virtual-dtor -Wdelete-non-virtual-dtor -Wstring-conversion -fdiagnostics-color -fprofile-instr-generate='/Users/buildslave/jenkins/workspace/clang-stage2-coverage-R/clang-build/profiles/%6m.profraw' -fcoverage-mapping -fno-common -Woverloaded-virtual -Wno-nested-anon-types -O3 -DNDEBUG -isysroot /Applications/Xcode.app/Contents/Developer/Platforms/MacOSX.platform/Developer/SDKs/MacOSX10.14.sdk    -fno-exceptions -fno-rtti -MD -MT tools/clang/tools/extra/clang-include-fixer/find-all-symbols/CMakeFiles/obj.findAllSymbols.dir/PathConfig.cpp.o -MF tools/clang/tools/extra/clang-include-fixer/find-all-symbols/CMakeFiles/obj.findAllSymbols.dir/PathConfig.cpp.o.d -o tools/clang/tools/extra/clang-include-fixer/find-all-symbols/CMakeFiles/obj.findAllSymbols.dir/PathConfig.cpp.o -c /Users/buildslave/jenkins/workspace/clang-stage2-coverage-R/llvm/tools/clang/tools/extra/clang-include-fixer/find-all-symbols/PathConfig.cpp
[4001/4613] /Users/buildslave/jenkins/workspace/clang-stage2-coverage-R/host-compiler/bin/clang++  -DGTEST_HAS_RTTI=0 -D_GNU_SOURCE -D__STDC_CONSTANT_MACROS -D__STDC_FORMAT_MACROS -D__STDC_LIMIT_MACROS -Itools/clang/tools/extra/clang-include-fixer/find-all-symbols -I/Users/buildslave/jenkins/workspace/clang-stage2-coverage-R/llvm/tools/clang/tools/extra/clang-include-fixer/find-all-symbols -I/Users/buildslave/jenkins/workspace/clang-stage2-coverage-R/llvm/tools/clang/include -Itools/clang/include -I/Applications/Xcode.app/Contents/Developer/Platforms/MacOSX.platform/Developer/SDKs/MacOSX10.14.sdk/usr/include/libxml2 -Iinclude -I/Users/buildslave/jenkins/workspace/clang-stage2-coverage-R/llvm/include -fPIC -fvisibility-inlines-hidden -Werror=date-time -Werror=unguarded-availability-new -std=c++11 -fmodules -fmodules-cache-path=/Users/buildslave/jenkins/workspace/clang-stage2-coverage-R/clang-build/module.cache -fcxx-modules -Wall -Wextra -Wno-unused-parameter -Wwrite-strings -Wcast-qual -Wmissing-field-initializers -pedantic -Wno-long-long -Wimplicit-fallthrough -Wcovered-switch-default -Wno-noexcept-type -Wnon-virtual-dtor -Wdelete-non-virtual-dtor -Wstring-conversion -fdiagnostics-color -fprofile-instr-generate='/Users/buildslave/jenkins/workspace/clang-stage2-coverage-R/clang-build/profiles/%6m.profraw' -fcoverage-mapping -fno-common -Woverloaded-virtual -Wno-nested-anon-types -O3 -DNDEBUG -isysroot /Applications/Xcode.app/Contents/Developer/Platforms/MacOSX.platform/Developer/SDKs/MacOSX10.14.sdk    -fno-exceptions -fno-rtti -MD -MT tools/clang/tools/extra/clang-include-fixer/find-all-symbols/CMakeFiles/obj.findAllSymbols.dir/STLPostfixHeaderMap.cpp.o -MF tools/clang/tools/extra/clang-include-fixer/find-all-symbols/CMakeFiles/obj.findAllSymbols.dir/STLPostfixHeaderMap.cpp.o.d -o tools/clang/tools/extra/clang-include-fixer/find-all-symbols/CMakeFiles/obj.findAllSymbols.dir/STLPostfixHeaderMap.cpp.o -c /Users/buildslave/jenkins/workspace/clang-stage2-coverage-R/llvm/tools/clang/tools/extra/clang-include-fixer/find-all-symbols/STLPostfixHeaderMap.cpp
[4002/4613] /Users/buildslave/jenkins/workspace/clang-stage2-coverage-R/host-compiler/bin/clang++  -DGTEST_HAS_RTTI=0 -D_GNU_SOURCE -D__STDC_CONSTANT_MACROS -D__STDC_FORMAT_MACROS -D__STDC_LIMIT_MACROS -Itools/clang/tools/extra/clang-include-fixer/find-all-symbols -I/Users/buildslave/jenkins/workspace/clang-stage2-coverage-R/llvm/tools/clang/tools/extra/clang-include-fixer/find-all-symbols -I/Users/buildslave/jenkins/workspace/clang-stage2-coverage-R/llvm/tools/clang/include -Itools/clang/include -I/Applications/Xcode.app/Contents/Developer/Platforms/MacOSX.platform/Developer/SDKs/MacOSX10.14.sdk/usr/include/libxml2 -Iinclude -I/Users/buildslave/jenkins/workspace/clang-stage2-coverage-R/llvm/include -fPIC -fvisibility-inlines-hidden -Werror=date-time -Werror=unguarded-availability-new -std=c++11 -fmodules -fmodules-cache-path=/Users/buildslave/jenkins/workspace/clang-stage2-coverage-R/clang-build/module.cache -fcxx-modules -Wall -Wextra -Wno-unused-parameter -Wwrite-strings -Wcast-qual -Wmissing-field-initializers -pedantic -Wno-long-long -Wimplicit-fallthrough -Wcovered-switch-default -Wno-noexcept-type -Wnon-virtual-dtor -Wdelete-non-virtual-dtor -Wstring-conversion -fdiagnostics-color -fprofile-instr-generate='/Users/buildslave/jenkins/workspace/clang-stage2-coverage-R/clang-build/profiles/%6m.profraw' -fcoverage-mapping -fno-common -Woverloaded-virtual -Wno-nested-anon-types -O3 -DNDEBUG -isysroot /Applications/Xcode.app/Contents/Developer/Platforms/MacOSX.platform/Developer/SDKs/MacOSX10.14.sdk    -fno-exceptions -fno-rtti -MD -MT tools/clang/tools/extra/clang-include-fixer/find-all-symbols/CMakeFiles/obj.findAllSymbols.dir/FindAllSymbolsAction.cpp.o -MF tools/clang/tools/extra/clang-include-fixer/find-all-symbols/CMakeFiles/obj.findAllSymbols.dir/FindAllSymbolsAction.cpp.o.d -o tools/clang/tools/extra/clang-include-fixer/find-all-symbols/CMakeFiles/obj.findAllSymbols.dir/FindAllSymbolsAction.cpp.o -c /Users/buildslave/jenkins/workspace/clang-stage2-coverage-R/llvm/tools/clang/tools/extra/clang-include-fixer/find-all-symbols/FindAllSymbolsAction.cpp
[4003/4613] : && /Users/buildslave/jenkins/workspace/clang-stage2-coverage-R/host-compiler/bin/clang++  -fPIC -fvisibility-inlines-hidden -Werror=date-time -Werror=unguarded-availability-new -std=c++11 -fmodules -fmodules-cache-path=/Users/buildslave/jenkins/workspace/clang-stage2-coverage-R/clang-build/module.cache -fcxx-modules -Wall -Wextra -Wno-unused-parameter -Wwrite-strings -Wcast-qual -Wmissing-field-initializers -pedantic -Wno-long-long -Wimplicit-fallthrough -Wcovered-switch-default -Wno-noexcept-type -Wnon-virtual-dtor -Wdelete-non-virtual-dtor -Wstring-conversion -fdiagnostics-color -fprofile-instr-generate='/Users/buildslave/jenkins/workspace/clang-stage2-coverage-R/clang-build/profiles/%6m.profraw' -fcoverage-mapping -fno-common -Woverloaded-virtual -Wno-nested-anon-types -O3 -DNDEBUG -isysroot /Applications/Xcode.app/Contents/Developer/Platforms/MacOSX.platform/Developer/SDKs/MacOSX10.14.sdk -Wl,-search_paths_first -Wl,-headerpad_max_install_names -fprofile-instr-generate='/Users/buildslave/jenkins/workspace/clang-stage2-coverage-R/clang-build/profiles/%6m.profraw' -fcoverage-mapping    -Wl,-dead_strip tools/clang/tools/extra/clang-doc/tool/CMakeFiles/clang-doc.dir/ClangDocMain.cpp.o  -o bin/clang-doc  -Wl,-rpath,@loader_path/../lib lib/libLLVMSupport.a lib/libLLVMBitstreamReader.a lib/libclangAST.a lib/libclangASTMatchers.a lib/libclangBasic.a lib/libclangFrontend.a lib/libclangDoc.a lib/libclangTooling.a lib/libclangToolingCore.a lib/libclangIndex.a lib/libclangFrontend.a lib/libclangDriver.a lib/libclangParse.a lib/libLLVMMCParser.a lib/libLLVMOption.a lib/libLLVMProfileData.a lib/libclangSerialization.a lib/libclangSema.a lib/libclangEdit.a lib/libclangAnalysis.a lib/libclangASTMatchers.a lib/libLLVMBitReader.a lib/libLLVMBitstreamReader.a lib/libclangFormat.a lib/libclangToolingInclusions.a lib/libclangToolingCore.a lib/libclangAST.a lib/libclangRewrite.a lib/libclangLex.a lib/libclangBasic.a lib/libLLVMCore.a lib/libLLVMRemarks.a lib/libLLVMMC.a lib/libLLVMBinaryFormat.a lib/libLLVMDebugInfoCodeView.a lib/libLLVMDebugInfoMSF.a lib/libLLVMSupport.a -lz -lcurses -lm lib/libLLVMDemangle.a && :
[4004/4613] /Users/buildslave/jenkins/workspace/clang-stage2-coverage-R/host-compiler/bin/clang++  -DGTEST_HAS_RTTI=0 -D_GNU_SOURCE -D__STDC_CONSTANT_MACROS -D__STDC_FORMAT_MACROS -D__STDC_LIMIT_MACROS -Itools/clang/tools/extra/clang-include-fixer/plugin -I/Users/buildslave/jenkins/workspace/clang-stage2-coverage-R/llvm/tools/clang/tools/extra/clang-include-fixer/plugin -I/Users/buildslave/jenkins/workspace/clang-stage2-coverage-R/llvm/tools/clang/include -Itools/clang/include -I/Applications/Xcode.app/Contents/Developer/Platforms/MacOSX.platform/Developer/SDKs/MacOSX10.14.sdk/usr/include/libxml2 -Iinclude -I/Users/buildslave/jenkins/workspace/clang-stage2-coverage-R/llvm/include -fPIC -fvisibility-inlines-hidden -Werror=date-time -Werror=unguarded-availability-new -std=c++11 -fmodules -fmodules-cache-path=/Users/buildslave/jenkins/workspace/clang-stage2-coverage-R/clang-build/module.cache -fcxx-modules -Wall -Wextra -Wno-unused-parameter -Wwrite-strings -Wcast-qual -Wmissing-field-initializers -pedantic -Wno-long-long -Wimplicit-fallthrough -Wcovered-switch-default -Wno-noexcept-type -Wnon-virtual-dtor -Wdelete-non-virtual-dtor -Wstring-conversion -fdiagnostics-color -fprofile-instr-generate='/Users/buildslave/jenkins/workspace/clang-stage2-coverage-R/clang-build/profiles/%6m.profraw' -fcoverage-mapping -fno-common -Woverloaded-virtual -Wno-nested-anon-types -O3 -DNDEBUG -isysroot /Applications/Xcode.app/Contents/Developer/Platforms/MacOSX.platform/Developer/SDKs/MacOSX10.14.sdk    -fno-exceptions -fno-rtti -MD -MT tools/clang/tools/extra/clang-include-fixer/plugin/CMakeFiles/obj.clangIncludeFixerPlugin.dir/IncludeFixerPlugin.cpp.o -MF tools/clang/tools/extra/clang-include-fixer/plugin/CMakeFiles/obj.clangIncludeFixerPlugin.dir/IncludeFixerPlugin.cpp.o.d -o tools/clang/tools/extra/clang-include-fixer/plugin/CMakeFiles/obj.clangIncludeFixerPlugin.dir/IncludeFixerPlugin.cpp.o -c /Users/buildslave/jenkins/workspace/clang-stage2-coverage-R/llvm/tools/clang/tools/extra/clang-include-fixer/plugin/IncludeFixerPlugin.cpp
[4005/4613] : && "/Applications/Xcode.app/Contents/Developer/Toolchains/XcodeDefault.xctoolchain/usr/bin/libtool" -static -no_warning_for_no_symbols -o lib/libclangIncludeFixerPlugin.a  tools/clang/tools/extra/clang-include-fixer/plugin/CMakeFiles/obj.clangIncludeFixerPlugin.dir/IncludeFixerPlugin.cpp.o && :
[4006/4613] /Users/buildslave/jenkins/workspace/clang-stage2-coverage-R/host-compiler/bin/clang++  -DGTEST_HAS_RTTI=0 -D_GNU_SOURCE -D__STDC_CONSTANT_MACROS -D__STDC_FORMAT_MACROS -D__STDC_LIMIT_MACROS -Itools/clang/tools/extra/clang-include-fixer/find-all-symbols -I/Users/buildslave/jenkins/workspace/clang-stage2-coverage-R/llvm/tools/clang/tools/extra/clang-include-fixer/find-all-symbols -I/Users/buildslave/jenkins/workspace/clang-stage2-coverage-R/llvm/tools/clang/include -Itools/clang/include -I/Applications/Xcode.app/Contents/Developer/Platforms/MacOSX.platform/Developer/SDKs/MacOSX10.14.sdk/usr/include/libxml2 -Iinclude -I/Users/buildslave/jenkins/workspace/clang-stage2-coverage-R/llvm/include -fPIC -fvisibility-inlines-hidden -Werror=date-time -Werror=unguarded-availability-new -std=c++11 -fmodules -fmodules-cache-path=/Users/buildslave/jenkins/workspace/clang-stage2-coverage-R/clang-build/module.cache -fcxx-modules -Wall -Wextra -Wno-unused-parameter -Wwrite-strings -Wcast-qual -Wmissing-field-initializers -pedantic -Wno-long-long -Wimplicit-fallthrough -Wcovered-switch-default -Wno-noexcept-type -Wnon-virtual-dtor -Wdelete-non-virtual-dtor -Wstring-conversion -fdiagnostics-color -fprofile-instr-generate='/Users/buildslave/jenkins/workspace/clang-stage2-coverage-R/clang-build/profiles/%6m.profraw' -fcoverage-mapping -fno-common -Woverloaded-virtual -Wno-nested-anon-types -O3 -DNDEBUG -isysroot /Applications/Xcode.app/Contents/Developer/Platforms/MacOSX.platform/Developer/SDKs/MacOSX10.14.sdk    -fno-exceptions -fno-rtti -MD -MT tools/clang/tools/extra/clang-include-fixer/find-all-symbols/CMakeFiles/obj.findAllSymbols.dir/SymbolInfo.cpp.o -MF tools/clang/tools/extra/clang-include-fixer/find-all-symbols/CMakeFiles/obj.findAllSymbols.dir/SymbolInfo.cpp.o.d -o tools/clang/tools/extra/clang-include-fixer/find-all-symbols/CMakeFiles/obj.findAllSymbols.dir/SymbolInfo.cpp.o -c /Users/buildslave/jenkins/workspace/clang-stage2-coverage-R/llvm/tools/clang/tools/extra/clang-include-fixer/find-all-symbols/SymbolInfo.cpp
[4007/4613] /Users/buildslave/jenkins/workspace/clang-stage2-coverage-R/host-compiler/bin/clang++  -DGTEST_HAS_RTTI=0 -D_GNU_SOURCE -D__STDC_CONSTANT_MACROS -D__STDC_FORMAT_MACROS -D__STDC_LIMIT_MACROS -Itools/clang/tools/extra/clang-include-fixer/tool -I/Users/buildslave/jenkins/workspace/clang-stage2-coverage-R/llvm/tools/clang/tools/extra/clang-include-fixer/tool -I/Users/buildslave/jenkins/workspace/clang-stage2-coverage-R/llvm/tools/clang/include -Itools/clang/include -I/Applications/Xcode.app/Contents/Developer/Platforms/MacOSX.platform/Developer/SDKs/MacOSX10.14.sdk/usr/include/libxml2 -Iinclude -I/Users/buildslave/jenkins/workspace/clang-stage2-coverage-R/llvm/include -I/Users/buildslave/jenkins/workspace/clang-stage2-coverage-R/llvm/tools/clang/tools/extra/clang-include-fixer/tool/.. -fPIC -fvisibility-inlines-hidden -Werror=date-time -Werror=unguarded-availability-new -std=c++11 -fmodules -fmodules-cache-path=/Users/buildslave/jenkins/workspace/clang-stage2-coverage-R/clang-build/module.cache -fcxx-modules -Wall -Wextra -Wno-unused-parameter -Wwrite-strings -Wcast-qual -Wmissing-field-initializers -pedantic -Wno-long-long -Wimplicit-fallthrough -Wcovered-switch-default -Wno-noexcept-type -Wnon-virtual-dtor -Wdelete-non-virtual-dtor -Wstring-conversion -fdiagnostics-color -fprofile-instr-generate='/Users/buildslave/jenkins/workspace/clang-stage2-coverage-R/clang-build/profiles/%6m.profraw' -fcoverage-mapping -fno-common -Woverloaded-virtual -Wno-nested-anon-types -O3 -DNDEBUG -isysroot /Applications/Xcode.app/Contents/Developer/Platforms/MacOSX.platform/Developer/SDKs/MacOSX10.14.sdk    -fno-exceptions -fno-rtti -MD -MT tools/clang/tools/extra/clang-include-fixer/tool/CMakeFiles/clang-include-fixer.dir/ClangIncludeFixer.cpp.o -MF tools/clang/tools/extra/clang-include-fixer/tool/CMakeFiles/clang-include-fixer.dir/ClangIncludeFixer.cpp.o.d -o tools/clang/tools/extra/clang-include-fixer/tool/CMakeFiles/clang-include-fixer.dir/ClangIncludeFixer.cpp.o -c /Users/buildslave/jenkins/workspace/clang-stage2-coverage-R/llvm/tools/clang/tools/extra/clang-include-fixer/tool/ClangIncludeFixer.cpp
[4008/4613] /Users/buildslave/jenkins/workspace/clang-stage2-coverage-R/host-compiler/bin/clang++  -DGTEST_HAS_RTTI=0 -D_GNU_SOURCE -D__STDC_CONSTANT_MACROS -D__STDC_FORMAT_MACROS -D__STDC_LIMIT_MACROS -Itools/clang/tools/extra/clang-include-fixer/find-all-symbols -I/Users/buildslave/jenkins/workspace/clang-stage2-coverage-R/llvm/tools/clang/tools/extra/clang-include-fixer/find-all-symbols -I/Users/buildslave/jenkins/workspace/clang-stage2-coverage-R/llvm/tools/clang/include -Itools/clang/include -I/Applications/Xcode.app/Contents/Developer/Platforms/MacOSX.platform/Developer/SDKs/MacOSX10.14.sdk/usr/include/libxml2 -Iinclude -I/Users/buildslave/jenkins/workspace/clang-stage2-coverage-R/llvm/include -fPIC -fvisibility-inlines-hidden -Werror=date-time -Werror=unguarded-availability-new -std=c++11 -fmodules -fmodules-cache-path=/Users/buildslave/jenkins/workspace/clang-stage2-coverage-R/clang-build/module.cache -fcxx-modules -Wall -Wextra -Wno-unused-parameter -Wwrite-strings -Wcast-qual -Wmissing-field-initializers -pedantic -Wno-long-long -Wimplicit-fallthrough -Wcovered-switch-default -Wno-noexcept-type -Wnon-virtual-dtor -Wdelete-non-virtual-dtor -Wstring-conversion -fdiagnostics-color -fprofile-instr-generate='/Users/buildslave/jenkins/workspace/clang-stage2-coverage-R/clang-build/profiles/%6m.profraw' -fcoverage-mapping -fno-common -Woverloaded-virtual -Wno-nested-anon-types -O3 -DNDEBUG -isysroot /Applications/Xcode.app/Contents/Developer/Platforms/MacOSX.platform/Developer/SDKs/MacOSX10.14.sdk    -fno-exceptions -fno-rtti -MD -MT tools/clang/tools/extra/clang-include-fixer/find-all-symbols/CMakeFiles/obj.findAllSymbols.dir/FindAllSymbols.cpp.o -MF tools/clang/tools/extra/clang-include-fixer/find-all-symbols/CMakeFiles/obj.findAllSymbols.dir/FindAllSymbols.cpp.o.d -o tools/clang/tools/extra/clang-include-fixer/find-all-symbols/CMakeFiles/obj.findAllSymbols.dir/FindAllSymbols.cpp.o -c /Users/buildslave/jenkins/workspace/clang-stage2-coverage-R/llvm/tools/clang/tools/extra/clang-include-fixer/find-all-symbols/FindAllSymbols.cpp
[4009/4613] /Users/buildslave/jenkins/workspace/clang-stage2-coverage-R/host-compiler/bin/clang++  -DGTEST_HAS_RTTI=0 -D_GNU_SOURCE -D__STDC_CONSTANT_MACROS -D__STDC_FORMAT_MACROS -D__STDC_LIMIT_MACROS -Itools/clang/tools/extra/clang-include-fixer/find-all-symbols -I/Users/buildslave/jenkins/workspace/clang-stage2-coverage-R/llvm/tools/clang/tools/extra/clang-include-fixer/find-all-symbols -I/Users/buildslave/jenkins/workspace/clang-stage2-coverage-R/llvm/tools/clang/include -Itools/clang/include -I/Applications/Xcode.app/Contents/Developer/Platforms/MacOSX.platform/Developer/SDKs/MacOSX10.14.sdk/usr/include/libxml2 -Iinclude -I/Users/buildslave/jenkins/workspace/clang-stage2-coverage-R/llvm/include -fPIC -fvisibility-inlines-hidden -Werror=date-time -Werror=unguarded-availability-new -std=c++11 -fmodules -fmodules-cache-path=/Users/buildslave/jenkins/workspace/clang-stage2-coverage-R/clang-build/module.cache -fcxx-modules -Wall -Wextra -Wno-unused-parameter -Wwrite-strings -Wcast-qual -Wmissing-field-initializers -pedantic -Wno-long-long -Wimplicit-fallthrough -Wcovered-switch-default -Wno-noexcept-type -Wnon-virtual-dtor -Wdelete-non-virtual-dtor -Wstring-conversion -fdiagnostics-color -fprofile-instr-generate='/Users/buildslave/jenkins/workspace/clang-stage2-coverage-R/clang-build/profiles/%6m.profraw' -fcoverage-mapping -fno-common -Woverloaded-virtual -Wno-nested-anon-types -O3 -DNDEBUG -isysroot /Applications/Xcode.app/Contents/Developer/Platforms/MacOSX.platform/Developer/SDKs/MacOSX10.14.sdk    -fno-exceptions -fno-rtti -MD -MT tools/clang/tools/extra/clang-include-fixer/find-all-symbols/CMakeFiles/obj.findAllSymbols.dir/PragmaCommentHandler.cpp.o -MF tools/clang/tools/extra/clang-include-fixer/find-all-symbols/CMakeFiles/obj.findAllSymbols.dir/PragmaCommentHandler.cpp.o.d -o tools/clang/tools/extra/clang-include-fixer/find-all-symbols/CMakeFiles/obj.findAllSymbols.dir/PragmaCommentHandler.cpp.o -c /Users/buildslave/jenkins/workspace/clang-stage2-coverage-R/llvm/tools/clang/tools/extra/clang-include-fixer/find-all-symbols/PragmaCommentHandler.cpp
[4010/4613] : && "/Applications/Xcode.app/Contents/Developer/Toolchains/XcodeDefault.xctoolchain/usr/bin/libtool" -static -no_warning_for_no_symbols -o lib/libfindAllSymbols.a  tools/clang/tools/extra/clang-include-fixer/find-all-symbols/CMakeFiles/obj.findAllSymbols.dir/FindAllSymbols.cpp.o tools/clang/tools/extra/clang-include-fixer/find-all-symbols/CMakeFiles/obj.findAllSymbols.dir/FindAllSymbolsAction.cpp.o tools/clang/tools/extra/clang-include-fixer/find-all-symbols/CMakeFiles/obj.findAllSymbols.dir/FindAllMacros.cpp.o tools/clang/tools/extra/clang-include-fixer/find-all-symbols/CMakeFiles/obj.findAllSymbols.dir/HeaderMapCollector.cpp.o tools/clang/tools/extra/clang-include-fixer/find-all-symbols/CMakeFiles/obj.findAllSymbols.dir/PathConfig.cpp.o tools/clang/tools/extra/clang-include-fixer/find-all-symbols/CMakeFiles/obj.findAllSymbols.dir/PragmaCommentHandler.cpp.o tools/clang/tools/extra/clang-include-fixer/find-all-symbols/CMakeFiles/obj.findAllSymbols.dir/STLPostfixHeaderMap.cpp.o tools/clang/tools/extra/clang-include-fixer/find-all-symbols/CMakeFiles/obj.findAllSymbols.dir/SymbolInfo.cpp.o && :
[4011/4613] /Users/buildslave/jenkins/workspace/clang-stage2-coverage-R/host-compiler/bin/clang++  -DCLANG_TOOL_EXTRA_BUILD -DGTEST_HAS_RTTI=0 -D_GNU_SOURCE -D__STDC_CONSTANT_MACROS -D__STDC_FORMAT_MACROS -D__STDC_LIMIT_MACROS -Itools/clang/tools/libclang -I/Users/buildslave/jenkins/workspace/clang-stage2-coverage-R/llvm/tools/clang/tools/libclang -I/Users/buildslave/jenkins/workspace/clang-stage2-coverage-R/llvm/tools/clang/include -Itools/clang/include -I/Applications/Xcode.app/Contents/Developer/Platforms/MacOSX.platform/Developer/SDKs/MacOSX10.14.sdk/usr/include/libxml2 -Iinclude -I/Users/buildslave/jenkins/workspace/clang-stage2-coverage-R/llvm/include -fPIC -fvisibility-inlines-hidden -Werror=date-time -Werror=unguarded-availability-new -std=c++11 -fmodules -fmodules-cache-path=/Users/buildslave/jenkins/workspace/clang-stage2-coverage-R/clang-build/module.cache -fcxx-modules -Wall -Wextra -Wno-unused-parameter -Wwrite-strings -Wcast-qual -Wmissing-field-initializers -pedantic -Wno-long-long -Wimplicit-fallthrough -Wcovered-switch-default -Wno-noexcept-type -Wnon-virtual-dtor -Wdelete-non-virtual-dtor -Wstring-conversion -fdiagnostics-color -fprofile-instr-generate='/Users/buildslave/jenkins/workspace/clang-stage2-coverage-R/clang-build/profiles/%6m.profraw' -fcoverage-mapping -fno-common -Woverloaded-virtual -Wno-nested-anon-types -O3 -DNDEBUG -isysroot /Applications/Xcode.app/Contents/Developer/Platforms/MacOSX.platform/Developer/SDKs/MacOSX10.14.sdk -fPIC    -fmodules-ignore-macro=CLANG_TOOL_EXTRA_BUILD -fno-exceptions -fno-rtti -MD -MT tools/clang/tools/libclang/CMakeFiles/libclang.dir/CXSourceLocation.cpp.o -MF tools/clang/tools/libclang/CMakeFiles/libclang.dir/CXSourceLocation.cpp.o.d -o tools/clang/tools/libclang/CMakeFiles/libclang.dir/CXSourceLocation.cpp.o -c /Users/buildslave/jenkins/workspace/clang-stage2-coverage-R/llvm/tools/clang/tools/libclang/CXSourceLocation.cpp
[4012/4613] /Users/buildslave/jenkins/workspace/clang-stage2-coverage-R/host-compiler/bin/clang++  -DCLANG_TOOL_EXTRA_BUILD -DGTEST_HAS_RTTI=0 -D_GNU_SOURCE -D__STDC_CONSTANT_MACROS -D__STDC_FORMAT_MACROS -D__STDC_LIMIT_MACROS -Itools/clang/tools/libclang -I/Users/buildslave/jenkins/workspace/clang-stage2-coverage-R/llvm/tools/clang/tools/libclang -I/Users/buildslave/jenkins/workspace/clang-stage2-coverage-R/llvm/tools/clang/include -Itools/clang/include -I/Applications/Xcode.app/Contents/Developer/Platforms/MacOSX.platform/Developer/SDKs/MacOSX10.14.sdk/usr/include/libxml2 -Iinclude -I/Users/buildslave/jenkins/workspace/clang-stage2-coverage-R/llvm/include -fPIC -fvisibility-inlines-hidden -Werror=date-time -Werror=unguarded-availability-new -std=c++11 -fmodules -fmodules-cache-path=/Users/buildslave/jenkins/workspace/clang-stage2-coverage-R/clang-build/module.cache -fcxx-modules -Wall -Wextra -Wno-unused-parameter -Wwrite-strings -Wcast-qual -Wmissing-field-initializers -pedantic -Wno-long-long -Wimplicit-fallthrough -Wcovered-switch-default -Wno-noexcept-type -Wnon-virtual-dtor -Wdelete-non-virtual-dtor -Wstring-conversion -fdiagnostics-color -fprofile-instr-generate='/Users/buildslave/jenkins/workspace/clang-stage2-coverage-R/clang-build/profiles/%6m.profraw' -fcoverage-mapping -fno-common -Woverloaded-virtual -Wno-nested-anon-types -O3 -DNDEBUG -isysroot /Applications/Xcode.app/Contents/Developer/Platforms/MacOSX.platform/Developer/SDKs/MacOSX10.14.sdk -fPIC    -fmodules-ignore-macro=CLANG_TOOL_EXTRA_BUILD -fno-exceptions -fno-rtti -MD -MT tools/clang/tools/libclang/CMakeFiles/libclang.dir/CXLoadedDiagnostic.cpp.o -MF tools/clang/tools/libclang/CMakeFiles/libclang.dir/CXLoadedDiagnostic.cpp.o.d -o tools/clang/tools/libclang/CMakeFiles/libclang.dir/CXLoadedDiagnostic.cpp.o -c /Users/buildslave/jenkins/workspace/clang-stage2-coverage-R/llvm/tools/clang/tools/libclang/CXLoadedDiagnostic.cpp
[4013/4613] /Users/buildslave/jenkins/workspace/clang-stage2-coverage-R/host-compiler/bin/clang++  -DGTEST_HAS_RTTI=0 -D_GNU_SOURCE -D__STDC_CONSTANT_MACROS -D__STDC_FORMAT_MACROS -D__STDC_LIMIT_MACROS -Itools/clang/tools/extra/clang-include-fixer/find-all-symbols/tool -I/Users/buildslave/jenkins/workspace/clang-stage2-coverage-R/llvm/tools/clang/tools/extra/clang-include-fixer/find-all-symbols/tool -I/Users/buildslave/jenkins/workspace/clang-stage2-coverage-R/llvm/tools/clang/include -Itools/clang/include -I/Applications/Xcode.app/Contents/Developer/Platforms/MacOSX.platform/Developer/SDKs/MacOSX10.14.sdk/usr/include/libxml2 -Iinclude -I/Users/buildslave/jenkins/workspace/clang-stage2-coverage-R/llvm/include -I/Users/buildslave/jenkins/workspace/clang-stage2-coverage-R/llvm/tools/clang/tools/extra/clang-include-fixer/find-all-symbols/tool/.. -fPIC -fvisibility-inlines-hidden -Werror=date-time -Werror=unguarded-availability-new -std=c++11 -fmodules -fmodules-cache-path=/Users/buildslave/jenkins/workspace/clang-stage2-coverage-R/clang-build/module.cache -fcxx-modules -Wall -Wextra -Wno-unused-parameter -Wwrite-strings -Wcast-qual -Wmissing-field-initializers -pedantic -Wno-long-long -Wimplicit-fallthrough -Wcovered-switch-default -Wno-noexcept-type -Wnon-virtual-dtor -Wdelete-non-virtual-dtor -Wstring-conversion -fdiagnostics-color -fprofile-instr-generate='/Users/buildslave/jenkins/workspace/clang-stage2-coverage-R/clang-build/profiles/%6m.profraw' -fcoverage-mapping -fno-common -Woverloaded-virtual -Wno-nested-anon-types -O3 -DNDEBUG -isysroot /Applications/Xcode.app/Contents/Developer/Platforms/MacOSX.platform/Developer/SDKs/MacOSX10.14.sdk    -fno-exceptions -fno-rtti -MD -MT tools/clang/tools/extra/clang-include-fixer/find-all-symbols/tool/CMakeFiles/find-all-symbols.dir/FindAllSymbolsMain.cpp.o -MF tools/clang/tools/extra/clang-include-fixer/find-all-symbols/tool/CMakeFiles/find-all-symbols.dir/FindAllSymbolsMain.cpp.o.d -o tools/clang/tools/extra/clang-include-fixer/find-all-symbols/tool/CMakeFiles/find-all-symbols.dir/FindAllSymbolsMain.cpp.o -c /Users/buildslave/jenkins/workspace/clang-stage2-coverage-R/llvm/tools/clang/tools/extra/clang-include-fixer/find-all-symbols/tool/FindAllSymbolsMain.cpp
[4014/4613] /Users/buildslave/jenkins/workspace/clang-stage2-coverage-R/host-compiler/bin/clang++  -DGTEST_HAS_RTTI=0 -D_GNU_SOURCE -D__STDC_CONSTANT_MACROS -D__STDC_FORMAT_MACROS -D__STDC_LIMIT_MACROS -Itools/clang/tools/extra/clang-move -I/Users/buildslave/jenkins/workspace/clang-stage2-coverage-R/llvm/tools/clang/tools/extra/clang-move -I/Users/buildslave/jenkins/workspace/clang-stage2-coverage-R/llvm/tools/clang/include -Itools/clang/include -I/Applications/Xcode.app/Contents/Developer/Platforms/MacOSX.platform/Developer/SDKs/MacOSX10.14.sdk/usr/include/libxml2 -Iinclude -I/Users/buildslave/jenkins/workspace/clang-stage2-coverage-R/llvm/include -fPIC -fvisibility-inlines-hidden -Werror=date-time -Werror=unguarded-availability-new -std=c++11 -fmodules -fmodules-cache-path=/Users/buildslave/jenkins/workspace/clang-stage2-coverage-R/clang-build/module.cache -fcxx-modules -Wall -Wextra -Wno-unused-parameter -Wwrite-strings -Wcast-qual -Wmissing-field-initializers -pedantic -Wno-long-long -Wimplicit-fallthrough -Wcovered-switch-default -Wno-noexcept-type -Wnon-virtual-dtor -Wdelete-non-virtual-dtor -Wstring-conversion -fdiagnostics-color -fprofile-instr-generate='/Users/buildslave/jenkins/workspace/clang-stage2-coverage-R/clang-build/profiles/%6m.profraw' -fcoverage-mapping -fno-common -Woverloaded-virtual -Wno-nested-anon-types -O3 -DNDEBUG -isysroot /Applications/Xcode.app/Contents/Developer/Platforms/MacOSX.platform/Developer/SDKs/MacOSX10.14.sdk    -fno-exceptions -fno-rtti -MD -MT tools/clang/tools/extra/clang-move/CMakeFiles/obj.clangMove.dir/HelperDeclRefGraph.cpp.o -MF tools/clang/tools/extra/clang-move/CMakeFiles/obj.clangMove.dir/HelperDeclRefGraph.cpp.o.d -o tools/clang/tools/extra/clang-move/CMakeFiles/obj.clangMove.dir/HelperDeclRefGraph.cpp.o -c /Users/buildslave/jenkins/workspace/clang-stage2-coverage-R/llvm/tools/clang/tools/extra/clang-move/HelperDeclRefGraph.cpp
[4015/4613] /Users/buildslave/jenkins/workspace/clang-stage2-coverage-R/host-compiler/bin/clang++  -DCLANG_TOOL_EXTRA_BUILD -DGTEST_HAS_RTTI=0 -D_GNU_SOURCE -D__STDC_CONSTANT_MACROS -D__STDC_FORMAT_MACROS -D__STDC_LIMIT_MACROS -Itools/clang/tools/libclang -I/Users/buildslave/jenkins/workspace/clang-stage2-coverage-R/llvm/tools/clang/tools/libclang -I/Users/buildslave/jenkins/workspace/clang-stage2-coverage-R/llvm/tools/clang/include -Itools/clang/include -I/Applications/Xcode.app/Contents/Developer/Platforms/MacOSX.platform/Developer/SDKs/MacOSX10.14.sdk/usr/include/libxml2 -Iinclude -I/Users/buildslave/jenkins/workspace/clang-stage2-coverage-R/llvm/include -fPIC -fvisibility-inlines-hidden -Werror=date-time -Werror=unguarded-availability-new -std=c++11 -fmodules -fmodules-cache-path=/Users/buildslave/jenkins/workspace/clang-stage2-coverage-R/clang-build/module.cache -fcxx-modules -Wall -Wextra -Wno-unused-parameter -Wwrite-strings -Wcast-qual -Wmissing-field-initializers -pedantic -Wno-long-long -Wimplicit-fallthrough -Wcovered-switch-default -Wno-noexcept-type -Wnon-virtual-dtor -Wdelete-non-virtual-dtor -Wstring-conversion -fdiagnostics-color -fprofile-instr-generate='/Users/buildslave/jenkins/workspace/clang-stage2-coverage-R/clang-build/profiles/%6m.profraw' -fcoverage-mapping -fno-common -Woverloaded-virtual -Wno-nested-anon-types -O3 -DNDEBUG -isysroot /Applications/Xcode.app/Contents/Developer/Platforms/MacOSX.platform/Developer/SDKs/MacOSX10.14.sdk -fPIC    -fmodules-ignore-macro=CLANG_TOOL_EXTRA_BUILD -fno-exceptions -fno-rtti -MD -MT tools/clang/tools/libclang/CMakeFiles/libclang.dir/CXStoredDiagnostic.cpp.o -MF tools/clang/tools/libclang/CMakeFiles/libclang.dir/CXStoredDiagnostic.cpp.o.d -o tools/clang/tools/libclang/CMakeFiles/libclang.dir/CXStoredDiagnostic.cpp.o -c /Users/buildslave/jenkins/workspace/clang-stage2-coverage-R/llvm/tools/clang/tools/libclang/CXStoredDiagnostic.cpp
[4016/4613] /Users/buildslave/jenkins/workspace/clang-stage2-coverage-R/host-compiler/bin/clang++  -DCLANG_TOOL_EXTRA_BUILD -DGTEST_HAS_RTTI=0 -D_GNU_SOURCE -D__STDC_CONSTANT_MACROS -D__STDC_FORMAT_MACROS -D__STDC_LIMIT_MACROS -Itools/clang/tools/libclang -I/Users/buildslave/jenkins/workspace/clang-stage2-coverage-R/llvm/tools/clang/tools/libclang -I/Users/buildslave/jenkins/workspace/clang-stage2-coverage-R/llvm/tools/clang/include -Itools/clang/include -I/Applications/Xcode.app/Contents/Developer/Platforms/MacOSX.platform/Developer/SDKs/MacOSX10.14.sdk/usr/include/libxml2 -Iinclude -I/Users/buildslave/jenkins/workspace/clang-stage2-coverage-R/llvm/include -fPIC -fvisibility-inlines-hidden -Werror=date-time -Werror=unguarded-availability-new -std=c++11 -fmodules -fmodules-cache-path=/Users/buildslave/jenkins/workspace/clang-stage2-coverage-R/clang-build/module.cache -fcxx-modules -Wall -Wextra -Wno-unused-parameter -Wwrite-strings -Wcast-qual -Wmissing-field-initializers -pedantic -Wno-long-long -Wimplicit-fallthrough -Wcovered-switch-default -Wno-noexcept-type -Wnon-virtual-dtor -Wdelete-non-virtual-dtor -Wstring-conversion -fdiagnostics-color -fprofile-instr-generate='/Users/buildslave/jenkins/workspace/clang-stage2-coverage-R/clang-build/profiles/%6m.profraw' -fcoverage-mapping -fno-common -Woverloaded-virtual -Wno-nested-anon-types -O3 -DNDEBUG -isysroot /Applications/Xcode.app/Contents/Developer/Platforms/MacOSX.platform/Developer/SDKs/MacOSX10.14.sdk -fPIC    -fmodules-ignore-macro=CLANG_TOOL_EXTRA_BUILD -fno-exceptions -fno-rtti -MD -MT tools/clang/tools/libclang/CMakeFiles/libclang.dir/CXString.cpp.o -MF tools/clang/tools/libclang/CMakeFiles/libclang.dir/CXString.cpp.o.d -o tools/clang/tools/libclang/CMakeFiles/libclang.dir/CXString.cpp.o -c /Users/buildslave/jenkins/workspace/clang-stage2-coverage-R/llvm/tools/clang/tools/libclang/CXString.cpp
[4017/4613] /Users/buildslave/jenkins/workspace/clang-stage2-coverage-R/host-compiler/bin/clang++  -DGTEST_HAS_RTTI=0 -D_GNU_SOURCE -D__STDC_CONSTANT_MACROS -D__STDC_FORMAT_MACROS -D__STDC_LIMIT_MACROS -Itools/clang/tools/extra/clangd -I/Users/buildslave/jenkins/workspace/clang-stage2-coverage-R/llvm/tools/clang/tools/extra/clangd -I/Users/buildslave/jenkins/workspace/clang-stage2-coverage-R/llvm/tools/clang/include -Itools/clang/include -I/Applications/Xcode.app/Contents/Developer/Platforms/MacOSX.platform/Developer/SDKs/MacOSX10.14.sdk/usr/include/libxml2 -Iinclude -I/Users/buildslave/jenkins/workspace/clang-stage2-coverage-R/llvm/include -fPIC -fvisibility-inlines-hidden -Werror=date-time -Werror=unguarded-availability-new -std=c++11 -fmodules -fmodules-cache-path=/Users/buildslave/jenkins/workspace/clang-stage2-coverage-R/clang-build/module.cache -fcxx-modules -Wall -Wextra -Wno-unused-parameter -Wwrite-strings -Wcast-qual -Wmissing-field-initializers -pedantic -Wno-long-long -Wimplicit-fallthrough -Wcovered-switch-default -Wno-noexcept-type -Wnon-virtual-dtor -Wdelete-non-virtual-dtor -Wstring-conversion -fdiagnostics-color -fprofile-instr-generate='/Users/buildslave/jenkins/workspace/clang-stage2-coverage-R/clang-build/profiles/%6m.profraw' -fcoverage-mapping -fno-common -Woverloaded-virtual -Wno-nested-anon-types -O3 -DNDEBUG -isysroot /Applications/Xcode.app/Contents/Developer/Platforms/MacOSX.platform/Developer/SDKs/MacOSX10.14.sdk    -fno-exceptions -fno-rtti -MD -MT tools/clang/tools/extra/clangd/CMakeFiles/obj.clangDaemon.dir/Cancellation.cpp.o -MF tools/clang/tools/extra/clangd/CMakeFiles/obj.clangDaemon.dir/Cancellation.cpp.o.d -o tools/clang/tools/extra/clangd/CMakeFiles/obj.clangDaemon.dir/Cancellation.cpp.o -c /Users/buildslave/jenkins/workspace/clang-stage2-coverage-R/llvm/tools/clang/tools/extra/clangd/Cancellation.cpp
[4018/4613] : && /Users/buildslave/jenkins/workspace/clang-stage2-coverage-R/host-compiler/bin/clang++  -fPIC -fvisibility-inlines-hidden -Werror=date-time -Werror=unguarded-availability-new -std=c++11 -fmodules -fmodules-cache-path=/Users/buildslave/jenkins/workspace/clang-stage2-coverage-R/clang-build/module.cache -fcxx-modules -Wall -Wextra -Wno-unused-parameter -Wwrite-strings -Wcast-qual -Wmissing-field-initializers -pedantic -Wno-long-long -Wimplicit-fallthrough -Wcovered-switch-default -Wno-noexcept-type -Wnon-virtual-dtor -Wdelete-non-virtual-dtor -Wstring-conversion -fdiagnostics-color -fprofile-instr-generate='/Users/buildslave/jenkins/workspace/clang-stage2-coverage-R/clang-build/profiles/%6m.profraw' -fcoverage-mapping -fno-common -Woverloaded-virtual -Wno-nested-anon-types -O3 -DNDEBUG -isysroot /Applications/Xcode.app/Contents/Developer/Platforms/MacOSX.platform/Developer/SDKs/MacOSX10.14.sdk -Wl,-search_paths_first -Wl,-headerpad_max_install_names -fprofile-instr-generate='/Users/buildslave/jenkins/workspace/clang-stage2-coverage-R/clang-build/profiles/%6m.profraw' -fcoverage-mapping    -Wl,-dead_strip tools/clang/tools/extra/clang-include-fixer/tool/CMakeFiles/clang-include-fixer.dir/ClangIncludeFixer.cpp.o  -o bin/clang-include-fixer  -Wl,-rpath,@loader_path/../lib lib/libLLVMSupport.a lib/libclangBasic.a lib/libclangFormat.a lib/libclangFrontend.a lib/libclangIncludeFixer.a lib/libclangRewrite.a lib/libclangSerialization.a lib/libclangTooling.a lib/libclangToolingCore.a lib/libfindAllSymbols.a lib/libclangTooling.a lib/libclangFormat.a lib/libclangToolingInclusions.a lib/libclangFrontend.a lib/libLLVMProfileData.a lib/libclangSerialization.a lib/libLLVMBitReader.a lib/libLLVMBitstreamReader.a lib/libclangToolingCore.a lib/libclangRewrite.a lib/libclangDriver.a lib/libLLVMOption.a lib/libclangParse.a lib/libLLVMMCParser.a lib/libclangSema.a lib/libclangEdit.a lib/libclangAnalysis.a lib/libclangASTMatchers.a lib/libclangAST.a lib/libclangLex.a lib/libclangBasic.a lib/libLLVMCore.a lib/libLLVMRemarks.a lib/libLLVMMC.a lib/libLLVMDebugInfoCodeView.a lib/libLLVMDebugInfoMSF.a lib/libLLVMBinaryFormat.a lib/libLLVMSupport.a -lz -lcurses -lm lib/libLLVMDemangle.a && :
[4019/4613] /Users/buildslave/jenkins/workspace/clang-stage2-coverage-R/host-compiler/bin/clang++  -DGTEST_HAS_RTTI=0 -D_GNU_SOURCE -D__STDC_CONSTANT_MACROS -D__STDC_FORMAT_MACROS -D__STDC_LIMIT_MACROS -Itools/clang/tools/extra/clangd -I/Users/buildslave/jenkins/workspace/clang-stage2-coverage-R/llvm/tools/clang/tools/extra/clangd -I/Users/buildslave/jenkins/workspace/clang-stage2-coverage-R/llvm/tools/clang/include -Itools/clang/include -I/Applications/Xcode.app/Contents/Developer/Platforms/MacOSX.platform/Developer/SDKs/MacOSX10.14.sdk/usr/include/libxml2 -Iinclude -I/Users/buildslave/jenkins/workspace/clang-stage2-coverage-R/llvm/include -fPIC -fvisibility-inlines-hidden -Werror=date-time -Werror=unguarded-availability-new -std=c++11 -fmodules -fmodules-cache-path=/Users/buildslave/jenkins/workspace/clang-stage2-coverage-R/clang-build/module.cache -fcxx-modules -Wall -Wextra -Wno-unused-parameter -Wwrite-strings -Wcast-qual -Wmissing-field-initializers -pedantic -Wno-long-long -Wimplicit-fallthrough -Wcovered-switch-default -Wno-noexcept-type -Wnon-virtual-dtor -Wdelete-non-virtual-dtor -Wstring-conversion -fdiagnostics-color -fprofile-instr-generate='/Users/buildslave/jenkins/workspace/clang-stage2-coverage-R/clang-build/profiles/%6m.profraw' -fcoverage-mapping -fno-common -Woverloaded-virtual -Wno-nested-anon-types -O3 -DNDEBUG -isysroot /Applications/Xcode.app/Contents/Developer/Platforms/MacOSX.platform/Developer/SDKs/MacOSX10.14.sdk    -fno-exceptions -fno-rtti -MD -MT tools/clang/tools/extra/clangd/CMakeFiles/obj.clangDaemon.dir/AST.cpp.o -MF tools/clang/tools/extra/clangd/CMakeFiles/obj.clangDaemon.dir/AST.cpp.o.d -o tools/clang/tools/extra/clangd/CMakeFiles/obj.clangDaemon.dir/AST.cpp.o -c /Users/buildslave/jenkins/workspace/clang-stage2-coverage-R/llvm/tools/clang/tools/extra/clangd/AST.cpp
[4020/4613] /Users/buildslave/jenkins/workspace/clang-stage2-coverage-R/host-compiler/bin/clang++  -DCLANG_TOOL_EXTRA_BUILD -DGTEST_HAS_RTTI=0 -D_GNU_SOURCE -D__STDC_CONSTANT_MACROS -D__STDC_FORMAT_MACROS -D__STDC_LIMIT_MACROS -Itools/clang/tools/libclang -I/Users/buildslave/jenkins/workspace/clang-stage2-coverage-R/llvm/tools/clang/tools/libclang -I/Users/buildslave/jenkins/workspace/clang-stage2-coverage-R/llvm/tools/clang/include -Itools/clang/include -I/Applications/Xcode.app/Contents/Developer/Platforms/MacOSX.platform/Developer/SDKs/MacOSX10.14.sdk/usr/include/libxml2 -Iinclude -I/Users/buildslave/jenkins/workspace/clang-stage2-coverage-R/llvm/include -fPIC -fvisibility-inlines-hidden -Werror=date-time -Werror=unguarded-availability-new -std=c++11 -fmodules -fmodules-cache-path=/Users/buildslave/jenkins/workspace/clang-stage2-coverage-R/clang-build/module.cache -fcxx-modules -Wall -Wextra -Wno-unused-parameter -Wwrite-strings -Wcast-qual -Wmissing-field-initializers -pedantic -Wno-long-long -Wimplicit-fallthrough -Wcovered-switch-default -Wno-noexcept-type -Wnon-virtual-dtor -Wdelete-non-virtual-dtor -Wstring-conversion -fdiagnostics-color -fprofile-instr-generate='/Users/buildslave/jenkins/workspace/clang-stage2-coverage-R/clang-build/profiles/%6m.profraw' -fcoverage-mapping -fno-common -Woverloaded-virtual -Wno-nested-anon-types -O3 -DNDEBUG -isysroot /Applications/Xcode.app/Contents/Developer/Platforms/MacOSX.platform/Developer/SDKs/MacOSX10.14.sdk -fPIC    -fmodules-ignore-macro=CLANG_TOOL_EXTRA_BUILD -fno-exceptions -fno-rtti -MD -MT tools/clang/tools/libclang/CMakeFiles/libclang.dir/CXType.cpp.o -MF tools/clang/tools/libclang/CMakeFiles/libclang.dir/CXType.cpp.o.d -o tools/clang/tools/libclang/CMakeFiles/libclang.dir/CXType.cpp.o -c /Users/buildslave/jenkins/workspace/clang-stage2-coverage-R/llvm/tools/clang/tools/libclang/CXType.cpp
[4021/4613] : && /Users/buildslave/jenkins/workspace/clang-stage2-coverage-R/host-compiler/bin/clang++  -fPIC -fvisibility-inlines-hidden -Werror=date-time -Werror=unguarded-availability-new -std=c++11 -fmodules -fmodules-cache-path=/Users/buildslave/jenkins/workspace/clang-stage2-coverage-R/clang-build/module.cache -fcxx-modules -Wall -Wextra -Wno-unused-parameter -Wwrite-strings -Wcast-qual -Wmissing-field-initializers -pedantic -Wno-long-long -Wimplicit-fallthrough -Wcovered-switch-default -Wno-noexcept-type -Wnon-virtual-dtor -Wdelete-non-virtual-dtor -Wstring-conversion -fdiagnostics-color -fprofile-instr-generate='/Users/buildslave/jenkins/workspace/clang-stage2-coverage-R/clang-build/profiles/%6m.profraw' -fcoverage-mapping -fno-common -Woverloaded-virtual -Wno-nested-anon-types -O3 -DNDEBUG -isysroot /Applications/Xcode.app/Contents/Developer/Platforms/MacOSX.platform/Developer/SDKs/MacOSX10.14.sdk -Wl,-search_paths_first -Wl,-headerpad_max_install_names -fprofile-instr-generate='/Users/buildslave/jenkins/workspace/clang-stage2-coverage-R/clang-build/profiles/%6m.profraw' -fcoverage-mapping    -Wl,-dead_strip tools/clang/tools/extra/clang-include-fixer/find-all-symbols/tool/CMakeFiles/find-all-symbols.dir/FindAllSymbolsMain.cpp.o  -o bin/find-all-symbols  -Wl,-rpath,@loader_path/../lib lib/libLLVMSupport.a lib/libclangAST.a lib/libclangASTMatchers.a lib/libclangBasic.a lib/libclangFrontend.a lib/libclangLex.a lib/libclangSerialization.a lib/libclangTooling.a lib/libfindAllSymbols.a lib/libclangTooling.a lib/libclangFrontend.a lib/libclangParse.a lib/libLLVMMCParser.a lib/libLLVMProfileData.a lib/libclangSerialization.a lib/libclangSema.a lib/libclangEdit.a lib/libclangAnalysis.a lib/libclangASTMatchers.a lib/libLLVMBitReader.a lib/libLLVMBitstreamReader.a lib/libclangDriver.a lib/libLLVMOption.a lib/libclangFormat.a lib/libclangToolingInclusions.a lib/libclangToolingCore.a lib/libclangAST.a lib/libclangRewrite.a lib/libclangLex.a lib/libclangBasic.a lib/libLLVMCore.a lib/libLLVMRemarks.a lib/libLLVMMC.a lib/libLLVMBinaryFormat.a lib/libLLVMDebugInfoCodeView.a lib/libLLVMDebugInfoMSF.a lib/libLLVMSupport.a -lz -lcurses -lm lib/libLLVMDemangle.a && :
[4022/4613] /Users/buildslave/jenkins/workspace/clang-stage2-coverage-R/host-compiler/bin/clang++  -DCLANG_TOOL_EXTRA_BUILD -DGTEST_HAS_RTTI=0 -D_GNU_SOURCE -D__STDC_CONSTANT_MACROS -D__STDC_FORMAT_MACROS -D__STDC_LIMIT_MACROS -Itools/clang/tools/libclang -I/Users/buildslave/jenkins/workspace/clang-stage2-coverage-R/llvm/tools/clang/tools/libclang -I/Users/buildslave/jenkins/workspace/clang-stage2-coverage-R/llvm/tools/clang/include -Itools/clang/include -I/Applications/Xcode.app/Contents/Developer/Platforms/MacOSX.platform/Developer/SDKs/MacOSX10.14.sdk/usr/include/libxml2 -Iinclude -I/Users/buildslave/jenkins/workspace/clang-stage2-coverage-R/llvm/include -fPIC -fvisibility-inlines-hidden -Werror=date-time -Werror=unguarded-availability-new -std=c++11 -fmodules -fmodules-cache-path=/Users/buildslave/jenkins/workspace/clang-stage2-coverage-R/clang-build/module.cache -fcxx-modules -Wall -Wextra -Wno-unused-parameter -Wwrite-strings -Wcast-qual -Wmissing-field-initializers -pedantic -Wno-long-long -Wimplicit-fallthrough -Wcovered-switch-default -Wno-noexcept-type -Wnon-virtual-dtor -Wdelete-non-virtual-dtor -Wstring-conversion -fdiagnostics-color -fprofile-instr-generate='/Users/buildslave/jenkins/workspace/clang-stage2-coverage-R/clang-build/profiles/%6m.profraw' -fcoverage-mapping -fno-common -Woverloaded-virtual -Wno-nested-anon-types -O3 -DNDEBUG -isysroot /Applications/Xcode.app/Contents/Developer/Platforms/MacOSX.platform/Developer/SDKs/MacOSX10.14.sdk -fPIC    -fmodules-ignore-macro=CLANG_TOOL_EXTRA_BUILD -fno-exceptions -fno-rtti -MD -MT tools/clang/tools/libclang/CMakeFiles/libclang.dir/Indexing.cpp.o -MF tools/clang/tools/libclang/CMakeFiles/libclang.dir/Indexing.cpp.o.d -o tools/clang/tools/libclang/CMakeFiles/libclang.dir/Indexing.cpp.o -c /Users/buildslave/jenkins/workspace/clang-stage2-coverage-R/llvm/tools/clang/tools/libclang/Indexing.cpp
[4023/4613] /Users/buildslave/jenkins/workspace/clang-stage2-coverage-R/host-compiler/bin/clang++  -DGTEST_HAS_RTTI=0 -D_GNU_SOURCE -D__STDC_CONSTANT_MACROS -D__STDC_FORMAT_MACROS -D__STDC_LIMIT_MACROS -Itools/clang/tools/extra/clangd -I/Users/buildslave/jenkins/workspace/clang-stage2-coverage-R/llvm/tools/clang/tools/extra/clangd -I/Users/buildslave/jenkins/workspace/clang-stage2-coverage-R/llvm/tools/clang/include -Itools/clang/include -I/Applications/Xcode.app/Contents/Developer/Platforms/MacOSX.platform/Developer/SDKs/MacOSX10.14.sdk/usr/include/libxml2 -Iinclude -I/Users/buildslave/jenkins/workspace/clang-stage2-coverage-R/llvm/include -fPIC -fvisibility-inlines-hidden -Werror=date-time -Werror=unguarded-availability-new -std=c++11 -fmodules -fmodules-cache-path=/Users/buildslave/jenkins/workspace/clang-stage2-coverage-R/clang-build/module.cache -fcxx-modules -Wall -Wextra -Wno-unused-parameter -Wwrite-strings -Wcast-qual -Wmissing-field-initializers -pedantic -Wno-long-long -Wimplicit-fallthrough -Wcovered-switch-default -Wno-noexcept-type -Wnon-virtual-dtor -Wdelete-non-virtual-dtor -Wstring-conversion -fdiagnostics-color -fprofile-instr-generate='/Users/buildslave/jenkins/workspace/clang-stage2-coverage-R/clang-build/profiles/%6m.profraw' -fcoverage-mapping -fno-common -Woverloaded-virtual -Wno-nested-anon-types -O3 -DNDEBUG -isysroot /Applications/Xcode.app/Contents/Developer/Platforms/MacOSX.platform/Developer/SDKs/MacOSX10.14.sdk    -fno-exceptions -fno-rtti -MD -MT tools/clang/tools/extra/clangd/CMakeFiles/obj.clangDaemon.dir/CodeCompletionStrings.cpp.o -MF tools/clang/tools/extra/clangd/CMakeFiles/obj.clangDaemon.dir/CodeCompletionStrings.cpp.o.d -o tools/clang/tools/extra/clangd/CMakeFiles/obj.clangDaemon.dir/CodeCompletionStrings.cpp.o -c /Users/buildslave/jenkins/workspace/clang-stage2-coverage-R/llvm/tools/clang/tools/extra/clangd/CodeCompletionStrings.cpp
[4024/4613] /Users/buildslave/jenkins/workspace/clang-stage2-coverage-R/host-compiler/bin/clang++  -DGTEST_HAS_RTTI=0 -D_GNU_SOURCE -D__STDC_CONSTANT_MACROS -D__STDC_FORMAT_MACROS -D__STDC_LIMIT_MACROS -Itools/clang/tools/extra/clang-move -I/Users/buildslave/jenkins/workspace/clang-stage2-coverage-R/llvm/tools/clang/tools/extra/clang-move -I/Users/buildslave/jenkins/workspace/clang-stage2-coverage-R/llvm/tools/clang/include -Itools/clang/include -I/Applications/Xcode.app/Contents/Developer/Platforms/MacOSX.platform/Developer/SDKs/MacOSX10.14.sdk/usr/include/libxml2 -Iinclude -I/Users/buildslave/jenkins/workspace/clang-stage2-coverage-R/llvm/include -fPIC -fvisibility-inlines-hidden -Werror=date-time -Werror=unguarded-availability-new -std=c++11 -fmodules -fmodules-cache-path=/Users/buildslave/jenkins/workspace/clang-stage2-coverage-R/clang-build/module.cache -fcxx-modules -Wall -Wextra -Wno-unused-parameter -Wwrite-strings -Wcast-qual -Wmissing-field-initializers -pedantic -Wno-long-long -Wimplicit-fallthrough -Wcovered-switch-default -Wno-noexcept-type -Wnon-virtual-dtor -Wdelete-non-virtual-dtor -Wstring-conversion -fdiagnostics-color -fprofile-instr-generate='/Users/buildslave/jenkins/workspace/clang-stage2-coverage-R/clang-build/profiles/%6m.profraw' -fcoverage-mapping -fno-common -Woverloaded-virtual -Wno-nested-anon-types -O3 -DNDEBUG -isysroot /Applications/Xcode.app/Contents/Developer/Platforms/MacOSX.platform/Developer/SDKs/MacOSX10.14.sdk    -fno-exceptions -fno-rtti -MD -MT tools/clang/tools/extra/clang-move/CMakeFiles/obj.clangMove.dir/Move.cpp.o -MF tools/clang/tools/extra/clang-move/CMakeFiles/obj.clangMove.dir/Move.cpp.o.d -o tools/clang/tools/extra/clang-move/CMakeFiles/obj.clangMove.dir/Move.cpp.o -c /Users/buildslave/jenkins/workspace/clang-stage2-coverage-R/llvm/tools/clang/tools/extra/clang-move/Move.cpp
[4025/4613] : && "/Applications/Xcode.app/Contents/Developer/Toolchains/XcodeDefault.xctoolchain/usr/bin/libtool" -static -no_warning_for_no_symbols -o lib/libclangMove.a  tools/clang/tools/extra/clang-move/CMakeFiles/obj.clangMove.dir/Move.cpp.o tools/clang/tools/extra/clang-move/CMakeFiles/obj.clangMove.dir/HelperDeclRefGraph.cpp.o && :
[4026/4613] : && /Users/buildslave/jenkins/workspace/clang-stage2-coverage-R/host-compiler/bin/clang++  -fPIC -fvisibility-inlines-hidden -Werror=date-time -Werror=unguarded-availability-new -std=c++11 -fmodules -fmodules-cache-path=/Users/buildslave/jenkins/workspace/clang-stage2-coverage-R/clang-build/module.cache -fcxx-modules -Wall -Wextra -Wno-unused-parameter -Wwrite-strings -Wcast-qual -Wmissing-field-initializers -pedantic -Wno-long-long -Wimplicit-fallthrough -Wcovered-switch-default -Wno-noexcept-type -Wnon-virtual-dtor -Wdelete-non-virtual-dtor -Wstring-conversion -fdiagnostics-color -fprofile-instr-generate='/Users/buildslave/jenkins/workspace/clang-stage2-coverage-R/clang-build/profiles/%6m.profraw' -fcoverage-mapping -fno-common -Woverloaded-virtual -Wno-nested-anon-types -O3 -DNDEBUG -isysroot /Applications/Xcode.app/Contents/Developer/Platforms/MacOSX.platform/Developer/SDKs/MacOSX10.14.sdk -Wl,-search_paths_first -Wl,-headerpad_max_install_names -fprofile-instr-generate='/Users/buildslave/jenkins/workspace/clang-stage2-coverage-R/clang-build/profiles/%6m.profraw' -fcoverage-mapping    -Wl,-dead_strip tools/clang/tools/extra/clang-move/tool/CMakeFiles/clang-move.dir/ClangMove.cpp.o  -o bin/clang-move  -Wl,-rpath,@loader_path/../lib lib/libLLVMSupport.a lib/libclangAST.a lib/libclangASTMatchers.a lib/libclangBasic.a lib/libclangFormat.a lib/libclangFrontend.a lib/libclangMove.a lib/libclangRewrite.a lib/libclangSerialization.a lib/libclangTooling.a lib/libclangToolingCore.a lib/libclangFormat.a lib/libclangToolingInclusions.a lib/libclangFrontend.a lib/libclangParse.a lib/libLLVMMCParser.a lib/libLLVMProfileData.a lib/libclangSerialization.a lib/libclangSema.a lib/libclangEdit.a lib/libLLVMBitReader.a lib/libLLVMBitstreamReader.a lib/libclangDriver.a lib/libLLVMOption.a lib/libclangToolingCore.a lib/libclangRewrite.a lib/libclangAnalysis.a lib/libclangASTMatchers.a lib/libclangAST.a lib/libclangLex.a lib/libclangBasic.a lib/libLLVMCore.a lib/libLLVMRemarks.a lib/libLLVMMC.a lib/libLLVMBinaryFormat.a lib/libLLVMDebugInfoCodeView.a lib/libLLVMDebugInfoMSF.a lib/libLLVMSupport.a -lz -lcurses -lm lib/libLLVMDemangle.a && :
[4027/4613] /Users/buildslave/jenkins/workspace/clang-stage2-coverage-R/host-compiler/bin/clang++  -DGTEST_HAS_RTTI=0 -D_GNU_SOURCE -D__STDC_CONSTANT_MACROS -D__STDC_FORMAT_MACROS -D__STDC_LIMIT_MACROS -Itools/clang/tools/extra/clangd -I/Users/buildslave/jenkins/workspace/clang-stage2-coverage-R/llvm/tools/clang/tools/extra/clangd -I/Users/buildslave/jenkins/workspace/clang-stage2-coverage-R/llvm/tools/clang/include -Itools/clang/include -I/Applications/Xcode.app/Contents/Developer/Platforms/MacOSX.platform/Developer/SDKs/MacOSX10.14.sdk/usr/include/libxml2 -Iinclude -I/Users/buildslave/jenkins/workspace/clang-stage2-coverage-R/llvm/include -fPIC -fvisibility-inlines-hidden -Werror=date-time -Werror=unguarded-availability-new -std=c++11 -fmodules -fmodules-cache-path=/Users/buildslave/jenkins/workspace/clang-stage2-coverage-R/clang-build/module.cache -fcxx-modules -Wall -Wextra -Wno-unused-parameter -Wwrite-strings -Wcast-qual -Wmissing-field-initializers -pedantic -Wno-long-long -Wimplicit-fallthrough -Wcovered-switch-default -Wno-noexcept-type -Wnon-virtual-dtor -Wdelete-non-virtual-dtor -Wstring-conversion -fdiagnostics-color -fprofile-instr-generate='/Users/buildslave/jenkins/workspace/clang-stage2-coverage-R/clang-build/profiles/%6m.profraw' -fcoverage-mapping -fno-common -Woverloaded-virtual -Wno-nested-anon-types -O3 -DNDEBUG -isysroot /Applications/Xcode.app/Contents/Developer/Platforms/MacOSX.platform/Developer/SDKs/MacOSX10.14.sdk    -fno-exceptions -fno-rtti -MD -MT tools/clang/tools/extra/clangd/CMakeFiles/obj.clangDaemon.dir/Context.cpp.o -MF tools/clang/tools/extra/clangd/CMakeFiles/obj.clangDaemon.dir/Context.cpp.o.d -o tools/clang/tools/extra/clangd/CMakeFiles/obj.clangDaemon.dir/Context.cpp.o -c /Users/buildslave/jenkins/workspace/clang-stage2-coverage-R/llvm/tools/clang/tools/extra/clangd/Context.cpp
[4028/4613] /Users/buildslave/jenkins/workspace/clang-stage2-coverage-R/host-compiler/bin/clang++  -DGTEST_HAS_RTTI=0 -D_GNU_SOURCE -D__STDC_CONSTANT_MACROS -D__STDC_FORMAT_MACROS -D__STDC_LIMIT_MACROS -Itools/clang/tools/extra/clangd -I/Users/buildslave/jenkins/workspace/clang-stage2-coverage-R/llvm/tools/clang/tools/extra/clangd -I/Users/buildslave/jenkins/workspace/clang-stage2-coverage-R/llvm/tools/clang/include -Itools/clang/include -I/Applications/Xcode.app/Contents/Developer/Platforms/MacOSX.platform/Developer/SDKs/MacOSX10.14.sdk/usr/include/libxml2 -Iinclude -I/Users/buildslave/jenkins/workspace/clang-stage2-coverage-R/llvm/include -fPIC -fvisibility-inlines-hidden -Werror=date-time -Werror=unguarded-availability-new -std=c++11 -fmodules -fmodules-cache-path=/Users/buildslave/jenkins/workspace/clang-stage2-coverage-R/clang-build/module.cache -fcxx-modules -Wall -Wextra -Wno-unused-parameter -Wwrite-strings -Wcast-qual -Wmissing-field-initializers -pedantic -Wno-long-long -Wimplicit-fallthrough -Wcovered-switch-default -Wno-noexcept-type -Wnon-virtual-dtor -Wdelete-non-virtual-dtor -Wstring-conversion -fdiagnostics-color -fprofile-instr-generate='/Users/buildslave/jenkins/workspace/clang-stage2-coverage-R/clang-build/profiles/%6m.profraw' -fcoverage-mapping -fno-common -Woverloaded-virtual -Wno-nested-anon-types -O3 -DNDEBUG -isysroot /Applications/Xcode.app/Contents/Developer/Platforms/MacOSX.platform/Developer/SDKs/MacOSX10.14.sdk    -fno-exceptions -fno-rtti -MD -MT tools/clang/tools/extra/clangd/CMakeFiles/obj.clangDaemon.dir/Compiler.cpp.o -MF tools/clang/tools/extra/clangd/CMakeFiles/obj.clangDaemon.dir/Compiler.cpp.o.d -o tools/clang/tools/extra/clangd/CMakeFiles/obj.clangDaemon.dir/Compiler.cpp.o -c /Users/buildslave/jenkins/workspace/clang-stage2-coverage-R/llvm/tools/clang/tools/extra/clangd/Compiler.cpp
[4029/4613] /Users/buildslave/jenkins/workspace/clang-stage2-coverage-R/host-compiler/bin/clang++  -DGTEST_HAS_RTTI=0 -D_GNU_SOURCE -D__STDC_CONSTANT_MACROS -D__STDC_FORMAT_MACROS -D__STDC_LIMIT_MACROS -Itools/clang/tools/extra/clangd -I/Users/buildslave/jenkins/workspace/clang-stage2-coverage-R/llvm/tools/clang/tools/extra/clangd -I/Users/buildslave/jenkins/workspace/clang-stage2-coverage-R/llvm/tools/clang/include -Itools/clang/include -I/Applications/Xcode.app/Contents/Developer/Platforms/MacOSX.platform/Developer/SDKs/MacOSX10.14.sdk/usr/include/libxml2 -Iinclude -I/Users/buildslave/jenkins/workspace/clang-stage2-coverage-R/llvm/include -fPIC -fvisibility-inlines-hidden -Werror=date-time -Werror=unguarded-availability-new -std=c++11 -fmodules -fmodules-cache-path=/Users/buildslave/jenkins/workspace/clang-stage2-coverage-R/clang-build/module.cache -fcxx-modules -Wall -Wextra -Wno-unused-parameter -Wwrite-strings -Wcast-qual -Wmissing-field-initializers -pedantic -Wno-long-long -Wimplicit-fallthrough -Wcovered-switch-default -Wno-noexcept-type -Wnon-virtual-dtor -Wdelete-non-virtual-dtor -Wstring-conversion -fdiagnostics-color -fprofile-instr-generate='/Users/buildslave/jenkins/workspace/clang-stage2-coverage-R/clang-build/profiles/%6m.profraw' -fcoverage-mapping -fno-common -Woverloaded-virtual -Wno-nested-anon-types -O3 -DNDEBUG -isysroot /Applications/Xcode.app/Contents/Developer/Platforms/MacOSX.platform/Developer/SDKs/MacOSX10.14.sdk    -fno-exceptions -fno-rtti -MD -MT tools/clang/tools/extra/clangd/CMakeFiles/obj.clangDaemon.dir/DraftStore.cpp.o -MF tools/clang/tools/extra/clangd/CMakeFiles/obj.clangDaemon.dir/DraftStore.cpp.o.d -o tools/clang/tools/extra/clangd/CMakeFiles/obj.clangDaemon.dir/DraftStore.cpp.o -c /Users/buildslave/jenkins/workspace/clang-stage2-coverage-R/llvm/tools/clang/tools/extra/clangd/DraftStore.cpp
[4030/4613] /Users/buildslave/jenkins/workspace/clang-stage2-coverage-R/host-compiler/bin/clang++  -DGTEST_HAS_RTTI=0 -D_GNU_SOURCE -D__STDC_CONSTANT_MACROS -D__STDC_FORMAT_MACROS -D__STDC_LIMIT_MACROS -Itools/clang/tools/extra/clangd -I/Users/buildslave/jenkins/workspace/clang-stage2-coverage-R/llvm/tools/clang/tools/extra/clangd -I/Users/buildslave/jenkins/workspace/clang-stage2-coverage-R/llvm/tools/clang/include -Itools/clang/include -I/Applications/Xcode.app/Contents/Developer/Platforms/MacOSX.platform/Developer/SDKs/MacOSX10.14.sdk/usr/include/libxml2 -Iinclude -I/Users/buildslave/jenkins/workspace/clang-stage2-coverage-R/llvm/include -fPIC -fvisibility-inlines-hidden -Werror=date-time -Werror=unguarded-availability-new -std=c++11 -fmodules -fmodules-cache-path=/Users/buildslave/jenkins/workspace/clang-stage2-coverage-R/clang-build/module.cache -fcxx-modules -Wall -Wextra -Wno-unused-parameter -Wwrite-strings -Wcast-qual -Wmissing-field-initializers -pedantic -Wno-long-long -Wimplicit-fallthrough -Wcovered-switch-default -Wno-noexcept-type -Wnon-virtual-dtor -Wdelete-non-virtual-dtor -Wstring-conversion -fdiagnostics-color -fprofile-instr-generate='/Users/buildslave/jenkins/workspace/clang-stage2-coverage-R/clang-build/profiles/%6m.profraw' -fcoverage-mapping -fno-common -Woverloaded-virtual -Wno-nested-anon-types -O3 -DNDEBUG -isysroot /Applications/Xcode.app/Contents/Developer/Platforms/MacOSX.platform/Developer/SDKs/MacOSX10.14.sdk    -fno-exceptions -fno-rtti -MD -MT tools/clang/tools/extra/clangd/CMakeFiles/obj.clangDaemon.dir/ClangdServer.cpp.o -MF tools/clang/tools/extra/clangd/CMakeFiles/obj.clangDaemon.dir/ClangdServer.cpp.o.d -o tools/clang/tools/extra/clangd/CMakeFiles/obj.clangDaemon.dir/ClangdServer.cpp.o -c /Users/buildslave/jenkins/workspace/clang-stage2-coverage-R/llvm/tools/clang/tools/extra/clangd/ClangdServer.cpp
[4031/4613] /Users/buildslave/jenkins/workspace/clang-stage2-coverage-R/host-compiler/bin/clang++  -DGTEST_HAS_RTTI=0 -D_GNU_SOURCE -D__STDC_CONSTANT_MACROS -D__STDC_FORMAT_MACROS -D__STDC_LIMIT_MACROS -Itools/clang/tools/extra/clangd -I/Users/buildslave/jenkins/workspace/clang-stage2-coverage-R/llvm/tools/clang/tools/extra/clangd -I/Users/buildslave/jenkins/workspace/clang-stage2-coverage-R/llvm/tools/clang/include -Itools/clang/include -I/Applications/Xcode.app/Contents/Developer/Platforms/MacOSX.platform/Developer/SDKs/MacOSX10.14.sdk/usr/include/libxml2 -Iinclude -I/Users/buildslave/jenkins/workspace/clang-stage2-coverage-R/llvm/include -fPIC -fvisibility-inlines-hidden -Werror=date-time -Werror=unguarded-availability-new -std=c++11 -fmodules -fmodules-cache-path=/Users/buildslave/jenkins/workspace/clang-stage2-coverage-R/clang-build/module.cache -fcxx-modules -Wall -Wextra -Wno-unused-parameter -Wwrite-strings -Wcast-qual -Wmissing-field-initializers -pedantic -Wno-long-long -Wimplicit-fallthrough -Wcovered-switch-default -Wno-noexcept-type -Wnon-virtual-dtor -Wdelete-non-virtual-dtor -Wstring-conversion -fdiagnostics-color -fprofile-instr-generate='/Users/buildslave/jenkins/workspace/clang-stage2-coverage-R/clang-build/profiles/%6m.profraw' -fcoverage-mapping -fno-common -Woverloaded-virtual -Wno-nested-anon-types -O3 -DNDEBUG -isysroot /Applications/Xcode.app/Contents/Developer/Platforms/MacOSX.platform/Developer/SDKs/MacOSX10.14.sdk    -fno-exceptions -fno-rtti -MD -MT tools/clang/tools/extra/clangd/CMakeFiles/obj.clangDaemon.dir/ExpectedTypes.cpp.o -MF tools/clang/tools/extra/clangd/CMakeFiles/obj.clangDaemon.dir/ExpectedTypes.cpp.o.d -o tools/clang/tools/extra/clangd/CMakeFiles/obj.clangDaemon.dir/ExpectedTypes.cpp.o -c /Users/buildslave/jenkins/workspace/clang-stage2-coverage-R/llvm/tools/clang/tools/extra/clangd/ExpectedTypes.cpp
[4032/4613] /Users/buildslave/jenkins/workspace/clang-stage2-coverage-R/host-compiler/bin/clang++  -DGTEST_HAS_RTTI=0 -D_GNU_SOURCE -D__STDC_CONSTANT_MACROS -D__STDC_FORMAT_MACROS -D__STDC_LIMIT_MACROS -Itools/clang/tools/extra/clangd -I/Users/buildslave/jenkins/workspace/clang-stage2-coverage-R/llvm/tools/clang/tools/extra/clangd -I/Users/buildslave/jenkins/workspace/clang-stage2-coverage-R/llvm/tools/clang/include -Itools/clang/include -I/Applications/Xcode.app/Contents/Developer/Platforms/MacOSX.platform/Developer/SDKs/MacOSX10.14.sdk/usr/include/libxml2 -Iinclude -I/Users/buildslave/jenkins/workspace/clang-stage2-coverage-R/llvm/include -fPIC -fvisibility-inlines-hidden -Werror=date-time -Werror=unguarded-availability-new -std=c++11 -fmodules -fmodules-cache-path=/Users/buildslave/jenkins/workspace/clang-stage2-coverage-R/clang-build/module.cache -fcxx-modules -Wall -Wextra -Wno-unused-parameter -Wwrite-strings -Wcast-qual -Wmissing-field-initializers -pedantic -Wno-long-long -Wimplicit-fallthrough -Wcovered-switch-default -Wno-noexcept-type -Wnon-virtual-dtor -Wdelete-non-virtual-dtor -Wstring-conversion -fdiagnostics-color -fprofile-instr-generate='/Users/buildslave/jenkins/workspace/clang-stage2-coverage-R/clang-build/profiles/%6m.profraw' -fcoverage-mapping -fno-common -Woverloaded-virtual -Wno-nested-anon-types -O3 -DNDEBUG -isysroot /Applications/Xcode.app/Contents/Developer/Platforms/MacOSX.platform/Developer/SDKs/MacOSX10.14.sdk    -fno-exceptions -fno-rtti -MD -MT tools/clang/tools/extra/clangd/CMakeFiles/obj.clangDaemon.dir/ClangdUnit.cpp.o -MF tools/clang/tools/extra/clangd/CMakeFiles/obj.clangDaemon.dir/ClangdUnit.cpp.o.d -o tools/clang/tools/extra/clangd/CMakeFiles/obj.clangDaemon.dir/ClangdUnit.cpp.o -c /Users/buildslave/jenkins/workspace/clang-stage2-coverage-R/llvm/tools/clang/tools/extra/clangd/ClangdUnit.cpp
[4033/4613] /Users/buildslave/jenkins/workspace/clang-stage2-coverage-R/host-compiler/bin/clang++  -DGTEST_HAS_RTTI=0 -D_GNU_SOURCE -D__STDC_CONSTANT_MACROS -D__STDC_FORMAT_MACROS -D__STDC_LIMIT_MACROS -Itools/clang/tools/extra/clangd -I/Users/buildslave/jenkins/workspace/clang-stage2-coverage-R/llvm/tools/clang/tools/extra/clangd -I/Users/buildslave/jenkins/workspace/clang-stage2-coverage-R/llvm/tools/clang/include -Itools/clang/include -I/Applications/Xcode.app/Contents/Developer/Platforms/MacOSX.platform/Developer/SDKs/MacOSX10.14.sdk/usr/include/libxml2 -Iinclude -I/Users/buildslave/jenkins/workspace/clang-stage2-coverage-R/llvm/include -fPIC -fvisibility-inlines-hidden -Werror=date-time -Werror=unguarded-availability-new -std=c++11 -fmodules -fmodules-cache-path=/Users/buildslave/jenkins/workspace/clang-stage2-coverage-R/clang-build/module.cache -fcxx-modules -Wall -Wextra -Wno-unused-parameter -Wwrite-strings -Wcast-qual -Wmissing-field-initializers -pedantic -Wno-long-long -Wimplicit-fallthrough -Wcovered-switch-default -Wno-noexcept-type -Wnon-virtual-dtor -Wdelete-non-virtual-dtor -Wstring-conversion -fdiagnostics-color -fprofile-instr-generate='/Users/buildslave/jenkins/workspace/clang-stage2-coverage-R/clang-build/profiles/%6m.profraw' -fcoverage-mapping -fno-common -Woverloaded-virtual -Wno-nested-anon-types -O3 -DNDEBUG -isysroot /Applications/Xcode.app/Contents/Developer/Platforms/MacOSX.platform/Developer/SDKs/MacOSX10.14.sdk    -fno-exceptions -fno-rtti -MD -MT tools/clang/tools/extra/clangd/CMakeFiles/obj.clangDaemon.dir/FS.cpp.o -MF tools/clang/tools/extra/clangd/CMakeFiles/obj.clangDaemon.dir/FS.cpp.o.d -o tools/clang/tools/extra/clangd/CMakeFiles/obj.clangDaemon.dir/FS.cpp.o -c /Users/buildslave/jenkins/workspace/clang-stage2-coverage-R/llvm/tools/clang/tools/extra/clangd/FS.cpp
[4034/4613] /Users/buildslave/jenkins/workspace/clang-stage2-coverage-R/host-compiler/bin/clang++  -DGTEST_HAS_RTTI=0 -D_GNU_SOURCE -D__STDC_CONSTANT_MACROS -D__STDC_FORMAT_MACROS -D__STDC_LIMIT_MACROS -Itools/clang/tools/extra/clangd -I/Users/buildslave/jenkins/workspace/clang-stage2-coverage-R/llvm/tools/clang/tools/extra/clangd -I/Users/buildslave/jenkins/workspace/clang-stage2-coverage-R/llvm/tools/clang/include -Itools/clang/include -I/Applications/Xcode.app/Contents/Developer/Platforms/MacOSX.platform/Developer/SDKs/MacOSX10.14.sdk/usr/include/libxml2 -Iinclude -I/Users/buildslave/jenkins/workspace/clang-stage2-coverage-R/llvm/include -fPIC -fvisibility-inlines-hidden -Werror=date-time -Werror=unguarded-availability-new -std=c++11 -fmodules -fmodules-cache-path=/Users/buildslave/jenkins/workspace/clang-stage2-coverage-R/clang-build/module.cache -fcxx-modules -Wall -Wextra -Wno-unused-parameter -Wwrite-strings -Wcast-qual -Wmissing-field-initializers -pedantic -Wno-long-long -Wimplicit-fallthrough -Wcovered-switch-default -Wno-noexcept-type -Wnon-virtual-dtor -Wdelete-non-virtual-dtor -Wstring-conversion -fdiagnostics-color -fprofile-instr-generate='/Users/buildslave/jenkins/workspace/clang-stage2-coverage-R/clang-build/profiles/%6m.profraw' -fcoverage-mapping -fno-common -Woverloaded-virtual -Wno-nested-anon-types -O3 -DNDEBUG -isysroot /Applications/Xcode.app/Contents/Developer/Platforms/MacOSX.platform/Developer/SDKs/MacOSX10.14.sdk    -fno-exceptions -fno-rtti -MD -MT tools/clang/tools/extra/clangd/CMakeFiles/obj.clangDaemon.dir/FileDistance.cpp.o -MF tools/clang/tools/extra/clangd/CMakeFiles/obj.clangDaemon.dir/FileDistance.cpp.o.d -o tools/clang/tools/extra/clangd/CMakeFiles/obj.clangDaemon.dir/FileDistance.cpp.o -c /Users/buildslave/jenkins/workspace/clang-stage2-coverage-R/llvm/tools/clang/tools/extra/clangd/FileDistance.cpp
[4035/4613] /Users/buildslave/jenkins/workspace/clang-stage2-coverage-R/host-compiler/bin/clang++  -DGTEST_HAS_RTTI=0 -D_GNU_SOURCE -D__STDC_CONSTANT_MACROS -D__STDC_FORMAT_MACROS -D__STDC_LIMIT_MACROS -Itools/clang/tools/extra/clangd -I/Users/buildslave/jenkins/workspace/clang-stage2-coverage-R/llvm/tools/clang/tools/extra/clangd -I/Users/buildslave/jenkins/workspace/clang-stage2-coverage-R/llvm/tools/clang/include -Itools/clang/include -I/Applications/Xcode.app/Contents/Developer/Platforms/MacOSX.platform/Developer/SDKs/MacOSX10.14.sdk/usr/include/libxml2 -Iinclude -I/Users/buildslave/jenkins/workspace/clang-stage2-coverage-R/llvm/include -fPIC -fvisibility-inlines-hidden -Werror=date-time -Werror=unguarded-availability-new -std=c++11 -fmodules -fmodules-cache-path=/Users/buildslave/jenkins/workspace/clang-stage2-coverage-R/clang-build/module.cache -fcxx-modules -Wall -Wextra -Wno-unused-parameter -Wwrite-strings -Wcast-qual -Wmissing-field-initializers -pedantic -Wno-long-long -Wimplicit-fallthrough -Wcovered-switch-default -Wno-noexcept-type -Wnon-virtual-dtor -Wdelete-non-virtual-dtor -Wstring-conversion -fdiagnostics-color -fprofile-instr-generate='/Users/buildslave/jenkins/workspace/clang-stage2-coverage-R/clang-build/profiles/%6m.profraw' -fcoverage-mapping -fno-common -Woverloaded-virtual -Wno-nested-anon-types -O3 -DNDEBUG -isysroot /Applications/Xcode.app/Contents/Developer/Platforms/MacOSX.platform/Developer/SDKs/MacOSX10.14.sdk    -fno-exceptions -fno-rtti -MD -MT tools/clang/tools/extra/clangd/CMakeFiles/obj.clangDaemon.dir/FSProvider.cpp.o -MF tools/clang/tools/extra/clangd/CMakeFiles/obj.clangDaemon.dir/FSProvider.cpp.o.d -o tools/clang/tools/extra/clangd/CMakeFiles/obj.clangDaemon.dir/FSProvider.cpp.o -c /Users/buildslave/jenkins/workspace/clang-stage2-coverage-R/llvm/tools/clang/tools/extra/clangd/FSProvider.cpp
[4036/4613] /Users/buildslave/jenkins/workspace/clang-stage2-coverage-R/host-compiler/bin/clang++  -DGTEST_HAS_RTTI=0 -D_GNU_SOURCE -D__STDC_CONSTANT_MACROS -D__STDC_FORMAT_MACROS -D__STDC_LIMIT_MACROS -Itools/clang/tools/extra/clangd -I/Users/buildslave/jenkins/workspace/clang-stage2-coverage-R/llvm/tools/clang/tools/extra/clangd -I/Users/buildslave/jenkins/workspace/clang-stage2-coverage-R/llvm/tools/clang/include -Itools/clang/include -I/Applications/Xcode.app/Contents/Developer/Platforms/MacOSX.platform/Developer/SDKs/MacOSX10.14.sdk/usr/include/libxml2 -Iinclude -I/Users/buildslave/jenkins/workspace/clang-stage2-coverage-R/llvm/include -fPIC -fvisibility-inlines-hidden -Werror=date-time -Werror=unguarded-availability-new -std=c++11 -fmodules -fmodules-cache-path=/Users/buildslave/jenkins/workspace/clang-stage2-coverage-R/clang-build/module.cache -fcxx-modules -Wall -Wextra -Wno-unused-parameter -Wwrite-strings -Wcast-qual -Wmissing-field-initializers -pedantic -Wno-long-long -Wimplicit-fallthrough -Wcovered-switch-default -Wno-noexcept-type -Wnon-virtual-dtor -Wdelete-non-virtual-dtor -Wstring-conversion -fdiagnostics-color -fprofile-instr-generate='/Users/buildslave/jenkins/workspace/clang-stage2-coverage-R/clang-build/profiles/%6m.profraw' -fcoverage-mapping -fno-common -Woverloaded-virtual -Wno-nested-anon-types -O3 -DNDEBUG -isysroot /Applications/Xcode.app/Contents/Developer/Platforms/MacOSX.platform/Developer/SDKs/MacOSX10.14.sdk    -fno-exceptions -fno-rtti -MD -MT tools/clang/tools/extra/clangd/CMakeFiles/obj.clangDaemon.dir/FormattedString.cpp.o -MF tools/clang/tools/extra/clangd/CMakeFiles/obj.clangDaemon.dir/FormattedString.cpp.o.d -o tools/clang/tools/extra/clangd/CMakeFiles/obj.clangDaemon.dir/FormattedString.cpp.o -c /Users/buildslave/jenkins/workspace/clang-stage2-coverage-R/llvm/tools/clang/tools/extra/clangd/FormattedString.cpp
[4037/4613] /Users/buildslave/jenkins/workspace/clang-stage2-coverage-R/host-compiler/bin/clang++  -DGTEST_HAS_RTTI=0 -D_GNU_SOURCE -D__STDC_CONSTANT_MACROS -D__STDC_FORMAT_MACROS -D__STDC_LIMIT_MACROS -Itools/clang/tools/extra/clangd -I/Users/buildslave/jenkins/workspace/clang-stage2-coverage-R/llvm/tools/clang/tools/extra/clangd -I/Users/buildslave/jenkins/workspace/clang-stage2-coverage-R/llvm/tools/clang/include -Itools/clang/include -I/Applications/Xcode.app/Contents/Developer/Platforms/MacOSX.platform/Developer/SDKs/MacOSX10.14.sdk/usr/include/libxml2 -Iinclude -I/Users/buildslave/jenkins/workspace/clang-stage2-coverage-R/llvm/include -fPIC -fvisibility-inlines-hidden -Werror=date-time -Werror=unguarded-availability-new -std=c++11 -fmodules -fmodules-cache-path=/Users/buildslave/jenkins/workspace/clang-stage2-coverage-R/clang-build/module.cache -fcxx-modules -Wall -Wextra -Wno-unused-parameter -Wwrite-strings -Wcast-qual -Wmissing-field-initializers -pedantic -Wno-long-long -Wimplicit-fallthrough -Wcovered-switch-default -Wno-noexcept-type -Wnon-virtual-dtor -Wdelete-non-virtual-dtor -Wstring-conversion -fdiagnostics-color -fprofile-instr-generate='/Users/buildslave/jenkins/workspace/clang-stage2-coverage-R/clang-build/profiles/%6m.profraw' -fcoverage-mapping -fno-common -Woverloaded-virtual -Wno-nested-anon-types -O3 -DNDEBUG -isysroot /Applications/Xcode.app/Contents/Developer/Platforms/MacOSX.platform/Developer/SDKs/MacOSX10.14.sdk    -fno-exceptions -fno-rtti -MD -MT tools/clang/tools/extra/clangd/CMakeFiles/obj.clangDaemon.dir/Format.cpp.o -MF tools/clang/tools/extra/clangd/CMakeFiles/obj.clangDaemon.dir/Format.cpp.o.d -o tools/clang/tools/extra/clangd/CMakeFiles/obj.clangDaemon.dir/Format.cpp.o -c /Users/buildslave/jenkins/workspace/clang-stage2-coverage-R/llvm/tools/clang/tools/extra/clangd/Format.cpp
[4038/4613] /Users/buildslave/jenkins/workspace/clang-stage2-coverage-R/host-compiler/bin/clang++  -DGTEST_HAS_RTTI=0 -D_GNU_SOURCE -D__STDC_CONSTANT_MACROS -D__STDC_FORMAT_MACROS -D__STDC_LIMIT_MACROS -Itools/clang/tools/extra/clangd -I/Users/buildslave/jenkins/workspace/clang-stage2-coverage-R/llvm/tools/clang/tools/extra/clangd -I/Users/buildslave/jenkins/workspace/clang-stage2-coverage-R/llvm/tools/clang/include -Itools/clang/include -I/Applications/Xcode.app/Contents/Developer/Platforms/MacOSX.platform/Developer/SDKs/MacOSX10.14.sdk/usr/include/libxml2 -Iinclude -I/Users/buildslave/jenkins/workspace/clang-stage2-coverage-R/llvm/include -fPIC -fvisibility-inlines-hidden -Werror=date-time -Werror=unguarded-availability-new -std=c++11 -fmodules -fmodules-cache-path=/Users/buildslave/jenkins/workspace/clang-stage2-coverage-R/clang-build/module.cache -fcxx-modules -Wall -Wextra -Wno-unused-parameter -Wwrite-strings -Wcast-qual -Wmissing-field-initializers -pedantic -Wno-long-long -Wimplicit-fallthrough -Wcovered-switch-default -Wno-noexcept-type -Wnon-virtual-dtor -Wdelete-non-virtual-dtor -Wstring-conversion -fdiagnostics-color -fprofile-instr-generate='/Users/buildslave/jenkins/workspace/clang-stage2-coverage-R/clang-build/profiles/%6m.profraw' -fcoverage-mapping -fno-common -Woverloaded-virtual -Wno-nested-anon-types -O3 -DNDEBUG -isysroot /Applications/Xcode.app/Contents/Developer/Platforms/MacOSX.platform/Developer/SDKs/MacOSX10.14.sdk    -fno-exceptions -fno-rtti -MD -MT tools/clang/tools/extra/clangd/CMakeFiles/obj.clangDaemon.dir/FuzzyMatch.cpp.o -MF tools/clang/tools/extra/clangd/CMakeFiles/obj.clangDaemon.dir/FuzzyMatch.cpp.o.d -o tools/clang/tools/extra/clangd/CMakeFiles/obj.clangDaemon.dir/FuzzyMatch.cpp.o -c /Users/buildslave/jenkins/workspace/clang-stage2-coverage-R/llvm/tools/clang/tools/extra/clangd/FuzzyMatch.cpp
[4039/4613] /Users/buildslave/jenkins/workspace/clang-stage2-coverage-R/host-compiler/bin/clang++  -DGTEST_HAS_RTTI=0 -D_GNU_SOURCE -D__STDC_CONSTANT_MACROS -D__STDC_FORMAT_MACROS -D__STDC_LIMIT_MACROS -Itools/clang/tools/extra/clangd -I/Users/buildslave/jenkins/workspace/clang-stage2-coverage-R/llvm/tools/clang/tools/extra/clangd -I/Users/buildslave/jenkins/workspace/clang-stage2-coverage-R/llvm/tools/clang/include -Itools/clang/include -I/Applications/Xcode.app/Contents/Developer/Platforms/MacOSX.platform/Developer/SDKs/MacOSX10.14.sdk/usr/include/libxml2 -Iinclude -I/Users/buildslave/jenkins/workspace/clang-stage2-coverage-R/llvm/include -fPIC -fvisibility-inlines-hidden -Werror=date-time -Werror=unguarded-availability-new -std=c++11 -fmodules -fmodules-cache-path=/Users/buildslave/jenkins/workspace/clang-stage2-coverage-R/clang-build/module.cache -fcxx-modules -Wall -Wextra -Wno-unused-parameter -Wwrite-strings -Wcast-qual -Wmissing-field-initializers -pedantic -Wno-long-long -Wimplicit-fallthrough -Wcovered-switch-default -Wno-noexcept-type -Wnon-virtual-dtor -Wdelete-non-virtual-dtor -Wstring-conversion -fdiagnostics-color -fprofile-instr-generate='/Users/buildslave/jenkins/workspace/clang-stage2-coverage-R/clang-build/profiles/%6m.profraw' -fcoverage-mapping -fno-common -Woverloaded-virtual -Wno-nested-anon-types -O3 -DNDEBUG -isysroot /Applications/Xcode.app/Contents/Developer/Platforms/MacOSX.platform/Developer/SDKs/MacOSX10.14.sdk    -fno-exceptions -fno-rtti -MD -MT tools/clang/tools/extra/clangd/CMakeFiles/obj.clangDaemon.dir/CodeComplete.cpp.o -MF tools/clang/tools/extra/clangd/CMakeFiles/obj.clangDaemon.dir/CodeComplete.cpp.o.d -o tools/clang/tools/extra/clangd/CMakeFiles/obj.clangDaemon.dir/CodeComplete.cpp.o -c /Users/buildslave/jenkins/workspace/clang-stage2-coverage-R/llvm/tools/clang/tools/extra/clangd/CodeComplete.cpp
[4040/4613] /Users/buildslave/jenkins/workspace/clang-stage2-coverage-R/host-compiler/bin/clang++  -DGTEST_HAS_RTTI=0 -D_GNU_SOURCE -D__STDC_CONSTANT_MACROS -D__STDC_FORMAT_MACROS -D__STDC_LIMIT_MACROS -Itools/clang/tools/extra/clangd -I/Users/buildslave/jenkins/workspace/clang-stage2-coverage-R/llvm/tools/clang/tools/extra/clangd -I/Users/buildslave/jenkins/workspace/clang-stage2-coverage-R/llvm/tools/clang/include -Itools/clang/include -I/Applications/Xcode.app/Contents/Developer/Platforms/MacOSX.platform/Developer/SDKs/MacOSX10.14.sdk/usr/include/libxml2 -Iinclude -I/Users/buildslave/jenkins/workspace/clang-stage2-coverage-R/llvm/include -fPIC -fvisibility-inlines-hidden -Werror=date-time -Werror=unguarded-availability-new -std=c++11 -fmodules -fmodules-cache-path=/Users/buildslave/jenkins/workspace/clang-stage2-coverage-R/clang-build/module.cache -fcxx-modules -Wall -Wextra -Wno-unused-parameter -Wwrite-strings -Wcast-qual -Wmissing-field-initializers -pedantic -Wno-long-long -Wimplicit-fallthrough -Wcovered-switch-default -Wno-noexcept-type -Wnon-virtual-dtor -Wdelete-non-virtual-dtor -Wstring-conversion -fdiagnostics-color -fprofile-instr-generate='/Users/buildslave/jenkins/workspace/clang-stage2-coverage-R/clang-build/profiles/%6m.profraw' -fcoverage-mapping -fno-common -Woverloaded-virtual -Wno-nested-anon-types -O3 -DNDEBUG -isysroot /Applications/Xcode.app/Contents/Developer/Platforms/MacOSX.platform/Developer/SDKs/MacOSX10.14.sdk    -fno-exceptions -fno-rtti -MD -MT tools/clang/tools/extra/clangd/CMakeFiles/obj.clangDaemon.dir/Diagnostics.cpp.o -MF tools/clang/tools/extra/clangd/CMakeFiles/obj.clangDaemon.dir/Diagnostics.cpp.o.d -o tools/clang/tools/extra/clangd/CMakeFiles/obj.clangDaemon.dir/Diagnostics.cpp.o -c /Users/buildslave/jenkins/workspace/clang-stage2-coverage-R/llvm/tools/clang/tools/extra/clangd/Diagnostics.cpp
[4041/4613] /Users/buildslave/jenkins/workspace/clang-stage2-coverage-R/host-compiler/bin/clang++  -DGTEST_HAS_RTTI=0 -D_GNU_SOURCE -D__STDC_CONSTANT_MACROS -D__STDC_FORMAT_MACROS -D__STDC_LIMIT_MACROS -Itools/clang/tools/extra/clangd -I/Users/buildslave/jenkins/workspace/clang-stage2-coverage-R/llvm/tools/clang/tools/extra/clangd -I/Users/buildslave/jenkins/workspace/clang-stage2-coverage-R/llvm/tools/clang/include -Itools/clang/include -I/Applications/Xcode.app/Contents/Developer/Platforms/MacOSX.platform/Developer/SDKs/MacOSX10.14.sdk/usr/include/libxml2 -Iinclude -I/Users/buildslave/jenkins/workspace/clang-stage2-coverage-R/llvm/include -fPIC -fvisibility-inlines-hidden -Werror=date-time -Werror=unguarded-availability-new -std=c++11 -fmodules -fmodules-cache-path=/Users/buildslave/jenkins/workspace/clang-stage2-coverage-R/clang-build/module.cache -fcxx-modules -Wall -Wextra -Wno-unused-parameter -Wwrite-strings -Wcast-qual -Wmissing-field-initializers -pedantic -Wno-long-long -Wimplicit-fallthrough -Wcovered-switch-default -Wno-noexcept-type -Wnon-virtual-dtor -Wdelete-non-virtual-dtor -Wstring-conversion -fdiagnostics-color -fprofile-instr-generate='/Users/buildslave/jenkins/workspace/clang-stage2-coverage-R/clang-build/profiles/%6m.profraw' -fcoverage-mapping -fno-common -Woverloaded-virtual -Wno-nested-anon-types -O3 -DNDEBUG -isysroot /Applications/Xcode.app/Contents/Developer/Platforms/MacOSX.platform/Developer/SDKs/MacOSX10.14.sdk    -fno-exceptions -fno-rtti -MD -MT tools/clang/tools/extra/clangd/CMakeFiles/obj.clangDaemon.dir/JSONTransport.cpp.o -MF tools/clang/tools/extra/clangd/CMakeFiles/obj.clangDaemon.dir/JSONTransport.cpp.o.d -o tools/clang/tools/extra/clangd/CMakeFiles/obj.clangDaemon.dir/JSONTransport.cpp.o -c /Users/buildslave/jenkins/workspace/clang-stage2-coverage-R/llvm/tools/clang/tools/extra/clangd/JSONTransport.cpp
[4042/4613] /Users/buildslave/jenkins/workspace/clang-stage2-coverage-R/host-compiler/bin/clang++  -DGTEST_HAS_RTTI=0 -D_GNU_SOURCE -D__STDC_CONSTANT_MACROS -D__STDC_FORMAT_MACROS -D__STDC_LIMIT_MACROS -Itools/clang/tools/extra/clangd -I/Users/buildslave/jenkins/workspace/clang-stage2-coverage-R/llvm/tools/clang/tools/extra/clangd -I/Users/buildslave/jenkins/workspace/clang-stage2-coverage-R/llvm/tools/clang/include -Itools/clang/include -I/Applications/Xcode.app/Contents/Developer/Platforms/MacOSX.platform/Developer/SDKs/MacOSX10.14.sdk/usr/include/libxml2 -Iinclude -I/Users/buildslave/jenkins/workspace/clang-stage2-coverage-R/llvm/include -fPIC -fvisibility-inlines-hidden -Werror=date-time -Werror=unguarded-availability-new -std=c++11 -fmodules -fmodules-cache-path=/Users/buildslave/jenkins/workspace/clang-stage2-coverage-R/clang-build/module.cache -fcxx-modules -Wall -Wextra -Wno-unused-parameter -Wwrite-strings -Wcast-qual -Wmissing-field-initializers -pedantic -Wno-long-long -Wimplicit-fallthrough -Wcovered-switch-default -Wno-noexcept-type -Wnon-virtual-dtor -Wdelete-non-virtual-dtor -Wstring-conversion -fdiagnostics-color -fprofile-instr-generate='/Users/buildslave/jenkins/workspace/clang-stage2-coverage-R/clang-build/profiles/%6m.profraw' -fcoverage-mapping -fno-common -Woverloaded-virtual -Wno-nested-anon-types -O3 -DNDEBUG -isysroot /Applications/Xcode.app/Contents/Developer/Platforms/MacOSX.platform/Developer/SDKs/MacOSX10.14.sdk    -fno-exceptions -fno-rtti -MD -MT tools/clang/tools/extra/clangd/CMakeFiles/obj.clangDaemon.dir/ClangdLSPServer.cpp.o -MF tools/clang/tools/extra/clangd/CMakeFiles/obj.clangDaemon.dir/ClangdLSPServer.cpp.o.d -o tools/clang/tools/extra/clangd/CMakeFiles/obj.clangDaemon.dir/ClangdLSPServer.cpp.o -c /Users/buildslave/jenkins/workspace/clang-stage2-coverage-R/llvm/tools/clang/tools/extra/clangd/ClangdLSPServer.cpp
[4043/4613] /Users/buildslave/jenkins/workspace/clang-stage2-coverage-R/host-compiler/bin/clang++  -DGTEST_HAS_RTTI=0 -D_GNU_SOURCE -D__STDC_CONSTANT_MACROS -D__STDC_FORMAT_MACROS -D__STDC_LIMIT_MACROS -Itools/clang/tools/extra/clangd -I/Users/buildslave/jenkins/workspace/clang-stage2-coverage-R/llvm/tools/clang/tools/extra/clangd -I/Users/buildslave/jenkins/workspace/clang-stage2-coverage-R/llvm/tools/clang/include -Itools/clang/include -I/Applications/Xcode.app/Contents/Developer/Platforms/MacOSX.platform/Developer/SDKs/MacOSX10.14.sdk/usr/include/libxml2 -Iinclude -I/Users/buildslave/jenkins/workspace/clang-stage2-coverage-R/llvm/include -fPIC -fvisibility-inlines-hidden -Werror=date-time -Werror=unguarded-availability-new -std=c++11 -fmodules -fmodules-cache-path=/Users/buildslave/jenkins/workspace/clang-stage2-coverage-R/clang-build/module.cache -fcxx-modules -Wall -Wextra -Wno-unused-parameter -Wwrite-strings -Wcast-qual -Wmissing-field-initializers -pedantic -Wno-long-long -Wimplicit-fallthrough -Wcovered-switch-default -Wno-noexcept-type -Wnon-virtual-dtor -Wdelete-non-virtual-dtor -Wstring-conversion -fdiagnostics-color -fprofile-instr-generate='/Users/buildslave/jenkins/workspace/clang-stage2-coverage-R/clang-build/profiles/%6m.profraw' -fcoverage-mapping -fno-common -Woverloaded-virtual -Wno-nested-anon-types -O3 -DNDEBUG -isysroot /Applications/Xcode.app/Contents/Developer/Platforms/MacOSX.platform/Developer/SDKs/MacOSX10.14.sdk    -fno-exceptions -fno-rtti -MD -MT tools/clang/tools/extra/clangd/CMakeFiles/obj.clangDaemon.dir/IncludeFixer.cpp.o -MF tools/clang/tools/extra/clangd/CMakeFiles/obj.clangDaemon.dir/IncludeFixer.cpp.o.d -o tools/clang/tools/extra/clangd/CMakeFiles/obj.clangDaemon.dir/IncludeFixer.cpp.o -c /Users/buildslave/jenkins/workspace/clang-stage2-coverage-R/llvm/tools/clang/tools/extra/clangd/IncludeFixer.cpp
[4044/4613] /Users/buildslave/jenkins/workspace/clang-stage2-coverage-R/host-compiler/bin/clang++  -DGTEST_HAS_RTTI=0 -D_GNU_SOURCE -D__STDC_CONSTANT_MACROS -D__STDC_FORMAT_MACROS -D__STDC_LIMIT_MACROS -Itools/clang/tools/extra/clangd -I/Users/buildslave/jenkins/workspace/clang-stage2-coverage-R/llvm/tools/clang/tools/extra/clangd -I/Users/buildslave/jenkins/workspace/clang-stage2-coverage-R/llvm/tools/clang/include -Itools/clang/include -I/Applications/Xcode.app/Contents/Developer/Platforms/MacOSX.platform/Developer/SDKs/MacOSX10.14.sdk/usr/include/libxml2 -Iinclude -I/Users/buildslave/jenkins/workspace/clang-stage2-coverage-R/llvm/include -fPIC -fvisibility-inlines-hidden -Werror=date-time -Werror=unguarded-availability-new -std=c++11 -fmodules -fmodules-cache-path=/Users/buildslave/jenkins/workspace/clang-stage2-coverage-R/clang-build/module.cache -fcxx-modules -Wall -Wextra -Wno-unused-parameter -Wwrite-strings -Wcast-qual -Wmissing-field-initializers -pedantic -Wno-long-long -Wimplicit-fallthrough -Wcovered-switch-default -Wno-noexcept-type -Wnon-virtual-dtor -Wdelete-non-virtual-dtor -Wstring-conversion -fdiagnostics-color -fprofile-instr-generate='/Users/buildslave/jenkins/workspace/clang-stage2-coverage-R/clang-build/profiles/%6m.profraw' -fcoverage-mapping -fno-common -Woverloaded-virtual -Wno-nested-anon-types -O3 -DNDEBUG -isysroot /Applications/Xcode.app/Contents/Developer/Platforms/MacOSX.platform/Developer/SDKs/MacOSX10.14.sdk    -fno-exceptions -fno-rtti -MD -MT tools/clang/tools/extra/clangd/CMakeFiles/obj.clangDaemon.dir/Logger.cpp.o -MF tools/clang/tools/extra/clangd/CMakeFiles/obj.clangDaemon.dir/Logger.cpp.o.d -o tools/clang/tools/extra/clangd/CMakeFiles/obj.clangDaemon.dir/Logger.cpp.o -c /Users/buildslave/jenkins/workspace/clang-stage2-coverage-R/llvm/tools/clang/tools/extra/clangd/Logger.cpp
[4045/4613] /Users/buildslave/jenkins/workspace/clang-stage2-coverage-R/host-compiler/bin/clang++  -DGTEST_HAS_RTTI=0 -D_GNU_SOURCE -D__STDC_CONSTANT_MACROS -D__STDC_FORMAT_MACROS -D__STDC_LIMIT_MACROS -Itools/clang/tools/extra/clangd -I/Users/buildslave/jenkins/workspace/clang-stage2-coverage-R/llvm/tools/clang/tools/extra/clangd -I/Users/buildslave/jenkins/workspace/clang-stage2-coverage-R/llvm/tools/clang/include -Itools/clang/include -I/Applications/Xcode.app/Contents/Developer/Platforms/MacOSX.platform/Developer/SDKs/MacOSX10.14.sdk/usr/include/libxml2 -Iinclude -I/Users/buildslave/jenkins/workspace/clang-stage2-coverage-R/llvm/include -fPIC -fvisibility-inlines-hidden -Werror=date-time -Werror=unguarded-availability-new -std=c++11 -fmodules -fmodules-cache-path=/Users/buildslave/jenkins/workspace/clang-stage2-coverage-R/clang-build/module.cache -fcxx-modules -Wall -Wextra -Wno-unused-parameter -Wwrite-strings -Wcast-qual -Wmissing-field-initializers -pedantic -Wno-long-long -Wimplicit-fallthrough -Wcovered-switch-default -Wno-noexcept-type -Wnon-virtual-dtor -Wdelete-non-virtual-dtor -Wstring-conversion -fdiagnostics-color -fprofile-instr-generate='/Users/buildslave/jenkins/workspace/clang-stage2-coverage-R/clang-build/profiles/%6m.profraw' -fcoverage-mapping -fno-common -Woverloaded-virtual -Wno-nested-anon-types -O3 -DNDEBUG -isysroot /Applications/Xcode.app/Contents/Developer/Platforms/MacOSX.platform/Developer/SDKs/MacOSX10.14.sdk    -fno-exceptions -fno-rtti -MD -MT tools/clang/tools/extra/clangd/CMakeFiles/obj.clangDaemon.dir/GlobalCompilationDatabase.cpp.o -MF tools/clang/tools/extra/clangd/CMakeFiles/obj.clangDaemon.dir/GlobalCompilationDatabase.cpp.o.d -o tools/clang/tools/extra/clangd/CMakeFiles/obj.clangDaemon.dir/GlobalCompilationDatabase.cpp.o -c /Users/buildslave/jenkins/workspace/clang-stage2-coverage-R/llvm/tools/clang/tools/extra/clangd/GlobalCompilationDatabase.cpp
[4046/4613] /Users/buildslave/jenkins/workspace/clang-stage2-coverage-R/host-compiler/bin/clang++  -DGTEST_HAS_RTTI=0 -D_GNU_SOURCE -D__STDC_CONSTANT_MACROS -D__STDC_FORMAT_MACROS -D__STDC_LIMIT_MACROS -Itools/clang/tools/extra/clangd -I/Users/buildslave/jenkins/workspace/clang-stage2-coverage-R/llvm/tools/clang/tools/extra/clangd -I/Users/buildslave/jenkins/workspace/clang-stage2-coverage-R/llvm/tools/clang/include -Itools/clang/include -I/Applications/Xcode.app/Contents/Developer/Platforms/MacOSX.platform/Developer/SDKs/MacOSX10.14.sdk/usr/include/libxml2 -Iinclude -I/Users/buildslave/jenkins/workspace/clang-stage2-coverage-R/llvm/include -fPIC -fvisibility-inlines-hidden -Werror=date-time -Werror=unguarded-availability-new -std=c++11 -fmodules -fmodules-cache-path=/Users/buildslave/jenkins/workspace/clang-stage2-coverage-R/clang-build/module.cache -fcxx-modules -Wall -Wextra -Wno-unused-parameter -Wwrite-strings -Wcast-qual -Wmissing-field-initializers -pedantic -Wno-long-long -Wimplicit-fallthrough -Wcovered-switch-default -Wno-noexcept-type -Wnon-virtual-dtor -Wdelete-non-virtual-dtor -Wstring-conversion -fdiagnostics-color -fprofile-instr-generate='/Users/buildslave/jenkins/workspace/clang-stage2-coverage-R/clang-build/profiles/%6m.profraw' -fcoverage-mapping -fno-common -Woverloaded-virtual -Wno-nested-anon-types -O3 -DNDEBUG -isysroot /Applications/Xcode.app/Contents/Developer/Platforms/MacOSX.platform/Developer/SDKs/MacOSX10.14.sdk    -fno-exceptions -fno-rtti -MD -MT tools/clang/tools/extra/clangd/CMakeFiles/obj.clangDaemon.dir/RIFF.cpp.o -MF tools/clang/tools/extra/clangd/CMakeFiles/obj.clangDaemon.dir/RIFF.cpp.o.d -o tools/clang/tools/extra/clangd/CMakeFiles/obj.clangDaemon.dir/RIFF.cpp.o -c /Users/buildslave/jenkins/workspace/clang-stage2-coverage-R/llvm/tools/clang/tools/extra/clangd/RIFF.cpp
[4047/4613] /Users/buildslave/jenkins/workspace/clang-stage2-coverage-R/host-compiler/bin/clang++  -DGTEST_HAS_RTTI=0 -D_GNU_SOURCE -D__STDC_CONSTANT_MACROS -D__STDC_FORMAT_MACROS -D__STDC_LIMIT_MACROS -Itools/clang/tools/extra/clangd -I/Users/buildslave/jenkins/workspace/clang-stage2-coverage-R/llvm/tools/clang/tools/extra/clangd -I/Users/buildslave/jenkins/workspace/clang-stage2-coverage-R/llvm/tools/clang/include -Itools/clang/include -I/Applications/Xcode.app/Contents/Developer/Platforms/MacOSX.platform/Developer/SDKs/MacOSX10.14.sdk/usr/include/libxml2 -Iinclude -I/Users/buildslave/jenkins/workspace/clang-stage2-coverage-R/llvm/include -fPIC -fvisibility-inlines-hidden -Werror=date-time -Werror=unguarded-availability-new -std=c++11 -fmodules -fmodules-cache-path=/Users/buildslave/jenkins/workspace/clang-stage2-coverage-R/clang-build/module.cache -fcxx-modules -Wall -Wextra -Wno-unused-parameter -Wwrite-strings -Wcast-qual -Wmissing-field-initializers -pedantic -Wno-long-long -Wimplicit-fallthrough -Wcovered-switch-default -Wno-noexcept-type -Wnon-virtual-dtor -Wdelete-non-virtual-dtor -Wstring-conversion -fdiagnostics-color -fprofile-instr-generate='/Users/buildslave/jenkins/workspace/clang-stage2-coverage-R/clang-build/profiles/%6m.profraw' -fcoverage-mapping -fno-common -Woverloaded-virtual -Wno-nested-anon-types -O3 -DNDEBUG -isysroot /Applications/Xcode.app/Contents/Developer/Platforms/MacOSX.platform/Developer/SDKs/MacOSX10.14.sdk    -fno-exceptions -fno-rtti -MD -MT tools/clang/tools/extra/clangd/CMakeFiles/obj.clangDaemon.dir/Quality.cpp.o -MF tools/clang/tools/extra/clangd/CMakeFiles/obj.clangDaemon.dir/Quality.cpp.o.d -o tools/clang/tools/extra/clangd/CMakeFiles/obj.clangDaemon.dir/Quality.cpp.o -c /Users/buildslave/jenkins/workspace/clang-stage2-coverage-R/llvm/tools/clang/tools/extra/clangd/Quality.cpp
[4048/4613] /Users/buildslave/jenkins/workspace/clang-stage2-coverage-R/host-compiler/bin/clang++  -DGTEST_HAS_RTTI=0 -D_GNU_SOURCE -D__STDC_CONSTANT_MACROS -D__STDC_FORMAT_MACROS -D__STDC_LIMIT_MACROS -Itools/clang/tools/extra/clangd -I/Users/buildslave/jenkins/workspace/clang-stage2-coverage-R/llvm/tools/clang/tools/extra/clangd -I/Users/buildslave/jenkins/workspace/clang-stage2-coverage-R/llvm/tools/clang/include -Itools/clang/include -I/Applications/Xcode.app/Contents/Developer/Platforms/MacOSX.platform/Developer/SDKs/MacOSX10.14.sdk/usr/include/libxml2 -Iinclude -I/Users/buildslave/jenkins/workspace/clang-stage2-coverage-R/llvm/include -fPIC -fvisibility-inlines-hidden -Werror=date-time -Werror=unguarded-availability-new -std=c++11 -fmodules -fmodules-cache-path=/Users/buildslave/jenkins/workspace/clang-stage2-coverage-R/clang-build/module.cache -fcxx-modules -Wall -Wextra -Wno-unused-parameter -Wwrite-strings -Wcast-qual -Wmissing-field-initializers -pedantic -Wno-long-long -Wimplicit-fallthrough -Wcovered-switch-default -Wno-noexcept-type -Wnon-virtual-dtor -Wdelete-non-virtual-dtor -Wstring-conversion -fdiagnostics-color -fprofile-instr-generate='/Users/buildslave/jenkins/workspace/clang-stage2-coverage-R/clang-build/profiles/%6m.profraw' -fcoverage-mapping -fno-common -Woverloaded-virtual -Wno-nested-anon-types -O3 -DNDEBUG -isysroot /Applications/Xcode.app/Contents/Developer/Platforms/MacOSX.platform/Developer/SDKs/MacOSX10.14.sdk    -fno-exceptions -fno-rtti -MD -MT tools/clang/tools/extra/clangd/CMakeFiles/obj.clangDaemon.dir/Protocol.cpp.o -MF tools/clang/tools/extra/clangd/CMakeFiles/obj.clangDaemon.dir/Protocol.cpp.o.d -o tools/clang/tools/extra/clangd/CMakeFiles/obj.clangDaemon.dir/Protocol.cpp.o -c /Users/buildslave/jenkins/workspace/clang-stage2-coverage-R/llvm/tools/clang/tools/extra/clangd/Protocol.cpp
[4049/4613] /Users/buildslave/jenkins/workspace/clang-stage2-coverage-R/host-compiler/bin/clang++  -DGTEST_HAS_RTTI=0 -D_GNU_SOURCE -D__STDC_CONSTANT_MACROS -D__STDC_FORMAT_MACROS -D__STDC_LIMIT_MACROS -Itools/clang/tools/extra/clangd -I/Users/buildslave/jenkins/workspace/clang-stage2-coverage-R/llvm/tools/clang/tools/extra/clangd -I/Users/buildslave/jenkins/workspace/clang-stage2-coverage-R/llvm/tools/clang/include -Itools/clang/include -I/Applications/Xcode.app/Contents/Developer/Platforms/MacOSX.platform/Developer/SDKs/MacOSX10.14.sdk/usr/include/libxml2 -Iinclude -I/Users/buildslave/jenkins/workspace/clang-stage2-coverage-R/llvm/include -fPIC -fvisibility-inlines-hidden -Werror=date-time -Werror=unguarded-availability-new -std=c++11 -fmodules -fmodules-cache-path=/Users/buildslave/jenkins/workspace/clang-stage2-coverage-R/clang-build/module.cache -fcxx-modules -Wall -Wextra -Wno-unused-parameter -Wwrite-strings -Wcast-qual -Wmissing-field-initializers -pedantic -Wno-long-long -Wimplicit-fallthrough -Wcovered-switch-default -Wno-noexcept-type -Wnon-virtual-dtor -Wdelete-non-virtual-dtor -Wstring-conversion -fdiagnostics-color -fprofile-instr-generate='/Users/buildslave/jenkins/workspace/clang-stage2-coverage-R/clang-build/profiles/%6m.profraw' -fcoverage-mapping -fno-common -Woverloaded-virtual -Wno-nested-anon-types -O3 -DNDEBUG -isysroot /Applications/Xcode.app/Contents/Developer/Platforms/MacOSX.platform/Developer/SDKs/MacOSX10.14.sdk    -fno-exceptions -fno-rtti -MD -MT tools/clang/tools/extra/clangd/CMakeFiles/obj.clangDaemon.dir/SourceCode.cpp.o -MF tools/clang/tools/extra/clangd/CMakeFiles/obj.clangDaemon.dir/SourceCode.cpp.o.d -o tools/clang/tools/extra/clangd/CMakeFiles/obj.clangDaemon.dir/SourceCode.cpp.o -c /Users/buildslave/jenkins/workspace/clang-stage2-coverage-R/llvm/tools/clang/tools/extra/clangd/SourceCode.cpp
[4050/4613] /Users/buildslave/jenkins/workspace/clang-stage2-coverage-R/host-compiler/bin/clang++  -DGTEST_HAS_RTTI=0 -D_GNU_SOURCE -D__STDC_CONSTANT_MACROS -D__STDC_FORMAT_MACROS -D__STDC_LIMIT_MACROS -Itools/clang/tools/extra/clangd -I/Users/buildslave/jenkins/workspace/clang-stage2-coverage-R/llvm/tools/clang/tools/extra/clangd -I/Users/buildslave/jenkins/workspace/clang-stage2-coverage-R/llvm/tools/clang/include -Itools/clang/include -I/Applications/Xcode.app/Contents/Developer/Platforms/MacOSX.platform/Developer/SDKs/MacOSX10.14.sdk/usr/include/libxml2 -Iinclude -I/Users/buildslave/jenkins/workspace/clang-stage2-coverage-R/llvm/include -fPIC -fvisibility-inlines-hidden -Werror=date-time -Werror=unguarded-availability-new -std=c++11 -fmodules -fmodules-cache-path=/Users/buildslave/jenkins/workspace/clang-stage2-coverage-R/clang-build/module.cache -fcxx-modules -Wall -Wextra -Wno-unused-parameter -Wwrite-strings -Wcast-qual -Wmissing-field-initializers -pedantic -Wno-long-long -Wimplicit-fallthrough -Wcovered-switch-default -Wno-noexcept-type -Wnon-virtual-dtor -Wdelete-non-virtual-dtor -Wstring-conversion -fdiagnostics-color -fprofile-instr-generate='/Users/buildslave/jenkins/workspace/clang-stage2-coverage-R/clang-build/profiles/%6m.profraw' -fcoverage-mapping -fno-common -Woverloaded-virtual -Wno-nested-anon-types -O3 -DNDEBUG -isysroot /Applications/Xcode.app/Contents/Developer/Platforms/MacOSX.platform/Developer/SDKs/MacOSX10.14.sdk    -fno-exceptions -fno-rtti -MD -MT tools/clang/tools/extra/clangd/CMakeFiles/obj.clangDaemon.dir/Threading.cpp.o -MF tools/clang/tools/extra/clangd/CMakeFiles/obj.clangDaemon.dir/Threading.cpp.o.d -o tools/clang/tools/extra/clangd/CMakeFiles/obj.clangDaemon.dir/Threading.cpp.o -c /Users/buildslave/jenkins/workspace/clang-stage2-coverage-R/llvm/tools/clang/tools/extra/clangd/Threading.cpp
[4051/4613] /Users/buildslave/jenkins/workspace/clang-stage2-coverage-R/host-compiler/bin/clang++  -DGTEST_HAS_RTTI=0 -D_GNU_SOURCE -D__STDC_CONSTANT_MACROS -D__STDC_FORMAT_MACROS -D__STDC_LIMIT_MACROS -Itools/clang/tools/extra/clangd -I/Users/buildslave/jenkins/workspace/clang-stage2-coverage-R/llvm/tools/clang/tools/extra/clangd -I/Users/buildslave/jenkins/workspace/clang-stage2-coverage-R/llvm/tools/clang/include -Itools/clang/include -I/Applications/Xcode.app/Contents/Developer/Platforms/MacOSX.platform/Developer/SDKs/MacOSX10.14.sdk/usr/include/libxml2 -Iinclude -I/Users/buildslave/jenkins/workspace/clang-stage2-coverage-R/llvm/include -fPIC -fvisibility-inlines-hidden -Werror=date-time -Werror=unguarded-availability-new -std=c++11 -fmodules -fmodules-cache-path=/Users/buildslave/jenkins/workspace/clang-stage2-coverage-R/clang-build/module.cache -fcxx-modules -Wall -Wextra -Wno-unused-parameter -Wwrite-strings -Wcast-qual -Wmissing-field-initializers -pedantic -Wno-long-long -Wimplicit-fallthrough -Wcovered-switch-default -Wno-noexcept-type -Wnon-virtual-dtor -Wdelete-non-virtual-dtor -Wstring-conversion -fdiagnostics-color -fprofile-instr-generate='/Users/buildslave/jenkins/workspace/clang-stage2-coverage-R/clang-build/profiles/%6m.profraw' -fcoverage-mapping -fno-common -Woverloaded-virtual -Wno-nested-anon-types -O3 -DNDEBUG -isysroot /Applications/Xcode.app/Contents/Developer/Platforms/MacOSX.platform/Developer/SDKs/MacOSX10.14.sdk    -fno-exceptions -fno-rtti -MD -MT tools/clang/tools/extra/clangd/CMakeFiles/obj.clangDaemon.dir/Trace.cpp.o -MF tools/clang/tools/extra/clangd/CMakeFiles/obj.clangDaemon.dir/Trace.cpp.o.d -o tools/clang/tools/extra/clangd/CMakeFiles/obj.clangDaemon.dir/Trace.cpp.o -c /Users/buildslave/jenkins/workspace/clang-stage2-coverage-R/llvm/tools/clang/tools/extra/clangd/Trace.cpp
[4052/4613] /Users/buildslave/jenkins/workspace/clang-stage2-coverage-R/host-compiler/bin/clang++  -DGTEST_HAS_RTTI=0 -D_GNU_SOURCE -D__STDC_CONSTANT_MACROS -D__STDC_FORMAT_MACROS -D__STDC_LIMIT_MACROS -Itools/clang/tools/extra/clangd -I/Users/buildslave/jenkins/workspace/clang-stage2-coverage-R/llvm/tools/clang/tools/extra/clangd -I/Users/buildslave/jenkins/workspace/clang-stage2-coverage-R/llvm/tools/clang/include -Itools/clang/include -I/Applications/Xcode.app/Contents/Developer/Platforms/MacOSX.platform/Developer/SDKs/MacOSX10.14.sdk/usr/include/libxml2 -Iinclude -I/Users/buildslave/jenkins/workspace/clang-stage2-coverage-R/llvm/include -fPIC -fvisibility-inlines-hidden -Werror=date-time -Werror=unguarded-availability-new -std=c++11 -fmodules -fmodules-cache-path=/Users/buildslave/jenkins/workspace/clang-stage2-coverage-R/clang-build/module.cache -fcxx-modules -Wall -Wextra -Wno-unused-parameter -Wwrite-strings -Wcast-qual -Wmissing-field-initializers -pedantic -Wno-long-long -Wimplicit-fallthrough -Wcovered-switch-default -Wno-noexcept-type -Wnon-virtual-dtor -Wdelete-non-virtual-dtor -Wstring-conversion -fdiagnostics-color -fprofile-instr-generate='/Users/buildslave/jenkins/workspace/clang-stage2-coverage-R/clang-build/profiles/%6m.profraw' -fcoverage-mapping -fno-common -Woverloaded-virtual -Wno-nested-anon-types -O3 -DNDEBUG -isysroot /Applications/Xcode.app/Contents/Developer/Platforms/MacOSX.platform/Developer/SDKs/MacOSX10.14.sdk    -fno-exceptions -fno-rtti -MD -MT tools/clang/tools/extra/clangd/CMakeFiles/obj.clangDaemon.dir/QueryDriverDatabase.cpp.o -MF tools/clang/tools/extra/clangd/CMakeFiles/obj.clangDaemon.dir/QueryDriverDatabase.cpp.o.d -o tools/clang/tools/extra/clangd/CMakeFiles/obj.clangDaemon.dir/QueryDriverDatabase.cpp.o -c /Users/buildslave/jenkins/workspace/clang-stage2-coverage-R/llvm/tools/clang/tools/extra/clangd/QueryDriverDatabase.cpp
[4053/4613] /Users/buildslave/jenkins/workspace/clang-stage2-coverage-R/host-compiler/bin/clang++  -DGTEST_HAS_RTTI=0 -D_GNU_SOURCE -D__STDC_CONSTANT_MACROS -D__STDC_FORMAT_MACROS -D__STDC_LIMIT_MACROS -Itools/clang/tools/extra/clangd -I/Users/buildslave/jenkins/workspace/clang-stage2-coverage-R/llvm/tools/clang/tools/extra/clangd -I/Users/buildslave/jenkins/workspace/clang-stage2-coverage-R/llvm/tools/clang/include -Itools/clang/include -I/Applications/Xcode.app/Contents/Developer/Platforms/MacOSX.platform/Developer/SDKs/MacOSX10.14.sdk/usr/include/libxml2 -Iinclude -I/Users/buildslave/jenkins/workspace/clang-stage2-coverage-R/llvm/include -fPIC -fvisibility-inlines-hidden -Werror=date-time -Werror=unguarded-availability-new -std=c++11 -fmodules -fmodules-cache-path=/Users/buildslave/jenkins/workspace/clang-stage2-coverage-R/clang-build/module.cache -fcxx-modules -Wall -Wextra -Wno-unused-parameter -Wwrite-strings -Wcast-qual -Wmissing-field-initializers -pedantic -Wno-long-long -Wimplicit-fallthrough -Wcovered-switch-default -Wno-noexcept-type -Wnon-virtual-dtor -Wdelete-non-virtual-dtor -Wstring-conversion -fdiagnostics-color -fprofile-instr-generate='/Users/buildslave/jenkins/workspace/clang-stage2-coverage-R/clang-build/profiles/%6m.profraw' -fcoverage-mapping -fno-common -Woverloaded-virtual -Wno-nested-anon-types -O3 -DNDEBUG -isysroot /Applications/Xcode.app/Contents/Developer/Platforms/MacOSX.platform/Developer/SDKs/MacOSX10.14.sdk    -fno-exceptions -fno-rtti -MD -MT tools/clang/tools/extra/clangd/CMakeFiles/obj.clangDaemon.dir/URI.cpp.o -MF tools/clang/tools/extra/clangd/CMakeFiles/obj.clangDaemon.dir/URI.cpp.o.d -o tools/clang/tools/extra/clangd/CMakeFiles/obj.clangDaemon.dir/URI.cpp.o -c /Users/buildslave/jenkins/workspace/clang-stage2-coverage-R/llvm/tools/clang/tools/extra/clangd/URI.cpp
[4054/4613] /Users/buildslave/jenkins/workspace/clang-stage2-coverage-R/host-compiler/bin/clang++  -DGTEST_HAS_RTTI=0 -D_GNU_SOURCE -D__STDC_CONSTANT_MACROS -D__STDC_FORMAT_MACROS -D__STDC_LIMIT_MACROS -Itools/clang/tools/extra/clangd -I/Users/buildslave/jenkins/workspace/clang-stage2-coverage-R/llvm/tools/clang/tools/extra/clangd -I/Users/buildslave/jenkins/workspace/clang-stage2-coverage-R/llvm/tools/clang/include -Itools/clang/include -I/Applications/Xcode.app/Contents/Developer/Platforms/MacOSX.platform/Developer/SDKs/MacOSX10.14.sdk/usr/include/libxml2 -Iinclude -I/Users/buildslave/jenkins/workspace/clang-stage2-coverage-R/llvm/include -fPIC -fvisibility-inlines-hidden -Werror=date-time -Werror=unguarded-availability-new -std=c++11 -fmodules -fmodules-cache-path=/Users/buildslave/jenkins/workspace/clang-stage2-coverage-R/clang-build/module.cache -fcxx-modules -Wall -Wextra -Wno-unused-parameter -Wwrite-strings -Wcast-qual -Wmissing-field-initializers -pedantic -Wno-long-long -Wimplicit-fallthrough -Wcovered-switch-default -Wno-noexcept-type -Wnon-virtual-dtor -Wdelete-non-virtual-dtor -Wstring-conversion -fdiagnostics-color -fprofile-instr-generate='/Users/buildslave/jenkins/workspace/clang-stage2-coverage-R/clang-build/profiles/%6m.profraw' -fcoverage-mapping -fno-common -Woverloaded-virtual -Wno-nested-anon-types -O3 -DNDEBUG -isysroot /Applications/Xcode.app/Contents/Developer/Platforms/MacOSX.platform/Developer/SDKs/MacOSX10.14.sdk    -fno-exceptions -fno-rtti -MD -MT tools/clang/tools/extra/clangd/CMakeFiles/obj.clangDaemon.dir/Selection.cpp.o -MF tools/clang/tools/extra/clangd/CMakeFiles/obj.clangDaemon.dir/Selection.cpp.o.d -o tools/clang/tools/extra/clangd/CMakeFiles/obj.clangDaemon.dir/Selection.cpp.o -c /Users/buildslave/jenkins/workspace/clang-stage2-coverage-R/llvm/tools/clang/tools/extra/clangd/Selection.cpp
[4055/4613] /Users/buildslave/jenkins/workspace/clang-stage2-coverage-R/host-compiler/bin/clang++  -DGTEST_HAS_RTTI=0 -D_GNU_SOURCE -D__STDC_CONSTANT_MACROS -D__STDC_FORMAT_MACROS -D__STDC_LIMIT_MACROS -Itools/clang/tools/extra/clangd -I/Users/buildslave/jenkins/workspace/clang-stage2-coverage-R/llvm/tools/clang/tools/extra/clangd -I/Users/buildslave/jenkins/workspace/clang-stage2-coverage-R/llvm/tools/clang/include -Itools/clang/include -I/Applications/Xcode.app/Contents/Developer/Platforms/MacOSX.platform/Developer/SDKs/MacOSX10.14.sdk/usr/include/libxml2 -Iinclude -I/Users/buildslave/jenkins/workspace/clang-stage2-coverage-R/llvm/include -fPIC -fvisibility-inlines-hidden -Werror=date-time -Werror=unguarded-availability-new -std=c++11 -fmodules -fmodules-cache-path=/Users/buildslave/jenkins/workspace/clang-stage2-coverage-R/clang-build/module.cache -fcxx-modules -Wall -Wextra -Wno-unused-parameter -Wwrite-strings -Wcast-qual -Wmissing-field-initializers -pedantic -Wno-long-long -Wimplicit-fallthrough -Wcovered-switch-default -Wno-noexcept-type -Wnon-virtual-dtor -Wdelete-non-virtual-dtor -Wstring-conversion -fdiagnostics-color -fprofile-instr-generate='/Users/buildslave/jenkins/workspace/clang-stage2-coverage-R/clang-build/profiles/%6m.profraw' -fcoverage-mapping -fno-common -Woverloaded-virtual -Wno-nested-anon-types -O3 -DNDEBUG -isysroot /Applications/Xcode.app/Contents/Developer/Platforms/MacOSX.platform/Developer/SDKs/MacOSX10.14.sdk    -fno-exceptions -fno-rtti -MD -MT tools/clang/tools/extra/clangd/CMakeFiles/obj.clangDaemon.dir/SemanticHighlighting.cpp.o -MF tools/clang/tools/extra/clangd/CMakeFiles/obj.clangDaemon.dir/SemanticHighlighting.cpp.o.d -o tools/clang/tools/extra/clangd/CMakeFiles/obj.clangDaemon.dir/SemanticHighlighting.cpp.o -c /Users/buildslave/jenkins/workspace/clang-stage2-coverage-R/llvm/tools/clang/tools/extra/clangd/SemanticHighlighting.cpp
[4056/4613] /Users/buildslave/jenkins/workspace/clang-stage2-coverage-R/host-compiler/bin/clang++  -DGTEST_HAS_RTTI=0 -D_GNU_SOURCE -D__STDC_CONSTANT_MACROS -D__STDC_FORMAT_MACROS -D__STDC_LIMIT_MACROS -Itools/clang/tools/extra/clangd -I/Users/buildslave/jenkins/workspace/clang-stage2-coverage-R/llvm/tools/clang/tools/extra/clangd -I/Users/buildslave/jenkins/workspace/clang-stage2-coverage-R/llvm/tools/clang/include -Itools/clang/include -I/Applications/Xcode.app/Contents/Developer/Platforms/MacOSX.platform/Developer/SDKs/MacOSX10.14.sdk/usr/include/libxml2 -Iinclude -I/Users/buildslave/jenkins/workspace/clang-stage2-coverage-R/llvm/include -fPIC -fvisibility-inlines-hidden -Werror=date-time -Werror=unguarded-availability-new -std=c++11 -fmodules -fmodules-cache-path=/Users/buildslave/jenkins/workspace/clang-stage2-coverage-R/clang-build/module.cache -fcxx-modules -Wall -Wextra -Wno-unused-parameter -Wwrite-strings -Wcast-qual -Wmissing-field-initializers -pedantic -Wno-long-long -Wimplicit-fallthrough -Wcovered-switch-default -Wno-noexcept-type -Wnon-virtual-dtor -Wdelete-non-virtual-dtor -Wstring-conversion -fdiagnostics-color -fprofile-instr-generate='/Users/buildslave/jenkins/workspace/clang-stage2-coverage-R/clang-build/profiles/%6m.profraw' -fcoverage-mapping -fno-common -Woverloaded-virtual -Wno-nested-anon-types -O3 -DNDEBUG -isysroot /Applications/Xcode.app/Contents/Developer/Platforms/MacOSX.platform/Developer/SDKs/MacOSX10.14.sdk    -fno-exceptions -fno-rtti -MD -MT tools/clang/tools/extra/clangd/CMakeFiles/obj.clangDaemon.dir/FindSymbols.cpp.o -MF tools/clang/tools/extra/clangd/CMakeFiles/obj.clangDaemon.dir/FindSymbols.cpp.o.d -o tools/clang/tools/extra/clangd/CMakeFiles/obj.clangDaemon.dir/FindSymbols.cpp.o -c /Users/buildslave/jenkins/workspace/clang-stage2-coverage-R/llvm/tools/clang/tools/extra/clangd/FindSymbols.cpp
FAILED: tools/clang/tools/extra/clangd/CMakeFiles/obj.clangDaemon.dir/FindSymbols.cpp.o 
/Users/buildslave/jenkins/workspace/clang-stage2-coverage-R/host-compiler/bin/clang++  -DGTEST_HAS_RTTI=0 -D_GNU_SOURCE -D__STDC_CONSTANT_MACROS -D__STDC_FORMAT_MACROS -D__STDC_LIMIT_MACROS -Itools/clang/tools/extra/clangd -I/Users/buildslave/jenkins/workspace/clang-stage2-coverage-R/llvm/tools/clang/tools/extra/clangd -I/Users/buildslave/jenkins/workspace/clang-stage2-coverage-R/llvm/tools/clang/include -Itools/clang/include -I/Applications/Xcode.app/Contents/Developer/Platforms/MacOSX.platform/Developer/SDKs/MacOSX10.14.sdk/usr/include/libxml2 -Iinclude -I/Users/buildslave/jenkins/workspace/clang-stage2-coverage-R/llvm/include -fPIC -fvisibility-inlines-hidden -Werror=date-time -Werror=unguarded-availability-new -std=c++11 -fmodules -fmodules-cache-path=/Users/buildslave/jenkins/workspace/clang-stage2-coverage-R/clang-build/module.cache -fcxx-modules -Wall -Wextra -Wno-unused-parameter -Wwrite-strings -Wcast-qual -Wmissing-field-initializers -pedantic -Wno-long-long -Wimplicit-fallthrough -Wcovered-switch-default -Wno-noexcept-type -Wnon-virtual-dtor -Wdelete-non-virtual-dtor -Wstring-conversion -fdiagnostics-color -fprofile-instr-generate='/Users/buildslave/jenkins/workspace/clang-stage2-coverage-R/clang-build/profiles/%6m.profraw' -fcoverage-mapping -fno-common -Woverloaded-virtual -Wno-nested-anon-types -O3 -DNDEBUG -isysroot /Applications/Xcode.app/Contents/Developer/Platforms/MacOSX.platform/Developer/SDKs/MacOSX10.14.sdk    -fno-exceptions -fno-rtti -MD -MT tools/clang/tools/extra/clangd/CMakeFiles/obj.clangDaemon.dir/FindSymbols.cpp.o -MF tools/clang/tools/extra/clangd/CMakeFiles/obj.clangDaemon.dir/FindSymbols.cpp.o.d -o tools/clang/tools/extra/clangd/CMakeFiles/obj.clangDaemon.dir/FindSymbols.cpp.o -c /Users/buildslave/jenkins/workspace/clang-stage2-coverage-R/llvm/tools/clang/tools/extra/clangd/FindSymbols.cpp
Assertion failed: (CachedFieldIndex && "failed to find field in parent"), function getFieldIndex, file /Users/buildslave/jenkins/workspace/clang-stage1-configure-RA/llvm/tools/clang/lib/AST/Decl.cpp, line 3965.
Stack dump:
0.	Program arguments: /Users/buildslave/jenkins/workspace/clang-stage2-coverage-R/host-compiler/bin/clang-9 -cc1 -triple x86_64-apple-macosx10.14.0 -Wdeprecated-objc-isa-usage -Werror=deprecated-objc-isa-usage -emit-obj -disable-free -main-file-name FindSymbols.cpp -mrelocation-model pic -pic-level 2 -mthread-model posix -mdisable-fp-elim -masm-verbose -munwind-tables -target-sdk-version=10.14 -target-cpu penryn -dwarf-column-info -debugger-tuning=lldb -ggnu-pubnames -target-linker-version 409.12 -fprofile-instrument-path=/Users/buildslave/jenkins/workspace/clang-stage2-coverage-R/clang-build/profiles/%6m.profraw -fprofile-instrument=clang -fcoverage-mapping -coverage-notes-file /Users/buildslave/jenkins/workspace/clang-stage2-coverage-R/clang-build/tools/clang/tools/extra/clangd/CMakeFiles/obj.clangDaemon.dir/FindSymbols.cpp.gcno -resource-dir /Users/buildslave/jenkins/workspace/clang-stage2-coverage-R/host-compiler/lib/clang/9.0.0 -dependency-file tools/clang/tools/extra/clangd/CMakeFiles/obj.clangDaemon.dir/FindSymbols.cpp.o.d -sys-header-deps -MT tools/clang/tools/extra/clangd/CMakeFiles/obj.clangDaemon.dir/FindSymbols.cpp.o -isysroot /Applications/Xcode.app/Contents/Developer/Platforms/MacOSX.platform/Developer/SDKs/MacOSX10.14.sdk -D GTEST_HAS_RTTI=0 -D _GNU_SOURCE -D __STDC_CONSTANT_MACROS -D __STDC_FORMAT_MACROS -D __STDC_LIMIT_MACROS -I tools/clang/tools/extra/clangd -I /Users/buildslave/jenkins/workspace/clang-stage2-coverage-R/llvm/tools/clang/tools/extra/clangd -I /Users/buildslave/jenkins/workspace/clang-stage2-coverage-R/llvm/tools/clang/include -I tools/clang/include -I /Applications/Xcode.app/Contents/Developer/Platforms/MacOSX.platform/Developer/SDKs/MacOSX10.14.sdk/usr/include/libxml2 -I include -I /Users/buildslave/jenkins/workspace/clang-stage2-coverage-R/llvm/include -D NDEBUG -stdlib=libc++ -internal-isystem /Users/buildslave/jenkins/workspace/clang-stage2-coverage-R/host-compiler/bin/../include/c++/v1 -internal-isystem /Applications/Xcode.app/Contents/Developer/Platforms/MacOSX.platform/Developer/SDKs/MacOSX10.14.sdk/usr/include/c++/v1 -internal-isystem /Applications/Xcode.app/Contents/Developer/Platforms/MacOSX.platform/Developer/SDKs/MacOSX10.14.sdk/usr/local/include -internal-isystem /Users/buildslave/jenkins/workspace/clang-stage2-coverage-R/host-compiler/lib/clang/9.0.0/include -internal-externc-isystem /Applications/Xcode.app/Contents/Developer/Platforms/MacOSX.platform/Developer/SDKs/MacOSX10.14.sdk/usr/include -O3 -Werror=date-time -Werror=unguarded-availability-new -Wall -Wextra -Wno-unused-parameter -Wwrite-strings -Wcast-qual -Wmissing-field-initializers -Wno-long-long -Wimplicit-fallthrough -Wcovered-switch-default -Wno-noexcept-type -Wnon-virtual-dtor -Wdelete-non-virtual-dtor -Wstring-conversion -Woverloaded-virtual -Wno-nested-anon-types -pedantic -std=c++11 -fdeprecated-macro -fdebug-compilation-dir /Users/buildslave/jenkins/workspace/clang-stage2-coverage-R/clang-build -ferror-limit 19 -fmessage-length 0 -fvisibility-inlines-hidden -stack-protector 1 -fblocks -fencode-extended-block-signature -fno-rtti -fregister-global-dtors-with-atexit -fmodules -fimplicit-module-maps -fmodules-cache-path=/Users/buildslave/jenkins/workspace/clang-stage2-coverage-R/clang-build/module.cache -fmodules-validate-system-headers -fobjc-runtime=macosx-10.14.0 -fmax-type-align=16 -fno-common -fdiagnostics-show-option -fcolor-diagnostics -vectorize-loops -vectorize-slp -o tools/clang/tools/extra/clangd/CMakeFiles/obj.clangDaemon.dir/FindSymbols.cpp.o -x c++ /Users/buildslave/jenkins/workspace/clang-stage2-coverage-R/llvm/tools/clang/tools/extra/clangd/FindSymbols.cpp 
1.	<eof> parser at end of file
2.	Per-file LLVM IR generation
3.	/Users/buildslave/jenkins/workspace/clang-stage2-coverage-R/llvm/include/llvm/Support/Error.h:625:17: Generating code for declaration 'llvm::Expected<std::__1::basic_string<char> >::getStorage'
0  clang-9                  0x0000000103858d78 llvm::sys::PrintStackTrace(llvm::raw_ostream&) + 40
1  clang-9                  0x0000000103857f25 llvm::sys::RunSignalHandlers() + 85
2  clang-9                  0x0000000103859388 SignalHandler(int) + 264
3  libsystem_platform.dylib 0x00007fff5c09eb3d _sigtramp + 29
4  clang-9                  0x00000001037ba156 llvm::FoldingSetBase::FindNodeOrInsertPos(llvm::FoldingSetNodeID const&, void*&) + 182
5  libsystem_c.dylib        0x00007fff5bf5d1c9 abort + 127
6  libsystem_c.dylib        0x00007fff5bf25868 basename_r + 0
7  clang-9                  0x00000001055d6dd6 clang::FieldDecl::getFieldIndex() const + 694
8  clang-9                  0x0000000103b496e5 clang::CodeGen::CodeGenFunction::EmitLValueForField(clang::CodeGen::LValue, clang::FieldDecl const*) + 1413
9  clang-9                  0x0000000103b5440f clang::CodeGen::CodeGenFunction::EmitMemberExpr(clang::MemberExpr const*) + 1247
10 clang-9                  0x0000000103b4607a clang::CodeGen::CodeGenFunction::EmitLValue(clang::Expr const*) + 1018
11 clang-9                  0x0000000103b4e56d clang::CodeGen::CodeGenFunction::EmitCheckedLValue(clang::Expr const*, clang::CodeGen::CodeGenFunction::TypeCheckKind) + 173
12 clang-9                  0x0000000103b54066 clang::CodeGen::CodeGenFunction::EmitMemberExpr(clang::MemberExpr const*) + 310
13 clang-9                  0x0000000103b4607a clang::CodeGen::CodeGenFunction::EmitLValue(clang::Expr const*) + 1018
14 clang-9                  0x0000000103b5562c clang::CodeGen::CodeGenFunction::EmitCastLValue(clang::CastExpr const*) + 1372
15 clang-9                  0x0000000103b45cff clang::CodeGen::CodeGenFunction::EmitLValue(clang::Expr const*) + 127
16 clang-9                  0x0000000103b4e56d clang::CodeGen::CodeGenFunction::EmitCheckedLValue(clang::Expr const*, clang::CodeGen::CodeGenFunction::TypeCheckKind) + 173
17 clang-9                  0x0000000103b54066 clang::CodeGen::CodeGenFunction::EmitMemberExpr(clang::MemberExpr const*) + 310
18 clang-9                  0x0000000103b4607a clang::CodeGen::CodeGenFunction::EmitLValue(clang::Expr const*) + 1018
19 clang-9                  0x0000000103b4de77 clang::CodeGen::CodeGenFunction::EmitArrayToPointerDecay(clang::Expr const*, clang::CodeGen::LValueBaseInfo*, clang::CodeGen::TBAAAccessInfo*) + 119
20 clang-9                  0x0000000103b9ebd8 (anonymous namespace)::ScalarExprEmitter::VisitCastExpr(clang::CastExpr*) + 3896
21 clang-9                  0x0000000103b9dd44 (anonymous namespace)::ScalarExprEmitter::VisitCastExpr(clang::CastExpr*) + 164
22 clang-9                  0x0000000103b8bdc8 clang::CodeGen::CodeGenFunction::EmitScalarExpr(clang::Expr const*, bool) + 104
23 clang-9                  0x0000000103c807a6 clang::CodeGen::CodeGenFunction::EmitReturnStmt(clang::ReturnStmt const&) + 1430
24 clang-9                  0x0000000103c7d9b2 clang::CodeGen::CodeGenFunction::EmitStmt(clang::Stmt const*, llvm::ArrayRef<clang::Attr const*>) + 2482
25 clang-9                  0x0000000103c85d8a clang::CodeGen::CodeGenFunction::EmitCompoundStmtWithoutScope(clang::CompoundStmt const&, bool, clang::CodeGen::AggValueSlot) + 186
26 clang-9                  0x0000000103cc5a87 clang::CodeGen::CodeGenFunction::GenerateCode(clang::GlobalDecl, llvm::Function*, clang::CodeGen::CGFunctionInfo const&) + 791
27 clang-9                  0x0000000103ce0827 clang::CodeGen::CodeGenModule::EmitGlobalFunctionDefinition(clang::GlobalDecl, llvm::GlobalValue*) + 503
28 clang-9                  0x0000000103cda746 clang::CodeGen::CodeGenModule::EmitGlobalDefinition(clang::GlobalDecl, llvm::GlobalValue*) + 486
29 clang-9                  0x0000000103cd0731 clang::CodeGen::CodeGenModule::EmitDeferred() + 289
30 clang-9                  0x0000000103cd0759 clang::CodeGen::CodeGenModule::EmitDeferred() + 329
31 clang-9                  0x0000000103cd0759 clang::CodeGen::CodeGenModule::EmitDeferred() + 329
32 clang-9                  0x0000000103ccfa2a clang::CodeGen::CodeGenModule::Release() + 42
33 clang-9                  0x0000000103d57864 (anonymous namespace)::CodeGeneratorImpl::HandleTranslationUnit(clang::ASTContext&) + 100
34 clang-9                  0x0000000103cbc4b6 clang::BackendConsumer::HandleTranslationUnit(clang::ASTContext&) + 134
35 clang-9                  0x0000000104bb8a23 clang::ParseAST(clang::Sema&, bool, bool) + 611
36 clang-9                  0x0000000103f3c114 clang::FrontendAction::Execute() + 84
37 clang-9                  0x0000000103eedab8 clang::CompilerInstance::ExecuteAction(clang::FrontendAction&) + 1544
38 clang-9                  0x0000000103fb4810 clang::ExecuteCompilerInvocation(clang::CompilerInstance*) + 1808
39 clang-9                  0x0000000101c744a4 cc1_main(llvm::ArrayRef<char const*>, char const*, void*) + 2356
40 clang-9                  0x0000000101c71c03 main + 10851
41 libdyld.dylib            0x00007fff5beb5085 start + 1
clang-9: error: unable to execute command: Abort trap: 6
clang-9: error: clang frontend command failed due to signal (use -v to see invocation)
clang version 9.0.0 (trunk)
Target: x86_64-apple-darwin18.0.0
Thread model: posix
InstalledDir: /Users/buildslave/jenkins/workspace/clang-stage2-coverage-R/host-compiler/bin
clang-9: note: diagnostic msg: PLEASE submit a bug report to https://bugs.llvm.org/ and include the crash backtrace, preprocessed source, and associated run script.
clang-9: note: diagnostic msg: 
********************

Hide Details

PLEASE ATTACH THE FOLLOWING FILES TO THE BUG REPORT: Preprocessed source(s) and associated run script(s) are located at: clang-9: note: diagnostic msg: /var/folders/09/r4vw4v8n5kb67jl66zvlbljw0000gn/T/FindSymbols-b7261c.cpp clang-9: note: diagnostic msg: /var/folders/09/r4vw4v8n5kb67jl66zvlbljw0000gn/T/FindSymbols-b7261c.cache clang-9: note: diagnostic msg: /var/folders/09/r4vw4v8n5kb67jl66zvlbljw0000gn/T/FindSymbols-b7261c.sh clang-9: note: diagnostic msg: Crash backtrace is located in clang-9: note: diagnostic msg: /Users/buildslave/Library/Logs/DiagnosticReports/clang-9_<YYYY-MM-DD-HHMMSS>_<hostname>.crash clang-9: note: diagnostic msg: (choose the .crash file that corresponds to your crash) clang-9: note: diagnostic msg:

Hide Details

******************** [4057/4613] /Users/buildslave/jenkins/workspace/clang-stage2-coverage-R/host-compiler/bin/clang++ -DGTEST_HAS_RTTI=0 -D_GNU_SOURCE -D__STDC_CONSTANT_MACROS -D__STDC_FORMAT_MACROS -D__STDC_LIMIT_MACROS -Itools/clang/tools/extra/clangd -I/Users/buildslave/jenkins/workspace/clang-stage2-coverage-R/llvm/tools/clang/tools/extra/clangd -I/Users/buildslave/jenkins/workspace/clang-stage2-coverage-R/llvm/tools/clang/include -Itools/clang/include -I/Applications/Xcode.app/Contents/Developer/Platforms/MacOSX.platform/Developer/SDKs/MacOSX10.14.sdk/usr/include/libxml2 -Iinclude -I/Users/buildslave/jenkins/workspace/clang-stage2-coverage-R/llvm/include -fPIC -fvisibility-inlines-hidden -Werror=date-time -Werror=unguarded-availability-new -std=c++11 -fmodules -fmodules-cache-path=/Users/buildslave/jenkins/workspace/clang-stage2-coverage-R/clang-build/module.cache -fcxx-modules -Wall -Wextra -Wno-unused-parameter -Wwrite-strings -Wcast-qual -Wmissing-field-initializers -pedantic -Wno-long-long -Wimplicit-fallthrough -Wcovered-switch-default -Wno-noexcept-type -Wnon-virtual-dtor -Wdelete-non-virtual-dtor -Wstring-conversion -fdiagnostics-color -fprofile-instr-generate='/Users/buildslave/jenkins/workspace/clang-stage2-coverage-R/clang-build/profiles/%6m.profraw' -fcoverage-mapping -fno-common -Woverloaded-virtual -Wno-nested-anon-types -O3 -DNDEBUG -isysroot /Applications/Xcode.app/Contents/Developer/Platforms/MacOSX.platform/Developer/SDKs/MacOSX10.14.sdk -fno-exceptions -fno-rtti -MD -MT tools/clang/tools/extra/clangd/CMakeFiles/obj.clangDaemon.dir/TUScheduler.cpp.o -MF tools/clang/tools/extra/clangd/CMakeFiles/obj.clangDaemon.dir/TUScheduler.cpp.o.d -o tools/clang/tools/extra/clangd/CMakeFiles/obj.clangDaemon.dir/TUScheduler.cpp.o -c /Users/buildslave/jenkins/workspace/clang-stage2-coverage-R/llvm/tools/clang/tools/extra/clangd/TUScheduler.cpp [4058/4613] /Users/buildslave/jenkins/workspace/clang-stage2-coverage-R/host-compiler/bin/clang++ -DGTEST_HAS_RTTI=0 -D_GNU_SOURCE -D__STDC_CONSTANT_MACROS -D__STDC_FORMAT_MACROS -D__STDC_LIMIT_MACROS -Itools/clang/tools/extra/clangd -I/Users/buildslave/jenkins/workspace/clang-stage2-coverage-R/llvm/tools/clang/tools/extra/clangd -I/Users/buildslave/jenkins/workspace/clang-stage2-coverage-R/llvm/tools/clang/include -Itools/clang/include -I/Applications/Xcode.app/Contents/Developer/Platforms/MacOSX.platform/Developer/SDKs/MacOSX10.14.sdk/usr/include/libxml2 -Iinclude -I/Users/buildslave/jenkins/workspace/clang-stage2-coverage-R/llvm/include -fPIC -fvisibility-inlines-hidden -Werror=date-time -Werror=unguarded-availability-new -std=c++11 -fmodules -fmodules-cache-path=/Users/buildslave/jenkins/workspace/clang-stage2-coverage-R/clang-build/module.cache -fcxx-modules -Wall -Wextra -Wno-unused-parameter -Wwrite-strings -Wcast-qual -Wmissing-field-initializers -pedantic -Wno-long-long -Wimplicit-fallthrough -Wcovered-switch-default -Wno-noexcept-type -Wnon-virtual-dtor -Wdelete-non-virtual-dtor -Wstring-conversion -fdiagnostics-color -fprofile-instr-generate='/Users/buildslave/jenkins/workspace/clang-stage2-coverage-R/clang-build/profiles/%6m.profraw' -fcoverage-mapping -fno-common -Woverloaded-virtual -Wno-nested-anon-types -O3 -DNDEBUG -isysroot /Applications/Xcode.app/Contents/Developer/Platforms/MacOSX.platform/Developer/SDKs/MacOSX10.14.sdk -fno-exceptions -fno-rtti -MD -MT tools/clang/tools/extra/clangd/CMakeFiles/obj.clangDaemon.dir/Headers.cpp.o -MF tools/clang/tools/extra/clangd/CMakeFiles/obj.clangDaemon.dir/Headers.cpp.o.d -o tools/clang/tools/extra/clangd/CMakeFiles/obj.clangDaemon.dir/Headers.cpp.o -c /Users/buildslave/jenkins/workspace/clang-stage2-coverage-R/llvm/tools/clang/tools/extra/clangd/Headers.cpp FAILED: tools/clang/tools/extra/clangd/CMakeFiles/obj.clangDaemon.dir/Headers.cpp.o /Users/buildslave/jenkins/workspace/clang-stage2-coverage-R/host-compiler/bin/clang++ -DGTEST_HAS_RTTI=0 -D_GNU_SOURCE -D__STDC_CONSTANT_MACROS -D__STDC_FORMAT_MACROS -D__STDC_LIMIT_MACROS -Itools/clang/tools/extra/clangd -I/Users/buildslave/jenkins/workspace/clang-stage2-coverage-R/llvm/tools/clang/tools/extra/clangd -I/Users/buildslave/jenkins/workspace/clang-stage2-coverage-R/llvm/tools/clang/include -Itools/clang/include -I/Applications/Xcode.app/Contents/Developer/Platforms/MacOSX.platform/Developer/SDKs/MacOSX10.14.sdk/usr/include/libxml2 -Iinclude -I/Users/buildslave/jenkins/workspace/clang-stage2-coverage-R/llvm/include -fPIC -fvisibility-inlines-hidden -Werror=date-time -Werror=unguarded-availability-new -std=c++11 -fmodules -fmodules-cache-path=/Users/buildslave/jenkins/workspace/clang-stage2-coverage-R/clang-build/module.cache -fcxx-modules -Wall -Wextra -Wno-unused-parameter -Wwrite-strings -Wcast-qual -Wmissing-field-initializers -pedantic -Wno-long-long -Wimplicit-fallthrough -Wcovered-switch-default -Wno-noexcept-type -Wnon-virtual-dtor -Wdelete-non-virtual-dtor -Wstring-conversion -fdiagnostics-color -fprofile-instr-generate='/Users/buildslave/jenkins/workspace/clang-stage2-coverage-R/clang-build/profiles/%6m.profraw' -fcoverage-mapping -fno-common -Woverloaded-virtual -Wno-nested-anon-types -O3 -DNDEBUG -isysroot /Applications/Xcode.app/Contents/Developer/Platforms/MacOSX.platform/Developer/SDKs/MacOSX10.14.sdk -fno-exceptions -fno-rtti -MD -MT tools/clang/tools/extra/clangd/CMakeFiles/obj.clangDaemon.dir/Headers.cpp.o -MF tools/clang/tools/extra/clangd/CMakeFiles/obj.clangDaemon.dir/Headers.cpp.o.d -o tools/clang/tools/extra/clangd/CMakeFiles/obj.clangDaemon.dir/Headers.cpp.o -c /Users/buildslave/jenkins/workspace/clang-stage2-coverage-R/llvm/tools/clang/tools/extra/clangd/Headers.cpp Assertion failed: (CachedFieldIndex && "failed to find field in parent"), function getFieldIndex, file /Users/buildslave/jenkins/workspace/clang-stage1-configure-RA/llvm/tools/clang/lib/AST/Decl.cpp, line 3965. Stack dump: 0. Program arguments: /Users/buildslave/jenkins/workspace/clang-stage2-coverage-R/host-compiler/bin/clang-9 -cc1 -triple x86_64-apple-macosx10.14.0 -Wdeprecated-objc-isa-usage -Werror=deprecated-objc-isa-usage -emit-obj -disable-free -main-file-name Headers.cpp -mrelocation-model pic -pic-level 2 -mthread-model posix -mdisable-fp-elim -masm-verbose -munwind-tables -target-sdk-version=10.14 -target-cpu penryn -dwarf-column-info -debugger-tuning=lldb -ggnu-pubnames -target-linker-version 409.12 -fprofile-instrument-path=/Users/buildslave/jenkins/workspace/clang-stage2-coverage-R/clang-build/profiles/%6m.profraw -fprofile-instrument=clang -fcoverage-mapping -coverage-notes-file /Users/buildslave/jenkins/workspace/clang-stage2-coverage-R/clang-build/tools/clang/tools/extra/clangd/CMakeFiles/obj.clangDaemon.dir/Headers.cpp.gcno -resource-dir /Users/buildslave/jenkins/workspace/clang-stage2-coverage-R/host-compiler/lib/clang/9.0.0 -dependency-file tools/clang/tools/extra/clangd/CMakeFiles/obj.clangDaemon.dir/Headers.cpp.o.d -sys-header-deps -MT tools/clang/tools/extra/clangd/CMakeFiles/obj.clangDaemon.dir/Headers.cpp.o -isysroot /Applications/Xcode.app/Contents/Developer/Platforms/MacOSX.platform/Developer/SDKs/MacOSX10.14.sdk -D GTEST_HAS_RTTI=0 -D _GNU_SOURCE -D __STDC_CONSTANT_MACROS -D __STDC_FORMAT_MACROS -D __STDC_LIMIT_MACROS -I tools/clang/tools/extra/clangd -I /Users/buildslave/jenkins/workspace/clang-stage2-coverage-R/llvm/tools/clang/tools/extra/clangd -I /Users/buildslave/jenkins/workspace/clang-stage2-coverage-R/llvm/tools/clang/include -I tools/clang/include -I /Applications/Xcode.app/Contents/Developer/Platforms/MacOSX.platform/Developer/SDKs/MacOSX10.14.sdk/usr/include/libxml2 -I include -I /Users/buildslave/jenkins/workspace/clang-stage2-coverage-R/llvm/include -D NDEBUG -stdlib=libc++ -internal-isystem /Users/buildslave/jenkins/workspace/clang-stage2-coverage-R/host-compiler/bin/../include/c++/v1 -internal-isystem /Applications/Xcode.app/Contents/Developer/Platforms/MacOSX.platform/Developer/SDKs/MacOSX10.14.sdk/usr/include/c++/v1 -internal-isystem /Applications/Xcode.app/Contents/Developer/Platforms/MacOSX.platform/Developer/SDKs/MacOSX10.14.sdk/usr/local/include -internal-isystem /Users/buildslave/jenkins/workspace/clang-stage2-coverage-R/host-compiler/lib/clang/9.0.0/include -internal-externc-isystem /Applications/Xcode.app/Contents/Developer/Platforms/MacOSX.platform/Developer/SDKs/MacOSX10.14.sdk/usr/include -O3 -Werror=date-time -Werror=unguarded-availability-new -Wall -Wextra -Wno-unused-parameter -Wwrite-strings -Wcast-qual -Wmissing-field-initializers -Wno-long-long -Wimplicit-fallthrough -Wcovered-switch-default -Wno-noexcept-type -Wnon-virtual-dtor -Wdelete-non-virtual-dtor -Wstring-conversion -Woverloaded-virtual -Wno-nested-anon-types -pedantic -std=c++11 -fdeprecated-macro -fdebug-compilation-dir /Users/buildslave/jenkins/workspace/clang-stage2-coverage-R/clang-build -ferror-limit 19 -fmessage-length 0 -fvisibility-inlines-hidden -stack-protector 1 -fblocks -fencode-extended-block-signature -fno-rtti -fregister-global-dtors-with-atexit -fmodules -fimplicit-module-maps -fmodules-cache-path=/Users/buildslave/jenkins/workspace/clang-stage2-coverage-R/clang-build/module.cache -fmodules-validate-system-headers -fobjc-runtime=macosx-10.14.0 -fmax-type-align=16 -fno-common -fdiagnostics-show-option -fcolor-diagnostics -vectorize-loops -vectorize-slp -o tools/clang/tools/extra/clangd/CMakeFiles/obj.clangDaemon.dir/Headers.cpp.o -x c++ /Users/buildslave/jenkins/workspace/clang-stage2-coverage-R/llvm/tools/clang/tools/extra/clangd/Headers.cpp 1. <eof> parser at end of file 2. Per-file LLVM IR generation 3. /Users/buildslave/jenkins/workspace/clang-stage2-coverage-R/llvm/include/llvm/Support/Error.h:625:17: Generating code for declaration 'llvm::Expected<std::__1::basic_string<char> >::getStorage' 0 clang-9 0x000000010de83d78 llvm::sys::PrintStackTrace(llvm::raw_ostream&) + 40 1 clang-9 0x000000010de82f25 llvm::sys::RunSignalHandlers() + 85 2 clang-9 0x000000010de84388 SignalHandler(int) + 264 3 libsystem_platform.dylib 0x00007fff5c09eb3d _sigtramp + 29 4 clang-9 0x000000010dde5156 llvm::FoldingSetBase::FindNodeOrInsertPos(llvm::FoldingSetNodeID const&, void*&) + 182 5 libsystem_c.dylib 0x00007fff5bf5d1c9 abort + 127 6 libsystem_c.dylib 0x00007fff5bf25868 basename_r + 0 7 clang-9 0x000000010fc01dd6 clang::FieldDecl::getFieldIndex() const + 694 8 clang-9 0x000000010e1746e5 clang::CodeGen::CodeGenFunction::EmitLValueForField(clang::CodeGen::LValue, clang::FieldDecl const*) + 1413 9 clang-9 0x000000010e17f40f clang::CodeGen::CodeGenFunction::EmitMemberExpr(clang::MemberExpr const*) + 1247 10 clang-9 0x000000010e17107a clang::CodeGen::CodeGenFunction::EmitLValue(clang::Expr const*) + 1018 11 clang-9 0x000000010e17956d clang::CodeGen::CodeGenFunction::EmitCheckedLValue(clang::Expr const*, clang::CodeGen::CodeGenFunction::TypeCheckKind) + 173 12 clang-9 0x000000010e17f066 clang::CodeGen::CodeGenFunction::EmitMemberExpr(clang::MemberExpr const*) + 310 13 clang-9 0x000000010e17107a clang::CodeGen::CodeGenFunction::EmitLValue(clang::Expr const*) + 1018 14 clang-9 0x000000010e18062c clang::CodeGen::CodeGenFunction::EmitCastLValue(clang::CastExpr const*) + 1372 15 clang-9 0x000000010e170cff clang::CodeGen::CodeGenFunction::EmitLValue(clang::Expr const*) + 127 16 clang-9 0x000000010e17956d clang::CodeGen::CodeGenFunction::EmitCheckedLValue(clang::Expr const*, clang::CodeGen::CodeGenFunction::TypeCheckKind) + 173 17 clang-9 0x000000010e17f066 clang::CodeGen::CodeGenFunction::EmitMemberExpr(clang::MemberExpr const*) + 310 18 clang-9 0x000000010e17107a clang::CodeGen::CodeGenFunction::EmitLValue(clang::Expr const*) + 1018 19 clang-9 0x000000010e178e77 clang::CodeGen::CodeGenFunction::EmitArrayToPointerDecay(clang::Expr const*, clang::CodeGen::LValueBaseInfo*, clang::CodeGen::TBAAAccessInfo*) + 119 20 clang-9 0x000000010e1c9bd8 (anonymous namespace)::ScalarExprEmitter::VisitCastExpr(clang::CastExpr*) + 3896 21 clang-9 0x000000010e1c8d44 (anonymous namespace)::ScalarExprEmitter::VisitCastExpr(clang::CastExpr*) + 164 22 clang-9 0x000000010e1b6dc8 clang::CodeGen::CodeGenFunction::EmitScalarExpr(clang::Expr const*, bool) + 104 23 clang-9 0x000000010e2ab7a6 clang::CodeGen::CodeGenFunction::EmitReturnStmt(clang::ReturnStmt const&) + 1430 24 clang-9 0x000000010e2a89b2 clang::CodeGen::CodeGenFunction::EmitStmt(clang::Stmt const*, llvm::ArrayRef<clang::Attr const*>) + 2482 25 clang-9 0x000000010e2b0d8a clang::CodeGen::CodeGenFunction::EmitCompoundStmtWithoutScope(clang::CompoundStmt const&, bool, clang::CodeGen::AggValueSlot) + 186 26 clang-9 0x000000010e2f0a87 clang::CodeGen::CodeGenFunction::GenerateCode(clang::GlobalDecl, llvm::Function*, clang::CodeGen::CGFunctionInfo const&) + 791 27 clang-9 0x000000010e30b827 clang::CodeGen::CodeGenModule::EmitGlobalFunctionDefinition(clang::GlobalDecl, llvm::GlobalValue*) + 503 28 clang-9 0x000000010e305746 clang::CodeGen::CodeGenModule::EmitGlobalDefinition(clang::GlobalDecl, llvm::GlobalValue*) + 486 29 clang-9 0x000000010e2fb731 clang::CodeGen::CodeGenModule::EmitDeferred() + 289 30 clang-9 0x000000010e2fb759 clang::CodeGen::CodeGenModule::EmitDeferred() + 329 31 clang-9 0x000000010e2fb759 clang::CodeGen::CodeGenModule::EmitDeferred() + 329 32 clang-9 0x000000010e2faa2a clang::CodeGen::CodeGenModule::Release() + 42 33 clang-9 0x000000010e382864 (anonymous namespace)::CodeGeneratorImpl::HandleTranslationUnit(clang::ASTContext&) + 100 34 clang-9 0x000000010e2e74b6 clang::BackendConsumer::HandleTranslationUnit(clang::ASTContext&) + 134 35 clang-9 0x000000010f1e3a23 clang::ParseAST(clang::Sema&, bool, bool) + 611 36 clang-9 0x000000010e567114 clang::FrontendAction::Execute() + 84 37 clang-9 0x000000010e518ab8 clang::CompilerInstance::ExecuteAction(clang::FrontendAction&) + 1544 38 clang-9 0x000000010e5df810 clang::ExecuteCompilerInvocation(clang::CompilerInstance*) + 1808 39 clang-9 0x000000010c29f4a4 cc1_main(llvm::ArrayRef<char const*>, char const*, void*) + 2356 40 clang-9 0x000000010c29cc03 main + 10851 41 libdyld.dylib 0x00007fff5beb5085 start + 1 42 libdyld.dylib 0x0000000000000080 start + 18446603338974015484 clang-9: error: unable to execute command: Abort trap: 6 clang-9: error: clang frontend command failed due to signal (use -v to see invocation) clang version 9.0.0 (trunk) Target: x86_64-apple-darwin18.0.0 Thread model: posix InstalledDir: /Users/buildslave/jenkins/workspace/clang-stage2-coverage-R/host-compiler/bin clang-9: note: diagnostic msg: PLEASE submit a bug report to https://bugs.llvm.org/ and include the crash backtrace, preprocessed source, and associated run script. clang-9: note: diagnostic msg: ********************

Hide Details

PLEASE ATTACH THE FOLLOWING FILES TO THE BUG REPORT: Preprocessed source(s) and associated run script(s) are located at: clang-9: note: diagnostic msg: /var/folders/09/r4vw4v8n5kb67jl66zvlbljw0000gn/T/Headers-72fb52.cpp clang-9: note: diagnostic msg: /var/folders/09/r4vw4v8n5kb67jl66zvlbljw0000gn/T/Headers-72fb52.cache clang-9: note: diagnostic msg: /var/folders/09/r4vw4v8n5kb67jl66zvlbljw0000gn/T/Headers-72fb52.sh clang-9: note: diagnostic msg: Crash backtrace is located in clang-9: note: diagnostic msg: /Users/buildslave/Library/Logs/DiagnosticReports/clang-9_<YYYY-MM-DD-HHMMSS>_<hostname>.crash clang-9: note: diagnostic msg: (choose the .crash file that corresponds to your crash) clang-9: note: diagnostic msg:

Hide Details

******************** [4059/4613] /Users/buildslave/jenkins/workspace/clang-stage2-coverage-R/host-compiler/bin/clang++ -DGTEST_HAS_RTTI=0 -D_GNU_SOURCE -D__STDC_CONSTANT_MACROS -D__STDC_FORMAT_MACROS -D__STDC_LIMIT_MACROS -Itools/clang/tools/extra/clangd -I/Users/buildslave/jenkins/workspace/clang-stage2-coverage-R/llvm/tools/clang/tools/extra/clangd -I/Users/buildslave/jenkins/workspace/clang-stage2-coverage-R/llvm/tools/clang/include -Itools/clang/include -I/Applications/Xcode.app/Contents/Developer/Platforms/MacOSX.platform/Developer/SDKs/MacOSX10.14.sdk/usr/include/libxml2 -Iinclude -I/Users/buildslave/jenkins/workspace/clang-stage2-coverage-R/llvm/include -fPIC -fvisibility-inlines-hidden -Werror=date-time -Werror=unguarded-availability-new -std=c++11 -fmodules -fmodules-cache-path=/Users/buildslave/jenkins/workspace/clang-stage2-coverage-R/clang-build/module.cache -fcxx-modules -Wall -Wextra -Wno-unused-parameter -Wwrite-strings -Wcast-qual -Wmissing-field-initializers -pedantic -Wno-long-long -Wimplicit-fallthrough -Wcovered-switch-default -Wno-noexcept-type -Wnon-virtual-dtor -Wdelete-non-virtual-dtor -Wstring-conversion -fdiagnostics-color -fprofile-instr-generate='/Users/buildslave/jenkins/workspace/clang-stage2-coverage-R/clang-build/profiles/%6m.profraw' -fcoverage-mapping -fno-common -Woverloaded-virtual -Wno-nested-anon-types -O3 -DNDEBUG -isysroot /Applications/Xcode.app/Contents/Developer/Platforms/MacOSX.platform/Developer/SDKs/MacOSX10.14.sdk -fno-exceptions -fno-rtti -MD -MT tools/clang/tools/extra/clangd/CMakeFiles/obj.clangDaemon.dir/index/BackgroundRebuild.cpp.o -MF tools/clang/tools/extra/clangd/CMakeFiles/obj.clangDaemon.dir/index/BackgroundRebuild.cpp.o.d -o tools/clang/tools/extra/clangd/CMakeFiles/obj.clangDaemon.dir/index/BackgroundRebuild.cpp.o -c /Users/buildslave/jenkins/workspace/clang-stage2-coverage-R/llvm/tools/clang/tools/extra/clangd/index/BackgroundRebuild.cpp [4060/4613] /Users/buildslave/jenkins/workspace/clang-stage2-coverage-R/host-compiler/bin/clang++ -DGTEST_HAS_RTTI=0 -D_GNU_SOURCE -D__STDC_CONSTANT_MACROS -D__STDC_FORMAT_MACROS -D__STDC_LIMIT_MACROS -Itools/clang/tools/extra/clangd -I/Users/buildslave/jenkins/workspace/clang-stage2-coverage-R/llvm/tools/clang/tools/extra/clangd -I/Users/buildslave/jenkins/workspace/clang-stage2-coverage-R/llvm/tools/clang/include -Itools/clang/include -I/Applications/Xcode.app/Contents/Developer/Platforms/MacOSX.platform/Developer/SDKs/MacOSX10.14.sdk/usr/include/libxml2 -Iinclude -I/Users/buildslave/jenkins/workspace/clang-stage2-coverage-R/llvm/include -fPIC -fvisibility-inlines-hidden -Werror=date-time -Werror=unguarded-availability-new -std=c++11 -fmodules -fmodules-cache-path=/Users/buildslave/jenkins/workspace/clang-stage2-coverage-R/clang-build/module.cache -fcxx-modules -Wall -Wextra -Wno-unused-parameter -Wwrite-strings -Wcast-qual -Wmissing-field-initializers -pedantic -Wno-long-long -Wimplicit-fallthrough -Wcovered-switch-default -Wno-noexcept-type -Wnon-virtual-dtor -Wdelete-non-virtual-dtor -Wstring-conversion -fdiagnostics-color -fprofile-instr-generate='/Users/buildslave/jenkins/workspace/clang-stage2-coverage-R/clang-build/profiles/%6m.profraw' -fcoverage-mapping -fno-common -Woverloaded-virtual -Wno-nested-anon-types -O3 -DNDEBUG -isysroot /Applications/Xcode.app/Contents/Developer/Platforms/MacOSX.platform/Developer/SDKs/MacOSX10.14.sdk -fno-exceptions -fno-rtti -MD -MT tools/clang/tools/extra/clangd/CMakeFiles/obj.clangDaemon.dir/XRefs.cpp.o -MF tools/clang/tools/extra/clangd/CMakeFiles/obj.clangDaemon.dir/XRefs.cpp.o.d -o tools/clang/tools/extra/clangd/CMakeFiles/obj.clangDaemon.dir/XRefs.cpp.o -c /Users/buildslave/jenkins/workspace/clang-stage2-coverage-R/llvm/tools/clang/tools/extra/clangd/XRefs.cpp [4061/4613] /Users/buildslave/jenkins/workspace/clang-stage2-coverage-R/host-compiler/bin/clang++ -DGTEST_HAS_RTTI=0 -D_GNU_SOURCE -D__STDC_CONSTANT_MACROS -D__STDC_FORMAT_MACROS -D__STDC_LIMIT_MACROS -Itools/clang/tools/extra/clangd -I/Users/buildslave/jenkins/workspace/clang-stage2-coverage-R/llvm/tools/clang/tools/extra/clangd -I/Users/buildslave/jenkins/workspace/clang-stage2-coverage-R/llvm/tools/clang/include -Itools/clang/include -I/Applications/Xcode.app/Contents/Developer/Platforms/MacOSX.platform/Developer/SDKs/MacOSX10.14.sdk/usr/include/libxml2 -Iinclude -I/Users/buildslave/jenkins/workspace/clang-stage2-coverage-R/llvm/include -fPIC -fvisibility-inlines-hidden -Werror=date-time -Werror=unguarded-availability-new -std=c++11 -fmodules -fmodules-cache-path=/Users/buildslave/jenkins/workspace/clang-stage2-coverage-R/clang-build/module.cache -fcxx-modules -Wall -Wextra -Wno-unused-parameter -Wwrite-strings -Wcast-qual -Wmissing-field-initializers -pedantic -Wno-long-long -Wimplicit-fallthrough -Wcovered-switch-default -Wno-noexcept-type -Wnon-virtual-dtor -Wdelete-non-virtual-dtor -Wstring-conversion -fdiagnostics-color -fprofile-instr-generate='/Users/buildslave/jenkins/workspace/clang-stage2-coverage-R/clang-build/profiles/%6m.profraw' -fcoverage-mapping -fno-common -Woverloaded-virtual -Wno-nested-anon-types -O3 -DNDEBUG -isysroot /Applications/Xcode.app/Contents/Developer/Platforms/MacOSX.platform/Developer/SDKs/MacOSX10.14.sdk -fno-exceptions -fno-rtti -MD -MT tools/clang/tools/extra/clangd/CMakeFiles/obj.clangDaemon.dir/index/Background.cpp.o -MF tools/clang/tools/extra/clangd/CMakeFiles/obj.clangDaemon.dir/index/Background.cpp.o.d -o tools/clang/tools/extra/clangd/CMakeFiles/obj.clangDaemon.dir/index/Background.cpp.o -c /Users/buildslave/jenkins/workspace/clang-stage2-coverage-R/llvm/tools/clang/tools/extra/clangd/index/Background.cpp FAILED: tools/clang/tools/extra/clangd/CMakeFiles/obj.clangDaemon.dir/index/Background.cpp.o /Users/buildslave/jenkins/workspace/clang-stage2-coverage-R/host-compiler/bin/clang++ -DGTEST_HAS_RTTI=0 -D_GNU_SOURCE -D__STDC_CONSTANT_MACROS -D__STDC_FORMAT_MACROS -D__STDC_LIMIT_MACROS -Itools/clang/tools/extra/clangd -I/Users/buildslave/jenkins/workspace/clang-stage2-coverage-R/llvm/tools/clang/tools/extra/clangd -I/Users/buildslave/jenkins/workspace/clang-stage2-coverage-R/llvm/tools/clang/include -Itools/clang/include -I/Applications/Xcode.app/Contents/Developer/Platforms/MacOSX.platform/Developer/SDKs/MacOSX10.14.sdk/usr/include/libxml2 -Iinclude -I/Users/buildslave/jenkins/workspace/clang-stage2-coverage-R/llvm/include -fPIC -fvisibility-inlines-hidden -Werror=date-time -Werror=unguarded-availability-new -std=c++11 -fmodules -fmodules-cache-path=/Users/buildslave/jenkins/workspace/clang-stage2-coverage-R/clang-build/module.cache -fcxx-modules -Wall -Wextra -Wno-unused-parameter -Wwrite-strings -Wcast-qual -Wmissing-field-initializers -pedantic -Wno-long-long -Wimplicit-fallthrough -Wcovered-switch-default -Wno-noexcept-type -Wnon-virtual-dtor -Wdelete-non-virtual-dtor -Wstring-conversion -fdiagnostics-color -fprofile-instr-generate='/Users/buildslave/jenkins/workspace/clang-stage2-coverage-R/clang-build/profiles/%6m.profraw' -fcoverage-mapping -fno-common -Woverloaded-virtual -Wno-nested-anon-types -O3 -DNDEBUG -isysroot /Applications/Xcode.app/Contents/Developer/Platforms/MacOSX.platform/Developer/SDKs/MacOSX10.14.sdk -fno-exceptions -fno-rtti -MD -MT tools/clang/tools/extra/clangd/CMakeFiles/obj.clangDaemon.dir/index/Background.cpp.o -MF tools/clang/tools/extra/clangd/CMakeFiles/obj.clangDaemon.dir/index/Background.cpp.o.d -o tools/clang/tools/extra/clangd/CMakeFiles/obj.clangDaemon.dir/index/Background.cpp.o -c /Users/buildslave/jenkins/workspace/clang-stage2-coverage-R/llvm/tools/clang/tools/extra/clangd/index/Background.cpp Assertion failed: (CachedFieldIndex && "failed to find field in parent"), function getFieldIndex, file /Users/buildslave/jenkins/workspace/clang-stage1-configure-RA/llvm/tools/clang/lib/AST/Decl.cpp, line 3965. Stack dump: 0. Program arguments: /Users/buildslave/jenkins/workspace/clang-stage2-coverage-R/host-compiler/bin/clang-9 -cc1 -triple x86_64-apple-macosx10.14.0 -Wdeprecated-objc-isa-usage -Werror=deprecated-objc-isa-usage -emit-obj -disable-free -main-file-name Background.cpp -mrelocation-model pic -pic-level 2 -mthread-model posix -mdisable-fp-elim -masm-verbose -munwind-tables -target-sdk-version=10.14 -target-cpu penryn -dwarf-column-info -debugger-tuning=lldb -ggnu-pubnames -target-linker-version 409.12 -fprofile-instrument-path=/Users/buildslave/jenkins/workspace/clang-stage2-coverage-R/clang-build/profiles/%6m.profraw -fprofile-instrument=clang -fcoverage-mapping -coverage-notes-file /Users/buildslave/jenkins/workspace/clang-stage2-coverage-R/clang-build/tools/clang/tools/extra/clangd/CMakeFiles/obj.clangDaemon.dir/index/Background.cpp.gcno -resource-dir /Users/buildslave/jenkins/workspace/clang-stage2-coverage-R/host-compiler/lib/clang/9.0.0 -dependency-file tools/clang/tools/extra/clangd/CMakeFiles/obj.clangDaemon.dir/index/Background.cpp.o.d -sys-header-deps -MT tools/clang/tools/extra/clangd/CMakeFiles/obj.clangDaemon.dir/index/Background.cpp.o -isysroot /Applications/Xcode.app/Contents/Developer/Platforms/MacOSX.platform/Developer/SDKs/MacOSX10.14.sdk -D GTEST_HAS_RTTI=0 -D _GNU_SOURCE -D __STDC_CONSTANT_MACROS -D __STDC_FORMAT_MACROS -D __STDC_LIMIT_MACROS -I tools/clang/tools/extra/clangd -I /Users/buildslave/jenkins/workspace/clang-stage2-coverage-R/llvm/tools/clang/tools/extra/clangd -I /Users/buildslave/jenkins/workspace/clang-stage2-coverage-R/llvm/tools/clang/include -I tools/clang/include -I /Applications/Xcode.app/Contents/Developer/Platforms/MacOSX.platform/Developer/SDKs/MacOSX10.14.sdk/usr/include/libxml2 -I include -I /Users/buildslave/jenkins/workspace/clang-stage2-coverage-R/llvm/include -D NDEBUG -stdlib=libc++ -internal-isystem /Users/buildslave/jenkins/workspace/clang-stage2-coverage-R/host-compiler/bin/../include/c++/v1 -internal-isystem /Applications/Xcode.app/Contents/Developer/Platforms/MacOSX.platform/Developer/SDKs/MacOSX10.14.sdk/usr/include/c++/v1 -internal-isystem /Applications/Xcode.app/Contents/Developer/Platforms/MacOSX.platform/Developer/SDKs/MacOSX10.14.sdk/usr/local/include -internal-isystem /Users/buildslave/jenkins/workspace/clang-stage2-coverage-R/host-compiler/lib/clang/9.0.0/include -internal-externc-isystem /Applications/Xcode.app/Contents/Developer/Platforms/MacOSX.platform/Developer/SDKs/MacOSX10.14.sdk/usr/include -O3 -Werror=date-time -Werror=unguarded-availability-new -Wall -Wextra -Wno-unused-parameter -Wwrite-strings -Wcast-qual -Wmissing-field-initializers -Wno-long-long -Wimplicit-fallthrough -Wcovered-switch-default -Wno-noexcept-type -Wnon-virtual-dtor -Wdelete-non-virtual-dtor -Wstring-conversion -Woverloaded-virtual -Wno-nested-anon-types -pedantic -std=c++11 -fdeprecated-macro -fdebug-compilation-dir /Users/buildslave/jenkins/workspace/clang-stage2-coverage-R/clang-build -ferror-limit 19 -fmessage-length 0 -fvisibility-inlines-hidden -stack-protector 1 -fblocks -fencode-extended-block-signature -fno-rtti -fregister-global-dtors-with-atexit -fmodules -fimplicit-module-maps -fmodules-cache-path=/Users/buildslave/jenkins/workspace/clang-stage2-coverage-R/clang-build/module.cache -fmodules-validate-system-headers -fobjc-runtime=macosx-10.14.0 -fmax-type-align=16 -fno-common -fdiagnostics-show-option -fcolor-diagnostics -vectorize-loops -vectorize-slp -o tools/clang/tools/extra/clangd/CMakeFiles/obj.clangDaemon.dir/index/Background.cpp.o -x c++ /Users/buildslave/jenkins/workspace/clang-stage2-coverage-R/llvm/tools/clang/tools/extra/clangd/index/Background.cpp 1. <eof> parser at end of file 2. Per-file LLVM IR generation 3. /Users/buildslave/jenkins/workspace/clang-stage2-coverage-R/llvm/include/llvm/Support/Error.h:635:15: Generating code for declaration 'llvm::Expected<std::__1::basic_string<char> >::getErrorStorage' 0 clang-9 0x0000000101fb9d78 llvm::sys::PrintStackTrace(llvm::raw_ostream&) + 40 1 clang-9 0x0000000101fb8f25 llvm::sys::RunSignalHandlers() + 85 2 clang-9 0x0000000101fba388 SignalHandler(int) + 264 3 libsystem_platform.dylib 0x00007fff5c09eb3d _sigtramp + 29 4 libsystem_platform.dylib 0x0000000000000040 _sigtramp + 18446603338972009760 5 libsystem_c.dylib 0x00007fff5bf5d1c9 abort + 127 6 libsystem_c.dylib 0x00007fff5bf25868 basename_r + 0 7 clang-9 0x0000000103d37dd6 clang::FieldDecl::getFieldIndex() const + 694 8 clang-9 0x00000001022aa6e5 clang::CodeGen::CodeGenFunction::EmitLValueForField(clang::CodeGen::LValue, clang::FieldDecl const*) + 1413 9 clang-9 0x00000001022b540f clang::CodeGen::CodeGenFunction::EmitMemberExpr(clang::MemberExpr const*) + 1247 10 clang-9 0x00000001022a707a clang::CodeGen::CodeGenFunction::EmitLValue(clang::Expr const*) + 1018 11 clang-9 0x00000001022af56d clang::CodeGen::CodeGenFunction::EmitCheckedLValue(clang::Expr const*, clang::CodeGen::CodeGenFunction::TypeCheckKind) + 173 12 clang-9 0x00000001022b5066 clang::CodeGen::CodeGenFunction::EmitMemberExpr(clang::MemberExpr const*) + 310 13 clang-9 0x00000001022a707a clang::CodeGen::CodeGenFunction::EmitLValue(clang::Expr const*) + 1018 14 clang-9 0x00000001022b662c clang::CodeGen::CodeGenFunction::EmitCastLValue(clang::CastExpr const*) + 1372 15 clang-9 0x00000001022a6cff clang::CodeGen::CodeGenFunction::EmitLValue(clang::Expr const*) + 127 16 clang-9 0x00000001022af56d clang::CodeGen::CodeGenFunction::EmitCheckedLValue(clang::Expr const*, clang::CodeGen::CodeGenFunction::TypeCheckKind) + 173 17 clang-9 0x00000001022b5066 clang::CodeGen::CodeGenFunction::EmitMemberExpr(clang::MemberExpr const*) + 310 18 clang-9 0x00000001022a707a clang::CodeGen::CodeGenFunction::EmitLValue(clang::Expr const*) + 1018 19 clang-9 0x00000001022aee77 clang::CodeGen::CodeGenFunction::EmitArrayToPointerDecay(clang::Expr const*, clang::CodeGen::LValueBaseInfo*, clang::CodeGen::TBAAAccessInfo*) + 119 20 clang-9 0x00000001022ffbd8 (anonymous namespace)::ScalarExprEmitter::VisitCastExpr(clang::CastExpr*) + 3896 21 clang-9 0x00000001022fed44 (anonymous namespace)::ScalarExprEmitter::VisitCastExpr(clang::CastExpr*) + 164 22 clang-9 0x00000001022ecdc8 clang::CodeGen::CodeGenFunction::EmitScalarExpr(clang::Expr const*, bool) + 104 23 clang-9 0x00000001023e17a6 clang::CodeGen::CodeGenFunction::EmitReturnStmt(clang::ReturnStmt const&) + 1430 24 clang-9 0x00000001023de9b2 clang::CodeGen::CodeGenFunction::EmitStmt(clang::Stmt const*, llvm::ArrayRef<clang::Attr const*>) + 2482 25 clang-9 0x00000001023e6d8a clang::CodeGen::CodeGenFunction::EmitCompoundStmtWithoutScope(clang::CompoundStmt const&, bool, clang::CodeGen::AggValueSlot) + 186 26 clang-9 0x0000000102426a87 clang::CodeGen::CodeGenFunction::GenerateCode(clang::GlobalDecl, llvm::Function*, clang::CodeGen::CGFunctionInfo const&) + 791 27 clang-9 0x0000000102441827 clang::CodeGen::CodeGenModule::EmitGlobalFunctionDefinition(clang::GlobalDecl, llvm::GlobalValue*) + 503 28 clang-9 0x000000010243b746 clang::CodeGen::CodeGenModule::EmitGlobalDefinition(clang::GlobalDecl, llvm::GlobalValue*) + 486 29 clang-9 0x0000000102431731 clang::CodeGen::CodeGenModule::EmitDeferred() + 289 30 clang-9 0x0000000102431759 clang::CodeGen::CodeGenModule::EmitDeferred() + 329 31 clang-9 0x0000000102431759 clang::CodeGen::CodeGenModule::EmitDeferred() + 329 32 clang-9 0x0000000102430a2a clang::CodeGen::CodeGenModule::Release() + 42 33 clang-9 0x00000001024b8864 (anonymous namespace)::CodeGeneratorImpl::HandleTranslationUnit(clang::ASTContext&) + 100 34 clang-9 0x000000010241d4b6 clang::BackendConsumer::HandleTranslationUnit(clang::ASTContext&) + 134 35 clang-9 0x0000000103319a23 clang::ParseAST(clang::Sema&, bool, bool) + 611 36 clang-9 0x000000010269d114 clang::FrontendAction::Execute() + 84 37 clang-9 0x000000010264eab8 clang::CompilerInstance::ExecuteAction(clang::FrontendAction&) + 1544 38 clang-9 0x0000000102715810 clang::ExecuteCompilerInvocation(clang::CompilerInstance*) + 1808 39 clang-9 0x00000001003d54a4 cc1_main(llvm::ArrayRef<char const*>, char const*, void*) + 2356 40 clang-9 0x00000001003d2c03 main + 10851 41 libdyld.dylib 0x00007fff5beb5085 start + 1 42 libdyld.dylib 0x0000000000000080 start + 18446603338974015484 clang-9: error: unable to execute command: Abort trap: 6 clang-9: error: clang frontend command failed due to signal (use -v to see invocation) clang version 9.0.0 (trunk) Target: x86_64-apple-darwin18.0.0 Thread model: posix InstalledDir: /Users/buildslave/jenkins/workspace/clang-stage2-coverage-R/host-compiler/bin clang-9: note: diagnostic msg: PLEASE submit a bug report to https://bugs.llvm.org/ and include the crash backtrace, preprocessed source, and associated run script. clang-9: note: diagnostic msg: ********************

Hide Details

PLEASE ATTACH THE FOLLOWING FILES TO THE BUG REPORT: Preprocessed source(s) and associated run script(s) are located at: clang-9: note: diagnostic msg: /var/folders/09/r4vw4v8n5kb67jl66zvlbljw0000gn/T/Background-777fce.cpp clang-9: note: diagnostic msg: /var/folders/09/r4vw4v8n5kb67jl66zvlbljw0000gn/T/Background-777fce.cache clang-9: note: diagnostic msg: /var/folders/09/r4vw4v8n5kb67jl66zvlbljw0000gn/T/Background-777fce.sh clang-9: note: diagnostic msg: Crash backtrace is located in clang-9: note: diagnostic msg: /Users/buildslave/Library/Logs/DiagnosticReports/clang-9_<YYYY-MM-DD-HHMMSS>_<hostname>.crash clang-9: note: diagnostic msg: (choose the .crash file that corresponds to your crash) clang-9: note: diagnostic msg:

Hide Details

******************** ninja: build stopped: subcommand failed. Command failed Command: ['/usr/local/bin/ninja', '-v', 'all'] Build step 'Execute shell' marked build as failure [WARNINGS] Skipping publisher since build result is FAILURE [BFA] Scanning build for known causes... [BFA] Found failure cause(s): [BFA] Assertion failure from category Assert [BFA] Ninja target failed from category Compile [BFA] Compile Error from category Compile [BFA] Done. 2s Email was triggered for: Failure - Any Sending email for trigger: Failure - Any

Hide Details

Begin Pre-Send Script... Username Vedant not found in auth.groovy. This may indicate a problem with the svn-mailer.conf update process. Please check this job: http://green.lab.llvm.org/green/view/Infrastructure/job/Update%20SVN%20email%20list/ User Vedant will need to be notified of the build failure manually.

Hide Details

Username Kumar not found in auth.groovy. This may indicate a problem with the svn-mailer.conf update process. Please check this job: http://green.lab.llvm.org/green/view/Infrastructure/job/Update%20SVN%20email%20list/ User Kumar will need to be notified of the build failure manually.

Hide Details

Sending email to: vsk@apple.com JF Bastien <jfbastien@apple.com> Andi Bergen <abergen@apple.com> Azhar Mohammed <azhar@apple.com> Finished: FAILURE