FailedConsole Output

Skipping 248 KB.. Full Log
cmake-dwarf5/lldb-build/bin/clang -gdwarf-5 is not a valid compiler executable; aborting...

Hide Details

******************** FAIL: lldb-Suite :: python_api/file_handle/TestFileHandle.py (671 of 1400) ******************** TEST 'lldb-Suite :: python_api/file_handle/TestFileHandle.py' FAILED ******************** ERROR:root:/Users/buildslave/jenkins/workspace/lldb-cmake-dwarf5/lldb-build/bin/clang -gdwarf-5 is not a valid compiler executable; aborting...

Hide Details

******************** FAIL: lldb-Suite :: python_api/exprpath_synthetic/TestExprPathSynthetic.py (672 of 1400) ******************** TEST 'lldb-Suite :: python_api/exprpath_synthetic/TestExprPathSynthetic.py' FAILED ******************** ERROR:root:/Users/buildslave/jenkins/workspace/lldb-cmake-dwarf5/lldb-build/bin/clang -gdwarf-5 is not a valid compiler executable; aborting...

Hide Details

******************** FAIL: lldb-Suite :: python_api/findvalue_duplist/TestSBFrameFindValue.py (673 of 1400) ******************** TEST 'lldb-Suite :: python_api/findvalue_duplist/TestSBFrameFindValue.py' FAILED ******************** ERROR:root:/Users/buildslave/jenkins/workspace/lldb-cmake-dwarf5/lldb-build/bin/clang -gdwarf-5 is not a valid compiler executable; aborting...

Hide Details

******************** FAIL: lldb-Suite :: python_api/frame/get-variables/TestGetVariables.py (674 of 1400) ******************** TEST 'lldb-Suite :: python_api/frame/get-variables/TestGetVariables.py' FAILED ******************** ERROR:root:/Users/buildslave/jenkins/workspace/lldb-cmake-dwarf5/lldb-build/bin/clang -gdwarf-5 is not a valid compiler executable; aborting...

Hide Details

******************** FAIL: lldb-Suite :: python_api/frame/TestFrames.py (675 of 1400) ******************** TEST 'lldb-Suite :: python_api/frame/TestFrames.py' FAILED ******************** ERROR:root:/Users/buildslave/jenkins/workspace/lldb-cmake-dwarf5/lldb-build/bin/clang -gdwarf-5 is not a valid compiler executable; aborting...

Hide Details

******************** FAIL: lldb-Suite :: python_api/formatters/TestFormattersSBAPI.py (676 of 1400) ******************** TEST 'lldb-Suite :: python_api/formatters/TestFormattersSBAPI.py' FAILED ******************** ERROR:root:/Users/buildslave/jenkins/workspace/lldb-cmake-dwarf5/lldb-build/bin/clang -gdwarf-5 is not a valid compiler executable; aborting...

Hide Details

******************** FAIL: lldb-Suite :: python_api/function_symbol/TestDisasmAPI.py (677 of 1400) ******************** TEST 'lldb-Suite :: python_api/function_symbol/TestDisasmAPI.py' FAILED ******************** ERROR:root:/Users/buildslave/jenkins/workspace/lldb-cmake-dwarf5/lldb-build/bin/clang -gdwarf-5 is not a valid compiler executable; aborting...

Hide Details

******************** FAIL: lldb-Suite :: python_api/frame/inlines/TestInlinedFrame.py (678 of 1400) ******************** TEST 'lldb-Suite :: python_api/frame/inlines/TestInlinedFrame.py' FAILED ******************** ERROR:root:/Users/buildslave/jenkins/workspace/lldb-cmake-dwarf5/lldb-build/bin/clang -gdwarf-5 is not a valid compiler executable; aborting...

Hide Details

******************** FAIL: lldb-Suite :: python_api/function_symbol/TestSymbolAPI.py (679 of 1400) ******************** TEST 'lldb-Suite :: python_api/function_symbol/TestSymbolAPI.py' FAILED ******************** ERROR:root:/Users/buildslave/jenkins/workspace/lldb-cmake-dwarf5/lldb-build/bin/clang -gdwarf-5 is not a valid compiler executable; aborting...

Hide Details

******************** FAIL: lldb-Suite :: python_api/hello_world/TestHelloWorld.py (680 of 1400) ******************** TEST 'lldb-Suite :: python_api/hello_world/TestHelloWorld.py' FAILED ******************** ERROR:root:/Users/buildslave/jenkins/workspace/lldb-cmake-dwarf5/lldb-build/bin/clang -gdwarf-5 is not a valid compiler executable; aborting...

Hide Details

******************** FAIL: lldb-Suite :: python_api/interpreter/TestCommandInterpreterAPI.py (681 of 1400) ******************** TEST 'lldb-Suite :: python_api/interpreter/TestCommandInterpreterAPI.py' FAILED ******************** ERROR:root:/Users/buildslave/jenkins/workspace/lldb-cmake-dwarf5/lldb-build/bin/clang -gdwarf-5 is not a valid compiler executable; aborting...

Hide Details

******************** FAIL: lldb-Suite :: python_api/lldbutil/frame/TestFrameUtils.py (682 of 1400) ******************** TEST 'lldb-Suite :: python_api/lldbutil/frame/TestFrameUtils.py' FAILED ******************** ERROR:root:/Users/buildslave/jenkins/workspace/lldb-cmake-dwarf5/lldb-build/bin/clang -gdwarf-5 is not a valid compiler executable; aborting...

Hide Details

******************** FAIL: lldb-Suite :: python_api/lldbutil/iter/TestLLDBIterator.py (683 of 1400) ******************** TEST 'lldb-Suite :: python_api/lldbutil/iter/TestLLDBIterator.py' FAILED ******************** ERROR:root:/Users/buildslave/jenkins/workspace/lldb-cmake-dwarf5/lldb-build/bin/clang -gdwarf-5 is not a valid compiler executable; aborting...

Hide Details

******************** FAIL: lldb-Suite :: python_api/lldbutil/iter/TestRegistersIterator.py (684 of 1400) ******************** TEST 'lldb-Suite :: python_api/lldbutil/iter/TestRegistersIterator.py' FAILED ******************** ERROR:root:/Users/buildslave/jenkins/workspace/lldb-cmake-dwarf5/lldb-build/bin/clang -gdwarf-5 is not a valid compiler executable; aborting...

Hide Details

******************** FAIL: lldb-Suite :: python_api/name_lookup/TestNameLookup.py (685 of 1400) ******************** TEST 'lldb-Suite :: python_api/name_lookup/TestNameLookup.py' FAILED ******************** ERROR:root:/Users/buildslave/jenkins/workspace/lldb-cmake-dwarf5/lldb-build/bin/clang -gdwarf-5 is not a valid compiler executable; aborting...

Hide Details

******************** FAIL: lldb-Suite :: python_api/process/TestProcessAPI.py (686 of 1400) ******************** TEST 'lldb-Suite :: python_api/process/TestProcessAPI.py' FAILED ******************** ERROR:root:/Users/buildslave/jenkins/workspace/lldb-cmake-dwarf5/lldb-build/bin/clang -gdwarf-5 is not a valid compiler executable; aborting...

Hide Details

******************** FAIL: lldb-Suite :: python_api/lldbutil/process/TestPrintStackTraces.py (687 of 1400) ******************** TEST 'lldb-Suite :: python_api/lldbutil/process/TestPrintStackTraces.py' FAILED ******************** ERROR:root:/Users/buildslave/jenkins/workspace/lldb-cmake-dwarf5/lldb-build/bin/clang -gdwarf-5 is not a valid compiler executable; aborting...

Hide Details

******************** FAIL: lldb-Suite :: python_api/objc_type/TestObjCType.py (688 of 1400) ******************** TEST 'lldb-Suite :: python_api/objc_type/TestObjCType.py' FAILED ******************** ERROR:root:/Users/buildslave/jenkins/workspace/lldb-cmake-dwarf5/lldb-build/bin/clang -gdwarf-5 is not a valid compiler executable; aborting...

Hide Details

******************** FAIL: lldb-Suite :: python_api/module_section/TestModuleAndSection.py (689 of 1400) ******************** TEST 'lldb-Suite :: python_api/module_section/TestModuleAndSection.py' FAILED ******************** ERROR:root:/Users/buildslave/jenkins/workspace/lldb-cmake-dwarf5/lldb-build/bin/clang -gdwarf-5 is not a valid compiler executable; aborting...

Hide Details

******************** FAIL: lldb-Suite :: python_api/process/io/TestProcessIO.py (690 of 1400) ******************** TEST 'lldb-Suite :: python_api/process/io/TestProcessIO.py' FAILED ******************** ERROR:root:/Users/buildslave/jenkins/workspace/lldb-cmake-dwarf5/lldb-build/bin/clang -gdwarf-5 is not a valid compiler executable; aborting...

Hide Details

******************** FAIL: lldb-Suite :: python_api/process/read-mem-cstring/TestReadMemCString.py (691 of 1400) ******************** TEST 'lldb-Suite :: python_api/process/read-mem-cstring/TestReadMemCString.py' FAILED ******************** ERROR:root:/Users/buildslave/jenkins/workspace/lldb-cmake-dwarf5/lldb-build/bin/clang -gdwarf-5 is not a valid compiler executable; aborting...

Hide Details

******************** FAIL: lldb-Suite :: python_api/rdar-12481949/Test-rdar-12481949.py (692 of 1400) ******************** TEST 'lldb-Suite :: python_api/rdar-12481949/Test-rdar-12481949.py' FAILED ******************** ERROR:root:/Users/buildslave/jenkins/workspace/lldb-cmake-dwarf5/lldb-build/bin/clang -gdwarf-5 is not a valid compiler executable; aborting...

Hide Details

******************** FAIL: lldb-Suite :: python_api/sbdata/TestSBData.py (693 of 1400) ******************** TEST 'lldb-Suite :: python_api/sbdata/TestSBData.py' FAILED ******************** ERROR:root:/Users/buildslave/jenkins/workspace/lldb-cmake-dwarf5/lldb-build/bin/clang -gdwarf-5 is not a valid compiler executable; aborting...

Hide Details

******************** FAIL: lldb-Suite :: python_api/sblaunchinfo/TestSBLaunchInfo.py (694 of 1400) ******************** TEST 'lldb-Suite :: python_api/sblaunchinfo/TestSBLaunchInfo.py' FAILED ******************** ERROR:root:/Users/buildslave/jenkins/workspace/lldb-cmake-dwarf5/lldb-build/bin/clang -gdwarf-5 is not a valid compiler executable; aborting...

Hide Details

******************** FAIL: lldb-Suite :: python_api/sbstructureddata/TestStructuredDataAPI.py (695 of 1400) ******************** TEST 'lldb-Suite :: python_api/sbstructureddata/TestStructuredDataAPI.py' FAILED ******************** ERROR:root:/Users/buildslave/jenkins/workspace/lldb-cmake-dwarf5/lldb-build/bin/clang -gdwarf-5 is not a valid compiler executable; aborting...

Hide Details

******************** FAIL: lldb-Suite :: python_api/sbvalue_const_addrof/TestSBValueConstAddrOf.py (696 of 1400) ******************** TEST 'lldb-Suite :: python_api/sbvalue_const_addrof/TestSBValueConstAddrOf.py' FAILED ******************** ERROR:root:/Users/buildslave/jenkins/workspace/lldb-cmake-dwarf5/lldb-build/bin/clang -gdwarf-5 is not a valid compiler executable; aborting...

Hide Details

******************** FAIL: lldb-Suite :: python_api/sbtype_typeclass/TestSBTypeTypeClass.py (697 of 1400) ******************** TEST 'lldb-Suite :: python_api/sbtype_typeclass/TestSBTypeTypeClass.py' FAILED ******************** ERROR:root:/Users/buildslave/jenkins/workspace/lldb-cmake-dwarf5/lldb-build/bin/clang -gdwarf-5 is not a valid compiler executable; aborting...

Hide Details

******************** FAIL: lldb-Suite :: python_api/section/TestSectionAPI.py (698 of 1400) ******************** TEST 'lldb-Suite :: python_api/section/TestSectionAPI.py' FAILED ******************** ERROR:root:/Users/buildslave/jenkins/workspace/lldb-cmake-dwarf5/lldb-build/bin/clang -gdwarf-5 is not a valid compiler executable; aborting...

Hide Details

******************** FAIL: lldb-Suite :: python_api/sbvalue_persist/TestSBValuePersist.py (699 of 1400) ******************** TEST 'lldb-Suite :: python_api/sbvalue_persist/TestSBValuePersist.py' FAILED ******************** ERROR:root:/Users/buildslave/jenkins/workspace/lldb-cmake-dwarf5/lldb-build/bin/clang -gdwarf-5 is not a valid compiler executable; aborting...

Hide Details

******************** FAIL: lldb-Suite :: python_api/signals/TestSignalsAPI.py (700 of 1400) ******************** TEST 'lldb-Suite :: python_api/signals/TestSignalsAPI.py' FAILED ******************** ERROR:root:/Users/buildslave/jenkins/workspace/lldb-cmake-dwarf5/lldb-build/bin/clang -gdwarf-5 is not a valid compiler executable; aborting...

Hide Details

******************** FAIL: lldb-Suite :: python_api/symbol-context/TestSymbolContext.py (701 of 1400) ******************** TEST 'lldb-Suite :: python_api/symbol-context/TestSymbolContext.py' FAILED ******************** ERROR:root:/Users/buildslave/jenkins/workspace/lldb-cmake-dwarf5/lldb-build/bin/clang -gdwarf-5 is not a valid compiler executable; aborting...

Hide Details

******************** FAIL: lldb-Suite :: python_api/symbol-context/two-files/TestSymbolContextTwoFiles.py (702 of 1400) ******************** TEST 'lldb-Suite :: python_api/symbol-context/two-files/TestSymbolContextTwoFiles.py' FAILED ******************** ERROR:root:/Users/buildslave/jenkins/workspace/lldb-cmake-dwarf5/lldb-build/bin/clang -gdwarf-5 is not a valid compiler executable; aborting...

Hide Details

******************** FAIL: lldb-Suite :: python_api/target/TestTargetAPI.py (703 of 1400) ******************** TEST 'lldb-Suite :: python_api/target/TestTargetAPI.py' FAILED ******************** ERROR:root:/Users/buildslave/jenkins/workspace/lldb-cmake-dwarf5/lldb-build/bin/clang -gdwarf-5 is not a valid compiler executable; aborting...

Hide Details

******************** FAIL: lldb-Suite :: python_api/thread/TestThreadAPI.py (704 of 1400) ******************** TEST 'lldb-Suite :: python_api/thread/TestThreadAPI.py' FAILED ******************** ERROR:root:/Users/buildslave/jenkins/workspace/lldb-cmake-dwarf5/lldb-build/bin/clang -gdwarf-5 is not a valid compiler executable; aborting...

Hide Details

******************** FAIL: lldb-Suite :: python_api/type/TestTypeList.py (705 of 1400) ******************** TEST 'lldb-Suite :: python_api/type/TestTypeList.py' FAILED ******************** ERROR:root:/Users/buildslave/jenkins/workspace/lldb-cmake-dwarf5/lldb-build/bin/clang -gdwarf-5 is not a valid compiler executable; aborting...

Hide Details

******************** FAIL: lldb-Suite :: python_api/value/TestValueAPI.py (706 of 1400) ******************** TEST 'lldb-Suite :: python_api/value/TestValueAPI.py' FAILED ******************** ERROR:root:/Users/buildslave/jenkins/workspace/lldb-cmake-dwarf5/lldb-build/bin/clang -gdwarf-5 is not a valid compiler executable; aborting...

Hide Details

******************** FAIL: lldb-Suite :: python_api/value/linked_list/TestValueAPILinkedList.py (707 of 1400) ******************** TEST 'lldb-Suite :: python_api/value/linked_list/TestValueAPILinkedList.py' FAILED ******************** ERROR:root:/Users/buildslave/jenkins/workspace/lldb-cmake-dwarf5/lldb-build/bin/clang -gdwarf-5 is not a valid compiler executable; aborting...

Hide Details

******************** FAIL: lldb-Suite :: python_api/value/empty_class/TestValueAPIEmptyClass.py (708 of 1400) ******************** TEST 'lldb-Suite :: python_api/value/empty_class/TestValueAPIEmptyClass.py' FAILED ******************** ERROR:root:/Users/buildslave/jenkins/workspace/lldb-cmake-dwarf5/lldb-build/bin/clang -gdwarf-5 is not a valid compiler executable; aborting...

Hide Details

******************** FAIL: lldb-Suite :: python_api/value_var_update/TestValueVarUpdate.py (709 of 1400) ******************** TEST 'lldb-Suite :: python_api/value_var_update/TestValueVarUpdate.py' FAILED ******************** ERROR:root:/Users/buildslave/jenkins/workspace/lldb-cmake-dwarf5/lldb-build/bin/clang -gdwarf-5 is not a valid compiler executable; aborting...

Hide Details

******************** FAIL: lldb-Suite :: python_api/watchpoint/TestWatchpointIgnoreCount.py (710 of 1400) ******************** TEST 'lldb-Suite :: python_api/watchpoint/TestWatchpointIgnoreCount.py' FAILED ******************** ERROR:root:/Users/buildslave/jenkins/workspace/lldb-cmake-dwarf5/lldb-build/bin/clang -gdwarf-5 is not a valid compiler executable; aborting...

Hide Details

******************** FAIL: lldb-Suite :: python_api/value/change_values/TestChangeValueAPI.py (711 of 1400) ******************** TEST 'lldb-Suite :: python_api/value/change_values/TestChangeValueAPI.py' FAILED ******************** ERROR:root:/Users/buildslave/jenkins/workspace/lldb-cmake-dwarf5/lldb-build/bin/clang -gdwarf-5 is not a valid compiler executable; aborting...

Hide Details

******************** FAIL: lldb-Suite :: python_api/watchpoint/TestSetWatchpoint.py (712 of 1400) ******************** TEST 'lldb-Suite :: python_api/watchpoint/TestSetWatchpoint.py' FAILED ******************** ERROR:root:/Users/buildslave/jenkins/workspace/lldb-cmake-dwarf5/lldb-build/bin/clang -gdwarf-5 is not a valid compiler executable; aborting...

Hide Details

******************** FAIL: lldb-Suite :: python_api/watchpoint/TestWatchpointIter.py (713 of 1400) ******************** TEST 'lldb-Suite :: python_api/watchpoint/TestWatchpointIter.py' FAILED ******************** ERROR:root:/Users/buildslave/jenkins/workspace/lldb-cmake-dwarf5/lldb-build/bin/clang -gdwarf-5 is not a valid compiler executable; aborting...

Hide Details

******************** FAIL: lldb-Suite :: python_api/watchpoint/condition/TestWatchpointConditionAPI.py (714 of 1400) ******************** TEST 'lldb-Suite :: python_api/watchpoint/condition/TestWatchpointConditionAPI.py' FAILED ******************** ERROR:root:/Users/buildslave/jenkins/workspace/lldb-cmake-dwarf5/lldb-build/bin/clang -gdwarf-5 is not a valid compiler executable; aborting...

Hide Details

******************** FAIL: lldb-Suite :: python_api/watchpoint/watchlocation/TestSetWatchlocation.py (715 of 1400) ******************** TEST 'lldb-Suite :: python_api/watchpoint/watchlocation/TestSetWatchlocation.py' FAILED ******************** ERROR:root:/Users/buildslave/jenkins/workspace/lldb-cmake-dwarf5/lldb-build/bin/clang -gdwarf-5 is not a valid compiler executable; aborting...

Hide Details

******************** FAIL: lldb-Suite :: python_api/watchpoint/watchlocation/TestTargetWatchAddress.py (716 of 1400) ******************** TEST 'lldb-Suite :: python_api/watchpoint/watchlocation/TestTargetWatchAddress.py' FAILED ******************** ERROR:root:/Users/buildslave/jenkins/workspace/lldb-cmake-dwarf5/lldb-build/bin/clang -gdwarf-5 is not a valid compiler executable; aborting...

Hide Details

******************** FAIL: lldb-Suite :: quit/TestQuit.py (717 of 1400) ******************** TEST 'lldb-Suite :: quit/TestQuit.py' FAILED ******************** ERROR:root:/Users/buildslave/jenkins/workspace/lldb-cmake-dwarf5/lldb-build/bin/clang -gdwarf-5 is not a valid compiler executable; aborting...

Hide Details

******************** FAIL: lldb-Suite :: sample_test/TestSampleInlineTest.py (718 of 1400) ******************** TEST 'lldb-Suite :: sample_test/TestSampleInlineTest.py' FAILED ******************** ERROR:root:/Users/buildslave/jenkins/workspace/lldb-cmake-dwarf5/lldb-build/bin/clang -gdwarf-5 is not a valid compiler executable; aborting...

Hide Details

******************** FAIL: lldb-Suite :: settings/quoting/TestQuoting.py (719 of 1400) ******************** TEST 'lldb-Suite :: settings/quoting/TestQuoting.py' FAILED ******************** ERROR:root:/Users/buildslave/jenkins/workspace/lldb-cmake-dwarf5/lldb-build/bin/clang -gdwarf-5 is not a valid compiler executable; aborting...

Hide Details

******************** FAIL: lldb-Suite :: sample_test/TestSampleTest.py (720 of 1400) ******************** TEST 'lldb-Suite :: sample_test/TestSampleTest.py' FAILED ******************** ERROR:root:/Users/buildslave/jenkins/workspace/lldb-cmake-dwarf5/lldb-build/bin/clang -gdwarf-5 is not a valid compiler executable; aborting...

Hide Details

******************** FAIL: lldb-Suite :: settings/TestSettings.py (721 of 1400) ******************** TEST 'lldb-Suite :: settings/TestSettings.py' FAILED ******************** ERROR:root:/Users/buildslave/jenkins/workspace/lldb-cmake-dwarf5/lldb-build/bin/clang -gdwarf-5 is not a valid compiler executable; aborting...

Hide Details

******************** FAIL: lldb-Suite :: source-manager/TestSourceManager.py (722 of 1400) ******************** TEST 'lldb-Suite :: source-manager/TestSourceManager.py' FAILED ******************** ERROR:root:/Users/buildslave/jenkins/workspace/lldb-cmake-dwarf5/lldb-build/bin/clang -gdwarf-5 is not a valid compiler executable; aborting...

Hide Details

******************** FAIL: lldb-Suite :: terminal/TestSTTYBeforeAndAfter.py (723 of 1400) ******************** TEST 'lldb-Suite :: terminal/TestSTTYBeforeAndAfter.py' FAILED ******************** ERROR:root:/Users/buildslave/jenkins/workspace/lldb-cmake-dwarf5/lldb-build/bin/clang -gdwarf-5 is not a valid compiler executable; aborting...

Hide Details

******************** FAIL: lldb-Suite :: tools/lldb-mi/TestMiEnvironmentCd.py (724 of 1400) ******************** TEST 'lldb-Suite :: tools/lldb-mi/TestMiEnvironmentCd.py' FAILED ******************** ERROR:root:/Users/buildslave/jenkins/workspace/lldb-cmake-dwarf5/lldb-build/bin/clang -gdwarf-5 is not a valid compiler executable; aborting...

Hide Details

******************** FAIL: lldb-Suite :: tools/lldb-mi/TestMiFile.py (725 of 1400) ******************** TEST 'lldb-Suite :: tools/lldb-mi/TestMiFile.py' FAILED ******************** ERROR:root:/Users/buildslave/jenkins/workspace/lldb-cmake-dwarf5/lldb-build/bin/clang -gdwarf-5 is not a valid compiler executable; aborting...

Hide Details

******************** FAIL: lldb-Suite :: tools/lldb-mi/TestMiLibraryLoaded.py (726 of 1400) ******************** TEST 'lldb-Suite :: tools/lldb-mi/TestMiLibraryLoaded.py' FAILED ******************** ERROR:root:/Users/buildslave/jenkins/workspace/lldb-cmake-dwarf5/lldb-build/bin/clang -gdwarf-5 is not a valid compiler executable; aborting...

Hide Details

******************** FAIL: lldb-Suite :: tools/lldb-mi/breakpoint/TestMiBreak.py (727 of 1400) ******************** TEST 'lldb-Suite :: tools/lldb-mi/breakpoint/TestMiBreak.py' FAILED ******************** ERROR:root:/Users/buildslave/jenkins/workspace/lldb-cmake-dwarf5/lldb-build/bin/clang -gdwarf-5 is not a valid compiler executable; aborting...

Hide Details

******************** FAIL: lldb-Suite :: tools/lldb-mi/control/TestMiExec.py (728 of 1400) ******************** TEST 'lldb-Suite :: tools/lldb-mi/control/TestMiExec.py' FAILED ******************** ERROR:root:/Users/buildslave/jenkins/workspace/lldb-cmake-dwarf5/lldb-build/bin/clang -gdwarf-5 is not a valid compiler executable; aborting...

Hide Details

******************** FAIL: lldb-Suite :: tools/lldb-mi/TestMiPrompt.py (729 of 1400) ******************** TEST 'lldb-Suite :: tools/lldb-mi/TestMiPrompt.py' FAILED ******************** ERROR:root:/Users/buildslave/jenkins/workspace/lldb-cmake-dwarf5/lldb-build/bin/clang -gdwarf-5 is not a valid compiler executable; aborting...

Hide Details

******************** FAIL: lldb-Suite :: tools/lldb-mi/data/TestMiData.py (730 of 1400) ******************** TEST 'lldb-Suite :: tools/lldb-mi/data/TestMiData.py' FAILED ******************** ERROR:root:/Users/buildslave/jenkins/workspace/lldb-cmake-dwarf5/lldb-build/bin/clang -gdwarf-5 is not a valid compiler executable; aborting...

Hide Details

******************** FAIL: lldb-Suite :: tools/lldb-mi/interpreter/TestMiInterpreterExec.py (731 of 1400) ******************** TEST 'lldb-Suite :: tools/lldb-mi/interpreter/TestMiInterpreterExec.py' FAILED ******************** ERROR:root:/Users/buildslave/jenkins/workspace/lldb-cmake-dwarf5/lldb-build/bin/clang -gdwarf-5 is not a valid compiler executable; aborting...

Hide Details

******************** FAIL: lldb-Suite :: tools/lldb-mi/lexical_scope/TestMiLexicalScope.py (732 of 1400) ******************** TEST 'lldb-Suite :: tools/lldb-mi/lexical_scope/TestMiLexicalScope.py' FAILED ******************** ERROR:root:/Users/buildslave/jenkins/workspace/lldb-cmake-dwarf5/lldb-build/bin/clang -gdwarf-5 is not a valid compiler executable; aborting...

Hide Details

******************** FAIL: lldb-Suite :: tools/lldb-mi/interpreter/TestMiCliSupport.py (733 of 1400) ******************** TEST 'lldb-Suite :: tools/lldb-mi/interpreter/TestMiCliSupport.py' FAILED ******************** ERROR:root:/Users/buildslave/jenkins/workspace/lldb-cmake-dwarf5/lldb-build/bin/clang -gdwarf-5 is not a valid compiler executable; aborting...

Hide Details

******************** FAIL: lldb-Suite :: tools/lldb-mi/stack/TestMiStack.py (734 of 1400) ******************** TEST 'lldb-Suite :: tools/lldb-mi/stack/TestMiStack.py' FAILED ******************** ERROR:root:/Users/buildslave/jenkins/workspace/lldb-cmake-dwarf5/lldb-build/bin/clang -gdwarf-5 is not a valid compiler executable; aborting...

Hide Details

******************** FAIL: lldb-Suite :: tools/lldb-mi/syntax/TestMiSyntax.py (735 of 1400) ******************** TEST 'lldb-Suite :: tools/lldb-mi/syntax/TestMiSyntax.py' FAILED ******************** ERROR:root:/Users/buildslave/jenkins/workspace/lldb-cmake-dwarf5/lldb-build/bin/clang -gdwarf-5 is not a valid compiler executable; aborting...

Hide Details

******************** FAIL: lldb-Suite :: tools/lldb-mi/target/TestMiTarget.py (736 of 1400) ******************** TEST 'lldb-Suite :: tools/lldb-mi/target/TestMiTarget.py' FAILED ******************** ERROR:root:/Users/buildslave/jenkins/workspace/lldb-cmake-dwarf5/lldb-build/bin/clang -gdwarf-5 is not a valid compiler executable; aborting...

Hide Details

******************** FAIL: lldb-Suite :: tools/lldb-mi/startup_options/TestMiStartupOptions.py (737 of 1400) ******************** TEST 'lldb-Suite :: tools/lldb-mi/startup_options/TestMiStartupOptions.py' FAILED ******************** ERROR:root:/Users/buildslave/jenkins/workspace/lldb-cmake-dwarf5/lldb-build/bin/clang -gdwarf-5 is not a valid compiler executable; aborting...

Hide Details

******************** FAIL: lldb-Suite :: tools/lldb-mi/threadinfo/TestMiThreadInfo.py (738 of 1400) ******************** TEST 'lldb-Suite :: tools/lldb-mi/threadinfo/TestMiThreadInfo.py' FAILED ******************** ERROR:root:/Users/buildslave/jenkins/workspace/lldb-cmake-dwarf5/lldb-build/bin/clang -gdwarf-5 is not a valid compiler executable; aborting...

Hide Details

******************** FAIL: lldb-Suite :: tools/lldb-mi/signal/TestMiSignal.py (739 of 1400) ******************** TEST 'lldb-Suite :: tools/lldb-mi/signal/TestMiSignal.py' FAILED ******************** ERROR:root:/Users/buildslave/jenkins/workspace/lldb-cmake-dwarf5/lldb-build/bin/clang -gdwarf-5 is not a valid compiler executable; aborting...

Hide Details

******************** FAIL: lldb-Suite :: tools/lldb-mi/variable/TestMiGdbSetShowPrint.py (740 of 1400) ******************** TEST 'lldb-Suite :: tools/lldb-mi/variable/TestMiGdbSetShowPrint.py' FAILED ******************** ERROR:root:/Users/buildslave/jenkins/workspace/lldb-cmake-dwarf5/lldb-build/bin/clang -gdwarf-5 is not a valid compiler executable; aborting...

Hide Details

******************** FAIL: lldb-Suite :: tools/lldb-mi/variable/TestMiVar.py (741 of 1400) ******************** TEST 'lldb-Suite :: tools/lldb-mi/variable/TestMiVar.py' FAILED ******************** ERROR:root:/Users/buildslave/jenkins/workspace/lldb-cmake-dwarf5/lldb-build/bin/clang -gdwarf-5 is not a valid compiler executable; aborting...

Hide Details

******************** FAIL: lldb-Suite :: tools/lldb-server/TestAppleSimulatorOSType.py (742 of 1400) ******************** TEST 'lldb-Suite :: tools/lldb-server/TestAppleSimulatorOSType.py' FAILED ******************** ERROR:root:/Users/buildslave/jenkins/workspace/lldb-cmake-dwarf5/lldb-build/bin/clang -gdwarf-5 is not a valid compiler executable; aborting...

Hide Details

******************** FAIL: lldb-Suite :: tools/lldb-server/TestGdbRemoteAttach.py (743 of 1400) ******************** TEST 'lldb-Suite :: tools/lldb-server/TestGdbRemoteAttach.py' FAILED ******************** ERROR:root:/Users/buildslave/jenkins/workspace/lldb-cmake-dwarf5/lldb-build/bin/clang -gdwarf-5 is not a valid compiler executable; aborting...

Hide Details

******************** FAIL: lldb-Suite :: tools/lldb-server/TestGdbRemoteAuxvSupport.py (744 of 1400) ******************** TEST 'lldb-Suite :: tools/lldb-server/TestGdbRemoteAuxvSupport.py' FAILED ******************** ERROR:root:/Users/buildslave/jenkins/workspace/lldb-cmake-dwarf5/lldb-build/bin/clang -gdwarf-5 is not a valid compiler executable; aborting...

Hide Details

******************** FAIL: lldb-Suite :: tools/lldb-server/TestGdbRemoteExitCode.py (745 of 1400) ******************** TEST 'lldb-Suite :: tools/lldb-server/TestGdbRemoteExitCode.py' FAILED ******************** ERROR:root:/Users/buildslave/jenkins/workspace/lldb-cmake-dwarf5/lldb-build/bin/clang -gdwarf-5 is not a valid compiler executable; aborting...

Hide Details

******************** FAIL: lldb-Suite :: tools/lldb-server/TestGdbRemoteExpeditedRegisters.py (746 of 1400) ******************** TEST 'lldb-Suite :: tools/lldb-server/TestGdbRemoteExpeditedRegisters.py' FAILED ******************** ERROR:root:/Users/buildslave/jenkins/workspace/lldb-cmake-dwarf5/lldb-build/bin/clang -gdwarf-5 is not a valid compiler executable; aborting...

Hide Details

******************** FAIL: lldb-Suite :: tools/lldb-server/TestGdbRemoteGPacket.py (747 of 1400) ******************** TEST 'lldb-Suite :: tools/lldb-server/TestGdbRemoteGPacket.py' FAILED ******************** ERROR:root:/Users/buildslave/jenkins/workspace/lldb-cmake-dwarf5/lldb-build/bin/clang -gdwarf-5 is not a valid compiler executable; aborting...

Hide Details

******************** FAIL: lldb-Suite :: tools/lldb-server/TestGdbRemoteHostInfo.py (748 of 1400) ******************** TEST 'lldb-Suite :: tools/lldb-server/TestGdbRemoteHostInfo.py' FAILED ******************** ERROR:root:/Users/buildslave/jenkins/workspace/lldb-cmake-dwarf5/lldb-build/bin/clang -gdwarf-5 is not a valid compiler executable; aborting...

Hide Details

******************** FAIL: lldb-Suite :: tools/lldb-server/TestGdbRemoteKill.py (749 of 1400) ******************** TEST 'lldb-Suite :: tools/lldb-server/TestGdbRemoteKill.py' FAILED ******************** ERROR:root:/Users/buildslave/jenkins/workspace/lldb-cmake-dwarf5/lldb-build/bin/clang -gdwarf-5 is not a valid compiler executable; aborting...

Hide Details

******************** FAIL: lldb-Suite :: tools/lldb-server/TestGdbRemoteModuleInfo.py (750 of 1400) ******************** TEST 'lldb-Suite :: tools/lldb-server/TestGdbRemoteModuleInfo.py' FAILED ******************** ERROR:root:/Users/buildslave/jenkins/workspace/lldb-cmake-dwarf5/lldb-build/bin/clang -gdwarf-5 is not a valid compiler executable; aborting...

Hide Details

******************** FAIL: lldb-Suite :: tools/lldb-server/TestGdbRemoteProcessInfo.py (751 of 1400) ******************** TEST 'lldb-Suite :: tools/lldb-server/TestGdbRemoteProcessInfo.py' FAILED ******************** ERROR:root:/Users/buildslave/jenkins/workspace/lldb-cmake-dwarf5/lldb-build/bin/clang -gdwarf-5 is not a valid compiler executable; aborting...

Hide Details

******************** FAIL: lldb-Suite :: tools/lldb-server/TestGdbRemoteSingleStep.py (752 of 1400) ******************** TEST 'lldb-Suite :: tools/lldb-server/TestGdbRemoteSingleStep.py' FAILED ******************** ERROR:root:/Users/buildslave/jenkins/workspace/lldb-cmake-dwarf5/lldb-build/bin/clang -gdwarf-5 is not a valid compiler executable; aborting...

Hide Details

******************** FAIL: lldb-Suite :: tools/lldb-server/TestGdbRemoteThreadsInStopReply.py (753 of 1400) ******************** TEST 'lldb-Suite :: tools/lldb-server/TestGdbRemoteThreadsInStopReply.py' FAILED ******************** ERROR:root:/Users/buildslave/jenkins/workspace/lldb-cmake-dwarf5/lldb-build/bin/clang -gdwarf-5 is not a valid compiler executable; aborting...

Hide Details

******************** FAIL: lldb-Suite :: tools/lldb-server/TestGdbRemote_qThreadStopInfo.py (754 of 1400) ******************** TEST 'lldb-Suite :: tools/lldb-server/TestGdbRemote_qThreadStopInfo.py' FAILED ******************** ERROR:root:/Users/buildslave/jenkins/workspace/lldb-cmake-dwarf5/lldb-build/bin/clang -gdwarf-5 is not a valid compiler executable; aborting...

Hide Details

******************** FAIL: lldb-Suite :: tools/lldb-server/TestGdbRemoteRegisterState.py (755 of 1400) ******************** TEST 'lldb-Suite :: tools/lldb-server/TestGdbRemoteRegisterState.py' FAILED ******************** ERROR:root:/Users/buildslave/jenkins/workspace/lldb-cmake-dwarf5/lldb-build/bin/clang -gdwarf-5 is not a valid compiler executable; aborting...

Hide Details

******************** FAIL: lldb-Suite :: tools/lldb-server/TestGdbRemote_vCont.py (756 of 1400) ******************** TEST 'lldb-Suite :: tools/lldb-server/TestGdbRemote_vCont.py' FAILED ******************** ERROR:root:/Users/buildslave/jenkins/workspace/lldb-cmake-dwarf5/lldb-build/bin/clang -gdwarf-5 is not a valid compiler executable; aborting...

Hide Details

******************** FAIL: lldb-Suite :: tools/lldb-server/commandline/TestStubReverseConnect.py (757 of 1400) ******************** TEST 'lldb-Suite :: tools/lldb-server/commandline/TestStubReverseConnect.py' FAILED ******************** ERROR:root:/Users/buildslave/jenkins/workspace/lldb-cmake-dwarf5/lldb-build/bin/clang -gdwarf-5 is not a valid compiler executable; aborting...

Hide Details

******************** FAIL: lldb-Suite :: tools/lldb-server/inferior-crash/TestGdbRemoteSegFault.py (758 of 1400) ******************** TEST 'lldb-Suite :: tools/lldb-server/inferior-crash/TestGdbRemoteSegFault.py' FAILED ******************** ERROR:root:/Users/buildslave/jenkins/workspace/lldb-cmake-dwarf5/lldb-build/bin/clang -gdwarf-5 is not a valid compiler executable; aborting...

Hide Details

******************** FAIL: lldb-Suite :: tools/lldb-server/TestLldbGdbServer.py (759 of 1400) ******************** TEST 'lldb-Suite :: tools/lldb-server/TestLldbGdbServer.py' FAILED ******************** ERROR:root:/Users/buildslave/jenkins/workspace/lldb-cmake-dwarf5/lldb-build/bin/clang -gdwarf-5 is not a valid compiler executable; aborting...

Hide Details

******************** FAIL: lldb-Suite :: tools/lldb-server/commandline/TestStubSetSID.py (760 of 1400) ******************** TEST 'lldb-Suite :: tools/lldb-server/commandline/TestStubSetSID.py' FAILED ******************** ERROR:root:/Users/buildslave/jenkins/workspace/lldb-cmake-dwarf5/lldb-build/bin/clang -gdwarf-5 is not a valid compiler executable; aborting...

Hide Details

******************** FAIL: lldb-Suite :: tools/lldb-server/inferior-crash/TestGdbRemoteAbort.py (761 of 1400) ******************** TEST 'lldb-Suite :: tools/lldb-server/inferior-crash/TestGdbRemoteAbort.py' FAILED ******************** ERROR:root:/Users/buildslave/jenkins/workspace/lldb-cmake-dwarf5/lldb-build/bin/clang -gdwarf-5 is not a valid compiler executable; aborting...

Hide Details

******************** FAIL: lldb-Suite :: tools/lldb-server/signal-filtering/TestGdbRemote_QPassSignals.py (762 of 1400) ******************** TEST 'lldb-Suite :: tools/lldb-server/signal-filtering/TestGdbRemote_QPassSignals.py' FAILED ******************** ERROR:root:/Users/buildslave/jenkins/workspace/lldb-cmake-dwarf5/lldb-build/bin/clang -gdwarf-5 is not a valid compiler executable; aborting...

Hide Details

******************** PASS: lldb-Unit :: Breakpoint/./LLDBBreakpointTests/BreakpointIDTest.StringIsBreakpointName (763 of 1400) FAIL: lldb-Suite :: tools/lldb-server/platform-process-connect/TestPlatformProcessConnect.py (764 of 1400) ******************** TEST 'lldb-Suite :: tools/lldb-server/platform-process-connect/TestPlatformProcessConnect.py' FAILED ******************** ERROR:root:/Users/buildslave/jenkins/workspace/lldb-cmake-dwarf5/lldb-build/bin/clang -gdwarf-5 is not a valid compiler executable; aborting...

Hide Details

******************** PASS: lldb-Unit :: Core/./LLDBCoreTests/BroadcasterTest.BroadcastEvent (765 of 1400) PASS: lldb-Unit :: Core/./LLDBCoreTests/BroadcasterTest.EventTypeHasListeners (766 of 1400) PASS: lldb-Unit :: Core/./LLDBCoreTests/EventTest.DumpEventDataBytes (767 of 1400) PASS: lldb-Unit :: Core/./LLDBCoreTests/ListenerTest.GetEventImmediate (768 of 1400) PASS: lldb-Unit :: Core/./LLDBCoreTests/MangledTest.EmptyForInvalidName (769 of 1400) PASS: lldb-Unit :: Core/./LLDBCoreTests/MangledTest.ResultForValidName (770 of 1400) PASS: lldb-Unit :: Core/./LLDBCoreTests/RangeTest.Clear (771 of 1400) PASS: lldb-Unit :: Core/./LLDBCoreTests/RangeTest.ClearWithStarAddress (772 of 1400) PASS: lldb-Unit :: Core/./LLDBCoreTests/ListenerTest.GetEventWait (773 of 1400) PASS: lldb-Unit :: Core/./LLDBCoreTests/RangeTest.Constructor (774 of 1400) PASS: lldb-Unit :: Core/./LLDBCoreTests/RangeTest.ContainsAddr (775 of 1400) PASS: lldb-Unit :: Core/./LLDBCoreTests/RangeTest.ContainsAddrInvalid (776 of 1400) PASS: lldb-Unit :: Core/./LLDBCoreTests/MangledTest.NameIndexes_FindFunctionSymbols (777 of 1400) PASS: lldb-Unit :: Core/./LLDBCoreTests/RangeTest.ContainsEndInclusive (778 of 1400) PASS: lldb-Unit :: Core/./LLDBCoreTests/RangeTest.ContainsEndInclusiveInvalid (779 of 1400) PASS: lldb-Unit :: Core/./LLDBCoreTests/RangeTest.ContainsRange (780 of 1400) PASS: lldb-Unit :: Core/./LLDBCoreTests/RangeTest.Copy (781 of 1400) PASS: lldb-Unit :: Core/./LLDBCoreTests/RangeTest.ContainsRangeStartingFromZero (782 of 1400) PASS: lldb-Unit :: Core/./LLDBCoreTests/RangeTest.DefaultConstructor (783 of 1400) PASS: lldb-Unit :: Core/./LLDBCoreTests/RangeTest.DoesIntersect (784 of 1400) PASS: lldb-Unit :: Core/./LLDBCoreTests/RangeTest.DoesAdjoinOrIntersect (785 of 1400) PASS: lldb-Unit :: Core/./LLDBCoreTests/RangeTest.Equal (786 of 1400) PASS: lldb-Unit :: Core/./LLDBCoreTests/RangeTest.EqualInvalid (787 of 1400) PASS: lldb-Unit :: Core/./LLDBCoreTests/RangeTest.LessThan (788 of 1400) PASS: lldb-Unit :: Core/./LLDBCoreTests/RangeTest.LessThanInvalid (789 of 1400) PASS: lldb-Unit :: Core/./LLDBCoreTests/RangeTest.NotEqual (790 of 1400) PASS: lldb-Unit :: Core/./LLDBCoreTests/RangeTest.NotEqualInvalid (791 of 1400) PASS: lldb-Unit :: Core/./LLDBCoreTests/RangeTest.SetRangeBase (792 of 1400) PASS: lldb-Unit :: Core/./LLDBCoreTests/RangeTest.SizeTypes (793 of 1400) PASS: lldb-Unit :: Core/./LLDBCoreTests/RangeTest.Slide (794 of 1400) PASS: lldb-Unit :: Core/./LLDBCoreTests/RangeTest.SlideZero (795 of 1400) PASS: lldb-Unit :: Core/./LLDBCoreTests/RangeTest.Union (796 of 1400) PASS: lldb-Unit :: Core/./LLDBCoreTests/RichManglingContextTest.Basic (797 of 1400) PASS: lldb-Unit :: Core/./LLDBCoreTests/RichManglingContextTest.FromCxxMethodName (798 of 1400) FAIL: lldb-Suite :: tools/lldb-server/thread-name/TestGdbRemoteThreadName.py (799 of 1400) ******************** TEST 'lldb-Suite :: tools/lldb-server/thread-name/TestGdbRemoteThreadName.py' FAILED ******************** ERROR:root:/Users/buildslave/jenkins/workspace/lldb-cmake-dwarf5/lldb-build/bin/clang -gdwarf-5 is not a valid compiler executable; aborting...

Hide Details

******************** PASS: lldb-Unit :: Core/./LLDBCoreTests/RichManglingContextTest.SwitchProvider (800 of 1400) PASS: lldb-Unit :: Core/./LLDBCoreTests/StreamCallbackTest.Callback (801 of 1400) PASS: lldb-Unit :: Core/./LLDBCoreTests/RichManglingContextTest.IPDRealloc (802 of 1400) PASS: lldb-Unit :: Editline/./EditlineTests/EditlineTestFixture.EditlineReceivesMultiLineText (803 of 1400) PASS: lldb-Unit :: Editline/./EditlineTests/EditlineTestFixture.EditlineReceivesSingleLineText (804 of 1400) PASS: lldb-Unit :: Host/./HostTests/FileSystemTest.EnumerateDirectory (805 of 1400) PASS: lldb-Unit :: Expression/./ExpressionTests/ClangHostTest.MacOSX (806 of 1400) PASS: lldb-Unit :: Host/./HostTests/FileSystemTest.Exists (807 of 1400) PASS: lldb-Unit :: Host/./HostTests/FileSystemTest.FileAndDirectoryComponents (808 of 1400) PASS: lldb-Unit :: Disassembler/./DisassemblerTests/TestArmv7Disassembly.TestCortexFPDisass (809 of 1400) PASS: lldb-Unit :: Host/./HostTests/FileSystemTest.GetByteSize (810 of 1400) PASS: lldb-Unit :: Host/./HostTests/FileSystemTest.GetPermissions (811 of 1400) PASS: lldb-Unit :: Host/./HostTests/FileSystemTest.MakeAbsolute (812 of 1400) PASS: lldb-Unit :: Host/./HostTests/FileSystemTest.Readable (813 of 1400) PASS: lldb-Unit :: Host/./HostTests/FileSystemTest.Resolve (814 of 1400) PASS: lldb-Unit :: Host/./HostTests/Host.GetEnvironment (815 of 1400) PASS: lldb-Unit :: Host/./HostTests/Host.WaitStatusFormat (816 of 1400) PASS: lldb-Unit :: Host/./HostTests/HostInfoTest.GetAugmentedArchSpec (817 of 1400) PASS: lldb-Unit :: Host/./HostTests/MainLoopTest.ReadObject (818 of 1400) PASS: lldb-Unit :: Host/./HostTests/MainLoopTest.DetectsEOF (819 of 1400) PASS: lldb-Unit :: Host/./HostTests/NativeProcessProtocolTest.ReadMemoryWithoutTrap (820 of 1400) PASS: lldb-Unit :: Host/./HostTests/MainLoopTest.Signal (821 of 1400) PASS: lldb-Unit :: Host/./HostTests/NativeProcessProtocolTest.SetBreakpoint (822 of 1400) PASS: lldb-Unit :: Host/./HostTests/MainLoopTest.TerminatesImmediately (823 of 1400) PASS: lldb-Unit :: Host/./HostTests/NativeProcessProtocolTest.SetBreakpointFailRead (824 of 1400) PASS: lldb-Unit :: Host/./HostTests/NativeProcessProtocolTest.SetBreakpointFailVerify (825 of 1400) PASS: lldb-Unit :: Host/./HostTests/NativeProcessProtocolTest.SetBreakpointFailWrite (826 of 1400) PASS: lldb-Unit :: Host/./HostTests/SocketAddressTest.GetAddressInfo (827 of 1400) PASS: lldb-Unit :: Host/./HostTests/SocketAddressTest.Set (828 of 1400) PASS: lldb-Unit :: Host/./HostTests/SocketTest.DecodeHostAndPort (829 of 1400) PASS: lldb-Unit :: Host/./HostTests/SocketTest.DomainListenConnectAccept (830 of 1400) PASS: lldb-Unit :: Host/./HostTests/SocketTest.TCPGetAddress (831 of 1400) PASS: lldb-Unit :: Host/./HostTests/SocketTest.TCPListen0ConnectAccept (832 of 1400) PASS: lldb-Unit :: Host/./HostTests/SocketTest.TCPListen0GetPort (833 of 1400) PASS: lldb-Unit :: Host/./HostTests/SocketTest.UDPConnect (834 of 1400) PASS: lldb-Unit :: Host/./HostTests/SymbolsTest.LocateExecutableSymbolFileForUnknownExecutableAndMissingSymbolFile (835 of 1400) PASS: lldb-Unit :: Host/./HostTests/SymbolsTest.TerminateLocateExecutableSymbolFileForUnknownExecutableAndUnknownSymbolFile (836 of 1400) PASS: lldb-Unit :: Host/./HostTests/TaskPoolTest.AddTask (837 of 1400) PASS: lldb-Unit :: Host/./HostTests/TaskPoolTest.TaskMap (838 of 1400) PASS: lldb-Unit :: Host/./HostTests/TaskPoolTest.RunTasks (839 of 1400) PASS: lldb-Unit :: Interpreter/./InterpreterTests/OptionArgParserTest.toScriptLanguage (840 of 1400) PASS: lldb-Unit :: Interpreter/./InterpreterTests/OptionArgParserTest.toBoolean (841 of 1400) PASS: lldb-Unit :: Interpreter/./InterpreterTests/OptionArgParserTest.toChar (842 of 1400) PASS: lldb-Unit :: Language/CPlusPlus/./LanguageCPlusPlusTests/CPlusPlusLanguage.ExtractContextAndIdentifier (843 of 1400) PASS: lldb-Unit :: Language/CPlusPlus/./LanguageCPlusPlusTests/CPlusPlusLanguage.FindAlternateFunctionManglings (844 of 1400) PASS: lldb-Unit :: Interpreter/./InterpreterTests/CompletionTest.DirCompletionAbsolute (845 of 1400) PASS: lldb-Unit :: Interpreter/./InterpreterTests/CompletionTest.DirCompletionUsername (846 of 1400) PASS: lldb-Unit :: Language/CPlusPlus/./LanguageCPlusPlusTests/CPlusPlusLanguage.MethodNameParsing (847 of 1400) PASS: lldb-Unit :: Interpreter/./InterpreterTests/CompletionTest.FileCompletionAbsolute (848 of 1400) PASS: lldb-Unit :: Language/Highlighting/./HighlighterTests/HighlighterTest.ClangBraces (849 of 1400) PASS: lldb-Unit :: Language/Highlighting/./HighlighterTests/HighlighterTest.ClangComments (850 of 1400) PASS: lldb-Unit :: Language/Highlighting/./HighlighterTests/HighlighterTest.ClangCommas (851 of 1400) PASS: lldb-Unit :: Language/Highlighting/./HighlighterTests/HighlighterTest.ClangCursorOutOfBounds (852 of 1400) PASS: lldb-Unit :: Language/Highlighting/./HighlighterTests/HighlighterTest.ClangCursorPos (853 of 1400) PASS: lldb-Unit :: Language/Highlighting/./HighlighterTests/HighlighterTest.ClangCursorPosAfterOtherToken (854 of 1400) PASS: lldb-Unit :: Language/Highlighting/./HighlighterTests/HighlighterTest.ClangCursorPosBeforeOtherToken (855 of 1400) PASS: lldb-Unit :: Language/Highlighting/./HighlighterTests/HighlighterTest.ClangCursorPosEndOfLine (856 of 1400) PASS: lldb-Unit :: Language/Highlighting/./HighlighterTests/HighlighterTest.ClangCursorPosInOtherToken (857 of 1400) PASS: lldb-Unit :: Language/Highlighting/./HighlighterTests/HighlighterTest.ClangEmptyInput (858 of 1400) PASS: lldb-Unit :: Language/Highlighting/./HighlighterTests/HighlighterTest.ClangIdentifiers (859 of 1400) PASS: lldb-Unit :: Language/Highlighting/./HighlighterTests/HighlighterTest.ClangPPDirectives (860 of 1400) PASS: lldb-Unit :: Language/Highlighting/./HighlighterTests/HighlighterTest.ClangScalarLiterals (861 of 1400) PASS: lldb-Unit :: Language/Highlighting/./HighlighterTests/HighlighterTest.ClangOperators (862 of 1400) PASS: lldb-Unit :: Language/Highlighting/./HighlighterTests/HighlighterTest.ClangSquareBrackets (863 of 1400) PASS: lldb-Unit :: Language/Highlighting/./HighlighterTests/HighlighterTest.ClangStringLiterals (864 of 1400) PASS: lldb-Unit :: Language/Highlighting/./HighlighterTests/HighlighterTest.ClangUnterminatedString (865 of 1400) PASS: lldb-Unit :: Language/Highlighting/./HighlighterTests/HighlighterTest.Colons (866 of 1400) PASS: lldb-Unit :: Language/Highlighting/./HighlighterTests/HighlighterTest.DefaultHighlighter (867 of 1400) PASS: lldb-Unit :: Language/Highlighting/./HighlighterTests/HighlighterTest.DefaultHighlighterWithCursor (868 of 1400) PASS: lldb-Unit :: Language/Highlighting/./HighlighterTests/HighlighterTest.DefaultHighlighterWithCursorOutOfBounds (869 of 1400) PASS: lldb-Unit :: Language/Highlighting/./HighlighterTests/HighlighterTest.HighlighterSelectionPath (870 of 1400) PASS: lldb-Unit :: Language/Highlighting/./HighlighterTests/HighlighterTest.FallbackHighlighter (871 of 1400) PASS: lldb-Unit :: Language/Highlighting/./HighlighterTests/HighlighterTest.HighlighterSelectionType (872 of 1400) PASS: lldb-Unit :: Language/Highlighting/./HighlighterTests/HighlighterTest.Keywords (873 of 1400) PASS: lldb-Unit :: Platform/./LLDBPlatformTests/PlatformDarwinTest.TestParseVersionBuildDir (874 of 1400) PASS: lldb-Unit :: ObjectFile/ELF/./ObjectFileELFTests/ObjectFileELFTest.GetModuleSpecifications_EarlySectionHeaders (875 of 1400) PASS: lldb-Unit :: ObjectFile/ELF/./ObjectFileELFTests/ObjectFileELFTest.TestAARCH64Relocations (876 of 1400) PASS: lldb-Unit :: ObjectFile/ELF/./ObjectFileELFTests/ObjectFileELFTest.SectionsResolveConsistently (877 of 1400) PASS: lldb-Unit :: Process/gdb-remote/./ProcessGdbRemoteTests/GDBRemoteClientBaseTest.SendContinueAndInterrupt2PacketBug (878 of 1400) PASS: lldb-Unit :: Process/gdb-remote/./ProcessGdbRemoteTests/GDBRemoteClientBaseTest.SendContinueAndWait (879 of 1400) PASS: lldb-Unit :: Process/gdb-remote/./ProcessGdbRemoteTests/GDBRemoteClientBaseTest.SendContinueDelegateInterface (880 of 1400) PASS: lldb-Unit :: Process/gdb-remote/./ProcessGdbRemoteTests/GDBRemoteClientBaseTest.SendContinueDelegateStructuredDataReceipt (881 of 1400) PASS: lldb-Unit :: Process/gdb-remote/./ProcessGdbRemoteTests/GDBRemoteClientBaseTest.SendPacketAndReceiveResponseWithOutputSupport (882 of 1400) PASS: lldb-Unit :: Process/gdb-remote/./ProcessGdbRemoteTests/GDBRemoteCommunicationClientTest.GetMemoryRegionInfo (883 of 1400) PASS: lldb-Unit :: Process/gdb-remote/./ProcessGdbRemoteTests/GDBRemoteCommunicationClientTest.GetMemoryRegionInfoInvalidResponse (884 of 1400) PASS: lldb-Unit :: Process/gdb-remote/./ProcessGdbRemoteTests/GDBRemoteCommunicationClientTest.GetModulesInfo (885 of 1400) PASS: lldb-Unit :: Process/gdb-remote/./ProcessGdbRemoteTests/GDBRemoteClientBaseTest.SendContinueAndAsyncPacket (886 of 1400) PASS: lldb-Unit :: Process/gdb-remote/./ProcessGdbRemoteTests/GDBRemoteCommunicationClientTest.GetModulesInfo_UUID20 (887 of 1400) PASS: lldb-Unit :: Process/gdb-remote/./ProcessGdbRemoteTests/GDBRemoteCommunicationClientTest.GetModulesInfoInvalidResponse (888 of 1400) PASS: lldb-Unit :: Process/gdb-remote/./ProcessGdbRemoteTests/GDBRemoteCommunicationClientTest.ReadRegister (889 of 1400) PASS: lldb-Unit :: Process/gdb-remote/./ProcessGdbRemoteTests/GDBRemoteCommunicationClientTest.SendGetDataPacket (890 of 1400) PASS: lldb-Unit :: Process/gdb-remote/./ProcessGdbRemoteTests/GDBRemoteCommunicationClientTest.SaveRestoreRegistersNoSuffix (891 of 1400) PASS: lldb-Unit :: Process/gdb-remote/./ProcessGdbRemoteTests/GDBRemoteClientBaseTest.SendContinueAndAsyncSignal (892 of 1400) PASS: lldb-Unit :: Process/gdb-remote/./ProcessGdbRemoteTests/GDBRemoteClientBaseTest.SendContinueAndInterrupt (893 of 1400) PASS: lldb-Unit :: Process/gdb-remote/./ProcessGdbRemoteTests/GDBRemoteClientBaseTest.SendContinueAndLateInterrupt (894 of 1400) FAIL: lldb-Suite :: tools/lldb-vscode/attach/TestVSCode_attach.py (895 of 1400) ******************** TEST 'lldb-Suite :: tools/lldb-vscode/attach/TestVSCode_attach.py' FAILED ******************** ERROR:root:/Users/buildslave/jenkins/workspace/lldb-cmake-dwarf5/lldb-build/bin/clang -gdwarf-5 is not a valid compiler executable; aborting...

Hide Details

******************** FAIL: lldb-Suite :: tools/lldb-vscode/launch/TestVSCode_launch.py (896 of 1400) ******************** TEST 'lldb-Suite :: tools/lldb-vscode/launch/TestVSCode_launch.py' FAILED ******************** ERROR:root:/Users/buildslave/jenkins/workspace/lldb-cmake-dwarf5/lldb-build/bin/clang -gdwarf-5 is not a valid compiler executable; aborting...

Hide Details

******************** FAIL: lldb-Suite :: tools/lldb-vscode/step/TestVSCode_step.py (897 of 1400) ******************** TEST 'lldb-Suite :: tools/lldb-vscode/step/TestVSCode_step.py' FAILED ******************** ERROR:root:/Users/buildslave/jenkins/workspace/lldb-cmake-dwarf5/lldb-build/bin/clang -gdwarf-5 is not a valid compiler executable; aborting...

Hide Details

******************** FAIL: lldb-Suite :: tools/lldb-vscode/breakpoint/TestVSCode_setFunctionBreakpoints.py (898 of 1400) ******************** TEST 'lldb-Suite :: tools/lldb-vscode/breakpoint/TestVSCode_setFunctionBreakpoints.py' FAILED ******************** ERROR:root:/Users/buildslave/jenkins/workspace/lldb-cmake-dwarf5/lldb-build/bin/clang -gdwarf-5 is not a valid compiler executable; aborting...

Hide Details

******************** FAIL: lldb-Suite :: tools/lldb-vscode/breakpoint/TestVSCode_setExceptionBreakpoints.py (899 of 1400) ******************** TEST 'lldb-Suite :: tools/lldb-vscode/breakpoint/TestVSCode_setExceptionBreakpoints.py' FAILED ******************** ERROR:root:/Users/buildslave/jenkins/workspace/lldb-cmake-dwarf5/lldb-build/bin/clang -gdwarf-5 is not a valid compiler executable; aborting...

Hide Details

******************** FAIL: lldb-Suite :: tools/lldb-vscode/breakpoint/TestVSCode_setBreakpoints.py (900 of 1400) ******************** TEST 'lldb-Suite :: tools/lldb-vscode/breakpoint/TestVSCode_setBreakpoints.py' FAILED ******************** ERROR:root:/Users/buildslave/jenkins/workspace/lldb-cmake-dwarf5/lldb-build/bin/clang -gdwarf-5 is not a valid compiler executable; aborting...

Hide Details

******************** PASS: lldb-Unit :: Process/gdb-remote/./ProcessGdbRemoteTests/GDBRemoteCommunicationClientTest.SendGetMetaDataPacket (901 of 1400) PASS: lldb-Unit :: Process/gdb-remote/./ProcessGdbRemoteTests/GDBRemoteCommunicationClientTest.SendSignalsToIgnore (902 of 1400) PASS: lldb-Unit :: Process/gdb-remote/./ProcessGdbRemoteTests/GDBRemoteCommunicationClientTest.SendGetTraceConfigPacket (903 of 1400) FAIL: lldb-Suite :: tools/lldb-vscode/stackTrace/TestVSCode_stackTrace.py (904 of 1400) ******************** TEST 'lldb-Suite :: tools/lldb-vscode/stackTrace/TestVSCode_stackTrace.py' FAILED ******************** ERROR:root:/Users/buildslave/jenkins/workspace/lldb-cmake-dwarf5/lldb-build/bin/clang -gdwarf-5 is not a valid compiler executable; aborting...

Hide Details

******************** FAIL: lldb-Suite :: types/TestFloatTypesExpr.py (905 of 1400) ******************** TEST 'lldb-Suite :: types/TestFloatTypesExpr.py' FAILED ******************** ERROR:root:/Users/buildslave/jenkins/workspace/lldb-cmake-dwarf5/lldb-build/bin/clang -gdwarf-5 is not a valid compiler executable; aborting...

Hide Details

******************** FAIL: lldb-Suite :: tools/lldb-vscode/variables/TestVSCode_variables.py (906 of 1400) ******************** TEST 'lldb-Suite :: tools/lldb-vscode/variables/TestVSCode_variables.py' FAILED ******************** ERROR:root:/Users/buildslave/jenkins/workspace/lldb-cmake-dwarf5/lldb-build/bin/clang -gdwarf-5 is not a valid compiler executable; aborting...

Hide Details

******************** FAIL: lldb-Suite :: types/TestRecursiveTypes.py (907 of 1400) ******************** TEST 'lldb-Suite :: types/TestRecursiveTypes.py' FAILED ******************** ERROR:root:/Users/buildslave/jenkins/workspace/lldb-cmake-dwarf5/lldb-build/bin/clang -gdwarf-5 is not a valid compiler executable; aborting...

Hide Details

******************** PASS: lldb-Unit :: Process/gdb-remote/./ProcessGdbRemoteTests/GDBRemoteCommunicationClientTest.SyncThreadState (908 of 1400) FAIL: lldb-Suite :: types/TestIntegerTypes.py (909 of 1400) ******************** TEST 'lldb-Suite :: types/TestIntegerTypes.py' FAILED ******************** ERROR:root:/Users/buildslave/jenkins/workspace/lldb-cmake-dwarf5/lldb-build/bin/clang -gdwarf-5 is not a valid compiler executable; aborting...

Hide Details

******************** PASS: lldb-Unit :: Process/gdb-remote/./ProcessGdbRemoteTests/GDBRemoteCommunicationClientTest.SendStopTracePacket (910 of 1400) PASS: lldb-Unit :: Process/gdb-remote/./ProcessGdbRemoteTests/GDBRemoteCommunicationClientTest.SendStartTracePacket (911 of 1400) PASS: lldb-Unit :: Process/gdb-remote/./ProcessGdbRemoteTests/GDBRemoteCommunicationClientTest.WriteRegister (912 of 1400) PASS: lldb-Unit :: Process/gdb-remote/./ProcessGdbRemoteTests/GDBRemoteCommunicationClientTest.WriteRegisterNoSuffix (913 of 1400) PASS: lldb-Unit :: Process/gdb-remote/./ProcessGdbRemoteTests/GDBRemoteCommunicationTest.ReadPacket_checksum (914 of 1400) PASS: lldb-Unit :: Process/minidump/./LLDBMinidumpTests/MinidumpParserTest.ConvertMinidumpContext_x86_32 (915 of 1400) PASS: lldb-Unit :: Process/minidump/./LLDBMinidumpTests/MinidumpParserTest.ConvertMinidumpContext_x86_32_wow64 (916 of 1400) PASS: lldb-Unit :: Process/minidump/./LLDBMinidumpTests/MinidumpParserTest.FindMemoryRangeWithFullMemoryMinidump (917 of 1400) PASS: lldb-Unit :: Process/minidump/./LLDBMinidumpTests/MinidumpParserTest.ConvertMinidumpContext_x86_64 (918 of 1400) PASS: lldb-Unit :: Process/minidump/./LLDBMinidumpTests/MinidumpParserTest.GetArchitectureWindows (919 of 1400) PASS: lldb-Unit :: Process/minidump/./LLDBMinidumpTests/MinidumpParserTest.FindMemoryRange (920 of 1400) PASS: lldb-Unit :: Process/minidump/./LLDBMinidumpTests/MinidumpParserTest.GetArchitecture (921 of 1400) PASS: lldb-Unit :: Process/minidump/./LLDBMinidumpTests/MinidumpParserTest.GetFilteredModuleList (922 of 1400) PASS: lldb-Unit :: Process/minidump/./LLDBMinidumpTests/MinidumpParserTest.GetExceptionStream (923 of 1400) PASS: lldb-Unit :: Process/minidump/./LLDBMinidumpTests/MinidumpParserTest.GetLinuxProcStatus (924 of 1400) PASS: lldb-Unit :: Process/minidump/./LLDBMinidumpTests/MinidumpParserTest.GetLinuxProcStatusWindows (925 of 1400) FAIL: lldb-Suite :: warnings/uuid/TestAddDsymCommand.py (926 of 1400) ******************** TEST 'lldb-Suite :: warnings/uuid/TestAddDsymCommand.py' FAILED ******************** ERROR:root:/Users/buildslave/jenkins/workspace/lldb-cmake-dwarf5/lldb-build/bin/clang -gdwarf-5 is not a valid compiler executable; aborting...

Hide Details

******************** FAIL: lldb-Suite :: types/TestFloatTypes.py (927 of 1400) ******************** TEST 'lldb-Suite :: types/TestFloatTypes.py' FAILED ******************** ERROR:root:/Users/buildslave/jenkins/workspace/lldb-cmake-dwarf5/lldb-build/bin/clang -gdwarf-5 is not a valid compiler executable; aborting...

Hide Details

******************** FAIL: lldb-Suite :: types/TestIntegerTypesExpr.py (928 of 1400) ******************** TEST 'lldb-Suite :: types/TestIntegerTypesExpr.py' FAILED ******************** ERROR:root:/Users/buildslave/jenkins/workspace/lldb-cmake-dwarf5/lldb-build/bin/clang -gdwarf-5 is not a valid compiler executable; aborting...

Hide Details

******************** PASS: lldb-Unit :: Process/minidump/./LLDBMinidumpTests/MinidumpParserTest.GetMemory (929 of 1400) PASS: lldb-Unit :: Process/minidump/./LLDBMinidumpTests/MinidumpParserTest.GetMemoryRegionInfo (930 of 1400) PASS: lldb-Unit :: Process/minidump/./LLDBMinidumpTests/MinidumpParserTest.GetMiscInfo (931 of 1400) PASS: lldb-Unit :: Process/minidump/./LLDBMinidumpTests/MinidumpParserTest.GetMemoryListNotPadded (932 of 1400) PASS: lldb-Unit :: Process/minidump/./LLDBMinidumpTests/MinidumpParserTest.GetMemoryListPadded (933 of 1400) PASS: lldb-Unit :: Process/minidump/./LLDBMinidumpTests/MinidumpParserTest.GetMiscInfoWindows (934 of 1400) PASS: lldb-Unit :: Process/minidump/./LLDBMinidumpTests/MinidumpParserTest.GetModuleList (935 of 1400) PASS: lldb-Unit :: Process/minidump/./LLDBMinidumpTests/MinidumpParserTest.GetModuleListPadded (936 of 1400) PASS: lldb-Unit :: Process/minidump/./LLDBMinidumpTests/MinidumpParserTest.GetModuleListWow64 (937 of 1400) PASS: lldb-Unit :: Process/minidump/./LLDBMinidumpTests/MinidumpParserTest.GetPid (938 of 1400) PASS: lldb-Unit :: Process/minidump/./LLDBMinidumpTests/MinidumpParserTest.GetModuleListNotPadded (939 of 1400) PASS: lldb-Unit :: Process/minidump/./LLDBMinidumpTests/MinidumpParserTest.GetPidWindows (940 of 1400) PASS: lldb-Unit :: Process/gdb-remote/./ProcessGdbRemoteTests/GDBRemoteCommunicationClientTest.TestPacketSpeedJSON (941 of 1400) PASS: lldb-Unit :: Process/minidump/./LLDBMinidumpTests/MinidumpParserTest.GetThreadListNotPadded (942 of 1400) PASS: lldb-Unit :: Process/minidump/./LLDBMinidumpTests/MinidumpParserTest.GetPidWow64 (943 of 1400) PASS: lldb-Unit :: Process/minidump/./LLDBMinidumpTests/MinidumpParserTest.GetThreadListPadded (944 of 1400) PASS: lldb-Unit :: Process/minidump/./LLDBMinidumpTests/MinidumpParserTest.TruncatedMinidumps (945 of 1400) PASS: lldb-Unit :: Process/minidump/./LLDBMinidumpTests/MinidumpParserTest.GetThreadsAndGetThreadContext (946 of 1400) PASS: lldb-Unit :: Process/minidump/./LLDBMinidumpTests/MinidumpParserTest.IllFormedMinidumps (947 of 1400) PASS: lldb-Unit :: ScriptInterpreter/Python/./ScriptInterpreterPythonTests/PythonDataObjectsTest.TestDictionaryResolutionWithDot (948 of 1400) PASS: lldb-Unit :: ScriptInterpreter/Python/./ScriptInterpreterPythonTests/PythonDataObjectsTest.TestBorrowedReferences (949 of 1400) PASS: lldb-Unit :: ScriptInterpreter/Python/./ScriptInterpreterPythonTests/PythonDataObjectsTest.TestExtractingUInt64ThroughStructuredData (950 of 1400) PASS: lldb-Unit :: ScriptInterpreter/Python/./ScriptInterpreterPythonTests/PythonDataObjectsTest.TestGlobalNameResolutionNoDot (951 of 1400) PASS: lldb-Unit :: ScriptInterpreter/Python/./ScriptInterpreterPythonTests/PythonDataObjectsTest.TestGlobalNameResolutionWithDot (952 of 1400) PASS: lldb-Unit :: ScriptInterpreter/Python/./ScriptInterpreterPythonTests/PythonDataObjectsTest.TestOwnedReferences (953 of 1400) PASS: lldb-Unit :: ScriptInterpreter/Python/./ScriptInterpreterPythonTests/PythonDataObjectsTest.TestModuleNameResolutionNoDot (954 of 1400) PASS: lldb-Unit :: ScriptInterpreter/Python/./ScriptInterpreterPythonTests/PythonDataObjectsTest.TestInstanceNameResolutionNoDot (955 of 1400) PASS: lldb-Unit :: ScriptInterpreter/Python/./ScriptInterpreterPythonTests/PythonDataObjectsTest.TestObjectAttributes (956 of 1400) PASS: lldb-Unit :: ScriptInterpreter/Python/./ScriptInterpreterPythonTests/PythonDataObjectsTest.TestPythonByteArray (957 of 1400) PASS: lldb-Unit :: ScriptInterpreter/Python/./ScriptInterpreterPythonTests/PythonDataObjectsTest.TestPythonBytes (958 of 1400) PASS: lldb-Unit :: ScriptInterpreter/Python/./ScriptInterpreterPythonTests/PythonDataObjectsTest.TestPythonDictionaryToStructuredDictionary (959 of 1400) PASS: lldb-Unit :: ScriptInterpreter/Python/./ScriptInterpreterPythonTests/PythonDataObjectsTest.TestPythonCallableCheck (960 of 1400) PASS: lldb-Unit :: ScriptInterpreter/Python/./ScriptInterpreterPythonTests/PythonDataObjectsTest.TestPythonListValueEquality (961 of 1400) PASS: lldb-Unit :: ScriptInterpreter/Python/./ScriptInterpreterPythonTests/PythonDataObjectsTest.TestPythonListToStructuredList (962 of 1400) PASS: lldb-Unit :: ScriptInterpreter/Python/./ScriptInterpreterPythonTests/PythonDataObjectsTest.TestPythonCallableInvoke (963 of 1400) PASS: lldb-Unit :: ScriptInterpreter/Python/./ScriptInterpreterPythonTests/PythonDataObjectsTest.TestPythonIntegerToStructuredInteger (964 of 1400) PASS: lldb-Unit :: ScriptInterpreter/Python/./ScriptInterpreterPythonTests/PythonDataObjectsTest.TestPythonDictionaryManipulation (965 of 1400) PASS: lldb-Unit :: ScriptInterpreter/Python/./ScriptInterpreterPythonTests/PythonDataObjectsTest.TestPythonIntegerToStr (966 of 1400) PASS: lldb-Unit :: ScriptInterpreter/Python/./ScriptInterpreterPythonTests/PythonDataObjectsTest.TestPythonInteger (967 of 1400) PASS: lldb-Unit :: ScriptInterpreter/Python/./ScriptInterpreterPythonTests/PythonDataObjectsTest.TestPythonDictionaryValueEquality (968 of 1400) PASS: lldb-Unit :: ScriptInterpreter/Python/./ScriptInterpreterPythonTests/PythonDataObjectsTest.TestPythonFile (969 of 1400) PASS: lldb-Unit :: ScriptInterpreter/Python/./ScriptInterpreterPythonTests/PythonDataObjectsTest.TestPythonListManipulation (970 of 1400) PASS: lldb-Unit :: Signals/./SignalsTests/UnixSignalsTest.GetFilteredSignals (971 of 1400) PASS: lldb-Unit :: Signals/./SignalsTests/UnixSignalsTest.GetInfo (972 of 1400) PASS: lldb-Unit :: Signals/./SignalsTests/UnixSignalsTest.VersionChange (973 of 1400) PASS: lldb-Unit :: Signals/./SignalsTests/UnixSignalsTest.Iteration (974 of 1400) PASS: lldb-Unit :: Symbol/./SymbolTests/DWARFCallFrameInfoTest.Basic_dwarf3 (975 of 1400) PASS: lldb-Unit :: Symbol/./SymbolTests/DWARFCallFrameInfoTest.Basic_dwarf4 (976 of 1400) PASS: lldb-Unit :: Symbol/./SymbolTests/TestClangASTContext.TestConvertAccessTypeToAccessSpecifier (977 of 1400) PASS: lldb-Unit :: Symbol/./SymbolTests/TestClangASTContext.TestBuiltinTypeForEncodingAndBitSize (978 of 1400) PASS: lldb-Unit :: Symbol/./SymbolTests/TestClangASTContext.TemplateArguments (979 of 1400) PASS: lldb-Unit :: Symbol/./SymbolTests/DWARFCallFrameInfoTest.Basic_eh (980 of 1400) PASS: lldb-Unit :: Symbol/./SymbolTests/TestClangASTContext.TestGetBasicTypeFromEnum (981 of 1400) PASS: lldb-Unit :: Symbol/./SymbolTests/TestClangASTContext.TestGetBasicTypeFromName (982 of 1400) PASS: lldb-Unit :: Symbol/./SymbolTests/TestClangASTContext.TestIsClangType (983 of 1400) PASS: lldb-Unit :: Symbol/./SymbolTests/TestClangASTContext.TestRecordHasFields (984 of 1400) PASS: lldb-Unit :: Symbol/./SymbolTests/TestClangASTContext.TestRemoveFastQualifiers (985 of 1400) PASS: lldb-Unit :: Symbol/./SymbolTests/TestClangASTContext.TestUnifyAccessSpecifiers (986 of 1400) PASS: lldb-Unit :: Symbol/./SymbolTests/Type.GetTypeScopeAndBasename (987 of 1400) PASS: lldb-Unit :: SymbolFile/DWARF/./SymbolFileDWARFTests/SymbolFileDWARFTests.TestAbilitiesForDWARF (988 of 1400) PASS: lldb-Unit :: Target/./TargetTests/MemoryRegionInfoTest.Formatv (989 of 1400) PASS: lldb-Unit :: Target/./TargetTests/PathMappingListTest.AbsoluteTests (990 of 1400) PASS: lldb-Unit :: ScriptInterpreter/Python/./ScriptInterpreterPythonTests/PythonDataObjectsTest.TestPythonString (991 of 1400) PASS: lldb-Unit :: ScriptInterpreter/Python/./ScriptInterpreterPythonTests/PythonDataObjectsTest.TestPythonStringToStr (992 of 1400) PASS: lldb-Unit :: ScriptInterpreter/Python/./ScriptInterpreterPythonTests/PythonDataObjectsTest.TestPythonStringToStructuredString (993 of 1400) PASS: lldb-Unit :: Target/./TargetTests/PathMappingListTest.RelativeTests (994 of 1400) PASS: lldb-Unit :: Target/./TargetTests/PathMappingListTest.RemapRoot (995 of 1400) PASS: lldb-Unit :: ScriptInterpreter/Python/./ScriptInterpreterPythonTests/PythonDataObjectsTest.TestPythonTupleInitializerList (996 of 1400) PASS: lldb-Unit :: Target/./TargetTests/ModuleCacheTest.GetAndPutStrangeHostname (997 of 1400) PASS: lldb-Unit :: Target/./TargetTests/ModuleCacheTest.GetAndPutUuidExists (998 of 1400) PASS: lldb-Unit :: Target/./TargetTests/ModuleCacheTest.GetAndPut (999 of 1400) PASS: lldb-Unit :: ScriptInterpreter/Python/./ScriptInterpreterPythonTests/PythonDataObjectsTest.TestPythonTupleInitializerList2 (1000 of 1400) PASS: lldb-Unit :: UnwindAssembly/ARM64/./Arm64InstEmulationTests/TestArm64InstEmulation.TestFramelessThreeEpilogueFunction (1001 of 1400) PASS: lldb-Unit :: UnwindAssembly/ARM64/./Arm64InstEmulationTests/TestArm64InstEmulation.TestMediumDarwinFunction (1002 of 1400) PASS: lldb-Unit :: UnwindAssembly/ARM64/./Arm64InstEmulationTests/TestArm64InstEmulation.TestRegisterDoubleSpills (1003 of 1400) PASS: lldb-Unit :: UnwindAssembly/ARM64/./Arm64InstEmulationTests/TestArm64InstEmulation.TestRegisterSavedTwice (1004 of 1400) PASS: lldb-Unit :: UnwindAssembly/ARM64/./Arm64InstEmulationTests/TestArm64InstEmulation.TestSimpleDarwinFunction (1005 of 1400) PASS: lldb-Unit :: ScriptInterpreter/Python/./ScriptInterpreterPythonTests/PythonDataObjectsTest.TestPythonTupleToStructuredList (1006 of 1400) PASS: lldb-Unit :: ScriptInterpreter/Python/./ScriptInterpreterPythonTests/PythonDataObjectsTest.TestPythonTupleSize (1007 of 1400) PASS: lldb-Unit :: ScriptInterpreter/Python/./ScriptInterpreterPythonTests/PythonDataObjectsTest.TestPythonTupleValues (1008 of 1400) PASS: lldb-Unit :: ScriptInterpreter/Python/./ScriptInterpreterPythonTests/PythonDataObjectsTest.TestResetting (1009 of 1400) PASS: lldb-Unit :: ScriptInterpreter/Python/./ScriptInterpreterPythonTests/PythonDataObjectsTest.TestTypeNameResolutionNoDot (1010 of 1400) PASS: lldb-Unit :: ScriptInterpreter/Python/./ScriptInterpreterPythonTests/PythonExceptionStateTest.TestAcquisitionSemantics (1011 of 1400) PASS: lldb-Unit :: UnwindAssembly/PPC64/./PPC64InstEmulationTests/TestPPC64InstEmulation.TestSimpleFunction (1012 of 1400) PASS: lldb-Unit :: UnwindAssembly/PPC64/./PPC64InstEmulationTests/TestPPC64InstEmulation.TestMediumFunction (1013 of 1400) PASS: lldb-Unit :: ScriptInterpreter/Python/./ScriptInterpreterPythonTests/PythonExceptionStateTest.TestAutoRestoreChanged (1014 of 1400) PASS: lldb-Unit :: ScriptInterpreter/Python/./ScriptInterpreterPythonTests/PythonExceptionStateTest.TestAutoRestoreSemantics (1015 of 1400) PASS: lldb-Unit :: ScriptInterpreter/Python/./ScriptInterpreterPythonTests/PythonExceptionStateTest.TestDiscardSemantics (1016 of 1400) PASS: lldb-Unit :: ScriptInterpreter/Python/./ScriptInterpreterPythonTests/PythonExceptionStateTest.TestResetSemantics (1017 of 1400) PASS: lldb-Unit :: ScriptInterpreter/Python/./ScriptInterpreterPythonTests/PythonExceptionStateTest.TestExceptionStateChecking (1018 of 1400) PASS: lldb-Unit :: UnwindAssembly/x86/./UnwindAssemblyx86Tests/Testx86AssemblyInspectionEngine.Test32BitOnlyInstruction (1019 of 1400) PASS: lldb-Unit :: UnwindAssembly/x86/./UnwindAssemblyx86Tests/Testx86AssemblyInspectionEngine.Test32bitFramelessSmallStackFrame (1020 of 1400) PASS: lldb-Unit :: UnwindAssembly/x86/./UnwindAssemblyx86Tests/Testx86AssemblyInspectionEngine.Test32bitFramelessBigStackFrame (1021 of 1400) PASS: lldb-Unit :: ScriptInterpreter/Python/./ScriptInterpreterPythonTests/PythonExceptionStateTest.TestManualRestoreSemantics (1022 of 1400) PASS: lldb-Unit :: UnwindAssembly/x86/./UnwindAssemblyx86Tests/Testx86AssemblyInspectionEngine.Test64bitFramelessBigStackFrame (1023 of 1400) PASS: lldb-Unit :: UnwindAssembly/x86/./UnwindAssemblyx86Tests/Testx86AssemblyInspectionEngine.Test64bitFramelessSmallStackFrame (1024 of 1400) PASS: lldb-Unit :: UnwindAssembly/x86/./UnwindAssemblyx86Tests/Testx86AssemblyInspectionEngine.TestAddRSP (1025 of 1400) PASS: lldb-Unit :: UnwindAssembly/x86/./UnwindAssemblyx86Tests/Testx86AssemblyInspectionEngine.TestCALLNextInsn (1026 of 1400) PASS: lldb-Unit :: UnwindAssembly/x86/./UnwindAssemblyx86Tests/Testx86AssemblyInspectionEngine.TestDisassemblyJunkBytes (1027 of 1400) PASS: lldb-Unit :: UnwindAssembly/x86/./UnwindAssemblyx86Tests/Testx86AssemblyInspectionEngine.TestAddESP (1028 of 1400) PASS: lldb-Unit :: UnwindAssembly/x86/./UnwindAssemblyx86Tests/Testx86AssemblyInspectionEngine.TestLEAVE (1029 of 1400) PASS: lldb-Unit :: UnwindAssembly/x86/./UnwindAssemblyx86Tests/Testx86AssemblyInspectionEngine.TestMovRSPtoRBP (1030 of 1400) PASS: lldb-Unit :: UnwindAssembly/x86/./UnwindAssemblyx86Tests/Testx86AssemblyInspectionEngine.TestPopEBP (1031 of 1400) PASS: lldb-Unit :: UnwindAssembly/x86/./UnwindAssemblyx86Tests/Testx86AssemblyInspectionEngine.TestPopEBX (1032 of 1400) PASS: lldb-Unit :: UnwindAssembly/x86/./UnwindAssemblyx86Tests/Testx86AssemblyInspectionEngine.TestPopR13 (1033 of 1400) PASS: lldb-Unit :: UnwindAssembly/x86/./UnwindAssemblyx86Tests/Testx86AssemblyInspectionEngine.TestPopESI (1034 of 1400) PASS: lldb-Unit :: UnwindAssembly/x86/./UnwindAssemblyx86Tests/Testx86AssemblyInspectionEngine.TestPopEDI (1035 of 1400) PASS: lldb-Unit :: UnwindAssembly/x86/./UnwindAssemblyx86Tests/Testx86AssemblyInspectionEngine.TestPopR12 (1036 of 1400) PASS: lldb-Unit :: UnwindAssembly/x86/./UnwindAssemblyx86Tests/Testx86AssemblyInspectionEngine.TestPopR14 (1037 of 1400) PASS: lldb-Unit :: UnwindAssembly/x86/./UnwindAssemblyx86Tests/Testx86AssemblyInspectionEngine.TestPopR15 (1038 of 1400) PASS: lldb-Unit :: UnwindAssembly/x86/./UnwindAssemblyx86Tests/Testx86AssemblyInspectionEngine.TestPopRBP (1039 of 1400) PASS: lldb-Unit :: UnwindAssembly/x86/./UnwindAssemblyx86Tests/Testx86AssemblyInspectionEngine.TestPushEAX (1040 of 1400) PASS: lldb-Unit :: UnwindAssembly/x86/./UnwindAssemblyx86Tests/Testx86AssemblyInspectionEngine.TestPushECX (1041 of 1400) PASS: lldb-Unit :: UnwindAssembly/x86/./UnwindAssemblyx86Tests/Testx86AssemblyInspectionEngine.TestPopRBX (1042 of 1400) PASS: lldb-Unit :: UnwindAssembly/x86/./UnwindAssemblyx86Tests/Testx86AssemblyInspectionEngine.TestPushEBP (1043 of 1400) PASS: lldb-Unit :: UnwindAssembly/x86/./UnwindAssemblyx86Tests/Testx86AssemblyInspectionEngine.TestPushEBX (1044 of 1400) PASS: lldb-Unit :: UnwindAssembly/x86/./UnwindAssemblyx86Tests/Testx86AssemblyInspectionEngine.TestPush0 (1045 of 1400) PASS: lldb-Unit :: UnwindAssembly/x86/./UnwindAssemblyx86Tests/Testx86AssemblyInspectionEngine.TestPushEDI (1046 of 1400) PASS: lldb-Unit :: UnwindAssembly/x86/./UnwindAssemblyx86Tests/Testx86AssemblyInspectionEngine.TestPushEDX (1047 of 1400) PASS: lldb-Unit :: UnwindAssembly/x86/./UnwindAssemblyx86Tests/Testx86AssemblyInspectionEngine.TestPushR12 (1048 of 1400) PASS: lldb-Unit :: UnwindAssembly/x86/./UnwindAssemblyx86Tests/Testx86AssemblyInspectionEngine.TestPushExtended (1049 of 1400) PASS: lldb-Unit :: UnwindAssembly/x86/./UnwindAssemblyx86Tests/Testx86AssemblyInspectionEngine.TestPushImm (1050 of 1400) PASS: lldb-Unit :: UnwindAssembly/x86/./UnwindAssemblyx86Tests/Testx86AssemblyInspectionEngine.TestPushESI (1051 of 1400) PASS: lldb-Unit :: UnwindAssembly/x86/./UnwindAssemblyx86Tests/Testx86AssemblyInspectionEngine.TestPushR15 (1052 of 1400) PASS: lldb-Unit :: UnwindAssembly/x86/./UnwindAssemblyx86Tests/Testx86AssemblyInspectionEngine.TestPushR14 (1053 of 1400) PASS: lldb-Unit :: UnwindAssembly/x86/./UnwindAssemblyx86Tests/Testx86AssemblyInspectionEngine.TestPushRBP (1054 of 1400) PASS: lldb-Unit :: UnwindAssembly/x86/./UnwindAssemblyx86Tests/Testx86AssemblyInspectionEngine.TestPushR13 (1055 of 1400) PASS: lldb-Unit :: UnwindAssembly/x86/./UnwindAssemblyx86Tests/Testx86AssemblyInspectionEngine.TestSimplei386ugmented (1056 of 1400) PASS: lldb-Unit :: UnwindAssembly/x86/./UnwindAssemblyx86Tests/Testx86AssemblyInspectionEngine.TestSimple32bitFrameFunction (1057 of 1400) PASS: lldb-Unit :: UnwindAssembly/x86/./UnwindAssemblyx86Tests/Testx86AssemblyInspectionEngine.TestPushRBX (1058 of 1400) PASS: lldb-Unit :: UnwindAssembly/x86/./UnwindAssemblyx86Tests/Testx86AssemblyInspectionEngine.TestSpillRegToStackViaMOVx86_64 (1059 of 1400) PASS: lldb-Unit :: UnwindAssembly/x86/./UnwindAssemblyx86Tests/Testx86AssemblyInspectionEngine.TestSimple64bitFrameFunction (1060 of 1400) PASS: lldb-Unit :: UnwindAssembly/x86/./UnwindAssemblyx86Tests/Testx86AssemblyInspectionEngine.TestSimplex86_64Augmented (1061 of 1400) PASS: lldb-Unit :: UnwindAssembly/x86/./UnwindAssemblyx86Tests/Testx86AssemblyInspectionEngine.TestSpillRegToStackViaMOVi386 (1062 of 1400) PASS: lldb-Unit :: UnwindAssembly/x86/./UnwindAssemblyx86Tests/Testx86AssemblyInspectionEngine.TestStackRealign8BitDisp_i386 (1063 of 1400) PASS: lldb-Unit :: UnwindAssembly/x86/./UnwindAssemblyx86Tests/Testx86AssemblyInspectionEngine.TestStackRealignMSVC_i386 (1064 of 1400) PASS: lldb-Unit :: UnwindAssembly/x86/./UnwindAssemblyx86Tests/Testx86AssemblyInspectionEngine.TestStackRealign32BitDisp_x86_64 (1065 of 1400) PASS: lldb-Unit :: UnwindAssembly/x86/./UnwindAssemblyx86Tests/Testx86AssemblyInspectionEngine.TestSubESP (1066 of 1400) PASS: lldb-Unit :: UnwindAssembly/x86/./UnwindAssemblyx86Tests/Testx86AssemblyInspectionEngine.Testi386IgnoredRegisters (1067 of 1400) PASS: lldb-Unit :: UnwindAssembly/x86/./UnwindAssemblyx86Tests/Testx86AssemblyInspectionEngine.TestSubRSP (1068 of 1400) PASS: lldb-Unit :: Utility/./UtilityTests/AnsiTerminal.AtEnd (1069 of 1400) PASS: lldb-Unit :: Utility/./UtilityTests/AnsiTerminal.AtStart (1070 of 1400) PASS: lldb-Unit :: Utility/./UtilityTests/AnsiTerminal.Empty (1071 of 1400) PASS: lldb-Unit :: Utility/./UtilityTests/AnsiTerminal.Incomplete (1072 of 1400) PASS: lldb-Unit :: Utility/./UtilityTests/AnsiTerminal.Basic (1073 of 1400) PASS: lldb-Unit :: Utility/./UtilityTests/AnsiTerminal.Twice (1074 of 1400) PASS: lldb-Unit :: Utility/./UtilityTests/AnsiTerminal.KnownPrefix (1075 of 1400) PASS: lldb-Unit :: Utility/./UtilityTests/AnsiTerminal.Unknown (1076 of 1400) PASS: lldb-Unit :: Utility/./UtilityTests/AnsiTerminal.WhiteSpace (1077 of 1400) PASS: lldb-Unit :: Utility/./UtilityTests/ArchSpecTest.MergeFrom (1078 of 1400) PASS: lldb-Unit :: Utility/./UtilityTests/ArchSpecTest.MergeFromMachOUnknown (1079 of 1400) PASS: lldb-Unit :: Utility/./UtilityTests/ArchSpecTest.TestParseMachCPUDashSubtypeTripleExtra (1080 of 1400) PASS: lldb-Unit :: Utility/./UtilityTests/ArchSpecTest.TestSetTriple (1081 of 1400) PASS: lldb-Unit :: Utility/./UtilityTests/ArchSpecTest.TestParseMachCPUDashSubtypeTripleSimple (1082 of 1400) PASS: lldb-Unit :: Utility/./UtilityTests/ArgsTest.AppendArguments (1083 of 1400) PASS: lldb-Unit :: Utility/./UtilityTests/ArgsTest.BareSingleQuote (1084 of 1400) PASS: lldb-Unit :: Utility/./UtilityTests/ArgsTest.DoubleQuotedItem (1085 of 1400) PASS: lldb-Unit :: Utility/./UtilityTests/ArgsTest.GetArgumentArrayRef (1086 of 1400) PASS: lldb-Unit :: Utility/./UtilityTests/ArgsTest.TestAppendArg (1087 of 1400) PASS: lldb-Unit :: Utility/./UtilityTests/ArgsTest.GetQuotedCommandString (1088 of 1400) PASS: lldb-Unit :: Utility/./UtilityTests/ArgsTest.TestArgv (1089 of 1400) PASS: lldb-Unit :: Utility/./UtilityTests/ArgsTest.StringListConstructor (1090 of 1400) PASS: lldb-Unit :: Utility/./UtilityTests/ArgsTest.TestInsertArg (1091 of 1400) PASS: lldb-Unit :: Utility/./UtilityTests/ArgsTest.TestMultipleArgs (1092 of 1400) PASS: lldb-Unit :: Utility/./UtilityTests/ArgsTest.TestOverwriteArgs (1093 of 1400) PASS: lldb-Unit :: Utility/./UtilityTests/ArgsTest.TestSingleArgWithQuotedSpace (1094 of 1400) PASS: lldb-Unit :: Utility/./UtilityTests/ArgsTest.TestSingleArg (1095 of 1400) PASS: lldb-Unit :: Utility/./UtilityTests/ArgsTest.TestSingleQuotedArgWithSpace (1096 of 1400) PASS: lldb-Unit :: Utility/./UtilityTests/BinaryStreamTest.PutSLEB128EightBytes (1097 of 1400) PASS: lldb-Unit :: Utility/./UtilityTests/BinaryStreamTest.PutSLEB128FiveBytes (1098 of 1400) PASS: lldb-Unit :: Utility/./UtilityTests/BinaryStreamTest.PutSLEB128FourBytes (1099 of 1400) PASS: lldb-Unit :: Utility/./UtilityTests/BinaryStreamTest.PutSLEB128NineBytes (1100 of 1400) PASS: lldb-Unit :: Utility/./UtilityTests/BinaryStreamTest.PutSLEB128MaxValue (1101 of 1400) PASS: lldb-Unit :: Utility/./UtilityTests/BinaryStreamTest.PutSLEB128One (1102 of 1400) PASS: lldb-Unit :: Utility/./UtilityTests/BinaryStreamTest.PutSLEB128OneByte (1103 of 1400) PASS: lldb-Unit :: Utility/./UtilityTests/BinaryStreamTest.PutSLEB128SixBytes (1104 of 1400) PASS: lldb-Unit :: Utility/./UtilityTests/BinaryStreamTest.PutSLEB128SevenBytes (1105 of 1400) PASS: lldb-Unit :: Utility/./UtilityTests/BinaryStreamTest.PutSLEB128TwoBytes (1106 of 1400) PASS: lldb-Unit :: Utility/./UtilityTests/BinaryStreamTest.PutSLEB128ThreeBytes (1107 of 1400) PASS: lldb-Unit :: Utility/./UtilityTests/BinaryStreamTest.PutSLEB128Zero (1108 of 1400) PASS: lldb-Unit :: Utility/./UtilityTests/BinaryStreamTest.PutULEB128EightBytes (1109 of 1400) PASS: lldb-Unit :: Utility/./UtilityTests/BinaryStreamTest.PutULEB128FiveBytes (1110 of 1400) PASS: lldb-Unit :: Utility/./UtilityTests/BinaryStreamTest.PutULEB128MaxValue (1111 of 1400) PASS: lldb-Unit :: Utility/./UtilityTests/BinaryStreamTest.PutULEB128FourBytes (1112 of 1400) PASS: lldb-Unit :: Utility/./UtilityTests/BinaryStreamTest.PutULEB128NineBytes (1113 of 1400) PASS: lldb-Unit :: Utility/./UtilityTests/BinaryStreamTest.PutULEB128One (1114 of 1400) PASS: lldb-Unit :: Utility/./UtilityTests/BinaryStreamTest.PutULEB128OneByte (1115 of 1400) PASS: lldb-Unit :: Utility/./UtilityTests/BinaryStreamTest.PutULEB128SevenBytes (1116 of 1400) PASS: lldb-Unit :: Utility/./UtilityTests/BinaryStreamTest.PutULEB128TwoBytes (1117 of 1400) PASS: lldb-Unit :: Utility/./UtilityTests/BinaryStreamTest.PutULEB128ThreeBytes (1118 of 1400) PASS: lldb-Unit :: Utility/./UtilityTests/BinaryStreamTest.PutULEB128SixBytes (1119 of 1400) PASS: lldb-Unit :: Utility/./UtilityTests/BinaryStreamTest.PutULEB128Zero (1120 of 1400) PASS: lldb-Unit :: Utility/./UtilityTests/CleanUpTest.disable (1121 of 1400) PASS: lldb-Unit :: Utility/./UtilityTests/CleanUpTest.no_args (1122 of 1400) PASS: lldb-Unit :: Utility/./UtilityTests/CleanUpTest.multiple_args (1123 of 1400) PASS: lldb-Unit :: Utility/./UtilityTests/CompletionRequest.Constructor (1124 of 1400) PASS: lldb-Unit :: Utility/./UtilityTests/CompletionRequest.DuplicateFiltering (1125 of 1400) PASS: lldb-Unit :: Utility/./UtilityTests/CompletionRequest.DuplicateFilteringWithComments (1126 of 1400) PASS: lldb-Unit :: Utility/./UtilityTests/ConstStringTest.UpdateMangledCounterpart (1127 of 1400) PASS: lldb-Unit :: Utility/./UtilityTests/CompletionRequest.TestCompletionOwnership (1128 of 1400) PASS: lldb-Unit :: Utility/./UtilityTests/ConstStringTest.format_provider (1129 of 1400) PASS: lldb-Unit :: Utility/./UtilityTests/ConstStringTest.FromMidOfBufferStringRef (1130 of 1400) PASS: lldb-Unit :: Utility/./UtilityTests/ConstStringTest.NullAndEmptyStates (1131 of 1400) PASS: lldb-Unit :: Utility/./UtilityTests/ConstStringTest.MangledCounterpart (1132 of 1400) PASS: lldb-Unit :: Utility/./UtilityTests/DataExtractorTest.GetBitfield (1133 of 1400) PASS: lldb-Unit :: Utility/./UtilityTests/DataExtractorTest.GetMaxS64 (1134 of 1400) PASS: lldb-Unit :: Utility/./UtilityTests/DataExtractorTest.GetMaxU64_unchecked (1135 of 1400) PASS: lldb-Unit :: Utility/./UtilityTests/DataExtractorTest.GetMaxU64 (1136 of 1400) PASS: lldb-Unit :: Utility/./UtilityTests/DataExtractorTest.PeekData (1137 of 1400) PASS: lldb-Unit :: Utility/./UtilityTests/EnvironmentTest.EnvpConstruction (1138 of 1400) PASS: lldb-Unit :: Utility/./UtilityTests/FileSpecTest.EqualDotsPosix (1139 of 1400) PASS: lldb-Unit :: Utility/./UtilityTests/EnvironmentTest.EnvpConversion (1140 of 1400) PASS: lldb-Unit :: Utility/./UtilityTests/FileSpecTest.AppendPathComponent (1141 of 1400) PASS: lldb-Unit :: Utility/./UtilityTests/FileSpecTest.EqualDotsWindows (1142 of 1400) PASS: lldb-Unit :: Utility/./UtilityTests/FileSpecTest.CopyByAppendingPathComponent (1143 of 1400) PASS: lldb-Unit :: Utility/./UtilityTests/FileSpecTest.EqualDotsPosixRoot (1144 of 1400) PASS: lldb-Unit :: Utility/./UtilityTests/FileSpecTest.FileAndDirectoryComponents (1145 of 1400) PASS: lldb-Unit :: Utility/./UtilityTests/FileSpecTest.FormatFileSpec (1146 of 1400) PASS: lldb-Unit :: Utility/./UtilityTests/FileSpecTest.EqualSeparator (1147 of 1400) PASS: lldb-Unit :: Utility/./UtilityTests/FileSpecTest.GetNormalizedPath (1148 of 1400) PASS: lldb-Unit :: Utility/./UtilityTests/FileSpecTest.PrependPathComponent (1149 of 1400) PASS: lldb-Unit :: Utility/./UtilityTests/FileSpecTest.IsRelative (1150 of 1400) PASS: lldb-Unit :: Utility/./UtilityTests/Flags.AnyClear (1151 of 1400) PASS: lldb-Unit :: Utility/./UtilityTests/Flags.AllClear (1152 of 1400) PASS: lldb-Unit :: Utility/./UtilityTests/Flags.AllSet (1153 of 1400) PASS: lldb-Unit :: Utility/./UtilityTests/FileSpecTest.RemoveLastPathComponent (1154 of 1400) PASS: lldb-Unit :: Utility/./UtilityTests/Flags.AnySet (1155 of 1400) PASS: lldb-Unit :: Utility/./UtilityTests/Flags.Clear (1156 of 1400) PASS: lldb-Unit :: Utility/./UtilityTests/Flags.ClearCount (1157 of 1400) PASS: lldb-Unit :: Utility/./UtilityTests/Flags.GetBitSize (1158 of 1400) PASS: lldb-Unit :: Utility/./UtilityTests/Flags.IsClear (1159 of 1400) PASS: lldb-Unit :: Utility/./UtilityTests/Flags.Reset (1160 of 1400) PASS: lldb-Unit :: Utility/./UtilityTests/Flags.SetCount (1161 of 1400) PASS: lldb-Unit :: Utility/./UtilityTests/Flags.Test (1162 of 1400) PASS: lldb-Unit :: Utility/./UtilityTests/GeneratorTest.Get (1163 of 1400) PASS: lldb-Unit :: Utility/./UtilityTests/GeneratorTest.GetOrCreate (1164 of 1400) PASS: lldb-Unit :: Utility/./UtilityTests/JSONTest.Newlines (1165 of 1400) PASS: lldb-Unit :: Utility/./UtilityTests/GeneratorTest.Create (1166 of 1400) PASS: lldb-Unit :: Utility/./UtilityTests/JSONTest.Dictionary (1167 of 1400) PASS: lldb-Unit :: Utility/./UtilityTests/LogChannelEnabledTest.LLDB_LOG_ERROR (1168 of 1400) PASS: lldb-Unit :: Utility/./UtilityTests/LogChannelEnabledTest.LogThread (1169 of 1400) PASS: lldb-Unit :: Utility/./UtilityTests/LogChannelEnabledTest.LogGetLogThread (1170 of 1400) PASS: lldb-Unit :: Utility/./UtilityTests/LogChannelEnabledTest.log_options (1171 of 1400) PASS: lldb-Unit :: Utility/./UtilityTests/LogChannelEnabledTest.LogVerboseThread (1172 of 1400) PASS: lldb-Unit :: Utility/./UtilityTests/LogChannelTest.Disable (1173 of 1400) PASS: lldb-Unit :: Utility/./UtilityTests/LogChannelTest.Enable (1174 of 1400) PASS: lldb-Unit :: Utility/./UtilityTests/LogChannelTest.List (1175 of 1400) PASS: lldb-Unit :: Utility/./UtilityTests/LogTest.LLDB_LOG_nullptr (1176 of 1400) PASS: lldb-Unit :: Utility/./UtilityTests/LogChannelTest.EnableOptions (1177 of 1400) PASS: lldb-Unit :: Utility/./UtilityTests/LogTest.Register (1178 of 1400) PASS: lldb-Unit :: Utility/./UtilityTests/NameMatchesTest.Contains (1179 of 1400) PASS: lldb-Unit :: Utility/./UtilityTests/NameMatchesTest.EndsWith (1180 of 1400) PASS: lldb-Unit :: Utility/./UtilityTests/NameMatchesTest.Equals (1181 of 1400) PASS: lldb-Unit :: Utility/./UtilityTests/LogTest.Unregister (1182 of 1400) PASS: lldb-Unit :: Utility/./UtilityTests/NameMatchesTest.Ignore (1183 of 1400) PASS: lldb-Unit :: Utility/./UtilityTests/NameMatchesTest.RegularExpression (1184 of 1400) PASS: lldb-Unit :: Utility/./UtilityTests/NameMatchesTest.StartsWith (1185 of 1400) PASS: lldb-Unit :: Utility/./UtilityTests/OptionsWithRawTest.ArgsButNoDelimiter (1186 of 1400) PASS: lldb-Unit :: Utility/./UtilityTests/OptionsWithRawTest.ArgsButNoLeadingDash (1187 of 1400) PASS: lldb-Unit :: Utility/./UtilityTests/OptionsWithRawTest.EmptyArgsOnlySuffix (1188 of 1400) PASS: lldb-Unit :: Utility/./UtilityTests/OptionsWithRawTest.EmptyInput (1189 of 1400) PASS: lldb-Unit :: Utility/./UtilityTests/OptionsWithRawTest.EmptySuffix (1190 of 1400) PASS: lldb-Unit :: Utility/./UtilityTests/OptionsWithRawTest.EmptySuffixSingleWhitespace (1191 of 1400) PASS: lldb-Unit :: Utility/./UtilityTests/OptionsWithRawTest.LeadingSpaceArgs (1192 of 1400) PASS: lldb-Unit :: Utility/./UtilityTests/OptionsWithRawTest.MultiWordSuffix (1193 of 1400) PASS: lldb-Unit :: Utility/./UtilityTests/OptionsWithRawTest.QuotedSuffix (1194 of 1400) PASS: lldb-Unit :: Utility/./UtilityTests/OptionsWithRawTest.SingleWordSuffix (1195 of 1400) PASS: lldb-Unit :: Utility/./UtilityTests/OptionsWithRawTest.SingleWhitespaceInput (1196 of 1400) PASS: lldb-Unit :: Utility/./UtilityTests/OptionsWithRawTest.TerminatedQuote (1197 of 1400) PASS: lldb-Unit :: Utility/./UtilityTests/OptionsWithRawTest.UnterminatedQuote (1198 of 1400) PASS: lldb-Unit :: Utility/./UtilityTests/OptionsWithRawTest.WhitespaceInput (1199 of 1400) PASS: lldb-Unit :: Utility/./UtilityTests/OptionsWithRawTest.WhitespaceSuffix (1200 of 1400) PASS: lldb-Unit :: Utility/./UtilityTests/RegisterValueTest.GetSet8 (1201 of 1400) PASS: lldb-Unit :: Utility/./UtilityTests/ReproducerTest.SetCapture (1202 of 1400) PASS: lldb-Unit :: Utility/./UtilityTests/ScalarTest.CastOperations (1203 of 1400) PASS: lldb-Unit :: Utility/./UtilityTests/ReproducerTest.SetReplay (1204 of 1400) PASS: lldb-Unit :: Utility/./UtilityTests/ScalarTest.Division (1205 of 1400) PASS: lldb-Unit :: Utility/./UtilityTests/Predicate.WaitForValueNotEqualTo (1206 of 1400) PASS: lldb-Unit :: Utility/./UtilityTests/ScalarTest.GetBytes (1207 of 1400) PASS: lldb-Unit :: Utility/./UtilityTests/ScalarTest.ExtractBitfield (1208 of 1400) PASS: lldb-Unit :: Utility/./UtilityTests/ScalarTest.RightShiftOperator (1209 of 1400) PASS: lldb-Unit :: Utility/./UtilityTests/ScalarTest.SetValueFromCString (1210 of 1400) PASS: lldb-Unit :: Utility/./UtilityTests/ScalarTest.GetValue (1211 of 1400) PASS: lldb-Unit :: Utility/./UtilityTests/StateTest.Formatv (1212 of 1400) PASS: lldb-Unit :: Utility/./UtilityTests/ScalarTest.Promotion (1213 of 1400) PASS: lldb-Unit :: Utility/./UtilityTests/StatusTest.ErrorConstructor (1214 of 1400) PASS: lldb-Unit :: Utility/./UtilityTests/StatusTest.ErrorConversion (1215 of 1400) PASS: lldb-Unit :: Utility/./UtilityTests/StatusTest.Formatv (1216 of 1400) PASS: lldb-Unit :: Utility/./UtilityTests/StreamTeeTest.AppendStream (1217 of 1400) PASS: lldb-Unit :: Utility/./UtilityTests/StreamTeeTest.Assignment (1218 of 1400) PASS: lldb-Unit :: Utility/./UtilityTests/StreamTeeTest.Constructor1Stream (1219 of 1400) PASS: lldb-Unit :: Utility/./UtilityTests/StreamTeeTest.Constructor2Streams (1220 of 1400) PASS: lldb-Unit :: Utility/./UtilityTests/StreamTeeTest.CopyConstructor (1221 of 1400) PASS: lldb-Unit :: Utility/./UtilityTests/StreamTeeTest.DefaultConstructor (1222 of 1400) PASS: lldb-Unit :: Utility/./UtilityTests/StreamTeeTest.Flush (1223 of 1400) PASS: lldb-Unit :: Utility/./UtilityTests/StreamTeeTest.SetStreamAtIndexOutOfBounds (1224 of 1400) PASS: lldb-Unit :: Utility/./UtilityTests/StreamTeeTest.GetStreamAtIndexOutOfBounds (1225 of 1400) PASS: lldb-Unit :: Utility/./UtilityTests/StreamTeeTest.SetStreamAtIndexOverwrite (1226 of 1400) PASS: lldb-Unit :: Utility/./UtilityTests/StreamTeeTest.GetStreamAtIndexOutOfBoundsEmpty (1227 of 1400) PASS: lldb-Unit :: Utility/./UtilityTests/StreamTeeTest.Write (1228 of 1400) PASS: lldb-Unit :: Utility/./UtilityTests/StreamTest.ChangingByteOrder (1229 of 1400) PASS: lldb-Unit :: Utility/./UtilityTests/StreamTest.PutBytesAsRawHex8ToMixedEndian (1230 of 1400) PASS: lldb-Unit :: Utility/./UtilityTests/StreamTest.PutBytesAsRawHex8ToLittleEndian (1231 of 1400) PASS: lldb-Unit :: Utility/./UtilityTests/StreamTest.PutBytesAsRawHex8ToBigEndian (1232 of 1400) PASS: lldb-Unit :: Utility/./UtilityTests/StreamTest.PutCStringAsRawHex8 (1233 of 1400) PASS: lldb-Unit :: Utility/./UtilityTests/StreamTest.PutCString (1234 of 1400) PASS: lldb-Unit :: Utility/./UtilityTests/StreamTest.PutChar (1235 of 1400) PASS: lldb-Unit :: Utility/./UtilityTests/StreamTest.PutCStringWithStringRef (1236 of 1400) PASS: lldb-Unit :: Utility/./UtilityTests/StreamTest.PutCharNull (1237 of 1400) PASS: lldb-Unit :: Utility/./UtilityTests/StreamTest.PutHex16ByteOrderBig (1238 of 1400) PASS: lldb-Unit :: Utility/./UtilityTests/StreamTest.PutCharWhitespace (1239 of 1400) PASS: lldb-Unit :: Utility/./UtilityTests/StreamTest.PutHex16ByteOrderLittle (1240 of 1400) PASS: lldb-Unit :: Utility/./UtilityTests/StreamTest.PutHex32ByteOrderLittle (1241 of 1400) PASS: lldb-Unit :: Utility/./UtilityTests/StreamTest.PutHex32ByteOrderBig (1242 of 1400) PASS: lldb-Unit :: Utility/./UtilityTests/StreamTest.PutHex64ByteOrderBig (1243 of 1400) PASS: lldb-Unit :: Utility/./UtilityTests/StreamTest.PutHex64ByteOrderLittle (1244 of 1400) PASS: lldb-Unit :: Utility/./UtilityTests/StreamTest.PutHex8 (1245 of 1400) PASS: lldb-Unit :: Utility/./UtilityTests/StreamTest.PutMaxHex64ByteOrderBig (1246 of 1400) PASS: lldb-Unit :: Utility/./UtilityTests/StreamTest.PutNHex8 (1247 of 1400) PASS: lldb-Unit :: Utility/./UtilityTests/StreamTest.PutPtr (1248 of 1400) PASS: lldb-Unit :: Utility/./UtilityTests/StreamTest.PutMaxHex64ByteOrderLittle (1249 of 1400) PASS: lldb-Unit :: Utility/./UtilityTests/StreamTest.PutRawBytesToBigEndian (1250 of 1400) PASS: lldb-Unit :: Utility/./UtilityTests/StreamTest.PutRawBytesToMixedEndian (1251 of 1400) PASS: lldb-Unit :: Utility/./UtilityTests/StreamTest.PutRawBytesToLittleEndian (1252 of 1400) PASS: lldb-Unit :: Utility/./UtilityTests/StreamTest.PutSLEB128 (1253 of 1400) PASS: lldb-Unit :: Utility/./UtilityTests/StreamTest.QuotedCString (1254 of 1400) PASS: lldb-Unit :: Utility/./UtilityTests/StreamTest.PutULEB128 (1255 of 1400) PASS: lldb-Unit :: Utility/./UtilityTests/StreamTest.ShiftOperatorInts (1256 of 1400) PASS: lldb-Unit :: Utility/./UtilityTests/StreamTest.ShiftOperatorChars (1257 of 1400) PASS: lldb-Unit :: Utility/./UtilityTests/StreamTest.ShiftOperatorStrings (1258 of 1400) PASS: lldb-Unit :: Utility/./UtilityTests/StreamTest.ShiftOperatorPtr (1259 of 1400) PASS: lldb-Unit :: Utility/./UtilityTests/StringExtractorTest.DecodeHexU8_Exact (1260 of 1400) PASS: lldb-Unit :: Utility/./UtilityTests/StreamTest.ShiftOperatorUInts (1261 of 1400) PASS: lldb-Unit :: Utility/./UtilityTests/StringExtractorTest.DecodeHexU8_Extra (1262 of 1400) PASS: lldb-Unit :: Utility/./UtilityTests/StringExtractorTest.DecodeHexU8_Underflow (1263 of 1400) PASS: lldb-Unit :: Utility/./UtilityTests/StringExtractorTest.DecodeHexU8_InvalidHex (1264 of 1400) PASS: lldb-Unit :: Utility/./UtilityTests/StringExtractorTest.DecodeHexU8_InvalidHex2 (1265 of 1400) PASS: lldb-Unit :: Utility/./UtilityTests/StringExtractorTest.DecodeHexU8_Underflow2 (1266 of 1400) PASS: lldb-Unit :: Utility/./UtilityTests/Predicate.WaitForValueEqualTo (1267 of 1400) PASS: lldb-Unit :: Utility/./UtilityTests/StringExtractorTest.GetHexBytes (1268 of 1400) PASS: lldb-Unit :: Utility/./UtilityTests/StringExtractorTest.GetHexBytesAvail (1269 of 1400) PASS: lldb-Unit :: Utility/./UtilityTests/StringExtractorTest.GetHexBytesAvail_OddPair (1270 of 1400) PASS: lldb-Unit :: Utility/./UtilityTests/StringExtractorTest.GetHexBytesAvail_FullString (1271 of 1400) PASS: lldb-Unit :: Utility/./UtilityTests/StringExtractorTest.GetHexBytesAvail_OddPair2 (1272 of 1400) PASS: lldb-Unit :: Utility/./UtilityTests/StringExtractorTest.GetHexBytesAvail_Partial (1273 of 1400) PASS: lldb-Unit :: Utility/./UtilityTests/StringExtractorTest.GetHexBytes_FullString (1274 of 1400) PASS: lldb-Unit :: Utility/./UtilityTests/StringExtractorTest.GetHexBytesAvail_Underflow (1275 of 1400) PASS: lldb-Unit :: Utility/./UtilityTests/StringExtractorTest.GetHexBytes_OddPair (1276 of 1400) PASS: lldb-Unit :: Utility/./UtilityTests/StringExtractorTest.GetHexBytes_OddPair2 (1277 of 1400) PASS: lldb-Unit :: Utility/./UtilityTests/StringExtractorTest.GetHexU8_Exact_NoEof (1278 of 1400) PASS: lldb-Unit :: Utility/./UtilityTests/StringExtractorTest.GetHexBytes_Underflow (1279 of 1400) PASS: lldb-Unit :: Utility/./UtilityTests/StringExtractorTest.GetHexBytes_Partial (1280 of 1400) PASS: lldb-Unit :: Utility/./UtilityTests/StringExtractorTest.GetHexU8_Exact (1281 of 1400) PASS: lldb-Unit :: Utility/./UtilityTests/StringExtractorTest.GetHexU8_Extra (1282 of 1400) PASS: lldb-Unit :: Utility/./UtilityTests/StringExtractorTest.GetHexU8_Extra_NoEof (1283 of 1400) PASS: lldb-Unit :: Utility/./UtilityTests/StringExtractorTest.GetHexU8_InvalidHex (1284 of 1400) PASS: lldb-Unit :: Utility/./UtilityTests/StringExtractorTest.GetHexU8_InvalidHex_NoEof (1285 of 1400) PASS: lldb-Unit :: Utility/./UtilityTests/StringExtractorTest.GetHexU8_Underflow (1286 of 1400) PASS: lldb-Unit :: Utility/./UtilityTests/StringExtractorTest.GetHexU8_Underflow2 (1287 of 1400) PASS: lldb-Unit :: Utility/./UtilityTests/StringExtractorTest.GetHexU8_Underflow2_NoEof (1288 of 1400) PASS: lldb-Unit :: Utility/./UtilityTests/StringExtractorTest.GetHexU8_Underflow_NoEof (1289 of 1400) PASS: lldb-Unit :: Utility/./UtilityTests/StringExtractorTest.GetNameColonValueContainsColon (1290 of 1400) PASS: lldb-Unit :: Utility/./UtilityTests/StringExtractorTest.GetNameColonValueNoColon (1291 of 1400) PASS: lldb-Unit :: Utility/./UtilityTests/StringExtractorTest.GetNameColonValueNoSemicolon (1292 of 1400) PASS: lldb-Unit :: Utility/./UtilityTests/StringExtractorTest.GetU32LittleEndian (1293 of 1400) PASS: lldb-Unit :: Utility/./UtilityTests/StringExtractorTest.GetNameColonValueSuccess (1294 of 1400) PASS: lldb-Unit :: Utility/./UtilityTests/StringExtractorTest.GetU32BigEndian (1295 of 1400) PASS: lldb-Unit :: Utility/./UtilityTests/StringExtractorTest.GetU64BigEndian (1296 of 1400) PASS: lldb-Unit :: Utility/./UtilityTests/StringExtractorTest.InitEmpty (1297 of 1400) PASS: lldb-Unit :: Utility/./UtilityTests/StringExtractorTest.GetU64LittleEndian (1298 of 1400) PASS: lldb-Unit :: Utility/./UtilityTests/StringExtractorTest.InitMisc (1299 of 1400) PASS: lldb-Unit :: Utility/./UtilityTests/StringLexerTest.AdvanceIf (1300 of 1400) PASS: lldb-Unit :: Utility/./UtilityTests/StringLexerTest.GetUnlexed (1301 of 1400) PASS: lldb-Unit :: Utility/./UtilityTests/StringLexerTest.HasAtLeast (1302 of 1400) PASS: lldb-Unit :: Utility/./UtilityTests/StringLexerTest.Next (1303 of 1400) PASS: lldb-Unit :: Utility/./UtilityTests/StringLexerTest.NextIfList (1304 of 1400) PASS: lldb-Unit :: Utility/./UtilityTests/StringLexerTest.NextIf (1305 of 1400) PASS: lldb-Unit :: Utility/./UtilityTests/StringLexerTest.PutBack (1306 of 1400) PASS: lldb-Unit :: Utility/./UtilityTests/StringLexerTest.Peek (1307 of 1400) PASS: lldb-Unit :: Utility/./UtilityTests/StringListTest.AppendListCStringArray (1308 of 1400) PASS: lldb-Unit :: Utility/./UtilityTests/StringListTest.AppendListCStringArrayEmpty (1309 of 1400) PASS: lldb-Unit :: Utility/./UtilityTests/StringListTest.AppendList (1310 of 1400) PASS: lldb-Unit :: Utility/./UtilityTests/StringListTest.AppendStringCString (1311 of 1400) PASS: lldb-Unit :: Utility/./UtilityTests/StringListTest.AppendStringMove (1312 of 1400) PASS: lldb-Unit :: Utility/./UtilityTests/StringListTest.AppendStringStdString (1313 of 1400) PASS: lldb-Unit :: Utility/./UtilityTests/StringListTest.CopyList (1314 of 1400) PASS: lldb-Unit :: Utility/./UtilityTests/StringListTest.Clear (1315 of 1400) PASS: lldb-Unit :: Utility/./UtilityTests/StringListTest.Assignment (1316 of 1400) PASS: lldb-Unit :: Utility/./UtilityTests/StringListTest.CopyListEmpty (1317 of 1400) PASS: lldb-Unit :: Utility/./UtilityTests/StringListTest.DefaultConstructor (1318 of 1400) PASS: lldb-Unit :: Utility/./UtilityTests/StringListTest.CopyListSingle (1319 of 1400) PASS: lldb-Unit :: Utility/./UtilityTests/StringListTest.GetMaxStringLengthDecreasingSize (1320 of 1400) PASS: lldb-Unit :: Utility/./UtilityTests/StringListTest.GetMaxStringLengthEmpty (1321 of 1400) PASS: lldb-Unit :: Utility/./UtilityTests/StringListTest.GetMaxStringLengthEqualSize (1322 of 1400) PASS: lldb-Unit :: Utility/./UtilityTests/StringListTest.GetMaxStringLengthIncreasingSize (1323 of 1400) PASS: lldb-Unit :: Utility/./UtilityTests/StringListTest.GetMaxStringLengthMixed (1324 of 1400) PASS: lldb-Unit :: Utility/./UtilityTests/StringListTest.InsertStringAtIndexEnd (1325 of 1400) PASS: lldb-Unit :: Utility/./UtilityTests/StringListTest.GetSize (1326 of 1400) PASS: lldb-Unit :: Utility/./UtilityTests/StringListTest.InsertStringAtIndexMove (1327 of 1400) PASS: lldb-Unit :: Utility/./UtilityTests/StringListTest.InsertStringAtIndexOutOfBounds (1328 of 1400) PASS: lldb-Unit :: Utility/./UtilityTests/StringListTest.InsertStringAtIndexStart (1329 of 1400) PASS: lldb-Unit :: Utility/./UtilityTests/StringListTest.JoinEmpty (1330 of 1400) PASS: lldb-Unit :: Utility/./UtilityTests/StringListTest.InsertStringAtIndexStdString (1331 of 1400) PASS: lldb-Unit :: Utility/./UtilityTests/StringListTest.Join (1332 of 1400) PASS: lldb-Unit :: Utility/./UtilityTests/StringListTest.JoinMultiCharSeparator (1333 of 1400) PASS: lldb-Unit :: Utility/./UtilityTests/StringListTest.JoinThree (1334 of 1400) PASS: lldb-Unit :: Utility/./UtilityTests/StringListTest.JoinNonSpace (1335 of 1400) PASS: lldb-Unit :: Utility/./UtilityTests/StringListTest.JoinSingle (1336 of 1400) PASS: lldb-Unit :: Utility/./UtilityTests/StringListTest.LongestCommonPrefix (1337 of 1400) PASS: lldb-Unit :: Utility/./UtilityTests/StringListTest.LongestCommonPrefixDuplicateElement (1338 of 1400) PASS: lldb-Unit :: Utility/./UtilityTests/StringListTest.LongestCommonPrefixNoPrefix (1339 of 1400) PASS: lldb-Unit :: Utility/./UtilityTests/StringListTest.LongestCommonPrefixSingleElement (1340 of 1400) PASS: lldb-Unit :: Utility/./UtilityTests/StringListTest.LongestCommonPrefixEmpty (1341 of 1400) PASS: lldb-Unit :: Utility/./UtilityTests/StringListTest.PopBack (1342 of 1400) PASS: lldb-Unit :: Utility/./UtilityTests/StringListTest.SetSize (1343 of 1400) PASS: lldb-Unit :: Utility/./UtilityTests/StringListTest.RemoveBlankLines (1344 of 1400) PASS: lldb-Unit :: Utility/./UtilityTests/StringListTest.ShiftStdString (1345 of 1400) PASS: lldb-Unit :: Utility/./UtilityTests/StringListTest.ShiftMove (1346 of 1400) PASS: lldb-Unit :: Utility/./UtilityTests/StringListTest.ShiftCString (1347 of 1400) PASS: lldb-Unit :: Utility/./UtilityTests/StringListTest.SplitIntoLines (1348 of 1400) PASS: lldb-Unit :: Utility/./UtilityTests/StringListTest.SplitIntoLinesSingleTrailingCR (1349 of 1400) PASS: lldb-Unit :: Utility/./UtilityTests/StringListTest.SplitIntoLinesEmpty (1350 of 1400) PASS: lldb-Unit :: Utility/./UtilityTests/StructuredDataTest.ParseJSONFromFile (1351 of 1400) PASS: lldb-Unit :: Utility/./UtilityTests/StructuredDataTest.StringDump (1352 of 1400) PASS: lldb-Unit :: Utility/./UtilityTests/TildeExpressionResolver.ResolveFullPath (1353 of 1400) PASS: lldb-Unit :: Utility/./UtilityTests/TimeoutTest.Construction (1354 of 1400) PASS: lldb-Unit :: Utility/./UtilityTests/TimeoutTest.Format (1355 of 1400) PASS: lldb-Unit :: Utility/./UtilityTests/UUIDTest.RelationalOperators (1356 of 1400) PASS: lldb-Unit :: Utility/./UtilityTests/UUIDTest.Validity (1357 of 1400) PASS: lldb-Unit :: Utility/./UtilityTests/UUIDTest.SetFromStringRef (1358 of 1400) PASS: lldb-Unit :: Utility/./UtilityTests/UUIDTest.StringConverion (1359 of 1400) PASS: lldb-Unit :: Utility/./UtilityTests/UriParserTest.BadPort (1360 of 1400) PASS: lldb-Unit :: Utility/./UtilityTests/UriParserTest.BracketedHostname (1361 of 1400) PASS: lldb-Unit :: Utility/./UtilityTests/UriParserTest.BadPort2 (1362 of 1400) PASS: lldb-Unit :: Utility/./UtilityTests/TimerTest.CategoryTimes (1363 of 1400) PASS: lldb-Unit :: Utility/./UtilityTests/UriParserTest.LongPath (1364 of 1400) PASS: lldb-Unit :: Utility/./UtilityTests/UriParserTest.Empty (1365 of 1400) PASS: lldb-Unit :: Utility/./UtilityTests/UriParserTest.BracketedHostnamePort (1366 of 1400) PASS: lldb-Unit :: Utility/./UtilityTests/UriParserTest.BracketedHostnameWithColon (1367 of 1400) PASS: lldb-Unit :: Utility/./UtilityTests/UriParserTest.Minimal (1368 of 1400) PASS: lldb-Unit :: Utility/./UtilityTests/UriParserTest.MinimalPath (1369 of 1400) PASS: lldb-Unit :: Utility/./UtilityTests/UriParserTest.MinimalPort (1370 of 1400) PASS: lldb-Unit :: Utility/./UtilityTests/TimerTest.CategoryTimesNested (1371 of 1400) PASS: lldb-Unit :: Utility/./UtilityTests/UriParserTest.MinimalPortPath (1372 of 1400) PASS: lldb-Unit :: Utility/./UtilityTests/UriParserTest.PortOverflow (1373 of 1400) PASS: lldb-Unit :: Utility/./UtilityTests/UriParserTest.SchemeHostSeparator (1374 of 1400) PASS: lldb-Unit :: Utility/./UtilityTests/UriParserTest.SchemeHostSeparator3 (1375 of 1400) PASS: lldb-Unit :: Utility/./UtilityTests/UriParserTest.SchemeHostSeparator2 (1376 of 1400) PASS: lldb-Unit :: Utility/./UtilityTests/UriParserTest.SchemeHostSeparator4 (1377 of 1400) PASS: lldb-Unit :: Utility/./UtilityTests/UriParserTest.TypicalPortPath (1378 of 1400) PASS: lldb-Unit :: Utility/./UtilityTests/VASprintfTest.BufferResize (1379 of 1400) PASS: lldb-Unit :: Utility/./UtilityTests/VASprintfTest.EncodingError (1380 of 1400) PASS: lldb-Unit :: Utility/./UtilityTests/VMRange.Comparison (1381 of 1400) PASS: lldb-Unit :: Utility/./UtilityTests/VMRange.Clear (1382 of 1400) PASS: lldb-Unit :: Utility/./UtilityTests/VMRange.CollectionContains (1383 of 1400) PASS: lldb-Unit :: Utility/./UtilityTests/VASprintfTest.NoBufferResize (1384 of 1400) PASS: lldb-Unit :: Utility/./UtilityTests/VMRange.ContainsAddr (1385 of 1400) PASS: lldb-Unit :: Utility/./UtilityTests/VMRange.ContainsRange (1386 of 1400) PASS: lldb-Unit :: Utility/./UtilityTests/VMRange.Ordering (1387 of 1400) PASS: lldb-Unit :: Utility/./UtilityTests/VMRange.IsValid (1388 of 1400) PASS: lldb-Unit :: Utility/./UtilityTests/VMRange.SetEndAddress (1389 of 1400) PASS: lldb-Unit :: Utility/./UtilityTests/VMRange.Reset (1390 of 1400) PASS: lldb-Unit :: debugserver/./debugserverTests/RNBSocket.AnyListen (1391 of 1400) PASS: lldb-Unit :: debugserver/./debugserverTests/RNBSocket.LoopBackConnectIPv4 (1392 of 1400) PASS: lldb-Unit :: debugserver/./debugserverTests/RNBSocket.LoopBackConnectIPv6 (1393 of 1400) PASS: lldb-Unit :: debugserver/./debugserverTests/RNBSocket.LoopBackListenIPv4 (1394 of 1400) PASS: lldb-Unit :: debugserver/./debugserverTests/RNBSocket.LoopBackListenIPv6 (1395 of 1400) PASS: lldb-Unit :: Utility/./UtilityTests/TimerTest.CategoryTimes2 (1396 of 1400) PASS: lldb-Unit :: tools/lldb-server/tests/./LLDBServerTests/TestBase.DebugserverEnv (1397 of 1400) PASS: lldb-Unit :: tools/lldb-server/tests/./LLDBServerTests/TestBase.LaunchModePreservesEnvironment (1398 of 1400) PASS: lldb-Unit :: tools/lldb-server/tests/./LLDBServerTests/StandardStartupTest.TestStopReplyContainsThreadPcs (1399 of 1400) PASS: lldb-Unit :: Process/gdb-remote/./ProcessGdbRemoteTests/GDBRemoteClientBaseTest.InterruptNoResponse (1400 of 1400) Testing Time: 67.07s ******************** Failing Tests (675): lldb-Suite :: android/platform/TestDefaultCacheLineSize.py lldb-Suite :: api/check_public_api_headers/TestPublicAPIHeaders.py lldb-Suite :: api/listeners/TestListener.py lldb-Suite :: api/multiple-debuggers/TestMultipleDebuggers.py lldb-Suite :: api/multiple-targets/TestMultipleTargets.py lldb-Suite :: api/multithreaded/TestMultithreaded.py lldb-Suite :: arm/breakpoint-it/TestBreakpointIt.py lldb-Suite :: arm/breakpoint-thumb-codesection/TestBreakpointThumbCodesection.py lldb-Suite :: arm/emulation/TestEmulations.py lldb-Suite :: benchmarks/continue/TestBenchmarkContinue.py lldb-Suite :: benchmarks/disassembly/TestDisassembly.py lldb-Suite :: benchmarks/disassembly/TestDoAttachThenDisassembly.py lldb-Suite :: benchmarks/disassembly/TestXcode41Vs42GDBDisassembly.py lldb-Suite :: benchmarks/expression/TestExpressionCmd.py lldb-Suite :: benchmarks/expression/TestRepeatedExprs.py lldb-Suite :: benchmarks/frame_variable/TestFrameVariableResponse.py lldb-Suite :: benchmarks/libcxxlist/TestBenchmarkLibcxxList.py lldb-Suite :: benchmarks/libcxxmap/TestBenchmarkLibcxxMap.py lldb-Suite :: benchmarks/startup/TestStartupDelays.py lldb-Suite :: benchmarks/stepping/TestSteppingSpeed.py lldb-Suite :: benchmarks/turnaround/TestCompileRunToBreakpointTurnaround.py lldb-Suite :: driver/batch_mode/TestBatchMode.py lldb-Suite :: expression_command/anonymous-struct/TestCallUserAnonTypedef.py lldb-Suite :: expression_command/calculator_mode/TestCalculatorMode.py lldb-Suite :: expression_command/call-function/TestCallBuiltinFunction.py lldb-Suite :: expression_command/call-function/TestCallStdStringFunction.py lldb-Suite :: expression_command/call-function/TestCallStopAndContinue.py lldb-Suite :: expression_command/call-function/TestCallUserDefinedFunction.py lldb-Suite :: expression_command/call-overridden-method/TestCallOverriddenMethod.py lldb-Suite :: expression_command/call-restarts/TestCallThatRestarts.py lldb-Suite :: expression_command/call-throws/TestCallThatThrows.py lldb-Suite :: expression_command/char/TestExprsChar.py lldb-Suite :: expression_command/completion/TestExprCompletion.py lldb-Suite :: expression_command/dont_allow_jit/TestAllowJIT.py lldb-Suite :: expression_command/expr-in-syscall/TestExpressionInSyscall.py lldb-Suite :: expression_command/fixits/TestFixIts.py lldb-Suite :: expression_command/formatters/TestFormatters.py lldb-Suite :: expression_command/ir-interpreter-phi-nodes/TestIRInterpreterPHINodes.py lldb-Suite :: expression_command/ir-interpreter/TestIRInterpreter.py lldb-Suite :: expression_command/issue_11588/Test11588.py lldb-Suite :: expression_command/macros/TestMacros.py lldb-Suite :: expression_command/options/TestExprOptions.py lldb-Suite :: expression_command/persist_objc_pointeetype/TestPersistObjCPointeeType.py lldb-Suite :: expression_command/persistent_ptr_update/TestPersistentPtrUpdate.py lldb-Suite :: expression_command/persistent_types/TestNestedPersistentTypes.py lldb-Suite :: expression_command/persistent_types/TestPersistentTypes.py lldb-Suite :: expression_command/persistent_variables/TestPersistentVariables.py lldb-Suite :: expression_command/po_verbosity/TestPoVerbosity.py lldb-Suite :: expression_command/pr35310/TestExprsBug35310.py lldb-Suite :: expression_command/radar_43822994/TestScopedEnumType.py lldb-Suite :: expression_command/radar_8638051/Test8638051.py lldb-Suite :: expression_command/radar_9531204/TestPrintfAfterUp.py lldb-Suite :: expression_command/radar_9673664/TestExprHelpExamples.py lldb-Suite :: expression_command/rdar42038760/TestScalarURem.py lldb-Suite :: expression_command/rdar44436068/Test128BitsInteger.py lldb-Suite :: expression_command/save_jit_objects/TestSaveJITObjects.py lldb-Suite :: expression_command/test/TestExprs.py lldb-Suite :: expression_command/test/TestExprs2.py lldb-Suite :: expression_command/timeout/TestCallWithTimeout.py lldb-Suite :: expression_command/top-level/TestTopLevelExprs.py lldb-Suite :: expression_command/two-files/TestObjCTypeQueryFromOtherCompileUnit.py lldb-Suite :: expression_command/unwind_expression/TestUnwindExpression.py lldb-Suite :: expression_command/xvalue/TestXValuePrinting.py lldb-Suite :: functionalities/abbreviation/TestAbbreviations.py lldb-Suite :: functionalities/abbreviation/TestCommonShortSpellings.py lldb-Suite :: functionalities/apropos_with_process/TestAproposWithProcess.py lldb-Suite :: functionalities/archives/TestBSDArchives.py lldb-Suite :: functionalities/asan/TestMemoryHistory.py lldb-Suite :: functionalities/asan/TestReportData.py lldb-Suite :: functionalities/attach_resume/TestAttachResume.py lldb-Suite :: functionalities/avoids-fd-leak/TestFdLeak.py lldb-Suite :: functionalities/backticks/TestBackticksWithoutATarget.py lldb-Suite :: functionalities/breakpoint/address_breakpoints/TestAddressBreakpoints.py lldb-Suite :: functionalities/breakpoint/address_breakpoints/TestBadAddressBreakpoints.py lldb-Suite :: functionalities/breakpoint/auto_continue/TestBreakpointAutoContinue.py lldb-Suite :: functionalities/breakpoint/breakpoint_by_line_and_column/TestBreakpointByLineAndColumn.py lldb-Suite :: functionalities/breakpoint/breakpoint_command/TestBreakpointCommand.py lldb-Suite :: functionalities/breakpoint/breakpoint_command/TestBreakpointCommandsFromPython.py lldb-Suite :: functionalities/breakpoint/breakpoint_command/TestRegexpBreakCommand.py lldb-Suite :: functionalities/breakpoint/breakpoint_conditions/TestBreakpointConditions.py lldb-Suite :: functionalities/breakpoint/breakpoint_hit_count/TestBreakpointHitCount.py lldb-Suite :: functionalities/breakpoint/breakpoint_ids/TestBreakpointIDs.py lldb-Suite :: functionalities/breakpoint/breakpoint_ignore_count/TestBreakpointIgnoreCount.py lldb-Suite :: functionalities/breakpoint/breakpoint_in_delayslot/TestAvoidBreakpointInDelaySlot.py lldb-Suite :: functionalities/breakpoint/breakpoint_language/TestBreakpointLanguage.py lldb-Suite :: functionalities/breakpoint/breakpoint_locations/TestBreakpointLocations.py lldb-Suite :: functionalities/breakpoint/breakpoint_names/TestBreakpointNames.py lldb-Suite :: functionalities/breakpoint/breakpoint_options/TestBreakpointOptions.py lldb-Suite :: functionalities/breakpoint/breakpoint_set_restart/TestBreakpointSetRestart.py lldb-Suite :: functionalities/breakpoint/comp_dir_symlink/TestCompDirSymLink.py lldb-Suite :: functionalities/breakpoint/consecutive_breakpoints/TestConsecutiveBreakpoints.py lldb-Suite :: functionalities/breakpoint/cpp/TestCPPBreakpointLocations.py lldb-Suite :: functionalities/breakpoint/cpp_exception/TestCPPExceptionBreakpoint.py lldb-Suite :: functionalities/breakpoint/debugbreak/TestDebugBreak.py lldb-Suite :: functionalities/breakpoint/dummy_target_breakpoints/TestBreakpointsWithNoTargets.py lldb-Suite :: functionalities/breakpoint/global_constructor/TestBreakpointInGlobalConstructor.py lldb-Suite :: functionalities/breakpoint/hardware_breakpoints/hardware_breakpoint_on_multiple_threads/TestHWBreakMultiThread.py lldb-Suite :: functionalities/breakpoint/inlined_breakpoints/TestInlinedBreakpoints.py lldb-Suite :: functionalities/breakpoint/move_nearest/TestMoveNearest.py lldb-Suite :: functionalities/breakpoint/objc/TestObjCBreakpoints.py lldb-Suite :: functionalities/breakpoint/require_hw_breakpoints/TestRequireHWBreakpoints.py lldb-Suite :: functionalities/breakpoint/scripted_bkpt/TestScriptedResolver.py lldb-Suite :: functionalities/breakpoint/serialize/TestBreakpointSerialization.py lldb-Suite :: functionalities/breakpoint/source_regexp/TestSourceRegexBreakpoints.py lldb-Suite :: functionalities/breakpoint/step_over_breakpoint/TestStepOverBreakpoint.py lldb-Suite :: functionalities/command_history/TestCommandHistory.py lldb-Suite :: functionalities/command_regex/TestCommandRegex.py lldb-Suite :: functionalities/command_script/TestCommandScript.py lldb-Suite :: functionalities/command_script/import/TestImport.py lldb-Suite :: functionalities/command_script/import/rdar-12586188/TestRdar12586188.py lldb-Suite :: functionalities/command_script_alias/TestCommandScriptAlias.py lldb-Suite :: functionalities/command_script_immediate_output/TestCommandScriptImmediateOutput.py lldb-Suite :: functionalities/command_source/TestCommandSource.py lldb-Suite :: functionalities/completion/TestCompletion.py lldb-Suite :: functionalities/conditional_break/TestConditionalBreak.py lldb-Suite :: functionalities/darwin_log/basic/TestDarwinLogBasic.py lldb-Suite :: functionalities/darwin_log/filter/exact_match/activity-chain/TestDarwinLogFilterMatchActivityChain.py lldb-Suite :: functionalities/darwin_log/filter/exact_match/activity/TestDarwinLogFilterMatchActivity.py lldb-Suite :: functionalities/darwin_log/filter/exact_match/category/TestDarwinLogFilterMatchCategory.py lldb-Suite :: functionalities/darwin_log/filter/exact_match/message/TestDarwinLogFilterMatchMessage.py lldb-Suite :: functionalities/darwin_log/filter/exact_match/subsystem/TestDarwinLogFilterMatchSubsystem.py lldb-Suite :: functionalities/darwin_log/filter/regex/activity-chain/TestDarwinLogFilterRegexActivityChain.py lldb-Suite :: functionalities/darwin_log/filter/regex/activity/TestDarwinLogFilterRegexActivity.py lldb-Suite :: functionalities/darwin_log/filter/regex/category/TestDarwinLogFilterRegexCategory.py lldb-Suite :: functionalities/darwin_log/filter/regex/message/TestDarwinLogFilterRegexMessage.py lldb-Suite :: functionalities/darwin_log/filter/regex/subsystem/TestDarwinLogFilterRegexSubsystem.py lldb-Suite :: functionalities/darwin_log/format/TestDarwinLogMessageFormat.py lldb-Suite :: functionalities/darwin_log/source/debug/TestDarwinLogSourceDebug.py lldb-Suite :: functionalities/darwin_log/source/info/TestDarwinLogSourceInfo.py lldb-Suite :: functionalities/data-formatter/boolreference/TestFormattersBoolRefPtr.py lldb-Suite :: functionalities/data-formatter/compactvectors/TestCompactVectors.py lldb-Suite :: functionalities/data-formatter/data-formatter-advanced/TestDataFormatterAdv.py lldb-Suite :: functionalities/data-formatter/data-formatter-categories/TestDataFormatterCategories.py lldb-Suite :: functionalities/data-formatter/data-formatter-cpp/TestDataFormatterCpp.py lldb-Suite :: functionalities/data-formatter/data-formatter-disabling/TestDataFormatterDisabling.py lldb-Suite :: functionalities/data-formatter/data-formatter-enum-format/TestDataFormatterEnumFormat.py lldb-Suite :: functionalities/data-formatter/data-formatter-globals/TestDataFormatterGlobals.py lldb-Suite :: functionalities/data-formatter/data-formatter-named-summaries/TestDataFormatterNamedSummaries.py lldb-Suite :: functionalities/data-formatter/data-formatter-objc/TestDataFormatterObjC.py lldb-Suite :: functionalities/data-formatter/data-formatter-objc/nsindexpath/TestDataFormatterNSIndexPath.py lldb-Suite :: functionalities/data-formatter/data-formatter-objc/nsstring/TestDataFormatterNSString.py lldb-Suite :: functionalities/data-formatter/data-formatter-proper-plurals/TestFormattersOneIsSingular.py lldb-Suite :: functionalities/data-formatter/data-formatter-ptr-to-array/TestPtrToArrayFormatting.py lldb-Suite :: functionalities/data-formatter/data-formatter-python-synth/TestDataFormatterPythonSynth.py lldb-Suite :: functionalities/data-formatter/data-formatter-script/TestDataFormatterScript.py lldb-Suite :: functionalities/data-formatter/data-formatter-skip-summary/TestDataFormatterSkipSummary.py lldb-Suite :: functionalities/data-formatter/data-formatter-smart-array/TestDataFormatterSmartArray.py lldb-Suite :: functionalities/data-formatter/data-formatter-stl/libcxx/atomic/TestLibCxxAtomic.py lldb-Suite :: functionalities/data-formatter/data-formatter-stl/libcxx/bitset/TestDataFormatterLibcxxBitset.py lldb-Suite :: functionalities/data-formatter/data-formatter-stl/libcxx/forward_list/TestDataFormatterLibcxxForwardList.py lldb-Suite :: functionalities/data-formatter/data-formatter-stl/libcxx/function/TestLibCxxFunction.py lldb-Suite :: functionalities/data-formatter/data-formatter-stl/libcxx/initializerlist/TestInitializerList.py lldb-Suite :: functionalities/data-formatter/data-formatter-stl/libcxx/iterator/TestDataFormatterLibccIterator.py lldb-Suite :: functionalities/data-formatter/data-formatter-stl/libcxx/list/TestDataFormatterLibcxxList.py lldb-Suite :: functionalities/data-formatter/data-formatter-stl/libcxx/list/loop/TestDataFormatterLibcxxListLoop.py lldb-Suite :: functionalities/data-formatter/data-formatter-stl/libcxx/map/TestDataFormatterLibccMap.py lldb-Suite :: functionalities/data-formatter/data-formatter-stl/libcxx/multimap/TestDataFormatterLibccMultiMap.py lldb-Suite :: functionalities/data-formatter/data-formatter-stl/libcxx/multiset/TestDataFormatterLibcxxMultiSet.py lldb-Suite :: functionalities/data-formatter/data-formatter-stl/libcxx/optional/TestDataFormatterLibcxxOptional.py lldb-Suite :: functionalities/data-formatter/data-formatter-stl/libcxx/queue/TestDataFormatterLibcxxQueue.py lldb-Suite :: functionalities/data-formatter/data-formatter-stl/libcxx/set/TestDataFormatterLibcxxSet.py lldb-Suite :: functionalities/data-formatter/data-formatter-stl/libcxx/string/TestDataFormatterLibcxxString.py lldb-Suite :: functionalities/data-formatter/data-formatter-stl/libcxx/tuple/TestDataFormatterLibcxxTuple.py lldb-Suite :: functionalities/data-formatter/data-formatter-stl/libcxx/unordered/TestDataFormatterUnordered.py lldb-Suite :: functionalities/data-formatter/data-formatter-stl/libcxx/variant/TestDataFormatterLibcxxVariant.py lldb-Suite :: functionalities/data-formatter/data-formatter-stl/libcxx/vbool/TestDataFormatterLibcxxVBool.py lldb-Suite :: functionalities/data-formatter/data-formatter-stl/libcxx/vector/TestDataFormatterLibcxxVector.py lldb-Suite :: functionalities/data-formatter/data-formatter-stl/libstdcpp/iterator/TestDataFormatterStdIterator.py lldb-Suite :: functionalities/data-formatter/data-formatter-stl/libstdcpp/list/TestDataFormatterStdList.py lldb-Suite :: functionalities/data-formatter/data-formatter-stl/libstdcpp/map/TestDataFormatterStdMap.py lldb-Suite :: functionalities/data-formatter/data-formatter-stl/libstdcpp/smart_ptr/TestDataFormatterStdSmartPtr.py lldb-Suite :: functionalities/data-formatter/data-formatter-stl/libstdcpp/string/TestDataFormatterStdString.py lldb-Suite :: functionalities/data-formatter/data-formatter-stl/libstdcpp/tuple/TestDataFormatterStdTuple.py lldb-Suite :: functionalities/data-formatter/data-formatter-stl/libstdcpp/unique_ptr/TestDataFormatterStdUniquePtr.py lldb-Suite :: functionalities/data-formatter/data-formatter-stl/libstdcpp/unique_ptr/invalid/TestDataFormatterInvalidStdUniquePtr.py lldb-Suite :: functionalities/data-formatter/data-formatter-stl/libstdcpp/vbool/TestDataFormatterStdVBool.py lldb-Suite :: functionalities/data-formatter/data-formatter-stl/libstdcpp/vector/TestDataFormatterStdVector.py lldb-Suite :: functionalities/data-formatter/data-formatter-synth/TestDataFormatterSynth.py lldb-Suite :: functionalities/data-formatter/data-formatter-synthtype/TestDataFormatterSynthType.py lldb-Suite :: functionalities/data-formatter/data-formatter-synthval/TestDataFormatterSynthVal.py lldb-Suite :: functionalities/data-formatter/dump_dynamic/TestDumpDynamic.py lldb-Suite :: functionalities/data-formatter/format-propagation/TestFormatPropagation.py lldb-Suite :: functionalities/data-formatter/frameformat_smallstruct/TestFrameFormatSmallStruct.py lldb-Suite :: functionalities/data-formatter/hexcaps/TestDataFormatterHexCaps.py lldb-Suite :: functionalities/data-formatter/language_category_updates/TestDataFormatterLanguageCategoryUpdates.py lldb-Suite :: functionalities/data-formatter/nsarraysynth/TestNSArraySynthetic.py lldb-Suite :: functionalities/data-formatter/nsdictionarysynth/TestNSDictionarySynthetic.py lldb-Suite :: functionalities/data-formatter/nssetsynth/TestNSSetSynthetic.py lldb-Suite :: functionalities/data-formatter/ostypeformatting/TestFormattersOsType.py lldb-Suite :: functionalities/data-formatter/parray/TestPrintArray.py lldb-Suite :: functionalities/data-formatter/poarray/TestPrintObjectArray.py lldb-Suite :: functionalities/data-formatter/ptr_ref_typedef/TestPtrRef2Typedef.py lldb-Suite :: functionalities/data-formatter/pyobjsynthprovider/TestPyObjSynthProvider.py lldb-Suite :: functionalities/data-formatter/refpointer-recursion/TestDataFormatterRefPtrRecursion.py lldb-Suite :: functionalities/data-formatter/setvaluefromcstring/TestSetValueFromCString.py lldb-Suite :: functionalities/data-formatter/stringprinter/TestStringPrinter.py lldb-Suite :: functionalities/data-formatter/summary-string-onfail/Test-rdar-9974002.py lldb-Suite :: functionalities/data-formatter/synthcapping/TestSyntheticCapping.py lldb-Suite :: functionalities/data-formatter/synthupdate/TestSyntheticFilterRecompute.py lldb-Suite :: functionalities/data-formatter/type_summary_list_arg/TestTypeSummaryListArg.py lldb-Suite :: functionalities/data-formatter/type_summary_list_script/TestTypeSummaryListScript.py lldb-Suite :: functionalities/data-formatter/typedef_array/TestTypedefArray.py lldb-Suite :: functionalities/data-formatter/user-format-vs-summary/TestUserFormatVsSummary.py lldb-Suite :: functionalities/data-formatter/var-in-aggregate-misuse/TestVarInAggregateMisuse.py lldb-Suite :: functionalities/data-formatter/varscript_formatting/TestDataFormatterVarScriptFormatting.py lldb-Suite :: functionalities/data-formatter/vector-types/TestVectorTypesFormatting.py lldb-Suite :: functionalities/dead-strip/TestDeadStrip.py lldb-Suite :: functionalities/disassembly/TestDisassembleBreakpoint.py lldb-Suite :: functionalities/disassembly/TestFrameDisassemble.py lldb-Suite :: functionalities/dynamic_value_child_count/TestDynamicValueChildCount.py lldb-Suite :: functionalities/embedded_interpreter/TestConvenienceVariables.py lldb-Suite :: functionalities/exec/TestExec.py lldb-Suite :: functionalities/expr-doesnt-deadlock/TestExprDoesntBlock.py lldb-Suite :: functionalities/expr-entry-bp/TestExprEntryBP.py lldb-Suite :: functionalities/fat_archives/TestFatArchives.py lldb-Suite :: functionalities/format/TestFormats.py lldb-Suite :: functionalities/frame-diagnose/array/TestArray.py lldb-Suite :: functionalities/frame-diagnose/bad-reference/TestBadReference.py lldb-Suite :: functionalities/frame-diagnose/complicated-expression/TestComplicatedExpression.py lldb-Suite :: functionalities/frame-diagnose/dereference-argument/TestDiagnoseDereferenceArgument.py lldb-Suite :: functionalities/frame-diagnose/dereference-function-return/TestDiagnoseDereferenceFunctionReturn.py lldb-Suite :: functionalities/frame-diagnose/dereference-this/TestDiagnoseDereferenceThis.py lldb-Suite :: functionalities/frame-diagnose/inheritance/TestDiagnoseInheritance.py lldb-Suite :: functionalities/frame-diagnose/local-variable/TestLocalVariable.py lldb-Suite :: functionalities/frame-diagnose/virtual-method-call/TestDiagnoseDereferenceVirtualMethodCall.py lldb-Suite :: functionalities/frame-language/TestGuessLanguage.py lldb-Suite :: functionalities/frame-recognizer/TestFrameRecognizer.py lldb-Suite :: functionalities/frame_var/TestFrameVar.py lldb-Suite :: functionalities/frame_var_scope/TestFrameVariableScope.py lldb-Suite :: functionalities/gdb_remote_client/TestArmRegisterDefinition.py lldb-Suite :: functionalities/gdb_remote_client/TestGDBRemoteClient.py lldb-Suite :: functionalities/gdb_remote_client/TestGDBRemoteLoad.py lldb-Suite :: functionalities/gdb_remote_client/TestNoWatchpointSupportInfo.py lldb-Suite :: functionalities/gdb_remote_client/TestRestartBug.py lldb-Suite :: functionalities/gdb_remote_client/TestStopPCs.py lldb-Suite :: functionalities/gdb_remote_client/TestTargetXMLArch.py lldb-Suite :: functionalities/gdb_remote_client/TestThreadSelectionBug.py lldb-Suite :: functionalities/history/TestHistoryRecall.py lldb-Suite :: functionalities/inferior-assert/TestInferiorAssert.py lldb-Suite :: functionalities/inferior-changed/TestInferiorChanged.py lldb-Suite :: functionalities/inferior-crashing/TestInferiorCrashing.py lldb-Suite :: functionalities/inferior-crashing/recursive-inferior/TestRecursiveInferior.py lldb-Suite :: functionalities/inline-stepping/TestInlineStepping.py lldb-Suite :: functionalities/jitloader_gdb/TestJITLoaderGDB.py lldb-Suite :: functionalities/launch_with_shellexpand/TestLaunchWithShellExpand.py lldb-Suite :: functionalities/load_unload/TestLoadUnload.py lldb-Suite :: functionalities/load_using_paths/TestLoadUsingPaths.py lldb-Suite :: functionalities/longjmp/TestLongjmp.py lldb-Suite :: functionalities/memory-region/TestMemoryRegion.py lldb-Suite :: functionalities/memory/cache/TestMemoryCache.py lldb-Suite :: functionalities/memory/find/TestMemoryFind.py lldb-Suite :: functionalities/memory/read/TestMemoryRead.py lldb-Suite :: functionalities/mtc/simple/TestMTCSimple.py lldb-Suite :: functionalities/multidebugger_commands/TestMultipleDebuggersCommands.py lldb-Suite :: functionalities/nested_alias/TestNestedAlias.py lldb-Suite :: functionalities/non-overlapping-index-variable-i/TestIndexVariable.py lldb-Suite :: functionalities/nosucharch/TestNoSuchArch.py lldb-Suite :: functionalities/object-file/TestImageListMultiArchitecture.py lldb-Suite :: functionalities/paths/TestPaths.py lldb-Suite :: functionalities/platform/TestPlatformCommand.py lldb-Suite :: functionalities/platform/TestPlatformPython.py lldb-Suite :: functionalities/plugins/commands/TestPluginCommands.py lldb-Suite :: functionalities/plugins/python_os_plugin/TestPythonOSPlugin.py lldb-Suite :: functionalities/postmortem/elf-core/TestLinuxCore.py lldb-Suite :: functionalities/postmortem/elf-core/gcore/TestGCore.py lldb-Suite :: functionalities/postmortem/elf-core/thread_crash/TestLinuxCoreThreads.py lldb-Suite :: functionalities/postmortem/mach-core/TestMachCore.py lldb-Suite :: functionalities/postmortem/minidump-new/TestMiniDumpNew.py lldb-Suite :: functionalities/postmortem/minidump/TestMiniDump.py lldb-Suite :: functionalities/postmortem/wow64_minidump/TestWow64MiniDump.py lldb-Suite :: functionalities/pre_run_dylibs/TestPreRunDylibs.py lldb-Suite :: functionalities/process_attach/TestProcessAttach.py lldb-Suite :: functionalities/process_attach/attach_denied/TestAttachDenied.py lldb-Suite :: functionalities/process_group/TestChangeProcessGroup.py lldb-Suite :: functionalities/process_launch/TestProcessLaunch.py lldb-Suite :: functionalities/process_save_core/TestProcessSaveCore.py lldb-Suite :: functionalities/ptr_refs/TestPtrRefs.py lldb-Suite :: functionalities/recursion/TestValueObjectRecursion.py lldb-Suite :: functionalities/register/intel_avx/TestYMMRegister.py lldb-Suite :: functionalities/register/intel_avx/TestZMMRegister.py lldb-Suite :: functionalities/register/intel_xtended_registers/TestMPXRegisters.py lldb-Suite :: functionalities/register/intel_xtended_registers/mpx_bound_violation/TestBoundViolation.py lldb-Suite :: functionalities/register/register_command/TestRegisters.py lldb-Suite :: functionalities/reproducer/gdb-remote/TestGdbRemoteReproducer.py lldb-Suite :: functionalities/rerun/TestRerun.py lldb-Suite :: functionalities/return-value/TestReturnValue.py lldb-Suite :: functionalities/set-data/TestSetData.py lldb-Suite :: functionalities/show_location/TestShowLocationDwarf5.py lldb-Suite :: functionalities/signal/TestSendSignal.py lldb-Suite :: functionalities/signal/handle-segv/TestHandleSegv.py lldb-Suite :: functionalities/signal/raise/TestRaise.py lldb-Suite :: functionalities/single-quote-in-filename-to-lldb/TestSingleQuoteInFilename.py lldb-Suite :: functionalities/source-map/TestTargetSourceMap.py lldb-Suite :: functionalities/stats/TestStats.py lldb-Suite :: functionalities/stats_api/TestStatisticsAPI.py lldb-Suite :: functionalities/step-avoids-no-debug/TestStepNoDebug.py lldb-Suite :: functionalities/step_scripted/TestStepScripted.py lldb-Suite :: functionalities/tail_call_frames/ambiguous_tail_call_seq1/TestAmbiguousTailCallSeq1.py lldb-Suite :: functionalities/tail_call_frames/ambiguous_tail_call_seq2/TestAmbiguousTailCallSeq2.py lldb-Suite :: functionalities/tail_call_frames/disambiguate_call_site/TestDisambiguateCallSite.py lldb-Suite :: functionalities/tail_call_frames/disambiguate_paths_to_common_sink/TestDisambiguatePathsToCommonSink.py lldb-Suite :: functionalities/tail_call_frames/disambiguate_tail_call_seq/TestDisambiguateTailCallSeq.py lldb-Suite :: functionalities/tail_call_frames/inlining_and_tail_calls/TestInliningAndTailCalls.py lldb-Suite :: functionalities/tail_call_frames/sbapi_support/TestTailCallFrameSBAPI.py lldb-Suite :: functionalities/tail_call_frames/thread_step_out_message/TestArtificialFrameStepOutMessage.py lldb-Suite :: functionalities/tail_call_frames/thread_step_out_or_return/TestSteppingOutWithArtificialFrames.py lldb-Suite :: functionalities/tail_call_frames/unambiguous_sequence/TestUnambiguousTailCalls.py lldb-Suite :: functionalities/target_command/TestTargetCommand.py lldb-Suite :: functionalities/target_create_deps/TestTargetCreateDeps.py lldb-Suite :: functionalities/target_var/TestTargetVar.py lldb-Suite :: functionalities/testid/TestTestId.py lldb-Suite :: functionalities/thread/backtrace_all/TestBacktraceAll.py lldb-Suite :: functionalities/thread/backtrace_limit/TestBacktraceLimit.py lldb-Suite :: functionalities/thread/break_after_join/TestBreakAfterJoin.py lldb-Suite :: functionalities/thread/concurrent_events/TestConcurrentBreakpointDelayBreakpointOneSignal.py lldb-Suite :: functionalities/thread/concurrent_events/TestConcurrentBreakpointOneDelayBreakpointThreads.py lldb-Suite :: functionalities/thread/concurrent_events/TestConcurrentBreakpointsDelayedBreakpointOneWatchpoint.py lldb-Suite :: functionalities/thread/concurrent_events/TestConcurrentCrashWithBreak.py lldb-Suite :: functionalities/thread/concurrent_events/TestConcurrentCrashWithSignal.py lldb-Suite :: functionalities/thread/concurrent_events/TestConcurrentCrashWithWatchpoint.py lldb-Suite :: functionalities/thread/concurrent_events/TestConcurrentCrashWithWatchpointBreakpointSignal.py lldb-Suite :: functionalities/thread/concurrent_events/TestConcurrentDelaySignalBreak.py lldb-Suite :: functionalities/thread/concurrent_events/TestConcurrentDelaySignalWatch.py lldb-Suite :: functionalities/thread/concurrent_events/TestConcurrentDelayWatchBreak.py lldb-Suite :: functionalities/thread/concurrent_events/TestConcurrentDelayedCrashWithBreakpointSignal.py lldb-Suite :: functionalities/thread/concurrent_events/TestConcurrentDelayedCrashWithBreakpointWatchpoint.py lldb-Suite :: functionalities/thread/concurrent_events/TestConcurrentManyBreakpoints.py lldb-Suite :: functionalities/thread/concurrent_events/TestConcurrentManyCrash.py lldb-Suite :: functionalities/thread/concurrent_events/TestConcurrentManySignals.py lldb-Suite :: functionalities/thread/concurrent_events/TestConcurrentManyWatchpoints.py lldb-Suite :: functionalities/thread/concurrent_events/TestConcurrentNWatchNBreak.py lldb-Suite :: functionalities/thread/concurrent_events/TestConcurrentSignalBreak.py lldb-Suite :: functionalities/thread/concurrent_events/TestConcurrentSignalDelayBreak.py lldb-Suite :: functionalities/thread/concurrent_events/TestConcurrentSignalDelayWatch.py lldb-Suite :: functionalities/thread/concurrent_events/TestConcurrentSignalNWatchNBreak.py lldb-Suite :: functionalities/thread/concurrent_events/TestConcurrentSignalWatch.py lldb-Suite :: functionalities/thread/concurrent_events/TestConcurrentSignalWatchBreak.py lldb-Suite :: functionalities/thread/concurrent_events/TestConcurrentTwoBreakpointThreads.py lldb-Suite :: functionalities/thread/concurrent_events/TestConcurrentTwoBreakpointsOneDelaySignal.py lldb-Suite :: functionalities/thread/concurrent_events/TestConcurrentTwoBreakpointsOneSignal.py lldb-Suite :: functionalities/thread/concurrent_events/TestConcurrentTwoBreakpointsOneWatchpoint.py lldb-Suite :: functionalities/thread/concurrent_events/TestConcurrentTwoWatchpointThreads.py lldb-Suite :: functionalities/thread/concurrent_events/TestConcurrentTwoWatchpointsOneBreakpoint.py lldb-Suite :: functionalities/thread/concurrent_events/TestConcurrentTwoWatchpointsOneDelayBreakpoint.py lldb-Suite :: functionalities/thread/concurrent_events/TestConcurrentTwoWatchpointsOneSignal.py lldb-Suite :: functionalities/thread/concurrent_events/TestConcurrentWatchBreak.py lldb-Suite :: functionalities/thread/concurrent_events/TestConcurrentWatchBreakDelay.py lldb-Suite :: functionalities/thread/concurrent_events/TestConcurrentWatchpointDelayWatchpointOneBreakpoint.py lldb-Suite :: functionalities/thread/concurrent_events/TestConcurrentWatchpointWithDelayWatchpointThreads.py lldb-Suite :: functionalities/thread/crash_during_step/TestCrashDuringStep.py lldb-Suite :: functionalities/thread/create_after_attach/TestCreateAfterAttach.py lldb-Suite :: functionalities/thread/create_during_step/TestCreateDuringStep.py lldb-Suite :: functionalities/thread/exit_during_break/TestExitDuringBreak.py lldb-Suite :: functionalities/thread/exit_during_step/TestExitDuringStep.py lldb-Suite :: functionalities/thread/jump/TestThreadJump.py lldb-Suite :: functionalities/thread/multi_break/TestMultipleBreakpoints.py lldb-Suite :: functionalities/thread/num_threads/TestNumThreads.py lldb-Suite :: functionalities/thread/state/TestThreadStates.py lldb-Suite :: functionalities/thread/step_out/TestThreadStepOut.py lldb-Suite :: functionalities/thread/step_until/TestStepUntil.py lldb-Suite :: functionalities/thread/thread_exit/TestThreadExit.py lldb-Suite :: functionalities/thread/thread_specific_break/TestThreadSpecificBreakpoint.py lldb-Suite :: functionalities/thread/thread_specific_break_plus_condition/TestThreadSpecificBpPlusCondition.py lldb-Suite :: functionalities/tsan/basic/TestTsanBasic.py lldb-Suite :: functionalities/tsan/cpp_global_location/TestTsanCPPGlobalLocation.py lldb-Suite :: functionalities/tsan/global_location/TestTsanGlobalLocation.py lldb-Suite :: functionalities/tsan/multiple/TestTsanMultiple.py lldb-Suite :: functionalities/tsan/thread_leak/TestTsanThreadLeak.py lldb-Suite :: functionalities/tsan/thread_numbers/TestTsanThreadNumbers.py lldb-Suite :: functionalities/tty/TestTerminal.py lldb-Suite :: functionalities/type_completion/TestTypeCompletion.py lldb-Suite :: functionalities/type_lookup/TestTypeLookup.py lldb-Suite :: functionalities/ubsan/basic/TestUbsanBasic.py lldb-Suite :: functionalities/ubsan/user-expression/TestUbsanUserExpression.py lldb-Suite :: functionalities/unwind/ehframe/TestEhFrameUnwind.py lldb-Suite :: functionalities/unwind/noreturn/TestNoreturnUnwind.py lldb-Suite :: functionalities/unwind/noreturn/module-end/TestNoReturnModuleEnd.py lldb-Suite :: functionalities/unwind/sigtramp/TestSigtrampUnwind.py lldb-Suite :: functionalities/unwind/standard/TestStandardUnwind.py lldb-Suite :: functionalities/value_md5_crash/TestValueMD5Crash.py lldb-Suite :: functionalities/watchpoint/hello_watchlocation/TestWatchLocation.py lldb-Suite :: functionalities/watchpoint/hello_watchpoint/TestMyFirstWatchpoint.py lldb-Suite :: functionalities/watchpoint/multi_watchpoint_slots/TestWatchpointMultipleSlots.py lldb-Suite :: functionalities/watchpoint/multiple_hits/TestMultipleHits.py lldb-Suite :: functionalities/watchpoint/multiple_threads/TestWatchpointMultipleThreads.py lldb-Suite :: functionalities/watchpoint/step_over_watchpoint/TestStepOverWatchpoint.py lldb-Suite :: functionalities/watchpoint/variable_out_of_scope/TestWatchedVarHitWhenInScope.py lldb-Suite :: functionalities/watchpoint/watchpoint_commands/TestWatchpointCommands.py lldb-Suite :: functionalities/watchpoint/watchpoint_commands/command/TestWatchpointCommandLLDB.py lldb-Suite :: functionalities/watchpoint/watchpoint_commands/command/TestWatchpointCommandPython.py lldb-Suite :: functionalities/watchpoint/watchpoint_commands/condition/TestWatchpointConditionCmd.py lldb-Suite :: functionalities/watchpoint/watchpoint_disable/TestWatchpointDisable.py lldb-Suite :: functionalities/watchpoint/watchpoint_events/TestWatchpointEvents.py lldb-Suite :: functionalities/watchpoint/watchpoint_on_vectors/TestValueOfVectorVariable.py lldb-Suite :: functionalities/watchpoint/watchpoint_set_command/TestWatchLocationWithWatchSet.py lldb-Suite :: functionalities/watchpoint/watchpoint_set_command/TestWatchpointSetErrorCases.py lldb-Suite :: functionalities/watchpoint/watchpoint_size/TestWatchpointSizes.py lldb-Suite :: functionalities/wrong_commands/TestWrongCommands.py lldb-Suite :: help/TestApropos.py lldb-Suite :: help/TestHelp.py lldb-Suite :: lang/c/anonymous/TestAnonymous.py lldb-Suite :: lang/c/array_types/TestArrayTypes.py lldb-Suite :: lang/c/bitfields/TestBitfields.py lldb-Suite :: lang/c/blocks/TestBlocks.py lldb-Suite :: lang/c/conflicting-symbol/TestConflictingSymbol.py lldb-Suite :: lang/c/const_variables/TestConstVariables.py lldb-Suite :: lang/c/enum_types/TestEnumTypes.py lldb-Suite :: lang/c/find_struct_type/TestFindStructTypes.py lldb-Suite :: lang/c/forward/TestForwardDeclaration.py lldb-Suite :: lang/c/function_types/TestFunctionTypes.py lldb-Suite :: lang/c/global_variables/TestGlobalVariables.py lldb-Suite :: lang/c/inlines/TestRedefinitionsInInlines.py lldb-Suite :: lang/c/local_variables/TestLocalVariables.py lldb-Suite :: lang/c/modules/TestCModules.py lldb-Suite :: lang/c/register_variables/TestRegisterVariables.py lldb-Suite :: lang/c/set_values/TestSetValues.py lldb-Suite :: lang/c/shared_lib/TestSharedLib.py lldb-Suite :: lang/c/shared_lib_stripped_symbols/TestSharedLibStrippedSymbols.py lldb-Suite :: lang/c/step-target/TestStepTarget.py lldb-Suite :: lang/c/stepping/TestStepAndBreakpoints.py lldb-Suite :: lang/c/stepping/TestThreadStepping.py lldb-Suite :: lang/c/strings/TestCStrings.py lldb-Suite :: lang/c/struct_types/TestStructTypes.py lldb-Suite :: lang/c/tls_globals/TestTlsGlobals.py lldb-Suite :: lang/c/typedef/Testtypedef.py lldb-Suite :: lang/c/unicode/TestUnicodeSymbols.py lldb-Suite :: lang/c/unions/TestUnionMembers.py lldb-Suite :: lang/c/vla/TestVLA.py lldb-Suite :: lang/cpp/auto/TestCPPAuto.py lldb-Suite :: lang/cpp/bool/TestCPPBool.py lldb-Suite :: lang/cpp/breakpoint-commands/TestCPPBreakpointCommands.py lldb-Suite :: lang/cpp/call-function/TestCallCPPFunction.py lldb-Suite :: lang/cpp/chained-calls/TestCppChainedCalls.py lldb-Suite :: lang/cpp/char1632_t/TestChar1632T.py lldb-Suite :: lang/cpp/class-template-parameter-pack/TestClassTemplateParameterPack.py lldb-Suite :: lang/cpp/class_static/TestStaticVariables.py lldb-Suite :: lang/cpp/class_types/TestClassTypes.py lldb-Suite :: lang/cpp/class_types/TestClassTypesDisassembly.py lldb-Suite :: lang/cpp/const_this/TestConstThis.py lldb-Suite :: lang/cpp/diamond/TestDiamond.py lldb-Suite :: lang/cpp/dynamic-value-same-basename/TestDynamicValueSameBase.py lldb-Suite :: lang/cpp/dynamic-value/TestCppValueCast.py lldb-Suite :: lang/cpp/dynamic-value/TestDynamicValue.py lldb-Suite :: lang/cpp/enum_types/TestCPP11EnumTypes.py lldb-Suite :: lang/cpp/exceptions/TestCPPExceptionBreakpoints.py lldb-Suite :: lang/cpp/extern_c/TestExternCSymbols.py lldb-Suite :: lang/cpp/frame-var-anon-unions/TestFrameVariableAnonymousUnions.py lldb-Suite :: lang/cpp/function-template-parameter-pack/TestFunctionTemplateParameterPack.py lldb-Suite :: lang/cpp/global_operators/TestCppGlobalOperators.py lldb-Suite :: lang/cpp/gmodules-templates/TestGModules.py lldb-Suite :: lang/cpp/gmodules/TestWithModuleDebugging.py lldb-Suite :: lang/cpp/incomplete-types/TestCppIncompleteTypes.py lldb-Suite :: lang/cpp/inlines/TestInlines.py lldb-Suite :: lang/cpp/lambdas/TestLambdas.py lldb-Suite :: lang/cpp/limit-debug-info/TestWithLimitDebugInfo.py lldb-Suite :: lang/cpp/llvm-style/TestLLVMStyle.py lldb-Suite :: lang/cpp/member-and-local-vars-with-same-name/TestMembersAndLocalsWithSameName.py lldb-Suite :: lang/cpp/namespace/TestNamespace.py lldb-Suite :: lang/cpp/namespace/TestNamespaceLookup.py lldb-Suite :: lang/cpp/namespace_conflicts/TestNamespaceConflicts.py lldb-Suite :: lang/cpp/namespace_definitions/TestNamespaceDefinitions.py lldb-Suite :: lang/cpp/nsimport/TestCppNsImport.py lldb-Suite :: lang/cpp/operator-overload/TestOperatorOverload.py lldb-Suite :: lang/cpp/overloaded-functions/TestOverloadedFunctions.py lldb-Suite :: lang/cpp/printf/TestPrintf.py lldb-Suite :: lang/cpp/rvalue-references/TestRvalueReferences.py lldb-Suite :: lang/cpp/scope/TestCppScope.py lldb-Suite :: lang/cpp/signed_types/TestSignedTypes.py lldb-Suite :: lang/cpp/static_members/TestCPPStaticMembers.py lldb-Suite :: lang/cpp/static_methods/TestCPPStaticMethods.py lldb-Suite :: lang/cpp/std-function-step-into-callable/TestStdFunctionStepIntoCallable.py lldb-Suite :: lang/cpp/stl/TestSTL.py lldb-Suite :: lang/cpp/stl/TestStdCXXDisassembly.py lldb-Suite :: lang/cpp/symbols/TestSymbols.py lldb-Suite :: lang/cpp/template/TestTemplateArgs.py lldb-Suite :: lang/cpp/this/TestCPPThis.py lldb-Suite :: lang/cpp/trivial_abi/TestTrivialABI.py lldb-Suite :: lang/cpp/type_lookup/TestCppTypeLookup.py lldb-Suite :: lang/cpp/unicode-literals/TestUnicodeLiterals.py lldb-Suite :: lang/cpp/unique-types/TestUniqueTypes.py lldb-Suite :: lang/cpp/unsigned_types/TestUnsignedTypes.py lldb-Suite :: lang/cpp/virtual-overload/TestVirtualOverload.py lldb-Suite :: lang/cpp/virtual/TestVirtual.py lldb-Suite :: lang/cpp/wchar_t/TestCxxWCharT.py lldb-Suite :: lang/mixed/TestMixedLanguages.py lldb-Suite :: lang/objc/bitfield_ivars/TestBitfieldIvars.py lldb-Suite :: lang/objc/blocks/TestObjCIvarsInBlocks.py lldb-Suite :: lang/objc/conflicting-definition/TestConflictingDefinition.py lldb-Suite :: lang/objc/exceptions/TestObjCExceptions.py lldb-Suite :: lang/objc/forward-decl/TestForwardDecl.py lldb-Suite :: lang/objc/foundation/TestConstStrings.py lldb-Suite :: lang/objc/foundation/TestFoundationDisassembly.py lldb-Suite :: lang/objc/foundation/TestObjCMethods.py lldb-Suite :: lang/objc/foundation/TestObjCMethods2.py lldb-Suite :: lang/objc/foundation/TestObjectDescriptionAPI.py lldb-Suite :: lang/objc/foundation/TestRuntimeTypes.py lldb-Suite :: lang/objc/foundation/TestSymbolTable.py lldb-Suite :: lang/objc/global_ptrs/TestGlobalObjects.py lldb-Suite :: lang/objc/hidden-ivars/TestHiddenIvars.py lldb-Suite :: lang/objc/ivar-IMP/TestObjCiVarIMP.py lldb-Suite :: lang/objc/modules-auto-import/TestModulesAutoImport.py lldb-Suite :: lang/objc/modules-cache/TestClangModulesCache.py lldb-Suite :: lang/objc/modules-incomplete/TestIncompleteModules.py lldb-Suite :: lang/objc/modules-inline-functions/TestModulesInlineFunctions.py lldb-Suite :: lang/objc/modules/TestObjCModules.py lldb-Suite :: lang/objc/objc++/TestObjCXX.py lldb-Suite :: lang/objc/objc-baseclass-sbtype/TestObjCBaseClassSBType.py lldb-Suite :: lang/objc/objc-builtin-types/TestObjCBuiltinTypes.py lldb-Suite :: lang/objc/objc-checker/TestObjCCheckers.py lldb-Suite :: lang/objc/objc-class-method/TestObjCClassMethod.py lldb-Suite :: lang/objc/objc-dyn-sbtype/TestObjCDynamicSBType.py lldb-Suite :: lang/objc/objc-dynamic-value/TestObjCDynamicValue.py lldb-Suite :: lang/objc/objc-foundation-dictionary-empty/TestNSDictionary0.py lldb-Suite :: lang/objc/objc-ivar-offsets/TestObjCIvarOffsets.py lldb-Suite :: lang/objc/objc-ivar-protocols/TestIvarProtocols.py lldb-Suite :: lang/objc/objc-ivar-stripped/TestObjCIvarStripped.py lldb-Suite :: lang/objc/objc-new-syntax/TestObjCNewSyntax.py lldb-Suite :: lang/objc/objc-optimized/TestObjcOptimized.py lldb-Suite :: lang/objc/objc-property/TestObjCProperty.py lldb-Suite :: lang/objc/objc-runtime-ivars/TestRuntimeIvars.py lldb-Suite :: lang/objc/objc-static-method-stripped/TestObjCStaticMethodStripped.py lldb-Suite :: lang/objc/objc-static-method/TestObjCStaticMethod.py lldb-Suite :: lang/objc/objc-stepping/TestObjCStepping.py lldb-Suite :: lang/objc/objc-struct-argument/TestObjCStructArgument.py lldb-Suite :: lang/objc/objc-struct-return/TestObjCStructReturn.py lldb-Suite :: lang/objc/objc-super/TestObjCSuper.py lldb-Suite :: lang/objc/orderedset/TestOrderedSet.py lldb-Suite :: lang/objc/print-obj/TestPrintObj.py lldb-Suite :: lang/objc/ptr_refs/TestPtrRefsObjC.py lldb-Suite :: lang/objc/radar-9691614/TestObjCMethodReturningBOOL.py lldb-Suite :: lang/objc/rdar-10967107/TestRdar10967107.py lldb-Suite :: lang/objc/rdar-11355592/TestRdar11355592.py lldb-Suite :: lang/objc/rdar-12408181/TestRdar12408181.py lldb-Suite :: lang/objc/real-definition/TestRealDefinition.py lldb-Suite :: lang/objc/self/TestObjCSelf.py lldb-Suite :: lang/objc/single-entry-dictionary/TestObjCSingleEntryDictionary.py lldb-Suite :: lang/objc/unicode-string/TestUnicodeString.py lldb-Suite :: lang/objc/variadic_methods/TestVariadicMethods.py lldb-Suite :: lang/objcxx/class-name-clash/TestNameClash.py lldb-Suite :: lang/objcxx/objcxx-ivar-vector/TestIvarVector.py lldb-Suite :: linux/add-symbols/TestTargetSymbolsAddCommand.py lldb-Suite :: linux/builtin_trap/TestBuiltinTrap.py lldb-Suite :: linux/mix-dwo-and-regular-objects/TestMixedDwarfBinary.py lldb-Suite :: linux/sepdebugsymlink/TestTargetSymbolsSepDebugSymlink.py lldb-Suite :: linux/thread/create_during_instruction_step/TestCreateDuringInstructionStep.py lldb-Suite :: logging/TestLogging.py lldb-Suite :: macosx/add-dsym/TestAddDsymMidExecutionCommand.py lldb-Suite :: macosx/duplicate-archive-members/TestDuplicateMembers.py lldb-Suite :: macosx/find-app-in-bundle/TestFindAppInBundle.py lldb-Suite :: macosx/find-dsym/bundle-with-dot-in-filename/TestBundleWithDotInFilename.py lldb-Suite :: macosx/find-dsym/deep-bundle/TestDeepBundle.py lldb-Suite :: macosx/function-starts/TestFunctionStarts.py lldb-Suite :: macosx/indirect_symbol/TestIndirectSymbols.py lldb-Suite :: macosx/load-kext/TestLoadKext.py lldb-Suite :: macosx/nslog/TestDarwinNSLogOutput.py lldb-Suite :: macosx/order/TestOrderFile.py lldb-Suite :: macosx/queues/TestQueues.py lldb-Suite :: macosx/safe-to-func-call/TestSafeFuncCalls.py lldb-Suite :: macosx/thread-names/TestInterruptThreadNames.py lldb-Suite :: macosx/universal/TestUniversal.py lldb-Suite :: python_api/breakpoint/TestBreakpointAPI.py lldb-Suite :: python_api/class_members/TestSBTypeClassMembers.py lldb-Suite :: python_api/debugger/TestDebuggerAPI.py lldb-Suite :: python_api/default-constructor/TestDefaultConstructorForAPIObjects.py lldb-Suite :: python_api/disassemble-raw-data/TestDisassembleRawData.py lldb-Suite :: python_api/disassemble-raw-data/TestDisassemble_VST1_64.py lldb-Suite :: python_api/event/TestEvents.py lldb-Suite :: python_api/exprpath_synthetic/TestExprPathSynthetic.py lldb-Suite :: python_api/file_handle/TestFileHandle.py lldb-Suite :: python_api/findvalue_duplist/TestSBFrameFindValue.py lldb-Suite :: python_api/formatters/TestFormattersSBAPI.py lldb-Suite :: python_api/frame/TestFrames.py lldb-Suite :: python_api/frame/get-variables/TestGetVariables.py lldb-Suite :: python_api/frame/inlines/TestInlinedFrame.py lldb-Suite :: python_api/function_symbol/TestDisasmAPI.py lldb-Suite :: python_api/function_symbol/TestSymbolAPI.py lldb-Suite :: python_api/hello_world/TestHelloWorld.py lldb-Suite :: python_api/interpreter/TestCommandInterpreterAPI.py lldb-Suite :: python_api/lldbutil/frame/TestFrameUtils.py lldb-Suite :: python_api/lldbutil/iter/TestLLDBIterator.py lldb-Suite :: python_api/lldbutil/iter/TestRegistersIterator.py lldb-Suite :: python_api/lldbutil/process/TestPrintStackTraces.py lldb-Suite :: python_api/module_section/TestModuleAndSection.py lldb-Suite :: python_api/name_lookup/TestNameLookup.py lldb-Suite :: python_api/objc_type/TestObjCType.py lldb-Suite :: python_api/process/TestProcessAPI.py lldb-Suite :: python_api/process/io/TestProcessIO.py lldb-Suite :: python_api/process/read-mem-cstring/TestReadMemCString.py lldb-Suite :: python_api/rdar-12481949/Test-rdar-12481949.py lldb-Suite :: python_api/sbdata/TestSBData.py lldb-Suite :: python_api/sblaunchinfo/TestSBLaunchInfo.py lldb-Suite :: python_api/sbstructureddata/TestStructuredDataAPI.py lldb-Suite :: python_api/sbtype_typeclass/TestSBTypeTypeClass.py lldb-Suite :: python_api/sbvalue_const_addrof/TestSBValueConstAddrOf.py lldb-Suite :: python_api/sbvalue_persist/TestSBValuePersist.py lldb-Suite :: python_api/section/TestSectionAPI.py lldb-Suite :: python_api/signals/TestSignalsAPI.py lldb-Suite :: python_api/symbol-context/TestSymbolContext.py lldb-Suite :: python_api/symbol-context/two-files/TestSymbolContextTwoFiles.py lldb-Suite :: python_api/target/TestTargetAPI.py lldb-Suite :: python_api/thread/TestThreadAPI.py lldb-Suite :: python_api/type/TestTypeList.py lldb-Suite :: python_api/value/TestValueAPI.py lldb-Suite :: python_api/value/change_values/TestChangeValueAPI.py lldb-Suite :: python_api/value/empty_class/TestValueAPIEmptyClass.py lldb-Suite :: python_api/value/linked_list/TestValueAPILinkedList.py lldb-Suite :: python_api/value_var_update/TestValueVarUpdate.py lldb-Suite :: python_api/watchpoint/TestSetWatchpoint.py lldb-Suite :: python_api/watchpoint/TestWatchpointIgnoreCount.py lldb-Suite :: python_api/watchpoint/TestWatchpointIter.py lldb-Suite :: python_api/watchpoint/condition/TestWatchpointConditionAPI.py lldb-Suite :: python_api/watchpoint/watchlocation/TestSetWatchlocation.py lldb-Suite :: python_api/watchpoint/watchlocation/TestTargetWatchAddress.py lldb-Suite :: quit/TestQuit.py lldb-Suite :: sample_test/TestSampleInlineTest.py lldb-Suite :: sample_test/TestSampleTest.py lldb-Suite :: settings/TestSettings.py lldb-Suite :: settings/quoting/TestQuoting.py lldb-Suite :: source-manager/TestSourceManager.py lldb-Suite :: terminal/TestSTTYBeforeAndAfter.py lldb-Suite :: tools/lldb-mi/TestMiEnvironmentCd.py lldb-Suite :: tools/lldb-mi/TestMiFile.py lldb-Suite :: tools/lldb-mi/TestMiLibraryLoaded.py lldb-Suite :: tools/lldb-mi/TestMiPrompt.py lldb-Suite :: tools/lldb-mi/breakpoint/TestMiBreak.py lldb-Suite :: tools/lldb-mi/control/TestMiExec.py lldb-Suite :: tools/lldb-mi/data/TestMiData.py lldb-Suite :: tools/lldb-mi/interpreter/TestMiCliSupport.py lldb-Suite :: tools/lldb-mi/interpreter/TestMiInterpreterExec.py lldb-Suite :: tools/lldb-mi/lexical_scope/TestMiLexicalScope.py lldb-Suite :: tools/lldb-mi/signal/TestMiSignal.py lldb-Suite :: tools/lldb-mi/stack/TestMiStack.py lldb-Suite :: tools/lldb-mi/startup_options/TestMiStartupOptions.py lldb-Suite :: tools/lldb-mi/syntax/TestMiSyntax.py lldb-Suite :: tools/lldb-mi/target/TestMiTarget.py lldb-Suite :: tools/lldb-mi/threadinfo/TestMiThreadInfo.py lldb-Suite :: tools/lldb-mi/variable/TestMiGdbSetShowPrint.py lldb-Suite :: tools/lldb-mi/variable/TestMiVar.py lldb-Suite :: tools/lldb-server/TestAppleSimulatorOSType.py lldb-Suite :: tools/lldb-server/TestGdbRemoteAttach.py lldb-Suite :: tools/lldb-server/TestGdbRemoteAuxvSupport.py lldb-Suite :: tools/lldb-server/TestGdbRemoteExitCode.py lldb-Suite :: tools/lldb-server/TestGdbRemoteExpeditedRegisters.py lldb-Suite :: tools/lldb-server/TestGdbRemoteGPacket.py lldb-Suite :: tools/lldb-server/TestGdbRemoteHostInfo.py lldb-Suite :: tools/lldb-server/TestGdbRemoteKill.py lldb-Suite :: tools/lldb-server/TestGdbRemoteModuleInfo.py lldb-Suite :: tools/lldb-server/TestGdbRemoteProcessInfo.py lldb-Suite :: tools/lldb-server/TestGdbRemoteRegisterState.py lldb-Suite :: tools/lldb-server/TestGdbRemoteSingleStep.py lldb-Suite :: tools/lldb-server/TestGdbRemoteThreadsInStopReply.py lldb-Suite :: tools/lldb-server/TestGdbRemote_qThreadStopInfo.py lldb-Suite :: tools/lldb-server/TestGdbRemote_vCont.py lldb-Suite :: tools/lldb-server/TestLldbGdbServer.py lldb-Suite :: tools/lldb-server/commandline/TestStubReverseConnect.py lldb-Suite :: tools/lldb-server/commandline/TestStubSetSID.py lldb-Suite :: tools/lldb-server/inferior-crash/TestGdbRemoteAbort.py lldb-Suite :: tools/lldb-server/inferior-crash/TestGdbRemoteSegFault.py lldb-Suite :: tools/lldb-server/platform-process-connect/TestPlatformProcessConnect.py lldb-Suite :: tools/lldb-server/signal-filtering/TestGdbRemote_QPassSignals.py lldb-Suite :: tools/lldb-server/thread-name/TestGdbRemoteThreadName.py lldb-Suite :: tools/lldb-vscode/attach/TestVSCode_attach.py lldb-Suite :: tools/lldb-vscode/breakpoint/TestVSCode_setBreakpoints.py lldb-Suite :: tools/lldb-vscode/breakpoint/TestVSCode_setExceptionBreakpoints.py lldb-Suite :: tools/lldb-vscode/breakpoint/TestVSCode_setFunctionBreakpoints.py lldb-Suite :: tools/lldb-vscode/launch/TestVSCode_launch.py lldb-Suite :: tools/lldb-vscode/stackTrace/TestVSCode_stackTrace.py lldb-Suite :: tools/lldb-vscode/step/TestVSCode_step.py lldb-Suite :: tools/lldb-vscode/variables/TestVSCode_variables.py lldb-Suite :: types/TestFloatTypes.py lldb-Suite :: types/TestFloatTypesExpr.py lldb-Suite :: types/TestIntegerTypes.py lldb-Suite :: types/TestIntegerTypesExpr.py lldb-Suite :: types/TestRecursiveTypes.py lldb-Suite :: warnings/uuid/TestAddDsymCommand.py

Hide Details

Expected Passes : 679 Unsupported Tests : 46 Unexpected Failures: 675 FAILED: tools/lldb/lit/CMakeFiles/check-lldb-lit cd /Users/buildslave/jenkins/workspace/lldb-cmake-dwarf5/lldb-build/tools/lldb/lit && /usr/bin/python2.7 /Users/buildslave/jenkins/workspace/lldb-cmake-dwarf5/lldb-build/./bin/llvm-lit --xunit-xml-output=/Users/buildslave/jenkins/workspace/lldb-cmake-dwarf5/test/results.xml -v /Users/buildslave/jenkins/workspace/lldb-cmake-dwarf5/lldb-build/tools/lldb/lit ninja: build stopped: subcommand failed. Command failed Command: ['/usr/bin/env', 'TERM=vt100', '/usr/local/bin/ninja', '-v', 'check-lldb'] + EXIT_STATUS=1 + set -e + echo @@@@@@ @@@@@@ + echo '@@@ Archiving Test Logs @@@'
Archiving Test Logs

Hide Details

@@@ Archiving Test Logs @@@ + tar zcf /Users/buildslave/jenkins/workspace/lldb-cmake-dwarf5/results/test_logs.tgz -C /Users/buildslave/jenkins/workspace/lldb-cmake-dwarf5/test/logs . + '[' 1 -ne 0 ']' + echo 'CHECK-LLDB Failed!\n' CHECK-LLDB Failed!

Hide Details

+ exit 1 Build step 'Execute shell' marked build as failure Archiving artifacts Recording test results Sending e-mails to: lldb@group.apple.com [BFA] Scanning build for known causes... [BFA] Found failure cause(s): [BFA] Regression test failed from category Test [BFA] Ninja target failed from category Compile [BFA] Done. 0s No emails were triggered. Returning node parameter for green-dragon-24 Triggering a new build of Zombie Detector (FAIL OK) Finished: FAILURE