FailedConsole Output

Skipping 546 KB.. Full Log
nspectionEngine.TestPopEDI (462 of 1781)
UNSUPPORTED: lldb-api :: commands/register/register/intel_xtended_registers/mpx_bound_violation/TestBoundViolation.py (463 of 1781)
PASS: lldb-api :: functionalities/plugins/python_os_plugin/TestPythonOSPlugin.py (464 of 1781)
PASS: lldb-unit :: Utility/./UtilityTests/StreamTest.PutPtr (465 of 1781)
PASS: lldb-api :: functionalities/inferior-crashing/recursive-inferior/TestRecursiveInferior.py (466 of 1781)
PASS: lldb-api :: functionalities/thread/step_until/TestStepUntil.py (467 of 1781)
PASS: lldb-unit :: UnwindAssembly/x86/./UnwindAssemblyx86Tests/Testx86AssemblyInspectionEngine.TestPushEDX (468 of 1781)
PASS: lldb-api :: commands/expression/pr35310/TestExprsBug35310.py (469 of 1781)
PASS: lldb-shell :: SymbolFile/DWARF/find-inline-method.s (470 of 1781)
PASS: lldb-unit :: Utility/./UtilityTests/UriParserTest.BracketedHostnamePort (471 of 1781)
PASS: lldb-unit :: Utility/./UtilityTests/TimerTest.CategoryTimesNested (472 of 1781)
UNSUPPORTED: lldb-api :: functionalities/data-formatter/data-formatter-stl/libstdcpp/iterator/TestDataFormatterStdIterator.py (473 of 1781)
UNSUPPORTED: lldb-api :: functionalities/darwin_log/filter/exact_match/activity/TestDarwinLogFilterMatchActivity.py (474 of 1781)
PASS: lldb-unit :: Host/./HostTests/NativeProcessProtocolTest.SetBreakpoint (475 of 1781)
PASS: lldb-unit :: Host/./HostTests/FileSystemTest.OpenErrno (476 of 1781)
PASS: lldb-unit :: Host/./HostTests/TaskPoolTest.TaskMap (477 of 1781)
PASS: lldb-unit :: Utility/./UtilityTests/ArchSpecTest.Compatibility (478 of 1781)
PASS: lldb-shell :: Expr/TestTypeOfDeclTypeExpr.test (479 of 1781)
UNSUPPORTED: lldb-shell :: ObjectFile/ELF/minidebuginfo-no-lzma.yaml (480 of 1781)
PASS: lldb-unit :: Expression/./ExpressionTests/CppModuleConfigurationTest.UnrelatedLibrary (481 of 1781)
PASS: lldb-api :: macosx/version_zero/TestGetVersionZeroVersion.py (482 of 1781)
UNSUPPORTED: lldb-shell :: BuildScript/toolchain-clang-cl.test (483 of 1781)
PASS: lldb-unit :: Language/Highlighting/./HighlighterTests/HighlighterTest.ClangCommas (484 of 1781)
PASS: lldb-unit :: Utility/./UtilityTests/Flags.AnySet (485 of 1781)
PASS: lldb-api :: functionalities/data-formatter/data-formatter-stl/libcxx/initializerlist/TestInitializerList.py (486 of 1781)
PASS: lldb-unit :: Utility/./UtilityTests/BinaryStreamTest.PutSLEB128SevenBytes (487 of 1781)
PASS: lldb-unit :: Language/Highlighting/./HighlighterTests/HighlighterTest.ClangComments (488 of 1781)
PASS: lldb-unit :: Utility/./UtilityTests/RangeTest.ContainsRange (489 of 1781)
UNSUPPORTED: lldb-shell :: Process/Windows/exception_access_violation.cpp (490 of 1781)
UNSUPPORTED: lldb-api :: functionalities/thread/thread_specific_break_plus_condition/TestThreadSpecificBpPlusCondition.py (491 of 1781)
PASS: lldb-shell :: SymbolFile/DWARF/dwarf5-partial-index.cpp (492 of 1781)
PASS: lldb-shell :: SymbolFile/NativePDB/function-types-builtins.cpp (493 of 1781)
PASS: lldb-api :: functionalities/thread/concurrent_events/TestConcurrentTwoWatchpointsOneSignal.py (494 of 1781)
PASS: lldb-unit :: SymbolFile/DWARF/./SymbolFileDWARFTests/SymbolFileDWARFTests.TestAbbrevNullAttrValidForm (495 of 1781)
UNSUPPORTED: lldb-api :: benchmarks/expression/TestRepeatedExprs.py (496 of 1781)
PASS: lldb-unit :: Process/minidump/./LLDBMinidumpTests/MinidumpParserTest.GetThreadContext_x86_32 (497 of 1781)
PASS: lldb-api :: commands/frame/diagnose/dereference-function-return/TestDiagnoseDereferenceFunctionReturn.py (498 of 1781)
PASS: lldb-api :: lang/c/strings/TestCStrings.py (499 of 1781)
PASS: lldb-unit :: Utility/./UtilityTests/ScalarTest.GetValue (500 of 1781)
PASS: lldb-api :: tools/lldb-server/TestGdbRemoteRegisterState.py (501 of 1781)
UNSUPPORTED: lldb-api :: api/multiple-debuggers/TestMultipleDebuggers.py (502 of 1781)
UNSUPPORTED: lldb-api :: functionalities/darwin_log/filter/regex/activity-chain/TestDarwinLogFilterRegexActivityChain.py (503 of 1781)
PASS: lldb-api :: lang/cpp/accelerator-table/TestCPPAccelerator.py (504 of 1781)
PASS: lldb-api :: lang/c/unions/TestUnionMembers.py (505 of 1781)
PASS: lldb-api :: lang/cpp/class_types/TestClassTypesDisassembly.py (506 of 1781)
UNSUPPORTED: lldb-shell :: Register/x86-ymm-read.test (507 of 1781)
PASS: lldb-unit :: Language/Highlighting/./HighlighterTests/HighlighterTest.ClangBraces (508 of 1781)
PASS: lldb-api :: functionalities/data-formatter/data-formatter-stl/libcxx/map/TestDataFormatterLibccMap.py (509 of 1781)
PASS: lldb-api :: functionalities/data-formatter/data-formatter-stl/libstdcpp/unique_ptr/invalid/TestDataFormatterInvalidStdUniquePtr.py (510 of 1781)
PASS: lldb-unit :: Utility/./UtilityTests/RegularExpression.Empty (511 of 1781)
UNSUPPORTED: lldb-api :: macosx/macabi/TestMacABImacOSFramework.py (512 of 1781)
PASS: lldb-unit :: Core/./LLDBCoreTests/MangledTest.ResultForValidName (513 of 1781)
PASS: lldb-unit :: Utility/./UtilityTests/GeneratorTest.GetOrCreate (514 of 1781)
PASS: lldb-api :: types/TestIntegerTypesExpr.py (515 of 1781)
PASS: lldb-api :: functionalities/data-formatter/data-formatter-objc/TestDataFormatterObjCExpr.py (516 of 1781)
PASS: lldb-api :: functionalities/data-formatter/data-formatter-disabling/TestDataFormatterDisabling.py (517 of 1781)
PASS: lldb-unit :: Utility/./UtilityTests/RangeTest.ClearWithStarAddress (518 of 1781)
PASS: lldb-unit :: Utility/./UtilityTests/FileSpecTest.GetNormalizedPath (519 of 1781)
PASS: lldb-shell :: Reproducer/Functionalities/TestStepping.test (520 of 1781)
PASS: lldb-api :: functionalities/data-formatter/data-formatter-enum-format/TestDataFormatterEnumFormat.py (521 of 1781)
PASS: lldb-unit :: Process/gdb-remote/./ProcessGdbRemoteTests/GDBRemoteCommunicationServerTest.SendErrorResponse_ErrorList (522 of 1781)
PASS: lldb-api :: lang/objcxx/objcxx-ivar-vector/TestIvarVector.py (523 of 1781)
PASS: lldb-api :: macosx/find-dsym/bundle-with-dot-in-filename/TestBundleWithDotInFilename.py (524 of 1781)
PASS: lldb-unit :: Utility/./UtilityTests/ConstStringTest.CompareConstString (525 of 1781)
PASS: lldb-unit :: Utility/./UtilityTests/StreamTest.QuotedCString (526 of 1781)
PASS: lldb-shell :: Settings/TestFrameFormatNoColor.test (527 of 1781)
PASS: lldb-api :: functionalities/data-formatter/synthcapping/TestSyntheticCapping.py (528 of 1781)
PASS: lldb-api :: functionalities/thread/concurrent_events/TestConcurrentSignalDelayWatch.py (529 of 1781)
PASS: lldb-unit :: SymbolFile/NativePDB/./SymbolFileNativePDBTests/PDBFPOProgramToDWARFExpressionTests.UnresolvedDependentCyclicRegisterAssignmentReference (530 of 1781)
UNSUPPORTED: lldb-shell :: SymbolFile/PDB/vbases.test (531 of 1781)
UNSUPPORTED: lldb-api :: lang/objc/objc-dynamic-value/TestObjCDynamicValue.py (532 of 1781)
PASS: lldb-unit :: Utility/./UtilityTests/TimerTest.CategoryTimes (533 of 1781)
PASS: lldb-api :: commands/log/invalid-args/TestInvalidArgsLog.py (534 of 1781)
PASS: lldb-unit :: Process/minidump/./LLDBMinidumpTests/RegisterContextMinidump.CheckRegisterContextMinidump_ARM (535 of 1781)
PASS: lldb-unit :: Utility/./UtilityTests/StreamTeeTest.AppendStream (536 of 1781)
PASS: lldb-api :: functionalities/float-display/TestFloatDisplay.py (537 of 1781)
PASS: lldb-api :: functionalities/stats_api/TestStatisticsAPI.py (538 of 1781)
PASS: lldb-shell :: Breakpoint/debug_rnglist_offset_pair.test (539 of 1781)
PASS: lldb-unit :: Utility/./UtilityTests/StreamTest.PutCharNull (540 of 1781)
PASS: lldb-api :: python_api/frame/get-variables/TestGetVariables.py (541 of 1781)
PASS: lldb-api :: commands/expression/call-function/TestCallBuiltinFunction.py (542 of 1781)
PASS: lldb-unit :: Utility/./UtilityTests/VMRange.Ordering (543 of 1781)
PASS: lldb-unit :: ScriptInterpreter/Python/./ScriptInterpreterPythonTests/PythonExceptionStateTest.TestResetSemantics (544 of 1781)
PASS: lldb-unit :: SymbolFile/NativePDB/./SymbolFileNativePDBTests/PDBFPOProgramToDWARFExpressionTests.InvalidAssignmentSingle (545 of 1781)
UNSUPPORTED: lldb-shell :: Register/x86-zmm-read.test (546 of 1781)
PASS: lldb-api :: tools/lldb-server/TestGdbRemoteExpeditedRegisters.py (547 of 1781)
PASS: lldb-api :: functionalities/breakpoint/serialize/TestBreakpointSerialization.py (548 of 1781)
PASS: lldb-api :: functionalities/data-formatter/refpointer-recursion/TestDataFormatterRefPtrRecursion.py (549 of 1781)
PASS: lldb-unit :: Utility/./UtilityTests/ProcessInstanceInfoMatch.Name (550 of 1781)
PASS: lldb-shell :: Driver/TestRepl.test (551 of 1781)
PASS: lldb-shell :: SymbolFile/Breakpad/line-table-discontinuous-file-ids.test (552 of 1781)
PASS: lldb-unit :: UnwindAssembly/x86/./UnwindAssemblyx86Tests/Testx86AssemblyInspectionEngine.TestDisassemblyMidFunctionEpilogues (553 of 1781)
PASS: lldb-api :: api/listeners/TestListener.py (554 of 1781)
PASS: lldb-unit :: Utility/./UtilityTests/StringExtractorTest.GetHexU8_InvalidHex_NoEof (555 of 1781)
PASS: lldb-unit :: ScriptInterpreter/Python/./ScriptInterpreterPythonTests/PythonExceptionStateTest.TestManualRestoreSemantics (556 of 1781)
PASS: lldb-api :: lang/cpp/template-function/TestTemplateFunctions.py (557 of 1781)
PASS: lldb-unit :: Utility/./UtilityTests/RangeTest.ContainsAddr (558 of 1781)
PASS: lldb-unit :: Utility/./UtilityTests/FileSpecTest.RemoveLastPathComponent (559 of 1781)
PASS: lldb-api :: macosx/find-app-in-bundle/TestFindAppInBundle.py (560 of 1781)
PASS: lldb-unit :: Utility/./UtilityTests/SerializationRountripTest.SerializeDeserializePod (561 of 1781)
PASS: lldb-shell :: Minidump/Windows/Sigsegv/sigsegv.test (562 of 1781)
PASS: lldb-api :: lang/c/find_struct_type/TestFindStructTypes.py (563 of 1781)
PASS: lldb-shell :: Minidump/Windows/find-module.test (564 of 1781)
PASS: lldb-api :: functionalities/tail_call_frames/disambiguate_tail_call_seq/TestDisambiguateTailCallSeq.py (565 of 1781)
PASS: lldb-unit :: Utility/./UtilityTests/LogChannelEnabledTest.LogVerboseThread (566 of 1781)
PASS: lldb-unit :: Utility/./UtilityTests/StringExtractorTest.GetHexU8_InvalidHex (567 of 1781)
PASS: lldb-api :: python_api/sbdata/TestSBData.py (568 of 1781)
PASS: lldb-api :: functionalities/postmortem/elf-core/TestLinuxCore.py (569 of 1781)
PASS: lldb-api :: functionalities/data-formatter/boolreference/TestFormattersBoolRefPtr.py (570 of 1781)
PASS: lldb-api :: commands/frame/diagnose/array/TestArray.py (571 of 1781)
PASS: lldb-api :: lang/cpp/llvm-style/TestLLVMStyle.py (572 of 1781)
PASS: lldb-api :: functionalities/ubsan/basic/TestUbsanBasic.py (573 of 1781)
PASS: lldb-api :: functionalities/signal/TestSendSignal.py (574 of 1781)
PASS: lldb-unit :: Host/./HostTests/FileSystemTest.Readable (575 of 1781)
PASS: lldb-unit :: Utility/./UtilityTests/SerializationRountripTest.SerializeDeserializeCString (576 of 1781)
UNSUPPORTED: lldb-api :: python_api/event/TestEvents.py (577 of 1781)
PASS: lldb-unit :: SymbolFile/DWARF/./SymbolFileDWARFTests/SymbolFileDWARFTests.TestAbbrevOrder1Start1 (578 of 1781)
PASS: lldb-unit :: debugserver/./debugserverTests/RNBSocket.LoopBackConnectIPv4 (579 of 1781)
PASS: lldb-unit :: Utility/./UtilityTests/StringExtractorTest.DecodeHexU8_Exact (580 of 1781)
PASS: lldb-api :: lang/cpp/nsimport/TestCppNsImport.py (581 of 1781)
PASS: lldb-shell :: SymbolFile/DWARF/find-method-local-struct.cpp (582 of 1781)
UNSUPPORTED: lldb-api :: arm/breakpoint-thumb-codesection/TestBreakpointThumbCodesection.py (583 of 1781)
PASS: lldb-api :: commands/expression/completion/TestExprCompletion.py (584 of 1781)
PASS: lldb-unit :: Utility/./UtilityTests/LogChannelTest.List (585 of 1781)
PASS: lldb-api :: commands/command/invalid-args/TestInvalidArgsCommand.py (586 of 1781)
PASS: lldb-unit :: Utility/./UtilityTests/StructuredDataTest.ParseJSONFromFile (587 of 1781)
PASS: lldb-unit :: Utility/./UtilityTests/StreamTest.PutBytesAsRawHex8ToBigEndian (588 of 1781)
PASS: lldb-unit :: Editline/./EditlineTests/EditlineTestFixture.EditlineReceivesSingleLineText (589 of 1781)
PASS: lldb-api :: api/command-return-object/TestSBCommandReturnObject.py (590 of 1781)
PASS: lldb-api :: sample_test/TestSampleTest.py (591 of 1781)
PASS: lldb-unit :: Utility/./UtilityTests/AnsiTerminal.Incomplete (592 of 1781)
PASS: lldb-unit :: Utility/./UtilityTests/StringListTest.InsertStringAtIndexMove (593 of 1781)
UNSUPPORTED: lldb-api :: functionalities/data-formatter/data-formatter-stl/libstdcpp/string/TestDataFormatterStdString.py (594 of 1781)
PASS: lldb-unit :: Utility/./UtilityTests/StringExtractorTest.GetHexU8_Extra_NoEof (595 of 1781)
PASS: lldb-shell :: ObjectFile/PECOFF/basic-info-arm.yaml (596 of 1781)
PASS: lldb-unit :: Utility/./UtilityTests/BinaryStreamTest.PutULEB128EightBytes (597 of 1781)
PASS: lldb-shell :: SymbolFile/DWARF/apple-index-is-used.cpp (598 of 1781)
PASS: lldb-api :: functionalities/inferior-assert/TestInferiorAssert.py (599 of 1781)
PASS: lldb-api :: lang/cpp/class_types/TestClassTypes.py (600 of 1781)
PASS: lldb-unit :: ObjectFile/PECOFF/./ObjectFilePECOFFTests/PECallFrameInfoTest.Frame_reg_eh (601 of 1781)
PASS: lldb-unit :: ScriptInterpreter/Python/./ScriptInterpreterPythonTests/PythonDataObjectsTest.TestObjectAttributes (602 of 1781)
PASS: lldb-api :: python_api/disassemble-raw-data/TestDisassembleRawData.py (603 of 1781)
UNSUPPORTED: lldb-api :: benchmarks/stepping/TestSteppingSpeed.py (604 of 1781)
PASS: lldb-unit :: Process/gdb-remote/./ProcessGdbRemoteTests/GDBRemoteCommunicationClientTest.GetModulesInfo (605 of 1781)
UNSUPPORTED: lldb-shell :: Register/x86-64-zmm-write.test (606 of 1781)
PASS: lldb-unit :: Utility/./UtilityTests/StreamTest.PutHex16ByteOrderLittle (607 of 1781)
PASS: lldb-unit :: Utility/./UtilityTests/ConstStringTest.NullAndEmptyStates (608 of 1781)
PASS: lldb-unit :: Target/./TargetTests/MemoryRegionInfoTest.Formatv (609 of 1781)
PASS: lldb-unit :: Utility/./UtilityTests/StringListTest.SetSize (610 of 1781)
PASS: lldb-unit :: Expression/./ExpressionTests/DiagnosticManagerTest.AppendMessageNoDiag (611 of 1781)
PASS: lldb-unit :: Utility/./UtilityTests/AnsiTerminal.Empty (612 of 1781)
PASS: lldb-unit :: UnwindAssembly/x86/./UnwindAssemblyx86Tests/Testx86AssemblyInspectionEngine.TestSimple32bitFrameFunction (613 of 1781)
PASS: lldb-api :: lang/cpp/function_refs/TestFunctionRefs.py (614 of 1781)
PASS: lldb-api :: functionalities/thread/concurrent_events/TestConcurrentTwoWatchpointsOneBreakpoint.py (615 of 1781)
PASS: lldb-unit :: SymbolFile/NativePDB/./SymbolFileNativePDBTests/PDBFPOProgramToDWARFExpressionTests.InvalidOpUnary (616 of 1781)
PASS: lldb-unit :: Utility/./UtilityTests/StatusTest.ErrorConstructor (617 of 1781)
PASS: lldb-unit :: Utility/./UtilityTests/ArgsTest.StringListConstructor (618 of 1781)
PASS: lldb-api :: macosx/safe-to-func-call/TestSafeFuncCalls.py (619 of 1781)
PASS: lldb-unit :: ObjectFile/ELF/./ObjectFileELFTests/ObjectFileELFTest.SectionsResolveConsistently (620 of 1781)
PASS: lldb-api :: functionalities/multiword-commands/TestMultiWordCommands.py (621 of 1781)
UNSUPPORTED: lldb-shell :: Register/x86-gp-write.test (622 of 1781)
PASS: lldb-api :: functionalities/breakpoint/dummy_target_breakpoints/TestBreakpointsWithNoTargets.py (623 of 1781)
UNSUPPORTED: lldb-api :: linux/thread/create_during_instruction_step/TestCreateDuringInstructionStep.py (624 of 1781)
UNSUPPORTED: lldb-shell :: BuildScript/toolchain-msvc.test (625 of 1781)
PASS: lldb-unit :: Utility/./UtilityTests/VMRange.SetEndAddress (626 of 1781)
PASS: lldb-unit :: Utility/./UtilityTests/StreamTeeTest.Flush (627 of 1781)
PASS: lldb-api :: functionalities/postmortem/netbsd-core/TestNetBSDCore.py (628 of 1781)
PASS: lldb-unit :: Utility/./UtilityTests/StringExtractorTest.DecodeHexU8_Underflow2 (629 of 1781)
UNSUPPORTED: lldb-api :: functionalities/breakpoint/breakpoint_in_delayslot/TestAvoidBreakpointInDelaySlot.py (630 of 1781)
PASS: lldb-unit :: ScriptInterpreter/Python/./ScriptInterpreterPythonTests/PythonDataObjectsTest.TestPythonTupleInitializerList2 (631 of 1781)
PASS: lldb-shell :: SymbolFile/NativePDB/nested-types.cpp (632 of 1781)
PASS: lldb-unit :: Host/./HostTests/SocketTest.TCPListen0GetPort (633 of 1781)
PASS: lldb-unit :: ObjectFile/ELF/./ObjectFileELFTests/ObjectFileELFTest.GetSymtab_NoSymEntryPointArmThumbAddressClass (634 of 1781)
PASS: lldb-api :: functionalities/data-formatter/data-formatter-proper-plurals/TestFormattersOneIsSingular.py (635 of 1781)
PASS: lldb-unit :: Process/minidump/./LLDBMinidumpTests/MinidumpParserTest.GetFilteredModuleList (636 of 1781)
PASS: lldb-api :: commands/expression/import-std-module/vector-basic/TestBasicVector.py (637 of 1781)
PASS: lldb-api :: commands/settings/TestSettings.py (638 of 1781)
PASS: lldb-unit :: Expression/./ExpressionTests/DiagnosticManagerTest.GetStringMultiline (639 of 1781)
PASS: lldb-unit :: Target/./TargetTests/PathMappingListTest.RelativeTests (640 of 1781)
PASS: lldb-unit :: Utility/./UtilityTests/DataExtractorTest.GetBitfield (641 of 1781)
PASS: lldb-unit :: Process/gdb-remote/./ProcessGdbRemoteTests/GDBRemoteCommunicationClientTest.SaveRestoreRegistersNoSuffix (642 of 1781)
PASS: lldb-unit :: Expression/./ExpressionTests/DiagnosticManagerTest.AppendMessageSubsequentDiags (643 of 1781)
PASS: lldb-api :: lang/c/shared_lib_stripped_symbols/TestSharedLibStrippedSymbols.py (644 of 1781)
PASS: lldb-api :: commands/frame/diagnose/dereference-this/TestDiagnoseDereferenceThis.py (645 of 1781)
PASS: lldb-api :: functionalities/data-formatter/data-formatter-objc/nsstring/TestDataFormatterNSString.py (646 of 1781)
PASS: lldb-unit :: Process/gdb-remote/./ProcessGdbRemoteTests/GDBRemoteClientBaseTest.SendContinueAndWait (647 of 1781)
PASS: lldb-unit :: Host/./HostTests/Host.WaitStatusFormat (648 of 1781)
PASS: lldb-api :: functionalities/modern-type-lookup/objc-modules/TestObjModulesModernTypeLookup.py (649 of 1781)
PASS: lldb-unit :: Utility/./UtilityTests/FileSpecTest.IsRelative (650 of 1781)
PASS: lldb-unit :: Process/minidump/./LLDBMinidumpTests/MinidumpParserTest.GetLinuxProcStatus (651 of 1781)
PASS: lldb-api :: macosx/lc-note/kern-ver-str/TestKernVerStrLCNOTE.py (652 of 1781)
PASS: lldb-unit :: Expression/./ExpressionTests/DiagnosticManagerTest.PutString (653 of 1781)
PASS: lldb-shell :: Quit/TestQuitExitCodeNonInt.test (654 of 1781)
UNSUPPORTED: lldb-api :: commands/expression/completion-crash2/TestCompletionCrash2.py (655 of 1781)
PASS: lldb-api :: functionalities/tail_call_frames/disambiguate_paths_to_common_sink/TestDisambiguatePathsToCommonSink.py (656 of 1781)
PASS: lldb-shell :: SymbolFile/DWARF/debug_rnglists.s (657 of 1781)
PASS: lldb-api :: functionalities/archives/TestBSDArchives.py (658 of 1781)
PASS: lldb-api :: functionalities/data-formatter/data-formatter-named-summaries/TestDataFormatterNamedSummaries.py (659 of 1781)
PASS: lldb-unit :: Utility/./UtilityTests/StringListTest.LongestCommonPrefixEmpty (660 of 1781)
PASS: lldb-api :: commands/watchpoints/watchpoint_set_command/TestWatchLocationWithWatchSet.py (661 of 1781)
PASS: lldb-unit :: UnwindAssembly/x86/./UnwindAssemblyx86Tests/Testx86AssemblyInspectionEngine.TestStackRealignMSVC_i386 (662 of 1781)
PASS: lldb-api :: functionalities/thread/concurrent_events/TestConcurrentCrashWithSignal.py (663 of 1781)
PASS: lldb-unit :: UnwindAssembly/x86/./UnwindAssemblyx86Tests/Testx86AssemblyInspectionEngine.TestDisassemblyJunkBytes (664 of 1781)
PASS: lldb-unit :: Signals/./SignalsTests/UnixSignalsTest.Iteration (665 of 1781)
PASS: lldb-shell :: SymbolFile/Breakpad/line-table-missing-file.test (666 of 1781)
UNSUPPORTED: lldb-api :: functionalities/data-formatter/data-formatter-stl/libstdcpp/vbool/TestDataFormatterStdVBool.py (667 of 1781)
PASS: lldb-unit :: Utility/./UtilityTests/BinaryStreamTest.PutSLEB128SixBytes (668 of 1781)
PASS: lldb-unit :: Utility/./UtilityTests/StringExtractorTest.GetNameColonValueNoColon (669 of 1781)
PASS: lldb-unit :: Symbol/./SymbolTests/DWARFCallFrameInfoTest.Basic_dwarf4 (670 of 1781)
PASS: lldb-api :: macosx/universal/TestUniversal.py (671 of 1781)
PASS: lldb-api :: lang/cpp/symbols/TestSymbols.py (672 of 1781)
PASS: lldb-unit :: Host/./HostTests/SocketTest.UDPConnect (673 of 1781)
PASS: lldb-unit :: Utility/./UtilityTests/ProcessInstanceInfo.DumpTable_invalidUID (674 of 1781)
PASS: lldb-unit :: Utility/./UtilityTests/FileSpecTest.EqualSeparator (675 of 1781)
PASS: lldb-api :: lang/objc/objc-super/TestObjCSuper.py (676 of 1781)
PASS: lldb-unit :: Process/gdb-remote/./ProcessGdbRemoteTests/GDBRemoteCommunicationClientTest.SyncThreadState (677 of 1781)
PASS: lldb-api :: lang/objc/unicode-string/TestUnicodeString.py (678 of 1781)
PASS: lldb-api :: lang/cpp/const_this/TestConstThis.py (679 of 1781)
PASS: lldb-api :: functionalities/gdb_remote_client/TestNestedRegDefinitions.py (680 of 1781)
PASS: lldb-unit :: ObjectFile/Breakpad/./ObjectFileBreakpadTests/FileRecord.parse (681 of 1781)
PASS: lldb-api :: functionalities/history/TestHistoryRecall.py (682 of 1781)
PASS: lldb-api :: lang/cpp/member-and-local-vars-with-same-name/TestMembersAndLocalsWithSameName.py (683 of 1781)
PASS: lldb-api :: lang/objc/objc-dyn-sbtype/TestObjCDynamicSBType.py (684 of 1781)
PASS: lldb-api :: commands/expression/anonymous-struct/TestCallUserAnonTypedef.py (685 of 1781)
UNSUPPORTED: lldb-shell :: Register/aarch64-gp-read.test (686 of 1781)
PASS: lldb-shell :: Driver/TestProcessAttach.test (687 of 1781)
PASS: lldb-api :: commands/process/launch-with-shellexpand/TestLaunchWithShellExpand.py (688 of 1781)
PASS: lldb-api :: lang/cpp/gmodules/TestWithModuleDebugging.py (689 of 1781)
PASS: lldb-unit :: Utility/./UtilityTests/BinaryStreamTest.PutSLEB128FiveBytes (690 of 1781)
PASS: lldb-unit :: ScriptInterpreter/Python/./ScriptInterpreterPythonTests/PythonDataObjectsTest.TestPythonByteArray (691 of 1781)
PASS: lldb-shell :: SymbolFile/Breakpad/line-table-edgecases.test (692 of 1781)
PASS: lldb-api :: python_api/lldbutil/frame/TestFrameUtils.py (693 of 1781)
UNSUPPORTED: lldb-api :: functionalities/breakpoint/hardware_breakpoints/hardware_breakpoint_on_multiple_threads/TestHWBreakMultiThread.py (694 of 1781)
PASS: lldb-api :: functionalities/breakpoint/breakpoint_conditions/TestBreakpointConditions.py (695 of 1781)
PASS: lldb-unit :: Utility/./UtilityTests/ArgsTest.TestInsertArg (696 of 1781)
PASS: lldb-shell :: BuildScript/script-args.test (697 of 1781)
PASS: lldb-unit :: Utility/./UtilityTests/StreamTeeTest.CopyConstructor (698 of 1781)
PASS: lldb-unit :: ScriptInterpreter/Python/./ScriptInterpreterPythonTests/PythonDataObjectsTest.TestModuleNameResolutionNoDot (699 of 1781)
PASS: lldb-unit :: Utility/./UtilityTests/StringListTest.AppendStringCString (700 of 1781)
PASS: lldb-shell :: SymbolFile/DWARF/forward-declarations.s (701 of 1781)
PASS: lldb-api :: commands/expression/import-std-module/sysroot/TestStdModuleSysroot.py (702 of 1781)
PASS: lldb-unit :: Utility/./UtilityTests/RegularExpression.Invalid (703 of 1781)
PASS: lldb-api :: lang/cpp/rvalue-references/TestRvalueReferences.py (704 of 1781)
PASS: lldb-api :: commands/frame/diagnose/virtual-method-call/TestDiagnoseDereferenceVirtualMethodCall.py (705 of 1781)
PASS: lldb-unit :: Utility/./UtilityTests/RangeTest.Union (706 of 1781)
PASS: lldb-api :: functionalities/data-formatter/data-formatter-stl/libcxx/multiset/TestDataFormatterLibcxxMultiSet.py (707 of 1781)
PASS: lldb-unit :: Utility/./UtilityTests/ProcessInstanceInfo.DumpTable (708 of 1781)
PASS: lldb-shell :: ObjectFile/PECOFF/sections-names.yaml (709 of 1781)
PASS: lldb-unit :: Utility/./UtilityTests/ArgsTest.AppendArguments (710 of 1781)
PASS: lldb-unit :: Language/Highlighting/./HighlighterTests/HighlighterTest.ClangCursorPosBeforeOtherToken (711 of 1781)
PASS: lldb-unit :: Host/./HostTests/FileSystemTest.MakeAbsolute (712 of 1781)
PASS: lldb-api :: commands/target/basic/TestTargetCommand.py (713 of 1781)
PASS: lldb-unit :: Process/gdb-remote/./ProcessGdbRemoteTests/GDBRemoteCommunicationClientTest.SendStopTracePacket (714 of 1781)
PASS: lldb-api :: python_api/sbvalue_persist/TestSBValuePersist.py (715 of 1781)
PASS: lldb-unit :: UnwindAssembly/x86/./UnwindAssemblyx86Tests/Testx86AssemblyInspectionEngine.TestPushEBX (716 of 1781)
UNSUPPORTED: lldb-api :: functionalities/thread/multi_break/TestMultipleBreakpoints.py (717 of 1781)
PASS: lldb-unit :: Utility/./UtilityTests/RangeTest.NotEqual (718 of 1781)
PASS: lldb-api :: functionalities/data-formatter/data-formatter-stl/libcxx/set/TestDataFormatterLibcxxSet.py (719 of 1781)
PASS: lldb-unit :: ScriptInterpreter/Python/./ScriptInterpreterPythonTests/PythonDataObjectsTest.TestPythonIntegerToStr (720 of 1781)
PASS: lldb-shell :: Breakpoint/debug_addrx.test (721 of 1781)
PASS: lldb-api :: functionalities/thread/concurrent_events/TestConcurrentDelayedCrashWithBreakpointWatchpoint.py (722 of 1781)
PASS: lldb-unit :: Utility/./UtilityTests/Flags.AllClear (723 of 1781)
PASS: lldb-api :: functionalities/data-formatter/data-formatter-objc/TestDataFormatterObjCCF.py (724 of 1781)
PASS: lldb-unit :: Utility/./UtilityTests/AnsiTerminal.WhiteSpace (725 of 1781)
PASS: lldb-shell :: Quit/TestQuitExitCode-30.test (726 of 1781)
PASS: lldb-unit :: Utility/./UtilityTests/BinaryStreamTest.PutSLEB128MaxValue (727 of 1781)
PASS: lldb-api :: functionalities/modern-type-lookup/basic/TestBasicModernTypeLookup.py (728 of 1781)
PASS: lldb-shell :: Driver/TestNoUseColor.test (729 of 1781)
PASS: lldb-unit :: ScriptInterpreter/Python/./ScriptInterpreterPythonTests/PythonDataObjectsTest.TestPythonTupleValues (730 of 1781)
PASS: lldb-unit :: Symbol/./SymbolTests/TestClangASTContext.TestRecordHasFields (731 of 1781)
PASS: lldb-api :: tools/lldb-server/TestGdbRemoteProcessInfo.py (732 of 1781)
UNSUPPORTED: lldb-shell :: Register/x86-gp-read.test (733 of 1781)
PASS: lldb-unit :: SymbolFile/NativePDB/./SymbolFileNativePDBTests/PDBFPOProgramToDWARFExpressionTests.MultipleDependentAssignments (734 of 1781)
PASS: lldb-api :: lang/c/inlines/TestRedefinitionsInInlines.py (735 of 1781)
PASS: lldb-api :: lang/objc/objc-builtin-types/TestObjCBuiltinTypes.py (736 of 1781)
PASS: lldb-unit :: UnwindAssembly/x86/./UnwindAssemblyx86Tests/Testx86AssemblyInspectionEngine.TestPopRBP (737 of 1781)
PASS: lldb-unit :: ScriptInterpreter/Python/./ScriptInterpreterPythonTests/PythonDataObjectsTest.TestPythonListManipulation (738 of 1781)
UNSUPPORTED: lldb-shell :: Register/x86-64-xmm16-read.test (739 of 1781)
PASS: lldb-api :: commands/watchpoints/multiple_threads/TestWatchpointMultipleThreads.py (740 of 1781)
PASS: lldb-unit :: SymbolFile/DWARF/./SymbolFileDWARFTests/SymbolFileDWARFTests.TestAbbrevMissingTerminator (741 of 1781)
PASS: lldb-unit :: Symbol/./SymbolTests/DWARFCallFrameInfoTest.Basic_eh (742 of 1781)
PASS: lldb-unit :: Utility/./UtilityTests/BinaryStreamTest.PutULEB128MaxValue (743 of 1781)
PASS: lldb-unit :: Host/./HostTests/MainLoopTest.ReadObject (744 of 1781)
PASS: lldb-api :: functionalities/gdb_remote_client/TestTargetXMLArch.py (745 of 1781)
UNSUPPORTED: lldb-api :: functionalities/thread/break_after_join/TestBreakAfterJoin.py (746 of 1781)
PASS: lldb-unit :: UnwindAssembly/x86/./UnwindAssemblyx86Tests/Testx86AssemblyInspectionEngine.TestSubRSP (747 of 1781)
PASS: lldb-api :: functionalities/data-formatter/data-formatter-synth/TestDataFormatterSynth.py (748 of 1781)
PASS: lldb-api :: functionalities/thread/concurrent_events/TestConcurrentSignalWatchBreak.py (749 of 1781)
PASS: lldb-unit :: Process/minidump/./LLDBMinidumpTests/MinidumpParserTest.GetMemory (750 of 1781)
PASS: lldb-unit :: Host/./HostTests/FileActionTest.Open (751 of 1781)
PASS: lldb-api :: functionalities/gdb_remote_client/TestThreadSelectionBug.py (752 of 1781)
PASS: lldb-unit :: SymbolFile/NativePDB/./SymbolFileNativePDBTests/PDBFPOProgramToDWARFExpressionTests.UnknownOp (753 of 1781)
PASS: lldb-shell :: ObjectFile/ELF/section-permissions.yaml (754 of 1781)
PASS: lldb-unit :: UnwindAssembly/x86/./UnwindAssemblyx86Tests/Testx86AssemblyInspectionEngine.TestAddRSP (755 of 1781)
PASS: lldb-unit :: Utility/./UtilityTests/VMRange.ContainsRange (756 of 1781)
PASS: lldb-api :: python_api/function_symbol/TestDisasmAPI.py (757 of 1781)
PASS: lldb-api :: types/TestIntegerTypes.py (758 of 1781)
PASS: lldb-api :: functionalities/rerun/TestRerun.py (759 of 1781)
PASS: lldb-unit :: Utility/./UtilityTests/UUIDTest.SetFromStringRef (760 of 1781)
PASS: lldb-api :: functionalities/breakpoint/source_regexp/TestSourceRegexBreakpoints.py (761 of 1781)
PASS: lldb-api :: tools/lldb-server/TestGdbRemoteKill.py (762 of 1781)
PASS: lldb-unit :: Expression/./ExpressionTests/CppModuleConfigurationTest.Sysroot (763 of 1781)
PASS: lldb-api :: functionalities/data-formatter/nsarraysynth/TestNSArraySynthetic.py (764 of 1781)
UNSUPPORTED: lldb-api :: tools/lldb-vscode/breakpoint/TestVSCode_setExceptionBreakpoints.py (765 of 1781)
PASS: lldb-api :: lang/objc/rdar-10967107/TestRdar10967107.py (766 of 1781)
PASS: lldb-api :: lang/c/forward/TestForwardDeclaration.py (767 of 1781)
PASS: lldb-shell :: Driver/LocalLLDBInit.test (768 of 1781)
PASS: lldb-unit :: Utility/./UtilityTests/StringLexerTest.HasAtLeast (769 of 1781)
PASS: lldb-api :: commands/watchpoints/watchpoint_commands/command/TestWatchpointCommandLLDB.py (770 of 1781)
UNSUPPORTED: lldb-api :: functionalities/data-formatter/data-formatter-stl/libstdcpp/map/TestDataFormatterStdMap.py (771 of 1781)
PASS: lldb-unit :: Host/./HostTests/SocketAddressTest.GetAddressInfo (772 of 1781)
PASS: lldb-api :: functionalities/tail_call_frames/unambiguous_sequence/TestUnambiguousTailCalls.py (773 of 1781)
PASS: lldb-unit :: Utility/./UtilityTests/StringExtractorTest.GetU32LittleEndian (774 of 1781)
PASS: lldb-api :: functionalities/gdb_remote_client/TestPlatformClient.py (775 of 1781)
PASS: lldb-api :: functionalities/thread/concurrent_events/TestConcurrentWatchBreak.py (776 of 1781)
PASS: lldb-api :: functionalities/inferior-crashing/recursive-inferior/TestRecursiveInferiorStep.py (777 of 1781)
PASS: lldb-api :: lang/objc/objc-foundation-dictionary-empty/TestNSDictionary0.py (778 of 1781)
PASS: lldb-unit :: Utility/./UtilityTests/UserIDResolver.GetUserName (779 of 1781)
PASS: lldb-api :: functionalities/ubsan/user-expression/TestUbsanUserExpression.py (780 of 1781)
PASS: lldb-unit :: UnwindAssembly/x86/./UnwindAssemblyx86Tests/Testx86AssemblyInspectionEngine.TestLEAVE (781 of 1781)
PASS: lldb-unit :: Utility/./UtilityTests/SerializationRountripTest.SerializeDeserializeObjectPointer (782 of 1781)
PASS: lldb-api :: commands/expression/call-function/TestCallStopAndContinue.py (783 of 1781)
PASS: lldb-unit :: Utility/./UtilityTests/CompletionRequest.TryCompleteCurrentArgBad (784 of 1781)
UNSUPPORTED: lldb-shell :: Register/x86-64-ymm16-read.test (785 of 1781)
PASS: lldb-unit :: Target/./TargetTests/ModuleCacheTest.GetAndPut (786 of 1781)
PASS: lldb-unit :: Utility/./UtilityTests/StreamTest.PutBytesAsRawHex8ToLittleEndian (787 of 1781)
PASS: lldb-unit :: Utility/./UtilityTests/ScalarTest.Scalar_512 (788 of 1781)
PASS: lldb-shell :: Reproducer/Functionalities/TestImageList.test (789 of 1781)
PASS: lldb-unit :: Utility/./UtilityTests/ProcessInstanceInfo.Dump (790 of 1781)
PASS: lldb-api :: commands/watchpoints/watchpoint_commands/condition/TestWatchpointConditionCmd.py (791 of 1781)
PASS: lldb-api :: functionalities/data-formatter/data-formatter-objc/TestDataFormatterObjCPlain.py (792 of 1781)
UNSUPPORTED: lldb-api :: commands/watchpoints/hello_watchlocation/TestWatchLocation.py (793 of 1781)
PASS: lldb-unit :: Process/minidump/./LLDBMinidumpTests/MinidumpParserTest.GetMemoryRegionInfoFromMemory64List (794 of 1781)
PASS: lldb-api :: functionalities/breakpoint/scripted_bkpt/TestScriptedResolver.py (795 of 1781)
PASS: lldb-api :: terminal/TestSTTYBeforeAndAfter.py (796 of 1781)
PASS: lldb-unit :: Utility/./UtilityTests/RangeTest.ContainsEndInclusive (797 of 1781)
PASS: lldb-unit :: Utility/./UtilityTests/TimerTest.CategoryTimesStats (798 of 1781)
PASS: lldb-unit :: Utility/./UtilityTests/OptionsWithRawTest.EmptyArgsOnlySuffix (799 of 1781)
PASS: lldb-unit :: Utility/./UtilityTests/UriParserTest.SchemeHostSeparator3 (800 of 1781)
PASS: lldb-unit :: Utility/./UtilityTests/DataExtractorTest.GetCStr (801 of 1781)
PASS: lldb-unit :: Process/gdb-remote/./ProcessGdbRemoteTests/GDBRemoteClientBaseTest.SendContinueAndInterrupt2PacketBug (802 of 1781)
PASS: lldb-api :: lang/objc/objc-property/TestObjCProperty.py (803 of 1781)
PASS: lldb-unit :: Utility/./UtilityTests/UriParserTest.BracketedHostnameWithColon (804 of 1781)
PASS: lldb-unit :: Utility/./UtilityTests/LogChannelEnabledTest.log_options (805 of 1781)
PASS: lldb-unit :: ScriptInterpreter/Python/./ScriptInterpreterPythonTests/PythonDataObjectsTest.TestPythonDictionaryValueEquality (806 of 1781)
PASS: lldb-shell :: ObjectFile/ELF/PT_LOAD-empty.yaml (807 of 1781)
PASS: lldb-unit :: Utility/./UtilityTests/LogTest.LLDB_LOG_nullptr (808 of 1781)
PASS: lldb-api :: functionalities/thread/backtrace_all/TestBacktraceAll.py (809 of 1781)
PASS: lldb-unit :: Utility/./UtilityTests/ArgsTest.ReplaceArgumentAtIndexFarOutOfRange (810 of 1781)
PASS: lldb-unit :: Utility/./UtilityTests/OptionsWithRawTest.ArgsButNoDelimiter (811 of 1781)
PASS: lldb-unit :: Process/minidump/./LLDBMinidumpTests/MinidumpParserTest.GetThreadContext_x86_32_wow64 (812 of 1781)
PASS: lldb-unit :: Utility/./UtilityTests/StringLexerTest.Next (813 of 1781)
PASS: lldb-shell :: SymbolFile/DWARF/debug-types-dwarf5.s (814 of 1781)
PASS: lldb-unit :: Utility/./UtilityTests/RangeTest.DoesIntersect (815 of 1781)
PASS: lldb-shell :: Unwind/trap_frame_sym_ctx.test (816 of 1781)
PASS: lldb-unit :: UnwindAssembly/x86/./UnwindAssemblyx86Tests/Testx86AssemblyInspectionEngine.TestCALLNextInsn (817 of 1781)
PASS: lldb-api :: functionalities/data-formatter/data-formatter-stl/libcxx/atomic/TestLibCxxAtomic.py (818 of 1781)
PASS: lldb-unit :: Utility/./UtilityTests/BinaryStreamTest.PutULEB128TwoBytes (819 of 1781)
PASS: lldb-unit :: Utility/./UtilityTests/ArgsTest.TestOverwriteArgs (820 of 1781)
PASS: lldb-unit :: Process/minidump/./LLDBMinidumpTests/MinidumpParserTest.GetThreadsAndGetThreadContext (821 of 1781)
PASS: lldb-api :: commands/expression/formatters/TestFormatters.py (822 of 1781)
UNSUPPORTED: lldb-shell :: SymbolFile/NativePDB/ast-functions-msvc.cpp (823 of 1781)
PASS: lldb-api :: commands/disassemble/basic/TestFrameDisassemble.py (824 of 1781)
PASS: lldb-api :: lang/cpp/dynamic-value-same-basename/TestDynamicValueSameBase.py (825 of 1781)
PASS: lldb-api :: commands/target/create-deps/TestTargetCreateDeps.py (826 of 1781)
PASS: lldb-unit :: Core/./LLDBCoreTests/RichManglingContextTest.Basic (827 of 1781)
PASS: lldb-shell :: SymbolFile/NativePDB/bitfields.cpp (828 of 1781)
PASS: lldb-unit :: Utility/./UtilityTests/Flags.Clear (829 of 1781)
PASS: lldb-unit :: Interpreter/./InterpreterTests/OptionArgParserTest.toScriptLanguage (830 of 1781)
PASS: lldb-unit :: Utility/./UtilityTests/ScalarTest.Comparison (831 of 1781)
PASS: lldb-unit :: ScriptInterpreter/Python/./ScriptInterpreterPythonTests/PythonDataObjectsTest.TestPythonTupleToStructuredList (832 of 1781)
PASS: lldb-unit :: Utility/./UtilityTests/UriParserTest.LongPath (833 of 1781)
PASS: lldb-api :: lang/objc/radar-9691614/TestObjCMethodReturningBOOL.py (834 of 1781)
PASS: lldb-unit :: Process/minidump/./LLDBMinidumpTests/MinidumpParserTest.GetExceptionStream (835 of 1781)
PASS: lldb-api :: lang/cpp/trivial_abi/TestTrivialABI.py (836 of 1781)
PASS: lldb-api :: functionalities/param_entry_vals/basic_entry_values_x86_64/TestBasicEntryValuesX86_64.py (837 of 1781)
PASS: lldb-unit :: UnwindAssembly/x86/./UnwindAssemblyx86Tests/Testx86AssemblyInspectionEngine.TestSubESP (838 of 1781)
PASS: lldb-api :: functionalities/thread/concurrent_events/TestConcurrentSignalBreak.py (839 of 1781)
PASS: lldb-api :: functionalities/data-formatter/data-formatter-stl/libcxx/queue/TestDataFormatterLibcxxQueue.py (840 of 1781)
PASS: lldb-unit :: Host/./HostTests/HostInfoTest.GetAugmentedArchSpec (841 of 1781)
PASS: lldb-shell :: SymbolFile/NativePDB/ast-methods.cpp (842 of 1781)
PASS: lldb-unit :: Utility/./UtilityTests/CompletionRequest.DuplicateFiltering (843 of 1781)
PASS: lldb-unit :: Process/gdb-remote/./ProcessGdbRemoteTests/GDBRemoteCommunicationClientTest.GetMemoryRegionInfoInvalidResponse (844 of 1781)
PASS: lldb-api :: functionalities/data-formatter/data-formatter-stl/libcxx/unordered/TestDataFormatterUnordered.py (845 of 1781)
UNSUPPORTED: lldb-shell :: SymbolFile/PDB/compilands.test (846 of 1781)
PASS: lldb-api :: python_api/module_section/TestModuleAndSection.py (847 of 1781)
PASS: lldb-shell :: ObjectFile/ELF/compressed-sections.yaml (848 of 1781)
PASS: lldb-unit :: Language/CPlusPlus/./LanguageCPlusPlusTests/CPlusPlusLanguage.MethodNameParsing (849 of 1781)
UNSUPPORTED: lldb-shell :: SymbolFile/PDB/func-symbols.test (850 of 1781)
PASS: lldb-unit :: Utility/./UtilityTests/ArgsTest.TestAppendArg (851 of 1781)
PASS: lldb-unit :: Utility/./UtilityTests/UUIDTest.StringConverion (852 of 1781)
UNSUPPORTED: lldb-api :: benchmarks/continue/TestBenchmarkContinue.py (853 of 1781)
PASS: lldb-unit :: Utility/./UtilityTests/BinaryStreamTest.PutULEB128Zero (854 of 1781)
PASS: lldb-api :: commands/expression/import_builtin_fileid/TestImportBuiltinFileID.py (855 of 1781)
PASS: lldb-api :: functionalities/breakpoint/breakpoint_command/TestBreakpointCommandsFromPython.py (856 of 1781)
PASS: lldb-unit :: Utility/./UtilityTests/ProcessInfoTest.Constructor (857 of 1781)
UNSUPPORTED: lldb-shell :: SymbolFile/target-symbols-add-unwind.test (858 of 1781)
PASS: lldb-shell :: Settings/TestSettingsSet.test (859 of 1781)
PASS: lldb-unit :: Utility/./UtilityTests/StreamTest.PutHex8 (860 of 1781)
PASS: lldb-api :: lang/cpp/breakpoint_in_member_func_w_non_primitive_params/TestBreakpointInMemberFuncWNonPrimitiveParams.py (861 of 1781)
PASS: lldb-api :: functionalities/breakpoint/address_breakpoints/TestBadAddressBreakpoints.py (862 of 1781)
PASS: lldb-api :: functionalities/postmortem/minidump-new/TestMiniDumpUUID.py (863 of 1781)
PASS: lldb-unit :: Expression/./ExpressionTests/DiagnosticManagerTest.PutStringMultiple (864 of 1781)
PASS: lldb-unit :: Utility/./UtilityTests/ArgsTest.TestMultipleArgs (865 of 1781)
PASS: lldb-unit :: Utility/./UtilityTests/StringListTest.AppendStringStdString (866 of 1781)
PASS: lldb-unit :: Utility/./UtilityTests/StringListTest.ForRange (867 of 1781)
PASS: lldb-unit :: debugserver/./debugserverTests/RNBSocket.LoopBackConnectIPv6 (868 of 1781)
PASS: lldb-unit :: Utility/./UtilityTests/OptionsWithRawTest.TerminatedQuote (869 of 1781)
PASS: lldb-api :: functionalities/completion/TestCompletion.py (870 of 1781)
PASS: lldb-api :: lang/mixed/TestMixedLanguages.py (871 of 1781)
PASS: lldb-api :: commands/process/attach/attach_denied/TestAttachDenied.py (872 of 1781)
PASS: lldb-unit :: Utility/./UtilityTests/OptionsWithRawTest.WhitespaceInput (873 of 1781)
PASS: lldb-shell :: SymbolFile/NativePDB/tag-types.cpp (874 of 1781)
PASS: lldb-api :: functionalities/postmortem/elf-core/thread_crash/TestLinuxCoreThreads.py (875 of 1781)
PASS: lldb-api :: commands/expression/save_jit_objects/TestSaveJITObjects.py (876 of 1781)
PASS: lldb-api :: lang/cpp/char8_t/TestCxxChar8_t.py (877 of 1781)
PASS: lldb-shell :: SymbolFile/DWARF/dwarf5_locations.s (878 of 1781)
PASS: lldb-unit :: Utility/./UtilityTests/RangeTest.Clear (879 of 1781)
PASS: lldb-shell :: Commands/command-regex-unalias.test (880 of 1781)
PASS: lldb-unit :: Process/minidump/./LLDBMinidumpTests/MinidumpParserTest.GetPidWow64 (881 of 1781)
PASS: lldb-shell :: BuildScript/modes.test (882 of 1781)
PASS: lldb-unit :: Utility/./UtilityTests/StringListTest.InsertStringAtIndexOutOfBounds (883 of 1781)
PASS: lldb-shell :: Reproducer/TestReuseDirectory.test (884 of 1781)
PASS: lldb-api :: functionalities/object-file/TestImageListMultiArchitecture.py (885 of 1781)
PASS: lldb-unit :: Utility/./UtilityTests/ConstStringTest.format_provider (886 of 1781)
PASS: lldb-unit :: debugserver/./debugserverTests/RNBSocket.LoopBackListenIPv4 (887 of 1781)
PASS: lldb-unit :: Utility/./UtilityTests/OptionsWithRawTest.SingleWhitespaceInput (888 of 1781)
PASS: lldb-api :: functionalities/thread/concurrent_events/TestConcurrentSignalNWatchNBreak.py (889 of 1781)
PASS: lldb-api :: functionalities/testid/TestTestId.py (890 of 1781)
UNSUPPORTED: lldb-api :: tools/lldb-server/TestGdbRemoteModuleInfo.py (891 of 1781)
PASS: lldb-unit :: Utility/./UtilityTests/VMRange.Comparison (892 of 1781)
UNSUPPORTED: lldb-shell :: SymbolFile/PDB/function-level-linking.test (893 of 1781)
PASS: lldb-shell :: SymbolFile/DWARF/debug_ranges.s (894 of 1781)
PASS: lldb-unit :: Utility/./UtilityTests/StreamTest.PutSLEB128 (895 of 1781)
PASS: lldb-api :: functionalities/tail_call_frames/thread_step_out_message/TestArtificialFrameStepOutMessage.py (896 of 1781)
PASS: lldb-unit :: Utility/./UtilityTests/ArchSpecTest.MergeFrom (897 of 1781)
PASS: lldb-unit :: UnwindAssembly/x86/./UnwindAssemblyx86Tests/Testx86AssemblyInspectionEngine.TestSpArithx86_64Augmented (898 of 1781)
PASS: lldb-api :: functionalities/tsan/basic/TestTsanBasic.py (899 of 1781)
UNSUPPORTED: lldb-api :: benchmarks/libcxxmap/TestBenchmarkLibcxxMap.py (900 of 1781)
PASS: lldb-unit :: Utility/./UtilityTests/RangeTest.SizeTypes (901 of 1781)
PASS: lldb-api :: functionalities/unwind/noreturn/TestNoreturnUnwind.py (902 of 1781)
PASS: lldb-api :: lang/c/register_variables/TestRegisterVariables.py (903 of 1781)
PASS: lldb-api :: api/check_public_api_headers/TestPublicAPIHeaders.py (904 of 1781)
PASS: lldb-api :: functionalities/thread/concurrent_events/TestConcurrentDelayedCrashWithBreakpointSignal.py (905 of 1781)
PASS: lldb-api :: commands/expression/import-std-module/shared_ptr/TestSharedPtr.py (906 of 1781)
PASS: lldb-shell :: SymbolFile/DWARF/debug-names-compressed.cpp (907 of 1781)
PASS: lldb-shell :: Reproducer/TestSynchronous.test (908 of 1781)
PASS: lldb-shell :: SymbolFile/DWARF/find-method.cpp (909 of 1781)
PASS: lldb-unit :: Utility/./UtilityTests/VMRange.Clear (910 of 1781)
PASS: lldb-unit :: Host/./HostTests/HostInfoTest.GetHostname (911 of 1781)
PASS: lldb-unit :: Utility/./UtilityTests/RangeTest.DoesAdjoinOrIntersect (912 of 1781)
PASS: lldb-unit :: Process/gdb-remote/./ProcessGdbRemoteTests/GDBRemoteClientBaseTest.SendContinueAndAsyncSignal (913 of 1781)
UNSUPPORTED: lldb-api :: functionalities/thread/state/TestThreadStates.py (914 of 1781)
PASS: lldb-api :: lang/c/tls_globals/TestTlsGlobals.py (915 of 1781)
PASS: lldb-unit :: Expression/./ExpressionTests/CppModuleConfigurationTest.Linux (916 of 1781)
PASS: lldb-api :: commands/expression/radar_9531204/TestPrintfAfterUp.py (917 of 1781)
PASS: lldb-unit :: Language/Highlighting/./HighlighterTests/HighlighterTest.ClangIdentifiers (918 of 1781)
PASS: lldb-unit :: Utility/./UtilityTests/OptionsWithRawTest.LeadingSpaceArgs (919 of 1781)
PASS: lldb-api :: tools/lldb-server/TestAppleSimulatorOSType.py (920 of 1781)
PASS: lldb-unit :: Utility/./UtilityTests/StringExtractorTest.GetHexBytesAvail_OddPair2 (921 of 1781)
PASS: lldb-unit :: Expression/./ExpressionTests/CppModuleConfigurationTest.AmbiguousCLib (922 of 1781)
PASS: lldb-api :: functionalities/data-formatter/summary-string-onfail/Test-rdar-9974002.py (923 of 1781)
PASS: lldb-api :: functionalities/thread/exit_during_step/TestExitDuringStep.py (924 of 1781)
UNSUPPORTED: lldb-shell :: SymbolFile/DWARF/debug-types-expressions.test (925 of 1781)
PASS: lldb-unit :: SymbolFile/DWARF/./SymbolFileDWARFTests/DWARFASTParserClangTests.EnsureAllDIEsInDeclContextHaveBeenParsedParsesOnlyMatchingEntries (926 of 1781)
PASS: lldb-unit :: Utility/./UtilityTests/ArgsTest.BareSingleQuote (927 of 1781)
PASS: lldb-api :: lang/cpp/std-function-step-into-callable/TestStdFunctionStepIntoCallable.py (928 of 1781)
PASS: lldb-api :: commands/statistics/basic/TestStats.py (929 of 1781)
PASS: lldb-api :: functionalities/data-formatter/parray/TestPrintArray.py (930 of 1781)
PASS: lldb-unit :: Utility/./UtilityTests/BinaryStreamTest.PutULEB128OneByte (931 of 1781)
PASS: lldb-shell :: Settings/TestModuleCacheSanity.test (932 of 1781)
UNSUPPORTED: lldb-api :: android/platform/TestDefaultCacheLineSize.py (933 of 1781)
PASS: lldb-unit :: Core/./LLDBCoreTests/RichManglingContextTest.SwitchProvider (934 of 1781)
PASS: lldb-unit :: Expression/./ExpressionTests/CppModuleConfigurationTest.LibCppV2 (935 of 1781)
PASS: lldb-unit :: Process/gdb-remote/./ProcessGdbRemoteTests/GDBRemoteClientBaseTest.SendContinueAndLateInterrupt (936 of 1781)
PASS: lldb-unit :: Utility/./UtilityTests/StreamTeeTest.GetStreamAtIndexOutOfBoundsEmpty (937 of 1781)
PASS: lldb-api :: functionalities/data-formatter/dump_dynamic/TestDumpDynamic.py (938 of 1781)
PASS: lldb-unit :: tools/lldb-server/tests/./LLDBServerTests/TestBase.LaunchModePreservesEnvironment (939 of 1781)
PASS: lldb-unit :: Utility/./UtilityTests/TimeoutTest.Format (940 of 1781)
PASS: lldb-api :: functionalities/data-formatter/data-formatter-synthval/TestDataFormatterSynthVal.py (941 of 1781)
UNSUPPORTED: lldb-shell :: Register/x86-ymm-write.test (942 of 1781)
PASS: lldb-unit :: Utility/./UtilityTests/StringListTest.Clear (943 of 1781)
UNSUPPORTED: lldb-shell :: Register/x86-64-gp-write.test (944 of 1781)
PASS: lldb-api :: lang/cpp/frame-var-anon-unions/TestFrameVariableAnonymousUnions.py (945 of 1781)
PASS: lldb-unit :: UnwindAssembly/x86/./UnwindAssemblyx86Tests/Testx86AssemblyInspectionEngine.TestStackRealign32BitDisp_x86_64 (946 of 1781)
PASS: lldb-shell :: ObjectFile/MachO/lc_build_version_notools.yaml (947 of 1781)
PASS: lldb-unit :: Utility/./UtilityTests/StringListTest.ShiftCString (948 of 1781)
PASS: lldb-api :: functionalities/postmortem/wow64_minidump/TestWow64MiniDump.py (949 of 1781)
PASS: lldb-api :: functionalities/data-formatter/data-formatter-objc/TestDataFormatterObjCNSURL.py (950 of 1781)
PASS: lldb-unit :: Utility/./UtilityTests/AnsiTerminal.AtEnd (951 of 1781)
PASS: lldb-api :: commands/command/nested_alias/TestNestedAlias.py (952 of 1781)
PASS: lldb-shell :: ObjectFile/ELF/PT_LOAD-overlap-PT_TLS.yaml (953 of 1781)
PASS: lldb-shell :: ObjectFile/ELF/section-addresses.yaml (954 of 1781)
PASS: lldb-unit :: Utility/./UtilityTests/RangeTest.ContainsAddrInvalid (955 of 1781)
PASS: lldb-unit :: Expression/./ExpressionTests/DiagnosticManagerTest.GetStringPreserveOrder (956 of 1781)
PASS: lldb-unit :: Utility/./UtilityTests/LogChannelTest.Disable (957 of 1781)
PASS: lldb-unit :: Process/gdb-remote/./ProcessGdbRemoteTests/GDBRemoteCommunicationServerTest.SendErrorResponse_ErrorNumber (958 of 1781)
PASS: lldb-api :: functionalities/tsan/global_location/TestTsanGlobalLocation.py (959 of 1781)
PASS: lldb-api :: functionalities/thread/concurrent_events/TestConcurrentTwoBreakpointsOneSignal.py (960 of 1781)
PASS: lldb-shell :: Minidump/breakpad-symbols.test (961 of 1781)
PASS: lldb-api :: functionalities/thread/concurrent_events/TestConcurrentTwoWatchpointThreads.py (962 of 1781)
PASS: lldb-api :: lang/objc/objc-ivar-protocols/TestIvarProtocols.py (963 of 1781)
PASS: lldb-unit :: Utility/./UtilityTests/OptionsWithRawTest.UnterminatedQuote (964 of 1781)
PASS: lldb-api :: functionalities/inferior-crashing/TestInferiorCrashing.py (965 of 1781)
PASS: lldb-unit :: Utility/./UtilityTests/StreamTest.PutCString (966 of 1781)
UNSUPPORTED: lldb-api :: python_api/disassemble-raw-data/TestDisassemble_VST1_64.py (967 of 1781)
PASS: lldb-unit :: Utility/./UtilityTests/LogChannelTest.Enable (968 of 1781)
PASS: lldb-api :: commands/command/delete/TestCommandDelete.py (969 of 1781)
PASS: lldb-unit :: Process/minidump/./LLDBMinidumpTests/MinidumpParserTest.InvalidMinidump (970 of 1781)
PASS: lldb-unit :: Host/./HostTests/File.GetWaitableHandleFileno (971 of 1781)
PASS: lldb-unit :: Utility/./UtilityTests/CompletionRequest.ShiftArguments (972 of 1781)
PASS: lldb-shell :: SymbolFile/DWARF/childless-compile-unit.s (973 of 1781)
PASS: lldb-unit :: Symbol/./SymbolTests/PostfixExpression.ParseOneExpression (974 of 1781)
PASS: lldb-unit :: Utility/./UtilityTests/ScalarTest.ComparisonFloat (975 of 1781)
PASS: lldb-api :: functionalities/thread/thread_specific_break/TestThreadSpecificBreakpoint.py (976 of 1781)
PASS: lldb-unit :: Utility/./UtilityTests/StreamTeeTest.Constructor1Stream (977 of 1781)
PASS: lldb-api :: functionalities/data-formatter/data-formatter-synthtype/TestDataFormatterSynthType.py (978 of 1781)
PASS: lldb-unit :: ObjectFile/Breakpad/./ObjectFileBreakpadTests/Record.classify (979 of 1781)
PASS: lldb-unit :: Target/./TargetTests/ModuleCacheTest.GetAndPutUuidExists (980 of 1781)
PASS: lldb-unit :: Expression/./ExpressionTests/DiagnosticManagerTest.AppendMessageAttachToLastDiag (981 of 1781)
PASS: lldb-unit :: Utility/./UtilityTests/StreamTeeTest.Constructor2Streams (982 of 1781)
PASS: lldb-api :: functionalities/type_completion/TestTypeCompletion.py (983 of 1781)
PASS: lldb-unit :: Process/minidump/./LLDBMinidumpTests/MinidumpParserTest.GetPidWindows (984 of 1781)
PASS: lldb-api :: lang/c/step-target/TestStepTarget.py (985 of 1781)
PASS: lldb-api :: functionalities/tsan/thread_numbers/TestTsanThreadNumbers.py (986 of 1781)
PASS: lldb-api :: functionalities/data-formatter/nsdictionarysynth/TestNSDictionarySynthetic.py (987 of 1781)
PASS: lldb-unit :: Utility/./UtilityTests/RangeTest.Slide (988 of 1781)
PASS: lldb-unit :: Utility/./UtilityTests/FileSpecTest.GuessPathStyle (989 of 1781)
PASS: lldb-unit :: ScriptInterpreter/Python/./ScriptInterpreterPythonTests/PythonExceptionStateTest.TestAutoRestoreSemantics (990 of 1781)
UNSUPPORTED: lldb-shell :: ExecControl/StopHook/stop-hook-threads.test (991 of 1781)
PASS: lldb-api :: functionalities/data-formatter/data-formatter-categories/TestDataFormatterCategories.py (992 of 1781)
PASS: lldb-unit :: Host/./HostTests/SocketTest.DomainListenConnectAccept (993 of 1781)
UNSUPPORTED: lldb-api :: commands/expression/macros/TestMacros.py (994 of 1781)
PASS: lldb-unit :: Expression/./ExpressionTests/DiagnosticManagerTest.GetStringNoDiags (995 of 1781)
PASS: lldb-unit :: Utility/./UtilityTests/DataExtractorTest.GetMaxU64 (996 of 1781)
PASS: lldb-api :: functionalities/breakpoint/breakpoint_by_line_and_column/TestBreakpointByLineAndColumn.py (997 of 1781)
PASS: lldb-unit :: Utility/./UtilityTests/StringListTest.JoinEmpty (998 of 1781)
PASS: lldb-shell :: Breakpoint/jitbp_elf.test (999 of 1781)
PASS: lldb-unit :: Utility/./UtilityTests/RangeTest.ContainsEndInclusiveInvalid (1000 of 1781)
PASS: lldb-unit :: Interpreter/./InterpreterTests/CompletionTest.FileCompletionAbsolute (1001 of 1781)
PASS: lldb-unit :: Host/./HostTests/MainLoopTest.Signal (1002 of 1781)
PASS: lldb-unit :: UnwindAssembly/x86/./UnwindAssemblyx86Tests/Testx86AssemblyInspectionEngine.TestPushESI (1003 of 1781)
PASS: lldb-unit :: ScriptInterpreter/Python/./ScriptInterpreterPythonTests/PythonDataObjectsTest.TestPythonBoolean (1004 of 1781)
PASS: lldb-shell :: BuildScript/compiler-full-path.test (1005 of 1781)
PASS: lldb-unit :: Signals/./SignalsTests/UnixSignalsTest.VersionChange (1006 of 1781)
PASS: lldb-unit :: Utility/./UtilityTests/StringListTest.JoinSingle (1007 of 1781)
PASS: lldb-unit :: Utility/./UtilityTests/OptionsWithRawTest.EmptySuffixSingleWhitespace (1008 of 1781)
PASS: lldb-api :: commands/expression/namespace_local_var_same_name_cpp_and_c/TestNamespaceLocalVarSameNameCppAndC.py (1009 of 1781)
PASS: lldb-api :: functionalities/breakpoint/move_nearest/TestMoveNearest.py (1010 of 1781)
PASS: lldb-unit :: Utility/./UtilityTests/StreamTest.PutNHex8 (1011 of 1781)
PASS: lldb-unit :: UnwindAssembly/x86/./UnwindAssemblyx86Tests/Testx86AssemblyInspectionEngine.TestPushR15 (1012 of 1781)
PASS: lldb-shell :: Reproducer/Modules/TestModuleCXX.test (1013 of 1781)
PASS: lldb-api :: lang/cpp/virtual/TestVirtual.py (1014 of 1781)
PASS: lldb-shell :: SymbolFile/NativePDB/globals-bss.cpp (1015 of 1781)
PASS: lldb-api :: lang/c/local_types/TestUseClosestType.py (1016 of 1781)
PASS: lldb-shell :: SymbolFile/NativePDB/function-types-classes.cpp (1017 of 1781)
PASS: lldb-api :: lang/objc/objc-struct-argument/TestObjCStructArgument.py (1018 of 1781)
PASS: lldb-shell :: SymbolFile/DWARF/debug-types-dwo-cross-reference.cpp (1019 of 1781)
PASS: lldb-unit :: Utility/./UtilityTests/StructuredDataTest.StringDump (1020 of 1781)
PASS: lldb-api :: python_api/frame/inlines/TestInlinedFrame.py (1021 of 1781)
UNSUPPORTED: lldb-api :: functionalities/darwin_log/format/TestDarwinLogMessageFormat.py (1022 of 1781)
PASS: lldb-unit :: Process/gdb-remote/./ProcessGdbRemoteTests/GDBRemoteClientBaseTest.SendPacketAndReceiveResponseWithOutputSupport (1023 of 1781)
PASS: lldb-api :: commands/frame/diagnose/inheritance/TestDiagnoseInheritance.py (1024 of 1781)
PASS: lldb-api :: commands/expression/test/TestExprs.py (1025 of 1781)
PASS: lldb-api :: commands/expression/radar_9673664/TestExprHelpExamples.py (1026 of 1781)
PASS: lldb-unit :: Utility/./UtilityTests/ArgsTest.EscapeLLDBCommandArgument (1027 of 1781)
PASS: lldb-api :: functionalities/asan/TestReportData.py (1028 of 1781)
PASS: lldb-shell :: SymbolFile/DWARF/find-qualified-variable.cpp (1029 of 1781)
PASS: lldb-unit :: Process/gdb-remote/./ProcessGdbRemoteTests/GDBRemoteCommunicationClientTest.WriteRegisterNoSuffix (1030 of 1781)
PASS: lldb-api :: commands/expression/import-std-module/no-std-module/TestMissingStdModule.py (1031 of 1781)
PASS: lldb-api :: commands/help/TestHelp.py (1032 of 1781)
PASS: lldb-unit :: Expression/./ExpressionTests/DWARFExpression.DW_OP_pick (1033 of 1781)
PASS: lldb-shell :: SymbolFile/NativePDB/ast-functions.cpp (1034 of 1781)
PASS: lldb-shell :: ObjectFile/PECOFF/subsections.yaml (1035 of 1781)
PASS: lldb-api :: lang/objc/rdar-11355592/TestRdar11355592.py (1036 of 1781)
UNSUPPORTED: lldb-api :: tools/lldb-vscode/attach/TestVSCode_attach.py (1037 of 1781)
XFAIL: lldb-shell :: Unwind/prefer-debug-over-eh-frame.test (1038 of 1781)
PASS: lldb-unit :: ScriptInterpreter/Python/./ScriptInterpreterPythonTests/PythonDataObjectsTest.TestPythonListValueEquality (1039 of 1781)
PASS: lldb-unit :: Utility/./UtilityTests/StringListTest.LongestCommonPrefixDuplicateElement (1040 of 1781)
PASS: lldb-api :: lang/cpp/lambdas/TestLambdas.py (1041 of 1781)
PASS: lldb-unit :: Target/./TargetTests/ExecutionContextTest.GetByteOrderProcess (1042 of 1781)
UNSUPPORTED: lldb-api :: linux/add-symbols/TestTargetSymbolsAddCommand.py (1043 of 1781)
PASS: lldb-api :: functionalities/thread/concurrent_events/TestConcurrentCrashWithWatchpointBreakpointSignal.py (1044 of 1781)
PASS: lldb-unit :: Utility/./UtilityTests/BinaryStreamTest.PutSLEB128TwoBytes (1045 of 1781)
PASS: lldb-unit :: tools/lldb-server/tests/./LLDBServerTests/StandardStartupTest.TestStopReplyContainsThreadPcs (1046 of 1781)
PASS: lldb-unit :: Language/Highlighting/./HighlighterTests/HighlighterTest.ClangEmptyInput (1047 of 1781)
UNSUPPORTED: lldb-api :: tools/lldb-server/platform-process-connect/TestPlatformProcessConnect.py (1048 of 1781)
PASS: lldb-api :: commands/expression/scoped_enums/TestScopedEnumType.py (1049 of 1781)
PASS: lldb-shell :: SymbolFile/Breakpad/symtab-macho.test (1050 of 1781)
PASS: lldb-shell :: ObjectFile/ELF/netbsd-core-amd64.test (1051 of 1781)
PASS: lldb-shell :: SymbolFile/DWARF/dir-separator-windows.s (1052 of 1781)
PASS: lldb-api :: lang/objc/blocks/TestObjCIvarsInBlocks.py (1053 of 1781)
PASS: lldb-api :: functionalities/abbreviation/TestCommonShortSpellings.py (1054 of 1781)
PASS: lldb-unit :: Utility/./UtilityTests/BinaryStreamTest.PutSLEB128EightBytes (1055 of 1781)
PASS: lldb-api :: functionalities/breakpoint/breakpoint_hit_count/TestBreakpointHitCount.py (1056 of 1781)
PASS: lldb-api :: commands/quit/TestQuit.py (1057 of 1781)
PASS: lldb-shell :: SymbolFile/Breakpad/unwind-via-stack-win.test (1058 of 1781)
PASS: lldb-api :: commands/watchpoints/watchpoint_commands/command/TestWatchpointCommandPython.py (1059 of 1781)
PASS: lldb-api :: functionalities/gdb_remote_client/TestGDBRemoteLoad.py (1060 of 1781)
PASS: lldb-unit :: UnwindAssembly/x86/./UnwindAssemblyx86Tests/Testx86AssemblyInspectionEngine.Test64bitFramelessBigStackFrame (1061 of 1781)
PASS: lldb-unit :: Utility/./UtilityTests/ArgsTest.TestQuotedUnknownEscape (1062 of 1781)
PASS: lldb-unit :: Utility/./UtilityTests/StringExtractorTest.GetHexBytesAvail_Partial (1063 of 1781)
PASS: lldb-shell :: Breakpoint/split-dwarf5-debug-stroffsets.test (1064 of 1781)
PASS: lldb-api :: commands/expression/import-std-module/weak_ptr/TestWeakPtr.py (1065 of 1781)
PASS: lldb-api :: lang/objc/modules-auto-import/TestModulesAutoImport.py (1066 of 1781)
PASS: lldb-api :: functionalities/data-formatter/stringprinter/TestStringPrinter.py (1067 of 1781)
PASS: lldb-api :: commands/expression/dont_allow_jit/TestAllowJIT.py (1068 of 1781)
PASS: lldb-api :: lang/objc/conflicting-definition/TestConflictingDefinition.py (1069 of 1781)
PASS: lldb-api :: functionalities/return-value/TestReturnValue.py (1070 of 1781)
PASS: lldb-api :: commands/expression/unwind_expression/TestUnwindExpression.py (1071 of 1781)
PASS: lldb-unit :: Utility/./UtilityTests/UriParserTest.SchemeHostSeparator2 (1072 of 1781)
PASS: lldb-unit :: Utility/./UtilityTests/ReproducerTest.SetCapture (1073 of 1781)
PASS: lldb-unit :: Utility/./UtilityTests/BinaryStreamTest.PutSLEB128NineBytes (1074 of 1781)
PASS: lldb-unit :: Utility/./UtilityTests/DataExtractorTest.GetCStrUnterminated (1075 of 1781)
PASS: lldb-shell :: Minidump/dump-all.test (1076 of 1781)
PASS: lldb-unit :: Utility/./UtilityTests/StringLexerTest.AdvanceIf (1077 of 1781)
PASS: lldb-shell :: SymbolFile/Breakpad/stack-cfi-parsing.test (1078 of 1781)
PASS: lldb-unit :: Utility/./UtilityTests/FileSpecTest.AppendPathComponent (1079 of 1781)
PASS: lldb-unit :: Host/./HostTests/SocketTest.TCPListen0ConnectAccept (1080 of 1781)
PASS: lldb-unit :: Utility/./UtilityTests/StringLexerTest.Peek (1081 of 1781)
PASS: lldb-unit :: Utility/./UtilityTests/CompletionRequest.TryCompleteCurrentArgMode (1082 of 1781)
PASS: lldb-api :: functionalities/memory-region/TestMemoryRegion.py (1083 of 1781)
PASS: lldb-unit :: Utility/./UtilityTests/StreamTest.ShiftOperatorChars (1084 of 1781)
PASS: lldb-unit :: Utility/./UtilityTests/DataExtractorTest.GetMaxU64_unchecked (1085 of 1781)
PASS: lldb-api :: macosx/indirect_symbol/TestIndirectSymbols.py (1086 of 1781)
PASS: lldb-api :: lang/objc/foundation/TestObjCMethods2.py (1087 of 1781)
PASS: lldb-api :: macosx/queues/TestQueues.py (1088 of 1781)
PASS: lldb-api :: types/TestDoubleTypesExpr.py (1089 of 1781)
PASS: lldb-unit :: Host/./HostTests/FileSystemTest.GetByteSize (1090 of 1781)
PASS: lldb-api :: lang/c/shared_lib/TestSharedLib.py (1091 of 1781)
PASS: lldb-unit :: ScriptInterpreter/Python/./ScriptInterpreterPythonTests/PythonDataObjectsTest.TestPythonStringToStr (1092 of 1781)
PASS: lldb-api :: functionalities/plugins/command_plugin/TestPluginCommands.py (1093 of 1781)
PASS: lldb-unit :: Signals/./SignalsTests/UnixSignalsTest.GetFilteredSignals (1094 of 1781)
PASS: lldb-api :: commands/expression/cast_int_to_anonymous_enum/TestCastIntToAnonymousEnum.py (1095 of 1781)
PASS: lldb-shell :: ObjectFile/MachO/subsections.yaml (1096 of 1781)
PASS: lldb-api :: functionalities/tail_call_frames/inlining_and_tail_calls/TestInliningAndTailCalls.py (1097 of 1781)
UNSUPPORTED: lldb-shell :: SymbolFile/dissassemble-entry-point.s (1098 of 1781)
PASS: lldb-shell :: SymbolFile/DWARF/dir-separator-posix.s (1099 of 1781)
PASS: lldb-api :: lang/cpp/bool/TestCPPBool.py (1100 of 1781)
PASS: lldb-shell :: Process/TestEnvironment.test (1101 of 1781)
PASS: lldb-unit :: UnwindAssembly/x86/./UnwindAssemblyx86Tests/Testx86AssemblyInspectionEngine.Test64bitFramelessSmallStackFrame (1102 of 1781)
PASS: lldb-api :: commands/expression/rdar42038760/TestScalarURem.py (1103 of 1781)
PASS: lldb-unit :: UnwindAssembly/x86/./UnwindAssemblyx86Tests/Testx86AssemblyInspectionEngine.TestPushR14 (1104 of 1781)
PASS: lldb-unit :: Process/gdb-remote/./ProcessGdbRemoteTests/GDBRemoteClientBaseTest.SendContinueAndInterrupt (1105 of 1781)
PASS: lldb-shell :: Minidump/fb-dump.test (1106 of 1781)
PASS: lldb-unit :: Utility/./UtilityTests/DataExtractorTest.GetCStrAtEnd (1107 of 1781)
PASS: lldb-unit :: Utility/./UtilityTests/TildeExpressionResolver.ResolveFullPath (1108 of 1781)
PASS: lldb-unit :: Utility/./UtilityTests/ConstStringTest.FromMidOfBufferStringRef (1109 of 1781)
PASS: lldb-api :: lang/objc/objc-ivar-stripped/TestObjCIvarStripped.py (1110 of 1781)
PASS: lldb-unit :: UnwindAssembly/x86/./UnwindAssemblyx86Tests/Testx86AssemblyInspectionEngine.TestPopR15 (1111 of 1781)
PASS: lldb-unit :: Utility/./UtilityTests/StreamTest.ShiftOperatorPtr (1112 of 1781)
PASS: lldb-unit :: Utility/./UtilityTests/TimeoutTest.Construction (1113 of 1781)
PASS: lldb-api :: functionalities/load_unload/TestLoadUnload.py (1114 of 1781)
PASS: lldb-api :: commands/expression/import-std-module/list-basic/TestBasicList.py (1115 of 1781)
PASS: lldb-api :: functionalities/data-formatter/data-formatter-stl/libcxx/bitset/TestDataFormatterLibcxxBitset.py (1116 of 1781)
PASS: lldb-unit :: Utility/./UtilityTests/StringListTest.GetMaxStringLengthMixed (1117 of 1781)
PASS: lldb-unit :: Utility/./UtilityTests/StreamTest.ShiftOperatorUInts (1118 of 1781)
PASS: lldb-unit :: Utility/./UtilityTests/UriParserTest.SchemeHostSeparator4 (1119 of 1781)
PASS: lldb-shell :: SymbolFile/Breakpad/unwind-via-raSearch.test (1120 of 1781)
PASS: lldb-api :: lang/objc/hidden-ivars/TestHiddenIvars.py (1121 of 1781)
PASS: lldb-api :: commands/version/TestVersion.py (1122 of 1781)
PASS: lldb-api :: commands/expression/import-std-module/forward_list-dbg-info-content/TestDbgInfoContentForwardList.py (1123 of 1781)
PASS: lldb-unit :: Utility/./UtilityTests/StringListTest.JoinNonSpace (1124 of 1781)
PASS: lldb-unit :: Utility/./UtilityTests/Predicate.WaitForValueEqualTo (1125 of 1781)
PASS: lldb-shell :: SymbolFile/DWARF/find-basic-function.cpp (1126 of 1781)
PASS: lldb-api :: commands/log/basic/TestLogging.py (1127 of 1781)
PASS: lldb-unit :: Utility/./UtilityTests/OptionsWithRawTest.EmptySuffix (1128 of 1781)
PASS: lldb-api :: commands/watchpoints/multiple_hits/TestMultipleHits.py (1129 of 1781)
PASS: lldb-api :: python_api/lldbutil/process/TestPrintStackTraces.py (1130 of 1781)
PASS: lldb-unit :: Expression/./ExpressionTests/CppModuleConfigurationTest.LinuxLocalLibCpp (1131 of 1781)
PASS: lldb-unit :: Utility/./UtilityTests/StringExtractorTest.GetHexBytesAvail (1132 of 1781)
PASS: lldb-api :: lang/objc/objc-class-method/TestObjCClassMethod.py (1133 of 1781)
PASS: lldb-unit :: Interpreter/./InterpreterTests/CompletionTest.DirCompletionUsername (1134 of 1781)
PASS: lldb-unit :: Process/gdb-remote/./ProcessGdbRemoteTests/GDBRemoteCommunicationServerTest.SendErrorResponse_StringError (1135 of 1781)
PASS: lldb-api :: commands/expression/expr-in-syscall/TestExpressionInSyscall.py (1136 of 1781)
PASS: lldb-unit :: Utility/./UtilityTests/AnsiTerminal.KnownPrefix (1137 of 1781)
PASS: lldb-api :: lang/objc/objc-static-method-stripped/TestObjCStaticMethodStripped.py (1138 of 1781)
PASS: lldb-api :: lang/cpp/wchar_t/TestCxxWCharT.py (1139 of 1781)
PASS: lldb-api :: functionalities/data-formatter/data-formatter-stl/libcxx/forward_list/TestDataFormatterLibcxxForwardList.py (1140 of 1781)
PASS: lldb-api :: functionalities/data-formatter/format-propagation/TestFormatPropagation.py (1141 of 1781)
PASS: lldb-api :: commands/platform/basic/TestPlatformCommand.py (1142 of 1781)
PASS: lldb-api :: lang/objc/foundation/TestRuntimeTypes.py (1143 of 1781)
UNSUPPORTED: lldb-shell :: SymbolFile/PDB/calling-conventions.test (1144 of 1781)
PASS: lldb-api :: commands/expression/weak_symbols/TestWeakSymbols.py (1145 of 1781)
PASS: lldb-api :: functionalities/thread/concurrent_events/TestConcurrentManyWatchpoints.py (1146 of 1781)
PASS: lldb-api :: commands/expression/import-std-module/conflicts/TestStdModuleWithConflicts.py (1147 of 1781)
PASS: lldb-unit :: Language/Highlighting/./HighlighterTests/HighlighterTest.HighlighterSelectionPath (1148 of 1781)
PASS: lldb-shell :: Quit/TestQuitExitCode30.test (1149 of 1781)
PASS: lldb-unit :: Utility/./UtilityTests/StringListTest.Assignment (1150 of 1781)
PASS: lldb-unit :: Utility/./UtilityTests/FileSpecTest.FileAndDirectoryComponents (1151 of 1781)
PASS: lldb-api :: functionalities/step-avoids-no-debug/TestStepNoDebug.py (1152 of 1781)
UNSUPPORTED: lldb-shell :: SymbolFile/PDB/variables.test (1153 of 1781)
PASS: lldb-api :: commands/expression/import-std-module/list-dbg-info-content/TestDbgInfoContentList.py (1154 of 1781)
PASS: lldb-shell :: Register/x86-64-ymm-read.test (1155 of 1781)
PASS: lldb-unit :: Utility/./UtilityTests/StreamTest.ChangingByteOrder (1156 of 1781)
PASS: lldb-unit :: Host/./HostTests/NativeProcessProtocolTest.SetBreakpointFailRead (1157 of 1781)
PASS: lldb-unit :: ScriptInterpreter/Python/./ScriptInterpreterPythonTests/PythonDataObjectsTest.TestPythonDictionaryToStructuredDictionary (1158 of 1781)
PASS: lldb-unit :: Process/gdb-remote/./ProcessGdbRemoteTests/GDBRemoteCommunicationServerTest.SendErrorResponse_UnimplementedError (1159 of 1781)
UNSUPPORTED: lldb-shell :: SymbolFile/PDB/ast-restore.test (1160 of 1781)
PASS: lldb-unit :: ScriptInterpreter/Python/./ScriptInterpreterPythonTests/PythonDataObjectsTest.TestPythonIntegerToStructuredInteger (1161 of 1781)
PASS: lldb-unit :: Expression/./ExpressionTests/DiagnosticManagerTest.GetStringSeverityLabels (1162 of 1781)
PASS: lldb-api :: lang/cpp/offsetof/TestOffsetofCpp.py (1163 of 1781)
PASS: lldb-unit :: Utility/./UtilityTests/ArchSpecTest.MergeFromMachOUnknown (1164 of 1781)
PASS: lldb-api :: lang/cpp/char1632_t/TestChar1632T.py (1165 of 1781)
PASS: lldb-shell :: Breakpoint/debug_rnglist_basic.test (1166 of 1781)
PASS: lldb-unit :: UnwindAssembly/x86/./UnwindAssemblyx86Tests/Testx86AssemblyInspectionEngine.Test32bitFramelessBigStackFrame (1167 of 1781)
PASS: lldb-unit :: Utility/./UtilityTests/SerializationRountripTest.SerializeDeserializePodPointers (1168 of 1781)
PASS: lldb-shell :: SymbolFile/NativePDB/s_constant.cpp (1169 of 1781)
PASS: lldb-unit :: Utility/./UtilityTests/BinaryStreamTest.PutULEB128NineBytes (1170 of 1781)
PASS: lldb-unit :: Utility/./UtilityTests/StringExtractorTest.InitEmpty (1171 of 1781)
UNSUPPORTED: lldb-shell :: Breakpoint/case-insensitive.test (1172 of 1781)
PASS: lldb-api :: commands/expression/import-std-module/stack/TestStack.py (1173 of 1781)
PASS: lldb-unit :: ScriptInterpreter/Python/./ScriptInterpreterPythonTests/PythonDataObjectsTest.TestPythonFile (1174 of 1781)
PASS: lldb-shell :: ObjectFile/ELF/PT_LOAD-overlap-section.yaml (1175 of 1781)
PASS: lldb-unit :: Utility/./UtilityTests/LogChannelEnabledTest.LLDB_LOG_ERROR (1176 of 1781)
UNSUPPORTED: lldb-api :: arm/breakpoint-it/TestBreakpointIt.py (1177 of 1781)
PASS: lldb-api :: lang/cpp/diamond/TestDiamond.py (1178 of 1781)
PASS: lldb-unit :: Language/Highlighting/./HighlighterTests/HighlighterTest.ClangCursorPosAfterOtherToken (1179 of 1781)
PASS: lldb-unit :: tools/lldb-server/tests/./LLDBServerTests/TestBase.DebugserverEnv (1180 of 1781)
PASS: lldb-api :: macosx/function-starts/TestFunctionStarts.py (1181 of 1781)
PASS: lldb-unit :: Utility/./UtilityTests/Flags.AnyClear (1182 of 1781)
PASS: lldb-unit :: SymbolFile/NativePDB/./SymbolFileNativePDBTests/PDBFPOProgramToDWARFExpressionTests.DependencyChain (1183 of 1781)
PASS: lldb-unit :: Utility/./UtilityTests/StringExtractorTest.GetU64BigEndian (1184 of 1781)
PASS: lldb-unit :: SymbolFile/NativePDB/./SymbolFileNativePDBTests/PDBFPOProgramToDWARFExpressionTests.UnsupportedRASearch (1185 of 1781)
PASS: lldb-shell :: Settings/TestStopCommandSourceOnError.test (1186 of 1781)
PASS: lldb-unit :: Process/minidump/./LLDBMinidumpTests/MinidumpParserTest.GetMemoryRegionInfo (1187 of 1781)
PASS: lldb-api :: commands/watchpoints/watchpoint_disable/TestWatchpointDisable.py (1188 of 1781)
PASS: lldb-shell :: ObjectFile/Breakpad/sections-trailing-func.test (1189 of 1781)
PASS: lldb-unit :: Utility/./UtilityTests/ScalarTest.Division (1190 of 1781)
PASS: lldb-api :: python_api/value/linked_list/TestValueAPILinkedList.py (1191 of 1781)
PASS: lldb-unit :: Target/./TargetTests/ModuleCacheTest.GetAndPutStrangeHostname (1192 of 1781)
PASS: lldb-api :: lang/objc/foundation/TestObjectDescriptionAPI.py (1193 of 1781)
UNSUPPORTED: lldb-shell :: Register/x86-zmm-write.test (1194 of 1781)
PASS: lldb-shell :: Driver/TestTarget.test (1195 of 1781)
UNSUPPORTED: lldb-api :: tools/lldb-vscode/breakpoint/TestVSCode_setFunctionBreakpoints.py (1196 of 1781)
PASS: lldb-shell :: SymbolFile/DWARF/find-basic-namespace.cpp (1197 of 1781)
PASS: lldb-api :: python_api/class_members/TestSBTypeClassMembers.py (1198 of 1781)
PASS: lldb-shell :: Reproducer/TestDriverOptions.test (1199 of 1781)
PASS: lldb-shell :: Settings/TestEchoCommands.test (1200 of 1781)
PASS: lldb-unit :: Utility/./UtilityTests/ArgsTest.ReplaceArgumentAtIndexEqual (1201 of 1781)
UNSUPPORTED: lldb-api :: functionalities/darwin_log/filter/exact_match/category/TestDarwinLogFilterMatchCategory.py (1202 of 1781)
PASS: lldb-api :: lang/c/global_variables/TestGlobalVariables.py (1203 of 1781)
PASS: lldb-unit :: Utility/./UtilityTests/ScalarTest.GetBytes (1204 of 1781)
UNSUPPORTED: lldb-api :: tools/lldb-vscode/stackTrace/TestVSCode_stackTrace.py (1205 of 1781)
PASS: lldb-unit :: SymbolFile/DWARF/./SymbolFileDWARFTests/SymbolFileDWARFTests.TestAbbrevInvalidNULLTag (1206 of 1781)
PASS: lldb-api :: functionalities/fat_archives/TestFatArchives.py (1207 of 1781)
PASS: lldb-api :: python_api/sbtype_typeclass/TestSBTypeTypeClass.py (1208 of 1781)
PASS: lldb-unit :: Core/./LLDBCoreTests/RichManglingContextTest.FromCxxMethodName (1209 of 1781)
PASS: lldb-unit :: Process/gdb-remote/./ProcessGdbRemoteTests/GDBRemoteCommunicationClientTest.SendGetDataPacket (1210 of 1781)
PASS: lldb-unit :: Utility/./UtilityTests/DataExtractorTest.GetCStrAtNullOffset (1211 of 1781)
PASS: lldb-api :: commands/expression/completion-in-lambda-and-unnnamed-class/TestCompletionInLambdaAndUnnamedClass.py (1212 of 1781)
PASS: lldb-api :: python_api/sbvalue_const_addrof/TestSBValueConstAddrOf.py (1213 of 1781)
PASS: lldb-shell :: Reproducer/Functionalities/TestDataFormatter.test (1214 of 1781)
PASS: lldb-unit :: Utility/./UtilityTests/ScalarTest.ExtractBitfield (1215 of 1781)
PASS: lldb-api :: functionalities/data-formatter/data-formatter-stl/libcxx/vbool/TestDataFormatterLibcxxVBool.py (1216 of 1781)
PASS: lldb-api :: commands/expression/rdar44436068/Test128BitsInteger.py (1217 of 1781)
PASS: lldb-shell :: SymbolFile/DWARF/split-dwarf-multiple-cu.ll (1218 of 1781)
PASS: lldb-api :: lang/objc/objc-new-syntax/TestObjCNewSyntaxArray.py (1219 of 1781)
PASS: lldb-api :: functionalities/process_group/TestChangeProcessGroup.py (1220 of 1781)
PASS: lldb-api :: commands/expression/context-object-objc/TestContextObjectObjc.py (1221 of 1781)
PASS: lldb-unit :: Language/CPlusPlus/./LanguageCPlusPlusTests/CPlusPlusLanguage.FindAlternateFunctionManglings (1222 of 1781)
PASS: lldb-api :: lang/cpp/thread_local/TestThreadLocal.py (1223 of 1781)
PASS: lldb-unit :: Utility/./UtilityTests/StatusTest.Formatv (1224 of 1781)
PASS: lldb-api :: commands/expression/import-std-module/empty-module/TestEmptyStdModule.py (1225 of 1781)
PASS: lldb-unit :: Utility/./UtilityTests/StringExtractorTest.GetNameColonValueNoSemicolon (1226 of 1781)
PASS: lldb-unit :: SymbolFile/NativePDB/./SymbolFileNativePDBTests/PDBFPOProgramToDWARFExpressionTests.UnresolvedRegisterReference (1227 of 1781)
PASS: lldb-shell :: Settings/TestSettingsWrite.test (1228 of 1781)
PASS: lldb-unit :: Utility/./UtilityTests/StringListTest.GetMaxStringLengthDecreasingSize (1229 of 1781)
PASS: lldb-unit :: UnwindAssembly/x86/./UnwindAssemblyx86Tests/Testx86AssemblyInspectionEngine.TestPush0 (1230 of 1781)
PASS: lldb-api :: functionalities/postmortem/minidump-new/TestMiniDumpNew.py (1231 of 1781)
PASS: lldb-api :: lang/objcxx/class-name-clash/TestNameClash.py (1232 of 1781)
PASS: lldb-api :: commands/watchpoints/watchpoint_on_vectors/TestValueOfVectorVariable.py (1233 of 1781)
PASS: lldb-api :: commands/expression/diagnostics/TestExprDiagnostics.py (1234 of 1781)
PASS: lldb-api :: commands/expression/fixits/TestFixIts.py (1235 of 1781)
UNSUPPORTED: lldb-api :: commands/watchpoints/multi_watchpoint_slots/TestWatchpointMultipleSlots.py (1236 of 1781)
PASS: lldb-api :: functionalities/step_scripted/TestStepScripted.py (1237 of 1781)
PASS: lldb-api :: api/multithreaded/TestMultithreaded.py (1238 of 1781)
PASS: lldb-unit :: ScriptInterpreter/Python/./ScriptInterpreterPythonTests/PythonDataObjectsTest.TestPythonInteger (1239 of 1781)
PASS: lldb-shell :: ObjectFile/Breakpad/uuid-matching-mac.test (1240 of 1781)
PASS: lldb-shell :: Minidump/disassemble-no-module.yaml (1241 of 1781)
PASS: lldb-api :: commands/target/create-no-such-arch/TestNoSuchArch.py (1242 of 1781)
PASS: lldb-unit :: Language/CPlusPlus/./LanguageCPlusPlusTests/CPlusPlusLanguage.ExtractContextAndIdentifier (1243 of 1781)
PASS: lldb-unit :: Language/Highlighting/./HighlighterTests/HighlighterTest.DefaultHighlighterWithCursor (1244 of 1781)
UNSUPPORTED: lldb-api :: functionalities/exec/TestExec.py (1245 of 1781)
PASS: lldb-shell :: Quit/TestQuitExitCodeHexA.test (1246 of 1781)
PASS: lldb-unit :: ScriptInterpreter/Python/./ScriptInterpreterPythonTests/PythonExceptionStateTest.TestDiscardSemantics (1247 of 1781)
PASS: lldb-unit :: Process/gdb-remote/./ProcessGdbRemoteTests/GDBRemoteCommunicationClientTest.GetModulesInfoInvalidResponse (1248 of 1781)
PASS: lldb-api :: functionalities/thread/concurrent_events/TestConcurrentWatchpointDelayWatchpointOneBreakpoint.py (1249 of 1781)
PASS: lldb-api :: lang/objc/objc-runtime-ivars/TestRuntimeIvars.py (1250 of 1781)
PASS: lldb-api :: tools/lldb-server/TestLldbGdbServer.py (1251 of 1781)
PASS: lldb-api :: functionalities/data-formatter/data-formatter-objc/nsindexpath/TestDataFormatterNSIndexPath.py (1252 of 1781)
PASS: lldb-unit :: Utility/./UtilityTests/StringExtractorTest.GetHexU8_Extra (1253 of 1781)
PASS: lldb-unit :: Utility/./UtilityTests/StringExtractorTest.GetHexU8_Underflow_NoEof (1254 of 1781)
UNSUPPORTED: lldb-shell :: Register/x86-64-zmm-read.test (1255 of 1781)
PASS: lldb-unit :: Symbol/./SymbolTests/TestClangASTContext.TestConvertAccessTypeToAccessSpecifier (1256 of 1781)
PASS: lldb-unit :: Utility/./UtilityTests/StreamTest.PutMaxHex64ByteOrderLittle (1257 of 1781)
PASS: lldb-unit :: Core/./LLDBCoreTests/StreamCallbackTest.Callback (1258 of 1781)
UNSUPPORTED: lldb-api :: commands/watchpoints/variable_out_of_scope/TestWatchedVarHitWhenInScope.py (1259 of 1781)
PASS: lldb-api :: lang/objc/foundation/TestObjCMethodsNSError.py (1260 of 1781)
PASS: lldb-unit :: Utility/./UtilityTests/UriParserTest.SchemeHostSeparator (1261 of 1781)
PASS: lldb-unit :: Utility/./UtilityTests/ArgsTest.TestTrailingBackslash (1262 of 1781)
PASS: lldb-unit :: ObjectFile/Breakpad/./ObjectFileBreakpadTests/FuncRecord.parse (1263 of 1781)
UNSUPPORTED: lldb-api :: benchmarks/expression/TestExpressionCmd.py (1264 of 1781)
PASS: lldb-shell :: Host/TestCustomShell.test (1265 of 1781)
PASS: lldb-shell :: Commands/CommandScriptImmediateOutput/CommandScriptImmediateOutputConsole.test (1266 of 1781)
PASS: lldb-api :: functionalities/data-formatter/data-formatter-globals/TestDataFormatterGlobals.py (1267 of 1781)
PASS: lldb-api :: lang/cpp/namespace_definitions/TestNamespaceDefinitions.py (1268 of 1781)
PASS: lldb-api :: commands/command/history/TestCommandHistory.py (1269 of 1781)
PASS: lldb-unit :: Breakpoint/./LLDBBreakpointTests/BreakpointIDTest.StringIsBreakpointName (1270 of 1781)
PASS: lldb-api :: functionalities/data-formatter/data-formatter-objc/TestDataFormatterObjCNSDate.py (1271 of 1781)
PASS: lldb-unit :: Utility/./UtilityTests/RecordReplayTest.InstrumentedFoo (1272 of 1781)
PASS: lldb-api :: functionalities/thread/concurrent_events/TestConcurrentDelaySignalBreak.py (1273 of 1781)
PASS: lldb-shell :: ObjectFile/MachO/lc_version_min.yaml (1274 of 1781)
PASS: lldb-shell :: SymbolFile/DWARF/debug-line-basic.s (1275 of 1781)
PASS: lldb-api :: functionalities/breakpoint/address_breakpoints/TestAddressBreakpoints.py (1276 of 1781)
PASS: lldb-api :: lang/objc/orderedset/TestOrderedSet.py (1277 of 1781)
PASS: lldb-api :: functionalities/thread/concurrent_events/TestConcurrentTwoBreakpointThreads.py (1278 of 1781)
PASS: lldb-shell :: Expr/TestIRMemoryMap.test (1279 of 1781)
PASS: lldb-api :: functionalities/thread/concurrent_events/TestConcurrentDelayWatchBreak.py (1280 of 1781)
PASS: lldb-unit :: Utility/./UtilityTests/ArgsTest.TestSingleArg (1281 of 1781)
PASS: lldb-unit :: Utility/./UtilityTests/RangeTest.EqualInvalid (1282 of 1781)
PASS: lldb-unit :: Utility/./UtilityTests/ArgsTest.GetArgumentArrayRef (1283 of 1781)
PASS: lldb-unit :: Host/./HostTests/File.GetStreamFromDescriptor (1284 of 1781)
PASS: lldb-unit :: Expression/./ExpressionTests/CppModuleConfigurationTest.MissingLibCpp (1285 of 1781)
PASS: lldb-unit :: Utility/./UtilityTests/NameMatchesTest.Equals (1286 of 1781)
PASS: lldb-unit :: ObjectFile/ELF/./ObjectFileELFTests/ObjectFileELFTest.GetModuleSpecifications_EarlySectionHeaders (1287 of 1781)
PASS: lldb-unit :: Utility/./UtilityTests/AnsiTerminal.AtStart (1288 of 1781)
PASS: lldb-shell :: Breakpoint/implicit_const_form_support.test (1289 of 1781)
PASS: lldb-shell :: ObjectFile/ELF/section-types.yaml (1290 of 1781)
PASS: lldb-unit :: Utility/./UtilityTests/StringListTest.ShiftStdString (1291 of 1781)
PASS: lldb-unit :: Process/minidump/./LLDBMinidumpTests/MinidumpParserTest.GetMiscInfoWindows (1292 of 1781)
PASS: lldb-api :: commands/command/script/import/TestImport.py (1293 of 1781)
PASS: lldb-api :: lang/objc/ptr_refs/TestPtrRefsObjC.py (1294 of 1781)
PASS: lldb-unit :: Utility/./UtilityTests/StringListTest.GetMaxStringLengthEmpty (1295 of 1781)
PASS: lldb-unit :: UnwindAssembly/x86/./UnwindAssemblyx86Tests/Testx86AssemblyInspectionEngine.TestSpillRegToStackViaMOVx86_64 (1296 of 1781)
UNSUPPORTED: lldb-api :: functionalities/darwin_log/filter/exact_match/activity-chain/TestDarwinLogFilterMatchActivityChain.py (1297 of 1781)
PASS: lldb-unit :: Process/minidump/./LLDBMinidumpTests/MinidumpParserTest.GetLinuxProcStatus_no_stream (1298 of 1781)
PASS: lldb-unit :: Process/minidump/./LLDBMinidumpTests/MinidumpParserTest.MinidumpModuleOrder (1299 of 1781)
PASS: lldb-unit :: Utility/./UtilityTests/ReproducerTest.SetReplay (1300 of 1781)
PASS: lldb-api :: python_api/file_handle/TestFileHandle.py (1301 of 1781)
PASS: lldb-unit :: Expression/./ExpressionTests/CppModuleConfigurationTest.AmbiguousLibCpp (1302 of 1781)
PASS: lldb-api :: functionalities/multidebugger_commands/TestMultipleDebuggersCommands.py (1303 of 1781)
UNSUPPORTED: lldb-api :: functionalities/data-formatter/data-formatter-stl/libstdcpp/list/TestDataFormatterStdList.py (1304 of 1781)
PASS: lldb-unit :: SymbolFile/DWARF/./SymbolFileDWARFTests/SymbolFileDWARFTests.TestAbbrevValidAttrNullForm (1305 of 1781)
PASS: lldb-unit :: Host/./HostTests/NativeProcessProtocolTest.SetBreakpointFailWrite (1306 of 1781)
PASS: lldb-api :: lang/cpp/class_static/TestStaticVariables.py (1307 of 1781)
PASS: lldb-unit :: ObjectFile/Breakpad/./ObjectFileBreakpadTests/ModuleRecord.parse (1308 of 1781)
PASS: lldb-api :: commands/expression/call-function/TestCallUserDefinedFunction.py (1309 of 1781)
PASS: lldb-api :: lang/cpp/call-function/TestCallCPPFunction.py (1310 of 1781)
PASS: lldb-unit :: UnwindAssembly/x86/./UnwindAssemblyx86Tests/Testx86AssemblyInspectionEngine.TestSimple64bitFrameFunction (1311 of 1781)
PASS: lldb-api :: lang/cpp/dynamic-value/TestDynamicValue.py (1312 of 1781)
UNSUPPORTED: lldb-api :: functionalities/darwin_log/filter/exact_match/message/TestDarwinLogFilterMatchMessage.py (1313 of 1781)
PASS: lldb-shell :: Breakpoint/case-sensitive.test (1314 of 1781)
PASS: lldb-unit :: Utility/./UtilityTests/UriParserTest.MinimalPort (1315 of 1781)
PASS: lldb-api :: functionalities/breakpoint/comp_dir_symlink/TestCompDirSymLink.py (1316 of 1781)
PASS: lldb-shell :: ObjectFile/ELF/many-sections.s (1317 of 1781)
PASS: lldb-unit :: Utility/./UtilityTests/ArchSpecTest.TestParseMachCPUDashSubtypeTripleSimple (1318 of 1781)
PASS: lldb-api :: lang/c/conflicting-symbol/TestConflictingSymbol.py (1319 of 1781)
PASS: lldb-unit :: Host/./HostTests/FileSystemTest.EnumerateDirectory (1320 of 1781)
PASS: lldb-unit :: Utility/./UtilityTests/StringExtractorTest.GetHexBytesAvail_OddPair (1321 of 1781)
PASS: lldb-api :: functionalities/breakpoint/breakpoint_ignore_count/TestBreakpointIgnoreCount.py (1322 of 1781)
PASS: lldb-unit :: Utility/./UtilityTests/Flags.Reset (1323 of 1781)
PASS: lldb-api :: lang/cpp/type_lookup/TestCppTypeLookup.py (1324 of 1781)
PASS: lldb-unit :: Utility/./UtilityTests/RegularExpression.Valid (1325 of 1781)
PASS: lldb-api :: functionalities/thread/concurrent_events/TestConcurrentWatchBreakDelay.py (1326 of 1781)
PASS: lldb-unit :: Utility/./UtilityTests/StringListTest.SplitIntoLinesEmpty (1327 of 1781)
PASS: lldb-unit :: SymbolFile/NativePDB/./SymbolFileNativePDBTests/PDBFPOProgramToDWARFExpressionTests.InvalidOpBinary (1328 of 1781)
PASS: lldb-api :: python_api/function_symbol/TestSymbolAPI.py (1329 of 1781)
PASS: lldb-api :: lang/cpp/global_operators/TestCppGlobalOperators.py (1330 of 1781)
PASS: lldb-api :: tools/lldb-server/inferior-crash/TestGdbRemoteAbort.py (1331 of 1781)
PASS: lldb-api :: lang/cpp/unicode-literals/TestUnicodeLiterals.py (1332 of 1781)
PASS: lldb-unit :: Process/minidump/./LLDBMinidumpTests/MinidumpParserTest.GetThreadContext_x86_64 (1333 of 1781)
PASS: lldb-api :: functionalities/gdb_remote_client/TestRecognizeBreakpoint.py (1334 of 1781)
PASS: lldb-api :: functionalities/tail_call_frames/disambiguate_call_site/TestDisambiguateCallSite.py (1335 of 1781)
PASS: lldb-api :: functionalities/modern-type-lookup/basic-objc/TestBasicObjcModernTypeLookup.py (1336 of 1781)
PASS: lldb-unit :: Symbol/./SymbolTests/TestClangASTContext.TemplateArguments (1337 of 1781)
PASS: lldb-unit :: Utility/./UtilityTests/StringListTest.SplitIntoLinesSingleTrailingCR (1338 of 1781)
PASS: lldb-shell :: Expr/TestMultilineExpr.test (1339 of 1781)
PASS: lldb-api :: functionalities/deleted-executable/TestDeletedExecutable.py (1340 of 1781)
PASS: lldb-api :: python_api/value/TestValueAPI.py (1341 of 1781)
PASS: lldb-api :: functionalities/data-formatter/nssetsynth/TestNSSetSynthetic.py (1342 of 1781)
PASS: lldb-unit :: Expression/./ExpressionTests/DiagnosticManagerTest.PutStringSeverities (1343 of 1781)
PASS: lldb-unit :: UnwindAssembly/x86/./UnwindAssemblyx86Tests/Testx86AssemblyInspectionEngine.TestPopEBX (1344 of 1781)
PASS: lldb-unit :: Utility/./UtilityTests/StreamTest.PutRawBytesToMixedEndian (1345 of 1781)
PASS: lldb-unit :: Expression/./ExpressionTests/DiagnosticManagerTest.FixedExpression (1346 of 1781)
PASS: lldb-unit :: Utility/./UtilityTests/BinaryStreamTest.PutULEB128FiveBytes (1347 of 1781)
UNSUPPORTED: lldb-api :: functionalities/darwin_log/basic/TestDarwinLogBasic.py (1348 of 1781)
PASS: lldb-unit :: Utility/./UtilityTests/StringExtractorTest.GetHexBytesAvail_FullString (1349 of 1781)
PASS: lldb-unit :: Language/Highlighting/./HighlighterTests/HighlighterTest.ClangSquareBrackets (1350 of 1781)
PASS: lldb-api :: functionalities/memory/find/TestMemoryFind.py (1351 of 1781)
PASS: lldb-api :: lang/cpp/global_variables/TestCPPGlobalVariables.py (1352 of 1781)
PASS: lldb-api :: lang/cpp/dynamic-value/TestCppValueCast.py (1353 of 1781)
PASS: lldb-shell :: ObjectFile/Breakpad/sections.test (1354 of 1781)
UNSUPPORTED: lldb-shell :: SymbolFile/PDB/variables-locations.test (1355 of 1781)
PASS: lldb-unit :: UnwindAssembly/x86/./UnwindAssemblyx86Tests/Testx86AssemblyInspectionEngine.TestPopR13 (1356 of 1781)
PASS: lldb-shell :: SymbolFile/NativePDB/source-list.cpp (1357 of 1781)
PASS: lldb-api :: functionalities/tsan/thread_leak/TestTsanThreadLeak.py (1358 of 1781)
PASS: lldb-api :: functionalities/avoids-fd-leak/TestFdLeak.py (1359 of 1781)
PASS: lldb-api :: commands/process/launch/TestProcessLaunch.py (1360 of 1781)
PASS: lldb-unit :: Utility/./UtilityTests/StringExtractorTest.GetNameColonValueSuccess (1361 of 1781)
PASS: lldb-unit :: Utility/./UtilityTests/StringExtractorTest.GetU32BigEndian (1362 of 1781)
PASS: lldb-api :: functionalities/thread/concurrent_events/TestConcurrentBreakpointDelayBreakpointOneSignal.py (1363 of 1781)
PASS: lldb-unit :: Utility/./UtilityTests/OptionsWithRawTest.ArgsButNoLeadingDash (1364 of 1781)
PASS: lldb-shell :: SymbolFile/Breakpad/symtab.test (1365 of 1781)
PASS: lldb-api :: functionalities/gdb_remote_client/TestGDBRemoteClient.py (1366 of 1781)
PASS: lldb-api :: python_api/hello_world/TestHelloWorld.py (1367 of 1781)
PASS: lldb-api :: lang/c/array_types/TestArrayTypes.py (1368 of 1781)
PASS: lldb-api :: commands/add-dsym/uuid/TestAddDsymCommand.py (1369 of 1781)
PASS: lldb-shell :: Reproducer/TestGDBRemoteRepro.test (1370 of 1781)
PASS: lldb-api :: lang/c/blocks/TestBlocks.py (1371 of 1781)
PASS: lldb-api :: lang/objc/self/TestObjCSelf.py (1372 of 1781)
PASS: lldb-unit :: Utility/./UtilityTests/ArgsTest.TestSingleArgWithQuotedSpace (1373 of 1781)
UNSUPPORTED: lldb-shell :: SymbolFile/NativePDB/typedefs.cpp (1374 of 1781)
PASS: lldb-shell :: ObjectFile/ELF/basic-info.yaml (1375 of 1781)
PASS: lldb-unit :: Language/Highlighting/./HighlighterTests/HighlighterTest.HighlighterSelectionType (1376 of 1781)
PASS: lldb-api :: lang/objc/objc-stepping/TestObjCStepping.py (1377 of 1781)
PASS: lldb-shell :: ObjectFile/ELF/duplicate-section.yaml (1378 of 1781)
PASS: lldb-unit :: Utility/./UtilityTests/ArgsTest.TestSingleQuotedArgWithSpace (1379 of 1781)
PASS: lldb-unit :: Utility/./UtilityTests/VASprintfTest.NoBufferResize (1380 of 1781)
PASS: lldb-unit :: ScriptInterpreter/Python/./ScriptInterpreterPythonTests/PythonDataObjectsTest.TestPythonBytes (1381 of 1781)
PASS: lldb-unit :: Symbol/./SymbolTests/SymbolsTest.LocateExecutableSymbolFileForUnknownExecutableAndMissingSymbolFile (1382 of 1781)
PASS: lldb-unit :: Process/gdb-remote/./ProcessGdbRemoteTests/GDBRemoteClientBaseTest.SendContinueAndAsyncPacket (1383 of 1781)
PASS: lldb-unit :: Utility/./UtilityTests/StringListTest.SplitIntoLines (1384 of 1781)
PASS: lldb-unit :: Utility/./UtilityTests/StringExtractorTest.DecodeHexU8_Underflow (1385 of 1781)
PASS: lldb-unit :: Core/./LLDBCoreTests/UniqueCStringMap.NoDefaultConstructor (1386 of 1781)
UNSUPPORTED: lldb-api :: functionalities/data-formatter/data-formatter-stl/libstdcpp/unique_ptr/TestDataFormatterStdUniquePtr.py (1387 of 1781)
PASS: lldb-shell :: ObjectFile/MachO/lc_build_version.yaml (1388 of 1781)
PASS: lldb-unit :: SymbolFile/NativePDB/./SymbolFileNativePDBTests/PDBFPOProgramToDWARFExpressionTests.InvalidAssignmentMultiple (1389 of 1781)
PASS: lldb-unit :: Target/./TargetTests/ExecutionContextTest.GetByteOrderTarget (1390 of 1781)
PASS: lldb-api :: functionalities/data-formatter/setvaluefromcstring/TestSetValueFromCString.py (1391 of 1781)
UNSUPPORTED: lldb-api :: functionalities/darwin_log/filter/regex/category/TestDarwinLogFilterRegexCategory.py (1392 of 1781)
PASS: lldb-unit :: Core/./LLDBCoreTests/MangledTest.EmptyForInvalidName (1393 of 1781)
PASS: lldb-unit :: Utility/./UtilityTests/AnsiTerminal.Twice (1394 of 1781)
PASS: lldb-unit :: Symbol/./SymbolTests/TestClangASTContext.TestIsClangType (1395 of 1781)
PASS: lldb-unit :: ScriptInterpreter/Python/./ScriptInterpreterPythonTests/PythonDataObjectsTest.TestTypeNameResolutionNoDot (1396 of 1781)
UNSUPPORTED: lldb-api :: tools/lldb-vscode/launch/TestVSCode_launch.py (1397 of 1781)
PASS: lldb-api :: lang/cpp/signed_types/TestSignedTypes.py (1398 of 1781)
PASS: lldb-unit :: Utility/./UtilityTests/UriParserTest.TypicalPortPath (1399 of 1781)
PASS: lldb-shell :: SymbolFile/NativePDB/break-by-function.cpp (1400 of 1781)
PASS: lldb-unit :: Utility/./UtilityTests/RangeTest.SlideZero (1401 of 1781)
PASS: lldb-api :: python_api/exprpath_synthetic/TestExprPathSynthetic.py (1402 of 1781)
PASS: lldb-api :: functionalities/thread/concurrent_events/TestConcurrentBreakpointOneDelayBreakpointThreads.py (1403 of 1781)
PASS: lldb-unit :: Utility/./UtilityTests/StringExtractorTest.GetHexBytes_Partial (1404 of 1781)
PASS: lldb-unit :: Expression/./ExpressionTests/DWARFExpression.DW_OP_convert (1405 of 1781)
PASS: lldb-unit :: Utility/./UtilityTests/StringListTest.ForRangeEmpty (1406 of 1781)
PASS: lldb-api :: functionalities/thread/concurrent_events/TestConcurrentCrashWithWatchpoint.py (1407 of 1781)
UNSUPPORTED: lldb-shell :: Register/x86-64-xmm16-write.test (1408 of 1781)
PASS: lldb-shell :: SymbolFile/NativePDB/disassembly.cpp (1409 of 1781)
PASS: lldb-api :: commands/expression/call-throws/TestCallThatThrows.py (1410 of 1781)
XFAIL: lldb-shell :: Register/x86-mm-xmm-read.test (1411 of 1781)
XFAIL: lldb-shell :: Register/x86-64-write.test (1412 of 1781)
PASS: lldb-unit :: Utility/./UtilityTests/CompletionRequest.FakeLastArg (1413 of 1781)
PASS: lldb-api :: functionalities/thread/concurrent_events/TestConcurrentTwoBreakpointsOneDelaySignal.py (1414 of 1781)
PASS: lldb-api :: python_api/symbol-context/TestSymbolContext.py (1415 of 1781)
PASS: lldb-api :: lang/objc/modules-inline-functions/TestModulesInlineFunctions.py (1416 of 1781)
PASS: lldb-unit :: Utility/./UtilityTests/AnsiTerminal.Unknown (1417 of 1781)
PASS: lldb-api :: functionalities/data-formatter/ostypeformatting/TestFormattersOsType.py (1418 of 1781)
UNSUPPORTED: lldb-api :: functionalities/signal/handle-segv/TestHandleSegv.py (1419 of 1781)
PASS: lldb-shell :: SymbolFile/DWARF/find-basic-type.cpp (1420 of 1781)
PASS: lldb-shell :: Commands/CommandScriptImmediateOutput/CommandScriptImmediateOutputFile.test (1421 of 1781)
PASS: lldb-unit :: Utility/./UtilityTests/Flags.Test (1422 of 1781)
PASS: lldb-unit :: Symbol/./SymbolTests/PostfixExpression.ToDWARF (1423 of 1781)
PASS: lldb-api :: functionalities/dynamic_value_child_count/TestDynamicValueChildCount.py (1424 of 1781)
PASS: lldb-api :: commands/expression/persistent_variables/TestPersistentVariables.py (1425 of 1781)
PASS: lldb-api :: functionalities/breakpoint/require_hw_breakpoints/TestRequireHWBreakpoints.py (1426 of 1781)
PASS: lldb-api :: python_api/frame/TestFrames.py (1427 of 1781)
PASS: lldb-unit :: Utility/./UtilityTests/StringExtractorTest.GetU64LittleEndian (1428 of 1781)
PASS: lldb-api :: functionalities/breakpoint/breakpoint_language/TestBreakpointLanguage.py (1429 of 1781)
PASS: lldb-api :: functionalities/type_lookup/TestTypeLookup.py (1430 of 1781)
PASS: lldb-shell :: Heap/heap-cstr.test (1431 of 1781)
PASS: lldb-api :: lang/cpp/modules-import/TestCXXModulesImport.py (1432 of 1781)
PASS: lldb-api :: functionalities/breakpoint/consecutive_breakpoints/TestConsecutiveBreakpoints.py (1433 of 1781)
PASS: lldb-api :: lang/cpp/nested-class-other-compilation-unit/TestNestedClassWithParentInAnotherCU.py (1434 of 1781)
PASS: lldb-unit :: Utility/./UtilityTests/ArgsTest.TestUnknownEscape (1435 of 1781)
PASS: lldb-api :: macosx/nslog/TestDarwinNSLogOutput.py (1436 of 1781)
PASS: lldb-unit :: UnwindAssembly/x86/./UnwindAssemblyx86Tests/Testx86AssemblyInspectionEngine.TestPushExtended (1437 of 1781)
PASS: lldb-api :: functionalities/breakpoint/breakpoint_command/TestRegexpBreakCommand.py (1438 of 1781)
PASS: lldb-unit :: ObjectFile/Breakpad/./ObjectFileBreakpadTests/PublicRecord.parse (1439 of 1781)
PASS: lldb-api :: macosx/duplicate-archive-members/TestDuplicateMembers.py (1440 of 1781)
PASS: lldb-api :: functionalities/modern-type-lookup/libcxx/TestLibCxxModernTypeLookup.py (1441 of 1781)
PASS: lldb-unit :: Utility/./UtilityTests/ScalarTest.Promotion (1442 of 1781)
PASS: lldb-api :: python_api/formatters/TestFormattersSBAPI.py (1443 of 1781)
PASS: lldb-unit :: Utility/./UtilityTests/StreamTest.PutHex64ByteOrderLittle (1444 of 1781)
PASS: lldb-api :: driver/batch_mode/TestBatchMode.py (1445 of 1781)
PASS: lldb-api :: functionalities/data-formatter/data-formatter-stl/libcxx/vector/TestDataFormatterLibcxxVector.py (1446 of 1781)
PASS: lldb-unit :: Utility/./UtilityTests/StreamTest.PutChar (1447 of 1781)
PASS: lldb-api :: functionalities/breakpoint/breakpoint_ids/TestBreakpointIDs.py (1448 of 1781)
PASS: lldb-api :: lang/cpp/scope/TestCppScope.py (1449 of 1781)
PASS: lldb-api :: lang/objc/forward-decl/TestForwardDecl.py (1450 of 1781)
UNSUPPORTED: lldb-shell :: SymbolFile/PDB/class-layout.test (1451 of 1781)
PASS: lldb-unit :: Host/./HostTests/MainLoopTest.UnmonitoredSignal (1452 of 1781)
PASS: lldb-unit :: UnwindAssembly/x86/./UnwindAssemblyx86Tests/Testx86AssemblyInspectionEngine.TestAddESP (1453 of 1781)
PASS: lldb-unit :: Utility/./UtilityTests/RangeTest.Equal (1454 of 1781)
PASS: lldb-unit :: Target/./TargetTests/PathMappingListTest.RemapRoot (1455 of 1781)
PASS: lldb-api :: commands/frame/recognizer/TestFrameRecognizer.py (1456 of 1781)
PASS: lldb-shell :: SymbolFile/Breakpad/unwind-via-stack-cfi.test (1457 of 1781)
PASS: lldb-api :: commands/expression/import-std-module/shared_ptr-dbg-info-content/TestSharedPtrDbgInfoContent.py (1458 of 1781)
PASS: lldb-api :: commands/expression/two-files/TestObjCTypeQueryFromOtherCompileUnit.py (1459 of 1781)
UNSUPPORTED: lldb-api :: lang/cpp/printf/TestPrintf.py (1460 of 1781)
PASS: lldb-unit :: Host/./HostTests/MainLoopTest.DetectsEOF (1461 of 1781)
PASS: lldb-unit :: Symbol/./SymbolTests/LineEntryTest.GetSameLineContiguousAddressRangeNoInlines (1462 of 1781)
PASS: lldb-unit :: ScriptInterpreter/Python/./ScriptInterpreterPythonTests/PythonDataObjectsTest.TestPythonTupleSize (1463 of 1781)
PASS: lldb-shell :: SymbolFile/DWARF/debug-types-signature-loop.s (1464 of 1781)
PASS: lldb-api :: functionalities/conditional_break/TestConditionalBreak.py (1465 of 1781)
PASS: lldb-unit :: Utility/./UtilityTests/BinaryStreamTest.PutSLEB128ThreeBytes (1466 of 1781)
PASS: lldb-unit :: Utility/./UtilityTests/StreamTeeTest.Write (1467 of 1781)
PASS: lldb-unit :: Expression/./ExpressionTests/DiagnosticManagerTest.GetStringMultipleDiags (1468 of 1781)
PASS: lldb-shell :: SymbolFile/DWARF/split-dwarf-inlining.cpp (1469 of 1781)
PASS: lldb-unit :: Language/Highlighting/./HighlighterTests/HighlighterTest.ClangOperators (1470 of 1781)
PASS: lldb-api :: functionalities/thread/concurrent_events/TestConcurrentManyCrash.py (1471 of 1781)
PASS: lldb-unit :: Utility/./UtilityTests/RangeDataVector.FindEntryThatContains (1472 of 1781)
PASS: lldb-unit :: Utility/./UtilityTests/IndexToObjectTest.ObjectForIndex (1473 of 1781)
PASS: lldb-unit :: Utility/./UtilityTests/StringLexerTest.NextIfList (1474 of 1781)
PASS: lldb-unit :: Utility/./UtilityTests/OptionsWithRawTest.WhitespaceSuffix (1475 of 1781)
PASS: lldb-api :: python_api/type/TestTypeList.py (1476 of 1781)
PASS: lldb-unit :: Utility/./UtilityTests/NameMatchesTest.Ignore (1477 of 1781)
PASS: lldb-unit :: Utility/./UtilityTests/UriParserTest.MinimalPortPath (1478 of 1781)
PASS: lldb-api :: python_api/interpreter/TestCommandInterpreterAPI.py (1479 of 1781)
PASS: lldb-unit :: Utility/./UtilityTests/StreamTeeTest.GetStreamAtIndexOutOfBounds (1480 of 1781)
UNSUPPORTED: lldb-shell :: ObjectFile/ELF/minidebuginfo-set-and-hit-breakpoint.test (1481 of 1781)
PASS: lldb-unit :: Utility/./UtilityTests/StringListTest.InsertStringAtIndexStdString (1482 of 1781)
PASS: lldb-unit :: Language/Highlighting/./HighlighterTests/HighlighterTest.DefaultHighlighterWithCursorOutOfBounds (1483 of 1781)
PASS: lldb-api :: tools/lldb-server/TestGdbRemoteExitCode.py (1484 of 1781)
PASS: lldb-unit :: Process/minidump/./LLDBMinidumpTests/MinidumpParserTest.GetPid (1485 of 1781)
PASS: lldb-unit :: Utility/./UtilityTests/LogChannelEnabledTest.LogGetLogThread (1486 of 1781)
PASS: lldb-unit :: ScriptInterpreter/Python/./ScriptInterpreterPythonTests/PythonDataObjectsTest.TestPythonStringToStructuredString (1487 of 1781)
PASS: lldb-unit :: Utility/./UtilityTests/DataExtractorTest.GetMaxS64 (1488 of 1781)
PASS: lldb-unit :: Expression/./ExpressionTests/DiagnosticManagerTest.AddDiagnostic (1489 of 1781)
PASS: lldb-unit :: Utility/./UtilityTests/StringListTest.CopyListEmpty (1490 of 1781)
PASS: lldb-api :: lang/objcxx/cxx-bridged-po/TestObjCXXBridgedPO.py (1491 of 1781)
PASS: lldb-unit :: Utility/./UtilityTests/VMRange.IsValid (1492 of 1781)
PASS: lldb-api :: lang/cpp/incomplete-types/TestCppIncompleteTypes.py (1493 of 1781)
PASS: lldb-api :: functionalities/data-formatter/hexcaps/TestDataFormatterHexCaps.py (1494 of 1781)
PASS: lldb-shell :: SymbolFile/DWARF/find-variable-file.cpp (1495 of 1781)
PASS: lldb-api :: types/TestDoubleTypes.py (1496 of 1781)
PASS: lldb-unit :: Utility/./UtilityTests/FileSpecTest.EqualDotsPosix (1497 of 1781)
PASS: lldb-api :: functionalities/breakpoint/breakpoint_set_restart/TestBreakpointSetRestart.py (1498 of 1781)
PASS: lldb-api :: lang/objc/objc-struct-return/TestObjCStructReturn.py (1499 of 1781)
PASS: lldb-api :: lang/cpp/stl/TestSTL.py (1500 of 1781)
PASS: lldb-unit :: Utility/./UtilityTests/ArgsTest.TestQuotedTrailingBackslash (1501 of 1781)
PASS: lldb-api :: lang/cpp/auto/TestCPPAuto.py (1502 of 1781)
PASS: lldb-api :: lang/cpp/namespace/TestNamespace.py (1503 of 1781)
PASS: lldb-unit :: Utility/./UtilityTests/StreamTest.PutHex32ByteOrderLittle (1504 of 1781)
PASS: lldb-unit :: Utility/./UtilityTests/BroadcasterTest.BroadcastEvent (1505 of 1781)
PASS: lldb-api :: commands/gui/invalid-args/TestInvalidArgsGui.py (1506 of 1781)
PASS: lldb-api :: functionalities/data-formatter/frameformat_smallstruct/TestFrameFormatSmallStruct.py (1507 of 1781)
PASS: lldb-unit :: Utility/./UtilityTests/RangeTest.LessThan (1508 of 1781)
PASS: lldb-api :: lang/objc/foundation/TestFoundationDisassembly.py (1509 of 1781)
PASS: lldb-unit :: Utility/./UtilityTests/ScalarTest.APIntConstructor (1510 of 1781)
PASS: lldb-unit :: Utility/./UtilityTests/StringListTest.LongestCommonPrefixSingleElement (1511 of 1781)
PASS: lldb-unit :: Process/gdb-remote/./ProcessGdbRemoteTests/GDBRemoteCommunicationClientTest.TestPacketSpeedJSON (1512 of 1781)
UNSUPPORTED: lldb-api :: commands/expression/multiline-completion/TestMultilineCompletion.py (1513 of 1781)
PASS: lldb-unit :: Utility/./UtilityTests/ArchSpecTest.TestSetTriple (1514 of 1781)
PASS: lldb-unit :: Utility/./UtilityTests/StreamTeeTest.SetStreamAtIndexOverwrite (1515 of 1781)
PASS: lldb-unit :: Process/minidump/./LLDBMinidumpTests/MinidumpParserTest.MinidumpDuplicateModuleMinAddress (1516 of 1781)
UNSUPPORTED: lldb-shell :: SymbolFile/NativePDB/stack_unwinding01.cpp (1517 of 1781)
PASS: lldb-unit :: Utility/./UtilityTests/StringExtractorTest.DecodeHexU8_InvalidHex (1518 of 1781)
PASS: lldb-unit :: Utility/./UtilityTests/BinaryStreamTest.PutSLEB128FourBytes (1519 of 1781)
PASS: lldb-unit :: Process/gdb-remote/./ProcessGdbRemoteTests/GDBRemoteCommunicationClientTest.GetMemoryRegionInfo (1520 of 1781)
PASS: lldb-unit :: Symbol/./SymbolTests/TestClangASTContext.TestUnifyAccessSpecifiers (1521 of 1781)
PASS: lldb-api :: functionalities/data-formatter/language_category_updates/TestDataFormatterLanguageCategoryUpdates.py (1522 of 1781)
UNSUPPORTED: lldb-api :: tools/lldb-vscode/variables/TestVSCode_variables.py (1523 of 1781)
PASS: lldb-unit :: Symbol/./SymbolTests/PostfixExpression.ParseFPOProgram (1524 of 1781)
PASS: lldb-api :: commands/source/info/TestSourceInfo.py (1525 of 1781)
PASS: lldb-unit :: Utility/./UtilityTests/RegularExpression.Match (1526 of 1781)
PASS: lldb-api :: python_api/process/io/TestProcessIO.py (1527 of 1781)
PASS: lldb-shell :: SymbolFile/DWARF/debug-types-basic.test (1528 of 1781)
PASS: lldb-unit :: Utility/./UtilityTests/BroadcasterTest.EventTypeHasListeners (1529 of 1781)
PASS: lldb-unit :: Language/Highlighting/./HighlighterTests/HighlighterTest.ClangCursorOutOfBounds (1530 of 1781)
PASS: lldb-unit :: ScriptInterpreter/Python/./ScriptInterpreterPythonTests/PythonDataObjectsTest.TestPythonListToStructuredList (1531 of 1781)
PASS: lldb-api :: functionalities/data-formatter/data-formatter-objc/TestDataFormatterObjCNSData.py (1532 of 1781)
PASS: lldb-shell :: ObjectFile/ELF/PT_LOAD.yaml (1533 of 1781)
PASS: lldb-api :: commands/target/stop-hooks/TestStopHooks.py (1534 of 1781)
PASS: lldb-shell :: Settings/TestDisassemblyFormat.test (1535 of 1781)
PASS: lldb-unit :: Host/./HostTests/FileSystemTest.Resolve (1536 of 1781)
PASS: lldb-api :: commands/expression/import-std-module/unique_ptr-dbg-info-content/TestUniquePtrDbgInfoContent.py (1537 of 1781)
UNSUPPORTED: lldb-shell :: Expr/TestIRMemoryMapWindows.test (1538 of 1781)
PASS: lldb-unit :: Utility/./UtilityTests/VASprintfTest.EncodingError (1539 of 1781)
PASS: lldb-unit :: Symbol/./SymbolTests/DWARFCallFrameInfoTest.Basic_dwarf3 (1540 of 1781)
PASS: lldb-api :: functionalities/data-formatter/data-formatter-objc/TestDataFormatterObjCNSBundle.py (1541 of 1781)
PASS: lldb-api :: commands/expression/ir-interpreter-phi-nodes/TestIRInterpreterPHINodes.py (1542 of 1781)
PASS: lldb-api :: lang/c/set_values/TestSetValues.py (1543 of 1781)
PASS: lldb-unit :: Utility/./UtilityTests/GeneratorTest.Create (1544 of 1781)
PASS: lldb-unit :: Host/./HostTests/SocketTest.TCPGetConnectURI (1545 of 1781)
PASS: lldb-unit :: Process/minidump/./LLDBMinidumpTests/MinidumpParserTest.GetMemoryRegionInfoLinuxMaps (1546 of 1781)
PASS: lldb-unit :: Utility/./UtilityTests/StreamTest.PutCStringWithStringRef (1547 of 1781)
PASS: lldb-unit :: Utility/./UtilityTests/CompletionRequest.Constructor (1548 of 1781)
PASS: lldb-api :: functionalities/breakpoint/auto_continue/TestBreakpointAutoContinue.py (1549 of 1781)
PASS: lldb-unit :: Utility/./UtilityTests/CompletionRequest.DuplicateFilteringWithComments (1550 of 1781)
PASS: lldb-unit :: Utility/./UtilityTests/ConstStringTest.UpdateMangledCounterpart (1551 of 1781)
PASS: lldb-api :: commands/settings/quoting/TestQuoting.py (1552 of 1781)
PASS: lldb-api :: lang/cpp/static_methods/TestCPPStaticMethods.py (1553 of 1781)
UNSUPPORTED: lldb-shell :: SymbolFile/PDB/function-nested-block.test (1554 of 1781)
PASS: lldb-api :: lang/cpp/exceptions/TestCPPExceptionBreakpoints.py (1555 of 1781)
PASS: lldb-api :: lang/cpp/chained-calls/TestCppChainedCalls.py (1556 of 1781)
PASS: lldb-unit :: Utility/./UtilityTests/UriParserTest.BadPort2 (1557 of 1781)
PASS: lldb-unit :: ScriptInterpreter/Python/./ScriptInterpreterPythonTests/PythonDataObjectsTest.TestResetting (1558 of 1781)
PASS: lldb-shell :: SymbolFile/NativePDB/break-by-line.cpp (1559 of 1781)
PASS: lldb-api :: api/log/TestAPILog.py (1560 of 1781)
PASS: lldb-api :: functionalities/data-formatter/type_summary_list_script/TestTypeSummaryListScript.py (1561 of 1781)
PASS: lldb-unit :: ScriptInterpreter/Python/./ScriptInterpreterPythonTests/PythonDataObjectsTest.TestPythonCallableCheck (1562 of 1781)
PASS: lldb-unit :: Utility/./UtilityTests/StreamTest.PutBytesAsRawHex8ToMixedEndian (1563 of 1781)
PASS: lldb-api :: python_api/sblaunchinfo/TestSBLaunchInfo.py (1564 of 1781)
PASS: lldb-unit :: UnwindAssembly/x86/./UnwindAssemblyx86Tests/Testx86AssemblyInspectionEngine.TestPopRBX (1565 of 1781)
XFAIL: lldb-shell :: SymbolFile/DWARF/find-type-in-function.cpp (1566 of 1781)
PASS: lldb-unit :: Platform/./LLDBPlatformTests/PlatformDarwinTest.TestParseVersionBuildDir (1567 of 1781)
PASS: lldb-api :: api/multiple-targets/TestMultipleTargets.py (1568 of 1781)
UNSUPPORTED: lldb-api :: commands/gui/basic/TestGuiBasic.py (1569 of 1781)
PASS: lldb-api :: commands/expression/options/TestExprOptions.py (1570 of 1781)
PASS: lldb-unit :: Utility/./UtilityTests/StringListTest.AppendList (1571 of 1781)
UNSUPPORTED: lldb-api :: tools/lldb-server/thread-name/TestGdbRemoteThreadName.py (1572 of 1781)
PASS: lldb-api :: functionalities/gdb_remote_client/TestWriteMemory.py (1573 of 1781)
PASS: lldb-unit :: Utility/./UtilityTests/StreamTest.PutStringAsRawHex8 (1574 of 1781)
PASS: lldb-api :: commands/expression/unicode-in-variable/TestUnicodeInVariable.py (1575 of 1781)
PASS: lldb-api :: functionalities/signal/handle-abrt/TestHandleAbort.py (1576 of 1781)
PASS: lldb-api :: python_api/watchpoint/TestSetWatchpoint.py (1577 of 1781)
PASS: lldb-api :: functionalities/data-formatter/data-formatter-stl/libcxx/iterator/TestDataFormatterLibccIterator.py (1578 of 1781)
PASS: lldb-unit :: Symbol/./SymbolTests/SymbolsTest.TerminateLocateExecutableSymbolFileForUnknownExecutableAndUnknownSymbolFile (1579 of 1781)
PASS: lldb-api :: commands/expression/invalid-args/TestInvalidArgsExpression.py (1580 of 1781)
PASS: lldb-api :: python_api/sbstructureddata/TestStructuredDataAPI.py (1581 of 1781)
PASS: lldb-api :: functionalities/paths/TestPaths.py (1582 of 1781)
PASS: lldb-unit :: Language/Highlighting/./HighlighterTests/HighlighterTest.FallbackHighlighter (1583 of 1781)
PASS: lldb-shell :: SymbolFile/DWARF/debug-types-missing-signature.test (1584 of 1781)
PASS: lldb-unit :: Utility/./UtilityTests/StringLexerTest.PutBack (1585 of 1781)
PASS: lldb-unit :: Utility/./UtilityTests/RangeTest.Copy (1586 of 1781)
PASS: lldb-unit :: UnwindAssembly/x86/./UnwindAssemblyx86Tests/Testx86AssemblyInspectionEngine.Test32bitFramelessSmallStackFrame (1587 of 1781)
PASS: lldb-unit :: Host/./HostTests/ProcessLaunchInfoTest.Constructor (1588 of 1781)
PASS: lldb-api :: lang/cpp/gmodules-templates/TestGModules.py (1589 of 1781)
PASS: lldb-unit :: Utility/./UtilityTests/StringListTest.AppendListCStringArrayEmpty (1590 of 1781)
PASS: lldb-unit :: UnwindAssembly/x86/./UnwindAssemblyx86Tests/Testx86AssemblyInspectionEngine.TestPushRBPWithREX (1591 of 1781)
PASS: lldb-api :: functionalities/dead-strip/TestDeadStrip.py (1592 of 1781)
PASS: lldb-unit :: Language/Highlighting/./HighlighterTests/HighlighterTest.ClangPPDirectives (1593 of 1781)
PASS: lldb-unit :: Utility/./UtilityTests/RecordReplayTest.InstrumentedBarPtr (1594 of 1781)
PASS: lldb-api :: lang/c/offsetof/TestOffsetof.py (1595 of 1781)
PASS: lldb-unit :: Symbol/./SymbolTests/TestClangASTContext.TestBuiltinTypeForEncodingAndBitSize (1596 of 1781)
PASS: lldb-unit :: Utility/./UtilityTests/NameMatchesTest.EndsWith (1597 of 1781)
PASS: lldb-unit :: Utility/./UtilityTests/VMRange.CollectionContains (1598 of 1781)
PASS: lldb-unit :: Utility/./UtilityTests/RegularExpression.CopyAssignment (1599 of 1781)
PASS: lldb-unit :: Expression/./ExpressionTests/CppModuleConfigurationTest.IgnoreLibStdCpp (1600 of 1781)
PASS: lldb-unit :: Utility/./UtilityTests/UUIDTest.Validity (1601 of 1781)
PASS: lldb-api :: functionalities/mtc/simple/TestMTCSimple.py (1602 of 1781)
PASS: lldb-unit :: debugserver/./debugserverTests/RNBSocket.AnyListen (1603 of 1781)
PASS: lldb-shell :: SymbolFile/DWARF/debug_aranges-empty-section.s (1604 of 1781)
PASS: lldb-unit :: UnwindAssembly/x86/./UnwindAssemblyx86Tests/Testx86AssemblyInspectionEngine.TestSpillRegToStackViaMOVi386 (1605 of 1781)
PASS: lldb-api :: functionalities/postmortem/minidump/TestMiniDump.py (1606 of 1781)
PASS: lldb-api :: python_api/watchpoint/watchlocation/TestSetWatchlocation.py (1607 of 1781)
PASS: lldb-api :: commands/disassemble/basic/TestDisassembleBreakpoint.py (1608 of 1781)
PASS: lldb-unit :: Expression/./ExpressionTests/CppModuleConfigurationTest.MissingUsrInclude (1609 of 1781)
PASS: lldb-unit :: Utility/./UtilityTests/DeserializerTest.HasData (1610 of 1781)
UNSUPPORTED: lldb-shell :: Unwind/unwind-plan-dwarf-dump.test (1611 of 1781)
PASS: lldb-api :: commands/apropos/with-process/TestAproposWithProcess.py (1612 of 1781)
PASS: lldb-unit :: Process/gdb-remote/./ProcessGdbRemoteTests/GDBRemoteClientBaseTest.InterruptNoResponse (1613 of 1781)
PASS: lldb-unit :: Symbol/./SymbolTests/TestClangASTContext.TestGetBasicTypeFromName (1614 of 1781)
PASS: lldb-api :: functionalities/breakpoint/breakpoint_command/TestBreakpointCommand.py (1615 of 1781)
PASS: lldb-api :: lang/c/struct_types/TestStructTypes.py (1616 of 1781)
PASS: lldb-unit :: Utility/./UtilityTests/StreamTest.PutMaxHex64ByteOrderBig (1617 of 1781)
PASS: lldb-unit :: ObjectFile/PECOFF/./ObjectFilePECOFFTests/PECallFrameInfoTest.Basic_eh (1618 of 1781)
PASS: lldb-shell :: SymbolFile/NativePDB/global-classes.cpp (1619 of 1781)
PASS: lldb-api :: functionalities/thread/concurrent_events/TestConcurrentDelaySignalWatch.py (1620 of 1781)
PASS: lldb-api :: commands/frame/diagnose/dereference-argument/TestDiagnoseDereferenceArgument.py (1621 of 1781)
PASS: lldb-api :: functionalities/postmortem/elf-core/gcore/TestGCore.py (1622 of 1781)
PASS: lldb-api :: functionalities/thread/concurrent_events/TestConcurrentSignalDelayBreak.py (1623 of 1781)
PASS: lldb-api :: python_api/name_lookup/TestNameLookup.py (1624 of 1781)
PASS: lldb-unit :: Utility/./UtilityTests/StringExtractorTest.GetHexU8_Underflow (1625 of 1781)
PASS: lldb-api :: functionalities/recursion/TestValueObjectRecursion.py (1626 of 1781)
PASS: lldb-api :: functionalities/breakpoint/breakpoint_names/TestBreakpointNames.py (1627 of 1781)
PASS: lldb-shell :: ObjectFile/ELF/gnu-debuglink.yaml (1628 of 1781)
PASS: lldb-unit :: UnwindAssembly/x86/./UnwindAssemblyx86Tests/Testx86AssemblyInspectionEngine.TestPopRBPWithREX (1629 of 1781)
PASS: lldb-unit :: Utility/./UtilityTests/RangeTest.ContainsRangeStartingFromZero (1630 of 1781)
PASS: lldb-unit :: Utility/./UtilityTests/RangeTest.SetRangeBase (1631 of 1781)
XFAIL: lldb-shell :: Register/x86-64-ymm-write.test (1632 of 1781)
PASS: lldb-shell :: SymbolFile/DWARF/find-variable-dwo.cpp (1633 of 1781)
PASS: lldb-api :: functionalities/pre_run_dylibs/TestPreRunDylibs.py (1634 of 1781)
PASS: lldb-shell :: ObjectFile/ELF/build-id-case.yaml (1635 of 1781)
PASS: lldb-api :: functionalities/tail_call_frames/ambiguous_tail_call_seq1/TestAmbiguousTailCallSeq1.py (1636 of 1781)
UNSUPPORTED: lldb-api :: functionalities/process_save_core/TestProcessSaveCore.py (1637 of 1781)
PASS: lldb-unit :: Host/./HostTests/ConnectionFileDescriptorTest.TCPGetURIv4 (1638 of 1781)
UNSUPPORTED: lldb-api :: tools/lldb-vscode/step/TestVSCode_step.py (1639 of 1781)
UNSUPPORTED: lldb-api :: commands/expression/completion-crash-incomplete-record/TestCompletionCrashIncompleteRecord.py (1640 of 1781)
PASS: lldb-api :: functionalities/gdb_remote_client/TestArmRegisterDefinition.py (1641 of 1781)
PASS: lldb-unit :: Expression/./ExpressionTests/DiagnosticManagerTest.GetStringBasic (1642 of 1781)
PASS: lldb-shell :: Breakpoint/split-dwarf-5-addrbase.test (1643 of 1781)
PASS: lldb-api :: python_api/findvalue_duplist/TestSBFrameFindValue.py (1644 of 1781)
PASS: lldb-unit :: Process/gdb-remote/./ProcessGdbRemoteTests/GDBRemoteCommunicationClientTest.SendGetTraceConfigPacket (1645 of 1781)
PASS: lldb-unit :: Expression/./ExpressionTests/ClangHostTest.MacOSX (1646 of 1781)
PASS: lldb-shell :: Register/x86-64-read.test (1647 of 1781)
PASS: lldb-api :: functionalities/breakpoint/debugbreak/TestDebugBreak.py (1648 of 1781)
PASS: lldb-unit :: Language/Highlighting/./HighlighterTests/HighlighterTest.ClangStringLiterals (1649 of 1781)
PASS: lldb-unit :: Utility/./UtilityTests/GeneratorTest.Get (1650 of 1781)
PASS: lldb-unit :: Language/Highlighting/./HighlighterTests/HighlighterTest.ClangCursorPos (1651 of 1781)
PASS: lldb-unit :: Utility/./UtilityTests/StringListTest.DefaultConstructor (1652 of 1781)
PASS: lldb-unit :: Utility/./UtilityTests/ArchSpecTest.TestParseMachCPUDashSubtypeTripleExtra (1653 of 1781)
PASS: lldb-shell :: SymbolFile/DWARF/compilercontext.ll (1654 of 1781)
PASS: lldb-unit :: Utility/./UtilityTests/SerializationRountripTest.SerializeDeserializeObjectReference (1655 of 1781)
PASS: lldb-api :: commands/apropos/basic/TestApropos.py (1656 of 1781)
PASS: lldb-api :: functionalities/postmortem/mach-core/TestMachCore.py (1657 of 1781)
PASS: lldb-api :: lang/objc/modules-incomplete/TestIncompleteModules.py (1658 of 1781)
PASS: lldb-api :: lang/objc/print-obj/TestPrintObj.py (1659 of 1781)
PASS: lldb-unit :: UnwindAssembly/x86/./UnwindAssemblyx86Tests/Testx86AssemblyInspectionEngine.TestStackRealign8BitDisp_i386 (1660 of 1781)
UNSUPPORTED: lldb-api :: functionalities/tty/TestTerminal.py (1661 of 1781)
PASS: lldb-api :: functionalities/thread/step_out/TestThreadStepOut.py (1662 of 1781)
PASS: lldb-api :: commands/expression/dollar-in-variable/TestDollarInVariable.py (1663 of 1781)
PASS: lldb-api :: functionalities/target_var/TestTargetVar.py (1664 of 1781)
PASS: lldb-api :: lang/cpp/overloaded-functions/TestOverloadedFunctions.py (1665 of 1781)
PASS: lldb-unit :: Utility/./UtilityTests/ScalarTest.RightShiftOperator (1666 of 1781)
PASS: lldb-api :: functionalities/gdb_remote_client/TestNoWatchpointSupportInfo.py (1667 of 1781)
PASS: lldb-unit :: Host/./HostTests/SocketTest.DecodeHostAndPort (1668 of 1781)
UNSUPPORTED: lldb-api :: commands/register/register/intel_xtended_registers/TestMPXRegisters.py (1669 of 1781)
PASS: lldb-unit :: Utility/./UtilityTests/OptionsWithRawTest.SingleWordSuffix (1670 of 1781)
UNSUPPORTED: lldb-api :: tools/lldb-vscode/breakpoint/TestVSCode_setBreakpoints.py (1671 of 1781)
PASS: lldb-unit :: Utility/./UtilityTests/UUIDTest.RelationalOperators (1672 of 1781)
PASS: lldb-api :: python_api/watchpoint/TestWatchpointIter.py (1673 of 1781)
PASS: lldb-unit :: Interpreter/./InterpreterTests/OptionArgParserTest.toChar (1674 of 1781)
PASS: lldb-api :: lang/objc/objc++/TestObjCXX.py (1675 of 1781)
PASS: lldb-unit :: Editline/./EditlineTests/EditlineTestFixture.EditlineReceivesMultiLineText (1676 of 1781)
PASS: lldb-unit :: UnwindAssembly/x86/./UnwindAssemblyx86Tests/Testx86AssemblyInspectionEngine.TestPushEAX (1677 of 1781)
PASS: lldb-api :: commands/expression/persistent_ptr_update/TestPersistentPtrUpdate.py (1678 of 1781)
PASS: lldb-shell :: SymbolFile/sizeless-symbol.test (1679 of 1781)
PASS: lldb-shell :: Commands/command-script-import.test (1680 of 1781)
PASS: lldb-unit :: Utility/./UtilityTests/StringListTest.RemoveBlankLines (1681 of 1781)
PASS: lldb-unit :: debugserver/./debugserverTests/RNBSocket.LoopBackListenIPv6 (1682 of 1781)
PASS: lldb-unit :: Utility/./UtilityTests/StringListTest.ShiftMove (1683 of 1781)
PASS: lldb-api :: functionalities/thread/backtrace_limit/TestBacktraceLimit.py (1684 of 1781)
PASS: lldb-api :: functionalities/data-formatter/type_summary_list_arg/TestTypeSummaryListArg.py (1685 of 1781)
UNSUPPORTED: lldb-shell :: SymbolFile/PDB/enums-layout.test (1686 of 1781)
PASS: lldb-api :: functionalities/tail_call_frames/ambiguous_tail_call_seq2/TestAmbiguousTailCallSeq2.py (1687 of 1781)
PASS: lldb-unit :: Utility/./UtilityTests/SerializationRountripTest.SerializeDeserializePodReferences (1688 of 1781)
PASS: lldb-api :: functionalities/data-formatter/data-formatter-ptr-to-array/TestPtrToArrayFormatting.py (1689 of 1781)
PASS: lldb-api :: functionalities/breakpoint/objc/TestObjCBreakpoints.py (1690 of 1781)
PASS: lldb-shell :: Watchpoint/SetErrorCases.test (1691 of 1781)
PASS: lldb-api :: lang/objc/variadic_methods/TestVariadicMethods.py (1692 of 1781)
PASS: lldb-api :: commands/expression/inline-namespace/TestInlineNamespace.py (1693 of 1781)
PASS: lldb-unit :: Utility/./UtilityTests/VMRange.ContainsAddr (1694 of 1781)
PASS: lldb-unit :: Utility/./UtilityTests/StreamTest.PutHex16ByteOrderBig (1695 of 1781)
PASS: lldb-api :: functionalities/data-formatter/data-formatter-stl/libcxx/tuple/TestDataFormatterLibcxxTuple.py (1696 of 1781)
PASS: lldb-shell :: Reproducer/TestDump.test (1697 of 1781)
PASS: lldb-unit :: ScriptInterpreter/Python/./ScriptInterpreterPythonTests/PythonDataObjectsTest.TestDictionaryResolutionWithDot (1698 of 1781)
PASS: lldb-api :: python_api/lldbutil/iter/TestLLDBIterator.py (1699 of 1781)
PASS: lldb-api :: functionalities/data-formatter/data-formatter-skip-summary/TestDataFormatterSkipSummary.py (1700 of 1781)
PASS: lldb-unit :: Utility/./UtilityTests/FileSpecTest.EqualDotsWindows (1701 of 1781)
PASS: lldb-unit :: ScriptInterpreter/Python/./ScriptInterpreterPythonTests/PythonDataObjectsTest.TestPythonCallableInvoke (1702 of 1781)
PASS: lldb-unit :: Symbol/./SymbolTests/LineEntryTest.GetSameLineContiguousAddressRangeOneInline (1703 of 1781)
PASS: lldb-unit :: Target/./TargetTests/ExecutionContextTest.GetByteOrder (1704 of 1781)
PASS: lldb-shell :: SymbolFile/DWARF/gnu-style-compression.cpp (1705 of 1781)
PASS: lldb-api :: lang/objc/foundation/TestSymbolTable.py (1706 of 1781)
PASS: lldb-api :: commands/expression/po_verbosity/TestPoVerbosity.py (1707 of 1781)
UNSUPPORTED: lldb-shell :: SymbolFile/PDB/expressions.test (1708 of 1781)
PASS: lldb-unit :: Host/./HostTests/ConnectionFileDescriptorTest.TCPGetURIv6 (1709 of 1781)
PASS: lldb-unit :: Process/minidump/./LLDBMinidumpTests/RegisterContextMinidump.ConvertMinidumpContext_x86_64 (1710 of 1781)
UNSUPPORTED: lldb-api :: benchmarks/frame_variable/TestFrameVariableResponse.py (1711 of 1781)
PASS: lldb-api :: commands/expression/vector_of_enums/TestVectorOfEnums.py (1712 of 1781)
PASS: lldb-api :: types/TestRecursiveTypes.py (1713 of 1781)
PASS: lldb-api :: commands/expression/issue_11588/Test11588.py (1714 of 1781)
PASS: lldb-unit :: UnwindAssembly/x86/./UnwindAssemblyx86Tests/Testx86AssemblyInspectionEngine.TestSimplex86_64Augmented (1715 of 1781)
PASS: lldb-shell :: Python/crashlog.test (1716 of 1781)
PASS: lldb-shell :: Register/x86-64-gp-read.test (1717 of 1781)
PASS: lldb-unit :: Utility/./UtilityTests/ArgsTest.DoubleQuotedItem (1718 of 1781)
PASS: lldb-unit :: Utility/./UtilityTests/StreamTest.PutULEB128 (1719 of 1781)
PASS: lldb-unit :: Utility/./UtilityTests/ArgsTest.ReplaceArgumentAtIndexShort (1720 of 1781)
PASS: lldb-unit :: Utility/./UtilityTests/BinaryStreamTest.PutULEB128ThreeBytes (1721 of 1781)
PASS: lldb-unit :: Utility/./UtilityTests/StreamTeeTest.Assignment (1722 of 1781)
PASS: lldb-unit :: Utility/./UtilityTests/BinaryStreamTest.PutULEB128SixBytes (1723 of 1781)
PASS: lldb-api :: functionalities/data-formatter/data-formatter-stl/libcxx/optional/TestDataFormatterLibcxxOptional.py (1724 of 1781)
PASS: lldb-shell :: SymbolFile/NativePDB/ast-types.cpp (1725 of 1781)
PASS: lldb-unit :: Utility/./UtilityTests/BinaryStreamTest.PutULEB128One (1726 of 1781)
PASS: lldb-unit :: Host/./HostTests/SocketTest.TCPGetAddress (1727 of 1781)
PASS: lldb-api :: python_api/lldbutil/iter/TestRegistersIterator.py (1728 of 1781)
UNSUPPORTED: lldb-api :: commands/expression/completion-crash1/TestCompletionCrash1.py (1729 of 1781)
PASS: lldb-unit :: Utility/./UtilityTests/ArgsTest.TestArgv (1730 of 1781)
PASS: lldb-unit :: Utility/./UtilityTests/OptionsWithRawTest.EmptyInput (1731 of 1781)
PASS: lldb-unit :: SymbolFile/DWARF/./SymbolFileDWARFTests/SymbolFileDWARFTests.TestAbbrevOutOfOrder (1732 of 1781)
PASS: lldb-unit :: Utility/./UtilityTests/StringExtractorTest.GetHexBytes_Underflow (1733 of 1781)
PASS: lldb-unit :: Utility/./UtilityTests/DataExtractorTest.PeekData (1734 of 1781)
PASS: lldb-unit :: Host/./HostTests/SocketTest.DomainGetConnectURI (1735 of 1781)
PASS: lldb-api :: functionalities/thread/crash_during_step/TestCrashDuringStep.py (1736 of 1781)
PASS: lldb-api :: python_api/watchpoint/condition/TestWatchpointConditionAPI.py (1737 of 1781)
PASS: lldb-unit :: UnwindAssembly/x86/./UnwindAssemblyx86Tests/Testx86AssemblyInspectionEngine.TestPushEBP (1738 of 1781)
PASS: lldb-api :: functionalities/data-formatter/ptr_ref_typedef/TestPtrRef2Typedef.py (1739 of 1781)
PASS: lldb-unit :: Process/minidump/./LLDBMinidumpTests/MinidumpParserTest.GetArchitecture (1740 of 1781)
PASS: lldb-unit :: Utility/./UtilityTests/RangeDataVector.FindEntryThatContains_Overlap (1741 of 1781)
PASS: lldb-api :: commands/expression/import-std-module/vector-dbg-info-content/TestDbgInfoContentVector.py (1742 of 1781)
PASS: lldb-shell :: SymbolFile/DWARF/find-basic-variable.cpp (1743 of 1781)
PASS: lldb-api :: functionalities/wrong_commands/TestWrongCommands.py (1744 of 1781)
PASS: lldb-unit :: UnwindAssembly/x86/./UnwindAssemblyx86Tests/Testx86AssemblyInspectionEngine.TestPushImm (1745 of 1781)
PASS: lldb-shell :: Breakpoint/debug_rnglistx_rlex.test (1746 of 1781)
PASS: lldb-api :: python_api/section/TestSectionAPI.py (1747 of 1781)
PASS: lldb-api :: commands/expression/persistent_types/TestPersistentTypes.py (1748 of 1781)
PASS: lldb-api :: lang/cpp/operator-overload/TestOperatorOverload.py (1749 of 1781)
PASS: lldb-shell :: Commands/command-backtrace.test (1750 of 1781)
PASS: lldb-unit :: Host/./HostTests/NativeProcessProtocolTest.ReadMemoryWithoutTrap (1751 of 1781)
PASS: lldb-shell :: ObjectFile/PECOFF/dep-modules.yaml (1752 of 1781)
PASS: lldb-shell :: Quit/TestQuitExitCodeTooManyArgs.test (1753 of 1781)
PASS: lldb-api :: lang/objc/single-entry-dictionary/TestObjCSingleEntryDictionary.py (1754 of 1781)
PASS: lldb-unit :: UnwindAssembly/x86/./UnwindAssemblyx86Tests/Testx86AssemblyInspectionEngine.TestSimplei386ugmented (1755 of 1781)
PASS: lldb-api :: lang/cpp/namespace_conflicts/TestNamespaceConflicts.py (1756 of 1781)
PASS: lldb-shell :: ObjectFile/PECOFF/uuid.yaml (1757 of 1781)
PASS: lldb-api :: commands/expression/no-deadlock/TestExprDoesntBlock.py (1758 of 1781)
FAIL: lldb-api :: iohandler/completion/TestIOHandlerCompletion.py (1759 of 1781)
******************** TEST 'lldb-api :: iohandler/completion/TestIOHandlerCompletion.py' FAILED ********************
lldb version 10.0.99 (http://labmaster3.local/git/llvm-project.git revision 078bec6c48dd9d17ab9720897d2bb7ccbb886763)
  clang revision 4d1ecadda59ce82e5fa6e28dd15bf794eee88363
  llvm revision 4d1ecadda59ce82e5fa6e28dd15bf794eee88363
LLDB library dir: /Users/buildslave/jenkins/workspace/lldb-cmake-sanitized/lldb-build/bin
LLDB import library dir: /Users/buildslave/jenkins/workspace/lldb-cmake-sanitized/lldb-build/bin
libstdcxx tests will not be run because: Don't know how to build with libstdcxx on macosx
Skipping following debug info categories: ['dwo']
(lldb) settings set symbols.enable-external-lookup false
(lldb) settings set plugin.process.gdb-remote.packet-timeout 60
(lldb) settings set symbols.clang-modules-cache-path "/Users/buildslave/jenkins/workspace/lldb-cmake-sanitized/lldb-build/tools/lldb/lldb-test-build.noindex/module-cache-lldb/lldb-api"
(lldb) settings set use-color false
(lldb) 		a
Available completions:
	_regexp-attach    -- Attach to process by ID or name.
	_regexp-break     -- Set a breakpoint using one of several shorthand formats.
	_regexp-bt        -- Show the current thread's call stack.  Any numeric argument displays at most that many frames.  The argument 'all' displays all threads.  Use 'settings set frame-format' to customize the printing of individual frames and 'settings set thread-format' to customize the thread header.
	_regexp-display   -- Evaluate an expression at every stop (see 'help target stop-hook'.)
	_regexp-down      -- Select a newer stack frame.  Defaults to moving one frame, a numeric argument can specify an arbitrary number.
	_regexp-env       -- Shorthand for viewing and setting environment variables.
	_regexp-jump      -- Set the program counter to a new address.
	_regexp-list      -- List relevant source code using one of several shorthand formats.
	_regexp-tbreak    -- Set a one-shot breakpoint using one of several shorthand formats.
	_regexp-undisplay -- Stop displaying expression at every stop (specified by stop-hook index.)
	_regexp-up        -- Select an older stack frame.  Defaults to moving one frame, a numeric argument can specify an arbitrary number.
	apropos           -- List debugger commands related to a word or subject.
	breakpoint        -- Commands for operating on breakpoints (see 'help b' for shorthand.)
	command           -- Commands for managing custom LLDB commands.
	disassemble       -- Disassemble specified instructions in the current target.  Defaults to the current function for the current thread and stack frame.
	expression        -- Evaluate an expression on the current thread.  Displays any returned value with LLDB's default formatting.
	frame             -- Commands for selecting and examing the current thread's stack frames.
	gdb-remote        -- Connect to a process via remote GDB server.  If no host is specifed, localhost is assumed.
	gui               -- Switch into the curses based GUI mode.
	help              -- Show a list of all debugger commands, or give details about a specific command.
	kdp-remote        -- Connect to a process via remote KDP server.  If no UDP port is specified, port 41139 is assumed.
	language          -- Commands specific to a source language.
	log               -- Commands controlling LLDB internal logging.
	memory            -- Commands for operating on memory in the current target process.
	platform          -- Commands to manage and create platforms.
	plugin            -- Commands for managing LLDB plugins.
	process           -- Commands for interacting with processes on the current platform.
	quit              -- Quit the LLDB debugger.
	register          -- Commands to access registers for the current thread and stack frame.
	reproducer        -- Commands for manipulate the reproducer functionality.
	script            -- Invoke the script interpreter with provided code and display any results.  Start the interactive interpreter if no code is supplied.
	settings   regi	       -- Commands for managing LLDB settings.
	source            -- Commands for examining source code described by debug information for the current target process.
	statistics        -- Print statistics about a debugging session
	target            -- Commands for operating on debugger targets.
	thread            -- Commands for operating on one or more threads in the current process.
	type              -- Commands for operating on the type system.
	version           -- Show the LLDB debugger version.
	watchpoint        -- Commands for operating on watchpoints.
	add-dsym          -- Add a debug symbol file to one of the target's current modules by specifying a path to a debug symbols file, or using the options to specify a module to download symbols for.
More (Y/n/a): 
	attach            -- Attach to process by ID or name.
	b                 -- Set a breakpoint using one of several shorthand formats.
	bt                -- Show the current thread's call stack.  Any numeric argument displays at most that many frames.  The argument 'all' displays all threads.  Use 'settings set frame-format' to customize the printing of individual frames and 'settings set thread-format' to customize the thread header.
	c                 -- Continue execution of all threads in the current process.
	call              -- Evaluate an expression on the current thread.  Displays any returned value with LLDB's default formatting.
	continue          -- Continue execution of all threads in the current process.
	detach            -- Detach from the current target process.
	di                -- Disassemble specified instructions in the current target.  Defaults to the current function for the current thread and stack frame.
	dis               -- Disassemble specified instructions in the current target.  Defaults to the current function for the current thread and stack frame.
	display           -- Evaluate an expression at every stop (see 'help target stop-hook'.)
	down              -- Select a newer stack frame.  Defaults to moving one frame, a numeric argument can specify an arbitrary number.
	env               -- Shorthand for viewing and setting environment variables.
	exit              -- Quit the LLDB debugger.
	f                 -- Select the current stack frame by index from within the current thread (see 'thread backtrace'.)
	file              -- Create a target using the argument as the main executable.
	finish            -- Finish executing the current stack frame and stop after returning.  Defaults to current thread unless specified.
	image             -- Commands for accessing information for one or more target modules.
	j                 -- Set the program counter to a new address.
	jump              -- Set the program counter to a new address.
	kill              -- Terminate the current target process.
	l                 -- List relevant source code using one of several shorthand formats.
	list              -- List relevant source code using one of several shorthand formats.
	n                 -- Source level single step, stepping over calls.  Defaults to current thread unless specified.
	next              -- Source level single step, stepping over calls.  Defaults to current thread unless specified.
	nexti             -- Instruction level single step, stepping over calls.  Defaults to current thread unless specified.
	ni                -- Instruction level single step, stepping over calls.  Defaults to current thread unless specified.
	p                 -- Evaluate an expression on the current thread.  Displays any returned value with LLDB's default formatting.
	parray            -- Evaluate an expression on the current thread.  Displays any returned value with LLDB's default formatting.
	po                -- Evaluate an expression on the current thread.  Displays any returned value with formatting controlled by the type's author.
	poarray           -- Evaluate an expression on the current thread.  Displays any returned value with LLDB's default formatting.
	print             -- Evaluate an expression on the current thread.  Displays any returned value with LLDB's default formatting.
	q                 -- Quit the LLDB debugger.
	r                 -- Launch the executable in the debugger.
	rbreak            -- Sets a breakpoint or set of breakpoints in the executable.
	re                -- Commands to access registers for the current thread and stack frame.
	run               -- Launch the executable in the debugger.
	s                 -- Source level single step, stepping into calls.  Defaults to current thread unless specified.
	si                -- Instruction level single step, stepping into calls.  Defaults to current thread unless specified.
	sif               -- Step through the current block, stopping if you step directly into a function whose name matches the TargetFunctionName.
	step              -- Source level single step, stepping into calls.  Defaults to current thread unless specified.
More (Y/n/a): 
	stepi             -- Instruction level single step, stepping into calls.  Defaults to current thread unless specified.
	t                 -- Change the currently selected thread.
	tbreak            -- Set a one-shot breakpoint using one of several shorthand formats.
	undisplay         -- Stop displaying expression at every stop (specified by stop-hook index.)
	up                -- Select an older stack frame.  Defaults to moving one frame, a numeric argument can specify an arbitrary number.
	v                 -- Show variables for the current stack frame. Defaults to all arguments and local variables in scope. Names of argument, local, file static and file global variables can be specified. Children of aggregate variables can be specified such as 'var->child.x'.  The -> and [] operators in 'frame variable' do not invoke operator overloads if they exist, but directly access the specified element.  If you want to trigger operator overloads use the expression command to print the variable instead.
It is worth noting that except for overloaded operators, when printing local variables 'expr local_var' and 'frame var local_var' produce the same results.  However, 'frame variable' is more efficient, since it uses debug information and memory reads directly, rather than parsing and evaluating an expression, which may even involve JITing and running code in the target program.
	var               -- Show variables for the current stack frame. Defaults to all arguments and local variables in scope. Names of argument, local, file static and file global variables can be specified. Children of aggregate variables can be specified such as 'var->child.x'.  The -> and [] operators in 'frame variable' do not invoke operator overloads if they exist, but directly access the specified element.  If you want to trigger operator overloads use the expression command to print the variable instead.
It is worth noting that except for overloaded operators, when printing local variables 'expr local_var' and 'frame var local_var' produce the same results.  However, 'frame variable' is more efficient, since it uses debug information and memory reads directly, rather than parsing and evaluating an expression, which may even involve JITing and running code in the target program.
	vo                -- Show variables for the current stack frame. Defaults to all arguments and local variables in scope. Names of argument, local, file static and file global variables can be specified. Children of aggregate variables can be specified such as 'var->child.x'.  The -> and [] operators in 'frame variable' do not invoke operator overloads if they exist, but directly access the specified element.  If you want to trigger operator overloads use the expression command to print the variable instead.
It is worth noting that except for overloaded operators, when printing local variables 'expr local_var' and 'frame var local_var' produce the same results.  However, 'frame variable' is more efficient, since it uses debug information and memory reads directly, rather than parsing and evaluating an expression, which may even involve JITing and running code in the target program.
	x                 -- Read from the memory of the current target process.
(lldb)  
(lldb) regi
(lldb) register 

Hide Details

Commands to access registers for the current thread and stack frame.

Hide Details

Syntax: register [read|write] ...

Hide Details

The following subcommands are supported:

Hide Details

read -- Dump the contents of one or more register values from the current frame. If no register is specified, dumps them all. write -- Modify a single register value.

Hide Details

For more help on any particular subcommand, type 'help <command> <subcommand>'. (lldb) file /Users/buildslave/jenkins/workspace/lldb-cmake-sanitized/llvm-project/lldb/packages/Python/lldbsuite/test/iohandler/completion file /Users/buildslave/jenkins/workspace/lldb-cmake-sanitized/llvm-project/lldb/packages/Python/lldbsuite/test/iohandler/completion (lldb) file /Users/buildslave/jenkins/workspace/lldb-cmake-sanitized/llvm-project/lldb/packages/Python/lldbsuite/test/iohandler/completion/TestIOHandler TestIOHandler (lldb) file /Users/buildslave/jenkins/workspace/lldb-cmake-sanitized/llvm-project/lldb/packages/Python/lldbsuite/test/iohandler/completion/TestIOHandlerCompletion.py

Hide Details

error: '/Users/buildslave/jenkins/workspace/lldb-cmake-sanitized/llvm-project/lldb/packages/Python/lldbsuite/test/iohandler/completion/TestIOHandlerCompletion.py' doesn't contain any 'host' platform architectures: x86_64, i386 (lldb) Available completions: _regexp-attach -- Attach to process by ID or name. _regexp-break -- Set a breakpoint using one of several shorthand formats. _regexp-bt -- Show the current thread's call stack. Any numeric argument displays at most that many frames. The argument 'all' displays all threads. Use 'settings set frame-format' to customize the printing of individual frames and 'settings set thread-format' to customize the thread header. _regexp-display -- Evaluate an expression at every stop (see 'help target stop-hook'.) _regexp-down -- Select a newer stack frame. Defaults to moving one frame, a numeric argument can specify an arbitrary number. _regexp-env -- Shorthand for viewing and setting environment variables. _regexp-jump -- Set the program counter to a new address. _regexp-list -- List relevant source code using one of several shorthand formats. _regexp-tbreak -- Set a one-shot breakpoint using one of several shorthand formats. _regexp-undisplay -- Stop displaying expression at every stop (specified by stop-hook index.) _regexp-up -- Select an older stack frame. Defaults to moving one frame, a numeric argument can specify an arbitrary number. apropos -- List debugger commands related to a word or subject. breakpoint -- Commands for operating on breakpoints (see 'help b' for shorthand.) command -- Commands for managing custom LLDB commands. disassemble -- Disassemble specified instructions in the current target. Defaults to the current function for the current thread and stack frame. expression -- Evaluate an expression on the current thread. Displays any returned value with LLDB's default formatting. frame -- Commands for selecting and examing the current thread's stack frames. gdb-remote -- Connect to a process via remote GDB server. If no host is specifed, localhost is assumed. gui -- Switch into the curses based GUI mode. help -- Show a list of all debugger commands, or give details about a specific command. kdp-remote -- Connect to a process via remote KDP server. If no UDP port is specified, port 41139 is assumed. language -- Commands specific to a source language. log -- Commands controlling LLDB internal logging. memory -- Commands for operating on memory in the current target process. platform -- Commands to manage and create platforms. plugin -- Commands for managing LLDB plugins. process -- Commands for interacting with processes on the current platform. quit -- Quit the LLDB debugger. register -- Commands to access registers for the current thread and stack frame. reproducer -- Commands for manipulate the reproducer functionality. script -- Invoke the script interpreter with provided code and display any results. Start the interactive interpreter if no code is supplied. settings -- Commands for managing LLDB settings. source -- Commands for examining source code described by debug information for the current target process. statistics -- Print statistics about a debugging session target -- Commands for operating on debugger targets. thread -- Commands for operating on one or more threads in the current process. type -- Commands for operating on the type system. version -- Show the LLDB debugger version. watchpoint -- Commands for operating on watchpoints. add-dsym -- Add a debug symbol file to one of the target's current modules by specifying a path to a debug symbols file, or using the options to specify a module to download symbols for. More (Y/n/a): n (lldb) regoinvalid (lldb) regsettings set interpreter.prompt-on-quit false

Hide Details

Session logs for test failures/errors/unexpected successes will go into directory '/Users/buildslave/jenkins/workspace/lldb-cmake-sanitized/test/logs' Command invoked: /Users/buildslave/jenkins/workspace/lldb-cmake-sanitized/llvm-project/lldb/test/API/dotest.py --arch=x86_64 -s /Users/buildslave/jenkins/workspace/lldb-cmake-sanitized/lldb-build/lldb-test-traces -S nm -u CXXFLAGS -u CFLAGS --executable /Users/buildslave/jenkins/workspace/lldb-cmake-sanitized/lldb-build/./bin/lldb --dsymutil /Users/buildslave/jenkins/workspace/lldb-cmake-sanitized/lldb-build/./bin/dsymutil --filecheck /Users/buildslave/jenkins/workspace/lldb-cmake-sanitized/lldb-build/./bin/FileCheck -C /Users/buildslave/jenkins/workspace/lldb-cmake-sanitized/host-compiler/bin/clang --codesign-identity lldb_codesign --server /Users/buildslave/jenkins/workspace/lldb-cmake-sanitized/lldb-build/./bin/debugserver --arch x86_64 --build-dir /Users/buildslave/jenkins/workspace/lldb-cmake-sanitized/lldb-build/lldb-test-build.noindex -s=/Users/buildslave/jenkins/workspace/lldb-cmake-sanitized/test/logs -t --env TERM=vt100 --env LLVM_LIBS_DIR=/Users/buildslave/jenkins/workspace/lldb-cmake-sanitized/lldb-build/./lib --build-dir /Users/buildslave/jenkins/workspace/lldb-cmake-sanitized/lldb-build/tools/lldb/lldb-test-build.noindex --lldb-module-cache-dir /Users/buildslave/jenkins/workspace/lldb-cmake-sanitized/lldb-build/tools/lldb/lldb-test-build.noindex/module-cache-lldb/lldb-api --clang-module-cache-dir /Users/buildslave/jenkins/workspace/lldb-cmake-sanitized/lldb-build/tools/lldb/lldb-test-build.noindex/module-cache-clang/lldb-api /Users/buildslave/jenkins/workspace/lldb-cmake-sanitized/llvm-project/lldb/packages/Python/lldbsuite/test/iohandler/completion -p TestIOHandlerCompletion.py Change dir to: /Users/buildslave/jenkins/workspace/lldb-cmake-sanitized/llvm-project/lldb/packages/Python/lldbsuite/test/iohandler/completion runCmd: settings set symbols.enable-external-lookup false output:

Hide Details

runCmd: settings set plugin.process.gdb-remote.packet-timeout 60 output:

Hide Details

runCmd: settings set symbols.clang-modules-cache-path "/Users/buildslave/jenkins/workspace/lldb-cmake-sanitized/lldb-build/tools/lldb/lldb-test-build.noindex/module-cache-lldb/lldb-api" output:

Hide Details

runCmd: settings set use-color false output:

Hide Details

FAIL: LLDB (/Users/buildslave/jenkins/workspace/lldb-cmake-sanitized/host-compiler/bin/clang-10-x86_64) :: test_completion (TestIOHandlerCompletion.IOHandlerCompletionTest) tearing down the child process....

Hide Details

CLEANUP ERROR: LLDB (/Users/buildslave/jenkins/workspace/lldb-cmake-sanitized/host-compiler/bin/clang-10-x86_64) :: test_completion (TestIOHandlerCompletion.IOHandlerCompletionTest) Restore dir to: /Users/buildslave/jenkins/workspace/lldb-cmake-sanitized/lldb-build/tools/lldb/test ====================================================================== ERROR: test_completion (TestIOHandlerCompletion.IOHandlerCompletionTest) ---------------------------------------------------------------------- Traceback (most recent call last): File "/Users/buildslave/jenkins/workspace/lldb-cmake-sanitized/llvm-project/lldb/packages/Python/lldbsuite/test/iohandler/completion/TestIOHandlerCompletion.py", line 52, in test_completion self.quit() File "/Users/buildslave/jenkins/workspace/lldb-cmake-sanitized/llvm-project/lldb/packages/Python/lldbsuite/test/lldbpexpect.py", line 61, in quit self.child.close(force=not gracefully) File "/Users/buildslave/jenkins/workspace/lldb-cmake-sanitized/llvm-project/lldb/third_party/Python/module/pexpect-4.6/pexpect/pty_spawn.py", line 327, in close self.ptyproc.close(force=force) File "/System/Library/Frameworks/Python.framework/Versions/2.7/lib/python2.7/contextlib.py", line 35, in __exit__ self.gen.throw(type, value, traceback) File "/Users/buildslave/jenkins/workspace/lldb-cmake-sanitized/llvm-project/lldb/third_party/Python/module/pexpect-4.6/pexpect/pty_spawn.py", line 25, in _wrap_ptyprocess_err raise ExceptionPexpect(*e.args) ExceptionPexpect: Could not terminate the child. Config=x86_64-/Users/buildslave/jenkins/workspace/lldb-cmake-sanitized/host-compiler/bin/clang-10 ---------------------------------------------------------------------- Ran 1 test in 3.490s

Hide Details

RESULT: FAILED (0 passes, 0 failures, 1 errors, 0 skipped, 0 expected failures, 0 unexpected successes)

Hide Details

******************** PASS: lldb-api :: commands/expression/import-std-module/vector-bool/TestBoolVector.py (1760 of 1781) PASS: lldb-shell :: SymbolFile/DWARF/deterministic-build.cpp (1761 of 1781) PASS: lldb-api :: lang/cpp/class-template-parameter-pack/TestClassTemplateParameterPack.py (1762 of 1781) PASS: lldb-api :: functionalities/data-formatter/data-formatter-objc/TestDataFormatterObjCNSContainer.py (1763 of 1781) PASS: lldb-api :: lang/c/enum_types/TestEnumTypes.py (1764 of 1781) PASS: lldb-unit :: Utility/./UtilityTests/StreamTest.ShiftOperatorStrings (1765 of 1781) PASS: lldb-api :: commands/expression/context-object/TestContextObject.py (1766 of 1781) PASS: lldb-api :: functionalities/breakpoint/breakpoint_options/TestBreakpointOptions.py (1767 of 1781) PASS: lldb-api :: functionalities/data-formatter/var-in-aggregate-misuse/TestVarInAggregateMisuse.py (1768 of 1781) PASS: lldb-api :: functionalities/thread/concurrent_events/TestConcurrentBreakpointsDelayedBreakpointOneWatchpoint.py (1769 of 1781) PASS: lldb-api :: commands/watchpoints/watchpoint_events/TestWatchpointEvents.py (1770 of 1781) PASS: lldb-api :: functionalities/data-formatter/data-formatter-stl/libcxx/list/TestDataFormatterLibcxxList.py (1771 of 1781) PASS: lldb-api :: commands/expression/namespace_local_var_same_name_obj_c/TestNamespaceLocalVarSameNameObjC.py (1772 of 1781) PASS: lldb-api :: functionalities/breakpoint/breakpoint_locations/TestBreakpointLocations.py (1773 of 1781) PASS: lldb-api :: types/TestFloatTypes.py (1774 of 1781) PASS: lldb-api :: functionalities/set-data/TestSetData.py (1775 of 1781) PASS: lldb-api :: lang/cpp/enum_types/TestCPP11EnumTypes.py (1776 of 1781) PASS: lldb-api :: lang/objc/objc-baseclass-sbtype/TestObjCBaseClassSBType.py (1777 of 1781) PASS: lldb-api :: commands/register/register/register_command/TestRegisters.py (1778 of 1781) PASS: lldb-api :: lang/objc/foundation/TestObjCMethodsNSArray.py (1779 of 1781) PASS: lldb-api :: lang/c/anonymous/TestAnonymous.py (1780 of 1781) PASS: lldb-api :: lang/objc/modules/TestObjCModules.py (1781 of 1781) Testing Time: 1636.96s ******************** Failing Tests (2): lldb-api :: tools/lldb-server/TestGdbRemoteAttach.py lldb-api :: iohandler/completion/TestIOHandlerCompletion.py

Hide Details

Hide Details

Slowest Tests: -------------------------------------------------------------------------- 113.15s: lldb-api :: commands/expression/import-std-module/stack/TestStack.py 113.46s: lldb-api :: functionalities/inferior-assert/TestInferiorAssert.py 122.60s: lldb-api :: api/check_public_api_headers/TestPublicAPIHeaders.py 123.47s: lldb-api :: functionalities/load_unload/TestLoadUnload.py 129.31s: lldb-api :: lang/objc/objc-new-syntax/TestObjCNewSyntaxArray.py 135.01s: lldb-api :: lang/objc/objc-new-syntax/TestObjCNewSyntaxDictionary.py 137.15s: lldb-api :: functionalities/recursion/TestValueObjectRecursion.py 139.29s: lldb-api :: commands/target/basic/TestTargetCommand.py 139.57s: lldb-api :: tools/lldb-server/TestLldbGdbServer.py 148.34s: lldb-api :: lang/cpp/namespace/TestNamespaceLookup.py 148.76s: lldb-api :: lang/objc/exceptions/TestObjCExceptions.py 161.88s: lldb-api :: functionalities/return-value/TestReturnValue.py 176.57s: lldb-api :: lang/objc/objc-new-syntax/TestObjCNewSyntaxLiteral.py 197.77s: lldb-api :: lang/cpp/enum_types/TestCPP11EnumTypes.py 200.13s: lldb-api :: lang/objc/foundation/TestObjCMethods.py 218.93s: lldb-api :: api/multithreaded/TestMultithreaded.py 227.29s: lldb-api :: lang/objc/hidden-ivars/TestHiddenIvars.py 434.52s: lldb-api :: types/TestIntegerTypes.py 519.23s: lldb-api :: types/TestIntegerTypesExpr.py 701.15s: lldb-api :: lang/objc/foundation/TestFoundationDisassembly.py

Hide Details

Tests Times: -------------------------------------------------------------------------- [ Range ] :: [ Percentage ] :: [ Count ] -------------------------------------------------------------------------- [ 0s, 50s) :: [************************************* ] :: [1650/1781] [ 50s,100s) :: [** ] :: [ 104/1781] [100s,150s) :: [ ] :: [ 16/1781] [150s,200s) :: [ ] :: [ 4/1781] [200s,250s) :: [ ] :: [ 4/1781] [250s,300s) :: [ ] :: [ 0/1781] [300s,350s) :: [ ] :: [ 0/1781] [350s,400s) :: [ ] :: [ 0/1781] [400s,450s) :: [ ] :: [ 0/1781] [450s,500s) :: [ ] :: [ 1/1781] [500s,550s) :: [ ] :: [ 0/1781] [550s,600s) :: [ ] :: [ 1/1781] [600s,650s) :: [ ] :: [ 0/1781] [650s,700s) :: [ ] :: [ 0/1781] [700s,750s) :: [ ] :: [ 1/1781] Expected Passes : 1632 Expected Failures : 6 Unsupported Tests : 141 Unexpected Failures: 2 FAILED: tools/lldb/test/CMakeFiles/check-lldb-lit cd /Users/buildslave/jenkins/workspace/lldb-cmake-sanitized/lldb-build/tools/lldb/test && /usr/bin/python /Users/buildslave/jenkins/workspace/lldb-cmake-sanitized/lldb-build/./bin/llvm-lit -v --time-tests --shuffle --xunit-xml-output=/Users/buildslave/jenkins/workspace/lldb-cmake-sanitized/test/results.xml -v --timeout 1200 /Users/buildslave/jenkins/workspace/lldb-cmake-sanitized/lldb-build/tools/lldb/test ninja: build stopped: subcommand failed. Command failed Command: ['/usr/bin/env', 'TERM=vt100', '/usr/local/bin/ninja', '-v', 'check-lldb'] [Pipeline] } [Pipeline] // timeout [Pipeline] } [Pipeline] // stage [Pipeline] stage [Pipeline] { (Declarative: Post Actions) [Pipeline] scanForIssues No credentials specified [Clang (LLVM based)] Sleeping for 5 seconds due to JENKINS-32191... [Clang (LLVM based)] Parsing console log (workspace: '/Users/buildslave/jenkins/workspace/lldb-cmake-sanitized') [Pipeline] junit Recording test results [Pipeline] } [Pipeline] // stage [Pipeline] } [Pipeline] // withEnv [Pipeline] } [Pipeline] // node [Pipeline] End of Pipeline [BFA] Scanning build for known causes... [BFA] Found failure cause(s): [BFA] Regression test failed from category Test [BFA] Ninja target failed from category Compile [BFA] Done. 0s ERROR: script returned exit code 1 Finished: FAILURE