FailedConsole Output

Skipping 592 KB.. Full Log
tyTests/DataExtractorTest.GetCStrEmpty (703 of 1857)
PASS: lldb-api :: lang/c/array_types/TestArrayTypes.py (704 of 1857)
PASS: lldb-unit :: Utility/./UtilityTests/RegisterValueTest.GetSet8 (705 of 1857)
PASS: lldb-api :: functionalities/breakpoint/auto_continue/TestBreakpointAutoContinue.py (706 of 1857)
PASS: lldb-api :: lang/cpp/diamond/TestDiamond.py (707 of 1857)
PASS: lldb-unit :: ObjectFile/Breakpad/./ObjectFileBreakpadTests/PublicRecord.parse (708 of 1857)
PASS: lldb-unit :: debugserver/./debugserverTests/RNBSocket.LoopBackConnectIPv6 (709 of 1857)
PASS: lldb-unit :: Utility/./UtilityTests/StreamTeeTest.Constructor1Stream (710 of 1857)
PASS: lldb-api :: lang/mixed/TestMixedLanguages.py (711 of 1857)
PASS: lldb-api :: functionalities/breakpoint/breakpoint_command/TestRegexpBreakCommand.py (712 of 1857)
PASS: lldb-unit :: Utility/./UtilityTests/CompletionRequest.Constructor (713 of 1857)
PASS: lldb-unit :: Symbol/./SymbolTests/Type.GetTypeScopeAndBasename (714 of 1857)
PASS: lldb-shell :: SymbolFile/Breakpad/line-table-edgecases.test (715 of 1857)
PASS: lldb-unit :: Utility/./UtilityTests/StreamTest.PutStringAsRawHex8 (716 of 1857)
PASS: lldb-unit :: Utility/./UtilityTests/StringListTest.GetMaxStringLengthDecreasingSize (717 of 1857)
PASS: lldb-api :: lang/cpp/namespace/TestNamespace.py (718 of 1857)
PASS: lldb-api :: lang/cpp/dynamic-value/TestCppValueCast.py (719 of 1857)
PASS: lldb-unit :: ScriptInterpreter/Python/./ScriptInterpreterPythonTests/PythonDataObjectsTest.TestResetting (720 of 1857)
PASS: lldb-api :: functionalities/thread/concurrent_events/TestConcurrentTwoBreakpointsOneWatchpoint.py (721 of 1857)
PASS: lldb-unit :: Utility/./UtilityTests/RegularExpression.Empty (722 of 1857)
PASS: lldb-shell :: Settings/TestModuleCacheSanity.test (723 of 1857)
PASS: lldb-api :: types/TestFloatTypesExpr.py (724 of 1857)
PASS: lldb-unit :: Process/minidump/./LLDBMinidumpTests/MinidumpParserTest.MinidumpDuplicateModuleMinAddress (725 of 1857)
PASS: lldb-unit :: UnwindAssembly/x86/./UnwindAssemblyx86Tests/Testx86AssemblyInspectionEngine.TestDisassemblyJunkBytes (726 of 1857)
PASS: lldb-api :: functionalities/gdb_remote_client/TestRecognizeBreakpoint.py (727 of 1857)
PASS: lldb-api :: lang/objc/modules-update/TestClangModulesUpdate.py (728 of 1857)
PASS: lldb-api :: types/TestIntegerType.py (729 of 1857)
UNSUPPORTED: lldb-api :: functionalities/process_save_core/TestProcessSaveCore.py (730 of 1857)
PASS: lldb-api :: commands/expression/import_builtin_fileid/TestImportBuiltinFileID.py (731 of 1857)
UNSUPPORTED: lldb-api :: functionalities/thread/create_during_step/TestCreateDuringStep.py (732 of 1857)
PASS: lldb-shell :: SymbolFile/NativePDB/disassembly.cpp (733 of 1857)
PASS: lldb-unit :: Symbol/./SymbolTests/PostfixExpression.ParseOneExpression (734 of 1857)
PASS: lldb-unit :: Utility/./UtilityTests/StatusTest.Formatv (735 of 1857)
PASS: lldb-shell :: Breakpoint/debug_rnglist_offset_pair.test (736 of 1857)
PASS: lldb-unit :: Process/gdb-remote/./ProcessGdbRemoteTests/GDBRemoteCommunicationClientTest.SyncThreadState (737 of 1857)
PASS: lldb-api :: functionalities/data-formatter/ostypeformatting/TestFormattersOsType.py (738 of 1857)
PASS: lldb-unit :: Target/./TargetTests/MemoryRegionInfoTest.Formatv (739 of 1857)
PASS: lldb-unit :: Utility/./UtilityTests/RangeTest.SizeTypes (740 of 1857)
PASS: lldb-unit :: Utility/./UtilityTests/LogChannelEnabledTest.LLDB_LOG_ERROR (741 of 1857)
PASS: lldb-unit :: Utility/./UtilityTests/DataExtractorTest.GetBitfield (742 of 1857)
PASS: lldb-api :: functionalities/thread/concurrent_events/TestConcurrentSignalNWatchNBreak.py (743 of 1857)
PASS: lldb-unit :: ObjectFile/Breakpad/./ObjectFileBreakpadTests/FuncRecord.parse (744 of 1857)
PASS: lldb-unit :: Utility/./UtilityTests/Predicate.WaitForValueNotEqualTo (745 of 1857)
PASS: lldb-shell :: Process/TestEnvironment.test (746 of 1857)
PASS: lldb-unit :: Process/minidump/./LLDBMinidumpTests/MinidumpParserTest.GetLinuxProcStatus (747 of 1857)
PASS: lldb-unit :: Utility/./UtilityTests/OptionsWithRawTest.EmptySuffixSingleWhitespace (748 of 1857)
PASS: lldb-api :: terminal/TestSTTYBeforeAndAfter.py (749 of 1857)
PASS: lldb-unit :: ScriptInterpreter/Python/./ScriptInterpreterPythonTests/PythonDataObjectsTest.TestBorrowedReferences (750 of 1857)
PASS: lldb-unit :: ScriptInterpreter/Python/./ScriptInterpreterPythonTests/PythonDataObjectsTest.TestPythonDictionaryToStructuredDictionary (751 of 1857)
PASS: lldb-unit :: SymbolFile/NativePDB/./SymbolFileNativePDBTests/PDBFPOProgramToDWARFExpressionTests.UnsupportedRASearch (752 of 1857)
PASS: lldb-unit :: Utility/./UtilityTests/LogTest.Register (753 of 1857)
PASS: lldb-api :: python_api/sbvalue_const_addrof/TestSBValueConstAddrOf.py (754 of 1857)
PASS: lldb-unit :: Host/./HostTests/SocketTest.TCPGetAddress (755 of 1857)
PASS: lldb-shell :: Quit/TestQuitExitCode30.test (756 of 1857)
UNSUPPORTED: lldb-api :: functionalities/darwin_log/basic/TestDarwinLogBasic.py (757 of 1857)
PASS: lldb-unit :: Utility/./UtilityTests/UriParserTest.BadPort2 (758 of 1857)
PASS: lldb-unit :: Utility/./UtilityTests/StringExtractorTest.GetHexBytesAvail_Underflow (759 of 1857)
PASS: lldb-api :: tools/lldb-vscode/stackTrace/TestVSCode_stackTrace.py (760 of 1857)
PASS: lldb-api :: commands/version/TestVersion.py (761 of 1857)
PASS: lldb-api :: functionalities/multiword-commands/TestMultiWordCommands.py (762 of 1857)
PASS: lldb-api :: commands/watchpoints/watchpoint_commands/condition/TestWatchpointConditionCmd.py (763 of 1857)
PASS: lldb-api :: functionalities/breakpoint/serialize/TestBreakpointSerialization.py (764 of 1857)
PASS: lldb-unit :: Host/./HostTests/NativeProcessProtocolTest.SetBreakpointFailRead (765 of 1857)
PASS: lldb-shell :: Reproducer/TestVersionCheck.test (766 of 1857)
PASS: lldb-api :: lang/cpp/stl/TestStdCXXDisassembly.py (767 of 1857)
UNSUPPORTED: lldb-api :: commands/register/register/intel_xtended_registers/mpx_offset_intersection/TestMPXOffsetIntersection.py (768 of 1857)
PASS: lldb-shell :: Driver/TestFile.test (769 of 1857)
PASS: lldb-api :: functionalities/thread/exit_during_break/TestExitDuringBreak.py (770 of 1857)
PASS: lldb-unit :: Process/gdb-remote/./ProcessGdbRemoteTests/GDBRemoteCommunicationClientTest.SaveRestoreRegistersNoSuffix (771 of 1857)
PASS: lldb-unit :: Utility/./UtilityTests/SerializationRountripTest.SerializeDeserializeObjectPointer (772 of 1857)
PASS: lldb-unit :: Utility/./UtilityTests/LogChannelTest.EnableOptions (773 of 1857)
PASS: lldb-unit :: Core/./LLDBCoreTests/RichManglingContextTest.SwitchProvider (774 of 1857)
PASS: lldb-unit :: Host/./HostTests/SocketTest.TCPListen0ConnectAccept (775 of 1857)
UNSUPPORTED: lldb-api :: python_api/event/TestEvents.py (776 of 1857)
PASS: lldb-api :: commands/expression/static-initializers/TestStaticInitializers.py (777 of 1857)
PASS: lldb-shell :: Breakpoint/split-dwarf-5-addrbase.test (778 of 1857)
PASS: lldb-shell :: SymbolFile/DWARF/debug_loc.s (779 of 1857)
PASS: lldb-unit :: Symbol/./SymbolTests/TestClangASTContext.TestGetBasicTypeFromEnum (780 of 1857)
PASS: lldb-unit :: Utility/./UtilityTests/StreamTeeTest.Write (781 of 1857)
PASS: lldb-api :: lang/cpp/overloaded-functions/TestOverloadedFunctions.py (782 of 1857)
PASS: lldb-unit :: Utility/./UtilityTests/VMRange.SetEndAddress (783 of 1857)
PASS: lldb-unit :: Utility/./UtilityTests/ArgsTest.GetQuotedCommandString (784 of 1857)
PASS: lldb-shell :: ObjectFile/Breakpad/discontiguous-sections.test (785 of 1857)
PASS: lldb-api :: functionalities/gdb_remote_client/TestPlatformClient.py (786 of 1857)
PASS: lldb-api :: lang/cpp/thread_local/TestThreadLocal.py (787 of 1857)
PASS: lldb-unit :: Language/Highlighting/./HighlighterTests/HighlighterTest.ClangPreserveNewLine (788 of 1857)
PASS: lldb-api :: tools/lldb-vscode/attach/TestVSCode_attach.py (789 of 1857)
UNSUPPORTED: lldb-shell :: Register/x86-gp-write.test (790 of 1857)
PASS: lldb-api :: functionalities/rerun/TestRerun.py (791 of 1857)
UNSUPPORTED: lldb-api :: functionalities/darwin_log/filter/regex/message/TestDarwinLogFilterRegexMessage.py (792 of 1857)
PASS: lldb-api :: lang/c/enum_types/TestEnumTypes.py (793 of 1857)
PASS: lldb-unit :: Core/./LLDBCoreTests/MangledTest.NameIndexes_FindFunctionSymbols (794 of 1857)
PASS: lldb-unit :: Utility/./UtilityTests/FileSpecTest.IsRelative (795 of 1857)
PASS: lldb-api :: commands/command/delete/TestCommandDelete.py (796 of 1857)
PASS: lldb-unit :: Utility/./UtilityTests/AnsiTerminal.Incomplete (797 of 1857)
UNSUPPORTED: lldb-api :: functionalities/data-formatter/data-formatter-stl/libstdcpp/vbool/TestDataFormatterStdVBool.py (798 of 1857)
PASS: lldb-api :: commands/expression/persistent_ptr_update/TestPersistentPtrUpdate.py (799 of 1857)
PASS: lldb-unit :: Process/gdb-remote/./ProcessGdbRemoteTests/GDBRemoteCommunicationClientTest.SendGetMetaDataPacket (800 of 1857)
PASS: lldb-shell :: Minidump/Windows/find-module.test (801 of 1857)
PASS: lldb-unit :: ObjectFile/ELF/./ObjectFileELFTests/ObjectFileELFTest.GetModuleSpecifications_EarlySectionHeaders (802 of 1857)
PASS: lldb-unit :: Utility/./UtilityTests/RegularExpression.CopyAssignment (803 of 1857)
PASS: lldb-api :: api/check_public_api_headers/TestPublicAPIHeaders.py (804 of 1857)
PASS: lldb-api :: functionalities/data-formatter/data-formatter-objc/nsindexpath/TestDataFormatterNSIndexPath.py (805 of 1857)
PASS: lldb-api :: functionalities/plugins/python_os_plugin/TestPythonOSPlugin.py (806 of 1857)
PASS: lldb-unit :: Utility/./UtilityTests/ArchSpecTest.TripleComponentsWereSpecified (807 of 1857)
PASS: lldb-api :: commands/expression/import-std-module/vector-bool/TestBoolVector.py (808 of 1857)
PASS: lldb-unit :: Utility/./UtilityTests/BinaryStreamTest.PutULEB128SevenBytes (809 of 1857)
PASS: lldb-unit :: Symbol/./SymbolTests/SymbolsTest.TerminateLocateExecutableSymbolFileForUnknownExecutableAndUnknownSymbolFile (810 of 1857)
PASS: lldb-api :: functionalities/data-formatter/data-formatter-named-summaries/TestDataFormatterNamedSummaries.py (811 of 1857)
PASS: lldb-api :: tools/lldb-server/TestGdbRemoteExitCode.py (812 of 1857)
UNSUPPORTED: lldb-api :: functionalities/darwin_log/source/info/TestDarwinLogSourceInfo.py (813 of 1857)
PASS: lldb-unit :: Host/./HostTests/SocketTest.TCPGetConnectURI (814 of 1857)
PASS: lldb-shell :: SymbolFile/DWARF/clang-ast-from-dwarf-unamed-and-anon-structs.cpp (815 of 1857)
PASS: lldb-api :: lang/objc/objc-struct-argument/TestObjCStructArgument.py (816 of 1857)
PASS: lldb-unit :: Utility/./UtilityTests/NameMatchesTest.StartsWith (817 of 1857)
PASS: lldb-api :: lang/objc/objc-baseclass-sbtype/TestObjCBaseClassSBType.py (818 of 1857)
FAIL: lldb-api :: commands/watchpoints/watchpoint_set_command/TestWatchLocationWithWatchSet.py (819 of 1857)
******************** TEST 'lldb-api :: commands/watchpoints/watchpoint_set_command/TestWatchLocationWithWatchSet.py' FAILED ********************
lldb version 10.0.99 (http://labmaster3.local/git/llvm-project.git revision 21b43885b81a6180e7231e575b5433202582f2fb)
  clang revision af39708c2d48beedc6721fe25676789cc6719f7b
  llvm revision af39708c2d48beedc6721fe25676789cc6719f7b
LLDB library dir: /Users/buildslave/jenkins/workspace/lldb-cmake/lldb-build/bin
LLDB import library dir: /Users/buildslave/jenkins/workspace/lldb-cmake/lldb-build/bin
libstdcxx tests will not be run because: Don't know how to build with libstdcxx on macosx
Skipping following debug info categories: ['dwo']

Hide Details

Session logs for test failures/errors/unexpected successes will go into directory '/Users/buildslave/jenkins/workspace/lldb-cmake/test/logs' Command invoked: /Users/buildslave/jenkins/workspace/lldb-cmake/llvm-project/lldb/test/API/dotest.py --arch=x86_64 -s /Users/buildslave/jenkins/workspace/lldb-cmake/lldb-build/lldb-test-traces -S nm -u CXXFLAGS -u CFLAGS --executable /Users/buildslave/jenkins/workspace/lldb-cmake/lldb-build/./bin/lldb --compiler /Users/buildslave/jenkins/workspace/lldb-cmake/lldb-build/./bin/clang --dsymutil /Users/buildslave/jenkins/workspace/lldb-cmake/lldb-build/./bin/dsymutil --filecheck /Users/buildslave/jenkins/workspace/lldb-cmake/lldb-build/./bin/FileCheck --codesign-identity lldb_codesign --server /Users/buildslave/jenkins/workspace/lldb-cmake/lldb-build/./bin/debugserver --arch x86_64 --build-dir /Users/buildslave/jenkins/workspace/lldb-cmake/lldb-build/lldb-test-build.noindex -s=/Users/buildslave/jenkins/workspace/lldb-cmake/test/logs -t --env TERM=vt100 --env LLVM_LIBS_DIR=/Users/buildslave/jenkins/workspace/lldb-cmake/lldb-build/./lib --build-dir /Users/buildslave/jenkins/workspace/lldb-cmake/lldb-build/lldb-test-build.noindex --lldb-module-cache-dir /Users/buildslave/jenkins/workspace/lldb-cmake/lldb-build/lldb-test-build.noindex/module-cache-lldb/lldb-api --clang-module-cache-dir /Users/buildslave/jenkins/workspace/lldb-cmake/lldb-build/lldb-test-build.noindex/module-cache-clang/lldb-api /Users/buildslave/jenkins/workspace/lldb-cmake/llvm-project/lldb/packages/Python/lldbsuite/test/commands/watchpoints/watchpoint_set_command -p TestWatchLocationWithWatchSet.py Change dir to: /Users/buildslave/jenkins/workspace/lldb-cmake/llvm-project/lldb/packages/Python/lldbsuite/test/commands/watchpoints/watchpoint_set_command runCmd: settings set symbols.enable-external-lookup false output:

Hide Details

runCmd: settings set plugin.process.gdb-remote.packet-timeout 60 output:

Hide Details

runCmd: settings set symbols.clang-modules-cache-path "/Users/buildslave/jenkins/workspace/lldb-cmake/lldb-build/lldb-test-build.noindex/module-cache-lldb/lldb-api" output:

Hide Details

runCmd: settings set use-color false output:

Hide Details

runCmd: file /Users/buildslave/jenkins/workspace/lldb-cmake/lldb-build/lldb-test-build.noindex/commands/watchpoints/watchpoint_set_command/TestWatchLocationWithWatchSet.test_watchlocation_using_watchpoint_set_dsym/a.out output: Current executable set to '/Users/buildslave/jenkins/workspace/lldb-cmake/lldb-build/lldb-test-build.noindex/commands/watchpoints/watchpoint_set_command/TestWatchLocationWithWatchSet.test_watchlocation_using_watchpoint_set_dsym/a.out' (x86_64).

Hide Details

Hide Details

runCmd: breakpoint set -l 105 output: Breakpoint 1: where = a.out`main + 391 at main.cpp:105:5, address = 0x0000000100001207

Hide Details

Hide Details

Expecting pattern: ^Breakpoint (?P<bpno>[0-9]+): (?P<num_locations>[0-9]+) locations\.$ Not matched

Hide Details

Expecting pattern: ^Breakpoint (?P<bpno>[0-9]+): (?P<num_locations>no) locations \(pending\)\. Not matched

Hide Details

Expecting pattern: ^Breakpoint (?P<bpno>[0-9]+): where = (?P<module>.*)`(?P<symbol>[+\-]{0,1}[^+]+)( \+ (?P<offset>[0-9]+)){0,1}( \[inlined\] (?P<inline_symbol>.*)){0,1} at (?P<file>[^:]+):(?P<line_no>[0-9]+)(?P<column>(:[0-9]+)?), address = (?P<address>0x[0-9a-fA-F]+)$ Matched

Hide Details

runCmd: run output: Process 67025 stopped * thread #1, queue = 'com.apple.main-thread', stop reason = breakpoint 1.1 frame #0: 0x0000000100001207 a.out`main(argc=1, argv=0x00007ffeefbff5b0) at main.cpp:105:5 102 int c; 103 } MyAggregateDataType; 104 -> 105 printf ("Before turning all three threads loose...\n"); // Set break point at this line. ^ 106 barrier_wait(); 107 108 // Join all of our threads

Hide Details

Process 67025 launched: '/Users/buildslave/jenkins/workspace/lldb-cmake/lldb-build/lldb-test-build.noindex/commands/watchpoints/watchpoint_set_command/TestWatchLocationWithWatchSet.test_watchlocation_using_watchpoint_set_dsym/a.out' (x86_64)

Hide Details

Hide Details

runCmd: thread list output: Process 67025 stopped * thread #1: tid = 0x6956bc, 0x0000000100001207 a.out`main(argc=1, argv=0x00007ffeefbff5b0) at main.cpp:105:5, queue = 'com.apple.main-thread', stop reason = breakpoint 1.1 thread #2: tid = 0x69588e, 0x00007fff58820b76 libsystem_kernel.dylib`_kernelrpc_mach_vm_map_trap + 10 thread #3: tid = 0x69588f, 0x00007fff58823872 libsystem_kernel.dylib`__psynch_mutexwait + 10 thread #4: tid = 0x695890, 0x00007fff58823872 libsystem_kernel.dylib`__psynch_mutexwait + 10

Hide Details

Hide Details

Expecting sub string: stopped Matched

Hide Details

Expecting sub string: stop reason = breakpoint Matched

Hide Details

runCmd: watchpoint set expression -w write -s 1 -- g_char_ptr + 7 output: Watchpoint created: Watchpoint 1: addr = 0x100200367 size = 1 state = enabled type = w new value: 0x0000001002000000

Hide Details

Hide Details

Expecting sub string: Watchpoint created Matched

Hide Details

Expecting sub string: size = 1 Matched

Hide Details

Expecting sub string: type = w Matched

Hide Details

runCmd: expr unsigned val = g_char_ptr[7]; val output: (unsigned int) $1 = 0

Hide Details

Hide Details

looking at: (unsigned int) $1 = 0

Hide Details

Expecting end string: = 0 Matched

Hide Details

runCmd: watchpoint list -v output: Number of supported hardware watchpoints: 4 Current watchpoints: Watchpoint 1: addr = 0x100200367 size = 1 state = enabled type = w new value: 0x0000001002000000 hw_index = -1 hit_count = 0 ignore_count = 0

Hide Details

Hide Details

Expecting sub string: hit_count = 0 Matched

Hide Details

runCmd: process continue output: Process 67025 resuming Process 67025 stopped * thread #2, stop reason = watchpoint 1 frame #0: 0x0000000100000d92 a.out`do_bad_thing_with_location(index=7, char_ptr="", new_val='c') at main.cpp:36:1 33 unsigned what = new_val; 34 printf("new value written to array(%p) and index(%u) = %u\n", char_ptr, index, what); 35 char_ptr[index] = new_val; -> 36 } ^ 37 38 uint32_t 39 access_pool (bool flag = false) thread #3, stop reason = watchpoint 1 frame #0: 0x0000000100000d92 a.out`do_bad_thing_with_location(index=7, char_ptr="", new_val='c') at main.cpp:36:1 33 unsigned what = new_val; 34 printf("new value written to array(%p) and index(%u) = %u\n", char_ptr, index, what); 35 char_ptr[index] = new_val; -> 36 } ^ 37 38 uint32_t 39 access_pool (bool flag = false)

Hide Details

Hide Details

Hide Details

runCmd: thread list output: Process 67025 stopped thread #1: tid = 0x6956bc, 0x00007fff5882336a libsystem_kernel.dylib`__ulock_wait + 10, queue = 'com.apple.main-thread' * thread #2: tid = 0x69588e, 0x0000000100000d92 a.out`do_bad_thing_with_location(index=7, char_ptr="", new_val='c') at main.cpp:36:1, stop reason = watchpoint 1 thread #3: tid = 0x69588f, 0x0000000100000d92 a.out`do_bad_thing_with_location(index=7, char_ptr="", new_val='c') at main.cpp:36:1, stop reason = watchpoint 1 thread #4: tid = 0x695890, 0x00007fff588cf60d libsystem_platform.dylib`_platform_memchr$VARIANT$Base + 13

Hide Details

Hide Details

Expecting sub string: stopped Matched

Hide Details

Expecting sub string: stop reason = watchpoint Matched

Hide Details

Expecting sub string: do_bad_thing_with_location Matched

Hide Details

runCmd: thread list output: Process 67025 stopped thread #1: tid = 0x6956bc, 0x00007fff5882336a libsystem_kernel.dylib`__ulock_wait + 10, queue = 'com.apple.main-thread' * thread #2: tid = 0x69588e, 0x0000000100000d92 a.out`do_bad_thing_with_location(index=7, char_ptr="", new_val='c') at main.cpp:36:1, stop reason = watchpoint 1 thread #3: tid = 0x69588f, 0x0000000100000d92 a.out`do_bad_thing_with_location(index=7, char_ptr="", new_val='c') at main.cpp:36:1, stop reason = watchpoint 1 thread #4: tid = 0x695890, 0x00007fff588cf60d libsystem_platform.dylib`_platform_memchr$VARIANT$Base + 13

Hide Details

Hide Details

runCmd: thread select 2 output:

Hide Details

runCmd: thread select 3 output:

Hide Details

runCmd: thread backtrace output: * thread #3, stop reason = watchpoint 1 * frame #0: 0x0000000100000d92 a.out`do_bad_thing_with_location(index=7, char_ptr="", new_val='c') at main.cpp:36:1 frame #1: 0x0000000100000e4e a.out`access_pool(flag=true) at main.cpp:53:9 frame #2: 0x0000000100000f35 a.out`thread_func(thread_index=1) at main.cpp:80:19 frame #3: 0x00000001000027c4 a.out`decltype(__f=0x00000001002023c8, __args=0x00000001002023d0)(unsigned int)>(fp)(std::__1::forward<long>(fp0))) std::__1::__invoke<void (*)(unsigned int), long>(void (*&&)(unsigned int), long&&) at type_traits:3539:1 frame #4: 0x000000010000270e a.out`void std::__1::__thread_execute<std::__1::unique_ptr<std::__1::__thread_struct, std::__1::default_delete<std::__1::__thread_struct> >, void (*)(unsigned int), long, 2ul>(__t=size=3, (null)=__tuple_indices<2> @ 0x000070000881deb8)(unsigned int), long>&, std::__1::__tuple_indices<2ul>) at thread:273:5 frame #5: 0x0000000100001f16 a.out`void* std::__1::__thread_proxy<std::__1::tuple<std::__1::unique_ptr<std::__1::__thread_struct, std::__1::default_delete<std::__1::__thread_struct> >, void (*)(unsigned int), long> >(__vp=0x00000001002023c0) at thread:284:5 frame #6: 0x00007fff588da33d libsystem_pthread.dylib`_pthread_body + 126 frame #7: 0x00007fff588dd2a7 libsystem_pthread.dylib`_pthread_start + 70 frame #8: 0x00007fff588d9425 libsystem_pthread.dylib`thread_start + 13

Hide Details

Hide Details

runCmd: expr unsigned val = g_char_ptr[7]; val output: (unsigned int) $2 = 99

Hide Details

Hide Details

looking at: (unsigned int) $2 = 99

Hide Details

Expecting end string: = 99 Matched

Hide Details

runCmd: watchpoint list -v output: Number of supported hardware watchpoints: 4 Current watchpoints: Watchpoint 1: addr = 0x100200367 size = 1 state = enabled type = w old value: 0x0000001002000063 new value: 0x0000001002000063 hw_index = 0 hit_count = 2 ignore_count = 0

Hide Details

Hide Details

Expecting sub string: hit_count = 2 Matched

Hide Details

runCmd: thread backtrace all output: thread #1, queue = 'com.apple.main-thread' frame #0: 0x00007fff5882336a libsystem_kernel.dylib`__ulock_wait + 10 frame #1: 0x00007fff588de70b libsystem_pthread.dylib`_pthread_join + 356 frame #2: 0x00007fff55e08978 libc++.1.dylib`std::__1::thread::join() + 24 frame #3: 0x000000010000127f a.out`main(argc=1, argv=0x00007ffeefbff5b0) at main.cpp:110:16 frame #4: 0x00007fff586e8085 libdyld.dylib`start + 1 thread #2, stop reason = watchpoint 1 frame #0: 0x0000000100000d92 a.out`do_bad_thing_with_location(index=7, char_ptr="", new_val='c') at main.cpp:36:1 frame #1: 0x0000000100000e4e a.out`access_pool(flag=true) at main.cpp:53:9 frame #2: 0x0000000100000f35 a.out`thread_func(thread_index=0) at main.cpp:80:19 frame #3: 0x00000001000027c4 a.out`decltype(__f=0x0000000100200698, __args=0x00000001002006a0)(unsigned int)>(fp)(std::__1::forward<long>(fp0))) std::__1::__invoke<void (*)(unsigned int), long>(void (*&&)(unsigned int), long&&) at type_traits:3539:1 frame #4: 0x000000010000270e a.out`void std::__1::__thread_execute<std::__1::unique_ptr<std::__1::__thread_struct, std::__1::default_delete<std::__1::__thread_struct> >, void (*)(unsigned int), long, 2ul>(__t=size=3, (null)=__tuple_indices<2> @ 0x000070000879aeb8)(unsigned int), long>&, std::__1::__tuple_indices<2ul>) at thread:273:5 frame #5: 0x0000000100001f16 a.out`void* std::__1::__thread_proxy<std::__1::tuple<std::__1::unique_ptr<std::__1::__thread_struct, std::__1::default_delete<std::__1::__thread_struct> >, void (*)(unsigned int), long> >(__vp=0x0000000100200690) at thread:284:5 frame #6: 0x00007fff588da33d libsystem_pthread.dylib`_pthread_body + 126 frame #7: 0x00007fff588dd2a7 libsystem_pthread.dylib`_pthread_start + 70 frame #8: 0x00007fff588d9425 libsystem_pthread.dylib`thread_start + 13 * thread #3, stop reason = watchpoint 1 * frame #0: 0x0000000100000d92 a.out`do_bad_thing_with_location(index=7, char_ptr="", new_val='c') at main.cpp:36:1 frame #1: 0x0000000100000e4e a.out`access_pool(flag=true) at main.cpp:53:9 frame #2: 0x0000000100000f35 a.out`thread_func(thread_index=1) at main.cpp:80:19 frame #3: 0x00000001000027c4 a.out`decltype(__f=0x00000001002023c8, __args=0x00000001002023d0)(unsigned int)>(fp)(std::__1::forward<long>(fp0))) std::__1::__invoke<void (*)(unsigned int), long>(void (*&&)(unsigned int), long&&) at type_traits:3539:1 frame #4: 0x000000010000270e a.out`void std::__1::__thread_execute<std::__1::unique_ptr<std::__1::__thread_struct, std::__1::default_delete<std::__1::__thread_struct> >, void (*)(unsigned int), long, 2ul>(__t=size=3, (null)=__tuple_indices<2> @ 0x000070000881deb8)(unsigned int), long>&, std::__1::__tuple_indices<2ul>) at thread:273:5 frame #5: 0x0000000100001f16 a.out`void* std::__1::__thread_proxy<std::__1::tuple<std::__1::unique_ptr<std::__1::__thread_struct, std::__1::default_delete<std::__1::__thread_struct> >, void (*)(unsigned int), long> >(__vp=0x00000001002023c0) at thread:284:5 frame #6: 0x00007fff588da33d libsystem_pthread.dylib`_pthread_body + 126 frame #7: 0x00007fff588dd2a7 libsystem_pthread.dylib`_pthread_start + 70 frame #8: 0x00007fff588d9425 libsystem_pthread.dylib`thread_start + 13 thread #4 frame #0: 0x00007fff588cf60d libsystem_platform.dylib`_platform_memchr$VARIANT$Base + 13 frame #1: 0x00007fff58771b54 libsystem_c.dylib`__sfvwrite + 611 frame #2: 0x00007fff5877ae2a libsystem_c.dylib`__vfprintf + 13516 frame #3: 0x00007fff587a013b libsystem_c.dylib`__v2printf + 475 frame #4: 0x00007fff58777882 libsystem_c.dylib`vfprintf_l + 54 frame #5: 0x00007fff5877599a libsystem_c.dylib`printf + 174 frame #6: 0x0000000100000d81 a.out`do_bad_thing_with_location(index=7, char_ptr="", new_val='c') at main.cpp:34:5 frame #7: 0x0000000100000e4e a.out`access_pool(flag=true) at main.cpp:53:9 frame #8: 0x0000000100000f35 a.out`thread_func(thread_index=2) at main.cpp:80:19 frame #9: 0x00000001000027c4 a.out`decltype(__f=0x00000001002024e8, __args=0x00000001002024f0)(unsigned int)>(fp)(std::__1::forward<long>(fp0))) std::__1::__invoke<void (*)(unsigned int), long>(void (*&&)(unsigned int), long&&) at type_traits:3539:1 frame #10: 0x000000010000270e a.out`void std::__1::__thread_execute<std::__1::unique_ptr<std::__1::__thread_struct, std::__1::default_delete<std::__1::__thread_struct> >, void (*)(unsigned int), long, 2ul>(__t=size=3, (null)=__tuple_indices<2> @ 0x00007000088a0eb8)(unsigned int), long>&, std::__1::__tuple_indices<2ul>) at thread:273:5 frame #11: 0x0000000100001f16 a.out`void* std::__1::__thread_proxy<std::__1::tuple<std::__1::unique_ptr<std::__1::__thread_struct, std::__1::default_delete<std::__1::__thread_struct> >, void (*)(unsigned int), long> >(__vp=0x00000001002024e0) at thread:284:5 frame #12: 0x00007fff588da33d libsystem_pthread.dylib`_pthread_body + 126 frame #13: 0x00007fff588dd2a7 libsystem_pthread.dylib`_pthread_start + 70 frame #14: 0x00007fff588d9425 libsystem_pthread.dylib`thread_start + 13

Hide Details

Hide Details

<bound method SBProcess.Kill of <lldb.SBProcess; proxy of <Swig Object of type 'lldb::SBProcess *' at 0x10ddeb540> >>: success

Hide Details

PASS: LLDB (/Users/buildslave/jenkins/workspace/lldb-cmake/lldb-build/bin/clang-10-x86_64) :: test_watchlocation_using_watchpoint_set_dsym (TestWatchLocationWithWatchSet.WatchLocationUsingWatchpointSetTestCase) runCmd: settings set symbols.enable-external-lookup false output:

Hide Details

runCmd: settings set plugin.process.gdb-remote.packet-timeout 60 output:

Hide Details

runCmd: settings set symbols.clang-modules-cache-path "/Users/buildslave/jenkins/workspace/lldb-cmake/lldb-build/lldb-test-build.noindex/module-cache-lldb/lldb-api" output:

Hide Details

runCmd: settings set use-color false output:

Hide Details

runCmd: file /Users/buildslave/jenkins/workspace/lldb-cmake/lldb-build/lldb-test-build.noindex/commands/watchpoints/watchpoint_set_command/TestWatchLocationWithWatchSet.test_watchlocation_using_watchpoint_set_dwarf/a.out output: Current executable set to '/Users/buildslave/jenkins/workspace/lldb-cmake/lldb-build/lldb-test-build.noindex/commands/watchpoints/watchpoint_set_command/TestWatchLocationWithWatchSet.test_watchlocation_using_watchpoint_set_dwarf/a.out' (x86_64).

Hide Details

Hide Details

runCmd: breakpoint set -l 105 output: Breakpoint 1: where = a.out`main + 391 at main.cpp:105:5, address = 0x0000000100001207

Hide Details

Hide Details

Expecting pattern: ^Breakpoint (?P<bpno>[0-9]+): (?P<num_locations>[0-9]+) locations\.$ Not matched

Hide Details

Expecting pattern: ^Breakpoint (?P<bpno>[0-9]+): (?P<num_locations>no) locations \(pending\)\. Not matched

Hide Details

Expecting pattern: ^Breakpoint (?P<bpno>[0-9]+): where = (?P<module>.*)`(?P<symbol>[+\-]{0,1}[^+]+)( \+ (?P<offset>[0-9]+)){0,1}( \[inlined\] (?P<inline_symbol>.*)){0,1} at (?P<file>[^:]+):(?P<line_no>[0-9]+)(?P<column>(:[0-9]+)?), address = (?P<address>0x[0-9a-fA-F]+)$ Matched

Hide Details

runCmd: run output: Process 72878 stopped * thread #1, queue = 'com.apple.main-thread', stop reason = breakpoint 1.1 frame #0: 0x0000000100001207 a.out`main(argc=1, argv=0x00007ffeefbff5b0) at main.cpp:105:5 102 int c; 103 } MyAggregateDataType; 104 -> 105 printf ("Before turning all three threads loose...\n"); // Set break point at this line. ^ 106 barrier_wait(); 107 108 // Join all of our threads

Hide Details

Process 72878 launched: '/Users/buildslave/jenkins/workspace/lldb-cmake/lldb-build/lldb-test-build.noindex/commands/watchpoints/watchpoint_set_command/TestWatchLocationWithWatchSet.test_watchlocation_using_watchpoint_set_dwarf/a.out' (x86_64)

Hide Details

Hide Details

runCmd: thread list output: Process 72878 stopped * thread #1: tid = 0x697fd2, 0x0000000100001207 a.out`main(argc=1, argv=0x00007ffeefbff5b0) at main.cpp:105:5, queue = 'com.apple.main-thread', stop reason = breakpoint 1.1 thread #2: tid = 0x698152, 0x00007fff587670ff libsystem_c.dylib`localeconv_l + 89 thread #3: tid = 0x698153, 0x00007fff58823872 libsystem_kernel.dylib`__psynch_mutexwait + 10 thread #4: tid = 0x698154, 0x00007fff58823872 libsystem_kernel.dylib`__psynch_mutexwait + 10

Hide Details

Hide Details

Expecting sub string: stopped Matched

Hide Details

Expecting sub string: stop reason = breakpoint Matched

Hide Details

runCmd: watchpoint set expression -w write -s 1 -- g_char_ptr + 7 runCmd failed! error: expression evaluation of address to watch failed expression evaluated: g_char_ptr + 7

Hide Details

Hide Details

FAIL: LLDB (/Users/buildslave/jenkins/workspace/lldb-cmake/lldb-build/bin/clang-10-x86_64) :: test_watchlocation_using_watchpoint_set_dwarf (TestWatchLocationWithWatchSet.WatchLocationUsingWatchpointSetTestCase) <bound method SBProcess.Kill of <lldb.SBProcess; proxy of <Swig Object of type 'lldb::SBProcess *' at 0x107187060> >>: success

Hide Details

UNSUPPORTED: LLDB (/Users/buildslave/jenkins/workspace/lldb-cmake/lldb-build/bin/clang-10-x86_64) :: test_watchlocation_using_watchpoint_set_dwo (TestWatchLocationWithWatchSet.WatchLocationUsingWatchpointSetTestCase) (test case does not fall in any category of interest for this run) runCmd: settings set symbols.enable-external-lookup false output:

Hide Details

runCmd: settings set plugin.process.gdb-remote.packet-timeout 60 output:

Hide Details

runCmd: settings set symbols.clang-modules-cache-path "/Users/buildslave/jenkins/workspace/lldb-cmake/lldb-build/lldb-test-build.noindex/module-cache-lldb/lldb-api" output:

Hide Details

runCmd: settings set use-color false output:

Hide Details

runCmd: file /Users/buildslave/jenkins/workspace/lldb-cmake/lldb-build/lldb-test-build.noindex/commands/watchpoints/watchpoint_set_command/TestWatchLocationWithWatchSet.test_watchlocation_using_watchpoint_set_gmodules/a.out output: Current executable set to '/Users/buildslave/jenkins/workspace/lldb-cmake/lldb-build/lldb-test-build.noindex/commands/watchpoints/watchpoint_set_command/TestWatchLocationWithWatchSet.test_watchlocation_using_watchpoint_set_gmodules/a.out' (x86_64).

Hide Details

Hide Details

runCmd: breakpoint set -l 105 output: Breakpoint 1: where = a.out`main + 391 at main.cpp:105:5, address = 0x0000000100001207

Hide Details

Hide Details

Expecting pattern: ^Breakpoint (?P<bpno>[0-9]+): (?P<num_locations>[0-9]+) locations\.$ Not matched

Hide Details

Expecting pattern: ^Breakpoint (?P<bpno>[0-9]+): (?P<num_locations>no) locations \(pending\)\. Not matched

Hide Details

Expecting pattern: ^Breakpoint (?P<bpno>[0-9]+): where = (?P<module>.*)`(?P<symbol>[+\-]{0,1}[^+]+)( \+ (?P<offset>[0-9]+)){0,1}( \[inlined\] (?P<inline_symbol>.*)){0,1} at (?P<file>[^:]+):(?P<line_no>[0-9]+)(?P<column>(:[0-9]+)?), address = (?P<address>0x[0-9a-fA-F]+)$ Matched

Hide Details

runCmd: run output: Process 90162 stopped * thread #1, queue = 'com.apple.main-thread', stop reason = breakpoint 1.1 frame #0: 0x0000000100001207 a.out`main(argc=1, argv=0x00007ffeefbff5a0) at main.cpp:105:5 102 int c; 103 } MyAggregateDataType; 104 -> 105 printf ("Before turning all three threads loose...\n"); // Set break point at this line. ^ 106 barrier_wait(); 107 108 // Join all of our threads

Hide Details

Process 90162 launched: '/Users/buildslave/jenkins/workspace/lldb-cmake/lldb-build/lldb-test-build.noindex/commands/watchpoints/watchpoint_set_command/TestWatchLocationWithWatchSet.test_watchlocation_using_watchpoint_set_gmodules/a.out' (x86_64)

Hide Details

Hide Details

runCmd: thread list output: Process 90162 stopped * thread #1: tid = 0x69f8b5, 0x0000000100001207 a.out`main(argc=1, argv=0x00007ffeefbff5a0) at main.cpp:105:5, queue = 'com.apple.main-thread', stop reason = breakpoint 1.1 thread #2: tid = 0x69fa29, 0x00007fff58824aa6 libsystem_kernel.dylib`__write_nocancel + 10 thread #3: tid = 0x69fa2a, 0x00007fff58823872 libsystem_kernel.dylib`__psynch_mutexwait + 10 thread #4: tid = 0x69fa2b, 0x00007fff58823872 libsystem_kernel.dylib`__psynch_mutexwait + 10

Hide Details

Hide Details

Expecting sub string: stopped Matched

Hide Details

Expecting sub string: stop reason = breakpoint Matched

Hide Details

runCmd: watchpoint set expression -w write -s 1 -- g_char_ptr + 7 output: Watchpoint created: Watchpoint 1: addr = 0x100400087 size = 1 state = enabled type = w new value: 0x0000000000000000

Hide Details

Hide Details

Expecting sub string: Watchpoint created Matched

Hide Details

Expecting sub string: size = 1 Matched

Hide Details

Expecting sub string: type = w Matched

Hide Details

runCmd: expr unsigned val = g_char_ptr[7]; val output: (unsigned int) $1 = 0

Hide Details

Hide Details

looking at: (unsigned int) $1 = 0

Hide Details

Expecting end string: = 0 Matched

Hide Details

runCmd: watchpoint list -v output: Number of supported hardware watchpoints: 4 Current watchpoints: Watchpoint 1: addr = 0x100400087 size = 1 state = enabled type = w new value: 0x0000000000000000 hw_index = -1 hit_count = 0 ignore_count = 0

Hide Details

Hide Details

Expecting sub string: hit_count = 0 Matched

Hide Details

runCmd: process continue output: Process 90162 resuming Process 90162 stopped * thread #2, stop reason = watchpoint 1 frame #0: 0x0000000100000d92 a.out`do_bad_thing_with_location(index=7, char_ptr="", new_val='c') at main.cpp:36:1 33 unsigned what = new_val; 34 printf("new value written to array(%p) and index(%u) = %u\n", char_ptr, index, what); 35 char_ptr[index] = new_val; -> 36 } ^ 37 38 uint32_t 39 access_pool (bool flag = false) thread #3, stop reason = watchpoint 1 frame #0: 0x0000000100000d92 a.out`do_bad_thing_with_location(index=7, char_ptr="", new_val='c') at main.cpp:36:1 33 unsigned what = new_val; 34 printf("new value written to array(%p) and index(%u) = %u\n", char_ptr, index, what); 35 char_ptr[index] = new_val; -> 36 } ^ 37 38 uint32_t 39 access_pool (bool flag = false)

Hide Details

Hide Details

Hide Details

runCmd: thread list output: Process 90162 stopped thread #1: tid = 0x69f8b5, 0x00007fff5882336a libsystem_kernel.dylib`__ulock_wait + 10, queue = 'com.apple.main-thread' * thread #2: tid = 0x69fa29, 0x0000000100000d92 a.out`do_bad_thing_with_location(index=7, char_ptr="", new_val='c') at main.cpp:36:1, stop reason = watchpoint 1 thread #3: tid = 0x69fa2a, 0x0000000100000d92 a.out`do_bad_thing_with_location(index=7, char_ptr="", new_val='c') at main.cpp:36:1, stop reason = watchpoint 1 thread #4: tid = 0x69fa2b, 0x00007fff587b55e4 libsystem_c.dylib`memchr

Hide Details

Hide Details

Expecting sub string: stopped Matched

Hide Details

Expecting sub string: stop reason = watchpoint Matched

Hide Details

Expecting sub string: do_bad_thing_with_location Matched

Hide Details

runCmd: thread list output: Process 90162 stopped thread #1: tid = 0x69f8b5, 0x00007fff5882336a libsystem_kernel.dylib`__ulock_wait + 10, queue = 'com.apple.main-thread' * thread #2: tid = 0x69fa29, 0x0000000100000d92 a.out`do_bad_thing_with_location(index=7, char_ptr="", new_val='c') at main.cpp:36:1, stop reason = watchpoint 1 thread #3: tid = 0x69fa2a, 0x0000000100000d92 a.out`do_bad_thing_with_location(index=7, char_ptr="", new_val='c') at main.cpp:36:1, stop reason = watchpoint 1 thread #4: tid = 0x69fa2b, 0x00007fff587b55e4 libsystem_c.dylib`memchr

Hide Details

Hide Details

runCmd: thread select 2 output:

Hide Details

runCmd: thread select 3 output:

Hide Details

runCmd: thread backtrace output: * thread #3, stop reason = watchpoint 1 * frame #0: 0x0000000100000d92 a.out`do_bad_thing_with_location(index=7, char_ptr="", new_val='c') at main.cpp:36:1 frame #1: 0x0000000100000e4e a.out`access_pool(flag=true) at main.cpp:53:9 frame #2: 0x0000000100000f35 a.out`thread_func(thread_index=1) at main.cpp:80:19 frame #3: 0x00000001000027c4 a.out`decltype(__f=0x00000001004001f8, __args=0x0000000100400200)(unsigned int)>(fp)(std::__1::forward<long>(fp0))) std::__1::__invoke<void (*)(unsigned int), long>(void (*&&)(unsigned int), long&&) at type_traits:3539:1 frame #4: 0x000000010000270e a.out`void std::__1::__thread_execute<std::__1::unique_ptr<std::__1::__thread_struct, std::__1::default_delete<std::__1::__thread_struct> >, void (*)(unsigned int), long, 2ul>(__t=size=3, (null)=__tuple_indices<2> @ 0x000070000f0a2eb8)(unsigned int), long>&, std::__1::__tuple_indices<2ul>) at thread:273:5 frame #5: 0x0000000100001f16 a.out`void* std::__1::__thread_proxy<std::__1::tuple<std::__1::unique_ptr<std::__1::__thread_struct, std::__1::default_delete<std::__1::__thread_struct> >, void (*)(unsigned int), long> >(__vp=0x00000001004001f0) at thread:284:5 frame #6: 0x00007fff588da33d libsystem_pthread.dylib`_pthread_body + 126 frame #7: 0x00007fff588dd2a7 libsystem_pthread.dylib`_pthread_start + 70 frame #8: 0x00007fff588d9425 libsystem_pthread.dylib`thread_start + 13

Hide Details

Hide Details

runCmd: expr unsigned val = g_char_ptr[7]; val output: (unsigned int) $2 = 99

Hide Details

Hide Details

looking at: (unsigned int) $2 = 99

Hide Details

Expecting end string: = 99 Matched

Hide Details

runCmd: watchpoint list -v output: Number of supported hardware watchpoints: 4 Current watchpoints: Watchpoint 1: addr = 0x100400087 size = 1 state = enabled type = w old value: 0x0000000000000063 new value: 0x0000000000000063 hw_index = 0 hit_count = 2 ignore_count = 0

Hide Details

Hide Details

Expecting sub string: hit_count = 2 Matched

Hide Details

runCmd: thread backtrace all output: thread #1, queue = 'com.apple.main-thread' frame #0: 0x00007fff5882336a libsystem_kernel.dylib`__ulock_wait + 10 frame #1: 0x00007fff588de70b libsystem_pthread.dylib`_pthread_join + 356 frame #2: 0x00007fff55e08978 libc++.1.dylib`std::__1::thread::join() + 24 frame #3: 0x000000010000127f a.out`main(argc=1, argv=0x00007ffeefbff5a0) at main.cpp:110:16 frame #4: 0x00007fff586e8085 libdyld.dylib`start + 1 thread #2, stop reason = watchpoint 1 frame #0: 0x0000000100000d92 a.out`do_bad_thing_with_location(index=7, char_ptr="", new_val='c') at main.cpp:36:1 frame #1: 0x0000000100000e4e a.out`access_pool(flag=true) at main.cpp:53:9 frame #2: 0x0000000100000f35 a.out`thread_func(thread_index=0) at main.cpp:80:19 frame #3: 0x00000001000027c4 a.out`decltype(__f=0x00000001004001a8, __args=0x00000001004001b0)(unsigned int)>(fp)(std::__1::forward<long>(fp0))) std::__1::__invoke<void (*)(unsigned int), long>(void (*&&)(unsigned int), long&&) at type_traits:3539:1 frame #4: 0x000000010000270e a.out`void std::__1::__thread_execute<std::__1::unique_ptr<std::__1::__thread_struct, std::__1::default_delete<std::__1::__thread_struct> >, void (*)(unsigned int), long, 2ul>(__t=size=3, (null)=__tuple_indices<2> @ 0x000070000f01feb8)(unsigned int), long>&, std::__1::__tuple_indices<2ul>) at thread:273:5 frame #5: 0x0000000100001f16 a.out`void* std::__1::__thread_proxy<std::__1::tuple<std::__1::unique_ptr<std::__1::__thread_struct, std::__1::default_delete<std::__1::__thread_struct> >, void (*)(unsigned int), long> >(__vp=0x00000001004001a0) at thread:284:5 frame #6: 0x00007fff588da33d libsystem_pthread.dylib`_pthread_body + 126 frame #7: 0x00007fff588dd2a7 libsystem_pthread.dylib`_pthread_start + 70 frame #8: 0x00007fff588d9425 libsystem_pthread.dylib`thread_start + 13 * thread #3, stop reason = watchpoint 1 * frame #0: 0x0000000100000d92 a.out`do_bad_thing_with_location(index=7, char_ptr="", new_val='c') at main.cpp:36:1 frame #1: 0x0000000100000e4e a.out`access_pool(flag=true) at main.cpp:53:9 frame #2: 0x0000000100000f35 a.out`thread_func(thread_index=1) at main.cpp:80:19 frame #3: 0x00000001000027c4 a.out`decltype(__f=0x00000001004001f8, __args=0x0000000100400200)(unsigned int)>(fp)(std::__1::forward<long>(fp0))) std::__1::__invoke<void (*)(unsigned int), long>(void (*&&)(unsigned int), long&&) at type_traits:3539:1 frame #4: 0x000000010000270e a.out`void std::__1::__thread_execute<std::__1::unique_ptr<std::__1::__thread_struct, std::__1::default_delete<std::__1::__thread_struct> >, void (*)(unsigned int), long, 2ul>(__t=size=3, (null)=__tuple_indices<2> @ 0x000070000f0a2eb8)(unsigned int), long>&, std::__1::__tuple_indices<2ul>) at thread:273:5 frame #5: 0x0000000100001f16 a.out`void* std::__1::__thread_proxy<std::__1::tuple<std::__1::unique_ptr<std::__1::__thread_struct, std::__1::default_delete<std::__1::__thread_struct> >, void (*)(unsigned int), long> >(__vp=0x00000001004001f0) at thread:284:5 frame #6: 0x00007fff588da33d libsystem_pthread.dylib`_pthread_body + 126 frame #7: 0x00007fff588dd2a7 libsystem_pthread.dylib`_pthread_start + 70 frame #8: 0x00007fff588d9425 libsystem_pthread.dylib`thread_start + 13 thread #4 frame #0: 0x00007fff587b55e4 libsystem_c.dylib`memchr frame #1: 0x00007fff58771b54 libsystem_c.dylib`__sfvwrite + 611 frame #2: 0x00007fff5877ae2a libsystem_c.dylib`__vfprintf + 13516 frame #3: 0x00007fff587a013b libsystem_c.dylib`__v2printf + 475 frame #4: 0x00007fff58777882 libsystem_c.dylib`vfprintf_l + 54 frame #5: 0x00007fff5877599a libsystem_c.dylib`printf + 174 frame #6: 0x0000000100000d81 a.out`do_bad_thing_with_location(index=7, char_ptr="", new_val='c') at main.cpp:34:5 frame #7: 0x0000000100000e4e a.out`access_pool(flag=true) at main.cpp:53:9 frame #8: 0x0000000100000f35 a.out`thread_func(thread_index=2) at main.cpp:80:19 frame #9: 0x00000001000027c4 a.out`decltype(__f=0x0000000100400258, __args=0x0000000100400260)(unsigned int)>(fp)(std::__1::forward<long>(fp0))) std::__1::__invoke<void (*)(unsigned int), long>(void (*&&)(unsigned int), long&&) at type_traits:3539:1 frame #10: 0x000000010000270e a.out`void std::__1::__thread_execute<std::__1::unique_ptr<std::__1::__thread_struct, std::__1::default_delete<std::__1::__thread_struct> >, void (*)(unsigned int), long, 2ul>(__t=size=3, (null)=__tuple_indices<2> @ 0x000070000f125eb8)(unsigned int), long>&, std::__1::__tuple_indices<2ul>) at thread:273:5 frame #11: 0x0000000100001f16 a.out`void* std::__1::__thread_proxy<std::__1::tuple<std::__1::unique_ptr<std::__1::__thread_struct, std::__1::default_delete<std::__1::__thread_struct> >, void (*)(unsigned int), long> >(__vp=0x0000000100400250) at thread:284:5 frame #12: 0x00007fff588da33d libsystem_pthread.dylib`_pthread_body + 126 frame #13: 0x00007fff588dd2a7 libsystem_pthread.dylib`_pthread_start + 70 frame #14: 0x00007fff588d9425 libsystem_pthread.dylib`thread_start + 13

Hide Details

Hide Details

<bound method SBProcess.Kill of <lldb.SBProcess; proxy of <Swig Object of type 'lldb::SBProcess *' at 0x10ddeb870> >>: success

Hide Details

PASS: LLDB (/Users/buildslave/jenkins/workspace/lldb-cmake/lldb-build/bin/clang-10-x86_64) :: test_watchlocation_using_watchpoint_set_gmodules (TestWatchLocationWithWatchSet.WatchLocationUsingWatchpointSetTestCase) Restore dir to: /Users/buildslave/jenkins/workspace/lldb-cmake/lldb-build/tools/lldb/test ====================================================================== FAIL: test_watchlocation_using_watchpoint_set_dwarf (TestWatchLocationWithWatchSet.WatchLocationUsingWatchpointSetTestCase) Test watching a location with 'watchpoint set expression -w write -s size' option. ---------------------------------------------------------------------- Traceback (most recent call last): File "/Users/buildslave/jenkins/workspace/lldb-cmake/llvm-project/lldb/packages/Python/lldbsuite/test/lldbtest.py", line 1732, in test_method return attrvalue(self) File "/Users/buildslave/jenkins/workspace/lldb-cmake/llvm-project/lldb/packages/Python/lldbsuite/test/decorators.py", line 111, in wrapper func(*args, **kwargs) File "/Users/buildslave/jenkins/workspace/lldb-cmake/llvm-project/lldb/packages/Python/lldbsuite/test/commands/watchpoints/watchpoint_set_command/TestWatchLocationWithWatchSet.py", line 68, in test_watchlocation_using_watchpoint_set 'type = w']) File "/Users/buildslave/jenkins/workspace/lldb-cmake/llvm-project/lldb/packages/Python/lldbsuite/test/lldbtest.py", line 2302, in expect inHistory=inHistory) File "/Users/buildslave/jenkins/workspace/lldb-cmake/llvm-project/lldb/packages/Python/lldbsuite/test/lldbtest.py", line 2061, in runCmd msg if (msg) else CMD_MSG(cmd)) AssertionError: False is not True : Watchpoint created successfully Error output: error: expression evaluation of address to watch failed expression evaluated: g_char_ptr + 7

Hide Details

Config=x86_64-/Users/buildslave/jenkins/workspace/lldb-cmake/lldb-build/bin/clang-10 ---------------------------------------------------------------------- Ran 4 tests in 52.274s

Hide Details

RESULT: FAILED (2 passes, 1 failures, 0 errors, 1 skipped, 0 expected failures, 0 unexpected successes)

Hide Details

******************** PASS: lldb-api :: functionalities/data-formatter/data-formatter-objc/TestDataFormatterObjCNSError.py (820 of 1857) PASS: lldb-unit :: Language/Highlighting/./HighlighterTests/HighlighterTest.ClangCursorPosInOtherToken (821 of 1857) PASS: lldb-unit :: Utility/./UtilityTests/BinaryStreamTest.PutULEB128ThreeBytes (822 of 1857) PASS: lldb-shell :: ObjectFile/ELF/build-id-case.yaml (823 of 1857) PASS: lldb-api :: functionalities/object-file/TestImageListMultiArchitecture.py (824 of 1857) PASS: lldb-unit :: Utility/./UtilityTests/OptionsWithRawTest.SingleWhitespaceInput (825 of 1857) PASS: lldb-unit :: Utility/./UtilityTests/StringListTest.JoinMultiCharSeparator (826 of 1857) PASS: lldb-unit :: Signals/./SignalsTests/UnixSignalsTest.GetFilteredSignals (827 of 1857) PASS: lldb-unit :: Utility/./UtilityTests/StreamTeeTest.SetStreamAtIndexOutOfBounds (828 of 1857) PASS: lldb-shell :: SymbolFile/NativePDB/globals-bss.cpp (829 of 1857) PASS: lldb-unit :: Utility/./UtilityTests/StringExtractorTest.GetHexBytesAvail_Partial (830 of 1857) PASS: lldb-api :: commands/expression/import-std-module/list-dbg-info-content/TestDbgInfoContentList.py (831 of 1857) UNSUPPORTED: lldb-shell :: Register/arm-fp-read.test (832 of 1857) PASS: lldb-api :: commands/process/attach/TestProcessAttach.py (833 of 1857) PASS: lldb-api :: functionalities/tail_call_frames/thread_step_out_message/TestArtificialFrameStepOutMessage.py (834 of 1857) PASS: lldb-api :: lang/cpp/trivial_abi/TestTrivialABI.py (835 of 1857) PASS: lldb-api :: functionalities/inferior-assert/TestInferiorAssert.py (836 of 1857) PASS: lldb-api :: commands/expression/entry-bp/TestExprEntryBP.py (837 of 1857) PASS: lldb-api :: lang/objc/modules-hash-mismatch/TestClangModulesHashMismatch.py (838 of 1857) PASS: lldb-shell :: Commands/command-regex-unalias.test (839 of 1857) PASS: lldb-api :: commands/expression/rdar42038760/TestScalarURem.py (840 of 1857) PASS: lldb-unit :: ObjectFile/Breakpad/./ObjectFileBreakpadTests/ModuleRecord.parse (841 of 1857) PASS: lldb-shell :: Driver/TestNoUseColor.test (842 of 1857) PASS: lldb-shell :: SymbolFile/DWARF/apple-index-is-used.cpp (843 of 1857) PASS: lldb-unit :: Target/./TargetTests/PathMappingListTest.RelativeTests (844 of 1857) PASS: lldb-unit :: Process/minidump/./LLDBMinidumpTests/MinidumpParserTest.GetMemoryRegionInfoLinuxMaps (845 of 1857) PASS: lldb-unit :: Utility/./UtilityTests/TimerTest.CategoryTimes (846 of 1857) PASS: lldb-api :: functionalities/ubsan/user-expression/TestUbsanUserExpression.py (847 of 1857) PASS: lldb-unit :: Utility/./UtilityTests/UriParserTest.Empty (848 of 1857) PASS: lldb-unit :: UnwindAssembly/x86/./UnwindAssemblyx86Tests/Testx86AssemblyInspectionEngine.TestPopR13 (849 of 1857) PASS: lldb-unit :: Expression/./ExpressionTests/DiagnosticManagerTest.PutStringMultiple (850 of 1857) PASS: lldb-unit :: Utility/./UtilityTests/StreamTeeTest.SetStreamAtIndexOverwrite (851 of 1857) PASS: lldb-unit :: Utility/./UtilityTests/UserIDResolver.GetUserName (852 of 1857) PASS: lldb-unit :: Utility/./UtilityTests/LogChannelTest.List (853 of 1857) PASS: lldb-unit :: Utility/./UtilityTests/CompletionRequest.TestCompletionOwnership (854 of 1857) PASS: lldb-unit :: Utility/./UtilityTests/ArgsTest.TestTrailingBackslash (855 of 1857) PASS: lldb-api :: lang/c/step-target/TestStepTarget.py (856 of 1857) PASS: lldb-api :: commands/breakpoint/command/list/TestBreakpointCommandList.py (857 of 1857) PASS: lldb-unit :: Expression/./ExpressionTests/CppModuleConfigurationTest.Sysroot (858 of 1857) PASS: lldb-shell :: Settings/TestDisassemblyFormat.test (859 of 1857) PASS: lldb-api :: lang/c/blocks/TestBlocks.py (860 of 1857) PASS: lldb-unit :: Utility/./UtilityTests/StringExtractorTest.GetNameColonValueNoColon (861 of 1857) PASS: lldb-api :: functionalities/signal/raise/TestRaise.py (862 of 1857) PASS: lldb-unit :: Process/minidump/./LLDBMinidumpTests/MinidumpParserTest.GetThreadsAndGetThreadContext (863 of 1857) PASS: lldb-api :: functionalities/data-formatter/format-propagation/TestFormatPropagation.py (864 of 1857) PASS: lldb-unit :: Utility/./UtilityTests/Flags.Reset (865 of 1857) PASS: lldb-unit :: Utility/./UtilityTests/FileSpecTest.EqualSeparator (866 of 1857) PASS: lldb-unit :: ScriptInterpreter/Python/./ScriptInterpreterPythonTests/PythonDataObjectsTest.TestPythonTupleValues (867 of 1857) PASS: lldb-api :: lang/c/offsetof/TestOffsetof.py (868 of 1857) PASS: lldb-unit :: Utility/./UtilityTests/ScalarTest.Scalar_512 (869 of 1857) PASS: lldb-unit :: Utility/./UtilityTests/StateTest.Formatv (870 of 1857) PASS: lldb-unit :: Language/Highlighting/./HighlighterTests/HighlighterTest.ClangTrailingBackslashMissingNewLine (871 of 1857) UNSUPPORTED: lldb-api :: tools/lldb-server/platform-process-connect/TestPlatformProcessConnect.py (872 of 1857) PASS: lldb-unit :: Utility/./UtilityTests/RangeTest.Union (873 of 1857) PASS: lldb-api :: commands/expression/scoped_enums/TestScopedEnumType.py (874 of 1857) PASS: lldb-api :: functionalities/tsan/multiple/TestTsanMultiple.py (875 of 1857) PASS: lldb-unit :: Utility/./UtilityTests/StringExtractorTest.GetHexU8_Underflow2 (876 of 1857) PASS: lldb-unit :: Utility/./UtilityTests/UUIDTest.SetFromStringRef (877 of 1857) PASS: lldb-shell :: Breakpoint/debug_rnglist_basic.test (878 of 1857) PASS: lldb-unit :: Utility/./UtilityTests/AnsiTerminal.WhiteSpace (879 of 1857) PASS: lldb-api :: commands/expression/import-std-module/basic/TestImportStdModule.py (880 of 1857) PASS: lldb-api :: lang/c/const_variables/TestConstVariables.py (881 of 1857) PASS: lldb-api :: functionalities/breakpoint/breakpoint_command/TestBreakpointCommandsFromPython.py (882 of 1857) PASS: lldb-unit :: Utility/./UtilityTests/StringListTest.SplitIntoLinesEmpty (883 of 1857) PASS: lldb-api :: functionalities/data-formatter/synthcapping/TestSyntheticCapping.py (884 of 1857) PASS: lldb-api :: lang/cpp/incomplete-types/TestCppIncompleteTypes.py (885 of 1857) PASS: lldb-api :: functionalities/thread/thread_specific_break/TestThreadSpecificBreakpoint.py (886 of 1857) PASS: lldb-api :: types/TestRecursiveTypes.py (887 of 1857) PASS: lldb-api :: functionalities/history/TestHistoryRecall.py (888 of 1857) PASS: lldb-shell :: Expr/TestMultilineExpr.test (889 of 1857) PASS: lldb-unit :: UnwindAssembly/x86/./UnwindAssemblyx86Tests/Testx86AssemblyInspectionEngine.TestPushExtended (890 of 1857) UNSUPPORTED: lldb-shell :: SymbolFile/PDB/typedefs.test (891 of 1857) PASS: lldb-api :: functionalities/thread/concurrent_events/TestConcurrentCrashWithWatchpoint.py (892 of 1857) PASS: lldb-unit :: Expression/./ExpressionTests/DWARFExpression.DW_OP_pick (893 of 1857) PASS: lldb-unit :: Process/gdb-remote/./ProcessGdbRemoteTests/GDBRemoteCommunicationClientTest.WriteRegister (894 of 1857) PASS: lldb-unit :: ScriptInterpreter/Python/./ScriptInterpreterPythonTests/PythonDataObjectsTest.TestTypeNameResolutionNoDot (895 of 1857) UNSUPPORTED: lldb-api :: functionalities/unwind/ehframe/TestEhFrameUnwind.py (896 of 1857) PASS: lldb-shell :: BuildScript/script-args.test (897 of 1857) PASS: lldb-unit :: Utility/./UtilityTests/Flags.AnyClear (898 of 1857) PASS: lldb-api :: lang/cpp/template/TestTemplateArgs.py (899 of 1857) PASS: lldb-api :: lang/c/unions/TestUnionMembers.py (900 of 1857) PASS: lldb-api :: commands/expression/dont_allow_jit/TestAllowJIT.py (901 of 1857) PASS: lldb-unit :: Process/gdb-remote/./ProcessGdbRemoteTests/GDBRemoteCommunicationServerTest.SendErrorResponse_Status (902 of 1857) PASS: lldb-api :: functionalities/set-data/TestSetData.py (903 of 1857) PASS: lldb-unit :: Utility/./UtilityTests/CompletionRequest.TryCompleteCurrentArgBad (904 of 1857) PASS: lldb-api :: commands/watchpoints/multiple_threads/TestWatchpointMultipleThreads.py (905 of 1857) PASS: lldb-api :: python_api/file_handle/TestFileHandle.py (906 of 1857) PASS: lldb-shell :: ObjectFile/Breakpad/sections.test (907 of 1857) PASS: lldb-unit :: Language/Highlighting/./HighlighterTests/HighlighterTest.ClangOperators (908 of 1857) PASS: lldb-unit :: Utility/./UtilityTests/SerializationRountripTest.SerializeDeserializeCString (909 of 1857) PASS: lldb-unit :: Target/./TargetTests/ModuleCacheTest.GetAndPutUuidExists (910 of 1857) PASS: lldb-unit :: Utility/./UtilityTests/ProcessInstanceInfo.DumpTable (911 of 1857) PASS: lldb-api :: commands/register/register/register_command/TestRegisters.py (912 of 1857) PASS: lldb-unit :: Host/./HostTests/FileSystemTest.FileAndDirectoryComponents (913 of 1857) PASS: lldb-unit :: ScriptInterpreter/Python/./ScriptInterpreterPythonTests/PythonDataObjectsTest.TestPythonListToStructuredList (914 of 1857) UNSUPPORTED: lldb-api :: functionalities/thread/concurrent_events/TestConcurrentManySignals.py (915 of 1857) PASS: lldb-api :: functionalities/data-formatter/data-formatter-objc/TestDataFormatterObjCNSURL.py (916 of 1857) PASS: lldb-api :: lang/objc/objc-new-syntax/TestObjCNewSyntaxLiteral.py (917 of 1857) UNSUPPORTED: lldb-api :: lang/objc/rdar-12408181/TestRdar12408181.py (918 of 1857) PASS: lldb-api :: commands/frame/diagnose/dereference-argument/TestDiagnoseDereferenceArgument.py (919 of 1857) PASS: lldb-unit :: Utility/./UtilityTests/UUIDTest.RelationalOperators (920 of 1857) PASS: lldb-api :: functionalities/abbreviation/TestCommonShortSpellings.py (921 of 1857) PASS: lldb-shell :: SymbolFile/Breakpad/symtab-macho.test (922 of 1857) PASS: lldb-shell :: ObjectFile/PECOFF/section-types.yaml (923 of 1857) PASS: lldb-unit :: Utility/./UtilityTests/VMRange.ContainsRange (924 of 1857) PASS: lldb-unit :: debugserver/./debugserverTests/RNBSocket.AnyListen (925 of 1857) PASS: lldb-shell :: ObjectFile/ELF/PT_LOAD-overlap-PT_INTERP.yaml (926 of 1857) PASS: lldb-unit :: Expression/./ExpressionTests/DWARFExpression.DW_OP_convert (927 of 1857) PASS: lldb-api :: commands/watchpoints/hello_watchpoint/TestMyFirstWatchpoint.py (928 of 1857) PASS: lldb-unit :: Utility/./UtilityTests/SerializationRountripTest.SerializeDeserializePod (929 of 1857) PASS: lldb-unit :: Utility/./UtilityTests/RangeDataVector.FindEntryThatContains (930 of 1857) PASS: lldb-unit :: Host/./HostTests/ProcessLaunchInfoTest.Constructor (931 of 1857) PASS: lldb-unit :: Utility/./UtilityTests/BroadcasterTest.EventTypeHasListeners (932 of 1857) PASS: lldb-unit :: Process/minidump/./LLDBMinidumpTests/MinidumpParserTest.GetMemoryRegionInfo (933 of 1857) PASS: lldb-unit :: Utility/./UtilityTests/StringExtractorTest.GetHexBytesAvail_OddPair2 (934 of 1857) PASS: lldb-unit :: UnwindAssembly/x86/./UnwindAssemblyx86Tests/Testx86AssemblyInspectionEngine.TestPopR12 (935 of 1857) PASS: lldb-api :: lang/cpp/breakpoint_in_member_func_w_non_primitive_params/TestBreakpointInMemberFuncWNonPrimitiveParams.py (936 of 1857) PASS: lldb-unit :: Utility/./UtilityTests/Flags.Test (937 of 1857) PASS: lldb-api :: types/TestLongTypesExpr.py (938 of 1857) PASS: lldb-unit :: Symbol/./SymbolTests/SymbolsTest.LocateExecutableSymbolFileForUnknownExecutableAndMissingSymbolFile (939 of 1857) UNSUPPORTED: lldb-api :: functionalities/data-formatter/data-formatter-stl/libstdcpp/vector/TestDataFormatterStdVector.py (940 of 1857) PASS: lldb-unit :: SymbolFile/DWARF/./SymbolFileDWARFTests/SymbolFileDWARFTests.TestAbbrevOrder1Start1 (941 of 1857) PASS: lldb-api :: sample_test/TestSampleInlineTest.py (942 of 1857) PASS: lldb-unit :: Utility/./UtilityTests/StringListTest.AppendListCStringArrayEmpty (943 of 1857) PASS: lldb-unit :: ScriptInterpreter/Python/./ScriptInterpreterPythonTests/PythonDataObjectsTest.TestPythonBytes (944 of 1857) UNSUPPORTED: lldb-shell :: SymbolFile/PDB/compilands.test (945 of 1857) PASS: lldb-unit :: Utility/./UtilityTests/RangeTest.DoesAdjoinOrIntersect (946 of 1857) PASS: lldb-shell :: SymbolFile/NativePDB/s_constant.cpp (947 of 1857) PASS: lldb-unit :: Utility/./UtilityTests/BinaryStreamTest.PutSLEB128One (948 of 1857) PASS: lldb-api :: commands/frame/diagnose/bad-reference/TestBadReference.py (949 of 1857) PASS: lldb-unit :: SymbolFile/NativePDB/./SymbolFileNativePDBTests/PDBFPOProgramToDWARFExpressionTests.InvalidOpBinary (950 of 1857) PASS: lldb-unit :: Process/gdb-remote/./ProcessGdbRemoteTests/GDBRemoteCommunicationClientTest.GetModulesInfo (951 of 1857) UNSUPPORTED: lldb-api :: commands/expression/completion-crash-incomplete-record/TestCompletionCrashIncompleteRecord.py (952 of 1857) PASS: lldb-unit :: Utility/./UtilityTests/VMRange.Reset (953 of 1857) PASS: lldb-unit :: Language/Highlighting/./HighlighterTests/HighlighterTest.ClangScalarLiterals (954 of 1857) PASS: lldb-unit :: Utility/./UtilityTests/StringListTest.JoinNonSpace (955 of 1857) UNSUPPORTED: lldb-api :: functionalities/darwin_log/filter/exact_match/activity/TestDarwinLogFilterMatchActivity.py (956 of 1857) PASS: lldb-unit :: Language/Highlighting/./HighlighterTests/HighlighterTest.ClangEmptyInput (957 of 1857) PASS: lldb-api :: lang/cpp/namespace_definitions/TestNamespaceDefinitions.py (958 of 1857) PASS: lldb-shell :: Breakpoint/implicit_const_form_support.test (959 of 1857) PASS: lldb-unit :: Utility/./UtilityTests/OptionsWithRawTest.WhitespaceSuffix (960 of 1857) PASS: lldb-api :: commands/help/TestHelp.py (961 of 1857) PASS: lldb-api :: functionalities/data-formatter/data-formatter-stl/libcxx/list/TestDataFormatterLibcxxList.py (962 of 1857) PASS: lldb-api :: functionalities/data-formatter/data-formatter-objc/TestDataFormatterObjCExpr.py (963 of 1857) PASS: lldb-api :: functionalities/inferior-changed/TestInferiorChanged.py (964 of 1857) PASS: lldb-unit :: Host/./HostTests/SocketTest.UDPConnect (965 of 1857) PASS: lldb-unit :: Process/minidump/./LLDBMinidumpTests/MinidumpParserTest.GetFilteredModuleList (966 of 1857) PASS: lldb-shell :: SymbolFile/DWARF/debug_ranges.s (967 of 1857) PASS: lldb-unit :: Interpreter/./InterpreterTests/CompletionTest.FileCompletionAbsolute (968 of 1857) PASS: lldb-shell :: Reproducer/TestMultipleTargets.test (969 of 1857) PASS: lldb-unit :: Utility/./UtilityTests/Flags.AllClear (970 of 1857) PASS: lldb-api :: commands/reproducer/invalid-args/TestInvalidArgsReproducer.py (971 of 1857) PASS: lldb-unit :: Utility/./UtilityTests/StringListTest.ShiftStdString (972 of 1857) PASS: lldb-api :: commands/expression/two-files/TestObjCTypeQueryFromOtherCompileUnit.py (973 of 1857) PASS: lldb-unit :: Utility/./UtilityTests/Flags.IsClear (974 of 1857) PASS: lldb-unit :: Utility/./UtilityTests/OptionsWithRawTest.ArgsButNoLeadingDash (975 of 1857) PASS: lldb-api :: lang/cpp/namespace/TestNamespaceLookup.py (976 of 1857) PASS: lldb-api :: lang/objc/ivar-IMP/TestObjCiVarIMP.py (977 of 1857) PASS: lldb-unit :: Utility/./UtilityTests/StringListTest.SplitIntoLines (978 of 1857) PASS: lldb-unit :: Utility/./UtilityTests/AnsiTerminal.Empty (979 of 1857) PASS: lldb-unit :: Utility/./UtilityTests/BinaryStreamTest.PutULEB128SixBytes (980 of 1857) PASS: lldb-api :: functionalities/data-formatter/data-formatter-synth/TestDataFormatterSynth.py (981 of 1857) PASS: lldb-unit :: SymbolFile/NativePDB/./SymbolFileNativePDBTests/PDBFPOProgramToDWARFExpressionTests.MissingTargetRegister (982 of 1857) PASS: lldb-api :: commands/expression/import-std-module/vector-of-vectors/TestVectorOfVectors.py (983 of 1857) PASS: lldb-unit :: Utility/./UtilityTests/NameMatchesTest.RegularExpression (984 of 1857) PASS: lldb-unit :: Symbol/./SymbolTests/TestClangASTContext.TestRemoveFastQualifiers (985 of 1857) PASS: lldb-unit :: UnwindAssembly/x86/./UnwindAssemblyx86Tests/Testx86AssemblyInspectionEngine.TestAddESP (986 of 1857) PASS: lldb-unit :: ScriptInterpreter/Python/./ScriptInterpreterPythonTests/PythonDataObjectsTest.TestOwnedReferences (987 of 1857) PASS: lldb-shell :: ObjectFile/ELF/base-address.yaml (988 of 1857) PASS: lldb-unit :: Process/minidump/./LLDBMinidumpTests/MinidumpParserTest.GetThreadContext_x86_32_wow64 (989 of 1857) PASS: lldb-api :: commands/expression/call-overridden-method/TestCallOverriddenMethod.py (990 of 1857) PASS: lldb-unit :: Host/./HostTests/NativeProcessProtocolTest.ReadCStringFromMemory (991 of 1857) PASS: lldb-api :: lang/objc/print-obj/TestPrintObj.py (992 of 1857) PASS: lldb-unit :: Host/./HostTests/File.GetWaitableHandleFileno (993 of 1857) PASS: lldb-unit :: Utility/./UtilityTests/StreamTest.PutMaxHex64ByteOrderBig (994 of 1857) PASS: lldb-api :: python_api/lldbutil/iter/TestLLDBIterator.py (995 of 1857) PASS: lldb-api :: functionalities/data-formatter/data-formatter-caching/TestDataFormatterCaching.py (996 of 1857) PASS: lldb-unit :: Utility/./UtilityTests/AnsiTerminal.Twice (997 of 1857) PASS: lldb-shell :: ObjectFile/PECOFF/disassemble-thumb.yaml (998 of 1857) PASS: lldb-unit :: Utility/./UtilityTests/StringExtractorTest.GetHexU8_Underflow2_NoEof (999 of 1857) PASS: lldb-api :: lang/objc/exceptions/TestObjCExceptions.py (1000 of 1857) PASS: lldb-api :: macosx/indirect_symbol/TestIndirectSymbols.py (1001 of 1857) PASS: lldb-api :: functionalities/data-formatter/data-formatter-stl/libcxx/vector/TestDataFormatterLibcxxVector.py (1002 of 1857) PASS: lldb-unit :: Process/gdb-remote/./ProcessGdbRemoteTests/GDBRemoteClientBaseTest.SendContinueAndAsyncPacket (1003 of 1857) PASS: lldb-unit :: Utility/./UtilityTests/BinaryStreamTest.PutSLEB128OneByte (1004 of 1857) PASS: lldb-unit :: Expression/./ExpressionTests/CppModuleConfigurationTest.MissingLibCpp (1005 of 1857) PASS: lldb-shell :: Watchpoint/SetErrorCases.test (1006 of 1857) UNSUPPORTED: lldb-api :: functionalities/data-formatter/data-formatter-stl/libstdcpp/map/TestDataFormatterStdMap.py (1007 of 1857) PASS: lldb-unit :: UnwindAssembly/ARM64/./Arm64InstEmulationTests/TestArm64InstEmulation.TestFramelessThreeEpilogueFunction (1008 of 1857) PASS: lldb-unit :: SymbolFile/NativePDB/./SymbolFileNativePDBTests/PDBFPOProgramToDWARFExpressionTests.UnresolvedCyclicRegisterAssignmentReference (1009 of 1857) PASS: lldb-api :: functionalities/data-formatter/synthupdate/TestSyntheticFilterRecompute.py (1010 of 1857) PASS: lldb-unit :: SymbolFile/DWARF/./SymbolFileDWARFTests/SymbolFileDWARFTests.TestAbbrevOutOfOrder (1011 of 1857) PASS: lldb-unit :: Utility/./UtilityTests/StringListTest.ShiftMove (1012 of 1857) PASS: lldb-api :: macosx/add-dsym/TestAddDsymMidExecutionCommand.py (1013 of 1857) PASS: lldb-unit :: Utility/./UtilityTests/BinaryStreamTest.PutULEB128MaxValue (1014 of 1857) PASS: lldb-api :: functionalities/step-avoids-no-debug/TestStepNoDebug.py (1015 of 1857) PASS: lldb-unit :: Signals/./SignalsTests/UnixSignalsTest.VersionChange (1016 of 1857) PASS: lldb-unit :: Process/gdb-remote/./ProcessGdbRemoteTests/GDBRemoteClientBaseTest.SendContinueAndAsyncSignal (1017 of 1857) PASS: lldb-shell :: Breakpoint/debug_addrx.test (1018 of 1857) PASS: lldb-api :: macosx/queues/TestQueues.py (1019 of 1857) PASS: lldb-api :: functionalities/data-formatter/data-formatter-stl/libcxx/map/TestDataFormatterLibccMap.py (1020 of 1857) PASS: lldb-unit :: Language/Highlighting/./HighlighterTests/HighlighterTest.HighlighterSelectionPath (1021 of 1857) UNSUPPORTED: lldb-shell :: Process/Windows/exception_access_violation.cpp (1022 of 1857) UNSUPPORTED: lldb-api :: functionalities/darwin_log/format/TestDarwinLogMessageFormat.py (1023 of 1857) PASS: lldb-unit :: ScriptInterpreter/Python/./ScriptInterpreterPythonTests/PythonDataObjectsTest.TestCallable (1024 of 1857) PASS: lldb-api :: functionalities/breakpoint/scripted_bkpt/TestScriptedResolver.py (1025 of 1857) PASS: lldb-api :: commands/expression/test/TestExprs.py (1026 of 1857) PASS: lldb-api :: commands/expression/import-std-module/weak_ptr/TestWeakPtr.py (1027 of 1857) PASS: lldb-shell :: SymbolFile/DWARF/find-basic-type.cpp (1028 of 1857) UNSUPPORTED: lldb-api :: functionalities/darwin_log/filter/exact_match/activity-chain/TestDarwinLogFilterMatchActivityChain.py (1029 of 1857) PASS: lldb-api :: functionalities/data-formatter/parray/TestPrintArray.py (1030 of 1857) PASS: lldb-api :: functionalities/asan/TestMemoryHistory.py (1031 of 1857) UNSUPPORTED: lldb-shell :: ObjectFile/ELF/minidebuginfo-set-and-hit-breakpoint.test (1032 of 1857) PASS: lldb-shell :: Driver/LocalLLDBInit.test (1033 of 1857) PASS: lldb-api :: functionalities/data-formatter/data-formatter-advanced/TestDataFormatterAdv.py (1034 of 1857) PASS: lldb-unit :: Utility/./UtilityTests/CompletionRequest.ShiftArguments (1035 of 1857) PASS: lldb-api :: lang/cpp/inlines/TestInlines.py (1036 of 1857) PASS: lldb-unit :: Language/Highlighting/./HighlighterTests/HighlighterTest.ClangComments (1037 of 1857) PASS: lldb-api :: functionalities/dynamic_value_child_count/TestDynamicValueChildCount.py (1038 of 1857) PASS: lldb-api :: commands/target/basic/TestTargetCommand.py (1039 of 1857) PASS: lldb-api :: commands/expression/import-std-module/forward_list-basic/TestBasicForwardList.py (1040 of 1857) PASS: lldb-unit :: Utility/./UtilityTests/BinaryStreamTest.PutSLEB128ThreeBytes (1041 of 1857) PASS: lldb-unit :: Symbol/./SymbolTests/PostfixExpression.ToDWARF (1042 of 1857) PASS: lldb-unit :: Utility/./UtilityTests/UriParserTest.PortOverflow (1043 of 1857) PASS: lldb-unit :: Process/minidump/./LLDBMinidumpTests/MinidumpParserTest.MinidumpModuleOrder (1044 of 1857) PASS: lldb-shell :: ObjectFile/ELF/compressed-sections.yaml (1045 of 1857) PASS: lldb-api :: commands/command/script_alias/TestCommandScriptAlias.py (1046 of 1857) PASS: lldb-api :: functionalities/gdb_remote_client/TestNestedRegDefinitions.py (1047 of 1857) PASS: lldb-shell :: ObjectFile/MachO/lc_build_version.yaml (1048 of 1857) PASS: lldb-unit :: UnwindAssembly/x86/./UnwindAssemblyx86Tests/Testx86AssemblyInspectionEngine.TestPushR12 (1049 of 1857) PASS: lldb-unit :: Utility/./UtilityTests/BinaryStreamTest.PutULEB128One (1050 of 1857) PASS: lldb-api :: linux/builtin_trap/TestBuiltinTrap.py (1051 of 1857) PASS: lldb-unit :: Disassembler/./DisassemblerTests/TestArm64Disassembly.TestArmv81Instruction (1052 of 1857) PASS: lldb-unit :: SymbolFile/NativePDB/./SymbolFileNativePDBTests/PDBFPOProgramToDWARFExpressionTests.UnresolvedRegisterReference (1053 of 1857) PASS: lldb-shell :: ObjectFile/ELF/PT_LOAD.yaml (1054 of 1857) PASS: lldb-unit :: UnwindAssembly/x86/./UnwindAssemblyx86Tests/Testx86AssemblyInspectionEngine.TestSpillRegToStackViaMOVi386 (1055 of 1857) PASS: lldb-unit :: Host/./HostTests/FileSystemTest.MakeAbsolute (1056 of 1857) PASS: lldb-unit :: SymbolFile/NativePDB/./SymbolFileNativePDBTests/PDBFPOProgramToDWARFExpressionTests.UnresolvedDependentCyclicRegisterAssignmentReference (1057 of 1857) PASS: lldb-api :: lang/cpp/accelerator-table/TestCPPAccelerator.py (1058 of 1857) PASS: lldb-api :: functionalities/breakpoint/objc/TestObjCBreakpoints.py (1059 of 1857) PASS: lldb-unit :: Process/minidump/./LLDBMinidumpTests/MinidumpParserTest.GetArchitecture (1060 of 1857) PASS: lldb-shell :: ObjectFile/ELF/minidebuginfo-corrupt-xz.yaml (1061 of 1857) PASS: lldb-shell :: Reproducer/TestRelativePath.test (1062 of 1857) UNSUPPORTED: lldb-api :: benchmarks/turnaround/TestCompileRunToBreakpointTurnaround.py (1063 of 1857) PASS: lldb-api :: commands/expression/import-std-module/vector-basic/TestBasicVector.py (1064 of 1857) UNSUPPORTED: lldb-shell :: SymbolFile/PDB/ast-restore.test (1065 of 1857) UNSUPPORTED: lldb-api :: functionalities/darwin_log/filter/exact_match/subsystem/TestDarwinLogFilterMatchSubsystem.py (1066 of 1857) PASS: lldb-api :: functionalities/gdb_remote_client/TestNoWatchpointSupportInfo.py (1067 of 1857) PASS: lldb-unit :: Process/gdb-remote/./ProcessGdbRemoteTests/GDBRemoteCommunicationClientTest.SendGetDataPacket (1068 of 1857) PASS: lldb-shell :: Breakpoint/single-file-split-dwarf.test (1069 of 1857) PASS: lldb-api :: commands/frame/recognizer/TestFrameRecognizer.py (1070 of 1857) PASS: lldb-api :: lang/cpp/modules-import/TestCXXModulesImport.py (1071 of 1857) PASS: lldb-api :: types/TestDoubleTypes.py (1072 of 1857) PASS: lldb-api :: functionalities/breakpoint/inlined_breakpoints/TestInlinedBreakpoints.py (1073 of 1857) PASS: lldb-shell :: SymbolFile/NativePDB/break-by-function.cpp (1074 of 1857) PASS: lldb-unit :: Utility/./UtilityTests/ArgsTest.TestSingleQuotedArgWithSpace (1075 of 1857) PASS: lldb-api :: macosx/duplicate-archive-members/TestDuplicateMembers.py (1076 of 1857) PASS: lldb-api :: commands/platform/basic/TestPlatformPython.py (1077 of 1857) UNSUPPORTED: lldb-shell :: SymbolFile/PDB/expressions.test (1078 of 1857) PASS: lldb-unit :: Utility/./UtilityTests/BinaryStreamTest.PutSLEB128SixBytes (1079 of 1857) PASS: lldb-unit :: Host/./HostTests/MainLoopTest.DetectsEOF (1080 of 1857) PASS: lldb-shell :: SymbolFile/NativePDB/bitfields.cpp (1081 of 1857) PASS: lldb-shell :: ObjectFile/ELF/PT_LOAD-overlap-PT_TLS.yaml (1082 of 1857) UNSUPPORTED: lldb-shell :: Register/x86-64-gp-write.test (1083 of 1857) PASS: lldb-api :: functionalities/data-formatter/data-formatter-objc/TestDataFormatterObjCNSBundle.py (1084 of 1857) PASS: lldb-api :: functionalities/exec/TestExec.py (1085 of 1857) PASS: lldb-shell :: SymbolFile/DWARF/debug_rnglists-dwo.s (1086 of 1857) PASS: lldb-unit :: Utility/./UtilityTests/RangeTest.ContainsAddrInvalid (1087 of 1857) PASS: lldb-unit :: Process/minidump/./LLDBMinidumpTests/MinidumpParserTest.GetMiscInfoWindows (1088 of 1857) PASS: lldb-api :: lang/c/vla/TestVLA.py (1089 of 1857) PASS: lldb-api :: lang/cpp/operator-overload/TestOperatorOverload.py (1090 of 1857) PASS: lldb-shell :: Register/x86-64-ymm-read.test (1091 of 1857) UNSUPPORTED: lldb-shell :: Register/x86-gp-read.test (1092 of 1857) PASS: lldb-unit :: Utility/./UtilityTests/StringExtractorTest.GetHexBytes_OddPair2 (1093 of 1857) PASS: lldb-api :: functionalities/data-formatter/data-formatter-ptr-to-array/TestPtrToArrayFormatting.py (1094 of 1857) PASS: lldb-api :: commands/expression/radar_9531204/TestPrintfAfterUp.py (1095 of 1857) PASS: lldb-unit :: Utility/./UtilityTests/RangeTest.DefaultConstructor (1096 of 1857) PASS: lldb-unit :: Utility/./UtilityTests/OptionsWithRawTest.WhitespaceInput (1097 of 1857) PASS: lldb-api :: functionalities/postmortem/netbsd-core/TestNetBSDCore.py (1098 of 1857) PASS: lldb-shell :: Unwind/trap_frame_sym_ctx.test (1099 of 1857) PASS: lldb-shell :: Driver/TestTarget.test (1100 of 1857) PASS: lldb-api :: functionalities/tail_call_frames/ambiguous_tail_call_seq2/TestAmbiguousTailCallSeq2.py (1101 of 1857) PASS: lldb-unit :: Process/gdb-remote/./ProcessGdbRemoteTests/GDBRemoteCommunicationClientTest.SendSignalsToIgnore (1102 of 1857) PASS: lldb-unit :: Process/gdb-remote/./ProcessGdbRemoteTests/GDBRemoteCommunicationClientTest.GetModulesInfoInvalidResponse (1103 of 1857) PASS: lldb-api :: python_api/function_symbol/TestDisasmAPI.py (1104 of 1857) PASS: lldb-unit :: Utility/./UtilityTests/StreamTest.PutChar (1105 of 1857) PASS: lldb-unit :: Symbol/./SymbolTests/Type.CompilerContextPattern (1106 of 1857) PASS: lldb-unit :: Utility/./UtilityTests/NameMatchesTest.Contains (1107 of 1857) UNSUPPORTED: lldb-api :: functionalities/thread/state/TestThreadStates.py (1108 of 1857) PASS: lldb-unit :: Utility/./UtilityTests/SerializationRountripTest.SerializeDeserializeObjectReference (1109 of 1857) PASS: lldb-shell :: SymbolFile/DWARF/debug-types-missing-signature.test (1110 of 1857) PASS: lldb-unit :: UnwindAssembly/ARM64/./Arm64InstEmulationTests/TestArm64InstEmulation.TestRegisterDoubleSpills (1111 of 1857) UNSUPPORTED: lldb-api :: functionalities/darwin_log/filter/exact_match/category/TestDarwinLogFilterMatchCategory.py (1112 of 1857) PASS: lldb-api :: lang/c/local_variables/TestLocalVariables.py (1113 of 1857) PASS: lldb-unit :: Utility/./UtilityTests/StreamTest.PutULEB128 (1114 of 1857) PASS: lldb-shell :: SymbolFile/DWARF/debug-types-line-tables.s (1115 of 1857) PASS: lldb-unit :: Symbol/./SymbolTests/TestClangASTContext.TestGetBasicTypeFromName (1116 of 1857) PASS: lldb-unit :: UnwindAssembly/x86/./UnwindAssemblyx86Tests/Testx86AssemblyInspectionEngine.TestPushEAX (1117 of 1857) PASS: lldb-api :: commands/expression/argument_passing_restrictions/TestArgumentPassingRestrictions.py (1118 of 1857) PASS: lldb-unit :: Utility/./UtilityTests/RangeTest.ContainsAddr (1119 of 1857) PASS: lldb-unit :: Utility/./UtilityTests/StreamTeeTest.Constructor2Streams (1120 of 1857) PASS: lldb-shell :: SymbolFile/Breakpad/line-table.test (1121 of 1857) PASS: lldb-shell :: SymbolFile/NativePDB/ast-functions.cpp (1122 of 1857) PASS: lldb-shell :: ObjectFile/PECOFF/basic-info.yaml (1123 of 1857) PASS: lldb-unit :: Utility/./UtilityTests/StreamTest.AddressNoSuffix (1124 of 1857) PASS: lldb-api :: lang/cpp/class-template-parameter-pack/TestClassTemplateParameterPack.py (1125 of 1857) PASS: lldb-api :: python_api/process/TestProcessAPI.py (1126 of 1857) PASS: lldb-unit :: UnwindAssembly/x86/./UnwindAssemblyx86Tests/Testx86AssemblyInspectionEngine.TestPopR15 (1127 of 1857) PASS: lldb-api :: commands/command/nested_alias/TestNestedAlias.py (1128 of 1857) PASS: lldb-api :: commands/expression/options/TestExprOptions.py (1129 of 1857) PASS: lldb-unit :: tools/lldb-server/tests/./LLDBServerTests/StandardStartupTest.TestStopReplyContainsThreadPcs (1130 of 1857) PASS: lldb-shell :: Minidump/Windows/arm-fp-unwind.test (1131 of 1857) PASS: lldb-api :: python_api/process/read-mem-cstring/TestReadMemCString.py (1132 of 1857) PASS: lldb-unit :: Utility/./UtilityTests/TimeoutTest.Construction (1133 of 1857) PASS: lldb-unit :: Utility/./UtilityTests/RangeTest.NotEqual (1134 of 1857) PASS: lldb-shell :: Commands/command-regex-delete.test (1135 of 1857) PASS: lldb-unit :: UnwindAssembly/x86/./UnwindAssemblyx86Tests/Testx86AssemblyInspectionEngine.TestPopRBP (1136 of 1857) PASS: lldb-unit :: Utility/./UtilityTests/VASprintfTest.BufferResize (1137 of 1857) PASS: lldb-api :: commands/expression/issue_11588/Test11588.py (1138 of 1857) PASS: lldb-api :: functionalities/data-formatter/data-formatter-objc/TestDataFormatterObjNSException.py (1139 of 1857) PASS: lldb-unit :: Utility/./UtilityTests/StringExtractorTest.GetHexBytes_Underflow (1140 of 1857) PASS: lldb-api :: functionalities/inferior-crashing/TestInferiorCrashingStep.py (1141 of 1857) PASS: lldb-unit :: Utility/./UtilityTests/CompletionRequest.DuplicateFilteringWithComments (1142 of 1857) PASS: lldb-api :: lang/objc/foundation/TestObjCMethodsNSError.py (1143 of 1857) PASS: lldb-unit :: Utility/./UtilityTests/StringExtractorTest.InitEmpty (1144 of 1857) PASS: lldb-api :: commands/expression/formatters/TestFormatters.py (1145 of 1857) PASS: lldb-shell :: SymbolFile/DWARF/debug_rnglists.s (1146 of 1857) PASS: lldb-unit :: Utility/./UtilityTests/StringExtractorTest.DecodeHexU8_Underflow2 (1147 of 1857) PASS: lldb-api :: commands/expression/import-std-module/unique_ptr/TestUniquePtr.py (1148 of 1857) PASS: lldb-unit :: Language/Highlighting/./HighlighterTests/HighlighterTest.ClangUnterminatedString (1149 of 1857) PASS: lldb-api :: python_api/disassemble-raw-data/TestDisassembleRawData.py (1150 of 1857) PASS: lldb-unit :: Utility/./UtilityTests/ProcessInstanceInfo.DumpTable_invalidUID (1151 of 1857) PASS: lldb-unit :: Utility/./UtilityTests/ArgsTest.ReplaceArgumentAtIndexLonger (1152 of 1857) PASS: lldb-unit :: Utility/./UtilityTests/UriParserTest.SchemeHostSeparator (1153 of 1857) PASS: lldb-api :: lang/objc/objc-static-method/TestObjCStaticMethod.py (1154 of 1857) PASS: lldb-unit :: Utility/./UtilityTests/VMRange.Comparison (1155 of 1857) PASS: lldb-api :: commands/expression/context-object-objc/TestContextObjectObjc.py (1156 of 1857) PASS: lldb-unit :: Process/minidump/./LLDBMinidumpTests/MinidumpParserTest.GetMiscInfo_no_stream (1157 of 1857) PASS: lldb-shell :: Quit/TestQuitExitCode0.test (1158 of 1857) PASS: lldb-api :: functionalities/non-overlapping-index-variable-i/TestIndexVariable.py (1159 of 1857) PASS: lldb-unit :: Utility/./UtilityTests/ArgsTest.TestQuotedUnknownEscape (1160 of 1857) PASS: lldb-api :: commands/target/create-deps/TestTargetCreateDeps.py (1161 of 1857) PASS: lldb-api :: functionalities/thread/concurrent_events/TestConcurrentTwoWatchpointThreads.py (1162 of 1857) PASS: lldb-shell :: ObjectFile/ELF/section-types-edgecases.yaml (1163 of 1857) PASS: lldb-unit :: Utility/./UtilityTests/ListenerTest.GetEventWait (1164 of 1857) PASS: lldb-unit :: Utility/./UtilityTests/StreamTest.AddressPrefixAndSuffix (1165 of 1857) PASS: lldb-unit :: Utility/./UtilityTests/UriParserTest.BracketedHostnamePort (1166 of 1857) PASS: lldb-unit :: ObjectFile/Breakpad/./ObjectFileBreakpadTests/StackCFIRecord.parse (1167 of 1857) PASS: lldb-api :: commands/process/attach-resume/TestAttachResume.py (1168 of 1857) PASS: lldb-api :: python_api/value/linked_list/TestValueAPILinkedList.py (1169 of 1857) PASS: lldb-unit :: Utility/./UtilityTests/StringExtractorTest.GetHexBytes (1170 of 1857) PASS: lldb-unit :: Utility/./UtilityTests/DataExtractorTest.GetMaxS64 (1171 of 1857) UNSUPPORTED: lldb-api :: functionalities/darwin_log/filter/regex/subsystem/TestDarwinLogFilterRegexSubsystem.py (1172 of 1857) PASS: lldb-unit :: Utility/./UtilityTests/StringExtractorTest.GetHexBytesAvail_OddPair (1173 of 1857) PASS: lldb-unit :: UnwindAssembly/x86/./UnwindAssemblyx86Tests/Testx86AssemblyInspectionEngine.TestPopEBP (1174 of 1857) PASS: lldb-api :: functionalities/breakpoint/consecutive_breakpoints/TestConsecutiveBreakpoints.py (1175 of 1857) PASS: lldb-api :: functionalities/data-formatter/data-formatter-enum-format/TestDataFormatterEnumFormat.py (1176 of 1857) PASS: lldb-unit :: SymbolFile/DWARF/./SymbolFileDWARFTests/DWARFASTParserClangTests.EnsureAllDIEsInDeclContextHaveBeenParsedParsesOnlyMatchingEntries (1177 of 1857) PASS: lldb-unit :: Utility/./UtilityTests/StreamTest.PutBytesAsRawHex8ToLittleEndian (1178 of 1857) PASS: lldb-api :: functionalities/load_unload/TestLoadUnload.py (1179 of 1857) PASS: lldb-api :: functionalities/postmortem/minidump-new/TestMiniDumpUUID.py (1180 of 1857) PASS: lldb-api :: lang/objc/real-definition/TestRealDefinition.py (1181 of 1857) PASS: lldb-api :: functionalities/memory/read/TestMemoryRead.py (1182 of 1857) PASS: lldb-unit :: Utility/./UtilityTests/AnsiTerminal.KnownPrefix (1183 of 1857) PASS: lldb-shell :: SymbolFile/DWARF/debug-types-dwo-cross-reference.cpp (1184 of 1857) PASS: lldb-shell :: SymbolFile/DWARF/debug-names-compressed.cpp (1185 of 1857) PASS: lldb-unit :: Utility/./UtilityTests/RecordReplayTest.InstrumentedBarRef (1186 of 1857) PASS: lldb-api :: functionalities/thread/num_threads/TestNumThreads.py (1187 of 1857) UNSUPPORTED: lldb-shell :: SymbolFile/PDB/variables.test (1188 of 1857) PASS: lldb-unit :: Utility/./UtilityTests/StreamTest.AddressRangeEmptyRange (1189 of 1857) PASS: lldb-shell :: SymbolFile/DWARF/debug-types-signature-loop.s (1190 of 1857) PASS: lldb-api :: functionalities/data-formatter/data-formatter-categories/TestDataFormatterCategories.py (1191 of 1857) PASS: lldb-api :: commands/expression/import-std-module/shared_ptr-dbg-info-content/TestSharedPtrDbgInfoContent.py (1192 of 1857) PASS: lldb-api :: functionalities/data-formatter/ptr_ref_typedef/TestPtrRef2Typedef.py (1193 of 1857) PASS: lldb-unit :: Utility/./UtilityTests/ScalarTest.Equality (1194 of 1857) PASS: lldb-api :: functionalities/thread/concurrent_events/TestConcurrentDelayedCrashWithBreakpointWatchpoint.py (1195 of 1857) PASS: lldb-api :: commands/expression/persistent_variables/TestPersistentVariables.py (1196 of 1857) PASS: lldb-unit :: UnwindAssembly/x86/./UnwindAssemblyx86Tests/Testx86AssemblyInspectionEngine.Test64bitFramelessBigStackFrame (1197 of 1857) PASS: lldb-shell :: SymbolFile/DWARF/array-sizes.s (1198 of 1857) PASS: lldb-unit :: Utility/./UtilityTests/StringExtractorTest.GetHexBytes_OddPair (1199 of 1857) PASS: lldb-api :: functionalities/data-formatter/data-formatter-objc/TestDataFormatterObjCKVO.py (1200 of 1857) PASS: lldb-unit :: Utility/./UtilityTests/OptionsWithRawTest.SingleWordSuffix (1201 of 1857) PASS: lldb-api :: functionalities/param_entry_vals/basic_entry_values_x86_64/TestBasicEntryValuesX86_64.py (1202 of 1857) PASS: lldb-shell :: Reproducer/Functionalities/TestExpressionEvaluation.test (1203 of 1857) PASS: lldb-shell :: Quit/TestQuitExitCode-30.test (1204 of 1857) PASS: lldb-api :: commands/expression/call-function/TestCallStopAndContinue.py (1205 of 1857) PASS: lldb-api :: types/TestIntegerTypeExpr.py (1206 of 1857) PASS: lldb-api :: functionalities/signal/TestSendSignal.py (1207 of 1857) PASS: lldb-unit :: ObjectFile/Breakpad/./ObjectFileBreakpadTests/StackWinRecord.parse (1208 of 1857) PASS: lldb-unit :: Utility/./UtilityTests/StreamTest.PutHex64ByteOrderBig (1209 of 1857) PASS: lldb-unit :: Utility/./UtilityTests/FileSpecTest.GetPath (1210 of 1857) PASS: lldb-shell :: SymbolFile/DWARF/dir-separator-posix.s (1211 of 1857) PASS: lldb-api :: python_api/symbol-context/two-files/TestSymbolContextTwoFiles.py (1212 of 1857) PASS: lldb-api :: functionalities/deleted-executable/TestDeletedExecutable.py (1213 of 1857) PASS: lldb-api :: lang/objc/foundation/TestRuntimeTypes.py (1214 of 1857) PASS: lldb-api :: functionalities/wrong_commands/TestWrongCommands.py (1215 of 1857) UNSUPPORTED: lldb-api :: benchmarks/stepping/TestSteppingSpeed.py (1216 of 1857) PASS: lldb-api :: functionalities/breakpoint/address_breakpoints/TestAddressBreakpoints.py (1217 of 1857) PASS: lldb-api :: functionalities/type_lookup/TestTypeLookup.py (1218 of 1857) PASS: lldb-api :: functionalities/tail_call_frames/ambiguous_tail_call_seq1/TestAmbiguousTailCallSeq1.py (1219 of 1857) PASS: lldb-shell :: SymbolFile/DWARF/win-i386-line-table.s (1220 of 1857) PASS: lldb-unit :: Utility/./UtilityTests/BinaryStreamTest.PutULEB128OneByte (1221 of 1857) PASS: lldb-unit :: Language/Highlighting/./HighlighterTests/HighlighterTest.ClangCursorPosAfterOtherToken (1222 of 1857) PASS: lldb-unit :: Expression/./ExpressionTests/DiagnosticManagerTest.GetStringMultiline (1223 of 1857) PASS: lldb-unit :: Expression/./ExpressionTests/CppModuleConfigurationTest.AmbiguousLibCpp (1224 of 1857) PASS: lldb-api :: functionalities/unwind/noreturn/module-end/TestNoReturnModuleEnd.py (1225 of 1857) PASS: lldb-shell :: ObjectFile/MachO/symtab.yaml (1226 of 1857) PASS: lldb-api :: functionalities/memory-region/TestMemoryRegion.py (1227 of 1857) PASS: lldb-api :: functionalities/breakpoint/cpp/TestCPPBreakpointLocations.py (1228 of 1857) PASS: lldb-unit :: UnwindAssembly/x86/./UnwindAssemblyx86Tests/Testx86AssemblyInspectionEngine.TestPushRBP (1229 of 1857) UNSUPPORTED: lldb-api :: functionalities/tty/TestTerminal.py (1230 of 1857) PASS: lldb-unit :: ScriptInterpreter/Python/./ScriptInterpreterPythonTests/PythonDataObjectsTest.TestPythonTupleToStructuredList (1231 of 1857) PASS: lldb-api :: functionalities/tsan/cpp_global_location/TestTsanCPPGlobalLocation.py (1232 of 1857) PASS: lldb-api :: lang/cpp/auto/TestCPPAuto.py (1233 of 1857) PASS: lldb-unit :: Host/./HostTests/SocketTest.DecodeHostAndPort (1234 of 1857) PASS: lldb-unit :: Utility/./UtilityTests/UriParserTest.BracketedHostname (1235 of 1857) PASS: lldb-unit :: Utility/./UtilityTests/AnsiTerminal.Unknown (1236 of 1857) PASS: lldb-unit :: Utility/./UtilityTests/StreamTest.PutBytesAsRawHex8ToMixedEndian (1237 of 1857) UNSUPPORTED: lldb-api :: benchmarks/frame_variable/TestFrameVariableResponse.py (1238 of 1857) PASS: lldb-api :: functionalities/tail_call_frames/inlining_and_tail_calls/TestInliningAndTailCalls.py (1239 of 1857) PASS: lldb-api :: lang/cpp/unicode-literals/TestUnicodeLiterals.py (1240 of 1857) PASS: lldb-unit :: ScriptInterpreter/Python/./ScriptInterpreterPythonTests/PythonDataObjectsTest.TestScript (1241 of 1857) PASS: lldb-unit :: Editline/./EditlineTests/EditlineTestFixture.EditlineReceivesSingleLineText (1242 of 1857) PASS: lldb-api :: functionalities/breakpoint/step_over_breakpoint/TestStepOverBreakpoint.py (1243 of 1857) PASS: lldb-unit :: Utility/./UtilityTests/CompletionRequest.DuplicateFiltering (1244 of 1857) PASS: lldb-unit :: Utility/./UtilityTests/BroadcasterTest.BroadcastEvent (1245 of 1857) PASS: lldb-unit :: Utility/./UtilityTests/StringExtractorTest.GetHexU8_Exact (1246 of 1857) PASS: lldb-unit :: Utility/./UtilityTests/EventTest.DumpEventDataBytes (1247 of 1857) PASS: lldb-api :: functionalities/data-formatter/data-formatter-stl/libcxx/vbool/TestDataFormatterLibcxxVBool.py (1248 of 1857) PASS: lldb-api :: tools/lldb-server/TestGdbRemoteExpeditedRegisters.py (1249 of 1857) PASS: lldb-unit :: Utility/./UtilityTests/BinaryStreamTest.PutULEB128Zero (1250 of 1857) PASS: lldb-shell :: ObjectFile/MachO/lc_version_min.yaml (1251 of 1857) PASS: lldb-shell :: SymbolFile/DWARF/find-method.cpp (1252 of 1857) PASS: lldb-unit :: Utility/./UtilityTests/GeneratorTest.Get (1253 of 1857) PASS: lldb-unit :: UnwindAssembly/x86/./UnwindAssemblyx86Tests/Testx86AssemblyInspectionEngine.TestSpArithx86_64Augmented (1254 of 1857) PASS: lldb-unit :: Utility/./UtilityTests/StreamTest.PutHex32ByteOrderBig (1255 of 1857) PASS: lldb-api :: lang/objc/modules/TestObjCModules.py (1256 of 1857) PASS: lldb-api :: lang/cpp/class_static/TestStaticVariables.py (1257 of 1857) PASS: lldb-unit :: SymbolFile/NativePDB/./SymbolFileNativePDBTests/PDBFPOProgramToDWARFExpressionTests.DependencyChain (1258 of 1857) PASS: lldb-shell :: Reproducer/Functionalities/TestImageList.test (1259 of 1857) PASS: lldb-unit :: Utility/./UtilityTests/BinaryStreamTest.PutSLEB128NineBytes (1260 of 1857) PASS: lldb-api :: commands/expression/char/TestExprsChar.py (1261 of 1857) PASS: lldb-api :: python_api/frame/get-variables/TestGetVariables.py (1262 of 1857) PASS: lldb-unit :: Disassembler/./DisassemblerTests/TestArmv7Disassembly.TestCortexFPDisass (1263 of 1857) PASS: lldb-unit :: Utility/./UtilityTests/RangeTest.ContainsEndInclusive (1264 of 1857) PASS: lldb-unit :: Utility/./UtilityTests/DataExtractorTest.GetCStr (1265 of 1857) PASS: lldb-unit :: UnwindAssembly/x86/./UnwindAssemblyx86Tests/Testx86AssemblyInspectionEngine.Test64bitFramelessSmallStackFrame (1266 of 1857) PASS: lldb-api :: commands/add-dsym/uuid/TestAddDsymCommand.py (1267 of 1857) PASS: lldb-api :: python_api/lldbutil/process/TestPrintStackTraces.py (1268 of 1857) PASS: lldb-api :: commands/watchpoints/watchpoint_size/TestWatchpointSizes.py (1269 of 1857) PASS: lldb-shell :: ObjectFile/ELF/netbsd-core-amd64.test (1270 of 1857) PASS: lldb-unit :: Utility/./UtilityTests/StreamTest.PutCharWhitespace (1271 of 1857) PASS: lldb-api :: iohandler/completion/TestIOHandlerCompletion.py (1272 of 1857) PASS: lldb-api :: commands/watchpoints/watchpoint_disable/TestWatchpointDisable.py (1273 of 1857) PASS: lldb-unit :: Utility/./UtilityTests/UriParserTest.Minimal (1274 of 1857) PASS: lldb-api :: functionalities/thread/concurrent_events/TestConcurrentDelayedCrashWithBreakpointSignal.py (1275 of 1857) PASS: lldb-unit :: Utility/./UtilityTests/ArgsTest.TestInsertArg (1276 of 1857) PASS: lldb-unit :: UnwindAssembly/x86/./UnwindAssemblyx86Tests/Testx86AssemblyInspectionEngine.Testi386IgnoredRegisters (1277 of 1857) PASS: lldb-unit :: ScriptInterpreter/Python/./ScriptInterpreterPythonTests/PythonDataObjectsTest.TestPythonBoolean (1278 of 1857) PASS: lldb-api :: functionalities/postmortem/elf-core/TestLinuxCore.py (1279 of 1857) PASS: lldb-unit :: ScriptInterpreter/Python/./ScriptInterpreterPythonTests/PythonDataObjectsTest.TestPythonFile (1280 of 1857) PASS: lldb-shell :: ObjectFile/PECOFF/sections.yaml (1281 of 1857) UNSUPPORTED: lldb-api :: functionalities/thread/multi_break/TestMultipleBreakpoints.py (1282 of 1857) PASS: lldb-api :: commands/expression/dollar-in-variable/TestDollarInVariable.py (1283 of 1857) PASS: lldb-api :: tools/lldb-vscode/launch/TestVSCode_launch.py (1284 of 1857) PASS: lldb-api :: lang/cpp/const_this/TestConstThis.py (1285 of 1857) PASS: lldb-unit :: Utility/./UtilityTests/ProcessInfoTest.Constructor (1286 of 1857) PASS: lldb-api :: functionalities/tsan/basic/TestTsanBasic.py (1287 of 1857) PASS: lldb-shell :: SymbolFile/DWARF/dwarf5-index-is-used.cpp (1288 of 1857) PASS: lldb-unit :: Process/minidump/./LLDBMinidumpTests/RegisterContextMinidump.CheckRegisterContextMinidump_ARM (1289 of 1857) PASS: lldb-unit :: Utility/./UtilityTests/Predicate.WaitForValueEqualTo (1290 of 1857) PASS: lldb-shell :: Register/x86-64-read.test (1291 of 1857) UNSUPPORTED: lldb-shell :: SymbolFile/PDB/function-level-linking.test (1292 of 1857) PASS: lldb-api :: functionalities/thread/concurrent_events/TestConcurrentTwoWatchpointsOneSignal.py (1293 of 1857) PASS: lldb-unit :: Expression/./ExpressionTests/DiagnosticManagerTest.GetStringNoDiags (1294 of 1857) PASS: lldb-unit :: Utility/./UtilityTests/VMRange.IsValid (1295 of 1857) PASS: lldb-unit :: Utility/./UtilityTests/AnsiTerminal.AtEnd (1296 of 1857) PASS: lldb-api :: python_api/sbdata/TestSBData.py (1297 of 1857) PASS: lldb-api :: commands/command/source/TestCommandSource.py (1298 of 1857) PASS: lldb-unit :: Language/CPlusPlus/./LanguageCPlusPlusTests/CPlusPlusLanguage.MethodNameParsing (1299 of 1857) PASS: lldb-unit :: Process/gdb-remote/./ProcessGdbRemoteTests/GDBRemoteCommunicationClientTest.GetMemoryRegionInfo (1300 of 1857) PASS: lldb-api :: functionalities/data-formatter/data-formatter-smart-array/TestDataFormatterSmartArray.py (1301 of 1857) PASS: lldb-api :: functionalities/postmortem/minidump-new/TestMiniDumpNew.py (1302 of 1857) UNSUPPORTED: lldb-shell :: Register/x86-ymm-write.test (1303 of 1857) UNSUPPORTED: lldb-shell :: SymbolFile/PDB/vbases.test (1304 of 1857) PASS: lldb-api :: types/TestDoubleTypesExpr.py (1305 of 1857) PASS: lldb-unit :: Utility/./UtilityTests/DataExtractorTest.GetCStrAtNullOffset (1306 of 1857) PASS: lldb-shell :: ObjectFile/ELF/PT_LOAD-overlap-section.yaml (1307 of 1857) PASS: lldb-unit :: Host/./HostTests/SocketTest.DomainGetConnectURI (1308 of 1857) PASS: lldb-unit :: debugserver/./debugserverTests/RNBSocket.LoopBackConnectIPv4 (1309 of 1857) PASS: lldb-api :: functionalities/gdb_remote_client/TestJLink6Armv7RegisterDefinition.py (1310 of 1857) PASS: lldb-unit :: Language/CPlusPlus/./LanguageCPlusPlusTests/CPlusPlusLanguage.ExtractContextAndIdentifier (1311 of 1857) PASS: lldb-api :: functionalities/thread/concurrent_events/TestConcurrentManyWatchpoints.py (1312 of 1857) PASS: lldb-unit :: Language/Highlighting/./HighlighterTests/HighlighterTest.DefaultHighlighter (1313 of 1857) PASS: lldb-unit :: UnwindAssembly/x86/./UnwindAssemblyx86Tests/Testx86AssemblyInspectionEngine.TestSimple32bitFrameFunction (1314 of 1857) PASS: lldb-api :: lang/cpp/stl/TestSTL.py (1315 of 1857) UNSUPPORTED: lldb-shell :: SymbolFile/PDB/udt-layout.test (1316 of 1857) PASS: lldb-api :: commands/expression/pr35310/TestExprsBug35310.py (1317 of 1857) PASS: lldb-unit :: Host/./HostTests/MainLoopTest.Signal (1318 of 1857) PASS: lldb-unit :: Utility/./UtilityTests/StreamTest.PutSLEB128 (1319 of 1857) PASS: lldb-api :: sample_test/TestSampleTest.py (1320 of 1857) PASS: lldb-api :: python_api/hello_world/TestHelloWorld.py (1321 of 1857) PASS: lldb-unit :: Utility/./UtilityTests/DataExtractorTest.GetCStrUnterminated (1322 of 1857) PASS: lldb-unit :: Utility/./UtilityTests/StreamTeeTest.Assignment (1323 of 1857) PASS: lldb-api :: commands/expression/import-std-module/queue/TestQueue.py (1324 of 1857) PASS: lldb-api :: functionalities/modern-type-lookup/libcxx/TestLibCxxModernTypeLookup.py (1325 of 1857) PASS: lldb-unit :: Utility/./UtilityTests/StringLexerTest.AdvanceIf (1326 of 1857) PASS: lldb-unit :: Utility/./UtilityTests/OptionsWithRawTest.UnterminatedQuote (1327 of 1857) PASS: lldb-api :: lang/cpp/call-function/TestCallCPPFunction.py (1328 of 1857) PASS: lldb-api :: tools/lldb-server/TestAppleSimulatorOSType.py (1329 of 1857) PASS: lldb-api :: iohandler/unicode/TestUnicode.py (1330 of 1857) PASS: lldb-unit :: Utility/./UtilityTests/StringListTest.InsertStringAtIndexOutOfBounds (1331 of 1857) PASS: lldb-unit :: Process/minidump/./LLDBMinidumpTests/RegisterContextMinidump.ConvertMinidumpContext_x86_64 (1332 of 1857) PASS: lldb-api :: lang/objc/objc-ivar-offsets/TestObjCIvarOffsets.py (1333 of 1857) PASS: lldb-unit :: Utility/./UtilityTests/StructuredDataTest.StringDump (1334 of 1857) UNSUPPORTED: lldb-shell :: SymbolFile/PDB/variables-locations.test (1335 of 1857) PASS: lldb-api :: functionalities/breakpoint/dummy_target_breakpoints/TestBreakpointsWithNoTargets.py (1336 of 1857) PASS: lldb-unit :: Utility/./UtilityTests/StreamTest.PutHex64ByteOrderLittle (1337 of 1857) PASS: lldb-shell :: Quit/TestQuitExitCodeTooManyArgs.test (1338 of 1857) PASS: lldb-unit :: Utility/./UtilityTests/RecordReplayTest.InstrumentedBar (1339 of 1857) PASS: lldb-api :: functionalities/thread/concurrent_events/TestConcurrentBreakpointOneDelayBreakpointThreads.py (1340 of 1857) PASS: lldb-api :: commands/process/launch/TestProcessLaunch.py (1341 of 1857) PASS: lldb-unit :: Utility/./UtilityTests/OptionsWithRawTest.QuotedSuffix (1342 of 1857) PASS: lldb-api :: functionalities/thread/concurrent_events/TestConcurrentDelayWatchBreak.py (1343 of 1857) PASS: lldb-unit :: Utility/./UtilityTests/OptionsWithRawTest.EmptyArgsOnlySuffix (1344 of 1857) PASS: lldb-unit :: Host/./HostTests/FileSystemTest.Readable (1345 of 1857) PASS: lldb-unit :: Utility/./UtilityTests/RangeTest.LessThanInvalid (1346 of 1857) PASS: lldb-api :: functionalities/thread/concurrent_events/TestConcurrentBreakpointDelayBreakpointOneSignal.py (1347 of 1857) PASS: lldb-unit :: ScriptInterpreter/Python/./ScriptInterpreterPythonTests/PythonDataObjectsTest.TestPythonListValueEquality (1348 of 1857) PASS: lldb-api :: commands/watchpoints/watchpoint_events/TestWatchpointEvents.py (1349 of 1857) PASS: lldb-api :: tools/lldb-server/inferior-crash/TestGdbRemoteAbort.py (1350 of 1857) PASS: lldb-api :: lang/cpp/scope/TestCppScope.py (1351 of 1857) PASS: lldb-shell :: Reproducer/TestGDBRemoteRepro.test (1352 of 1857) PASS: lldb-unit :: Process/minidump/./LLDBMinidumpTests/MinidumpParserTest.GetExceptionStream (1353 of 1857) PASS: lldb-unit :: Expression/./ExpressionTests/DiagnosticManagerTest.FixedExpression (1354 of 1857) UNSUPPORTED: lldb-api :: linux/add-symbols/TestTargetSymbolsAddCommand.py (1355 of 1857) PASS: lldb-unit :: Host/./HostTests/FileActionTest.Open (1356 of 1857) PASS: lldb-unit :: Utility/./UtilityTests/StringExtractorTest.GetHexU8_Extra_NoEof (1357 of 1857) PASS: lldb-api :: functionalities/data-formatter/vector-types/TestVectorTypesFormatting.py (1358 of 1857) PASS: lldb-shell :: Python/crashlog.test (1359 of 1857) PASS: lldb-unit :: Process/minidump/./LLDBMinidumpTests/MinidumpParserTest.GetLinuxProcStatus_no_stream (1360 of 1857) PASS: lldb-api :: lang/objc/objc-new-syntax/TestObjCNewSyntaxArray.py (1361 of 1857) PASS: lldb-unit :: Signals/./SignalsTests/UnixSignalsTest.Iteration (1362 of 1857) PASS: lldb-api :: functionalities/data-formatter/data-formatter-stl/libcxx/multimap/TestDataFormatterLibccMultiMap.py (1363 of 1857) PASS: lldb-api :: tools/lldb-vscode/variables/TestVSCode_variables.py (1364 of 1857) PASS: lldb-unit :: UnwindAssembly/x86/./UnwindAssemblyx86Tests/Testx86AssemblyInspectionEngine.TestDisassemblyMidFunctionEpilogues (1365 of 1857) PASS: lldb-api :: commands/quit/TestQuit.py (1366 of 1857) PASS: lldb-unit :: Utility/./UtilityTests/StringListTest.LongestCommonPrefixNoPrefix (1367 of 1857) PASS: lldb-api :: functionalities/breakpoint/require_hw_breakpoints/TestRequireHWBreakpoints.py (1368 of 1857) PASS: lldb-api :: commands/expression/import-std-module/sysroot/TestStdModuleSysroot.py (1369 of 1857) PASS: lldb-api :: python_api/thread/TestThreadAPI.py (1370 of 1857) PASS: lldb-api :: tools/lldb-server/TestGdbRemoteRegisterState.py (1371 of 1857) PASS: lldb-api :: functionalities/gdb_remote_client/TestTargetXMLArch.py (1372 of 1857) PASS: lldb-api :: lang/objc/orderedset/TestOrderedSet.py (1373 of 1857) PASS: lldb-unit :: Expression/./ExpressionTests/CppModuleConfigurationTest.LinuxLocalLibCpp (1374 of 1857) PASS: lldb-unit :: Utility/./UtilityTests/RangeTest.SetRangeBase (1375 of 1857) PASS: lldb-api :: lang/cpp/template-function/TestTemplateFunctions.py (1376 of 1857) PASS: lldb-api :: functionalities/process_group/TestChangeProcessGroup.py (1377 of 1857) PASS: lldb-unit :: Utility/./UtilityTests/StringListTest.PopBack (1378 of 1857) PASS: lldb-unit :: Editline/./EditlineTests/EditlineTestFixture.EditlineReceivesMultiLineText (1379 of 1857) PASS: lldb-unit :: UnwindAssembly/x86/./UnwindAssemblyx86Tests/Testx86AssemblyInspectionEngine.TestPushR13 (1380 of 1857) UNSUPPORTED: lldb-shell :: SymbolFile/PDB/func-symbols.test (1381 of 1857) PASS: lldb-unit :: Utility/./UtilityTests/DataExtractorTest.GetCStrAtEnd (1382 of 1857) PASS: lldb-shell :: ObjectFile/ELF/section-overlap.yaml (1383 of 1857) PASS: lldb-unit :: Utility/./UtilityTests/StringListTest.Assignment (1384 of 1857) PASS: lldb-unit :: Utility/./UtilityTests/ArgsTest.BareSingleQuote (1385 of 1857) PASS: lldb-shell :: SymbolFile/DWARF/find-variable-dwo.cpp (1386 of 1857) PASS: lldb-api :: functionalities/tail_call_frames/disambiguate_call_site/TestDisambiguateCallSite.py (1387 of 1857) PASS: lldb-api :: lang/c/bitfields/TestBitfields.py (1388 of 1857) PASS: lldb-unit :: SymbolFile/NativePDB/./SymbolFileNativePDBTests/PDBFPOProgramToDWARFExpressionTests.InvalidAssignmentSingle (1389 of 1857) PASS: lldb-unit :: Utility/./UtilityTests/StreamTest.PutPtr (1390 of 1857) PASS: lldb-unit :: Utility/./UtilityTests/RegularExpression.Match (1391 of 1857) PASS: lldb-api :: commands/command/script/import/rdar-12586188/TestRdar12586188.py (1392 of 1857) PASS: lldb-unit :: Host/./HostTests/Host.WaitStatusFormat (1393 of 1857) PASS: lldb-api :: commands/target/dump-symtab-demangle/TestDumpSymtabDemangle.py (1394 of 1857) PASS: lldb-unit :: Utility/./UtilityTests/StringExtractorTest.DecodeHexU8_Underflow (1395 of 1857) PASS: lldb-unit :: UnwindAssembly/x86/./UnwindAssemblyx86Tests/Testx86AssemblyInspectionEngine.TestPushRBPWithREX (1396 of 1857) PASS: lldb-unit :: Utility/./UtilityTests/RangeTest.Equal (1397 of 1857) PASS: lldb-unit :: Core/./LLDBCoreTests/MangledTest.EmptyForInvalidName (1398 of 1857) PASS: lldb-shell :: Quit/TestQuitExitCodeNonInt.test (1399 of 1857) PASS: lldb-shell :: Settings/TestEchoCommands.test (1400 of 1857) PASS: lldb-shell :: Driver/TestCore.test (1401 of 1857) PASS: lldb-api :: lang/cpp/this/TestCPPThis.py (1402 of 1857) XFAIL: lldb-shell :: Unwind/prefer-debug-over-eh-frame.test (1403 of 1857) PASS: lldb-api :: commands/expression/top-level/TestTopLevelExprs.py (1404 of 1857) PASS: lldb-unit :: Host/./HostTests/SocketAddressTest.GetAddressInfo (1405 of 1857) PASS: lldb-unit :: tools/lldb-server/tests/./LLDBServerTests/TestBase.DebugserverEnv (1406 of 1857) PASS: lldb-api :: types/TestCharType.py (1407 of 1857) PASS: lldb-shell :: SymbolFile/DWARF/debug-types-address-ranges.s (1408 of 1857) PASS: lldb-api :: python_api/interpreter/TestRunCommandInterpreterAPI.py (1409 of 1857) PASS: lldb-api :: commands/expression/cast_int_to_anonymous_enum/TestCastIntToAnonymousEnum.py (1410 of 1857) PASS: lldb-api :: functionalities/data-formatter/data-formatter-disabling/TestDataFormatterDisabling.py (1411 of 1857) PASS: lldb-unit :: Utility/./UtilityTests/OptionsWithRawTest.TerminatedQuote (1412 of 1857) PASS: lldb-api :: commands/watchpoints/watchpoint_commands/command/TestWatchpointCommandPython.py (1413 of 1857) PASS: lldb-api :: functionalities/gdb_remote_client/TestArmRegisterDefinition.py (1414 of 1857) PASS: lldb-api :: python_api/watchpoint/watchlocation/TestTargetWatchAddress.py (1415 of 1857) PASS: lldb-unit :: UnwindAssembly/x86/./UnwindAssemblyx86Tests/Testx86AssemblyInspectionEngine.TestSimplei386ugmented (1416 of 1857) PASS: lldb-api :: functionalities/gdb_remote_client/TestThreadSelectionBug.py (1417 of 1857) UNSUPPORTED: lldb-api :: functionalities/unwind/standard/TestStandardUnwind.py (1418 of 1857) PASS: lldb-unit :: Utility/./UtilityTests/RegularExpression.Invalid (1419 of 1857) PASS: lldb-unit :: Symbol/./SymbolTests/LineEntryTest.GetSameLineContiguousAddressRangeOneInline (1420 of 1857) PASS: lldb-unit :: UnwindAssembly/x86/./UnwindAssemblyx86Tests/Testx86AssemblyInspectionEngine.TestPushR15 (1421 of 1857) PASS: lldb-api :: lang/c/struct_types/TestStructTypes.py (1422 of 1857) PASS: lldb-unit :: Utility/./UtilityTests/ArgsTest.DoubleQuotedItem (1423 of 1857) PASS: lldb-api :: lang/objc/objc-optimized/TestObjcOptimized.py (1424 of 1857) PASS: lldb-shell :: Breakpoint/split-dwarf5-debug-stroffsets.test (1425 of 1857) PASS: lldb-api :: commands/settings/quoting/TestQuoting.py (1426 of 1857) PASS: lldb-api :: commands/expression/ir-interpreter/TestIRInterpreter.py (1427 of 1857) PASS: lldb-unit :: Utility/./UtilityTests/ConstStringTest.CompareStringRef (1428 of 1857) PASS: lldb-unit :: Utility/./UtilityTests/BinaryStreamTest.PutSLEB128FiveBytes (1429 of 1857) PASS: lldb-shell :: SymbolFile/DWARF/deterministic-build.cpp (1430 of 1857) UNSUPPORTED: lldb-shell :: Register/x86-64-ymm16-write.test (1431 of 1857) PASS: lldb-shell :: Commands/command-backtrace.test (1432 of 1857) PASS: lldb-api :: commands/platform/basic/TestPlatformCommand.py (1433 of 1857) PASS: lldb-unit :: debugserver/./debugserverTests/RNBSocket.LoopBackListenIPv4 (1434 of 1857) PASS: lldb-api :: functionalities/postmortem/mach-core/TestMachCore.py (1435 of 1857) PASS: lldb-unit :: Utility/./UtilityTests/ProcessInstanceInfoMatch.Name (1436 of 1857) PASS: lldb-api :: lang/objcxx/class-name-clash/TestNameClash.py (1437 of 1857) PASS: lldb-api :: lang/cpp/member-and-local-vars-with-same-name/TestMembersAndLocalsWithSameName.py (1438 of 1857) PASS: lldb-api :: macosx/universal/TestUniversal.py (1439 of 1857) PASS: lldb-unit :: Expression/./ExpressionTests/DiagnosticManagerTest.AppendMessageNoDiag (1440 of 1857) UNSUPPORTED: lldb-api :: tools/lldb-vscode/completions/TestVSCode_completions.py (1441 of 1857) PASS: lldb-shell :: SymbolFile/Breakpad/line-table-discontinuous-file-ids.test (1442 of 1857) PASS: lldb-shell :: Minidump/fb-dump.test (1443 of 1857) PASS: lldb-api :: functionalities/memory/find/TestMemoryFind.py (1444 of 1857) PASS: lldb-api :: functionalities/target-new-solib-notifications/TestModuleLoadedNotifys.py (1445 of 1857) UNSUPPORTED: lldb-api :: tools/lldb-server/TestGdbRemoteModuleInfo.py (1446 of 1857) PASS: lldb-api :: lang/cpp/symbols/TestSymbols.py (1447 of 1857) PASS: lldb-api :: tools/lldb-server/TestGdbRemote_vCont.py (1448 of 1857) PASS: lldb-api :: tools/lldb-server/TestGdbRemoteSingleStep.py (1449 of 1857) PASS: lldb-unit :: Utility/./UtilityTests/StringListTest.InsertStringAtIndexMove (1450 of 1857) PASS: lldb-unit :: Process/gdb-remote/./ProcessGdbRemoteTests/GDBRemoteCommunicationServerTest.SendErrorResponse_ErrorList (1451 of 1857) PASS: lldb-shell :: SymbolFile/NativePDB/function-types-calling-conv.cpp (1452 of 1857) PASS: lldb-shell :: ObjectFile/ELF/netbsd-exec-8.99.30-amd64.yaml (1453 of 1857) PASS: lldb-unit :: Utility/./UtilityTests/StreamTeeTest.GetStreamAtIndexOutOfBounds (1454 of 1857) PASS: lldb-unit :: Utility/./UtilityTests/StringListTest.AppendList (1455 of 1857) PASS: lldb-unit :: ScriptInterpreter/Python/./ScriptInterpreterPythonTests/PythonDataObjectsTest.TestPythonStringToStructuredString (1456 of 1857) PASS: lldb-api :: python_api/sbvalue_persist/TestSBValuePersist.py (1457 of 1857) PASS: lldb-unit :: Utility/./UtilityTests/StreamTest.PutHex8 (1458 of 1857) PASS: lldb-api :: macosx/order/TestOrderFile.py (1459 of 1857) PASS: lldb-api :: functionalities/data-formatter/type_summary_list_arg/TestTypeSummaryListArg.py (1460 of 1857) PASS: lldb-unit :: Target/./TargetTests/ExecutionContextTest.GetByteOrder (1461 of 1857) PASS: lldb-shell :: SymbolFile/DWARF/DW_OP_piece-struct.s (1462 of 1857) PASS: lldb-unit :: Utility/./UtilityTests/StringLexerTest.NextIfList (1463 of 1857) PASS: lldb-unit :: UnwindAssembly/x86/./UnwindAssemblyx86Tests/Testx86AssemblyInspectionEngine.TestStackRealign32BitDisp_x86_64 (1464 of 1857) PASS: lldb-api :: functionalities/completion/TestCompletion.py (1465 of 1857) PASS: lldb-unit :: Utility/./UtilityTests/StreamTeeTest.GetStreamAtIndexOutOfBoundsEmpty (1466 of 1857) PASS: lldb-api :: functionalities/postmortem/elf-core/gcore/TestGCore.py (1467 of 1857) UNSUPPORTED: lldb-api :: tools/lldb-server/TestGdbRemote_vContThreads.py (1468 of 1857) PASS: lldb-api :: lang/c/forward/TestForwardDeclaration.py (1469 of 1857) PASS: lldb-shell :: SymbolFile/DWARF/clang-ast-from-dwarf-objc-property.m (1470 of 1857) UNSUPPORTED: lldb-shell :: Register/aarch64-fp-read.test (1471 of 1857) PASS: lldb-unit :: Host/./HostTests/SocketTest.DomainListenConnectAccept (1472 of 1857) UNSUPPORTED: lldb-shell :: SymbolFile/PDB/function-nested-block.test (1473 of 1857) PASS: lldb-shell :: ExecControl/StopHook/stop-hook.test (1474 of 1857) PASS: lldb-unit :: Expression/./ExpressionTests/CppModuleConfigurationTest.MissingUsrInclude (1475 of 1857) PASS: lldb-unit :: Expression/./ExpressionTests/CppModuleConfigurationTest.AmbiguousCLib (1476 of 1857) PASS: lldb-api :: functionalities/thread/concurrent_events/TestConcurrentManyBreakpoints.py (1477 of 1857) PASS: lldb-unit :: Language/Highlighting/./HighlighterTests/HighlighterTest.ClangPPDirectives (1478 of 1857) PASS: lldb-api :: lang/c/stepping/TestStepAndBreakpoints.py (1479 of 1857) PASS: lldb-unit :: Utility/./UtilityTests/ConstStringTest.FromMidOfBufferStringRef (1480 of 1857) PASS: lldb-unit :: Utility/./UtilityTests/ScalarTest.GetBytes (1481 of 1857) PASS: lldb-shell :: Unwind/eh-frame-dwarf-unwind.test (1482 of 1857) PASS: lldb-api :: commands/frame/select/TestFrameSelect.py (1483 of 1857) PASS: lldb-unit :: Utility/./UtilityTests/UriParserTest.LongPath (1484 of 1857) PASS: lldb-shell :: ObjectFile/ELF/PT_LOAD-overlap.yaml (1485 of 1857) PASS: lldb-unit :: UnwindAssembly/x86/./UnwindAssemblyx86Tests/Testx86AssemblyInspectionEngine.TestReturnDetect (1486 of 1857) PASS: lldb-unit :: Utility/./UtilityTests/ConstStringTest.UpdateMangledCounterpart (1487 of 1857) PASS: lldb-api :: python_api/type/TestTypeList.py (1488 of 1857) PASS: lldb-api :: functionalities/breakpoint/source_regexp/TestSourceRegexBreakpoints.py (1489 of 1857) PASS: lldb-api :: commands/watchpoints/step_over_watchpoint/TestStepOverWatchpoint.py (1490 of 1857) PASS: lldb-api :: api/log/TestAPILog.py (1491 of 1857) PASS: lldb-unit :: Language/Highlighting/./HighlighterTests/HighlighterTest.ClangStringLiterals (1492 of 1857) PASS: lldb-unit :: Utility/./UtilityTests/StringLexerTest.NextIf (1493 of 1857) PASS: lldb-shell :: ObjectFile/PECOFF/symbol.yaml (1494 of 1857) PASS: lldb-api :: lang/cpp/class_types/TestClassTypes.py (1495 of 1857) PASS: lldb-shell :: SymbolFile/NativePDB/function-types-classes.cpp (1496 of 1857) PASS: lldb-unit :: Utility/./UtilityTests/OptionsWithRawTest.MultiWordSuffix (1497 of 1857) PASS: lldb-unit :: Utility/./UtilityTests/LogChannelEnabledTest.LogVerboseThread (1498 of 1857) PASS: lldb-shell :: SymbolFile/DWARF/dir-separator-windows.s (1499 of 1857) PASS: lldb-shell :: SymbolFile/DWARF/childless-compile-unit.s (1500 of 1857) PASS: lldb-unit :: Expression/./ExpressionTests/CppModuleConfigurationTest.IgnoreLibStdCpp (1501 of 1857) PASS: lldb-api :: python_api/name_lookup/TestNameLookup.py (1502 of 1857) PASS: lldb-unit :: Utility/./UtilityTests/StringListTest.JoinSingle (1503 of 1857) PASS: lldb-unit :: SymbolFile/NativePDB/./SymbolFileNativePDBTests/PDBFPOProgramToDWARFExpressionTests.SingleAssignmentRegisterRef (1504 of 1857) PASS: lldb-unit :: Utility/./UtilityTests/UriParserTest.TypicalPortPath (1505 of 1857) PASS: lldb-api :: commands/watchpoints/watchpoint_on_vectors/TestValueOfVectorVariable.py (1506 of 1857) PASS: lldb-unit :: Utility/./UtilityTests/SerializationRountripTest.SerializeDeserializePodPointers (1507 of 1857) PASS: lldb-unit :: UnwindAssembly/x86/./UnwindAssemblyx86Tests/Testx86AssemblyInspectionEngine.TestPushECX (1508 of 1857) UNSUPPORTED: lldb-api :: benchmarks/startup/TestStartupDelays.py (1509 of 1857) PASS: lldb-api :: functionalities/breakpoint/address_breakpoints/TestBadAddressBreakpoints.py (1510 of 1857) PASS: lldb-shell :: Reproducer/TestDriverOptions.test (1511 of 1857) PASS: lldb-unit :: Process/gdb-remote/./ProcessGdbRemoteTests/GDBRemoteCommunicationClientTest.GetModulesInfo_UUID20 (1512 of 1857) PASS: lldb-unit :: Utility/./UtilityTests/StringLexerTest.Next (1513 of 1857) PASS: lldb-unit :: Host/./HostTests/FileSystemTest.Resolve (1514 of 1857) UNSUPPORTED: lldb-shell :: BuildScript/toolchain-msvc.test (1515 of 1857) XFAIL: lldb-shell :: Register/x86-64-ymm-write.test (1516 of 1857) PASS: lldb-shell :: Quit/TestQuitExitCodeImplicit0.test (1517 of 1857) PASS: lldb-api :: functionalities/data-formatter/data-formatter-stl/libcxx/variant/TestDataFormatterLibcxxVariant.py (1518 of 1857) PASS: lldb-api :: commands/log/invalid-args/TestInvalidArgsLog.py (1519 of 1857) PASS: lldb-unit :: Utility/./UtilityTests/UriParserTest.SchemeHostSeparator4 (1520 of 1857) PASS: lldb-unit :: Utility/./UtilityTests/StringExtractorTest.GetHexBytesAvail_FullString (1521 of 1857) PASS: lldb-unit :: Host/./HostTests/HostInfoTest.GetHostname (1522 of 1857) PASS: lldb-unit :: Utility/./UtilityTests/TimeoutTest.Format (1523 of 1857) PASS: lldb-api :: python_api/value/TestValueAPI.py (1524 of 1857) PASS: lldb-shell :: SymbolFile/DWARF/anon_class_w_and_wo_export_symbols.ll (1525 of 1857) UNSUPPORTED: lldb-api :: functionalities/data-formatter/data-formatter-stl/libstdcpp/unique_ptr/TestDataFormatterStdUniquePtr.py (1526 of 1857) PASS: lldb-api :: functionalities/tail_call_frames/sbapi_support/TestTailCallFrameSBAPI.py (1527 of 1857) PASS: lldb-unit :: Host/./HostTests/NativeProcessProtocolTest.ReadMemoryWithoutTrap (1528 of 1857) PASS: lldb-unit :: tools/lldb-server/tests/./LLDBServerTests/TestBase.LaunchModePreservesEnvironment (1529 of 1857) PASS: lldb-unit :: Process/minidump/./LLDBMinidumpTests/MinidumpParserTest.GetThreadContext_x86_64 (1530 of 1857) PASS: lldb-api :: lang/objc/rdar-10967107/TestRdar10967107.py (1531 of 1857) PASS: lldb-unit :: Utility/./UtilityTests/StringExtractorTest.GetHexU8_InvalidHex (1532 of 1857) UNSUPPORTED: lldb-api :: commands/expression/call-restarts/TestCallThatRestarts.py (1533 of 1857) PASS: lldb-unit :: Utility/./UtilityTests/ArchSpecTest.TestParseMachCPUDashSubtypeTripleExtra (1534 of 1857) PASS: lldb-unit :: SymbolFile/DWARF/./SymbolFileDWARFTests/SymbolFileDWARFTests.TestAbilitiesForDWARF (1535 of 1857) PASS: lldb-api :: commands/expression/import-std-module/deque-dbg-info-content/TestDbgInfoContentDeque.py (1536 of 1857) PASS: lldb-unit :: Host/./HostTests/FileSystemTest.GetPermissions (1537 of 1857) PASS: lldb-api :: types/TestShortType.py (1538 of 1857) PASS: lldb-api :: commands/expression/completion-in-lambda-and-unnamed-class/TestCompletionInLambdaAndUnnamedClass.py (1539 of 1857) PASS: lldb-api :: functionalities/thread/create_after_attach/TestCreateAfterAttach.py (1540 of 1857) PASS: lldb-unit :: Utility/./UtilityTests/StringListTest.AppendStringStdString (1541 of 1857) PASS: lldb-unit :: Utility/./UtilityTests/StringListTest.JoinEmpty (1542 of 1857) PASS: lldb-unit :: Utility/./UtilityTests/UserIDResolver.GetGroupName (1543 of 1857) PASS: lldb-shell :: ObjectFile/PECOFF/basic-info-arm.yaml (1544 of 1857) PASS: lldb-unit :: Utility/./UtilityTests/FileSpecTest.GuessPathStyle (1545 of 1857) PASS: lldb-api :: commands/command/invalid-args/TestInvalidArgsCommand.py (1546 of 1857) PASS: lldb-api :: commands/expression/namespace_local_var_same_name_cpp_and_c/TestNamespaceLocalVarSameNameCppAndC.py (1547 of 1857) PASS: lldb-api :: commands/expression/expr-in-syscall/TestExpressionInSyscall.py (1548 of 1857) PASS: lldb-api :: lang/objc/ptr_refs/TestPtrRefsObjC.py (1549 of 1857) UNSUPPORTED: lldb-api :: functionalities/data-formatter/data-formatter-stl/libstdcpp/tuple/TestDataFormatterStdTuple.py (1550 of 1857) PASS: lldb-unit :: Host/./HostTests/MainLoopTest.UnmonitoredSignal (1551 of 1857) PASS: lldb-api :: functionalities/thread/concurrent_events/TestConcurrentTwoBreakpointsOneDelaySignal.py (1552 of 1857) PASS: lldb-shell :: Reproducer/TestDump.test (1553 of 1857) PASS: lldb-unit :: UnwindAssembly/PPC64/./PPC64InstEmulationTests/TestPPC64InstEmulation.TestSimpleFunction (1554 of 1857) PASS: lldb-unit :: UnwindAssembly/x86/./UnwindAssemblyx86Tests/Testx86AssemblyInspectionEngine.Test32BitOnlyInstruction (1555 of 1857) PASS: lldb-api :: lang/cpp/function_refs/TestFunctionRefs.py (1556 of 1857) UNSUPPORTED: lldb-shell :: SymbolFile/NativePDB/local-variables.cpp (1557 of 1857) PASS: lldb-unit :: SymbolFile/DWARF/./SymbolFileDWARFTests/SymbolFileDWARFTests.TestAbbrevInvalidNULLTag (1558 of 1857) PASS: lldb-api :: functionalities/data-formatter/data-formatter-stl/libcxx/list/loop/TestDataFormatterLibcxxListLoop.py (1559 of 1857) PASS: lldb-api :: functionalities/thread/concurrent_events/TestConcurrentCrashWithWatchpointBreakpointSignal.py (1560 of 1857) PASS: lldb-api :: tools/lldb-server/TestGdbRemoteKill.py (1561 of 1857) PASS: lldb-unit :: Utility/./UtilityTests/EnvironmentTest.EnvpConstruction (1562 of 1857) PASS: lldb-unit :: Process/gdb-remote/./ProcessGdbRemoteTests/GDBRemoteCommunicationClientTest.SendGetTraceConfigPacket (1563 of 1857) PASS: lldb-unit :: Expression/./ExpressionTests/DiagnosticManagerTest.PutString (1564 of 1857) PASS: lldb-unit :: ScriptInterpreter/Python/./ScriptInterpreterPythonTests/PythonDataObjectsTest.TestGlobalNameResolutionNoDot (1565 of 1857) PASS: lldb-api :: lang/cpp/gmodules/TestWithModuleDebugging.py (1566 of 1857) PASS: lldb-unit :: Utility/./UtilityTests/StreamTest.AddressPrefix (1567 of 1857) PASS: lldb-unit :: UnwindAssembly/x86/./UnwindAssemblyx86Tests/Testx86AssemblyInspectionEngine.TestPushRBX (1568 of 1857) PASS: lldb-unit :: Process/gdb-remote/./ProcessGdbRemoteTests/GDBRemoteCommunicationClientTest.WriteRegisterNoSuffix (1569 of 1857) PASS: lldb-unit :: Process/minidump/./LLDBMinidumpTests/MinidumpParserTest.FindMemoryRange (1570 of 1857) PASS: lldb-unit :: Utility/./UtilityTests/StreamTest.PutRawBytesToBigEndian (1571 of 1857) PASS: lldb-unit :: Target/./TargetTests/PathMappingListTest.RemapRoot (1572 of 1857) PASS: lldb-unit :: ObjectFile/Breakpad/./ObjectFileBreakpadTests/InfoRecord.parse (1573 of 1857) PASS: lldb-unit :: UnwindAssembly/x86/./UnwindAssemblyx86Tests/Testx86AssemblyInspectionEngine.TestCALLNextInsn (1574 of 1857) PASS: lldb-api :: functionalities/data-formatter/stringprinter/TestStringPrinter.py (1575 of 1857) UNSUPPORTED: lldb-shell :: ObjectFile/ELF/minidebuginfo-no-lzma.yaml (1576 of 1857) PASS: lldb-api :: commands/expression/context-object/TestContextObject.py (1577 of 1857) PASS: lldb-api :: lang/cpp/offsetof/TestOffsetofCpp.py (1578 of 1857) PASS: lldb-unit :: UnwindAssembly/x86/./UnwindAssemblyx86Tests/Testx86AssemblyInspectionEngine.TestPopRBX (1579 of 1857) PASS: lldb-unit :: Utility/./UtilityTests/UriParserTest.MinimalPortPath (1580 of 1857) PASS: lldb-api :: functionalities/conditional_break/TestConditionalBreak.py (1581 of 1857) UNSUPPORTED: lldb-api :: tools/lldb-server/thread-name/TestGdbRemoteThreadName.py (1582 of 1857) PASS: lldb-api :: functionalities/step_scripted/TestStepScripted.py (1583 of 1857) PASS: lldb-api :: functionalities/data-formatter/data-formatter-objc/TestDataFormatterObjCNSDate.py (1584 of 1857) PASS: lldb-unit :: Utility/./UtilityTests/ArgsTest.GetArgumentArrayRef (1585 of 1857) PASS: lldb-shell :: ObjectFile/PECOFF/dep-modules.yaml (1586 of 1857) PASS: lldb-unit :: Utility/./UtilityTests/BinaryStreamTest.PutULEB128EightBytes (1587 of 1857) PASS: lldb-unit :: Host/./HostTests/FileSystemTest.GetByteSize (1588 of 1857) PASS: lldb-api :: tools/lldb-server/TestGdbRemoteProcessInfo.py (1589 of 1857) PASS: lldb-unit :: Utility/./UtilityTests/StringExtractorTest.GetNameColonValueNoSemicolon (1590 of 1857) PASS: lldb-unit :: Process/gdb-remote/./ProcessGdbRemoteTests/GDBRemoteCommunicationClientTest.SendStartTracePacket (1591 of 1857) PASS: lldb-unit :: Utility/./UtilityTests/ReproducerTest.SetCapture (1592 of 1857) PASS: lldb-api :: lang/objc/objc++/TestObjCXX.py (1593 of 1857) PASS: lldb-unit :: Utility/./UtilityTests/StringListTest.AppendListCStringArray (1594 of 1857) PASS: lldb-api :: functionalities/thread/concurrent_events/TestConcurrentCrashWithBreak.py (1595 of 1857) PASS: lldb-api :: functionalities/breakpoint/breakpoint_by_line_and_column/TestBreakpointByLineAndColumn.py (1596 of 1857) UNSUPPORTED: lldb-api :: functionalities/longjmp/TestLongjmp.py (1597 of 1857) PASS: lldb-unit :: Utility/./UtilityTests/StringExtractorTest.GetHexBytesAvail (1598 of 1857) PASS: lldb-api :: functionalities/unwind/sigtramp/TestSigtrampUnwind.py (1599 of 1857) PASS: lldb-api :: python_api/interpreter/TestCommandInterpreterAPI.py (1600 of 1857) PASS: lldb-unit :: Core/./LLDBCoreTests/RichManglingContextTest.Basic (1601 of 1857) PASS: lldb-api :: functionalities/gdb_remote_client/TestNoGPacketSupported.py (1602 of 1857) PASS: lldb-api :: lang/objc/objc-ivar-protocols/TestIvarProtocols.py (1603 of 1857) PASS: lldb-unit :: Utility/./UtilityTests/StreamTeeTest.AppendStream (1604 of 1857) PASS: lldb-shell :: ObjectFile/PECOFF/basic-info-arm64.yaml (1605 of 1857) PASS: lldb-unit :: Utility/./UtilityTests/StreamTeeTest.CopyConstructor (1606 of 1857) PASS: lldb-unit :: Utility/./UtilityTests/StreamTest.PutCStringWithStringRef (1607 of 1857) PASS: lldb-shell :: ObjectFile/ELF/aarch64-relocations.yaml (1608 of 1857) PASS: lldb-unit :: Utility/./UtilityTests/ArchSpecTest.OperatorBool (1609 of 1857) PASS: lldb-shell :: ObjectFile/MachO/subsections.yaml (1610 of 1857) PASS: lldb-unit :: Utility/./UtilityTests/FileSpecTest.CopyByAppendingPathComponent (1611 of 1857) PASS: lldb-api :: functionalities/source-map/TestTargetSourceMap.py (1612 of 1857) PASS: lldb-shell :: SymbolFile/NativePDB/function-types-builtins.cpp (1613 of 1857) PASS: lldb-shell :: SymbolFile/NativePDB/break-by-line.cpp (1614 of 1857) PASS: lldb-api :: commands/source/info/TestSourceInfo.py (1615 of 1857) PASS: lldb-api :: commands/expression/call-function/TestCallStdStringFunction.py (1616 of 1857) PASS: lldb-unit :: Target/./TargetTests/ModuleCacheTest.GetAndPut (1617 of 1857) PASS: lldb-api :: functionalities/thread/concurrent_events/TestConcurrentSignalBreak.py (1618 of 1857) PASS: lldb-unit :: Utility/./UtilityTests/ArgsTest.TestSingleArg (1619 of 1857) PASS: lldb-unit :: Process/gdb-remote/./ProcessGdbRemoteTests/GDBRemoteCommunicationClientTest.ReadRegister (1620 of 1857) PASS: lldb-unit :: Host/./HostTests/NativeProcessProtocolTest.ReadCStringFromMemory_MaxSize (1621 of 1857) PASS: lldb-unit :: Utility/./UtilityTests/StreamTest.PutCharNull (1622 of 1857) PASS: lldb-unit :: Utility/./UtilityTests/ArchSpecTest.Compatibility (1623 of 1857) PASS: lldb-unit :: UnwindAssembly/ARM64/./Arm64InstEmulationTests/TestArm64InstEmulation.TestMediumDarwinFunction (1624 of 1857) PASS: lldb-unit :: Utility/./UtilityTests/StringListTest.InsertStringAtIndexStdString (1625 of 1857) PASS: lldb-unit :: Language/Highlighting/./HighlighterTests/HighlighterTest.ClangTrailingBackslashWithWhitespace (1626 of 1857) PASS: lldb-api :: types/TestShortTypeExpr.py (1627 of 1857) UNSUPPORTED: lldb-api :: commands/watchpoints/variable_out_of_scope/TestWatchedVarHitWhenInScope.py (1628 of 1857) PASS: lldb-unit :: Interpreter/./InterpreterTests/OptionArgParserTest.toBoolean (1629 of 1857) PASS: lldb-api :: functionalities/data-formatter/data-formatter-proper-plurals/TestFormattersOneIsSingular.py (1630 of 1857) PASS: lldb-api :: functionalities/thread/concurrent_events/TestConcurrentBreakpointsDelayedBreakpointOneWatchpoint.py (1631 of 1857) UNSUPPORTED: lldb-api :: commands/watchpoints/multi_watchpoint_slots/TestWatchpointMultipleSlots.py (1632 of 1857) UNSUPPORTED: lldb-shell :: SymbolFile/PDB/calling-conventions.test (1633 of 1857) PASS: lldb-unit :: Symbol/./SymbolTests/TestClangASTContext.TemplateArguments (1634 of 1857) PASS: lldb-unit :: Utility/./UtilityTests/StringListTest.Clear (1635 of 1857) PASS: lldb-unit :: Utility/./UtilityTests/ScalarTest.Division (1636 of 1857) PASS: lldb-unit :: ScriptInterpreter/Python/./ScriptInterpreterPythonTests/PythonDataObjectsTest.TestObjectAttributes (1637 of 1857) PASS: lldb-shell :: ObjectFile/ELF/short-build-id.yaml (1638 of 1857) PASS: lldb-shell :: Commands/command-script-import.test (1639 of 1857) PASS: lldb-unit :: Process/minidump/./LLDBMinidumpTests/MinidumpParserTest.GetPidWindows (1640 of 1857) PASS: lldb-api :: functionalities/recursion/TestValueObjectRecursion.py (1641 of 1857) PASS: lldb-api :: commands/watchpoints/watchpoint_commands/TestWatchpointCommands.py (1642 of 1857) PASS: lldb-api :: functionalities/tsan/thread_numbers/TestTsanThreadNumbers.py (1643 of 1857) UNSUPPORTED: lldb-api :: commands/expression/completion-crash1/TestCompletionCrash1.py (1644 of 1857) PASS: lldb-unit :: ScriptInterpreter/Python/./ScriptInterpreterPythonTests/PythonDataObjectsTest.TestPythonTupleInitializerList2 (1645 of 1857) PASS: lldb-api :: functionalities/thread/concurrent_events/TestConcurrentWatchpointDelayWatchpointOneBreakpoint.py (1646 of 1857) PASS: lldb-unit :: Core/./LLDBCoreTests/StreamCallbackTest.Callback (1647 of 1857) PASS: lldb-shell :: SymbolFile/DWARF/dir-separator-no-comp-dir-relative-name.s (1648 of 1857) PASS: lldb-shell :: SymbolFile/DWARF/parallel-indexing-stress.s (1649 of 1857) PASS: lldb-api :: commands/frame/diagnose/virtual-method-call/TestDiagnoseDereferenceVirtualMethodCall.py (1650 of 1857) PASS: lldb-unit :: Utility/./UtilityTests/ScalarTest.SetValueFromCString (1651 of 1857) PASS: lldb-unit :: Symbol/./SymbolTests/TestClangASTContext.TestRecordHasFields (1652 of 1857) PASS: lldb-shell :: SymbolFile/DWARF/compilercontext.ll (1653 of 1857) PASS: lldb-api :: functionalities/breakpoint/debugbreak/TestDebugBreak.py (1654 of 1857) PASS: lldb-api :: functionalities/signal/handle-abrt/TestHandleAbort.py (1655 of 1857) PASS: lldb-unit :: SymbolFile/DWARF/./SymbolFileDWARFTests/SymbolFileDWARFTests.TestAbbrevOrder1Start5 (1656 of 1857) PASS: lldb-unit :: Language/Highlighting/./HighlighterTests/HighlighterTest.ClangSquareBrackets (1657 of 1857) PASS: lldb-api :: api/multiple-targets/TestMultipleTargets.py (1658 of 1857) PASS: lldb-api :: lang/cpp/dynamic-value-same-basename/TestDynamicValueSameBase.py (1659 of 1857) UNSUPPORTED: lldb-api :: commands/register/register/intel_xtended_registers/TestMPXRegisters.py (1660 of 1857) PASS: lldb-unit :: Utility/./UtilityTests/UriParserTest.SchemeHostSeparator3 (1661 of 1857) PASS: lldb-api :: macosx/function-starts/TestFunctionStarts.py (1662 of 1857) PASS: lldb-shell :: Register/x86-64-gp-read.test (1663 of 1857) PASS: lldb-unit :: Host/./HostTests/FileSystemTest.Exists (1664 of 1857) PASS: lldb-api :: commands/expression/namespace_local_var_same_name_obj_c/TestNamespaceLocalVarSameNameObjC.py (1665 of 1857) PASS: lldb-unit :: Utility/./UtilityTests/UUIDTest.Validity (1666 of 1857) PASS: lldb-unit :: ObjectFile/Breakpad/./ObjectFileBreakpadTests/FileRecord.parse (1667 of 1857) PASS: lldb-unit :: Host/./HostTests/SocketAddressTest.Set (1668 of 1857) PASS: lldb-unit :: Utility/./UtilityTests/ReproducerTest.SetReplay (1669 of 1857) PASS: lldb-api :: functionalities/data-formatter/data-formatter-cpp/TestDataFormatterCpp.py (1670 of 1857) PASS: lldb-api :: lang/c/register_variables/TestRegisterVariables.py (1671 of 1857) PASS: lldb-api :: commands/expression/import-std-module/unique_ptr-dbg-info-content/TestUniquePtrDbgInfoContent.py (1672 of 1857) PASS: lldb-shell :: SymbolFile/Breakpad/stack-cfi-parsing.test (1673 of 1857) PASS: lldb-api :: macosx/find-dsym/deep-bundle/TestDeepBundle.py (1674 of 1857) PASS: lldb-shell :: ObjectFile/PECOFF/sections-names.yaml (1675 of 1857) PASS: lldb-unit :: UnwindAssembly/x86/./UnwindAssemblyx86Tests/Testx86AssemblyInspectionEngine.TestPushR14 (1676 of 1857) PASS: lldb-unit :: Utility/./UtilityTests/RecordReplayTest.InstrumentedBarPtr (1677 of 1857) PASS: lldb-unit :: Symbol/./SymbolTests/TestClangASTContext.TestUnifyAccessSpecifiers (1678 of 1857) PASS: lldb-api :: commands/expression/invalid-args/TestInvalidArgsExpression.py (1679 of 1857) PASS: lldb-api :: functionalities/thread/backtrace_limit/TestBacktraceLimit.py (1680 of 1857) PASS: lldb-api :: python_api/class_members/TestSBTypeClassMembers.py (1681 of 1857) PASS: lldb-unit :: ScriptInterpreter/Python/./ScriptInterpreterPythonTests/PythonDataObjectsTest.TestPythonDictionaryManipulation (1682 of 1857) PASS: lldb-api :: commands/expression/call-function/TestCallBuiltinFunction.py (1683 of 1857) PASS: lldb-unit :: SymbolFile/DWARF/./SymbolFileDWARFTests/SymbolFileDWARFTests.TestAbbrevNullAttrValidForm (1684 of 1857) PASS: lldb-unit :: Utility/./UtilityTests/BinaryStreamTest.PutSLEB128TwoBytes (1685 of 1857) PASS: lldb-unit :: Process/gdb-remote/./ProcessGdbRemoteTests/GDBRemoteCommunicationClientTest.TestPacketSpeedJSON (1686 of 1857) PASS: lldb-api :: source-manager/TestSourceManager.py (1687 of 1857) PASS: lldb-api :: commands/frame/diagnose/local-variable/TestLocalVariable.py (1688 of 1857) PASS: lldb-api :: functionalities/data-formatter/data-formatter-stl/libcxx/initializerlist/TestInitializerList.py (1689 of 1857) PASS: lldb-api :: functionalities/postmortem/minidump/TestMiniDump.py (1690 of 1857) PASS: lldb-unit :: UnwindAssembly/x86/./UnwindAssemblyx86Tests/Testx86AssemblyInspectionEngine.TestPushEBP (1691 of 1857) PASS: lldb-shell :: Reproducer/TestReuseDirectory.test (1692 of 1857) PASS: lldb-unit :: UnwindAssembly/PPC64/./PPC64InstEmulationTests/TestPPC64InstEmulation.TestMediumFunction (1693 of 1857) PASS: lldb-api :: python_api/watchpoint/TestWatchpointIter.py (1694 of 1857) PASS: lldb-api :: commands/expression/timeout/TestCallWithTimeout.py (1695 of 1857) PASS: lldb-unit :: Expression/./ExpressionTests/DiagnosticManagerTest.PutStringSeverities (1696 of 1857) PASS: lldb-shell :: Driver/TestProcessAttach.test (1697 of 1857) PASS: lldb-api :: macosx/safe-to-func-call/TestSafeFuncCalls.py (1698 of 1857) UNSUPPORTED: lldb-api :: lang/cpp/static_members/TestCPPStaticMembers.py (1699 of 1857) PASS: lldb-unit :: Language/Highlighting/./HighlighterTests/HighlighterTest.ClangBraces (1700 of 1857) PASS: lldb-unit :: Utility/./UtilityTests/StringExtractorTest.DecodeHexU8_Extra (1701 of 1857) PASS: lldb-api :: lang/objc/objc-runtime-ivars/TestRuntimeIvars.py (1702 of 1857) PASS: lldb-unit :: Utility/./UtilityTests/NameMatchesTest.EndsWith (1703 of 1857) PASS: lldb-unit :: Language/Highlighting/./HighlighterTests/HighlighterTest.HighlighterSelectionType (1704 of 1857) PASS: lldb-api :: lang/objc/single-entry-dictionary/TestObjCSingleEntryDictionary.py (1705 of 1857) PASS: lldb-unit :: Utility/./UtilityTests/LogChannelEnabledTest.LogThread (1706 of 1857) PASS: lldb-api :: commands/expression/unwind_expression/TestUnwindExpression.py (1707 of 1857) PASS: lldb-api :: macosx/lc-note/kern-ver-str/TestKernVerStrLCNOTE.py (1708 of 1857) PASS: lldb-unit :: Expression/./ExpressionTests/DiagnosticManagerTest.HasFixits (1709 of 1857) PASS: lldb-unit :: SymbolFile/DWARF/./SymbolFileDWARFTests/SymbolFileDWARFTests.TestAbbrevMissingTerminator (1710 of 1857) PASS: lldb-unit :: Utility/./UtilityTests/StringListTest.JoinThree (1711 of 1857) PASS: lldb-unit :: Utility/./UtilityTests/ArgsTest.EscapeLLDBCommandArgument (1712 of 1857) PASS: lldb-api :: lang/objc/foundation/TestObjCMethodsNSArray.py (1713 of 1857) PASS: lldb-api :: functionalities/pre_run_dylibs/TestPreRunDylibs.py (1714 of 1857) PASS: lldb-api :: python_api/default-constructor/TestDefaultConstructorForAPIObjects.py (1715 of 1857) PASS: lldb-unit :: Expression/./ExpressionTests/DiagnosticManagerTest.GetStringBasic (1716 of 1857) PASS: lldb-unit :: Language/Highlighting/./HighlighterTests/HighlighterTest.ClangCursorOutOfBounds (1717 of 1857) PASS: lldb-api :: lang/c/set_values/TestSetValues.py (1718 of 1857) PASS: lldb-unit :: Utility/./UtilityTests/StringExtractorTest.GetHexU8_Underflow_NoEof (1719 of 1857) PASS: lldb-unit :: Process/gdb-remote/./ProcessGdbRemoteTests/GDBRemoteCommunicationClientTest.SendStopTracePacket (1720 of 1857) PASS: lldb-unit :: Utility/./UtilityTests/StringExtractorTest.DecodeHexU8_InvalidHex2 (1721 of 1857) UNSUPPORTED: lldb-shell :: SymbolFile/PDB/class-layout.test (1722 of 1857) UNSUPPORTED: lldb-shell :: SymbolFile/PDB/pointers.test (1723 of 1857) PASS: lldb-api :: commands/expression/import-std-module/empty-module/TestEmptyStdModule.py (1724 of 1857) PASS: lldb-unit :: Utility/./UtilityTests/ScalarTest.Comparison (1725 of 1857) PASS: lldb-api :: functionalities/data-formatter/data-formatter-stl/libcxx/multiset/TestDataFormatterLibcxxMultiSet.py (1726 of 1857) PASS: lldb-shell :: Settings/TestDisableColor.test (1727 of 1857) PASS: lldb-api :: tools/lldb-server/register-reading/TestGdbRemoteGPacket.py (1728 of 1857) PASS: lldb-unit :: Utility/./UtilityTests/StreamTest.PutMaxHex64ByteOrderLittle (1729 of 1857) PASS: lldb-shell :: SymbolFile/DWARF/dir-separator-no-comp-dir.s (1730 of 1857) UNSUPPORTED: lldb-api :: arm/breakpoint-thumb-codesection/TestBreakpointThumbCodesection.py (1731 of 1857) PASS: lldb-unit :: Symbol/./SymbolTests/PostfixExpression.ParseFPOProgram (1732 of 1857) PASS: lldb-unit :: Host/./HostTests/NativeProcessProtocolTest.SetBreakpointFailVerify (1733 of 1857) PASS: lldb-unit :: Utility/./UtilityTests/StreamTest.AddressRangeSize (1734 of 1857) PASS: lldb-unit :: Utility/./UtilityTests/FileSpecTest.Match (1735 of 1857) PASS: lldb-unit :: Host/./HostTests/NativeProcessProtocolTest.SetBreakpoint (1736 of 1857) PASS: lldb-api :: lang/c/tls_globals/TestTlsGlobals.py (1737 of 1857) PASS: lldb-api :: lang/cpp/global_variables/TestCPPGlobalVariables.py (1738 of 1857) PASS: lldb-api :: lang/objcxx/cxx-bridged-po/TestObjCXXBridgedPO.py (1739 of 1857) PASS: lldb-shell :: Reproducer/TestSynchronous.test (1740 of 1857) PASS: lldb-unit :: Symbol/./SymbolTests/TestClangASTContext.TestIsClangType (1741 of 1857) PASS: lldb-unit :: Utility/./UtilityTests/StringListTest.CopyList (1742 of 1857) PASS: lldb-shell :: SymbolFile/Breakpad/unwind-via-stack-cfi.test (1743 of 1857) PASS: lldb-shell :: Minidump/Windows/Sigsegv/sigsegv.test (1744 of 1857) PASS: lldb-shell :: SymbolFile/DWARF/debug_ranges-missing-section.s (1745 of 1857) PASS: lldb-unit :: Core/./LLDBCoreTests/RichManglingContextTest.FromCxxMethodName (1746 of 1857) PASS: lldb-api :: functionalities/breakpoint/breakpoint_ids/TestBreakpointIDs.py (1747 of 1857) PASS: lldb-shell :: Reproducer/TestFileRepro.test (1748 of 1857) PASS: lldb-unit :: SymbolFile/NativePDB/./SymbolFileNativePDBTests/PDBFPOProgramToDWARFExpressionTests.InvalidAssignmentMultiple (1749 of 1857) PASS: lldb-unit :: Expression/./ExpressionTests/DiagnosticManagerTest.GetStringPreserveOrder (1750 of 1857) PASS: lldb-api :: functionalities/thread/step_until/TestStepUntil.py (1751 of 1857) PASS: lldb-api :: functionalities/data-formatter/data-formatter-stl/libcxx/forward_list/TestDataFormatterLibcxxForwardList.py (1752 of 1857) PASS: lldb-unit :: Expression/./ExpressionTests/DiagnosticManagerTest.AppendMessageAttachToLastDiag (1753 of 1857) PASS: lldb-api :: tools/lldb-server/TestLldbGdbServer.py (1754 of 1857) PASS: lldb-unit :: Process/minidump/./LLDBMinidumpTests/MinidumpParserTest.FindMemoryRangeWithFullMemoryMinidump (1755 of 1857) PASS: lldb-unit :: UnwindAssembly/x86/./UnwindAssemblyx86Tests/Testx86AssemblyInspectionEngine.TestStackRealign8BitDisp_i386 (1756 of 1857) PASS: lldb-api :: functionalities/thread/concurrent_events/TestConcurrentSignalDelayWatch.py (1757 of 1857) PASS: lldb-unit :: Host/./HostTests/MainLoopTest.ReadObject (1758 of 1857) PASS: lldb-unit :: Utility/./UtilityTests/ArchSpecTest.TestParseMachCPUDashSubtypeTripleSimple (1759 of 1857) PASS: lldb-unit :: Language/Highlighting/./HighlighterTests/HighlighterTest.FallbackHighlighter (1760 of 1857) PASS: lldb-api :: functionalities/thread/concurrent_events/TestConcurrentTwoWatchpointsOneDelayBreakpoint.py (1761 of 1857) PASS: lldb-unit :: Utility/./UtilityTests/StringExtractorTest.GetNameColonValueSuccess (1762 of 1857) PASS: lldb-unit :: Utility/./UtilityTests/StringListTest.LongestCommonPrefixEmpty (1763 of 1857) PASS: lldb-api :: functionalities/paths/TestPaths.py (1764 of 1857) PASS: lldb-api :: functionalities/data-formatter/data-formatter-objc/nsstring/TestDataFormatterNSString.py (1765 of 1857) PASS: lldb-api :: functionalities/modern-type-lookup/basic/TestBasicModernTypeLookup.py (1766 of 1857) PASS: lldb-unit :: UnwindAssembly/x86/./UnwindAssemblyx86Tests/Testx86AssemblyInspectionEngine.TestPushImm (1767 of 1857) PASS: lldb-api :: functionalities/breakpoint/cpp_exception/TestCPPExceptionBreakpoint.py (1768 of 1857) PASS: lldb-api :: commands/expression/persistent_types/TestPersistentTypes.py (1769 of 1857) PASS: lldb-api :: commands/target/create-no-such-arch/TestNoSuchArch.py (1770 of 1857) PASS: lldb-api :: macosx/version_zero/TestGetVersionZeroVersion.py (1771 of 1857) PASS: lldb-api :: functionalities/breakpoint/breakpoint_names/TestBreakpointNames.py (1772 of 1857) PASS: lldb-shell :: SymbolFile/NativePDB/globals-fundamental.cpp (1773 of 1857) PASS: lldb-unit :: Utility/./UtilityTests/ArgsTest.TestArgv (1774 of 1857) PASS: lldb-api :: lang/cpp/bool/TestCPPBool.py (1775 of 1857) PASS: lldb-shell :: Minidump/memory-region-from-module.yaml (1776 of 1857) UNSUPPORTED: lldb-shell :: Register/x86-64-xmm16-write.test (1777 of 1857) PASS: lldb-unit :: Utility/./UtilityTests/FileSpecTest.Equal (1778 of 1857) PASS: lldb-unit :: Process/gdb-remote/./ProcessGdbRemoteTests/GDBRemoteClientBaseTest.SendContinueDelegateStructuredDataReceipt (1779 of 1857) PASS: lldb-shell :: Driver/TestCommands.test (1780 of 1857) PASS: lldb-api :: python_api/lldbutil/frame/TestFrameUtils.py (1781 of 1857) PASS: lldb-api :: sanity/TestModuleCacheSanity.py (1782 of 1857) UNSUPPORTED: lldb-api :: commands/expression/macros/TestMacros.py (1783 of 1857) PASS: lldb-unit :: Utility/./UtilityTests/RangeTest.Copy (1784 of 1857) PASS: lldb-api :: functionalities/thread/concurrent_events/TestConcurrentSignalWatch.py (1785 of 1857) PASS: lldb-unit :: UnwindAssembly/x86/./UnwindAssemblyx86Tests/Testx86AssemblyInspectionEngine.TestPopR14 (1786 of 1857) UNSUPPORTED: lldb-api :: arm/breakpoint-it/TestBreakpointIt.py (1787 of 1857) UNSUPPORTED: lldb-shell :: BuildScript/toolchain-clang-cl.test (1788 of 1857) PASS: lldb-unit :: Utility/./UtilityTests/BinaryStreamTest.PutULEB128TwoBytes (1789 of 1857) PASS: lldb-api :: functionalities/breakpoint/breakpoint_locations/TestBreakpointLocations.py (1790 of 1857) PASS: lldb-unit :: Expression/./ExpressionTests/CppModuleConfigurationTest.Linux (1791 of 1857) PASS: lldb-unit :: Host/./HostTests/SocketTest.TCPListen0GetPort (1792 of 1857) PASS: lldb-unit :: Core/./LLDBCoreTests/RichManglingContextTest.IPDRealloc (1793 of 1857) PASS: lldb-unit :: ScriptInterpreter/Python/./ScriptInterpreterPythonTests/PythonDataObjectsTest.TestExtractingUInt64ThroughStructuredData (1794 of 1857) PASS: lldb-unit :: Language/Highlighting/./HighlighterTests/HighlighterTest.ClangIdentifiers (1795 of 1857) UNSUPPORTED: lldb-shell :: Register/x86-64-xmm16-read.test (1796 of 1857) PASS: lldb-unit :: Process/minidump/./LLDBMinidumpTests/MinidumpParserTest.GetMemoryRegionInfoFromMemoryList (1797 of 1857) PASS: lldb-unit :: Language/Highlighting/./HighlighterTests/HighlighterTest.ClangCursorPos (1798 of 1857) PASS: lldb-unit :: Symbol/./SymbolTests/DWARFCallFrameInfoTest.Basic_eh (1799 of 1857) PASS: lldb-api :: commands/expression/anonymous-struct/TestCallUserAnonTypedef.py (1800 of 1857) PASS: lldb-api :: lang/c/find_struct_type/TestFindStructTypes.py (1801 of 1857) PASS: lldb-shell :: Breakpoint/case-sensitive.test (1802 of 1857) PASS: lldb-unit :: Process/gdb-remote/./ProcessGdbRemoteTests/GDBRemoteClientBaseTest.InterruptNoResponse (1803 of 1857) PASS: lldb-api :: functionalities/data-formatter/poarray/TestPrintObjectArray.py (1804 of 1857) PASS: lldb-unit :: SymbolFile/NativePDB/./SymbolFileNativePDBTests/PDBFPOProgramToDWARFExpressionTests.UnknownOp (1805 of 1857) PASS: lldb-unit :: UnwindAssembly/x86/./UnwindAssemblyx86Tests/Testx86AssemblyInspectionEngine.Test32bitFramelessBigStackFrame (1806 of 1857) PASS: lldb-api :: commands/apropos/basic/TestApropos.py (1807 of 1857) PASS: lldb-api :: functionalities/thread/concurrent_events/TestConcurrentCrashWithSignal.py (1808 of 1857) PASS: lldb-unit :: Utility/./UtilityTests/UriParserTest.BracketedHostnameWithColon (1809 of 1857) PASS: lldb-api :: commands/watchpoints/watchpoint_commands/command/TestWatchpointCommandLLDB.py (1810 of 1857) PASS: lldb-unit :: Process/gdb-remote/./ProcessGdbRemoteTests/GDBRemoteCommunicationClientTest.GetMemoryRegionInfoInvalidResponse (1811 of 1857) PASS: lldb-unit :: Utility/./UtilityTests/Flags.GetBitSize (1812 of 1857) PASS: lldb-unit :: Utility/./UtilityTests/StreamTest.PutHex16ByteOrderBig (1813 of 1857) PASS: lldb-shell :: Driver/TestRepl.test (1814 of 1857) UNSUPPORTED: lldb-shell :: SymbolFile/target-symbols-add-unwind.test (1815 of 1857) PASS: lldb-shell :: SymbolFile/Breakpad/unwind-via-stack-win.test (1816 of 1857) PASS: lldb-unit :: Utility/./UtilityTests/AnsiTerminal.Basic (1817 of 1857) PASS: lldb-unit :: Process/gdb-remote/./ProcessGdbRemoteTests/GDBRemoteClientBaseTest.SendContinueAndLateInterrupt (1818 of 1857) UNSUPPORTED: lldb-shell :: Watchpoint/netbsd-nouserdbregs.test (1819 of 1857) PASS: lldb-unit :: Utility/./UtilityTests/StringExtractorTest.DecodeHexU8_InvalidHex (1820 of 1857) PASS: lldb-api :: commands/expression/multiline-completion/TestMultilineCompletion.py (1821 of 1857) PASS: lldb-unit :: Utility/./UtilityTests/RangeTest.Constructor (1822 of 1857) PASS: lldb-unit :: Utility/./UtilityTests/StringLexerTest.PutBack (1823 of 1857) PASS: lldb-unit :: Language/Highlighting/./HighlighterTests/HighlighterTest.DefaultHighlighterWithCursorOutOfBounds (1824 of 1857) PASS: lldb-api :: functionalities/fat_archives/TestFatArchives.py (1825 of 1857) PASS: lldb-unit :: Language/Highlighting/./HighlighterTests/HighlighterTest.ClangCursorPosBeforeOtherToken (1826 of 1857) PASS: lldb-api :: lang/cpp/virtual/TestVirtual.py (1827 of 1857) PASS: lldb-unit :: Utility/./UtilityTests/StringListTest.CopyListSingle (1828 of 1857) UNSUPPORTED: lldb-shell :: Expr/TestIRMemoryMapWindows.test (1829 of 1857) PASS: lldb-api :: python_api/sbstructureddata/TestStructuredDataAPI.py (1830 of 1857) PASS: lldb-shell :: SymbolFile/DWARF/debug_loc-aslr.s (1831 of 1857) PASS: lldb-api :: functionalities/inferior-crashing/recursive-inferior/TestRecursiveInferior.py (1832 of 1857) PASS: lldb-unit :: UnwindAssembly/x86/./UnwindAssemblyx86Tests/Testx86AssemblyInspectionEngine.TestStackRealignMSVC_i386 (1833 of 1857) PASS: lldb-unit :: Host/./HostTests/TaskPoolTest.AddTask (1834 of 1857) XFAIL: lldb-shell :: Register/x86-mm-xmm-write.test (1835 of 1857) PASS: lldb-api :: lang/cpp/chained-calls/TestCppChainedCalls.py (1836 of 1857) PASS: lldb-api :: lang/cpp/char8_t/TestCxxChar8_t.py (1837 of 1857) PASS: lldb-api :: lang/objc/objc-super/TestObjCSuper.py (1838 of 1857) PASS: lldb-api :: tools/lldb-server/TestGdbRemote_qThreadStopInfo.py (1839 of 1857) PASS: lldb-api :: commands/expression/import-std-module/weak_ptr-dbg-info-content/TestDbgInfoContentWeakPtr.py (1840 of 1857) PASS: lldb-api :: lang/cpp/namespace_conflicts/TestNamespaceConflicts.py (1841 of 1857) PASS: lldb-api :: lang/cpp/rvalue-references/TestRvalueReferences.py (1842 of 1857) PASS: lldb-api :: commands/settings/TestSettings.py (1843 of 1857) PASS: lldb-api :: lang/objcxx/objcxx-ivar-vector/TestIvarVector.py (1844 of 1857) PASS: lldb-api :: commands/expression/import-std-module/deque-basic/TestBasicDeque.py (1845 of 1857) PASS: lldb-api :: functionalities/data-formatter/nsdictionarysynth/TestNSDictionarySynthetic.py (1846 of 1857) PASS: lldb-api :: lang/objc/foundation/TestSymbolTable.py (1847 of 1857) PASS: lldb-api :: functionalities/data-formatter/data-formatter-stl/libcxx/unordered/TestDataFormatterUnordered.py (1848 of 1857) PASS: lldb-api :: functionalities/inline-stepping/TestInlineStepping.py (1849 of 1857) PASS: lldb-api :: functionalities/breakpoint/breakpoint_conditions/TestBreakpointConditions.py (1850 of 1857) PASS: lldb-api :: api/multithreaded/TestMultithreaded.py (1851 of 1857) PASS: lldb-api :: lang/objc/objc-new-syntax/TestObjCNewSyntaxDictionary.py (1852 of 1857) PASS: lldb-api :: lang/objc/foundation/TestObjCMethods.py (1853 of 1857) PASS: lldb-api :: lang/objc/foundation/TestObjCMethodsString.py (1854 of 1857) PASS: lldb-api :: python_api/watchpoint/watchlocation/TestSetWatchlocation.py (1855 of 1857) PASS: lldb-api :: lang/cpp/enum_types/TestCPP11EnumTypes.py (1856 of 1857) PASS: lldb-api :: lang/objc/foundation/TestFoundationDisassembly.py (1857 of 1857)

Hide Details

Testing Time: 339.24s ******************** Failing Tests (1): lldb-api :: commands/watchpoints/watchpoint_set_command/TestWatchLocationWithWatchSet.py

Hide Details

Hide Details

Slowest Tests: -------------------------------------------------------------------------- 35.84s: lldb-api :: tools/lldb-server/TestGdbRemoteThreadsInStopReply.py 36.10s: lldb-api :: types/TestIntegerTypeExpr.py 38.23s: lldb-api :: python_api/watchpoint/watchlocation/TestSetWatchlocation.py 43.00s: lldb-api :: lang/objc/foundation/TestObjCMethodsNSError.py 44.97s: lldb-api :: python_api/watchpoint/watchlocation/TestTargetWatchAddress.py 45.41s: lldb-api :: lang/objc/objc-new-syntax/TestObjCNewSyntaxArray.py 48.50s: lldb-api :: functionalities/recursion/TestValueObjectRecursion.py 50.43s: lldb-api :: types/TestLongTypes.py 50.55s: lldb-api :: lang/objc/real-definition/TestRealDefinition.py 52.98s: lldb-api :: commands/watchpoints/watchpoint_set_command/TestWatchLocationWithWatchSet.py 54.57s: lldb-api :: lang/objc/exceptions/TestObjCExceptions.py 56.91s: lldb-api :: types/TestLongTypesExpr.py 59.03s: lldb-api :: lang/objc/objc-new-syntax/TestObjCNewSyntaxLiteral.py 62.03s: lldb-api :: api/multithreaded/TestMultithreaded.py 63.43s: lldb-api :: lang/cpp/namespace/TestNamespaceLookup.py 65.32s: lldb-api :: lang/cpp/enum_types/TestCPP11EnumTypes.py 67.09s: lldb-api :: lang/objc/foundation/TestObjCMethods.py 90.47s: lldb-api :: lang/objc/hidden-ivars/TestHiddenIvars.py 94.15s: lldb-api :: tools/lldb-server/TestLldbGdbServer.py 129.95s: lldb-api :: lang/objc/foundation/TestFoundationDisassembly.py

Hide Details

Tests Times: -------------------------------------------------------------------------- [ Range ] :: [ Percentage ] :: [ Count ] -------------------------------------------------------------------------- [ 0s, 10s) :: [*********************************** ] :: [1646/1857] [ 10s, 20s) :: [*** ] :: [ 152/1857] [ 20s, 30s) :: [ ] :: [ 35/1857] [ 30s, 40s) :: [ ] :: [ 7/1857] [ 40s, 50s) :: [ ] :: [ 4/1857] [ 50s, 60s) :: [ ] :: [ 6/1857] [ 60s, 70s) :: [ ] :: [ 4/1857] [ 70s, 80s) :: [ ] :: [ 0/1857] [ 80s, 90s) :: [ ] :: [ 0/1857] [ 90s,100s) :: [ ] :: [ 2/1857] [100s,110s) :: [ ] :: [ 0/1857] [110s,120s) :: [ ] :: [ 0/1857] [120s,130s) :: [ ] :: [ 1/1857] Expected Passes : 1718 Expected Failures : 6 Unsupported Tests : 132 Unexpected Failures: 1 FAILED: tools/lldb/test/CMakeFiles/check-lldb-lit cd /Users/buildslave/jenkins/workspace/lldb-cmake/lldb-build/tools/lldb/test && /usr/local/bin/python /Users/buildslave/jenkins/workspace/lldb-cmake/lldb-build/./bin/llvm-lit -v --time-tests --shuffle --xunit-xml-output=/Users/buildslave/jenkins/workspace/lldb-cmake/test/results.xml -v /Users/buildslave/jenkins/workspace/lldb-cmake/lldb-build/tools/lldb/test ninja: build stopped: subcommand failed. Command failed: Command '['/usr/bin/env', 'TERM=vt100', '/usr/local/bin/ninja', '-v', 'check-lldb']' returned non-zero exit status 1. Command: ['/usr/bin/env', 'TERM=vt100', '/usr/local/bin/ninja', '-v', 'check-lldb'] [Pipeline] } [Pipeline] // timeout [Pipeline] } [Pipeline] // stage [Pipeline] stage [Pipeline] { (Declarative: Post Actions) [Pipeline] scanForIssues No credentials specified [Clang (LLVM based)] Sleeping for 5 seconds due to JENKINS-32191... [Clang (LLVM based)] Parsing console log (workspace: '/Users/buildslave/jenkins/workspace/lldb-cmake') [Clang (LLVM based)] [-ERROR-] Git blame errors: [Clang (LLVM based)] [-ERROR-] - no blame results for request <llvm-project/llvm/include/llvm/Analysis/ScalarEvolution.h - [1696]>.

Hide Details

[Clang (LLVM based)] Post processing issues on 'green-dragon-24' with source code encoding 'UTF-8' [Clang (LLVM based)] Resolving absolute file names for all issues in workspace '/Users/buildslave/jenkins/workspace/lldb-cmake' [Clang (LLVM based)] -> 0 resolved, 0 unresolved, 1 already resolved [Clang (LLVM based)] Copying affected files to Jenkins' build folder '/Users/Shared/Jenkins/Home/jobs/lldb-cmake/builds/4594/files-with-issues' [Clang (LLVM based)] -> 1 copied, 0 not in workspace, 0 not-found, 0 with I/O error [Clang (LLVM based)] Resolving module names from module definitions (build.xml, pom.xml, or Manifest.mf files) [Clang (LLVM based)] -> resolved module names for 1 issues [Clang (LLVM based)] Resolving package names (or namespaces) by parsing the affected files [Clang (LLVM based)] -> resolved package names of 1 affected files [Clang (LLVM based)] No filter has been set, publishing all 1 issues [Clang (LLVM based)] Creating fingerprints for all affected code blocks to track issues over different builds [Clang (LLVM based)] -> created fingerprints for 1 issues [Clang (LLVM based)] Invoking Git blamer to create author and commit information for all affected files [Clang (LLVM based)] GIT_COMMIT env = 'HEAD' [Clang (LLVM based)] Git working tree = '/Users/buildslave/jenkins/workspace/lldb-cmake' [Clang (LLVM based)] Git commit ID = '5e6a628dc7e5d645d1fe9f24c0e66061e8ab2ad1' [Clang (LLVM based)] Job workspace = '/Users/buildslave/jenkins/workspace/lldb-cmake' [Clang (LLVM based)] Created blame requests for 1 files - invoking Git blame on agent for each of the requests [Clang (LLVM based)] -> blamed authors of issues in 1 files
[Pipeline] junit Recording test results [BFA] Scanning build for known causes... [Pipeline] emailext [BFA] Found failure cause(s): [BFA] Ninja target failed from category Compile [BFA] Regression test failed from category Test [BFA] Done. 0s Not sending mail to unregistered user martin@martin.st because your SCM claimed this was associated with a user ID ‘martin' which your security realm does not recognize; you may need changes in your SCM plugin Not sending mail to unregistered user martin@martin.st because your SCM claimed this was associated with a user ID ‘martin' which your security realm does not recognize; you may need changes in your SCM plugin

Hide Details

Begin Pre-Send Script... Sending email to: mschifer@apple.com Akira Hatanaka <ahatanaka@apple.com> Azhar Mohammed <azhar@apple.com>
> git rev-parse HEAD^{commit} # timeout=10 [Pipeline] } [Pipeline] // stage [Pipeline] } [Pipeline] // withEnv [Pipeline] } [Pipeline] // node [Pipeline] End of Pipeline ERROR: script returned exit code 1 Finished: FAILURE