FailedConsole Output

Skipping 7,920 KB.. Full Log
mon-Unit :: ./Sanitizer-x86_64-Test/FileSizes/SanitizerCommonFileTest.ReadFileToVector/1 (1197 of 2873)
PASS: SanitizerCommon-Unit :: ./Sanitizer-x86_64-Test/FileSizes/SanitizerCommonFileTest.ReadFileToVector/2 (1198 of 2873)
PASS: SanitizerCommon-Unit :: ./Sanitizer-x86_64-Test/FileSizes/SanitizerCommonFileTest.ReadFileToVector/3 (1199 of 2873)
PASS: SanitizerCommon-Unit :: ./Sanitizer-x86_64-Test/FileSizes/SanitizerCommonFileTest.ReadFileToVector/4 (1200 of 2873)
PASS: SanitizerCommon-Unit :: ./Sanitizer-x86_64-Test/FileSizes/SanitizerCommonFileTest.ReadFileToVector/5 (1201 of 2873)
PASS: SanitizerCommon-Unit :: ./Sanitizer-x86_64-Test/FileSizes/SanitizerCommonFileTest.ReadFileToVector/6 (1202 of 2873)
PASS: SanitizerCommon-Unit :: ./Sanitizer-x86_64-Test/FileSizes/SanitizerCommonFileTest.ReadFileToVector/7 (1203 of 2873)
PASS: SanitizerCommon-Unit :: ./Sanitizer-x86_64-Test/FileSizes/SanitizerCommonFileTest.ReadFileToVector/8 (1204 of 2873)
PASS: SanitizerCommon-Unit :: ./Sanitizer-x86_64-Test/FileSizes/SanitizerCommonFileTest.ReadFileToVectorHalf/0 (1205 of 2873)
PASS: SanitizerCommon-Unit :: ./Sanitizer-x86_64-Test/FileSizes/SanitizerCommonFileTest.ReadFileToVector/9 (1206 of 2873)
PASS: SanitizerCommon-Unit :: ./Sanitizer-x86_64-Test/FileSizes/SanitizerCommonFileTest.ReadFileToVectorHalf/1 (1207 of 2873)
PASS: SanitizerCommon-Unit :: ./Sanitizer-x86_64-Test/FileSizes/SanitizerCommonFileTest.ReadFileToVectorHalf/2 (1208 of 2873)
PASS: SanitizerCommon-Unit :: ./Sanitizer-x86_64-Test/FileSizes/SanitizerCommonFileTest.ReadFileToVectorHalf/3 (1209 of 2873)
PASS: SanitizerCommon-Unit :: ./Sanitizer-x86_64-Test/FileSizes/SanitizerCommonFileTest.ReadFileToVectorHalf/4 (1210 of 2873)
PASS: SanitizerCommon-Unit :: ./Sanitizer-x86_64-Test/FileSizes/SanitizerCommonFileTest.ReadFileToVectorHalf/5 (1211 of 2873)
PASS: SanitizerCommon-Unit :: ./Sanitizer-x86_64-Test/FileSizes/SanitizerCommonFileTest.ReadFileToVectorHalf/6 (1212 of 2873)
PASS: SanitizerCommon-Unit :: ./Sanitizer-x86_64-Test/FileSizes/SanitizerCommonFileTest.ReadFileToVectorHalf/7 (1213 of 2873)
PASS: SanitizerCommon-Unit :: ./Sanitizer-x86_64-Test/FileSizes/SanitizerCommonFileTest.ReadFileToVectorHalf/8 (1214 of 2873)
PASS: SanitizerCommon-Unit :: ./Sanitizer-x86_64-Test/MemoryMapping.LoadedModuleArchAndUUID (1215 of 2873)
PASS: SanitizerCommon-Unit :: ./Sanitizer-x86_64-Test/FileSizes/SanitizerCommonFileTest.ReadFileToVectorHalf/9 (1216 of 2873)
PASS: SanitizerCommon-Unit :: ./Sanitizer-x86_64-Test/MemoryMappingLayout.DumpListOfModules (1217 of 2873)
PASS: SanitizerCommon-Unit :: ./Sanitizer-x86_64-Test/Printf.Basic (1218 of 2873)
PASS: SanitizerCommon-Unit :: ./Sanitizer-x86_64-Test/Printf.MinMax (1219 of 2873)
PASS: SanitizerCommon-Unit :: ./Sanitizer-x86_64-Test/Printf.OverflowInt (1220 of 2873)
PASS: SanitizerCommon-Unit :: ./Sanitizer-x86_64-Test/Printf.OverflowPtr (1221 of 2873)
PASS: LeakSanitizer-Standalone-x86_64 :: TestCases/use_unaligned.cpp (1222 of 2873)
PASS: SanitizerCommon-Unit :: ./Sanitizer-x86_64-Test/Printf.OverflowStr (1223 of 2873)
PASS: SanitizerCommon-Unit :: ./Sanitizer-x86_64-Test/Printf.OverflowUint (1224 of 2873)
PASS: SanitizerCommon-Unit :: ./Sanitizer-x86_64-Test/Printf.Padding (1225 of 2873)
PASS: SanitizerCommon-Unit :: ./Sanitizer-x86_64-Test/Printf.Precision (1226 of 2873)
PASS: SanitizerCommon-Unit :: ./Sanitizer-x86_64-Test/RingBuffer.Construct (1227 of 2873)
PASS: SanitizerCommon-Unit :: ./Sanitizer-x86_64-Test/RingBuffer.LargeStruct (1228 of 2873)
PASS: SanitizerCommon-Unit :: ./Sanitizer-x86_64-Test/RingBuffer.int64 (1229 of 2873)
PASS: SanitizerCommon-Unit :: ./Sanitizer-x86_64-Test/SanitizerCommon.AllocatorLeakTest (1230 of 2873)
PASS: SanitizerCommon-Unit :: ./Sanitizer-x86_64-Test/SanitizerCommon.AtomicCompareExchangeTest (1231 of 2873)
PASS: SanitizerCommon-Unit :: ./Sanitizer-x86_64-Test/SanitizerCommon.AtomicStoreLoad (1232 of 2873)
PASS: SanitizerCommon-Unit :: ./Sanitizer-x86_64-Test/SanitizerCommon.BasicBitVector (1233 of 2873)
PASS: SanitizerCommon-Unit :: ./Sanitizer-x86_64-Test/SanitizerCommon.BooleanFlags (1234 of 2873)
PASS: SanitizerCommon-Unit :: ./Sanitizer-x86_64-Test/SanitizerCommon.BlockingMutex (1235 of 2873)
PASS: LeakSanitizer-Standalone-x86_64 :: TestCases/leak_check_at_exit.cpp (1236 of 2873)
PASS: SanitizerCommon-Unit :: ./Sanitizer-x86_64-Test/SanitizerCommon.CombinedAllocator64 (1237 of 2873)
PASS: SanitizerCommon-Unit :: ./Sanitizer-x86_64-Test/SanitizerCommon.CombinedAllocator64Compact (1238 of 2873)
PASS: SanitizerCommon-Unit :: ./Sanitizer-x86_64-Test/SanitizerCommon.CombinedAllocator64Dynamic (1239 of 2873)
PASS: Profile-x86_64 :: instrprof-value-prof.test (1240 of 2873)
PASS: SanitizerCommon-Unit :: ./Sanitizer-x86_64-Test/SanitizerCommon.CombinedAllocator64VeryCompact (1241 of 2873)
PASS: SanitizerCommon-Unit :: ./Sanitizer-x86_64-Test/SanitizerCommon.CommonFlags (1242 of 2873)
PASS: SanitizerCommon-Unit :: ./Sanitizer-x86_64-Test/SanitizerCommon.CommonSuffixFlags (1243 of 2873)
PASS: SanitizerCommon-Unit :: ./Sanitizer-x86_64-Test/SanitizerCommon.CompactSizeClassMap (1244 of 2873)
PASS: SanitizerCommon-Unit :: ./Sanitizer-x86_64-Test/SanitizerCommon.Conditional (1245 of 2873)
PASS: SanitizerCommon-Unit :: ./Sanitizer-x86_64-Test/SanitizerCommon.DefaultSizeClassMap (1246 of 2873)
PASS: SanitizerCommon-Unit :: ./Sanitizer-x86_64-Test/SanitizerCommon.DenseSizeClassMap (1247 of 2873)
PASS: SanitizerCommon-Unit :: ./Sanitizer-x86_64-Test/SanitizerCommon.FileOps (1248 of 2873)
PASS: SanitizerCommon-Unit :: ./Sanitizer-x86_64-Test/SanitizerCommon.GetRandom (1249 of 2873)
PASS: SanitizerCommon-Unit :: ./Sanitizer-x86_64-Test/SanitizerCommon.HandleSignalMode (1250 of 2873)
PASS: SanitizerCommon-Unit :: ./Sanitizer-x86_64-Test/SanitizerCommon.IntFlags (1251 of 2873)
PASS: SanitizerCommon-Unit :: ./Sanitizer-x86_64-Test/SanitizerCommon.InternalLowerBound (1252 of 2873)
PASS: SanitizerCommon-Unit :: ./Sanitizer-x86_64-Test/SanitizerCommon.InternalLowerBoundVsStdLowerBound (1253 of 2873)
PASS: SanitizerCommon-Unit :: ./Sanitizer-x86_64-Test/SanitizerCommon.InternalMemmoveRegression (1254 of 2873)
PASS: SanitizerCommon-Unit :: ./Sanitizer-x86_64-Test/SanitizerCommon.InternalMmapVector (1255 of 2873)
PASS: SanitizerCommon-Unit :: ./Sanitizer-x86_64-Test/SanitizerCommon.InternalMmapVectorEq (1256 of 2873)
PASS: SanitizerCommon-Unit :: ./Sanitizer-x86_64-Test/SanitizerCommon.InternalMmapVectorReize (1257 of 2873)
PASS: SanitizerCommon-Unit :: ./Sanitizer-x86_64-Test/SanitizerCommon.InternalMmapVectorRoundUpCapacity (1258 of 2873)
PASS: SanitizerCommon-Unit :: ./Sanitizer-x86_64-Test/SanitizerCommon.InternalMmapVectorSwap (1259 of 2873)
PASS: SanitizerCommon-Unit :: ./Sanitizer-x86_64-Test/SanitizerCommon.InternalScopedString (1260 of 2873)
PASS: SanitizerCommon-Unit :: ./Sanitizer-x86_64-Test/SanitizerCommon.InternalSizeClassMap (1261 of 2873)
PASS: SanitizerCommon-Unit :: ./Sanitizer-x86_64-Test/SanitizerCommon.InternalStrFunctions (1262 of 2873)
PASS: SanitizerCommon-Unit :: ./Sanitizer-x86_64-Test/SanitizerCommon.IntrusiveList (1263 of 2873)
PASS: SanitizerCommon-Unit :: ./Sanitizer-x86_64-Test/SanitizerCommon.IntrusiveListAppendEmpty (1264 of 2873)
PASS: SanitizerCommon-Unit :: ./Sanitizer-x86_64-Test/SanitizerCommon.IsAccessibleMemoryRange (1265 of 2873)
PASS: SanitizerCommon-Unit :: ./Sanitizer-x86_64-Test/SanitizerCommon.IsSame (1266 of 2873)
PASS: AddressSanitizer-x86_64-darwin :: TestCases/use-after-scope-types.cpp (1267 of 2873)
PASS: SanitizerCommon-Unit :: ./Sanitizer-x86_64-Test/SanitizerCommon.LargeMmapAllocatorBlockBegin (1268 of 2873)
PASS: SanitizerCommon-Unit :: ./Sanitizer-x86_64-Test/SanitizerCommon.LargeMmapAllocatorIteration (1269 of 2873)
PASS: SanitizerCommon-Unit :: ./Sanitizer-x86_64-Test/SanitizerCommon.LargeMmapAllocatorMapUnmapCallback (1270 of 2873)
PASS: SanitizerCommon-Unit :: ./Sanitizer-x86_64-Test/SanitizerCommon.LongLongIntFlags (1271 of 2873)
PASS: SanitizerCommon-Unit :: ./Sanitizer-x86_64-Test/SanitizerCommon.MmapAlignedOrDieOnFatalError (1272 of 2873)
PASS: SanitizerCommon-Unit :: ./Sanitizer-x86_64-Test/SanitizerCommon.MultipleFlags (1273 of 2873)
PASS: SanitizerCommon-Unit :: ./Sanitizer-x86_64-Test/SanitizerCommon.PthreadDestructorIterations (1274 of 2873)
PASS: SanitizerCommon-Unit :: ./Sanitizer-x86_64-Test/SanitizerCommon.QuarantineBatchMerge (1275 of 2873)
PASS: SanitizerCommon-Unit :: ./Sanitizer-x86_64-Test/SanitizerCommon.QuarantineCacheMergeBatchesALotOfBatches (1276 of 2873)
PASS: SanitizerCommon-Unit :: ./Sanitizer-x86_64-Test/SanitizerCommon.QuarantineCacheMergeBatchesEmpty (1277 of 2873)
PASS: SanitizerCommon-Unit :: ./Sanitizer-x86_64-Test/SanitizerCommon.QuarantineCacheMergeBatchesOneBatch (1278 of 2873)
PASS: SanitizerCommon-Unit :: ./Sanitizer-x86_64-Test/SanitizerCommon.QuarantineCacheMergeBatchesSmallBatches (1279 of 2873)
PASS: SanitizerCommon-Unit :: ./Sanitizer-x86_64-Test/SanitizerCommon.QuarantineCacheMergeBatchesTooBigToMerge (1280 of 2873)
PASS: SanitizerCommon-Unit :: ./Sanitizer-x86_64-Test/SanitizerCommon.ReadBinaryNameCached (1281 of 2873)
PASS: SanitizerCommon-Unit :: ./Sanitizer-x86_64-Test/SanitizerCommon.RemoveANSIEscapeSequencesFromString (1282 of 2873)
PASS: SanitizerCommon-Unit :: ./Sanitizer-x86_64-Test/SanitizerCommon.ReservedAddressRangeInit (1283 of 2873)
PASS: SanitizerCommon-Unit :: ./Sanitizer-x86_64-Test/SanitizerCommon.ReservedAddressRangeMap (1284 of 2873)
PASS: SanitizerCommon-Unit :: ./Sanitizer-x86_64-Test/SanitizerCommon.ReservedAddressRangeUnmap (1285 of 2873)
PASS: SanitizerCommon-Unit :: ./Sanitizer-x86_64-Test/SanitizerCommon.LargeMmapAllocator (1286 of 2873)
PASS: SanitizerCommon-Unit :: ./Sanitizer-x86_64-Test/SanitizerCommon.SizeClassAllocator32CompactGetBlockBegin (1287 of 2873)
PASS: SanitizerCommon-Unit :: ./Sanitizer-x86_64-Test/SanitizerCommon.SizeClassAllocator32Compact (1288 of 2873)
PASS: SanitizerCommon-Unit :: ./Sanitizer-x86_64-Test/SanitizerCommon.SizeClassAllocator32CompactMetadataStress (1289 of 2873)
PASS: SanitizerCommon-Unit :: ./Sanitizer-x86_64-Test/SanitizerCommon.SizeClassAllocator32Iteration (1290 of 2873)
PASS: SanitizerCommon-Unit :: ./Sanitizer-x86_64-Test/SanitizerCommon.SizeClassAllocator32MapUnmapCallback (1291 of 2873)
PASS: SanitizerCommon-Unit :: ./Sanitizer-x86_64-Test/SanitizerCommon.SizeClassAllocator32SeparateBatches (1292 of 2873)
PASS: SanitizerCommon-Unit :: ./Sanitizer-x86_64-Test/SanitizerCommon.SizeClassAllocator32CompactLocalCache (1293 of 2873)
PASS: SanitizerCommon-Unit :: ./Sanitizer-x86_64-Test/SanitizerCommon.SizeClassAllocator64 (1294 of 2873)
PASS: SanitizerCommon-Unit :: ./Sanitizer-x86_64-Test/SanitizerCommon.SizeClassAllocator64CompactGetBlockBegin (1295 of 2873)
PASS: SanitizerCommon-Unit :: ./Sanitizer-x86_64-Test/SanitizerCommon.SizeClassAllocator64CompactLocalCache (1296 of 2873)
PASS: SanitizerCommon-Unit :: ./Sanitizer-x86_64-Test/SanitizerCommon.SizeClassAllocator64Compact (1297 of 2873)
PASS: SanitizerCommon-Unit :: ./Sanitizer-x86_64-Test/SanitizerCommon.SizeClassAllocator64CompactReleaseFreeMemoryToOS (1298 of 2873)
PASS: SanitizerCommon-Unit :: ./Sanitizer-x86_64-Test/SanitizerCommon.SizeClassAllocator64CompactMetadataStress (1299 of 2873)
PASS: SanitizerCommon-Unit :: ./Sanitizer-x86_64-Test/SanitizerCommon.SizeClassAllocator64Dense (1300 of 2873)
PASS: SanitizerCommon-Unit :: ./Sanitizer-x86_64-Test/SanitizerCommon.SizeClassAllocator64DynamicGetBlockBegin (1301 of 2873)
PASS: SanitizerCommon-Unit :: ./Sanitizer-x86_64-Test/SanitizerCommon.SizeClassAllocator64DynamicIteration (1302 of 2873)
PASS: SanitizerCommon-Unit :: ./Sanitizer-x86_64-Test/SanitizerCommon.SizeClassAllocator64Dynamic (1303 of 2873)
PASS: SanitizerCommon-Unit :: ./Sanitizer-x86_64-Test/SanitizerCommon.SizeClassAllocator64DynamicLocalCache (1304 of 2873)
PASS: SanitizerCommon-Unit :: ./Sanitizer-x86_64-Test/SanitizerCommon.SizeClassAllocator64FreePagesRangeTracker (1305 of 2873)
PASS: SanitizerCommon-Unit :: ./Sanitizer-x86_64-Test/SanitizerCommon.CombinedAllocator32Compact (1306 of 2873)
PASS: SanitizerCommon-Unit :: ./Sanitizer-x86_64-Test/SanitizerCommon.SizeClassAllocator64Iteration (1307 of 2873)
PASS: Profile-x86_64 :: Posix/instrprof-value-prof-shared.test (1308 of 2873)
PASS: SanitizerCommon-Unit :: ./Sanitizer-x86_64-Test/SanitizerCommon.SizeClassAllocator64LocalCache (1309 of 2873)
PASS: SanitizerCommon-Unit :: ./Sanitizer-x86_64-Test/SanitizerCommon.SizeClassAllocator64MapUnmapCallback (1310 of 2873)
PASS: SanitizerCommon-Unit :: ./Sanitizer-x86_64-Test/SanitizerCommon.SizeClassAllocator64GetBlockBegin (1311 of 2873)
PASS: SanitizerCommon-Unit :: ./Sanitizer-x86_64-Test/SanitizerCommon.SizeClassAllocator64Overflow (1312 of 2873)
PASS: SanitizerCommon-Unit :: ./Sanitizer-x86_64-Test/SanitizerCommon.SizeClassAllocator64PackedCounterArray (1313 of 2873)
PASS: SanitizerCommon-Unit :: ./Sanitizer-x86_64-Test/SanitizerCommon.SizeClassAllocator64PopulateFreeListOOM (1314 of 2873)
PASS: SanitizerCommon-Unit :: ./Sanitizer-x86_64-Test/SanitizerCommon.SizeClassAllocator64DynamicMetadataStress (1315 of 2873)
PASS: SanitizerCommon-Unit :: ./Sanitizer-x86_64-Test/SanitizerCommon.SizeClassAllocator64ReleaseFreeMemoryToOS (1316 of 2873)
PASS: SanitizerCommon-Unit :: ./Sanitizer-x86_64-Test/SanitizerCommon.SizeClassAllocator64VeryCompactGetBlockBegin (1317 of 2873)
PASS: SanitizerCommon-Unit :: ./Sanitizer-x86_64-Test/SanitizerCommon.SizeClassAllocator64VeryCompactLocalCache (1318 of 2873)
PASS: SanitizerCommon-Unit :: ./Sanitizer-x86_64-Test/SanitizerCommon.SizeClassAllocator64MetadataStress (1319 of 2873)
PASS: SanitizerCommon-Unit :: ./Sanitizer-x86_64-Test/SanitizerCommon.SortTest (1320 of 2873)
PASS: SanitizerCommon-Unit :: ./Sanitizer-x86_64-Test/SanitizerCommon.SizeClassAllocator64VeryCompactReleaseFreeMemoryToOS (1321 of 2873)
PASS: SanitizerCommon-Unit :: ./Sanitizer-x86_64-Test/SanitizerCommon.SpinMutex (1322 of 2873)
PASS: SanitizerCommon-Unit :: ./Sanitizer-x86_64-Test/SanitizerCommon.StackDepotAbsent (1323 of 2873)
PASS: SanitizerCommon-Unit :: ./Sanitizer-x86_64-Test/SanitizerCommon.StackDepotBasic (1324 of 2873)
PASS: SanitizerCommon-Unit :: ./Sanitizer-x86_64-Test/SanitizerCommon.SpinMutexTry (1325 of 2873)
PASS: SanitizerCommon-Unit :: ./Sanitizer-x86_64-Test/SanitizerCommon.StackDepotEmptyStack (1326 of 2873)
PASS: SanitizerCommon-Unit :: ./Sanitizer-x86_64-Test/SanitizerCommon.StackDepotReverseMap (1327 of 2873)
PASS: SanitizerCommon-Unit :: ./Sanitizer-x86_64-Test/SanitizerCommon.StackDepotSame (1328 of 2873)
PASS: SanitizerCommon-Unit :: ./Sanitizer-x86_64-Test/SanitizerCommon.StackDepotSeveral (1329 of 2873)
PASS: SanitizerCommon-Unit :: ./Sanitizer-x86_64-Test/SanitizerCommon.StackDepotZeroId (1330 of 2873)
PASS: SanitizerCommon-Unit :: ./Sanitizer-x86_64-Test/SanitizerCommon.StrFlags (1331 of 2873)
PASS: SanitizerCommon-Unit :: ./Sanitizer-x86_64-Test/SanitizerCommon.StripPathPrefix (1332 of 2873)
PASS: SanitizerCommon-Unit :: ./Sanitizer-x86_64-Test/SanitizerCommon.ThreadRegistryTest (1333 of 2873)
PASS: SanitizerCommon-Unit :: ./Sanitizer-x86_64-Test/SanitizerCommon.ThreadRegistryThreadedTest (1334 of 2873)
PASS: SanitizerCommon-Unit :: ./Sanitizer-x86_64-Test/SanitizerCommon.ThreadStackTlsMain (1335 of 2873)
PASS: SanitizerCommon-Unit :: ./Sanitizer-x86_64-Test/SanitizerCommon.ThreadStackTlsWorker (1336 of 2873)
PASS: SanitizerCommon-Unit :: ./Sanitizer-x86_64-Test/SanitizerCommon.ThreadedTwoLevelByteMap (1337 of 2873)
PASS: SanitizerCommon-Unit :: ./Sanitizer-x86_64-Test/SanitizerCommon.TwoLevelByteMap (1338 of 2873)
PASS: SanitizerCommon-Unit :: ./Sanitizer-x86_64-Test/SanitizerCommon.VeryCompactSizeClassMap (1339 of 2873)
PASS: SanitizerCommon-Unit :: ./Sanitizer-x86_64-Test/SanitizerCommon.mem_is_zero (1340 of 2873)
PASS: SanitizerCommon-Unit :: ./Sanitizer-x86_64-Test/SanitizerCommonInterceptors.Printf (1341 of 2873)
PASS: SanitizerCommon-Unit :: ./Sanitizer-x86_64-Test/SanitizerCommonInterceptors.Scanf (1342 of 2873)
PASS: SanitizerCommon-Unit :: ./Sanitizer-x86_64-Test/SanitizerStacktracePrinter.RenderFrame (1343 of 2873)
PASS: SanitizerCommon-Unit :: ./Sanitizer-x86_64-Test/SanitizerStacktracePrinter.RenderModuleLocation (1344 of 2873)
PASS: SanitizerCommon-Unit :: ./Sanitizer-x86_64-Test/SanitizerStacktracePrinter.RenderSourceLocation (1345 of 2873)
PASS: SanitizerCommon-Unit :: ./Sanitizer-x86_64-Test/SlowUnwindTest.ShortStackTrace (1346 of 2873)
PASS: SanitizerCommon-Unit :: ./Sanitizer-x86_64-Test/SuppressionContextTest.HasSuppressionType (1347 of 2873)
PASS: SanitizerCommon-Unit :: ./Sanitizer-x86_64-Test/SanitizerCommon.SizeClassAllocator64VeryCompact (1348 of 2873)
PASS: SanitizerCommon-Unit :: ./Sanitizer-x86_64-Test/SuppressionContextTest.Parse (1349 of 2873)
PASS: SanitizerCommon-Unit :: ./Sanitizer-x86_64-Test/SuppressionContextTest.Parse2 (1350 of 2873)
PASS: SanitizerCommon-Unit :: ./Sanitizer-x86_64-Test/SuppressionContextTest.Parse3 (1351 of 2873)
PASS: SanitizerCommon-Unit :: ./Sanitizer-x86_64-Test/SuppressionContextTest.ParseType (1352 of 2873)
PASS: SanitizerCommon-Unit :: ./Sanitizer-x86_64-Test/Suppressions.Match (1353 of 2873)
PASS: SanitizerCommon-Unit :: ./Sanitizer-x86_64-Test/SuppressionContextTest.RegressionTestForBufferOverflowInSuppressions (1354 of 2873)
PASS: SanitizerCommon-Unit :: ./Sanitizer-x86_64-Test/Symbolizer.DemangleSwiftAndCXX (1355 of 2873)
PASS: SanitizerCommon-Unit :: ./Sanitizer-x86_64-Test/Symbolizer.ExtractInt (1356 of 2873)
PASS: SanitizerCommon-Unit :: ./Sanitizer-x86_64-Test/Symbolizer.ExtractToken (1357 of 2873)
PASS: SanitizerCommon-Unit :: ./Sanitizer-x86_64-Test/Symbolizer.ExtractTokenUpToDelimiter (1358 of 2873)
PASS: SanitizerCommon-Unit :: ./Sanitizer-x86_64-Test/Symbolizer.ExtractUptr (1359 of 2873)
PASS: SanitizerCommon-Unit :: ./Sanitizer-x86_64-Test/Vector.Basic (1360 of 2873)
PASS: SanitizerCommon-Unit :: ./Sanitizer-x86_64-Test/Vector.ResizeReduction (1361 of 2873)
PASS: SanitizerCommon-Unit :: ./Sanitizer-x86_64-Test/Vector.Stride (1362 of 2873)
PASS: SanitizerCommon-asan-x86_64-Darwin :: Darwin/fputs_puts_null.cpp (1363 of 2873)
PASS: SanitizerCommon-Unit :: ./Sanitizer-x86_64-Test/SanitizerCommon.TwoLevelBitVector (1364 of 2873)
PASS: SanitizerCommon-asan-x86_64-Darwin :: Darwin/malloc_zone.cpp (1365 of 2873)
UNSUPPORTED: SanitizerCommon-asan-x86_64-Darwin :: FreeBSD/capsicum.cpp (1366 of 2873)
UNSUPPORTED: SanitizerCommon-asan-x86_64-Darwin :: FreeBSD/fdevname.cpp (1367 of 2873)
UNSUPPORTED: SanitizerCommon-asan-x86_64-Darwin :: Linux/abort_on_error.cpp (1368 of 2873)
UNSUPPORTED: SanitizerCommon-asan-x86_64-Darwin :: Linux/aligned_alloc-alignment.cpp (1369 of 2873)
UNSUPPORTED: SanitizerCommon-asan-x86_64-Darwin :: Linux/aligned_alloc.c (1370 of 2873)
UNSUPPORTED: SanitizerCommon-asan-x86_64-Darwin :: Linux/allow_user_segv.cpp (1371 of 2873)
UNSUPPORTED: SanitizerCommon-asan-x86_64-Darwin :: Linux/assert.cpp (1372 of 2873)
UNSUPPORTED: SanitizerCommon-asan-x86_64-Darwin :: Linux/clock_gettime.c (1373 of 2873)
UNSUPPORTED: SanitizerCommon-asan-x86_64-Darwin :: Linux/closedir.c (1374 of 2873)
UNSUPPORTED: SanitizerCommon-asan-x86_64-Darwin :: Linux/decorate_proc_maps.cpp (1375 of 2873)
UNSUPPORTED: SanitizerCommon-asan-x86_64-Darwin :: Linux/deepbind.cpp (1376 of 2873)
UNSUPPORTED: SanitizerCommon-asan-x86_64-Darwin :: Linux/getpwnam_r_invalid_user.cpp (1377 of 2873)
UNSUPPORTED: SanitizerCommon-asan-x86_64-Darwin :: Linux/getrandom.cpp (1378 of 2873)
UNSUPPORTED: SanitizerCommon-asan-x86_64-Darwin :: Linux/iconv_test.c (1379 of 2873)
UNSUPPORTED: SanitizerCommon-asan-x86_64-Darwin :: Linux/ill.cpp (1380 of 2873)
UNSUPPORTED: SanitizerCommon-asan-x86_64-Darwin :: Linux/mallopt.cpp (1381 of 2873)
UNSUPPORTED: SanitizerCommon-asan-x86_64-Darwin :: Linux/mlock_test.cpp (1382 of 2873)
UNSUPPORTED: SanitizerCommon-asan-x86_64-Darwin :: Linux/mmap64_test.c (1383 of 2873)
UNSUPPORTED: SanitizerCommon-asan-x86_64-Darwin :: Linux/mmap_write_exec.cpp (1384 of 2873)
UNSUPPORTED: SanitizerCommon-asan-x86_64-Darwin :: Linux/mprobe.cpp (1385 of 2873)
UNSUPPORTED: SanitizerCommon-asan-x86_64-Darwin :: Linux/name_to_handle_at.cpp (1386 of 2873)
UNSUPPORTED: SanitizerCommon-asan-x86_64-Darwin :: Linux/new_delete_test.cpp (1387 of 2873)
UNSUPPORTED: SanitizerCommon-asan-x86_64-Darwin :: Linux/open_memstream.cpp (1388 of 2873)
UNSUPPORTED: SanitizerCommon-asan-x86_64-Darwin :: Linux/pthread_mutex.cpp (1389 of 2873)
UNSUPPORTED: SanitizerCommon-asan-x86_64-Darwin :: Linux/ptrace.cpp (1390 of 2873)
UNSUPPORTED: SanitizerCommon-asan-x86_64-Darwin :: Linux/pvalloc-overflow.cpp (1391 of 2873)
UNSUPPORTED: SanitizerCommon-asan-x86_64-Darwin :: Linux/recv_msg_trunc.cpp (1392 of 2873)
UNSUPPORTED: SanitizerCommon-asan-x86_64-Darwin :: Linux/sched_getparam.cpp (1393 of 2873)
UNSUPPORTED: SanitizerCommon-asan-x86_64-Darwin :: Linux/sem_init_glibc.cpp (1394 of 2873)
UNSUPPORTED: SanitizerCommon-asan-x86_64-Darwin :: Linux/signal_segv_handler.cpp (1395 of 2873)
UNSUPPORTED: SanitizerCommon-asan-x86_64-Darwin :: Linux/soft_rss_limit_mb_test.cpp (1396 of 2873)
UNSUPPORTED: SanitizerCommon-asan-x86_64-Darwin :: Linux/sysconf_interceptor_bypass_test.cpp (1397 of 2873)
UNSUPPORTED: SanitizerCommon-asan-x86_64-Darwin :: Linux/timerfd.cpp (1398 of 2873)
UNSUPPORTED: SanitizerCommon-asan-x86_64-Darwin :: Linux/unexpected_format_specifier_test.cpp (1399 of 2873)
UNSUPPORTED: SanitizerCommon-asan-x86_64-Darwin :: NetBSD/asysctl.cpp (1400 of 2873)
UNSUPPORTED: SanitizerCommon-asan-x86_64-Darwin :: NetBSD/cdb.cpp (1401 of 2873)
UNSUPPORTED: SanitizerCommon-asan-x86_64-Darwin :: NetBSD/faccessat.cpp (1402 of 2873)
UNSUPPORTED: SanitizerCommon-asan-x86_64-Darwin :: NetBSD/fparseln.cpp (1403 of 2873)
UNSUPPORTED: SanitizerCommon-asan-x86_64-Darwin :: NetBSD/funopen2.cpp (1404 of 2873)
UNSUPPORTED: SanitizerCommon-asan-x86_64-Darwin :: NetBSD/getgrouplist.cpp (1405 of 2873)
UNSUPPORTED: SanitizerCommon-asan-x86_64-Darwin :: NetBSD/getgroupmembership.cpp (1406 of 2873)
UNSUPPORTED: SanitizerCommon-asan-x86_64-Darwin :: NetBSD/getvfsstat.cpp (1407 of 2873)
UNSUPPORTED: SanitizerCommon-asan-x86_64-Darwin :: NetBSD/gid_from_group.cpp (1408 of 2873)
UNSUPPORTED: SanitizerCommon-asan-x86_64-Darwin :: NetBSD/group_from_gid.cpp (1409 of 2873)
UNSUPPORTED: SanitizerCommon-asan-x86_64-Darwin :: NetBSD/md2.cpp (1410 of 2873)
UNSUPPORTED: SanitizerCommon-asan-x86_64-Darwin :: NetBSD/md4.cpp (1411 of 2873)
UNSUPPORTED: SanitizerCommon-asan-x86_64-Darwin :: NetBSD/md5.cpp (1412 of 2873)
UNSUPPORTED: SanitizerCommon-asan-x86_64-Darwin :: NetBSD/mi_vector_hash.cpp (1413 of 2873)
UNSUPPORTED: SanitizerCommon-asan-x86_64-Darwin :: NetBSD/netent.cpp (1414 of 2873)
UNSUPPORTED: SanitizerCommon-asan-x86_64-Darwin :: NetBSD/paccept.cpp (1415 of 2873)
UNSUPPORTED: SanitizerCommon-asan-x86_64-Darwin :: NetBSD/protoent.cpp (1416 of 2873)
UNSUPPORTED: SanitizerCommon-asan-x86_64-Darwin :: NetBSD/rmd160.cpp (1417 of 2873)
UNSUPPORTED: SanitizerCommon-asan-x86_64-Darwin :: NetBSD/sha1.cpp (1418 of 2873)
UNSUPPORTED: SanitizerCommon-asan-x86_64-Darwin :: NetBSD/sha2.cpp (1419 of 2873)
UNSUPPORTED: SanitizerCommon-asan-x86_64-Darwin :: NetBSD/statvfs1.cpp (1420 of 2873)
UNSUPPORTED: SanitizerCommon-asan-x86_64-Darwin :: NetBSD/strmode.cpp (1421 of 2873)
UNSUPPORTED: SanitizerCommon-asan-x86_64-Darwin :: NetBSD/strtoi.cpp (1422 of 2873)
UNSUPPORTED: SanitizerCommon-asan-x86_64-Darwin :: NetBSD/sysctlgetmibinfo.cpp (1423 of 2873)
UNSUPPORTED: SanitizerCommon-asan-x86_64-Darwin :: NetBSD/ttyent.cpp (1424 of 2873)
UNSUPPORTED: SanitizerCommon-asan-x86_64-Darwin :: NetBSD/uid_from_user.cpp (1425 of 2873)
UNSUPPORTED: SanitizerCommon-asan-x86_64-Darwin :: NetBSD/user_from_uid.cpp (1426 of 2873)
PASS: SanitizerCommon-asan-x86_64-Darwin :: Posix/access.cpp (1427 of 2873)
PASS: SanitizerCommon-asan-x86_64-Darwin :: Posix/arc4random.cpp (1428 of 2873)
PASS: SanitizerCommon-asan-x86_64-Darwin :: Darwin/abort_on_error.cpp (1429 of 2873)
PASS: SanitizerCommon-asan-x86_64-Darwin :: Posix/devname.cpp (1430 of 2873)
PASS: SanitizerCommon-asan-x86_64-Darwin :: Darwin/print-stack-trace.cpp (1431 of 2873)
PASS: SanitizerCommon-asan-x86_64-Darwin :: Posix/devname_r.cpp (1432 of 2873)
UNSUPPORTED: SanitizerCommon-asan-x86_64-Darwin :: Posix/dump_registers.cpp (1433 of 2873)
PASS: SanitizerCommon-asan-x86_64-Darwin :: Posix/feof_fileno_ferror.cpp (1434 of 2873)
PASS: SanitizerCommon-asan-x86_64-Darwin :: Posix/fgetc_ungetc_getc.cpp (1435 of 2873)
PASS: SanitizerCommon-asan-x86_64-Darwin :: Posix/fgetln.cpp (1436 of 2873)
PASS: SanitizerCommon-asan-x86_64-Darwin :: Posix/fgets.cpp (1437 of 2873)
PASS: SanitizerCommon-asan-x86_64-Darwin :: Posix/dump_instruction_bytes.cpp (1438 of 2873)
PASS: SanitizerCommon-asan-x86_64-Darwin :: Posix/fputc_putc_putchar.cpp (1439 of 2873)
PASS: SanitizerCommon-asan-x86_64-Darwin :: Posix/fputs_puts.cpp (1440 of 2873)
UNSUPPORTED: SanitizerCommon-asan-x86_64-Darwin :: Posix/fseek.cpp (1441 of 2873)
UNSUPPORTED: SanitizerCommon-asan-x86_64-Darwin :: Posix/fts.cpp (1442 of 2873)
UNSUPPORTED: SanitizerCommon-asan-x86_64-Darwin :: Posix/funopen.cpp (1443 of 2873)
PASS: SanitizerCommon-asan-x86_64-Darwin :: Posix/getc_unlocked.cpp (1444 of 2873)
UNSUPPORTED: SanitizerCommon-asan-x86_64-Darwin :: Posix/getfsent.cpp (1445 of 2873)
PASS: SanitizerCommon-asan-x86_64-Darwin :: Posix/getmntinfo.cpp (1446 of 2873)
PASS: SanitizerCommon-asan-x86_64-Darwin :: Posix/getpass.cpp (1447 of 2873)
PASS: SanitizerCommon-asan-x86_64-Darwin :: Posix/fpe.cpp (1448 of 2873)
PASS: SanitizerCommon-asan-x86_64-Darwin :: Posix/dedup_token_length_test.cpp (1449 of 2873)
PASS: SanitizerCommon-asan-x86_64-Darwin :: Posix/getusershell.cpp (1450 of 2873)
PASS: SanitizerCommon-asan-x86_64-Darwin :: Posix/getpw_getgr.cpp (1451 of 2873)
PASS: SanitizerCommon-asan-x86_64-Darwin :: Posix/lstat.cpp (1452 of 2873)
PASS: SanitizerCommon-asan-x86_64-Darwin :: Posix/mmap_test.c (1453 of 2873)
UNSUPPORTED: SanitizerCommon-asan-x86_64-Darwin :: Posix/nl_langinfo.cpp (1454 of 2873)
PASS: SanitizerCommon-asan-x86_64-Darwin :: Posix/popen.cpp (1455 of 2873)
PASS: SanitizerCommon-asan-x86_64-Darwin :: Posix/illegal_read_test.cpp (1456 of 2873)
PASS: SanitizerCommon-asan-x86_64-Darwin :: Posix/illegal_write_test.cpp (1457 of 2873)
PASS: SanitizerCommon-asan-x86_64-Darwin :: Posix/putc_putchar_unlocked.cpp (1458 of 2873)
PASS: SanitizerCommon-asan-x86_64-Darwin :: Posix/readlink.c (1459 of 2873)
UNSUPPORTED: SanitizerCommon-asan-x86_64-Darwin :: Posix/regex.cpp (1460 of 2873)
PASS: SanitizerCommon-asan-x86_64-Darwin :: Posix/readlinkat.c (1461 of 2873)
PASS: SanitizerCommon-asan-x86_64-Darwin :: Posix/sanitizer_set_death_callback_test.cpp (1462 of 2873)
PASS: SanitizerCommon-asan-x86_64-Darwin :: Posix/setvbuf.cpp (1463 of 2873)
UNSUPPORTED: SanitizerCommon-asan-x86_64-Darwin :: Posix/sl_add.cpp (1464 of 2873)
PASS: SanitizerCommon-asan-x86_64-Darwin :: Posix/strlcat.cpp (1465 of 2873)
PASS: SanitizerCommon-asan-x86_64-Darwin :: Posix/strlcpy.cpp (1466 of 2873)
UNSUPPORTED: SanitizerCommon-asan-x86_64-Darwin :: Posix/strtonum.cpp (1467 of 2873)
UNSUPPORTED: SanitizerCommon-asan-x86_64-Darwin :: Posix/strxfrm.c (1468 of 2873)
PASS: SanitizerCommon-asan-x86_64-Darwin :: Posix/sysctl.cpp (1469 of 2873)
UNSUPPORTED: SanitizerCommon-asan-x86_64-Darwin :: Posix/vis.cpp (1470 of 2873)
PASS: SanitizerCommon-asan-x86_64-Darwin :: Posix/wcsdup.c (1471 of 2873)
UNSUPPORTED: SanitizerCommon-asan-x86_64-Darwin :: Posix/wcsxfrm.c (1472 of 2873)
PASS: SanitizerCommon-asan-x86_64-Darwin :: Posix/weak_hook_test.cpp (1473 of 2873)
PASS: SanitizerCommon-asan-x86_64-Darwin :: Posix/sanitizer_set_report_fd_test.cpp (1474 of 2873)
PASS: SanitizerCommon-asan-x86_64-Darwin :: corelimit.cpp (1475 of 2873)
PASS: SanitizerCommon-asan-x86_64-Darwin :: ctype.c (1476 of 2873)
PASS: SanitizerCommon-asan-x86_64-Darwin :: fopen_nullptr.c (1477 of 2873)
PASS: SanitizerCommon-asan-x86_64-Darwin :: Posix/posix_memalign-alignment.cpp (1478 of 2873)
UNSUPPORTED: SanitizerCommon-asan-x86_64-Darwin :: hard_rss_limit_mb_test.cpp (1479 of 2873)
PASS: SanitizerCommon-asan-x86_64-Darwin :: malloc_hook.cpp (1480 of 2873)
PASS: SanitizerCommon-asan-x86_64-Darwin :: options-help.cpp (1481 of 2873)
PASS: SanitizerCommon-asan-x86_64-Darwin :: options-include.cpp (1482 of 2873)
PASS: SanitizerCommon-asan-x86_64-Darwin :: get_module_and_offset_for_pc.cpp (1483 of 2873)
UNSUPPORTED: SanitizerCommon-asan-x86_64-Darwin :: print-stack-trace.cpp (1484 of 2873)
PASS: SanitizerCommon-asan-x86_64-Darwin :: options-invalid.cpp (1485 of 2873)
PASS: SanitizerCommon-asan-x86_64-Darwin :: printf-ldbl.c (1486 of 2873)
UNSUPPORTED: SanitizerCommon-asan-x86_64-Darwin :: reallocarray-overflow.cpp (1487 of 2873)
PASS: SanitizerCommon-asan-x86_64-Darwin :: pthread_mutexattr_get.cpp (1488 of 2873)
PASS: SanitizerCommon-asan-x86_64-Darwin :: sanitizer_coverage_inline8bit_counter.cpp (1489 of 2873)
PASS: SanitizerCommon-asan-x86_64-Darwin :: sanitizer_coverage_no_prune.cpp (1490 of 2873)
UNSUPPORTED: SanitizerCommon-asan-x86_64-Darwin :: sanitizer_coverage_symbolize.cpp (1491 of 2873)
XFAIL: SanitizerCommon-asan-x86_64-Darwin :: sanitizer_coverage_trace_pc_guard-dso.cpp (1492 of 2873)
UNSUPPORTED: SanitizerCommon-asan-x86_64-Darwin :: sanitizer_coverage_trace_pc_guard-init.cpp (1493 of 2873)
PASS: SanitizerCommon-asan-x86_64-Darwin :: sanitizer_coverage_stack_depth.cpp (1494 of 2873)
PASS: SanitizerCommon-asan-x86_64-Darwin :: scanf-ldbl.c (1495 of 2873)
PASS: SanitizerCommon-asan-x86_64-Darwin :: sanitizer_coverage_trace_pc_guard.cpp (1496 of 2873)
PASS: SanitizerCommon-asan-x86_64-Darwin :: strcasestr.c (1497 of 2873)
PASS: SanitizerCommon-asan-x86_64-Darwin :: strcspn.c (1498 of 2873)
PASS: SanitizerCommon-asan-x86_64-Darwin :: strpbrk.c (1499 of 2873)
PASS: SanitizerCommon-asan-x86_64-Darwin :: strnlen.c (1500 of 2873)
PASS: SanitizerCommon-asan-x86_64-Darwin :: strstr.c (1501 of 2873)
PASS: SanitizerCommon-asan-x86_64-Darwin :: strspn.c (1502 of 2873)
PASS: SanitizerCommon-asan-x86_64-Darwin :: symbolize_pc.cpp (1503 of 2873)
XFAIL: SanitizerCommon-asan-x86_64-Darwin :: symbolize_pc_inline.cpp (1504 of 2873)
PASS: SanitizerCommon-asan-x86_64-Darwin :: wcrtomb.c (1505 of 2873)
PASS: SanitizerCommon-asan-x86_64-Darwin :: wctomb.c (1506 of 2873)
UNSUPPORTED: SanitizerCommon-lsan-x86_64-Darwin :: Darwin/abort_on_error.cpp (1507 of 2873)
PASS: SanitizerCommon-lsan-x86_64-Darwin :: Darwin/fputs_puts_null.cpp (1508 of 2873)
PASS: SanitizerCommon-lsan-x86_64-Darwin :: Darwin/malloc_zone.cpp (1509 of 2873)
PASS: SanitizerCommon-asan-x86_64-Darwin :: symbolize_stack.cpp (1510 of 2873)
UNSUPPORTED: SanitizerCommon-lsan-x86_64-Darwin :: FreeBSD/capsicum.cpp (1511 of 2873)
UNSUPPORTED: SanitizerCommon-lsan-x86_64-Darwin :: FreeBSD/fdevname.cpp (1512 of 2873)
UNSUPPORTED: SanitizerCommon-lsan-x86_64-Darwin :: Linux/abort_on_error.cpp (1513 of 2873)
UNSUPPORTED: SanitizerCommon-lsan-x86_64-Darwin :: Linux/aligned_alloc-alignment.cpp (1514 of 2873)
UNSUPPORTED: SanitizerCommon-lsan-x86_64-Darwin :: Linux/aligned_alloc.c (1515 of 2873)
UNSUPPORTED: SanitizerCommon-lsan-x86_64-Darwin :: Linux/allow_user_segv.cpp (1516 of 2873)
UNSUPPORTED: SanitizerCommon-lsan-x86_64-Darwin :: Linux/assert.cpp (1517 of 2873)
UNSUPPORTED: SanitizerCommon-lsan-x86_64-Darwin :: Linux/clock_gettime.c (1518 of 2873)
UNSUPPORTED: SanitizerCommon-lsan-x86_64-Darwin :: Linux/closedir.c (1519 of 2873)
UNSUPPORTED: SanitizerCommon-lsan-x86_64-Darwin :: Linux/decorate_proc_maps.cpp (1520 of 2873)
UNSUPPORTED: SanitizerCommon-lsan-x86_64-Darwin :: Linux/deepbind.cpp (1521 of 2873)
UNSUPPORTED: SanitizerCommon-lsan-x86_64-Darwin :: Linux/getpwnam_r_invalid_user.cpp (1522 of 2873)
UNSUPPORTED: SanitizerCommon-lsan-x86_64-Darwin :: Linux/getrandom.cpp (1523 of 2873)
UNSUPPORTED: SanitizerCommon-lsan-x86_64-Darwin :: Linux/iconv_test.c (1524 of 2873)
UNSUPPORTED: SanitizerCommon-lsan-x86_64-Darwin :: Linux/ill.cpp (1525 of 2873)
UNSUPPORTED: SanitizerCommon-lsan-x86_64-Darwin :: Linux/mallopt.cpp (1526 of 2873)
UNSUPPORTED: SanitizerCommon-lsan-x86_64-Darwin :: Linux/mlock_test.cpp (1527 of 2873)
UNSUPPORTED: SanitizerCommon-lsan-x86_64-Darwin :: Linux/mmap64_test.c (1528 of 2873)
UNSUPPORTED: SanitizerCommon-lsan-x86_64-Darwin :: Linux/mmap_write_exec.cpp (1529 of 2873)
UNSUPPORTED: SanitizerCommon-lsan-x86_64-Darwin :: Linux/mprobe.cpp (1530 of 2873)
UNSUPPORTED: SanitizerCommon-lsan-x86_64-Darwin :: Linux/name_to_handle_at.cpp (1531 of 2873)
UNSUPPORTED: SanitizerCommon-lsan-x86_64-Darwin :: Linux/new_delete_test.cpp (1532 of 2873)
UNSUPPORTED: SanitizerCommon-lsan-x86_64-Darwin :: Linux/open_memstream.cpp (1533 of 2873)
UNSUPPORTED: SanitizerCommon-lsan-x86_64-Darwin :: Linux/pthread_mutex.cpp (1534 of 2873)
UNSUPPORTED: SanitizerCommon-lsan-x86_64-Darwin :: Linux/ptrace.cpp (1535 of 2873)
UNSUPPORTED: SanitizerCommon-lsan-x86_64-Darwin :: Linux/pvalloc-overflow.cpp (1536 of 2873)
UNSUPPORTED: SanitizerCommon-lsan-x86_64-Darwin :: Linux/recv_msg_trunc.cpp (1537 of 2873)
UNSUPPORTED: SanitizerCommon-lsan-x86_64-Darwin :: Linux/sched_getparam.cpp (1538 of 2873)
UNSUPPORTED: SanitizerCommon-lsan-x86_64-Darwin :: Linux/sem_init_glibc.cpp (1539 of 2873)
UNSUPPORTED: SanitizerCommon-lsan-x86_64-Darwin :: Linux/signal_segv_handler.cpp (1540 of 2873)
UNSUPPORTED: SanitizerCommon-lsan-x86_64-Darwin :: Linux/soft_rss_limit_mb_test.cpp (1541 of 2873)
UNSUPPORTED: SanitizerCommon-lsan-x86_64-Darwin :: Linux/sysconf_interceptor_bypass_test.cpp (1542 of 2873)
UNSUPPORTED: SanitizerCommon-lsan-x86_64-Darwin :: Linux/timerfd.cpp (1543 of 2873)
UNSUPPORTED: SanitizerCommon-lsan-x86_64-Darwin :: Linux/unexpected_format_specifier_test.cpp (1544 of 2873)
UNSUPPORTED: SanitizerCommon-lsan-x86_64-Darwin :: NetBSD/asysctl.cpp (1545 of 2873)
UNSUPPORTED: SanitizerCommon-lsan-x86_64-Darwin :: NetBSD/cdb.cpp (1546 of 2873)
UNSUPPORTED: SanitizerCommon-lsan-x86_64-Darwin :: NetBSD/faccessat.cpp (1547 of 2873)
UNSUPPORTED: SanitizerCommon-lsan-x86_64-Darwin :: NetBSD/fparseln.cpp (1548 of 2873)
UNSUPPORTED: SanitizerCommon-lsan-x86_64-Darwin :: NetBSD/funopen2.cpp (1549 of 2873)
UNSUPPORTED: SanitizerCommon-lsan-x86_64-Darwin :: NetBSD/getgrouplist.cpp (1550 of 2873)
UNSUPPORTED: SanitizerCommon-lsan-x86_64-Darwin :: NetBSD/getgroupmembership.cpp (1551 of 2873)
UNSUPPORTED: SanitizerCommon-lsan-x86_64-Darwin :: NetBSD/getvfsstat.cpp (1552 of 2873)
UNSUPPORTED: SanitizerCommon-lsan-x86_64-Darwin :: NetBSD/gid_from_group.cpp (1553 of 2873)
UNSUPPORTED: SanitizerCommon-lsan-x86_64-Darwin :: NetBSD/group_from_gid.cpp (1554 of 2873)
UNSUPPORTED: SanitizerCommon-lsan-x86_64-Darwin :: NetBSD/md2.cpp (1555 of 2873)
UNSUPPORTED: SanitizerCommon-lsan-x86_64-Darwin :: NetBSD/md4.cpp (1556 of 2873)
UNSUPPORTED: SanitizerCommon-lsan-x86_64-Darwin :: NetBSD/md5.cpp (1557 of 2873)
UNSUPPORTED: SanitizerCommon-lsan-x86_64-Darwin :: NetBSD/mi_vector_hash.cpp (1558 of 2873)
UNSUPPORTED: SanitizerCommon-lsan-x86_64-Darwin :: NetBSD/netent.cpp (1559 of 2873)
UNSUPPORTED: SanitizerCommon-lsan-x86_64-Darwin :: NetBSD/paccept.cpp (1560 of 2873)
UNSUPPORTED: SanitizerCommon-lsan-x86_64-Darwin :: NetBSD/protoent.cpp (1561 of 2873)
UNSUPPORTED: SanitizerCommon-lsan-x86_64-Darwin :: NetBSD/rmd160.cpp (1562 of 2873)
UNSUPPORTED: SanitizerCommon-lsan-x86_64-Darwin :: NetBSD/sha1.cpp (1563 of 2873)
UNSUPPORTED: SanitizerCommon-lsan-x86_64-Darwin :: NetBSD/sha2.cpp (1564 of 2873)
UNSUPPORTED: SanitizerCommon-lsan-x86_64-Darwin :: NetBSD/statvfs1.cpp (1565 of 2873)
UNSUPPORTED: SanitizerCommon-lsan-x86_64-Darwin :: NetBSD/strmode.cpp (1566 of 2873)
UNSUPPORTED: SanitizerCommon-lsan-x86_64-Darwin :: NetBSD/strtoi.cpp (1567 of 2873)
UNSUPPORTED: SanitizerCommon-lsan-x86_64-Darwin :: NetBSD/sysctlgetmibinfo.cpp (1568 of 2873)
UNSUPPORTED: SanitizerCommon-lsan-x86_64-Darwin :: NetBSD/ttyent.cpp (1569 of 2873)
UNSUPPORTED: SanitizerCommon-lsan-x86_64-Darwin :: NetBSD/uid_from_user.cpp (1570 of 2873)
UNSUPPORTED: SanitizerCommon-lsan-x86_64-Darwin :: NetBSD/user_from_uid.cpp (1571 of 2873)
PASS: SanitizerCommon-lsan-x86_64-Darwin :: Posix/access.cpp (1572 of 2873)
PASS: SanitizerCommon-lsan-x86_64-Darwin :: Posix/arc4random.cpp (1573 of 2873)
PASS: SanitizerCommon-lsan-x86_64-Darwin :: Darwin/print-stack-trace.cpp (1574 of 2873)
PASS: SanitizerCommon-lsan-x86_64-Darwin :: Posix/devname.cpp (1575 of 2873)
PASS: SanitizerCommon-lsan-x86_64-Darwin :: Posix/devname_r.cpp (1576 of 2873)
PASS: SanitizerCommon-asan-x86_64-Darwin :: allocator_returns_null.cpp (1577 of 2873)
UNSUPPORTED: SanitizerCommon-lsan-x86_64-Darwin :: Posix/dump_registers.cpp (1578 of 2873)
PASS: SanitizerCommon-lsan-x86_64-Darwin :: Posix/feof_fileno_ferror.cpp (1579 of 2873)
PASS: SanitizerCommon-lsan-x86_64-Darwin :: Posix/fgetc_ungetc_getc.cpp (1580 of 2873)
PASS: SanitizerCommon-lsan-x86_64-Darwin :: Posix/fgetln.cpp (1581 of 2873)
PASS: SanitizerCommon-lsan-x86_64-Darwin :: Posix/fgets.cpp (1582 of 2873)
PASS: SanitizerCommon-lsan-x86_64-Darwin :: Posix/dump_instruction_bytes.cpp (1583 of 2873)
PASS: SanitizerCommon-lsan-x86_64-Darwin :: Posix/fputc_putc_putchar.cpp (1584 of 2873)
PASS: SanitizerCommon-lsan-x86_64-Darwin :: Posix/fputs_puts.cpp (1585 of 2873)
UNSUPPORTED: SanitizerCommon-lsan-x86_64-Darwin :: Posix/fseek.cpp (1586 of 2873)
UNSUPPORTED: SanitizerCommon-lsan-x86_64-Darwin :: Posix/fts.cpp (1587 of 2873)
UNSUPPORTED: SanitizerCommon-lsan-x86_64-Darwin :: Posix/funopen.cpp (1588 of 2873)
PASS: SanitizerCommon-lsan-x86_64-Darwin :: Posix/getc_unlocked.cpp (1589 of 2873)
UNSUPPORTED: SanitizerCommon-lsan-x86_64-Darwin :: Posix/getfsent.cpp (1590 of 2873)
PASS: SanitizerCommon-lsan-x86_64-Darwin :: Posix/getmntinfo.cpp (1591 of 2873)
PASS: SanitizerCommon-lsan-x86_64-Darwin :: Posix/dedup_token_length_test.cpp (1592 of 2873)
PASS: SanitizerCommon-lsan-x86_64-Darwin :: Posix/fpe.cpp (1593 of 2873)
PASS: SanitizerCommon-lsan-x86_64-Darwin :: Posix/getusershell.cpp (1594 of 2873)
PASS: SanitizerCommon-lsan-x86_64-Darwin :: Posix/getpw_getgr.cpp (1595 of 2873)
PASS: SanitizerCommon-lsan-x86_64-Darwin :: Posix/getpass.cpp (1596 of 2873)
PASS: SanitizerCommon-lsan-x86_64-Darwin :: Posix/lstat.cpp (1597 of 2873)
PASS: SanitizerCommon-lsan-x86_64-Darwin :: Posix/mmap_test.c (1598 of 2873)
UNSUPPORTED: SanitizerCommon-lsan-x86_64-Darwin :: Posix/nl_langinfo.cpp (1599 of 2873)
PASS: SanitizerCommon-lsan-x86_64-Darwin :: Posix/popen.cpp (1600 of 2873)
PASS: SanitizerCommon-lsan-x86_64-Darwin :: Posix/illegal_read_test.cpp (1601 of 2873)
PASS: SanitizerCommon-lsan-x86_64-Darwin :: Posix/illegal_write_test.cpp (1602 of 2873)
PASS: SanitizerCommon-lsan-x86_64-Darwin :: Posix/putc_putchar_unlocked.cpp (1603 of 2873)
PASS: SanitizerCommon-lsan-x86_64-Darwin :: Posix/readlink.c (1604 of 2873)
UNSUPPORTED: SanitizerCommon-lsan-x86_64-Darwin :: Posix/regex.cpp (1605 of 2873)
PASS: SanitizerCommon-lsan-x86_64-Darwin :: Posix/readlinkat.c (1606 of 2873)
XFAIL: SanitizerCommon-lsan-x86_64-Darwin :: Posix/sanitizer_set_death_callback_test.cpp (1607 of 2873)
PASS: SanitizerCommon-lsan-x86_64-Darwin :: Posix/setvbuf.cpp (1608 of 2873)
UNSUPPORTED: SanitizerCommon-lsan-x86_64-Darwin :: Posix/sl_add.cpp (1609 of 2873)
PASS: SanitizerCommon-lsan-x86_64-Darwin :: Posix/strlcat.cpp (1610 of 2873)
PASS: SanitizerCommon-lsan-x86_64-Darwin :: Posix/strlcpy.cpp (1611 of 2873)
UNSUPPORTED: SanitizerCommon-lsan-x86_64-Darwin :: Posix/strtonum.cpp (1612 of 2873)
UNSUPPORTED: SanitizerCommon-lsan-x86_64-Darwin :: Posix/strxfrm.c (1613 of 2873)
PASS: SanitizerCommon-lsan-x86_64-Darwin :: Posix/sysctl.cpp (1614 of 2873)
UNSUPPORTED: SanitizerCommon-lsan-x86_64-Darwin :: Posix/vis.cpp (1615 of 2873)
PASS: SanitizerCommon-lsan-x86_64-Darwin :: Posix/wcsdup.c (1616 of 2873)
UNSUPPORTED: SanitizerCommon-lsan-x86_64-Darwin :: Posix/wcsxfrm.c (1617 of 2873)
XFAIL: SanitizerCommon-lsan-x86_64-Darwin :: Posix/weak_hook_test.cpp (1618 of 2873)
PASS: SanitizerCommon-lsan-x86_64-Darwin :: Posix/sanitizer_set_report_fd_test.cpp (1619 of 2873)
UNSUPPORTED: SanitizerCommon-lsan-x86_64-Darwin :: corelimit.cpp (1620 of 2873)
PASS: SanitizerCommon-lsan-x86_64-Darwin :: ctype.c (1621 of 2873)
PASS: SanitizerCommon-lsan-x86_64-Darwin :: fopen_nullptr.c (1622 of 2873)
PASS: SanitizerCommon-lsan-x86_64-Darwin :: Posix/posix_memalign-alignment.cpp (1623 of 2873)
UNSUPPORTED: SanitizerCommon-lsan-x86_64-Darwin :: hard_rss_limit_mb_test.cpp (1624 of 2873)
PASS: SanitizerCommon-lsan-x86_64-Darwin :: malloc_hook.cpp (1625 of 2873)
PASS: SanitizerCommon-lsan-x86_64-Darwin :: options-help.cpp (1626 of 2873)
PASS: SanitizerCommon-lsan-x86_64-Darwin :: options-include.cpp (1627 of 2873)
PASS: SanitizerCommon-lsan-x86_64-Darwin :: options-invalid.cpp (1628 of 2873)
UNSUPPORTED: SanitizerCommon-lsan-x86_64-Darwin :: print-stack-trace.cpp (1629 of 2873)
PASS: SanitizerCommon-lsan-x86_64-Darwin :: printf-ldbl.c (1630 of 2873)
PASS: SanitizerCommon-lsan-x86_64-Darwin :: get_module_and_offset_for_pc.cpp (1631 of 2873)
UNSUPPORTED: SanitizerCommon-lsan-x86_64-Darwin :: reallocarray-overflow.cpp (1632 of 2873)
PASS: SanitizerCommon-lsan-x86_64-Darwin :: pthread_mutexattr_get.cpp (1633 of 2873)
PASS: SanitizerCommon-lsan-x86_64-Darwin :: sanitizer_coverage_inline8bit_counter.cpp (1634 of 2873)
PASS: SanitizerCommon-lsan-x86_64-Darwin :: sanitizer_coverage_no_prune.cpp (1635 of 2873)
UNSUPPORTED: SanitizerCommon-lsan-x86_64-Darwin :: sanitizer_coverage_symbolize.cpp (1636 of 2873)
XFAIL: SanitizerCommon-lsan-x86_64-Darwin :: sanitizer_coverage_trace_pc_guard-dso.cpp (1637 of 2873)
UNSUPPORTED: SanitizerCommon-lsan-x86_64-Darwin :: sanitizer_coverage_trace_pc_guard-init.cpp (1638 of 2873)
PASS: SanitizerCommon-lsan-x86_64-Darwin :: sanitizer_coverage_stack_depth.cpp (1639 of 2873)
PASS: SanitizerCommon-lsan-x86_64-Darwin :: scanf-ldbl.c (1640 of 2873)
PASS: SanitizerCommon-lsan-x86_64-Darwin :: sanitizer_coverage_trace_pc_guard.cpp (1641 of 2873)
PASS: SanitizerCommon-lsan-x86_64-Darwin :: strcasestr.c (1642 of 2873)
PASS: SanitizerCommon-lsan-x86_64-Darwin :: strcspn.c (1643 of 2873)
PASS: SanitizerCommon-lsan-x86_64-Darwin :: strnlen.c (1644 of 2873)
PASS: SanitizerCommon-lsan-x86_64-Darwin :: strpbrk.c (1645 of 2873)
PASS: SanitizerCommon-lsan-x86_64-Darwin :: strspn.c (1646 of 2873)
PASS: SanitizerCommon-lsan-x86_64-Darwin :: strstr.c (1647 of 2873)
PASS: SanitizerCommon-lsan-x86_64-Darwin :: symbolize_pc.cpp (1648 of 2873)
XFAIL: SanitizerCommon-lsan-x86_64-Darwin :: symbolize_pc_inline.cpp (1649 of 2873)
PASS: SanitizerCommon-lsan-x86_64-Darwin :: wcrtomb.c (1650 of 2873)
PASS: SanitizerCommon-lsan-x86_64-Darwin :: wctomb.c (1651 of 2873)
XFAIL: SanitizerCommon-lsan-x86_64-Darwin :: symbolize_stack.cpp (1652 of 2873)
PASS: SanitizerCommon-tsan-x86_64-Darwin :: Darwin/fputs_puts_null.cpp (1653 of 2873)
PASS: SanitizerCommon-tsan-x86_64-Darwin :: Darwin/abort_on_error.cpp (1654 of 2873)
PASS: SanitizerCommon-tsan-x86_64-Darwin :: Darwin/malloc_zone.cpp (1655 of 2873)
UNSUPPORTED: SanitizerCommon-tsan-x86_64-Darwin :: FreeBSD/capsicum.cpp (1656 of 2873)
UNSUPPORTED: SanitizerCommon-tsan-x86_64-Darwin :: FreeBSD/fdevname.cpp (1657 of 2873)
UNSUPPORTED: SanitizerCommon-tsan-x86_64-Darwin :: Linux/abort_on_error.cpp (1658 of 2873)
UNSUPPORTED: SanitizerCommon-tsan-x86_64-Darwin :: Linux/aligned_alloc-alignment.cpp (1659 of 2873)
UNSUPPORTED: SanitizerCommon-tsan-x86_64-Darwin :: Linux/aligned_alloc.c (1660 of 2873)
UNSUPPORTED: SanitizerCommon-tsan-x86_64-Darwin :: Linux/allow_user_segv.cpp (1661 of 2873)
UNSUPPORTED: SanitizerCommon-tsan-x86_64-Darwin :: Linux/assert.cpp (1662 of 2873)
UNSUPPORTED: SanitizerCommon-tsan-x86_64-Darwin :: Linux/clock_gettime.c (1663 of 2873)
UNSUPPORTED: SanitizerCommon-tsan-x86_64-Darwin :: Linux/closedir.c (1664 of 2873)
UNSUPPORTED: SanitizerCommon-tsan-x86_64-Darwin :: Linux/decorate_proc_maps.cpp (1665 of 2873)
UNSUPPORTED: SanitizerCommon-tsan-x86_64-Darwin :: Linux/deepbind.cpp (1666 of 2873)
UNSUPPORTED: SanitizerCommon-tsan-x86_64-Darwin :: Linux/getpwnam_r_invalid_user.cpp (1667 of 2873)
UNSUPPORTED: SanitizerCommon-tsan-x86_64-Darwin :: Linux/getrandom.cpp (1668 of 2873)
UNSUPPORTED: SanitizerCommon-tsan-x86_64-Darwin :: Linux/iconv_test.c (1669 of 2873)
UNSUPPORTED: SanitizerCommon-tsan-x86_64-Darwin :: Linux/ill.cpp (1670 of 2873)
UNSUPPORTED: SanitizerCommon-tsan-x86_64-Darwin :: Linux/mallopt.cpp (1671 of 2873)
UNSUPPORTED: SanitizerCommon-tsan-x86_64-Darwin :: Linux/mlock_test.cpp (1672 of 2873)
UNSUPPORTED: SanitizerCommon-tsan-x86_64-Darwin :: Linux/mmap64_test.c (1673 of 2873)
UNSUPPORTED: SanitizerCommon-tsan-x86_64-Darwin :: Linux/mmap_write_exec.cpp (1674 of 2873)
UNSUPPORTED: SanitizerCommon-tsan-x86_64-Darwin :: Linux/mprobe.cpp (1675 of 2873)
UNSUPPORTED: SanitizerCommon-tsan-x86_64-Darwin :: Linux/name_to_handle_at.cpp (1676 of 2873)
UNSUPPORTED: SanitizerCommon-tsan-x86_64-Darwin :: Linux/new_delete_test.cpp (1677 of 2873)
UNSUPPORTED: SanitizerCommon-tsan-x86_64-Darwin :: Linux/open_memstream.cpp (1678 of 2873)
UNSUPPORTED: SanitizerCommon-tsan-x86_64-Darwin :: Linux/pthread_mutex.cpp (1679 of 2873)
UNSUPPORTED: SanitizerCommon-tsan-x86_64-Darwin :: Linux/ptrace.cpp (1680 of 2873)
UNSUPPORTED: SanitizerCommon-tsan-x86_64-Darwin :: Linux/pvalloc-overflow.cpp (1681 of 2873)
UNSUPPORTED: SanitizerCommon-tsan-x86_64-Darwin :: Linux/recv_msg_trunc.cpp (1682 of 2873)
UNSUPPORTED: SanitizerCommon-tsan-x86_64-Darwin :: Linux/sched_getparam.cpp (1683 of 2873)
UNSUPPORTED: SanitizerCommon-tsan-x86_64-Darwin :: Linux/sem_init_glibc.cpp (1684 of 2873)
UNSUPPORTED: SanitizerCommon-tsan-x86_64-Darwin :: Linux/signal_segv_handler.cpp (1685 of 2873)
UNSUPPORTED: SanitizerCommon-tsan-x86_64-Darwin :: Linux/soft_rss_limit_mb_test.cpp (1686 of 2873)
UNSUPPORTED: SanitizerCommon-tsan-x86_64-Darwin :: Linux/sysconf_interceptor_bypass_test.cpp (1687 of 2873)
UNSUPPORTED: SanitizerCommon-tsan-x86_64-Darwin :: Linux/timerfd.cpp (1688 of 2873)
UNSUPPORTED: SanitizerCommon-tsan-x86_64-Darwin :: Linux/unexpected_format_specifier_test.cpp (1689 of 2873)
UNSUPPORTED: SanitizerCommon-tsan-x86_64-Darwin :: NetBSD/asysctl.cpp (1690 of 2873)
UNSUPPORTED: SanitizerCommon-tsan-x86_64-Darwin :: NetBSD/cdb.cpp (1691 of 2873)
UNSUPPORTED: SanitizerCommon-tsan-x86_64-Darwin :: NetBSD/faccessat.cpp (1692 of 2873)
UNSUPPORTED: SanitizerCommon-tsan-x86_64-Darwin :: NetBSD/fparseln.cpp (1693 of 2873)
UNSUPPORTED: SanitizerCommon-tsan-x86_64-Darwin :: NetBSD/funopen2.cpp (1694 of 2873)
UNSUPPORTED: SanitizerCommon-tsan-x86_64-Darwin :: NetBSD/getgrouplist.cpp (1695 of 2873)
UNSUPPORTED: SanitizerCommon-tsan-x86_64-Darwin :: NetBSD/getgroupmembership.cpp (1696 of 2873)
UNSUPPORTED: SanitizerCommon-tsan-x86_64-Darwin :: NetBSD/getvfsstat.cpp (1697 of 2873)
UNSUPPORTED: SanitizerCommon-tsan-x86_64-Darwin :: NetBSD/gid_from_group.cpp (1698 of 2873)
UNSUPPORTED: SanitizerCommon-tsan-x86_64-Darwin :: NetBSD/group_from_gid.cpp (1699 of 2873)
UNSUPPORTED: SanitizerCommon-tsan-x86_64-Darwin :: NetBSD/md2.cpp (1700 of 2873)
UNSUPPORTED: SanitizerCommon-tsan-x86_64-Darwin :: NetBSD/md4.cpp (1701 of 2873)
UNSUPPORTED: SanitizerCommon-tsan-x86_64-Darwin :: NetBSD/md5.cpp (1702 of 2873)
UNSUPPORTED: SanitizerCommon-tsan-x86_64-Darwin :: NetBSD/mi_vector_hash.cpp (1703 of 2873)
UNSUPPORTED: SanitizerCommon-tsan-x86_64-Darwin :: NetBSD/netent.cpp (1704 of 2873)
UNSUPPORTED: SanitizerCommon-tsan-x86_64-Darwin :: NetBSD/paccept.cpp (1705 of 2873)
UNSUPPORTED: SanitizerCommon-tsan-x86_64-Darwin :: NetBSD/protoent.cpp (1706 of 2873)
UNSUPPORTED: SanitizerCommon-tsan-x86_64-Darwin :: NetBSD/rmd160.cpp (1707 of 2873)
UNSUPPORTED: SanitizerCommon-tsan-x86_64-Darwin :: NetBSD/sha1.cpp (1708 of 2873)
UNSUPPORTED: SanitizerCommon-tsan-x86_64-Darwin :: NetBSD/sha2.cpp (1709 of 2873)
UNSUPPORTED: SanitizerCommon-tsan-x86_64-Darwin :: NetBSD/statvfs1.cpp (1710 of 2873)
UNSUPPORTED: SanitizerCommon-tsan-x86_64-Darwin :: NetBSD/strmode.cpp (1711 of 2873)
UNSUPPORTED: SanitizerCommon-tsan-x86_64-Darwin :: NetBSD/strtoi.cpp (1712 of 2873)
UNSUPPORTED: SanitizerCommon-tsan-x86_64-Darwin :: NetBSD/sysctlgetmibinfo.cpp (1713 of 2873)
UNSUPPORTED: SanitizerCommon-tsan-x86_64-Darwin :: NetBSD/ttyent.cpp (1714 of 2873)
UNSUPPORTED: SanitizerCommon-tsan-x86_64-Darwin :: NetBSD/uid_from_user.cpp (1715 of 2873)
UNSUPPORTED: SanitizerCommon-tsan-x86_64-Darwin :: NetBSD/user_from_uid.cpp (1716 of 2873)
PASS: SanitizerCommon-lsan-x86_64-Darwin :: allocator_returns_null.cpp (1717 of 2873)
PASS: SanitizerCommon-tsan-x86_64-Darwin :: Posix/access.cpp (1718 of 2873)
PASS: SanitizerCommon-tsan-x86_64-Darwin :: Posix/arc4random.cpp (1719 of 2873)
PASS: SanitizerCommon-tsan-x86_64-Darwin :: Posix/devname.cpp (1720 of 2873)
PASS: SanitizerCommon-tsan-x86_64-Darwin :: Posix/devname_r.cpp (1721 of 2873)
PASS: SanitizerCommon-tsan-x86_64-Darwin :: Darwin/print-stack-trace.cpp (1722 of 2873)
UNSUPPORTED: SanitizerCommon-tsan-x86_64-Darwin :: Posix/dump_registers.cpp (1723 of 2873)
PASS: SanitizerCommon-tsan-x86_64-Darwin :: Posix/feof_fileno_ferror.cpp (1724 of 2873)
PASS: SanitizerCommon-tsan-x86_64-Darwin :: Posix/fgetc_ungetc_getc.cpp (1725 of 2873)
PASS: SanitizerCommon-tsan-x86_64-Darwin :: Posix/fgetln.cpp (1726 of 2873)
PASS: SanitizerCommon-tsan-x86_64-Darwin :: Posix/dump_instruction_bytes.cpp (1727 of 2873)
PASS: SanitizerCommon-tsan-x86_64-Darwin :: Posix/fgets.cpp (1728 of 2873)
PASS: SanitizerCommon-tsan-x86_64-Darwin :: Posix/fputc_putc_putchar.cpp (1729 of 2873)
PASS: SanitizerCommon-tsan-x86_64-Darwin :: Posix/fputs_puts.cpp (1730 of 2873)
UNSUPPORTED: SanitizerCommon-tsan-x86_64-Darwin :: Posix/fseek.cpp (1731 of 2873)
UNSUPPORTED: SanitizerCommon-tsan-x86_64-Darwin :: Posix/fts.cpp (1732 of 2873)
UNSUPPORTED: SanitizerCommon-tsan-x86_64-Darwin :: Posix/funopen.cpp (1733 of 2873)
PASS: SanitizerCommon-tsan-x86_64-Darwin :: Posix/getc_unlocked.cpp (1734 of 2873)
UNSUPPORTED: SanitizerCommon-tsan-x86_64-Darwin :: Posix/getfsent.cpp (1735 of 2873)
PASS: SanitizerCommon-tsan-x86_64-Darwin :: Posix/dedup_token_length_test.cpp (1736 of 2873)
PASS: SanitizerCommon-tsan-x86_64-Darwin :: Posix/getmntinfo.cpp (1737 of 2873)
PASS: SanitizerCommon-tsan-x86_64-Darwin :: Posix/fpe.cpp (1738 of 2873)
PASS: SanitizerCommon-tsan-x86_64-Darwin :: Posix/getpass.cpp (1739 of 2873)
PASS: SanitizerCommon-tsan-x86_64-Darwin :: Posix/getusershell.cpp (1740 of 2873)
PASS: SanitizerCommon-tsan-x86_64-Darwin :: Posix/getpw_getgr.cpp (1741 of 2873)
PASS: SanitizerCommon-tsan-x86_64-Darwin :: Posix/lstat.cpp (1742 of 2873)
PASS: SanitizerCommon-tsan-x86_64-Darwin :: Posix/illegal_read_test.cpp (1743 of 2873)
UNSUPPORTED: SanitizerCommon-tsan-x86_64-Darwin :: Posix/nl_langinfo.cpp (1744 of 2873)
PASS: SanitizerCommon-tsan-x86_64-Darwin :: Posix/mmap_test.c (1745 of 2873)
PASS: SanitizerCommon-tsan-x86_64-Darwin :: Posix/illegal_write_test.cpp (1746 of 2873)
PASS: SanitizerCommon-tsan-x86_64-Darwin :: Posix/popen.cpp (1747 of 2873)
PASS: SanitizerCommon-tsan-x86_64-Darwin :: Posix/putc_putchar_unlocked.cpp (1748 of 2873)
PASS: SanitizerCommon-tsan-x86_64-Darwin :: Posix/readlink.c (1749 of 2873)
UNSUPPORTED: SanitizerCommon-tsan-x86_64-Darwin :: Posix/regex.cpp (1750 of 2873)
PASS: SanitizerCommon-tsan-x86_64-Darwin :: Posix/readlinkat.c (1751 of 2873)
PASS: SanitizerCommon-tsan-x86_64-Darwin :: Posix/sanitizer_set_death_callback_test.cpp (1752 of 2873)
PASS: SanitizerCommon-tsan-x86_64-Darwin :: Posix/setvbuf.cpp (1753 of 2873)
UNSUPPORTED: SanitizerCommon-tsan-x86_64-Darwin :: Posix/sl_add.cpp (1754 of 2873)
PASS: SanitizerCommon-tsan-x86_64-Darwin :: Posix/strlcat.cpp (1755 of 2873)
PASS: SanitizerCommon-tsan-x86_64-Darwin :: Posix/strlcpy.cpp (1756 of 2873)
UNSUPPORTED: SanitizerCommon-tsan-x86_64-Darwin :: Posix/strtonum.cpp (1757 of 2873)
UNSUPPORTED: SanitizerCommon-tsan-x86_64-Darwin :: Posix/strxfrm.c (1758 of 2873)
PASS: SanitizerCommon-tsan-x86_64-Darwin :: Posix/sysctl.cpp (1759 of 2873)
UNSUPPORTED: SanitizerCommon-tsan-x86_64-Darwin :: Posix/vis.cpp (1760 of 2873)
PASS: SanitizerCommon-tsan-x86_64-Darwin :: Posix/wcsdup.c (1761 of 2873)
UNSUPPORTED: SanitizerCommon-tsan-x86_64-Darwin :: Posix/wcsxfrm.c (1762 of 2873)
PASS: SanitizerCommon-tsan-x86_64-Darwin :: Posix/sanitizer_set_report_fd_test.cpp (1763 of 2873)
PASS: SanitizerCommon-tsan-x86_64-Darwin :: Posix/weak_hook_test.cpp (1764 of 2873)
PASS: SanitizerCommon-tsan-x86_64-Darwin :: corelimit.cpp (1765 of 2873)
PASS: SanitizerCommon-tsan-x86_64-Darwin :: ctype.c (1766 of 2873)
PASS: SanitizerCommon-tsan-x86_64-Darwin :: Posix/posix_memalign-alignment.cpp (1767 of 2873)
PASS: SanitizerCommon-tsan-x86_64-Darwin :: fopen_nullptr.c (1768 of 2873)
UNSUPPORTED: SanitizerCommon-tsan-x86_64-Darwin :: hard_rss_limit_mb_test.cpp (1769 of 2873)
PASS: SanitizerCommon-tsan-x86_64-Darwin :: malloc_hook.cpp (1770 of 2873)
PASS: SanitizerCommon-tsan-x86_64-Darwin :: get_module_and_offset_for_pc.cpp (1771 of 2873)
PASS: SanitizerCommon-tsan-x86_64-Darwin :: options-help.cpp (1772 of 2873)
PASS: SanitizerCommon-tsan-x86_64-Darwin :: options-invalid.cpp (1773 of 2873)
UNSUPPORTED: SanitizerCommon-tsan-x86_64-Darwin :: print-stack-trace.cpp (1774 of 2873)
PASS: SanitizerCommon-tsan-x86_64-Darwin :: printf-ldbl.c (1775 of 2873)
PASS: SanitizerCommon-tsan-x86_64-Darwin :: pthread_mutexattr_get.cpp (1776 of 2873)
UNSUPPORTED: SanitizerCommon-tsan-x86_64-Darwin :: reallocarray-overflow.cpp (1777 of 2873)
XFAIL: SanitizerCommon-tsan-x86_64-Darwin :: sanitizer_coverage_inline8bit_counter.cpp (1778 of 2873)
PASS: SanitizerCommon-tsan-x86_64-Darwin :: options-include.cpp (1779 of 2873)
XFAIL: SanitizerCommon-tsan-x86_64-Darwin :: sanitizer_coverage_no_prune.cpp (1780 of 2873)
UNSUPPORTED: SanitizerCommon-tsan-x86_64-Darwin :: sanitizer_coverage_symbolize.cpp (1781 of 2873)
XFAIL: SanitizerCommon-tsan-x86_64-Darwin :: sanitizer_coverage_stack_depth.cpp (1782 of 2873)
UNSUPPORTED: SanitizerCommon-tsan-x86_64-Darwin :: sanitizer_coverage_trace_pc_guard-init.cpp (1783 of 2873)
XFAIL: SanitizerCommon-tsan-x86_64-Darwin :: sanitizer_coverage_trace_pc_guard-dso.cpp (1784 of 2873)
XFAIL: SanitizerCommon-tsan-x86_64-Darwin :: sanitizer_coverage_trace_pc_guard.cpp (1785 of 2873)
PASS: SanitizerCommon-tsan-x86_64-Darwin :: scanf-ldbl.c (1786 of 2873)
PASS: SanitizerCommon-tsan-x86_64-Darwin :: strcasestr.c (1787 of 2873)
PASS: SanitizerCommon-tsan-x86_64-Darwin :: strcspn.c (1788 of 2873)
PASS: SanitizerCommon-tsan-x86_64-Darwin :: strnlen.c (1789 of 2873)
PASS: SanitizerCommon-tsan-x86_64-Darwin :: strpbrk.c (1790 of 2873)
PASS: SanitizerCommon-tsan-x86_64-Darwin :: strspn.c (1791 of 2873)
PASS: SanitizerCommon-tsan-x86_64-Darwin :: strstr.c (1792 of 2873)
PASS: SanitizerCommon-tsan-x86_64-Darwin :: symbolize_pc.cpp (1793 of 2873)
XFAIL: SanitizerCommon-tsan-x86_64-Darwin :: symbolize_pc_inline.cpp (1794 of 2873)
PASS: SanitizerCommon-tsan-x86_64-Darwin :: wcrtomb.c (1795 of 2873)
PASS: SanitizerCommon-tsan-x86_64-Darwin :: wctomb.c (1796 of 2873)
PASS: SanitizerCommon-tsan-x86_64-Darwin :: symbolize_stack.cpp (1797 of 2873)
PASS: SanitizerCommon-ubsan-x86_64-Darwin :: Darwin/fputs_puts_null.cpp (1798 of 2873)
XFAIL: SanitizerCommon-ubsan-x86_64-Darwin :: Darwin/malloc_zone.cpp (1799 of 2873)
PASS: SanitizerCommon-ubsan-x86_64-Darwin :: Darwin/abort_on_error.cpp (1800 of 2873)
UNSUPPORTED: SanitizerCommon-ubsan-x86_64-Darwin :: FreeBSD/capsicum.cpp (1801 of 2873)
UNSUPPORTED: SanitizerCommon-ubsan-x86_64-Darwin :: FreeBSD/fdevname.cpp (1802 of 2873)
UNSUPPORTED: SanitizerCommon-ubsan-x86_64-Darwin :: Linux/abort_on_error.cpp (1803 of 2873)
UNSUPPORTED: SanitizerCommon-ubsan-x86_64-Darwin :: Linux/aligned_alloc-alignment.cpp (1804 of 2873)
UNSUPPORTED: SanitizerCommon-ubsan-x86_64-Darwin :: Linux/aligned_alloc.c (1805 of 2873)
UNSUPPORTED: SanitizerCommon-ubsan-x86_64-Darwin :: Linux/allow_user_segv.cpp (1806 of 2873)
UNSUPPORTED: SanitizerCommon-ubsan-x86_64-Darwin :: Linux/assert.cpp (1807 of 2873)
UNSUPPORTED: SanitizerCommon-ubsan-x86_64-Darwin :: Linux/clock_gettime.c (1808 of 2873)
UNSUPPORTED: SanitizerCommon-ubsan-x86_64-Darwin :: Linux/closedir.c (1809 of 2873)
UNSUPPORTED: SanitizerCommon-ubsan-x86_64-Darwin :: Linux/decorate_proc_maps.cpp (1810 of 2873)
UNSUPPORTED: SanitizerCommon-ubsan-x86_64-Darwin :: Linux/deepbind.cpp (1811 of 2873)
UNSUPPORTED: SanitizerCommon-ubsan-x86_64-Darwin :: Linux/getpwnam_r_invalid_user.cpp (1812 of 2873)
UNSUPPORTED: SanitizerCommon-ubsan-x86_64-Darwin :: Linux/getrandom.cpp (1813 of 2873)
UNSUPPORTED: SanitizerCommon-ubsan-x86_64-Darwin :: Linux/iconv_test.c (1814 of 2873)
UNSUPPORTED: SanitizerCommon-ubsan-x86_64-Darwin :: Linux/ill.cpp (1815 of 2873)
UNSUPPORTED: SanitizerCommon-ubsan-x86_64-Darwin :: Linux/mallopt.cpp (1816 of 2873)
UNSUPPORTED: SanitizerCommon-ubsan-x86_64-Darwin :: Linux/mlock_test.cpp (1817 of 2873)
UNSUPPORTED: SanitizerCommon-ubsan-x86_64-Darwin :: Linux/mmap64_test.c (1818 of 2873)
UNSUPPORTED: SanitizerCommon-ubsan-x86_64-Darwin :: Linux/mmap_write_exec.cpp (1819 of 2873)
UNSUPPORTED: SanitizerCommon-ubsan-x86_64-Darwin :: Linux/mprobe.cpp (1820 of 2873)
UNSUPPORTED: SanitizerCommon-ubsan-x86_64-Darwin :: Linux/name_to_handle_at.cpp (1821 of 2873)
UNSUPPORTED: SanitizerCommon-ubsan-x86_64-Darwin :: Linux/new_delete_test.cpp (1822 of 2873)
UNSUPPORTED: SanitizerCommon-ubsan-x86_64-Darwin :: Linux/open_memstream.cpp (1823 of 2873)
UNSUPPORTED: SanitizerCommon-ubsan-x86_64-Darwin :: Linux/pthread_mutex.cpp (1824 of 2873)
UNSUPPORTED: SanitizerCommon-ubsan-x86_64-Darwin :: Linux/ptrace.cpp (1825 of 2873)
UNSUPPORTED: SanitizerCommon-ubsan-x86_64-Darwin :: Linux/pvalloc-overflow.cpp (1826 of 2873)
UNSUPPORTED: SanitizerCommon-ubsan-x86_64-Darwin :: Linux/recv_msg_trunc.cpp (1827 of 2873)
UNSUPPORTED: SanitizerCommon-ubsan-x86_64-Darwin :: Linux/sched_getparam.cpp (1828 of 2873)
UNSUPPORTED: SanitizerCommon-ubsan-x86_64-Darwin :: Linux/sem_init_glibc.cpp (1829 of 2873)
UNSUPPORTED: SanitizerCommon-ubsan-x86_64-Darwin :: Linux/signal_segv_handler.cpp (1830 of 2873)
UNSUPPORTED: SanitizerCommon-ubsan-x86_64-Darwin :: Linux/soft_rss_limit_mb_test.cpp (1831 of 2873)
UNSUPPORTED: SanitizerCommon-ubsan-x86_64-Darwin :: Linux/sysconf_interceptor_bypass_test.cpp (1832 of 2873)
UNSUPPORTED: SanitizerCommon-ubsan-x86_64-Darwin :: Linux/timerfd.cpp (1833 of 2873)
UNSUPPORTED: SanitizerCommon-ubsan-x86_64-Darwin :: Linux/unexpected_format_specifier_test.cpp (1834 of 2873)
UNSUPPORTED: SanitizerCommon-ubsan-x86_64-Darwin :: NetBSD/asysctl.cpp (1835 of 2873)
UNSUPPORTED: SanitizerCommon-ubsan-x86_64-Darwin :: NetBSD/cdb.cpp (1836 of 2873)
UNSUPPORTED: SanitizerCommon-ubsan-x86_64-Darwin :: NetBSD/faccessat.cpp (1837 of 2873)
UNSUPPORTED: SanitizerCommon-ubsan-x86_64-Darwin :: NetBSD/fparseln.cpp (1838 of 2873)
UNSUPPORTED: SanitizerCommon-ubsan-x86_64-Darwin :: NetBSD/funopen2.cpp (1839 of 2873)
UNSUPPORTED: SanitizerCommon-ubsan-x86_64-Darwin :: NetBSD/getgrouplist.cpp (1840 of 2873)
UNSUPPORTED: SanitizerCommon-ubsan-x86_64-Darwin :: NetBSD/getgroupmembership.cpp (1841 of 2873)
UNSUPPORTED: SanitizerCommon-ubsan-x86_64-Darwin :: NetBSD/getvfsstat.cpp (1842 of 2873)
UNSUPPORTED: SanitizerCommon-ubsan-x86_64-Darwin :: NetBSD/gid_from_group.cpp (1843 of 2873)
UNSUPPORTED: SanitizerCommon-ubsan-x86_64-Darwin :: NetBSD/group_from_gid.cpp (1844 of 2873)
UNSUPPORTED: SanitizerCommon-ubsan-x86_64-Darwin :: NetBSD/md2.cpp (1845 of 2873)
UNSUPPORTED: SanitizerCommon-ubsan-x86_64-Darwin :: NetBSD/md4.cpp (1846 of 2873)
UNSUPPORTED: SanitizerCommon-ubsan-x86_64-Darwin :: NetBSD/md5.cpp (1847 of 2873)
UNSUPPORTED: SanitizerCommon-ubsan-x86_64-Darwin :: NetBSD/mi_vector_hash.cpp (1848 of 2873)
UNSUPPORTED: SanitizerCommon-ubsan-x86_64-Darwin :: NetBSD/netent.cpp (1849 of 2873)
UNSUPPORTED: SanitizerCommon-ubsan-x86_64-Darwin :: NetBSD/paccept.cpp (1850 of 2873)
UNSUPPORTED: SanitizerCommon-ubsan-x86_64-Darwin :: NetBSD/protoent.cpp (1851 of 2873)
UNSUPPORTED: SanitizerCommon-ubsan-x86_64-Darwin :: NetBSD/rmd160.cpp (1852 of 2873)
UNSUPPORTED: SanitizerCommon-ubsan-x86_64-Darwin :: NetBSD/sha1.cpp (1853 of 2873)
UNSUPPORTED: SanitizerCommon-ubsan-x86_64-Darwin :: NetBSD/sha2.cpp (1854 of 2873)
UNSUPPORTED: SanitizerCommon-ubsan-x86_64-Darwin :: NetBSD/statvfs1.cpp (1855 of 2873)
UNSUPPORTED: SanitizerCommon-ubsan-x86_64-Darwin :: NetBSD/strmode.cpp (1856 of 2873)
UNSUPPORTED: SanitizerCommon-ubsan-x86_64-Darwin :: NetBSD/strtoi.cpp (1857 of 2873)
UNSUPPORTED: SanitizerCommon-ubsan-x86_64-Darwin :: NetBSD/sysctlgetmibinfo.cpp (1858 of 2873)
UNSUPPORTED: SanitizerCommon-ubsan-x86_64-Darwin :: NetBSD/ttyent.cpp (1859 of 2873)
UNSUPPORTED: SanitizerCommon-ubsan-x86_64-Darwin :: NetBSD/uid_from_user.cpp (1860 of 2873)
UNSUPPORTED: SanitizerCommon-ubsan-x86_64-Darwin :: NetBSD/user_from_uid.cpp (1861 of 2873)
PASS: SanitizerCommon-ubsan-x86_64-Darwin :: Posix/access.cpp (1862 of 2873)
PASS: SanitizerCommon-ubsan-x86_64-Darwin :: Posix/arc4random.cpp (1863 of 2873)
PASS: SanitizerCommon-tsan-x86_64-Darwin :: allocator_returns_null.cpp (1864 of 2873)
PASS: SanitizerCommon-ubsan-x86_64-Darwin :: Darwin/print-stack-trace.cpp (1865 of 2873)
PASS: SanitizerCommon-ubsan-x86_64-Darwin :: Posix/devname.cpp (1866 of 2873)
PASS: SanitizerCommon-ubsan-x86_64-Darwin :: Posix/devname_r.cpp (1867 of 2873)
UNSUPPORTED: SanitizerCommon-ubsan-x86_64-Darwin :: Posix/dump_registers.cpp (1868 of 2873)
PASS: SanitizerCommon-ubsan-x86_64-Darwin :: Posix/feof_fileno_ferror.cpp (1869 of 2873)
PASS: SanitizerCommon-ubsan-x86_64-Darwin :: Posix/fgetc_ungetc_getc.cpp (1870 of 2873)
PASS: SanitizerCommon-ubsan-x86_64-Darwin :: Posix/fgetln.cpp (1871 of 2873)
PASS: SanitizerCommon-ubsan-x86_64-Darwin :: Posix/fgets.cpp (1872 of 2873)
PASS: SanitizerCommon-ubsan-x86_64-Darwin :: Posix/dump_instruction_bytes.cpp (1873 of 2873)
PASS: SanitizerCommon-ubsan-x86_64-Darwin :: Posix/fputc_putc_putchar.cpp (1874 of 2873)
PASS: SanitizerCommon-ubsan-x86_64-Darwin :: Posix/fputs_puts.cpp (1875 of 2873)
UNSUPPORTED: SanitizerCommon-ubsan-x86_64-Darwin :: Posix/fseek.cpp (1876 of 2873)
UNSUPPORTED: SanitizerCommon-ubsan-x86_64-Darwin :: Posix/fts.cpp (1877 of 2873)
UNSUPPORTED: SanitizerCommon-ubsan-x86_64-Darwin :: Posix/funopen.cpp (1878 of 2873)
PASS: SanitizerCommon-ubsan-x86_64-Darwin :: Posix/getc_unlocked.cpp (1879 of 2873)
UNSUPPORTED: SanitizerCommon-ubsan-x86_64-Darwin :: Posix/getfsent.cpp (1880 of 2873)
PASS: SanitizerCommon-ubsan-x86_64-Darwin :: Posix/getmntinfo.cpp (1881 of 2873)
PASS: SanitizerCommon-ubsan-x86_64-Darwin :: Posix/getpass.cpp (1882 of 2873)
PASS: SanitizerCommon-ubsan-x86_64-Darwin :: Posix/fpe.cpp (1883 of 2873)
PASS: SanitizerCommon-ubsan-x86_64-Darwin :: Posix/getusershell.cpp (1884 of 2873)
PASS: SanitizerCommon-ubsan-x86_64-Darwin :: Posix/getpw_getgr.cpp (1885 of 2873)
PASS: SanitizerCommon-ubsan-x86_64-Darwin :: Posix/dedup_token_length_test.cpp (1886 of 2873)
PASS: SanitizerCommon-ubsan-x86_64-Darwin :: Posix/lstat.cpp (1887 of 2873)
PASS: SanitizerCommon-ubsan-x86_64-Darwin :: Posix/illegal_read_test.cpp (1888 of 2873)
UNSUPPORTED: SanitizerCommon-ubsan-x86_64-Darwin :: Posix/nl_langinfo.cpp (1889 of 2873)
PASS: SanitizerCommon-ubsan-x86_64-Darwin :: Posix/mmap_test.c (1890 of 2873)
UNSUPPORTED: SanitizerCommon-ubsan-x86_64-Darwin :: Posix/posix_memalign-alignment.cpp (1891 of 2873)
PASS: SanitizerCommon-ubsan-x86_64-Darwin :: Posix/illegal_write_test.cpp (1892 of 2873)
PASS: SanitizerCommon-ubsan-x86_64-Darwin :: Posix/popen.cpp (1893 of 2873)
PASS: SanitizerCommon-ubsan-x86_64-Darwin :: Posix/putc_putchar_unlocked.cpp (1894 of 2873)
UNSUPPORTED: SanitizerCommon-ubsan-x86_64-Darwin :: Posix/regex.cpp (1895 of 2873)
PASS: SanitizerCommon-ubsan-x86_64-Darwin :: Posix/readlink.c (1896 of 2873)
PASS: SanitizerCommon-ubsan-x86_64-Darwin :: Posix/readlinkat.c (1897 of 2873)
XFAIL: SanitizerCommon-ubsan-x86_64-Darwin :: Posix/sanitizer_set_death_callback_test.cpp (1898 of 2873)
UNSUPPORTED: SanitizerCommon-ubsan-x86_64-Darwin :: Posix/sl_add.cpp (1899 of 2873)
PASS: SanitizerCommon-ubsan-x86_64-Darwin :: Posix/setvbuf.cpp (1900 of 2873)
PASS: SanitizerCommon-ubsan-x86_64-Darwin :: Posix/strlcat.cpp (1901 of 2873)
UNSUPPORTED: SanitizerCommon-ubsan-x86_64-Darwin :: Posix/strtonum.cpp (1902 of 2873)
UNSUPPORTED: SanitizerCommon-ubsan-x86_64-Darwin :: Posix/strxfrm.c (1903 of 2873)
PASS: SanitizerCommon-ubsan-x86_64-Darwin :: Posix/strlcpy.cpp (1904 of 2873)
UNSUPPORTED: SanitizerCommon-ubsan-x86_64-Darwin :: Posix/vis.cpp (1905 of 2873)
PASS: SanitizerCommon-ubsan-x86_64-Darwin :: Posix/sysctl.cpp (1906 of 2873)
UNSUPPORTED: SanitizerCommon-ubsan-x86_64-Darwin :: Posix/wcsxfrm.c (1907 of 2873)
PASS: SanitizerCommon-ubsan-x86_64-Darwin :: Posix/wcsdup.c (1908 of 2873)
UNSUPPORTED: SanitizerCommon-ubsan-x86_64-Darwin :: allocator_returns_null.cpp (1909 of 2873)
UNSUPPORTED: SanitizerCommon-ubsan-x86_64-Darwin :: corelimit.cpp (1910 of 2873)
PASS: SanitizerCommon-ubsan-x86_64-Darwin :: ctype.c (1911 of 2873)
XFAIL: SanitizerCommon-ubsan-x86_64-Darwin :: Posix/weak_hook_test.cpp (1912 of 2873)
PASS: SanitizerCommon-ubsan-x86_64-Darwin :: fopen_nullptr.c (1913 of 2873)
UNSUPPORTED: SanitizerCommon-ubsan-x86_64-Darwin :: hard_rss_limit_mb_test.cpp (1914 of 2873)
XFAIL: SanitizerCommon-ubsan-x86_64-Darwin :: malloc_hook.cpp (1915 of 2873)
PASS: SanitizerCommon-ubsan-x86_64-Darwin :: options-help.cpp (1916 of 2873)
PASS: SanitizerCommon-ubsan-x86_64-Darwin :: options-include.cpp (1917 of 2873)
PASS: SanitizerCommon-ubsan-x86_64-Darwin :: options-invalid.cpp (1918 of 2873)
UNSUPPORTED: SanitizerCommon-ubsan-x86_64-Darwin :: print-stack-trace.cpp (1919 of 2873)
PASS: SanitizerCommon-ubsan-x86_64-Darwin :: printf-ldbl.c (1920 of 2873)
PASS: SanitizerCommon-ubsan-x86_64-Darwin :: pthread_mutexattr_get.cpp (1921 of 2873)
UNSUPPORTED: SanitizerCommon-ubsan-x86_64-Darwin :: reallocarray-overflow.cpp (1922 of 2873)
PASS: SanitizerCommon-ubsan-x86_64-Darwin :: get_module_and_offset_for_pc.cpp (1923 of 2873)
XFAIL: SanitizerCommon-ubsan-x86_64-Darwin :: sanitizer_coverage_no_prune.cpp (1924 of 2873)
PASS: SanitizerCommon-ubsan-x86_64-Darwin :: sanitizer_coverage_inline8bit_counter.cpp (1925 of 2873)
UNSUPPORTED: SanitizerCommon-ubsan-x86_64-Darwin :: sanitizer_coverage_symbolize.cpp (1926 of 2873)
UNSUPPORTED: SanitizerCommon-ubsan-x86_64-Darwin :: sanitizer_coverage_trace_pc_guard-dso.cpp (1927 of 2873)
UNSUPPORTED: SanitizerCommon-ubsan-x86_64-Darwin :: sanitizer_coverage_trace_pc_guard-init.cpp (1928 of 2873)
UNSUPPORTED: ShadowCallStack :: init.c (1929 of 2873)
UNSUPPORTED: ShadowCallStack :: overflow.c (1930 of 2873)
UNSUPPORTED: SanitizerCommon-ubsan-x86_64-Darwin :: sanitizer_coverage_trace_pc_guard.cpp (1931 of 2873)
PASS: SanitizerCommon-ubsan-x86_64-Darwin :: scanf-ldbl.c (1932 of 2873)
PASS: SanitizerCommon-ubsan-x86_64-Darwin :: strcasestr.c (1933 of 2873)
PASS: SanitizerCommon-ubsan-x86_64-Darwin :: sanitizer_coverage_stack_depth.cpp (1934 of 2873)
PASS: SanitizerCommon-ubsan-x86_64-Darwin :: strcspn.c (1935 of 2873)
PASS: SanitizerCommon-ubsan-x86_64-Darwin :: strpbrk.c (1936 of 2873)
PASS: SanitizerCommon-ubsan-x86_64-Darwin :: strnlen.c (1937 of 2873)
PASS: SanitizerCommon-ubsan-x86_64-Darwin :: strstr.c (1938 of 2873)
PASS: SanitizerCommon-ubsan-x86_64-Darwin :: strspn.c (1939 of 2873)
PASS: SanitizerCommon-ubsan-x86_64-Darwin :: Posix/sanitizer_set_report_fd_test.cpp (1940 of 2873)
PASS: SanitizerCommon-ubsan-x86_64-Darwin :: symbolize_pc.cpp (1941 of 2873)
PASS: SanitizerCommon-ubsan-x86_64-Darwin :: wcrtomb.c (1942 of 2873)
XFAIL: SanitizerCommon-ubsan-x86_64-Darwin :: symbolize_pc_inline.cpp (1943 of 2873)
PASS: SanitizerCommon-ubsan-x86_64-Darwin :: wctomb.c (1944 of 2873)
PASS: ThreadSanitizer-Unit :: rtl/./TsanRtlTest-x86_64-Test/Posix.CondBasic (1945 of 2873)
PASS: ThreadSanitizer-Unit :: rtl/./TsanRtlTest-x86_64-Test/Posix.ThreadLocalAccesses (1946 of 2873)
PASS: SanitizerCommon-ubsan-x86_64-Darwin :: symbolize_stack.cpp (1947 of 2873)
PASS: ThreadSanitizer-Unit :: rtl/./TsanRtlTest-x86_64-Test/Posix.ThreadSpecificDtors (1948 of 2873)
PASS: ThreadSanitizer-Unit :: rtl/./TsanRtlTest-x86_64-Test/ThreadSanitizer.BasicMutex (1949 of 2873)
PASS: ThreadSanitizer-Unit :: rtl/./TsanRtlTest-x86_64-Test/ThreadSanitizer.BasicRwMutex (1950 of 2873)
PASS: ThreadSanitizer-Unit :: rtl/./TsanRtlTest-x86_64-Test/ThreadSanitizer.BasicSpinMutex (1951 of 2873)
PASS: ThreadSanitizer-Unit :: rtl/./TsanRtlTest-x86_64-Test/ThreadSanitizer.BenignRaceOnVptr (1952 of 2873)
PASS: ThreadSanitizer-Unit :: rtl/./TsanRtlTest-x86_64-Test/ThreadSanitizer.FuncCall (1953 of 2873)
PASS: ThreadSanitizer-Unit :: rtl/./TsanRtlTest-x86_64-Test/ThreadSanitizer.HarmfulRaceOnVptr (1954 of 2873)
PASS: ThreadSanitizer-Unit :: rtl/./TsanRtlTest-x86_64-Test/ThreadSanitizer.LockedWriteThenRead (1955 of 2873)
PASS: ThreadSanitizer-Unit :: rtl/./TsanRtlTest-x86_64-Test/ThreadSanitizer.Memcpy (1956 of 2873)
PASS: ThreadSanitizer-Unit :: rtl/./TsanRtlTest-x86_64-Test/ThreadSanitizer.MemcpyRace1 (1957 of 2873)
PASS: ThreadSanitizer-Unit :: rtl/./TsanRtlTest-x86_64-Test/ThreadSanitizer.MemcpyRace2 (1958 of 2873)
PASS: ThreadSanitizer-Unit :: rtl/./TsanRtlTest-x86_64-Test/ThreadSanitizer.MemcpyRace3 (1959 of 2873)
PASS: ThreadSanitizer-Unit :: rtl/./TsanRtlTest-x86_64-Test/ThreadSanitizer.MemcpyStack (1960 of 2873)
PASS: ThreadSanitizer-Unit :: rtl/./TsanRtlTest-x86_64-Test/ThreadSanitizer.MemsetRace1 (1961 of 2873)
PASS: ThreadSanitizer-Unit :: rtl/./TsanRtlTest-x86_64-Test/ThreadSanitizer.Mutex (1962 of 2873)
PASS: ThreadSanitizer-Unit :: rtl/./TsanRtlTest-x86_64-Test/ThreadSanitizer.NoRaceWithOffset (1963 of 2873)
PASS: ThreadSanitizer-Unit :: rtl/./TsanRtlTest-x86_64-Test/ThreadSanitizer.RaceWithDeadThread (1964 of 2873)
PASS: ThreadSanitizer-Unit :: rtl/./TsanRtlTest-x86_64-Test/ThreadSanitizer.RaceWithOffset (1965 of 2873)
PASS: ThreadSanitizer-Unit :: rtl/./TsanRtlTest-x86_64-Test/ThreadSanitizer.RaceWithOffset2 (1966 of 2873)
PASS: ThreadSanitizer-Unit :: rtl/./TsanRtlTest-x86_64-Test/ThreadSanitizer.ReadReadNoRace (1967 of 2873)
PASS: ThreadSanitizer-Unit :: rtl/./TsanRtlTest-x86_64-Test/ThreadSanitizer.ReadWriteRace (1968 of 2873)
PASS: ThreadSanitizer-Unit :: rtl/./TsanRtlTest-x86_64-Test/ThreadSanitizer.ReportDeadThread (1969 of 2873)
PASS: ThreadSanitizer-Unit :: rtl/./TsanRtlTest-x86_64-Test/ThreadSanitizer.ReportRace (1970 of 2873)
PASS: ThreadSanitizer-Unit :: rtl/./TsanRtlTest-x86_64-Test/ThreadSanitizer.RwMutex (1971 of 2873)
PASS: ThreadSanitizer-Unit :: rtl/./TsanRtlTest-x86_64-Test/ThreadSanitizer.SimpleWriteWrite (1972 of 2873)
PASS: ThreadSanitizer-Unit :: rtl/./TsanRtlTest-x86_64-Test/ThreadSanitizer.SimpleWrite (1973 of 2873)
PASS: ThreadSanitizer-Unit :: rtl/./TsanRtlTest-x86_64-Test/ThreadSanitizer.SpinMutex (1974 of 2873)
PASS: ThreadSanitizer-Unit :: rtl/./TsanRtlTest-x86_64-Test/ThreadSanitizer.StaticMutex (1975 of 2873)
PASS: ThreadSanitizer-Unit :: rtl/./TsanRtlTest-x86_64-Test/ThreadSanitizer.ThreadDetach1 (1976 of 2873)
PASS: ThreadSanitizer-Unit :: rtl/./TsanRtlTest-x86_64-Test/ThreadSanitizer.ThreadDetach2 (1977 of 2873)
PASS: ThreadSanitizer-Unit :: rtl/./TsanRtlTest-x86_64-Test/ThreadSanitizer.WriteReadRace (1978 of 2873)
PASS: ThreadSanitizer-Unit :: rtl/./TsanRtlTest-x86_64-Test/ThreadSanitizer.ThreadSync (1979 of 2873)
PASS: ThreadSanitizer-Unit :: rtl/./TsanRtlTest-x86_64-Test/ThreadSanitizer.WriteThenLockedRead (1980 of 2873)
PASS: ThreadSanitizer-Unit :: rtl/./TsanRtlTest-x86_64-Test/ThreadSanitizer.WriteWriteRace (1981 of 2873)
PASS: ThreadSanitizer-Unit :: rtl/./TsanRtlTest-x86_64-Test/ThreadSanitizer.WriteThenRead (1982 of 2873)
PASS: ThreadSanitizer-Unit :: unit/./TsanUnitTest-x86_64-Test/Clock.AcquireRelease (1983 of 2873)
PASS: ThreadSanitizer-Unit :: unit/./TsanUnitTest-x86_64-Test/Clock.ChunkedBasic (1984 of 2873)
PASS: ThreadSanitizer-Unit :: unit/./TsanUnitTest-x86_64-Test/Clock.DifferentSizes (1985 of 2873)
PASS: ThreadSanitizer-Unit :: unit/./TsanUnitTest-x86_64-Test/Clock.Fuzzer (1986 of 2873)
PASS: ThreadSanitizer-Unit :: unit/./TsanUnitTest-x86_64-Test/Clock.Growth (1987 of 2873)
PASS: ThreadSanitizer-Unit :: unit/./TsanUnitTest-x86_64-Test/Clock.Growth2 (1988 of 2873)
PASS: ThreadSanitizer-Unit :: unit/./TsanUnitTest-x86_64-Test/Clock.Iter (1989 of 2873)
PASS: ThreadSanitizer-Unit :: unit/./TsanUnitTest-x86_64-Test/Clock.ManyThreads (1990 of 2873)
PASS: ThreadSanitizer-Unit :: unit/./TsanUnitTest-x86_64-Test/Clock.RepeatedAcquire (1991 of 2873)
PASS: ThreadSanitizer-Unit :: unit/./TsanUnitTest-x86_64-Test/Clock.VectorBasic (1992 of 2873)
PASS: ThreadSanitizer-Unit :: unit/./TsanUnitTest-x86_64-Test/Flags.Basic (1993 of 2873)
PASS: ThreadSanitizer-Unit :: unit/./TsanUnitTest-x86_64-Test/Flags.DefaultValues (1994 of 2873)
PASS: ThreadSanitizer-Unit :: unit/./TsanUnitTest-x86_64-Test/Flags.ParseDefaultOptions (1995 of 2873)
PASS: ThreadSanitizer-Unit :: unit/./TsanUnitTest-x86_64-Test/Flags.ParseEnvOptions (1996 of 2873)
PASS: ThreadSanitizer-Unit :: unit/./TsanUnitTest-x86_64-Test/Flags.ParsePriority (1997 of 2873)
PASS: ThreadSanitizer-Unit :: unit/./TsanUnitTest-x86_64-Test/MetaMap.Basic (1998 of 2873)
PASS: ThreadSanitizer-Unit :: unit/./TsanUnitTest-x86_64-Test/MetaMap.FreeRange (1999 of 2873)
PASS: ThreadSanitizer-Unit :: unit/./TsanUnitTest-x86_64-Test/MetaMap.MoveMemory (2000 of 2873)
PASS: ThreadSanitizer-Unit :: unit/./TsanUnitTest-x86_64-Test/MetaMap.ResetSync (2001 of 2873)
PASS: ThreadSanitizer-Unit :: unit/./TsanUnitTest-x86_64-Test/MetaMap.Sync (2002 of 2873)
PASS: ThreadSanitizer-Unit :: unit/./TsanUnitTest-x86_64-Test/Mman.AlignedAlloc (2003 of 2873)
PASS: ThreadSanitizer-Unit :: unit/./TsanUnitTest-x86_64-Test/Mman.Internal (2004 of 2873)
PASS: ThreadSanitizer-Unit :: unit/./TsanUnitTest-x86_64-Test/Mman.PosixMemalign (2005 of 2873)
PASS: ThreadSanitizer-Unit :: unit/./TsanUnitTest-x86_64-Test/Mman.Stats (2006 of 2873)
PASS: ThreadSanitizer-Unit :: unit/./TsanUnitTest-x86_64-Test/Mman.UsableSize (2007 of 2873)
PASS: ThreadSanitizer-Unit :: unit/./TsanUnitTest-x86_64-Test/Mman.User (2008 of 2873)
PASS: ThreadSanitizer-Unit :: unit/./TsanUnitTest-x86_64-Test/Mman.Memalign (2009 of 2873)
PASS: ThreadSanitizer-Unit :: unit/./TsanUnitTest-x86_64-Test/Mman.UserRealloc (2010 of 2873)
PASS: ThreadSanitizer-Unit :: unit/./TsanUnitTest-x86_64-Test/Mman.Valloc (2011 of 2873)
PASS: ThreadSanitizer-Unit :: unit/./TsanUnitTest-x86_64-Test/Mutex.ReadWrite (2012 of 2873)
PASS: ThreadSanitizer-Unit :: unit/./TsanUnitTest-x86_64-Test/Mutex.SpinWrite (2013 of 2873)
PASS: ThreadSanitizer-Unit :: unit/./TsanUnitTest-x86_64-Test/Shadow.Celling (2014 of 2873)
PASS: ThreadSanitizer-Unit :: unit/./TsanUnitTest-x86_64-Test/Mutex.Write (2015 of 2873)
PASS: ThreadSanitizer-Unit :: unit/./TsanUnitTest-x86_64-Test/Shadow.FastState (2016 of 2873)
PASS: ThreadSanitizer-Unit :: unit/./TsanUnitTest-x86_64-Test/Shadow.Mapping (2017 of 2873)
PASS: ThreadSanitizer-Unit :: unit/./TsanUnitTest-x86_64-Test/StackTrace.BasicBuffered (2018 of 2873)
PASS: ThreadSanitizer-Unit :: unit/./TsanUnitTest-x86_64-Test/StackTrace.BasicVarSize (2019 of 2873)
PASS: ThreadSanitizer-Unit :: unit/./TsanUnitTest-x86_64-Test/StackTrace.TrimBuffered (2020 of 2873)
PASS: ThreadSanitizer-Unit :: unit/./TsanUnitTest-x86_64-Test/StackTrace.TrimVarSize (2021 of 2873)
PASS: ThreadSanitizer-x86_64 :: Darwin/dlopen.cpp (2022 of 2873)
PASS: ThreadSanitizer-x86_64 :: Darwin/debug_external.cpp (2023 of 2873)
PASS: ThreadSanitizer-x86_64 :: Darwin/deadlock.mm (2024 of 2873)
PASS: ThreadSanitizer-x86_64 :: Darwin/external-lib.cpp (2025 of 2873)
PASS: ThreadSanitizer-x86_64 :: Darwin/external-noninstrumented-module.cpp (2026 of 2873)
PASS: ThreadSanitizer-x86_64 :: Darwin/external-dups.cpp (2027 of 2873)
PASS: ThreadSanitizer-x86_64 :: Darwin/external-ignore-noninstrumented.cpp (2028 of 2873)
PASS: ThreadSanitizer-x86_64 :: Darwin/external-swift-debugging.cpp (2029 of 2873)
PASS: ThreadSanitizer-x86_64 :: Darwin/external-swift.cpp (2030 of 2873)
PASS: ThreadSanitizer-x86_64 :: Darwin/gcd-sync-block-copy.mm (2031 of 2873)
PASS: ThreadSanitizer-x86_64 :: Darwin/libcxx-call-once.mm (2032 of 2873)
PASS: ThreadSanitizer-x86_64 :: Darwin/external.cpp (2033 of 2873)
PASS: ThreadSanitizer-x86_64 :: Darwin/ignore-noninstrumented.mm (2034 of 2873)
PASS: ThreadSanitizer-x86_64 :: Darwin/libcxx-future.mm (2035 of 2873)
PASS: ThreadSanitizer-x86_64 :: Darwin/libcxx-shared-ptr-recursive.mm (2036 of 2873)
FAIL: ThreadSanitizer-x86_64 :: Darwin/mach_vm_allocate.c (2037 of 2873)
******************** TEST 'ThreadSanitizer-x86_64 :: Darwin/mach_vm_allocate.c' FAILED ********************
Script:
--
: 'RUN: at line 3';      /Users/buildslave/jenkins/workspace/test-mr-clang-stage1-RA/clang-build/./bin/clang  -fsanitize=thread -Wall  -arch x86_64 -stdlib=libc++ -mmacosx-version-min=10.9 -isysroot /Applications/Xcode.app/Contents/Developer/Platforms/MacOSX.platform/Developer/SDKs/MacOSX10.14.sdk   -gline-tables-only -I/Users/buildslave/jenkins/workspace/test-mr-clang-stage1-RA/llvm/projects/compiler-rt/test/tsan/../ /Users/buildslave/jenkins/workspace/test-mr-clang-stage1-RA/llvm/projects/compiler-rt/test/tsan/Darwin/mach_vm_allocate.c -o /Users/buildslave/jenkins/workspace/test-mr-clang-stage1-RA/clang-build/tools/clang/runtime/compiler-rt-bins/test/tsan/X86_64Config/Darwin/Output/mach_vm_allocate.c.tmp
: 'RUN: at line 4';    /Users/buildslave/jenkins/workspace/test-mr-clang-stage1-RA/clang-build/tools/clang/runtime/compiler-rt-bins/test/tsan/X86_64Config/Darwin/Output/mach_vm_allocate.c.tmp 2>&1 | FileCheck /Users/buildslave/jenkins/workspace/test-mr-clang-stage1-RA/llvm/projects/compiler-rt/test/tsan/Darwin/mach_vm_allocate.c --implicit-check-not='ThreadSanitizer'
--
Exit Code: 1

Hide Details

Command Output (stderr): -- /Users/buildslave/jenkins/workspace/test-mr-clang-stage1-RA/llvm/projects/compiler-rt/test/tsan/Darwin/mach_vm_allocate.c:68:11: error: CHECK: expected string not found in input // CHECK: Done. ^ <stdin>:1:1: note: scanning from here Assertion failed: (res == KERN_SUCCESS), function alloc_fixed, file /Users/buildslave/jenkins/workspace/test-mr-clang-stage1-RA/llvm/projects/compiler-rt/test/tsan/Darwin/mach_vm_allocate.c, line 29. ^ <stdin>:1:7: note: possible intended match here Assertion failed: (res == KERN_SUCCESS), function alloc_fixed, file /Users/buildslave/jenkins/workspace/test-mr-clang-stage1-RA/llvm/projects/compiler-rt/test/tsan/Darwin/mach_vm_allocate.c, line 29. ^

Hide Details

--

Hide Details

******************** PASS: ThreadSanitizer-x86_64 :: Darwin/libcxx-shared-ptr-stress.mm (2038 of 2873) PASS: ThreadSanitizer-x86_64 :: Darwin/malloc-stack-logging.cpp (2039 of 2873) PASS: ThreadSanitizer-x86_64 :: Darwin/libcxx-shared-ptr.mm (2040 of 2873) PASS: ThreadSanitizer-x86_64 :: Darwin/malloc_size.mm (2041 of 2873) PASS: ThreadSanitizer-x86_64 :: Darwin/main_tid.mm (2042 of 2873) PASS: ThreadSanitizer-x86_64 :: Darwin/norace-objcxx-run-time.mm (2043 of 2873) PASS: ThreadSanitizer-x86_64 :: Darwin/objc-simple.mm (2044 of 2873) PASS: ThreadSanitizer-x86_64 :: Darwin/objc-race.mm (2045 of 2873) PASS: ThreadSanitizer-x86_64 :: Darwin/objc-synchronize-cycle-tagged.mm (2046 of 2873) PASS: ThreadSanitizer-x86_64 :: Darwin/objc-double-property.mm (2047 of 2873) PASS: ThreadSanitizer-x86_64 :: Darwin/objc-synchronize-cycle.mm (2048 of 2873) PASS: ThreadSanitizer-x86_64 :: Darwin/objc-synchronize-nested-recursive.mm (2049 of 2873) PASS: ThreadSanitizer-x86_64 :: Darwin/os_unfair_lock.c (2050 of 2873) PASS: ThreadSanitizer-x86_64 :: Darwin/objc-synchronize-tagged.mm (2051 of 2873) PASS: ThreadSanitizer-x86_64 :: Darwin/objc-synchronize.mm (2052 of 2873) PASS: ThreadSanitizer-x86_64 :: Darwin/osatomics-bitops.mm (2053 of 2873) PASS: ThreadSanitizer-x86_64 :: Darwin/osatomics-add.mm (2054 of 2873) PASS: ThreadSanitizer-x86_64 :: Darwin/osspinlock-norace.cpp (2055 of 2873) PASS: ThreadSanitizer-x86_64 :: Darwin/realloc-zero.cpp (2056 of 2873) PASS: ThreadSanitizer-x86_64 :: Darwin/osatomics-list.mm (2057 of 2873) PASS: ThreadSanitizer-x86_64 :: Darwin/signals-blocked.cpp (2058 of 2873) PASS: ThreadSanitizer-x86_64 :: Darwin/symbolizer-dladdr.cpp (2059 of 2873) PASS: ThreadSanitizer-x86_64 :: Darwin/symbolizer-atos.cpp (2060 of 2873) PASS: ThreadSanitizer-x86_64 :: Darwin/workerthreads.mm (2061 of 2873) PASS: ThreadSanitizer-x86_64 :: Darwin/xpc-cancel.mm (2062 of 2873) UNSUPPORTED: ThreadSanitizer-x86_64 :: Linux/check_memcpy.c (2063 of 2873) UNSUPPORTED: ThreadSanitizer-x86_64 :: Linux/check_preinit.cpp (2064 of 2873) UNSUPPORTED: ThreadSanitizer-x86_64 :: Linux/double_race.cpp (2065 of 2873) UNSUPPORTED: ThreadSanitizer-x86_64 :: Linux/mutex_robust.cpp (2066 of 2873) UNSUPPORTED: ThreadSanitizer-x86_64 :: Linux/mutex_robust2.cpp (2067 of 2873) UNSUPPORTED: ThreadSanitizer-x86_64 :: Linux/pie_no_aslr.cpp (2068 of 2873) UNSUPPORTED: ThreadSanitizer-x86_64 :: Linux/thread_timedjoin.c (2069 of 2873) UNSUPPORTED: ThreadSanitizer-x86_64 :: Linux/thread_tryjoin.c (2070 of 2873) UNSUPPORTED: ThreadSanitizer-x86_64 :: Linux/user_fopen.cpp (2071 of 2873) UNSUPPORTED: ThreadSanitizer-x86_64 :: Linux/user_malloc.cpp (2072 of 2873) PASS: ThreadSanitizer-x86_64 :: Darwin/xpc-race.mm (2073 of 2873) PASS: ThreadSanitizer-x86_64 :: annotate_happens_before.cpp (2074 of 2873) PASS: ThreadSanitizer-x86_64 :: aligned_vs_unaligned_race.cpp (2075 of 2873) PASS: ThreadSanitizer-x86_64 :: atexit.cpp (2076 of 2873) PASS: ThreadSanitizer-x86_64 :: atexit2.cpp (2077 of 2873) PASS: ThreadSanitizer-x86_64 :: Darwin/xpc.mm (2078 of 2873) PASS: ThreadSanitizer-x86_64 :: atexit3.cpp (2079 of 2873) PASS: ThreadSanitizer-x86_64 :: atomic_free2.cpp (2080 of 2873) PASS: ThreadSanitizer-x86_64 :: atomic_free3.cpp (2081 of 2873) PASS: ThreadSanitizer-x86_64 :: atomic_hle.cpp (2082 of 2873) PASS: ThreadSanitizer-x86_64 :: atomic_norace.cpp (2083 of 2873) PASS: ThreadSanitizer-x86_64 :: atomic_race.cpp (2084 of 2873) PASS: ThreadSanitizer-x86_64 :: atomic_stack.cpp (2085 of 2873) UNSUPPORTED: ThreadSanitizer-x86_64 :: barrier.cpp (2086 of 2873) UNSUPPORTED: ThreadSanitizer-x86_64 :: bench_acquire_only.cpp (2087 of 2873) UNSUPPORTED: ThreadSanitizer-x86_64 :: bench_acquire_release.cpp (2088 of 2873) UNSUPPORTED: ThreadSanitizer-x86_64 :: bench_local_mutex.cpp (2089 of 2873) UNSUPPORTED: ThreadSanitizer-x86_64 :: bench_mutex.cpp (2090 of 2873) UNSUPPORTED: ThreadSanitizer-x86_64 :: bench_release_only.cpp (2091 of 2873) UNSUPPORTED: ThreadSanitizer-x86_64 :: bench_rwmutex.cpp (2092 of 2873) PASS: ThreadSanitizer-x86_64 :: bench_shadow_flush.cpp (2093 of 2873) UNSUPPORTED: ThreadSanitizer-x86_64 :: bench_single_writer.cpp (2094 of 2873) UNSUPPORTED: ThreadSanitizer-x86_64 :: bench_ten_mutexes.cpp (2095 of 2873) PASS: ThreadSanitizer-x86_64 :: atomic_store.cpp (2096 of 2873) PASS: ThreadSanitizer-x86_64 :: benign_race.cpp (2097 of 2873) PASS: ThreadSanitizer-x86_64 :: blacklist.cpp (2098 of 2873) PASS: ThreadSanitizer-x86_64 :: cond.c (2099 of 2873) PASS: ThreadSanitizer-x86_64 :: blacklist2.cpp (2100 of 2873) PASS: ThreadSanitizer-x86_64 :: cond_cancel.c (2101 of 2873) PASS: ThreadSanitizer-x86_64 :: cond_destruction.cpp (2102 of 2873) UNSUPPORTED: ThreadSanitizer-x86_64 :: cond_version.c (2103 of 2873) PASS: ThreadSanitizer-x86_64 :: cond_race.cpp (2104 of 2873) PASS: ThreadSanitizer-x86_64 :: custom_mutex0.cpp (2105 of 2873) PASS: ThreadSanitizer-x86_64 :: atomic_free.cpp (2106 of 2873) PASS: ThreadSanitizer-x86_64 :: custom_mutex3.cpp (2107 of 2873) PASS: ThreadSanitizer-x86_64 :: custom_mutex1.cpp (2108 of 2873) PASS: ThreadSanitizer-x86_64 :: custom_mutex2.cpp (2109 of 2873) PASS: ThreadSanitizer-x86_64 :: custom_mutex4.cpp (2110 of 2873) PASS: ThreadSanitizer-x86_64 :: cxa_guard_acquire.cpp (2111 of 2873) UNSUPPORTED: ThreadSanitizer-x86_64 :: debug_alloc_stack.cpp (2112 of 2873) PASS: ThreadSanitizer-x86_64 :: custom_mutex5.cpp (2113 of 2873) PASS: ThreadSanitizer-x86_64 :: debug_locate.cpp (2114 of 2873) PASS: ThreadSanitizer-x86_64 :: debugging.cpp (2115 of 2873) PASS: ThreadSanitizer-x86_64 :: default_options.cpp (2116 of 2873) UNSUPPORTED: ThreadSanitizer-x86_64 :: dl_iterate_phdr.cpp (2117 of 2873) PASS: ThreadSanitizer-x86_64 :: dlclose.cpp (2118 of 2873) PASS: ThreadSanitizer-x86_64 :: deep_stack1.cpp (2119 of 2873) PASS: ThreadSanitizer-x86_64 :: dtls.c (2120 of 2873) PASS: ThreadSanitizer-x86_64 :: exceptions.cpp (2121 of 2873) PASS: ThreadSanitizer-x86_64 :: fd_close_norace.cpp (2122 of 2873) PASS: ThreadSanitizer-x86_64 :: fd_close_norace2.cpp (2123 of 2873) PASS: ThreadSanitizer-x86_64 :: fd_dup_norace.cpp (2124 of 2873) PASS: ThreadSanitizer-x86_64 :: fd_dup_norace2.cpp (2125 of 2873) PASS: ThreadSanitizer-x86_64 :: fd_dup_race.cpp (2126 of 2873) PASS: ThreadSanitizer-x86_64 :: fd_location.cpp (2127 of 2873) PASS: ThreadSanitizer-x86_64 :: fd_pipe_norace.cpp (2128 of 2873) PASS: ThreadSanitizer-x86_64 :: fd_socket_connect_norace.cpp (2129 of 2873) PASS: ThreadSanitizer-x86_64 :: fd_socket_norace.cpp (2130 of 2873) PASS: ThreadSanitizer-x86_64 :: fd_pipe_race.cpp (2131 of 2873) PASS: ThreadSanitizer-x86_64 :: fd_socketpair_norace.cpp (2132 of 2873) PASS: ThreadSanitizer-x86_64 :: deadlock_detector_stress_test.cpp (2133 of 2873) PASS: ThreadSanitizer-x86_64 :: fd_stdout_race.cpp (2134 of 2873) PASS: ThreadSanitizer-x86_64 :: fiber_asm.cpp (2135 of 2873) PASS: ThreadSanitizer-x86_64 :: fd_tid_recycled.cpp (2136 of 2873) PASS: ThreadSanitizer-x86_64 :: fiber_from_thread.cpp (2137 of 2873) PASS: ThreadSanitizer-x86_64 :: fiber_longjmp.cpp (2138 of 2873) PASS: ThreadSanitizer-x86_64 :: fiber_simple.cpp (2139 of 2873) PASS: ThreadSanitizer-x86_64 :: fiber_two_threads.cpp (2140 of 2873) PASS: ThreadSanitizer-x86_64 :: fiber_race.cpp (2141 of 2873) PASS: ThreadSanitizer-x86_64 :: fork_atexit.cpp (2142 of 2873) PASS: ThreadSanitizer-x86_64 :: fork_multithreaded3.cpp (2143 of 2873) PASS: ThreadSanitizer-x86_64 :: fork_multithreaded.cpp (2144 of 2873) PASS: ThreadSanitizer-x86_64 :: free_race2.c (2145 of 2873) PASS: ThreadSanitizer-x86_64 :: free_race.c (2146 of 2873) PASS: ThreadSanitizer-x86_64 :: getline_nohang.cpp (2147 of 2873) PASS: ThreadSanitizer-x86_64 :: fork_deadlock.cpp (2148 of 2873) PASS: ThreadSanitizer-x86_64 :: global_race2.cpp (2149 of 2873) PASS: ThreadSanitizer-x86_64 :: global_race3.cpp (2150 of 2873) PASS: ThreadSanitizer-x86_64 :: halt_on_error.cpp (2151 of 2873) PASS: ThreadSanitizer-x86_64 :: heap_race.cpp (2152 of 2873) PASS: ThreadSanitizer-x86_64 :: ignore_free.cpp (2153 of 2873) PASS: ThreadSanitizer-x86_64 :: ignore_lib0.cpp (2154 of 2873) PASS: ThreadSanitizer-x86_64 :: ignore_lib1.cpp (2155 of 2873) PASS: ThreadSanitizer-x86_64 :: ignore_lib2.cpp (2156 of 2873) PASS: ThreadSanitizer-x86_64 :: ignore_lib3.cpp (2157 of 2873) PASS: ThreadSanitizer-x86_64 :: global_race.cpp (2158 of 2873) PASS: ThreadSanitizer-x86_64 :: ignore_malloc.cpp (2159 of 2873) PASS: ThreadSanitizer-x86_64 :: ignore_lib5.cpp (2160 of 2873) PASS: ThreadSanitizer-x86_64 :: ignore_race.cpp (2161 of 2873) PASS: ThreadSanitizer-x86_64 :: ignore_lib4.cpp (2162 of 2873) PASS: ThreadSanitizer-x86_64 :: ignore_sync.cpp (2163 of 2873) PASS: ThreadSanitizer-x86_64 :: ignored-interceptors-mmap.cpp (2164 of 2873) PASS: ThreadSanitizer-x86_64 :: inlined_memcpy_race.cpp (2165 of 2873) PASS: ThreadSanitizer-x86_64 :: interface_atomic_test.c (2166 of 2873) PASS: ThreadSanitizer-x86_64 :: inlined_memcpy_race2.cpp (2167 of 2873) PASS: ThreadSanitizer-x86_64 :: java_alloc.cpp (2168 of 2873) PASS: ThreadSanitizer-x86_64 :: java_finalizer.cpp (2169 of 2873) PASS: ThreadSanitizer-x86_64 :: java_find.cpp (2170 of 2873) PASS: ThreadSanitizer-x86_64 :: java_heap_init.cpp (2171 of 2873) PASS: ThreadSanitizer-x86_64 :: java_lock.cpp (2172 of 2873) PASS: ThreadSanitizer-x86_64 :: java_lock_move.cpp (2173 of 2873) PASS: ThreadSanitizer-x86_64 :: java_lock_rec.cpp (2174 of 2873) PASS: ThreadSanitizer-x86_64 :: java_move_overlap.cpp (2175 of 2873) PASS: ThreadSanitizer-x86_64 :: java_lock_rec_race.cpp (2176 of 2873) PASS: ThreadSanitizer-x86_64 :: java_race.cpp (2177 of 2873) PASS: ThreadSanitizer-x86_64 :: java_race_move.cpp (2178 of 2873) PASS: ThreadSanitizer-x86_64 :: java_move_overlap_race.cpp (2179 of 2873) PASS: ThreadSanitizer-x86_64 :: java_rwlock.cpp (2180 of 2873) PASS: ThreadSanitizer-x86_64 :: java_race_pc.cpp (2181 of 2873) PASS: ThreadSanitizer-x86_64 :: java_symbolization.cpp (2182 of 2873) PASS: ThreadSanitizer-x86_64 :: java_volatile.cpp (2183 of 2873) PASS: ThreadSanitizer-x86_64 :: java_symbolization_legacy.cpp (2184 of 2873) PASS: ThreadSanitizer-x86_64 :: libdispatch/after.c (2185 of 2873) PASS: ThreadSanitizer-x86_64 :: libcxx/std_shared_ptr.cpp (2186 of 2873) PASS: ThreadSanitizer-x86_64 :: libdispatch/apply.c (2187 of 2873) PASS: ThreadSanitizer-x86_64 :: large_malloc_meta.cpp (2188 of 2873) PASS: ThreadSanitizer-x86_64 :: libdispatch/apply-race.c (2189 of 2873) PASS: ThreadSanitizer-x86_64 :: libdispatch/async-norace.c (2190 of 2873) PASS: ThreadSanitizer-x86_64 :: libdispatch/barrier.c (2191 of 2873) PASS: ThreadSanitizer-x86_64 :: libdispatch/async-race.c (2192 of 2873) PASS: ThreadSanitizer-x86_64 :: libdispatch/blocks.c (2193 of 2873) PASS: ThreadSanitizer-x86_64 :: libdispatch/barrier-race.c (2194 of 2873) PASS: ThreadSanitizer-x86_64 :: libdispatch/data.c (2195 of 2873) PASS: ThreadSanitizer-x86_64 :: libdispatch/fd.c (2196 of 2873) PASS: ThreadSanitizer-x86_64 :: libdispatch/dispatch_main.c (2197 of 2873) PASS: ThreadSanitizer-x86_64 :: libdispatch/dispatch_once_deadlock.c (2198 of 2873) PASS: ThreadSanitizer-x86_64 :: libdispatch/groups-destructor.cpp (2199 of 2873) PASS: ThreadSanitizer-x86_64 :: libdispatch/groups-leave.c (2200 of 2873) PASS: ThreadSanitizer-x86_64 :: libdispatch/groups-norace.c (2201 of 2873) PASS: ThreadSanitizer-x86_64 :: libdispatch/io-barrier.c (2202 of 2873) PASS: ThreadSanitizer-x86_64 :: libdispatch/io-cleanup.c (2203 of 2873) PASS: ThreadSanitizer-x86_64 :: libdispatch/io-barrier-race.c (2204 of 2873) PASS: ThreadSanitizer-x86_64 :: libdispatch/groups-stress.c (2205 of 2873) PASS: ThreadSanitizer-x86_64 :: libdispatch/io.c (2206 of 2873) PASS: ThreadSanitizer-x86_64 :: libdispatch/once.c (2207 of 2873) PASS: ThreadSanitizer-x86_64 :: libdispatch/semaphore-norace.c (2208 of 2873) PASS: ThreadSanitizer-x86_64 :: libdispatch/io-race.c (2209 of 2873) PASS: ThreadSanitizer-x86_64 :: libdispatch/serial-queue-norace.c (2210 of 2873) PASS: ThreadSanitizer-x86_64 :: libdispatch/source-cancel.c (2211 of 2873) PASS: ThreadSanitizer-x86_64 :: libdispatch/source-cancel2.c (2212 of 2873) PASS: ThreadSanitizer-x86_64 :: libdispatch/source-event.c (2213 of 2873) PASS: ThreadSanitizer-x86_64 :: libdispatch/source-event2.c (2214 of 2873) PASS: ThreadSanitizer-x86_64 :: libdispatch/source-registration.c (2215 of 2873) PASS: ThreadSanitizer-x86_64 :: libdispatch/source-registration2.c (2216 of 2873) PASS: ThreadSanitizer-x86_64 :: libdispatch/suspend.c (2217 of 2873) PASS: ThreadSanitizer-x86_64 :: libdispatch/source-serial.c (2218 of 2873) PASS: ThreadSanitizer-x86_64 :: libdispatch/sync-norace.c (2219 of 2873) PASS: ThreadSanitizer-x86_64 :: libdispatch/sync-block-copy.cpp (2220 of 2873) PASS: ThreadSanitizer-x86_64 :: libdispatch/target-queue-norace.c (2221 of 2873) PASS: ThreadSanitizer-x86_64 :: longjmp.cpp (2222 of 2873) PASS: ThreadSanitizer-x86_64 :: libdispatch/sync-race.c (2223 of 2873) PASS: ThreadSanitizer-x86_64 :: longjmp2.cpp (2224 of 2873) PASS: ThreadSanitizer-x86_64 :: load_shared_lib.cpp (2225 of 2873) PASS: ThreadSanitizer-x86_64 :: longjmp3.cpp (2226 of 2873) PASS: ThreadSanitizer-x86_64 :: longjmp4.cpp (2227 of 2873) PASS: ThreadSanitizer-x86_64 :: malloc_overflow.cpp (2228 of 2873) UNSUPPORTED: ThreadSanitizer-x86_64 :: map32bit.cpp (2229 of 2873) PASS: ThreadSanitizer-x86_64 :: lots_of_threads.c (2230 of 2873) PASS: ThreadSanitizer-x86_64 :: malloc_stack.cpp (2231 of 2873) PASS: ThreadSanitizer-x86_64 :: memcmp_race.cpp (2232 of 2873) PASS: ThreadSanitizer-x86_64 :: memcpy_race.cpp (2233 of 2873) PASS: ThreadSanitizer-x86_64 :: mmap_large.cpp (2234 of 2873) PASS: ThreadSanitizer-x86_64 :: mmap_stress.cpp (2235 of 2873) PASS: ThreadSanitizer-x86_64 :: mop1.c (2236 of 2873) XFAIL: ThreadSanitizer-x86_64 :: must_deadlock.cpp (2237 of 2873) PASS: ThreadSanitizer-x86_64 :: mop_with_offset.cpp (2238 of 2873) PASS: ThreadSanitizer-x86_64 :: mop_with_offset2.cpp (2239 of 2873) PASS: ThreadSanitizer-x86_64 :: mutex_annotations.cpp (2240 of 2873) PASS: ThreadSanitizer-x86_64 :: mutex_bad_read_lock.cpp (2241 of 2873) PASS: ThreadSanitizer-x86_64 :: mutex_bad_read_unlock.cpp (2242 of 2873) PASS: ThreadSanitizer-x86_64 :: mutex_bad_unlock.cpp (2243 of 2873) PASS: ThreadSanitizer-x86_64 :: mutex_destroy_locked.cpp (2244 of 2873) PASS: ThreadSanitizer-x86_64 :: mutex_destroy_locked2.cpp (2245 of 2873) PASS: ThreadSanitizer-x86_64 :: mutex_double_lock.cpp (2246 of 2873) PASS: ThreadSanitizer-x86_64 :: mutex_cycle2.c (2247 of 2873) PASS: ThreadSanitizer-x86_64 :: mutex_cycle_long.c (2248 of 2873) PASS: ThreadSanitizer-x86_64 :: mutexset1.cpp (2249 of 2873) PASS: ThreadSanitizer-x86_64 :: mutexset2.cpp (2250 of 2873) PASS: ThreadSanitizer-x86_64 :: mutex_lock_destroyed.cpp (2251 of 2873) PASS: ThreadSanitizer-x86_64 :: mutexset3.cpp (2252 of 2873) PASS: ThreadSanitizer-x86_64 :: mutexset4.cpp (2253 of 2873) PASS: ThreadSanitizer-x86_64 :: mutexset5.cpp (2254 of 2873) PASS: ThreadSanitizer-x86_64 :: mutexset6.cpp (2255 of 2873) PASS: ThreadSanitizer-x86_64 :: pie_test.cpp (2256 of 2873) PASS: ThreadSanitizer-x86_64 :: mutexset7.cpp (2257 of 2873) PASS: ThreadSanitizer-x86_64 :: mutexset8.cpp (2258 of 2873) PASS: ThreadSanitizer-x86_64 :: printf-1.c (2259 of 2873) UNSUPPORTED: ThreadSanitizer-x86_64 :: race_on_barrier.c (2260 of 2873) UNSUPPORTED: ThreadSanitizer-x86_64 :: race_on_barrier2.c (2261 of 2873) PASS: ThreadSanitizer-x86_64 :: pthread_key.cpp (2262 of 2873) PASS: ThreadSanitizer-x86_64 :: pthread_atfork_deadlock.c (2263 of 2873) PASS: ThreadSanitizer-x86_64 :: race_on_fputs.cpp (2264 of 2873) PASS: ThreadSanitizer-x86_64 :: race_on_heap.cpp (2265 of 2873) PASS: ThreadSanitizer-x86_64 :: race_on_mutex.c (2266 of 2873) PASS: ThreadSanitizer-x86_64 :: race_on_mutex2.c (2267 of 2873) PASS: ThreadSanitizer-x86_64 :: race_on_puts.cpp (2268 of 2873) PASS: ThreadSanitizer-x86_64 :: race_on_read.cpp (2269 of 2873) PASS: ThreadSanitizer-x86_64 :: race_on_speculative_load.cpp (2270 of 2873) PASS: ThreadSanitizer-x86_64 :: race_on_write.cpp (2271 of 2873) PASS: ThreadSanitizer-x86_64 :: race_stress.cpp (2272 of 2873) PASS: ThreadSanitizer-x86_64 :: race_top_suppression.cpp (2273 of 2873) PASS: ThreadSanitizer-x86_64 :: race_top_suppression1.cpp (2274 of 2873) PASS: ThreadSanitizer-x86_64 :: real_deadlock_detector_stress_test.cpp (2275 of 2873) PASS: ThreadSanitizer-x86_64 :: race_with_finished_thread.cpp (2276 of 2873) PASS: ThreadSanitizer-x86_64 :: setuid.c (2277 of 2873) PASS: ThreadSanitizer-x86_64 :: signal_block.cpp (2278 of 2873) PASS: ThreadSanitizer-x86_64 :: restore_stack.cpp (2279 of 2873) PASS: ThreadSanitizer-x86_64 :: setuid2.c (2280 of 2873) PASS: ThreadSanitizer-x86_64 :: signal_cond.cpp (2281 of 2873) PASS: ThreadSanitizer-x86_64 :: signal_longjmp.cpp (2282 of 2873) PASS: ThreadSanitizer-x86_64 :: signal_errno.cpp (2283 of 2873) UNSUPPORTED: ThreadSanitizer-x86_64 :: signal_recursive.cpp (2284 of 2873) UNSUPPORTED: ThreadSanitizer-x86_64 :: signal_reset.cpp (2285 of 2873) UNSUPPORTED: ThreadSanitizer-x86_64 :: signal_sync.cpp (2286 of 2873) UNSUPPORTED: ThreadSanitizer-x86_64 :: signal_sync2.cpp (2287 of 2873) UNSUPPORTED: ThreadSanitizer-x86_64 :: signal_thread.cpp (2288 of 2873) PASS: ThreadSanitizer-x86_64 :: signal_pause.cpp (2289 of 2873) PASS: ThreadSanitizer-x86_64 :: sigsuspend.cpp (2290 of 2873) PASS: ThreadSanitizer-x86_64 :: signal_malloc.cpp (2291 of 2873) PASS: ThreadSanitizer-x86_64 :: signal_write.cpp (2292 of 2873) PASS: ThreadSanitizer-x86_64 :: simple_race.c (2293 of 2873) PASS: ThreadSanitizer-x86_64 :: simple_race.cpp (2294 of 2873) PASS: ThreadSanitizer-x86_64 :: simple_stack2.cpp (2295 of 2873) PASS: ThreadSanitizer-x86_64 :: sleep_sync.cpp (2296 of 2873) PASS: ThreadSanitizer-x86_64 :: simple_stack.c (2297 of 2873) PASS: ThreadSanitizer-x86_64 :: sleep_sync2.cpp (2298 of 2873) PASS: ThreadSanitizer-x86_64 :: stack_sync_reuse.cpp (2299 of 2873) PASS: ThreadSanitizer-x86_64 :: stack_race.cpp (2300 of 2873) PASS: ThreadSanitizer-x86_64 :: stack_race2.cpp (2301 of 2873) PASS: ThreadSanitizer-x86_64 :: static_init1.cpp (2302 of 2873) PASS: ThreadSanitizer-x86_64 :: static_init2.cpp (2303 of 2873) PASS: ThreadSanitizer-x86_64 :: static_init4.cpp (2304 of 2873) PASS: ThreadSanitizer-x86_64 :: static_init5.cpp (2305 of 2873) UNSUPPORTED: ThreadSanitizer-x86_64 :: strerror_r.cpp (2306 of 2873) UNSUPPORTED: ThreadSanitizer-x86_64 :: sunrpc.cpp (2307 of 2873) PASS: ThreadSanitizer-x86_64 :: static_init6.cpp (2308 of 2873) PASS: ThreadSanitizer-x86_64 :: static_init3.cpp (2309 of 2873) PASS: ThreadSanitizer-x86_64 :: suppress_same_address.cpp (2310 of 2873) PASS: ThreadSanitizer-x86_64 :: suppress_same_stacks.cpp (2311 of 2873) PASS: ThreadSanitizer-x86_64 :: suppressions_global.cpp (2312 of 2873) PASS: ThreadSanitizer-x86_64 :: suppressions_mutex.cpp (2313 of 2873) PASS: ThreadSanitizer-x86_64 :: thread_detach.c (2314 of 2873) PASS: ThreadSanitizer-x86_64 :: suppressions_race.cpp (2315 of 2873) PASS: ThreadSanitizer-x86_64 :: suppressions_race2.cpp (2316 of 2873) PASS: ThreadSanitizer-x86_64 :: thread_detach2.c (2317 of 2873) PASS: ThreadSanitizer-x86_64 :: thread_end_with_ignore.cpp (2318 of 2873) PASS: ThreadSanitizer-x86_64 :: thread_end_with_ignore2.cpp (2319 of 2873) PASS: ThreadSanitizer-x86_64 :: thread_end_with_ignore3.cpp (2320 of 2873) PASS: ThreadSanitizer-x86_64 :: thread_exit.c (2321 of 2873) PASS: ThreadSanitizer-x86_64 :: thread_leak.c (2322 of 2873) PASS: ThreadSanitizer-x86_64 :: thread_leak2.c (2323 of 2873) PASS: ThreadSanitizer-x86_64 :: thread_leak4.c (2324 of 2873) PASS: ThreadSanitizer-x86_64 :: thread_leak3.c (2325 of 2873) UNSUPPORTED: ThreadSanitizer-x86_64 :: thread_name2.cpp (2326 of 2873) PASS: ThreadSanitizer-x86_64 :: thread_name.cpp (2327 of 2873) PASS: ThreadSanitizer-x86_64 :: thread_leak5.c (2328 of 2873) PASS: ThreadSanitizer-x86_64 :: tiny_race.c (2329 of 2873) PASS: ThreadSanitizer-x86_64 :: tls_race.cpp (2330 of 2873) PASS: ThreadSanitizer-x86_64 :: tls_race2.cpp (2331 of 2873) PASS: ThreadSanitizer-x86_64 :: unaligned_norace.cpp (2332 of 2873) PASS: ThreadSanitizer-x86_64 :: tsan-vs-gvn.cpp (2333 of 2873) PASS: ThreadSanitizer-x86_64 :: vfork.cpp (2334 of 2873) PASS: ThreadSanitizer-x86_64 :: virtual_inheritance_compile_bug.cpp (2335 of 2873) PASS: ThreadSanitizer-x86_64 :: unaligned_race.cpp (2336 of 2873) PASS: ThreadSanitizer-x86_64 :: vptr_benign_race.cpp (2337 of 2873) PASS: ThreadSanitizer-x86_64 :: vptr_harmful_race.cpp (2338 of 2873) PASS: ThreadSanitizer-x86_64 :: vptr_harmful_race2.cpp (2339 of 2873) PASS: ThreadSanitizer-x86_64 :: vptr_harmful_race3.cpp (2340 of 2873) PASS: UBSan-AddressSanitizer-x86_64 :: TestCases/Float/cast-overflow.cpp (2341 of 2873) PASS: ThreadSanitizer-x86_64 :: vptr_harmful_race4.cpp (2342 of 2873) PASS: ThreadSanitizer-x86_64 :: write_in_reader_lock.cpp (2343 of 2873) PASS: UBSan-AddressSanitizer-x86_64 :: TestCases/ImplicitConversion/integer-sign-change-blacklist.c (2344 of 2873) PASS: UBSan-AddressSanitizer-x86_64 :: TestCases/ImplicitConversion/integer-sign-change-summary.cpp (2345 of 2873) PASS: UBSan-AddressSanitizer-x86_64 :: TestCases/ImplicitConversion/integer-arithmetic-value-change.c (2346 of 2873) PASS: UBSan-AddressSanitizer-x86_64 :: TestCases/ImplicitConversion/integer-conversion.c (2347 of 2873) PASS: UBSan-AddressSanitizer-x86_64 :: TestCases/ImplicitConversion/integer-sign-change.c (2348 of 2873) PASS: UBSan-AddressSanitizer-x86_64 :: TestCases/ImplicitConversion/integer-truncation.c (2349 of 2873) PASS: UBSan-AddressSanitizer-x86_64 :: TestCases/ImplicitConversion/signed-integer-truncation-or-sign-change-summary.cpp (2350 of 2873) PASS: UBSan-AddressSanitizer-x86_64 :: TestCases/ImplicitConversion/signed-integer-truncation-summary.cpp (2351 of 2873) PASS: UBSan-AddressSanitizer-x86_64 :: TestCases/ImplicitConversion/signed-integer-truncation-blacklist.c (2352 of 2873) PASS: UBSan-AddressSanitizer-x86_64 :: TestCases/ImplicitConversion/signed-integer-truncation-or-sign-change-blacklist.c (2353 of 2873) PASS: UBSan-AddressSanitizer-x86_64 :: TestCases/ImplicitConversion/unsigned-integer-truncation-summary.cpp (2354 of 2873) PASS: UBSan-AddressSanitizer-x86_64 :: TestCases/ImplicitConversion/signed-integer-truncation.c (2355 of 2873) PASS: UBSan-AddressSanitizer-x86_64 :: TestCases/Integer/add-overflow.cpp (2356 of 2873) PASS: UBSan-AddressSanitizer-x86_64 :: TestCases/Integer/div-overflow.cpp (2357 of 2873) PASS: UBSan-AddressSanitizer-x86_64 :: TestCases/Integer/div-zero.cpp (2358 of 2873) PASS: UBSan-AddressSanitizer-x86_64 :: TestCases/ImplicitConversion/unsigned-integer-truncation.c (2359 of 2873) PASS: UBSan-AddressSanitizer-x86_64 :: TestCases/Integer/incdec-overflow.cpp (2360 of 2873) PASS: UBSan-AddressSanitizer-x86_64 :: TestCases/Integer/mul-overflow.cpp (2361 of 2873) PASS: UBSan-AddressSanitizer-x86_64 :: TestCases/ImplicitConversion/unsigned-integer-truncation-blacklist.c (2362 of 2873) PASS: UBSan-AddressSanitizer-x86_64 :: TestCases/Integer/negate-overflow.cpp (2363 of 2873) PASS: UBSan-AddressSanitizer-x86_64 :: TestCases/Integer/no-recover.cpp (2364 of 2873) PASS: UBSan-AddressSanitizer-x86_64 :: TestCases/Integer/summary.cpp (2365 of 2873) PASS: UBSan-AddressSanitizer-x86_64 :: TestCases/Integer/sub-overflow.cpp (2366 of 2873) PASS: UBSan-AddressSanitizer-x86_64 :: TestCases/Integer/uadd-overflow.cpp (2367 of 2873) PASS: UBSan-AddressSanitizer-x86_64 :: TestCases/Integer/uincdec-overflow.cpp (2368 of 2873) PASS: UBSan-AddressSanitizer-x86_64 :: TestCases/Integer/umul-overflow.cpp (2369 of 2873) PASS: UBSan-AddressSanitizer-x86_64 :: TestCases/Integer/suppressions.cpp (2370 of 2873) UNSUPPORTED: UBSan-AddressSanitizer-x86_64 :: TestCases/Misc/Linux/print_stack_trace.cpp (2371 of 2873) UNSUPPORTED: UBSan-AddressSanitizer-x86_64 :: TestCases/Misc/Linux/ubsan_options.cpp (2372 of 2873) PASS: UBSan-AddressSanitizer-x86_64 :: TestCases/Misc/bool.cpp (2373 of 2873) PASS: UBSan-AddressSanitizer-x86_64 :: TestCases/Integer/shift.cpp (2374 of 2873) PASS: UBSan-AddressSanitizer-x86_64 :: TestCases/Integer/usub-overflow.cpp (2375 of 2873) PASS: UBSan-AddressSanitizer-x86_64 :: TestCases/Misc/builtins.cpp (2376 of 2873) PASS: UBSan-AddressSanitizer-x86_64 :: TestCases/Misc/bounds.cpp (2377 of 2873) PASS: UBSan-AddressSanitizer-x86_64 :: TestCases/Misc/deduplication.cpp (2378 of 2873) PASS: UBSan-AddressSanitizer-x86_64 :: TestCases/Misc/enum.cpp (2379 of 2873) PASS: UBSan-AddressSanitizer-x86_64 :: TestCases/Misc/coverage-levels.cpp (2380 of 2873) PASS: UBSan-AddressSanitizer-x86_64 :: TestCases/Misc/log-path_test.cpp (2381 of 2873) UNSUPPORTED: UBSan-AddressSanitizer-x86_64 :: TestCases/Misc/no-interception.cpp (2382 of 2873) PASS: UBSan-AddressSanitizer-x86_64 :: TestCases/Misc/monitor.cpp (2383 of 2873) PASS: UBSan-AddressSanitizer-x86_64 :: TestCases/Misc/nonnull.cpp (2384 of 2873) PASS: UBSan-AddressSanitizer-x86_64 :: TestCases/Misc/nonnull-arg.cpp (2385 of 2873) PASS: UBSan-AddressSanitizer-x86_64 :: TestCases/Misc/nullability.c (2386 of 2873) PASS: UBSan-AddressSanitizer-x86_64 :: TestCases/Misc/print_summary.c (2387 of 2873) PASS: UBSan-AddressSanitizer-x86_64 :: TestCases/Misc/missing_return.cpp (2388 of 2873) PASS: UBSan-AddressSanitizer-x86_64 :: TestCases/Misc/vla.c (2389 of 2873) PASS: UBSan-AddressSanitizer-x86_64 :: TestCases/Misc/unreachable.cpp (2390 of 2873) PASS: UBSan-AddressSanitizer-x86_64 :: TestCases/Pointer/alignment-assumption-attribute-align_value-on-lvalue.cpp (2391 of 2873) PASS: UBSan-AddressSanitizer-x86_64 :: TestCases/Pointer/alignment-assumption-attribute-align_value-on-paramvar.cpp (2392 of 2873) PASS: UBSan-AddressSanitizer-x86_64 :: TestCases/Pointer/alignment-assumption-attribute-alloc_align-on-function-variable.cpp (2393 of 2873) PASS: UBSan-AddressSanitizer-x86_64 :: TestCases/Pointer/alignment-assumption-attribute-alloc_align-on-function.cpp (2394 of 2873) PASS: UBSan-AddressSanitizer-x86_64 :: TestCases/Pointer/alignment-assumption-blacklist.cpp (2395 of 2873) PASS: UBSan-AddressSanitizer-x86_64 :: TestCases/Pointer/alignment-assumption-attribute-assume_aligned-on-function-two-params.cpp (2396 of 2873) PASS: UBSan-AddressSanitizer-x86_64 :: TestCases/Pointer/alignment-assumption-attribute-assume_aligned-on-function.cpp (2397 of 2873) PASS: UBSan-AddressSanitizer-x86_64 :: TestCases/Pointer/alignment-assumption-builtin_assume_aligned-three-params.cpp (2398 of 2873) PASS: UBSan-AddressSanitizer-x86_64 :: TestCases/Pointer/alignment-assumption-builtin_assume_aligned-two-params.cpp (2399 of 2873) PASS: UBSan-AddressSanitizer-x86_64 :: TestCases/Pointer/alignment-assumption-builtin_assume_aligned-three-params-variable.cpp (2400 of 2873) PASS: UBSan-Minimal-x86_64 :: TestCases/implicit-integer-sign-change.c (2401 of 2873) PASS: UBSan-Minimal-x86_64 :: TestCases/alignment-assumption.c (2402 of 2873) PASS: UBSan-Minimal-x86_64 :: TestCases/implicit-signed-integer-truncation-or-sign-change.c (2403 of 2873) PASS: UBSan-Minimal-x86_64 :: TestCases/implicit-signed-integer-truncation.c (2404 of 2873) PASS: UBSan-Minimal-x86_64 :: TestCases/implicit-unsigned-integer-truncation.c (2405 of 2873) PASS: UBSan-Minimal-x86_64 :: TestCases/recover-dedup-limit.cpp (2406 of 2873) PASS: UBSan-Minimal-x86_64 :: TestCases/test-darwin-interface.c (2407 of 2873) PASS: UBSan-Minimal-x86_64 :: TestCases/recover-dedup.cpp (2408 of 2873) PASS: UBSan-AddressSanitizer-x86_64 :: TestCases/Pointer/alignment-assumption-summary.cpp (2409 of 2873) PASS: UBSan-Minimal-x86_64 :: TestCases/uadd-overflow.cpp (2410 of 2873) PASS: UBSan-AddressSanitizer-x86_64 :: TestCases/Pointer/index-overflow.cpp (2411 of 2873) PASS: UBSan-Standalone-x86_64 :: TestCases/Float/cast-overflow.cpp (2412 of 2873) UNSUPPORTED: UBSan-Standalone-x86_64 :: TestCases/ImplicitConversion/integer-sign-change-summary.cpp (2413 of 2873) PASS: UBSan-AddressSanitizer-x86_64 :: TestCases/Pointer/unsigned-index-expression.cpp (2414 of 2873) UNSUPPORTED: UBSan-AddressSanitizer-x86_64 :: TestCases/TypeCheck/Linux/PR33221.cpp (2415 of 2873) PASS: UBSan-AddressSanitizer-x86_64 :: TestCases/TypeCheck/PR33221.cpp (2416 of 2873) PASS: UBSan-Standalone-x86_64 :: TestCases/ImplicitConversion/integer-sign-change-blacklist.c (2417 of 2873) UNSUPPORTED: UBSan-Standalone-x86_64 :: TestCases/ImplicitConversion/signed-integer-truncation-or-sign-change-summary.cpp (2418 of 2873) UNSUPPORTED: UBSan-Standalone-x86_64 :: TestCases/ImplicitConversion/signed-integer-truncation-summary.cpp (2419 of 2873) PASS: UBSan-AddressSanitizer-x86_64 :: TestCases/Pointer/alignment-assumption-openmp.cpp (2420 of 2873) PASS: UBSan-Standalone-x86_64 :: TestCases/ImplicitConversion/integer-sign-change.c (2421 of 2873) UNSUPPORTED: UBSan-Standalone-x86_64 :: TestCases/ImplicitConversion/unsigned-integer-truncation-summary.cpp (2422 of 2873) PASS: UBSan-Standalone-x86_64 :: TestCases/ImplicitConversion/integer-truncation.c (2423 of 2873) PASS: UBSan-Standalone-x86_64 :: TestCases/ImplicitConversion/integer-arithmetic-value-change.c (2424 of 2873) PASS: UBSan-Standalone-x86_64 :: TestCases/ImplicitConversion/integer-conversion.c (2425 of 2873) PASS: UBSan-Standalone-x86_64 :: TestCases/Integer/div-overflow.cpp (2426 of 2873) PASS: UBSan-Standalone-x86_64 :: TestCases/Integer/add-overflow.cpp (2427 of 2873) PASS: UBSan-Standalone-x86_64 :: TestCases/ImplicitConversion/signed-integer-truncation-or-sign-change-blacklist.c (2428 of 2873) PASS: UBSan-Standalone-x86_64 :: TestCases/ImplicitConversion/signed-integer-truncation-blacklist.c (2429 of 2873) PASS: UBSan-Standalone-x86_64 :: TestCases/Integer/mul-overflow.cpp (2430 of 2873) PASS: UBSan-AddressSanitizer-x86_64 :: TestCases/TypeCheck/null.cpp (2431 of 2873) PASS: UBSan-Standalone-x86_64 :: TestCases/Integer/div-zero.cpp (2432 of 2873) UNSUPPORTED: UBSan-Standalone-x86_64 :: TestCases/Integer/summary.cpp (2433 of 2873) PASS: UBSan-Standalone-x86_64 :: TestCases/ImplicitConversion/signed-integer-truncation.c (2434 of 2873) PASS: UBSan-Standalone-x86_64 :: TestCases/Integer/incdec-overflow.cpp (2435 of 2873) PASS: UBSan-Standalone-x86_64 :: TestCases/Integer/negate-overflow.cpp (2436 of 2873) PASS: UBSan-Standalone-x86_64 :: TestCases/Integer/umul-overflow.cpp (2437 of 2873) PASS: UBSan-Standalone-x86_64 :: TestCases/Integer/no-recover.cpp (2438 of 2873) UNSUPPORTED: UBSan-Standalone-x86_64 :: TestCases/Misc/Linux/print_stack_trace.cpp (2439 of 2873) UNSUPPORTED: UBSan-Standalone-x86_64 :: TestCases/Misc/Linux/ubsan_options.cpp (2440 of 2873) PASS: UBSan-Standalone-x86_64 :: TestCases/Integer/sub-overflow.cpp (2441 of 2873) PASS: UBSan-AddressSanitizer-x86_64 :: TestCases/TypeCheck/vptr-corrupted-vtable-itanium.cpp (2442 of 2873) PASS: UBSan-Standalone-x86_64 :: TestCases/Misc/bool.cpp (2443 of 2873) PASS: UBSan-Standalone-x86_64 :: TestCases/Integer/uincdec-overflow.cpp (2444 of 2873) PASS: UBSan-Standalone-x86_64 :: TestCases/Integer/uadd-overflow.cpp (2445 of 2873) PASS: UBSan-Standalone-x86_64 :: TestCases/Misc/bounds.cpp (2446 of 2873) PASS: UBSan-Standalone-x86_64 :: TestCases/Misc/builtins.cpp (2447 of 2873) PASS: UBSan-Standalone-x86_64 :: TestCases/Integer/usub-overflow.cpp (2448 of 2873) PASS: UBSan-Standalone-x86_64 :: TestCases/Misc/deduplication.cpp (2449 of 2873) UNSUPPORTED: UBSan-Standalone-x86_64 :: TestCases/Misc/no-interception.cpp (2450 of 2873) PASS: UBSan-AddressSanitizer-x86_64 :: TestCases/TypeCheck/Function/function.cpp (2451 of 2873) PASS: UBSan-AddressSanitizer-x86_64 :: TestCases/TypeCheck/vptr-non-unique-typeinfo.cpp (2452 of 2873) PASS: UBSan-Standalone-x86_64 :: TestCases/Misc/monitor.cpp (2453 of 2873) PASS: UBSan-Standalone-x86_64 :: TestCases/Misc/enum.cpp (2454 of 2873) PASS: UBSan-Standalone-x86_64 :: TestCases/Misc/nonnull-arg.cpp (2455 of 2873) PASS: UBSan-AddressSanitizer-x86_64 :: TestCases/TypeCheck/vptr-virtual-base-construction.cpp (2456 of 2873) PASS: UBSan-Standalone-x86_64 :: TestCases/Misc/log-path_test.cpp (2457 of 2873) PASS: UBSan-Standalone-x86_64 :: TestCases/Misc/nullability.c (2458 of 2873) PASS: UBSan-Standalone-x86_64 :: TestCases/Misc/print_summary.c (2459 of 2873) PASS: UBSan-Standalone-x86_64 :: TestCases/Misc/nonnull.cpp (2460 of 2873) PASS: UBSan-AddressSanitizer-x86_64 :: TestCases/TypeCheck/vptr-virtual-base.cpp (2461 of 2873) PASS: UBSan-Standalone-x86_64 :: TestCases/Misc/vla.c (2462 of 2873) PASS: UBSan-Standalone-x86_64 :: TestCases/Misc/coverage-levels.cpp (2463 of 2873) PASS: UBSan-Standalone-x86_64 :: TestCases/Misc/unreachable.cpp (2464 of 2873) PASS: UBSan-Standalone-x86_64 :: TestCases/ImplicitConversion/unsigned-integer-truncation.c (2465 of 2873) PASS: UBSan-Standalone-x86_64 :: TestCases/Integer/shift.cpp (2466 of 2873) PASS: UBSan-Standalone-x86_64 :: TestCases/Pointer/alignment-assumption-blacklist.cpp (2467 of 2873) UNSUPPORTED: UBSan-Standalone-x86_64 :: TestCases/Pointer/alignment-assumption-summary.cpp (2468 of 2873) PASS: UBSan-Standalone-x86_64 :: TestCases/ImplicitConversion/unsigned-integer-truncation-blacklist.c (2469 of 2873) PASS: UBSan-AddressSanitizer-x86_64 :: TestCases/TypeCheck/misaligned.cpp (2470 of 2873) PASS: UBSan-Standalone-x86_64 :: TestCases/Pointer/unsigned-index-expression.cpp (2471 of 2873) UNSUPPORTED: UBSan-Standalone-x86_64 :: TestCases/TypeCheck/Linux/PR33221.cpp (2472 of 2873) PASS: UBSan-Standalone-x86_64 :: TestCases/Pointer/index-overflow.cpp (2473 of 2873) PASS: UBSan-Standalone-x86_64 :: TestCases/TypeCheck/PR33221.cpp (2474 of 2873) PASS: UBSan-Standalone-x86_64 :: TestCases/Integer/suppressions.cpp (2475 of 2873) PASS: UBSan-Standalone-x86_64 :: TestCases/TypeCheck/null.cpp (2476 of 2873) PASS: UBSan-Standalone-x86_64 :: TestCases/TypeCheck/vptr-corrupted-vtable-itanium.cpp (2477 of 2873) PASS: UBSan-Standalone-x86_64 :: TestCases/Misc/missing_return.cpp (2478 of 2873) PASS: UBSan-Standalone-x86_64 :: TestCases/TypeCheck/vptr-non-unique-typeinfo.cpp (2479 of 2873) PASS: UBSan-Standalone-x86_64 :: TestCases/TypeCheck/vptr-virtual-base-construction.cpp (2480 of 2873) PASS: UBSan-Standalone-x86_64 :: TestCases/TypeCheck/vptr-virtual-base.cpp (2481 of 2873) PASS: UBSan-Standalone-x86_64 :: TestCases/Pointer/alignment-assumption-attribute-alloc_align-on-function-variable.cpp (2482 of 2873) PASS: UBSan-Standalone-x86_64 :: TestCases/Pointer/alignment-assumption-attribute-align_value-on-paramvar.cpp (2483 of 2873) PASS: UBSan-Standalone-x86_64 :: TestCases/Pointer/alignment-assumption-attribute-align_value-on-lvalue.cpp (2484 of 2873) UNSUPPORTED: UBSan-StandaloneStatic-x86_64 :: TestCases/ImplicitConversion/integer-sign-change-summary.cpp (2485 of 2873) PASS: UBSan-Standalone-x86_64 :: TestCases/Pointer/alignment-assumption-attribute-alloc_align-on-function.cpp (2486 of 2873) PASS: UBSan-Standalone-x86_64 :: TestCases/Pointer/alignment-assumption-attribute-assume_aligned-on-function-two-params.cpp (2487 of 2873) PASS: UBSan-StandaloneStatic-x86_64 :: TestCases/Float/cast-overflow.cpp (2488 of 2873) PASS: UBSan-Standalone-x86_64 :: TestCases/Pointer/alignment-assumption-attribute-assume_aligned-on-function.cpp (2489 of 2873) UNSUPPORTED: UBSan-StandaloneStatic-x86_64 :: TestCases/ImplicitConversion/signed-integer-truncation-or-sign-change-summary.cpp (2490 of 2873) UNSUPPORTED: UBSan-StandaloneStatic-x86_64 :: TestCases/ImplicitConversion/signed-integer-truncation-summary.cpp (2491 of 2873) PASS: UBSan-Standalone-x86_64 :: TestCases/Pointer/alignment-assumption-builtin_assume_aligned-three-params-variable.cpp (2492 of 2873) PASS: UBSan-Standalone-x86_64 :: TestCases/Pointer/alignment-assumption-builtin_assume_aligned-three-params.cpp (2493 of 2873) UNSUPPORTED: UBSan-StandaloneStatic-x86_64 :: TestCases/ImplicitConversion/unsigned-integer-truncation-summary.cpp (2494 of 2873) PASS: UBSan-Standalone-x86_64 :: TestCases/Pointer/alignment-assumption-builtin_assume_aligned-two-params.cpp (2495 of 2873) PASS: UBSan-StandaloneStatic-x86_64 :: TestCases/Integer/add-overflow.cpp (2496 of 2873) PASS: UBSan-Standalone-x86_64 :: TestCases/Pointer/alignment-assumption-openmp.cpp (2497 of 2873) PASS: UBSan-StandaloneStatic-x86_64 :: TestCases/Integer/div-overflow.cpp (2498 of 2873) PASS: UBSan-StandaloneStatic-x86_64 :: TestCases/ImplicitConversion/integer-sign-change-blacklist.c (2499 of 2873) PASS: UBSan-StandaloneStatic-x86_64 :: TestCases/Integer/mul-overflow.cpp (2500 of 2873) PASS: UBSan-StandaloneStatic-x86_64 :: TestCases/Integer/div-zero.cpp (2501 of 2873) PASS: UBSan-StandaloneStatic-x86_64 :: TestCases/Integer/incdec-overflow.cpp (2502 of 2873) PASS: UBSan-StandaloneStatic-x86_64 :: TestCases/Integer/negate-overflow.cpp (2503 of 2873) PASS: UBSan-StandaloneStatic-x86_64 :: TestCases/Integer/no-recover.cpp (2504 of 2873) UNSUPPORTED: UBSan-StandaloneStatic-x86_64 :: TestCases/Integer/summary.cpp (2505 of 2873) PASS: UBSan-Standalone-x86_64 :: TestCases/TypeCheck/misaligned.cpp (2506 of 2873) PASS: UBSan-StandaloneStatic-x86_64 :: TestCases/Integer/sub-overflow.cpp (2507 of 2873) PASS: UBSan-StandaloneStatic-x86_64 :: TestCases/ImplicitConversion/unsigned-integer-truncation.c (2508 of 2873) PASS: UBSan-StandaloneStatic-x86_64 :: TestCases/Integer/uadd-overflow.cpp (2509 of 2873) PASS: UBSan-StandaloneStatic-x86_64 :: TestCases/Integer/uincdec-overflow.cpp (2510 of 2873) UNSUPPORTED: UBSan-StandaloneStatic-x86_64 :: TestCases/Misc/Linux/print_stack_trace.cpp (2511 of 2873) UNSUPPORTED: UBSan-StandaloneStatic-x86_64 :: TestCases/Misc/Linux/ubsan_options.cpp (2512 of 2873) PASS: UBSan-StandaloneStatic-x86_64 :: TestCases/ImplicitConversion/integer-truncation.c (2513 of 2873) PASS: UBSan-StandaloneStatic-x86_64 :: TestCases/Integer/umul-overflow.cpp (2514 of 2873) PASS: UBSan-StandaloneStatic-x86_64 :: TestCases/ImplicitConversion/integer-sign-change.c (2515 of 2873) UNSUPPORTED: UBSan-StandaloneStatic-x86_64 :: TestCases/Misc/coverage-levels.cpp (2516 of 2873) PASS: UBSan-StandaloneStatic-x86_64 :: TestCases/ImplicitConversion/signed-integer-truncation.c (2517 of 2873) PASS: UBSan-StandaloneStatic-x86_64 :: TestCases/Misc/bool.cpp (2518 of 2873) PASS: UBSan-StandaloneStatic-x86_64 :: TestCases/Misc/bounds.cpp (2519 of 2873) PASS: UBSan-StandaloneStatic-x86_64 :: TestCases/Misc/deduplication.cpp (2520 of 2873) PASS: UBSan-StandaloneStatic-x86_64 :: TestCases/Misc/builtins.cpp (2521 of 2873) UNSUPPORTED: UBSan-StandaloneStatic-x86_64 :: TestCases/Misc/no-interception.cpp (2522 of 2873) PASS: UBSan-StandaloneStatic-x86_64 :: TestCases/ImplicitConversion/signed-integer-truncation-or-sign-change-blacklist.c (2523 of 2873) PASS: UBSan-StandaloneStatic-x86_64 :: TestCases/Misc/monitor.cpp (2524 of 2873) PASS: UBSan-StandaloneStatic-x86_64 :: TestCases/ImplicitConversion/integer-arithmetic-value-change.c (2525 of 2873) PASS: UBSan-StandaloneStatic-x86_64 :: TestCases/Integer/usub-overflow.cpp (2526 of 2873) PASS: UBSan-StandaloneStatic-x86_64 :: TestCases/Misc/enum.cpp (2527 of 2873) PASS: UBSan-StandaloneStatic-x86_64 :: TestCases/ImplicitConversion/integer-conversion.c (2528 of 2873) PASS: UBSan-StandaloneStatic-x86_64 :: TestCases/ImplicitConversion/signed-integer-truncation-blacklist.c (2529 of 2873) PASS: UBSan-StandaloneStatic-x86_64 :: TestCases/Misc/nonnull-arg.cpp (2530 of 2873) PASS: UBSan-StandaloneStatic-x86_64 :: TestCases/Misc/nullability.c (2531 of 2873) PASS: UBSan-StandaloneStatic-x86_64 :: TestCases/Misc/print_summary.c (2532 of 2873) PASS: UBSan-StandaloneStatic-x86_64 :: TestCases/Misc/log-path_test.cpp (2533 of 2873) PASS: UBSan-StandaloneStatic-x86_64 :: TestCases/Misc/vla.c (2534 of 2873) PASS: UBSan-StandaloneStatic-x86_64 :: TestCases/ImplicitConversion/unsigned-integer-truncation-blacklist.c (2535 of 2873) PASS: UBSan-StandaloneStatic-x86_64 :: TestCases/Misc/nonnull.cpp (2536 of 2873) PASS: UBSan-StandaloneStatic-x86_64 :: TestCases/Misc/unreachable.cpp (2537 of 2873) PASS: UBSan-StandaloneStatic-x86_64 :: TestCases/Integer/shift.cpp (2538 of 2873) PASS: UBSan-Standalone-x86_64 :: TestCases/TypeCheck/Function/function.cpp (2539 of 2873) UNSUPPORTED: UBSan-StandaloneStatic-x86_64 :: TestCases/Pointer/alignment-assumption-summary.cpp (2540 of 2873) PASS: UBSan-StandaloneStatic-x86_64 :: TestCases/Pointer/alignment-assumption-blacklist.cpp (2541 of 2873) PASS: UBSan-StandaloneStatic-x86_64 :: TestCases/Pointer/index-overflow.cpp (2542 of 2873) PASS: UBSan-StandaloneStatic-x86_64 :: TestCases/Pointer/unsigned-index-expression.cpp (2543 of 2873) UNSUPPORTED: UBSan-StandaloneStatic-x86_64 :: TestCases/TypeCheck/Linux/PR33221.cpp (2544 of 2873) PASS: UBSan-StandaloneStatic-x86_64 :: TestCases/TypeCheck/PR33221.cpp (2545 of 2873) PASS: UBSan-StandaloneStatic-x86_64 :: TestCases/Integer/suppressions.cpp (2546 of 2873) PASS: UBSan-StandaloneStatic-x86_64 :: TestCases/TypeCheck/null.cpp (2547 of 2873) PASS: UBSan-StandaloneStatic-x86_64 :: TestCases/Pointer/alignment-assumption-attribute-align_value-on-lvalue.cpp (2548 of 2873) PASS: UBSan-StandaloneStatic-x86_64 :: TestCases/Pointer/alignment-assumption-attribute-alloc_align-on-function.cpp (2549 of 2873) PASS: UBSan-StandaloneStatic-x86_64 :: TestCases/Pointer/alignment-assumption-attribute-alloc_align-on-function-variable.cpp (2550 of 2873) PASS: UBSan-StandaloneStatic-x86_64 :: TestCases/Pointer/alignment-assumption-attribute-align_value-on-paramvar.cpp (2551 of 2873) PASS: UBSan-StandaloneStatic-x86_64 :: TestCases/Pointer/alignment-assumption-attribute-assume_aligned-on-function.cpp (2552 of 2873) PASS: UBSan-StandaloneStatic-x86_64 :: TestCases/Pointer/alignment-assumption-attribute-assume_aligned-on-function-two-params.cpp (2553 of 2873) PASS: UBSan-StandaloneStatic-x86_64 :: TestCases/Pointer/alignment-assumption-builtin_assume_aligned-three-params-variable.cpp (2554 of 2873) PASS: UBSan-StandaloneStatic-x86_64 :: TestCases/Pointer/alignment-assumption-builtin_assume_aligned-three-params.cpp (2555 of 2873) PASS: UBSan-StandaloneStatic-x86_64 :: TestCases/TypeCheck/vptr-virtual-base-construction.cpp (2556 of 2873) PASS: UBSan-StandaloneStatic-x86_64 :: TestCases/Pointer/alignment-assumption-builtin_assume_aligned-two-params.cpp (2557 of 2873) PASS: UBSan-StandaloneStatic-x86_64 :: TestCases/TypeCheck/vptr-virtual-base.cpp (2558 of 2873) PASS: UBSan-StandaloneStatic-x86_64 :: TestCases/TypeCheck/vptr-corrupted-vtable-itanium.cpp (2559 of 2873) PASS: UBSan-StandaloneStatic-x86_64 :: TestCases/TypeCheck/vptr-non-unique-typeinfo.cpp (2560 of 2873) PASS: UBSan-StandaloneStatic-x86_64 :: TestCases/Pointer/alignment-assumption-openmp.cpp (2561 of 2873) PASS: UBSan-StandaloneStatic-x86_64 :: TestCases/Misc/missing_return.cpp (2562 of 2873) PASS: UBSan-StandaloneStatic-x86_64 :: TestCases/TypeCheck/misaligned.cpp (2563 of 2873) PASS: UBSan-StandaloneStatic-x86_64 :: TestCases/TypeCheck/Function/function.cpp (2564 of 2873) PASS: UBSan-ThreadSanitizer-x86_64 :: TestCases/Float/cast-overflow.cpp (2565 of 2873) PASS: UBSan-Standalone-x86_64 :: TestCases/TypeCheck/vptr.cpp (2566 of 2873) PASS: UBSan-AddressSanitizer-x86_64 :: TestCases/TypeCheck/vptr.cpp (2567 of 2873) PASS: UBSan-StandaloneStatic-x86_64 :: TestCases/TypeCheck/vptr.cpp (2568 of 2873) PASS: UBSan-ThreadSanitizer-x86_64 :: TestCases/ImplicitConversion/integer-arithmetic-value-change.c (2569 of 2873) PASS: UBSan-ThreadSanitizer-x86_64 :: TestCases/ImplicitConversion/integer-sign-change-summary.cpp (2570 of 2873) PASS: UBSan-ThreadSanitizer-x86_64 :: TestCases/ImplicitConversion/integer-sign-change-blacklist.c (2571 of 2873) PASS: UBSan-ThreadSanitizer-x86_64 :: TestCases/ImplicitConversion/integer-conversion.c (2572 of 2873) PASS: UBSan-ThreadSanitizer-x86_64 :: TestCases/ImplicitConversion/integer-sign-change.c (2573 of 2873) PASS: UBSan-ThreadSanitizer-x86_64 :: TestCases/ImplicitConversion/integer-truncation.c (2574 of 2873) PASS: UBSan-ThreadSanitizer-x86_64 :: TestCases/ImplicitConversion/signed-integer-truncation-or-sign-change-summary.cpp (2575 of 2873) PASS: UBSan-ThreadSanitizer-x86_64 :: TestCases/ImplicitConversion/signed-integer-truncation-summary.cpp (2576 of 2873) PASS: UBSan-ThreadSanitizer-x86_64 :: TestCases/ImplicitConversion/signed-integer-truncation-blacklist.c (2577 of 2873) PASS: UBSan-ThreadSanitizer-x86_64 :: TestCases/ImplicitConversion/signed-integer-truncation-or-sign-change-blacklist.c (2578 of 2873) PASS: UBSan-ThreadSanitizer-x86_64 :: TestCases/ImplicitConversion/unsigned-integer-truncation-summary.cpp (2579 of 2873) PASS: UBSan-ThreadSanitizer-x86_64 :: TestCases/ImplicitConversion/signed-integer-truncation.c (2580 of 2873) PASS: UBSan-ThreadSanitizer-x86_64 :: TestCases/Integer/add-overflow.cpp (2581 of 2873) PASS: UBSan-ThreadSanitizer-x86_64 :: TestCases/Integer/div-overflow.cpp (2582 of 2873) PASS: UBSan-ThreadSanitizer-x86_64 :: TestCases/Integer/div-zero.cpp (2583 of 2873) PASS: UBSan-ThreadSanitizer-x86_64 :: TestCases/Integer/incdec-overflow.cpp (2584 of 2873) PASS: UBSan-ThreadSanitizer-x86_64 :: TestCases/ImplicitConversion/unsigned-integer-truncation.c (2585 of 2873) PASS: UBSan-ThreadSanitizer-x86_64 :: TestCases/ImplicitConversion/unsigned-integer-truncation-blacklist.c (2586 of 2873) PASS: UBSan-ThreadSanitizer-x86_64 :: TestCases/Integer/mul-overflow.cpp (2587 of 2873) PASS: UBSan-ThreadSanitizer-x86_64 :: TestCases/Integer/negate-overflow.cpp (2588 of 2873) PASS: UBSan-ThreadSanitizer-x86_64 :: TestCases/Integer/no-recover.cpp (2589 of 2873) UNSUPPORTED: UBSan-ThreadSanitizer-x86_64 :: TestCases/Integer/summary.cpp (2590 of 2873) PASS: UBSan-ThreadSanitizer-x86_64 :: TestCases/Integer/sub-overflow.cpp (2591 of 2873) PASS: UBSan-ThreadSanitizer-x86_64 :: TestCases/Integer/uadd-overflow.cpp (2592 of 2873) PASS: UBSan-ThreadSanitizer-x86_64 :: TestCases/Integer/suppressions.cpp (2593 of 2873) PASS: UBSan-ThreadSanitizer-x86_64 :: TestCases/Integer/uincdec-overflow.cpp (2594 of 2873) PASS: UBSan-ThreadSanitizer-x86_64 :: TestCases/Integer/umul-overflow.cpp (2595 of 2873) UNSUPPORTED: UBSan-ThreadSanitizer-x86_64 :: TestCases/Misc/Linux/print_stack_trace.cpp (2596 of 2873) UNSUPPORTED: UBSan-ThreadSanitizer-x86_64 :: TestCases/Misc/Linux/ubsan_options.cpp (2597 of 2873) PASS: UBSan-ThreadSanitizer-x86_64 :: TestCases/Misc/bool.cpp (2598 of 2873) PASS: UBSan-ThreadSanitizer-x86_64 :: TestCases/Integer/usub-overflow.cpp (2599 of 2873) PASS: UBSan-ThreadSanitizer-x86_64 :: TestCases/Integer/shift.cpp (2600 of 2873) PASS: UBSan-ThreadSanitizer-x86_64 :: TestCases/Misc/builtins.cpp (2601 of 2873) XFAIL: UBSan-ThreadSanitizer-x86_64 :: TestCases/Misc/coverage-levels.cpp (2602 of 2873) PASS: UBSan-ThreadSanitizer-x86_64 :: TestCases/Misc/deduplication.cpp (2603 of 2873) PASS: UBSan-ThreadSanitizer-x86_64 :: TestCases/Misc/bounds.cpp (2604 of 2873) PASS: UBSan-ThreadSanitizer-x86_64 :: TestCases/Misc/enum.cpp (2605 of 2873) PASS: UBSan-ThreadSanitizer-x86_64 :: TestCases/Misc/log-path_test.cpp (2606 of 2873) UNSUPPORTED: UBSan-ThreadSanitizer-x86_64 :: TestCases/Misc/no-interception.cpp (2607 of 2873) PASS: UBSan-ThreadSanitizer-x86_64 :: TestCases/Misc/monitor.cpp (2608 of 2873) PASS: UBSan-ThreadSanitizer-x86_64 :: TestCases/Misc/missing_return.cpp (2609 of 2873) PASS: UBSan-ThreadSanitizer-x86_64 :: TestCases/Misc/nullability.c (2610 of 2873) PASS: UBSan-ThreadSanitizer-x86_64 :: TestCases/Misc/nonnull.cpp (2611 of 2873) PASS: UBSan-ThreadSanitizer-x86_64 :: TestCases/Misc/print_summary.c (2612 of 2873) PASS: UBSan-ThreadSanitizer-x86_64 :: TestCases/Misc/unreachable.cpp (2613 of 2873) PASS: UBSan-ThreadSanitizer-x86_64 :: TestCases/Misc/nonnull-arg.cpp (2614 of 2873) PASS: UBSan-ThreadSanitizer-x86_64 :: TestCases/Misc/vla.c (2615 of 2873) PASS: UBSan-ThreadSanitizer-x86_64 :: TestCases/Pointer/alignment-assumption-attribute-align_value-on-lvalue.cpp (2616 of 2873) PASS: UBSan-ThreadSanitizer-x86_64 :: TestCases/Pointer/alignment-assumption-attribute-alloc_align-on-function-variable.cpp (2617 of 2873) PASS: UBSan-ThreadSanitizer-x86_64 :: TestCases/Pointer/alignment-assumption-attribute-align_value-on-paramvar.cpp (2618 of 2873) PASS: UBSan-ThreadSanitizer-x86_64 :: TestCases/Pointer/alignment-assumption-attribute-alloc_align-on-function.cpp (2619 of 2873) PASS: UBSan-ThreadSanitizer-x86_64 :: TestCases/Pointer/alignment-assumption-blacklist.cpp (2620 of 2873) PASS: UBSan-ThreadSanitizer-x86_64 :: TestCases/Pointer/alignment-assumption-attribute-assume_aligned-on-function.cpp (2621 of 2873) PASS: UBSan-ThreadSanitizer-x86_64 :: TestCases/Pointer/alignment-assumption-attribute-assume_aligned-on-function-two-params.cpp (2622 of 2873) PASS: UBSan-ThreadSanitizer-x86_64 :: TestCases/Pointer/alignment-assumption-builtin_assume_aligned-three-params-variable.cpp (2623 of 2873) PASS: UBSan-ThreadSanitizer-x86_64 :: TestCases/Pointer/alignment-assumption-builtin_assume_aligned-three-params.cpp (2624 of 2873) UNSUPPORTED: XRay-x86_64-darwin :: TestCases/Posix/always-never-instrument.cpp (2625 of 2873) UNSUPPORTED: XRay-x86_64-darwin :: TestCases/Posix/arg1-arg0-logging.cpp (2626 of 2873) UNSUPPORTED: XRay-x86_64-darwin :: TestCases/Posix/arg1-logger.cpp (2627 of 2873) UNSUPPORTED: XRay-x86_64-darwin :: TestCases/Posix/arg1-logging-implicit-this.cpp (2628 of 2873) UNSUPPORTED: XRay-x86_64-darwin :: TestCases/Posix/argv0-log-file-name.cpp (2629 of 2873) UNSUPPORTED: XRay-x86_64-darwin :: TestCases/Posix/basic-filtering.cpp (2630 of 2873) UNSUPPORTED: XRay-x86_64-darwin :: TestCases/Posix/c-test.cpp (2631 of 2873) UNSUPPORTED: XRay-x86_64-darwin :: TestCases/Posix/clang-no-xray-instrument.cpp (2632 of 2873) UNSUPPORTED: XRay-x86_64-darwin :: TestCases/Posix/common-trampoline-alignment.cpp (2633 of 2873) UNSUPPORTED: XRay-x86_64-darwin :: TestCases/Posix/coverage-sample.cpp (2634 of 2873) UNSUPPORTED: XRay-x86_64-darwin :: TestCases/Posix/custom-event-handler-alignment.cpp (2635 of 2873) UNSUPPORTED: XRay-x86_64-darwin :: TestCases/Posix/custom-event-logging.cpp (2636 of 2873) UNSUPPORTED: XRay-x86_64-darwin :: TestCases/Posix/fdr-mode-inmemory.cpp (2637 of 2873) UNSUPPORTED: XRay-x86_64-darwin :: TestCases/Posix/fdr-mode-multiple.cpp (2638 of 2873) UNSUPPORTED: XRay-x86_64-darwin :: TestCases/Posix/fdr-mode.cpp (2639 of 2873) UNSUPPORTED: XRay-x86_64-darwin :: TestCases/Posix/fdr-reinit.cpp (2640 of 2873) UNSUPPORTED: XRay-x86_64-darwin :: TestCases/Posix/fdr-single-thread.cpp (2641 of 2873) UNSUPPORTED: XRay-x86_64-darwin :: TestCases/Posix/fdr-thread-order.cpp (2642 of 2873) UNSUPPORTED: XRay-x86_64-darwin :: TestCases/Posix/fixedsize-logging.cpp (2643 of 2873) UNSUPPORTED: XRay-x86_64-darwin :: TestCases/Posix/fork_basic_logging.cpp (2644 of 2873) UNSUPPORTED: XRay-x86_64-darwin :: TestCases/Posix/func-id-utils.cpp (2645 of 2873) UNSUPPORTED: XRay-x86_64-darwin :: TestCases/Posix/logging-modes.cpp (2646 of 2873) UNSUPPORTED: XRay-x86_64-darwin :: TestCases/Posix/optional-inmemory-log.cpp (2647 of 2873) UNSUPPORTED: XRay-x86_64-darwin :: TestCases/Posix/patching-unpatching.cpp (2648 of 2873) UNSUPPORTED: XRay-x86_64-darwin :: TestCases/Posix/pic_test.cpp (2649 of 2873) UNSUPPORTED: XRay-x86_64-darwin :: TestCases/Posix/profiling-multi-threaded.cpp (2650 of 2873) UNSUPPORTED: XRay-x86_64-darwin :: TestCases/Posix/profiling-single-threaded.cpp (2651 of 2873) UNSUPPORTED: XRay-x86_64-darwin :: TestCases/Posix/quiet-start.cpp (2652 of 2873) UNSUPPORTED: XRay-x86_64h-darwin :: TestCases/Posix/always-never-instrument.cpp (2653 of 2873) UNSUPPORTED: XRay-x86_64h-darwin :: TestCases/Posix/arg1-arg0-logging.cpp (2654 of 2873) UNSUPPORTED: XRay-x86_64h-darwin :: TestCases/Posix/arg1-logger.cpp (2655 of 2873) UNSUPPORTED: XRay-x86_64h-darwin :: TestCases/Posix/arg1-logging-implicit-this.cpp (2656 of 2873) UNSUPPORTED: XRay-x86_64h-darwin :: TestCases/Posix/argv0-log-file-name.cpp (2657 of 2873) UNSUPPORTED: XRay-x86_64h-darwin :: TestCases/Posix/basic-filtering.cpp (2658 of 2873) UNSUPPORTED: XRay-x86_64h-darwin :: TestCases/Posix/c-test.cpp (2659 of 2873) UNSUPPORTED: XRay-x86_64h-darwin :: TestCases/Posix/clang-no-xray-instrument.cpp (2660 of 2873) UNSUPPORTED: XRay-x86_64h-darwin :: TestCases/Posix/common-trampoline-alignment.cpp (2661 of 2873) UNSUPPORTED: XRay-x86_64h-darwin :: TestCases/Posix/coverage-sample.cpp (2662 of 2873) UNSUPPORTED: XRay-x86_64h-darwin :: TestCases/Posix/custom-event-handler-alignment.cpp (2663 of 2873) UNSUPPORTED: XRay-x86_64h-darwin :: TestCases/Posix/custom-event-logging.cpp (2664 of 2873) UNSUPPORTED: XRay-x86_64h-darwin :: TestCases/Posix/fdr-mode-inmemory.cpp (2665 of 2873) UNSUPPORTED: XRay-x86_64h-darwin :: TestCases/Posix/fdr-mode-multiple.cpp (2666 of 2873) UNSUPPORTED: XRay-x86_64h-darwin :: TestCases/Posix/fdr-mode.cpp (2667 of 2873) UNSUPPORTED: XRay-x86_64h-darwin :: TestCases/Posix/fdr-reinit.cpp (2668 of 2873) UNSUPPORTED: XRay-x86_64h-darwin :: TestCases/Posix/fdr-single-thread.cpp (2669 of 2873) UNSUPPORTED: XRay-x86_64h-darwin :: TestCases/Posix/fdr-thread-order.cpp (2670 of 2873) UNSUPPORTED: XRay-x86_64h-darwin :: TestCases/Posix/fixedsize-logging.cpp (2671 of 2873) UNSUPPORTED: XRay-x86_64h-darwin :: TestCases/Posix/fork_basic_logging.cpp (2672 of 2873) UNSUPPORTED: XRay-x86_64h-darwin :: TestCases/Posix/func-id-utils.cpp (2673 of 2873) UNSUPPORTED: XRay-x86_64h-darwin :: TestCases/Posix/logging-modes.cpp (2674 of 2873) UNSUPPORTED: XRay-x86_64h-darwin :: TestCases/Posix/optional-inmemory-log.cpp (2675 of 2873) UNSUPPORTED: XRay-x86_64h-darwin :: TestCases/Posix/patching-unpatching.cpp (2676 of 2873) UNSUPPORTED: XRay-x86_64h-darwin :: TestCases/Posix/pic_test.cpp (2677 of 2873) UNSUPPORTED: XRay-x86_64h-darwin :: TestCases/Posix/profiling-multi-threaded.cpp (2678 of 2873) UNSUPPORTED: XRay-x86_64h-darwin :: TestCases/Posix/profiling-single-threaded.cpp (2679 of 2873) UNSUPPORTED: XRay-x86_64h-darwin :: TestCases/Posix/quiet-start.cpp (2680 of 2873) PASS: UBSan-ThreadSanitizer-x86_64 :: TestCases/Pointer/alignment-assumption-builtin_assume_aligned-two-params.cpp (2681 of 2873) PASS: cfi-devirt-x86_64 :: bad-cast.cpp (2682 of 2873) PASS: cfi-devirt-x86_64 :: anon-namespace.cpp (2683 of 2873) PASS: cfi-devirt-x86_64 :: bad-split.cpp (2684 of 2873) PASS: UBSan-ThreadSanitizer-x86_64 :: TestCases/Pointer/alignment-assumption-summary.cpp (2685 of 2873) PASS: cfi-devirt-x86_64 :: create-derivers.test (2686 of 2873) UNSUPPORTED: cfi-devirt-x86_64 :: cross-dso/icall/diag.cpp (2687 of 2873) UNSUPPORTED: cfi-devirt-x86_64 :: cross-dso/icall/dlopen.cpp (2688 of 2873) UNSUPPORTED: cfi-devirt-x86_64 :: cross-dso/icall/icall-from-dso.cpp (2689 of 2873) UNSUPPORTED: cfi-devirt-x86_64 :: cross-dso/icall/icall.cpp (2690 of 2873) UNSUPPORTED: cfi-devirt-x86_64 :: cross-dso/shadow_is_read_only.cpp (2691 of 2873) UNSUPPORTED: cfi-devirt-x86_64 :: cross-dso/simple-fail.cpp (2692 of 2873) UNSUPPORTED: cfi-devirt-x86_64 :: cross-dso/simple-pass.cpp (2693 of 2873) UNSUPPORTED: cfi-devirt-x86_64 :: cross-dso/stats.cpp (2694 of 2873) UNSUPPORTED: cfi-devirt-x86_64 :: cross-dso/target_out_of_bounds.cpp (2695 of 2873) PASS: UBSan-ThreadSanitizer-x86_64 :: TestCases/Pointer/unsigned-index-expression.cpp (2696 of 2873) UNSUPPORTED: cfi-devirt-x86_64 :: icall/external-call.c (2697 of 2873) PASS: UBSan-ThreadSanitizer-x86_64 :: TestCases/Pointer/index-overflow.cpp (2698 of 2873) UNSUPPORTED: UBSan-ThreadSanitizer-x86_64 :: TestCases/TypeCheck/Linux/PR33221.cpp (2699 of 2873) UNSUPPORTED: cfi-devirt-x86_64 :: icall/wrong-signature-mixed-lto.c (2700 of 2873) XFAIL: cfi-devirt-x86_64 :: icall/weak.c (2701 of 2873) PASS: cfi-devirt-x86_64 :: cross-dso-diagnostic.cpp (2702 of 2873) PASS: UBSan-ThreadSanitizer-x86_64 :: TestCases/TypeCheck/PR33221.cpp (2703 of 2873) PASS: cfi-devirt-x86_64 :: icall/bad-signature.c (2704 of 2873) XFAIL: cfi-devirt-x86_64 :: sibling.cpp (2705 of 2873) XFAIL: cfi-devirt-x86_64 :: simple-pass.cpp (2706 of 2873) UNSUPPORTED: cfi-devirt-x86_64 :: stats.cpp (2707 of 2873) PASS: cfi-devirt-x86_64 :: nvcall.cpp (2708 of 2873) PASS: cfi-devirt-x86_64 :: base-derived-destructor.cpp (2709 of 2873) PASS: cfi-devirt-x86_64 :: target_uninstrumented.cpp (2710 of 2873) PASS: cfi-devirt-x86_64 :: vtable-may-alias.cpp (2711 of 2873) PASS: cfi-devirt-x86_64 :: overwrite.cpp (2712 of 2873) PASS: cfi-devirt-x86_64 :: multiple-inheritance.cpp (2713 of 2873) PASS: cfi-standalone-x86_64 :: bad-split.cpp (2714 of 2873) XFAIL: cfi-devirt-x86_64 :: two-vcalls.cpp (2715 of 2873) PASS: cfi-devirt-x86_64 :: vdtor.cpp (2716 of 2873) PASS: cfi-devirt-x86_64 :: mfcall.cpp (2717 of 2873) UNSUPPORTED: cfi-standalone-x86_64 :: cross-dso/icall/diag.cpp (2718 of 2873) UNSUPPORTED: cfi-standalone-x86_64 :: cross-dso/icall/dlopen.cpp (2719 of 2873) UNSUPPORTED: cfi-standalone-x86_64 :: cross-dso/icall/icall-from-dso.cpp (2720 of 2873) UNSUPPORTED: cfi-standalone-x86_64 :: cross-dso/icall/icall.cpp (2721 of 2873) UNSUPPORTED: cfi-standalone-x86_64 :: cross-dso/shadow_is_read_only.cpp (2722 of 2873) UNSUPPORTED: cfi-standalone-x86_64 :: cross-dso/simple-fail.cpp (2723 of 2873) UNSUPPORTED: cfi-standalone-x86_64 :: cross-dso/simple-pass.cpp (2724 of 2873) UNSUPPORTED: cfi-standalone-x86_64 :: cross-dso/stats.cpp (2725 of 2873) UNSUPPORTED: cfi-standalone-x86_64 :: cross-dso/target_out_of_bounds.cpp (2726 of 2873) PASS: cfi-standalone-x86_64 :: bad-cast.cpp (2727 of 2873) UNSUPPORTED: cfi-standalone-x86_64 :: icall/external-call.c (2728 of 2873) PASS: cfi-standalone-x86_64 :: create-derivers.test (2729 of 2873) UNSUPPORTED: cfi-standalone-x86_64 :: icall/wrong-signature-mixed-lto.c (2730 of 2873) XFAIL: cfi-standalone-x86_64 :: icall/weak.c (2731 of 2873) PASS: cfi-standalone-x86_64 :: anon-namespace.cpp (2732 of 2873) PASS: UBSan-ThreadSanitizer-x86_64 :: TestCases/Pointer/alignment-assumption-openmp.cpp (2733 of 2873) PASS: cfi-standalone-x86_64 :: cross-dso-diagnostic.cpp (2734 of 2873) XFAIL: cfi-standalone-x86_64 :: sibling.cpp (2735 of 2873) PASS: cfi-standalone-x86_64 :: base-derived-destructor.cpp (2736 of 2873) PASS: cfi-standalone-x86_64 :: nvcall.cpp (2737 of 2873) PASS: cfi-standalone-x86_64 :: icall/bad-signature.c (2738 of 2873) XFAIL: cfi-standalone-x86_64 :: simple-pass.cpp (2739 of 2873) PASS: cfi-standalone-x86_64 :: stats.cpp (2740 of 2873) PASS: cfi-standalone-x86_64 :: target_uninstrumented.cpp (2741 of 2873) PASS: cfi-standalone-x86_64 :: multiple-inheritance.cpp (2742 of 2873) PASS: UBSan-ThreadSanitizer-x86_64 :: TestCases/TypeCheck/Function/function.cpp (2743 of 2873) PASS: cfi-standalone-x86_64 :: vtable-may-alias.cpp (2744 of 2873) PASS: cfi-standalone-x86_64 :: overwrite.cpp (2745 of 2873) PASS: cfi-devirt-x86_64 :: simple-fail.cpp (2746 of 2873) XFAIL: cfi-standalone-x86_64 :: two-vcalls.cpp (2747 of 2873) PASS: cfi-standalone-x86_64 :: vdtor.cpp (2748 of 2873) PASS: cfi-standalone-x86_64 :: mfcall.cpp (2749 of 2873) PASS: UBSan-ThreadSanitizer-x86_64 :: TestCases/TypeCheck/vptr-corrupted-vtable-itanium.cpp (2750 of 2873) PASS: UBSan-ThreadSanitizer-x86_64 :: TestCases/TypeCheck/vptr-non-unique-typeinfo.cpp (2751 of 2873) PASS: UBSan-ThreadSanitizer-x86_64 :: TestCases/TypeCheck/vptr-virtual-base-construction.cpp (2752 of 2873) PASS: cfi-standalone-x86_64 :: simple-fail.cpp (2753 of 2873) PASS: UBSan-ThreadSanitizer-x86_64 :: TestCases/TypeCheck/vptr-virtual-base.cpp (2754 of 2873) PASS: UBSan-ThreadSanitizer-x86_64 :: TestCases/TypeCheck/null.cpp (2755 of 2873) PASS: libFuzzer :: acquire-crash-state.test (2756 of 2873) UNSUPPORTED: libFuzzer :: afl-driver-close-fd-mask.test (2757 of 2873) PASS: libFuzzer :: afl-driver-stderr.test (2758 of 2873) UNSUPPORTED: libFuzzer :: afl-driver.test (2759 of 2873) PASS: libFuzzer :: bad-strcmp.test (2760 of 2873) PASS: libFuzzer :: bogus-initialize.test (2761 of 2873) PASS: UBSan-ThreadSanitizer-x86_64 :: TestCases/TypeCheck/misaligned.cpp (2762 of 2873) PASS: libFuzzer :: buffer-overflow-on-input.test (2763 of 2873) PASS: libFuzzer :: caller-callee.test (2764 of 2873) UNSUPPORTED: libFuzzer :: compressed.test (2765 of 2873) PASS: libFuzzer :: counters.test (2766 of 2873) PASS: libFuzzer :: coverage.test (2767 of 2873) PASS: libFuzzer :: cross_over.test (2768 of 2873) PASS: UBSan-ThreadSanitizer-x86_64 :: TestCases/TypeCheck/vptr.cpp (2769 of 2873) UNSUPPORTED: libFuzzer :: dataflow.test (2770 of 2873) PASS: libFuzzer :: cxxstring.test (2771 of 2873) UNSUPPORTED: libFuzzer :: deep-recursion.test (2772 of 2873) PASS: libFuzzer :: dead-stripping.test (2773 of 2873) UNSUPPORTED: libFuzzer :: disable-leaks.test (2774 of 2873) PASS: libFuzzer :: dso.test (2775 of 2873) UNSUPPORTED: libFuzzer :: equivalence-signals.test (2776 of 2873) UNSUPPORTED: libFuzzer :: equivalence.test (2777 of 2873) PASS: libFuzzer :: deprecated-instrumentation.test (2778 of 2873) PASS: libFuzzer :: cleanse.test (2779 of 2873) UNSUPPORTED: libFuzzer :: extra-counters.test (2780 of 2873) UNSUPPORTED: libFuzzer :: features_dir.test (2781 of 2873) UNSUPPORTED: libFuzzer :: fork-sigusr.test (2782 of 2873) UNSUPPORTED: libFuzzer :: fork-ubsan.test (2783 of 2873) UNSUPPORTED: libFuzzer :: fork.test (2784 of 2873) PASS: libFuzzer :: exit-report.test (2785 of 2873) PASS: libFuzzer :: full-coverage-set.test (2786 of 2873) PASS: libFuzzer :: fuzzer-alignment-assumption.test (2787 of 2873) PASS: libFuzzer :: exit_on_src_pos.test (2788 of 2873) PASS: libFuzzer :: fuzzer-customcrossoverandmutate.test (2789 of 2873) PASS: libFuzzer :: fuzzer-customcrossover.test (2790 of 2873) PASS: libFuzzer :: fuzzer-custommutator.test (2791 of 2873) PASS: libFuzzer :: fuzzer-dirs.test (2792 of 2873) PASS: libFuzzer :: fuzzer-fdmask.test (2793 of 2873) PASS: libFuzzer :: fuzzer-dict.test (2794 of 2873) PASS: libFuzzer :: fuzzer-finalstats.test (2795 of 2873) PASS: libFuzzer :: fuzzer-implicit-integer-sign-change.test (2796 of 2873) PASS: libFuzzer :: fuzzer-flags.test (2797 of 2873) PASS: libFuzzer :: fuzzer-implicit-signed-integer-truncation-or-sign-change.test (2798 of 2873) UNSUPPORTED: libFuzzer :: fuzzer-leak.test (2799 of 2873) UNSUPPORTED: libFuzzer :: fuzzer-oom-with-profile.test (2800 of 2873) PASS: libFuzzer :: fuzzer-implicit-signed-integer-truncation.test (2801 of 2873) PASS: libFuzzer :: fuzzer-implicit-unsigned-integer-truncation.test (2802 of 2873) PASS: libFuzzer :: fuzzer-printcovpcs.test (2803 of 2873) PASS: libFuzzer :: fuzzer-runs.test (2804 of 2873) PASS: libFuzzer :: fuzzer-seed.test (2805 of 2873) PASS: libFuzzer :: fuzzer-singleinputs.test (2806 of 2873) PASS: libFuzzer :: fuzzer-segv.test (2807 of 2873) PASS: libFuzzer :: fuzzer-oom.test (2808 of 2873) PASS: libFuzzer :: fuzzer-ubsan.test (2809 of 2873) UNSUPPORTED: libFuzzer :: gc-sections.test (2810 of 2873) PASS: libFuzzer :: initialize.test (2811 of 2873) UNSUPPORTED: libFuzzer :: large.test (2812 of 2873) PASS: libFuzzer :: len_control.test (2813 of 2873) UNSUPPORTED: libFuzzer :: libcxx.test (2814 of 2873) UNSUPPORTED: libFuzzer :: magic-separator.test (2815 of 2873) PASS: libFuzzer :: fuzzer-threaded.test (2816 of 2873) PASS: libFuzzer :: max-number-of-runs.test (2817 of 2873) PASS: libFuzzer :: memcmp64.test (2818 of 2873) PASS: libFuzzer :: memcmp.test (2819 of 2873) PASS: libFuzzer :: merge-control-file.test (2820 of 2873) UNSUPPORTED: libFuzzer :: merge-sigusr.test (2821 of 2873) PASS: libFuzzer :: merge-posix.test (2822 of 2873) PASS: libFuzzer :: merge_two_step.test (2823 of 2873) PASS: libFuzzer :: fuzzer-timeout.test (2824 of 2873) PASS: libFuzzer :: merge.test (2825 of 2873) UNSUPPORTED: libFuzzer :: msan-param-unpoison.test (2826 of 2873) UNSUPPORTED: libFuzzer :: msan.test (2827 of 2873) PASS: libFuzzer :: not-instrumented.test (2828 of 2873) PASS: libFuzzer :: null-deref-on-empty.test (2829 of 2873) PASS: libFuzzer :: minimize_two_crashes.test (2830 of 2873) UNSUPPORTED: libFuzzer :: only-some-bytes-fork.test (2831 of 2873) UNSUPPORTED: libFuzzer :: only-some-bytes.test (2832 of 2873) PASS: libFuzzer :: null-deref.test (2833 of 2873) UNSUPPORTED: libFuzzer :: print-func.test (2834 of 2873) PASS: libFuzzer :: overwrite-input.test (2835 of 2873) PASS: libFuzzer :: read-binary.test (2836 of 2873) PASS: libFuzzer :: recommended-dictionary.test (2837 of 2873) PASS: libFuzzer :: reduce_inputs.test (2838 of 2873) PASS: libFuzzer :: reload.test (2839 of 2873) PASS: libFuzzer :: repeated-bytes.test (2840 of 2873) PASS: libFuzzer :: seed_inputs.test (2841 of 2873) UNSUPPORTED: libFuzzer :: sigint.test (2842 of 2873) UNSUPPORTED: libFuzzer :: sigusr.test (2843 of 2873) UNSUPPORTED: libFuzzer :: simple-cmp.test (2844 of 2873) PASS: libFuzzer :: shrink.test (2845 of 2873) PASS: libFuzzer :: standalone.test (2846 of 2873) PASS: libFuzzer :: strcmp.test (2847 of 2873) PASS: libFuzzer :: simple.test (2848 of 2873) PASS: libFuzzer :: strncmp-oob.test (2849 of 2873) PASS: libFuzzer :: strstr.test (2850 of 2873) PASS: libFuzzer :: swap-cmp.test (2851 of 2873) PASS: libFuzzer :: symbolize-deadlock.test (2852 of 2873) UNSUPPORTED: libFuzzer :: target-function.test (2853 of 2873) PASS: libFuzzer :: strncmp.test (2854 of 2873) UNSUPPORTED: libFuzzer :: trace-malloc-2.test (2855 of 2873) UNSUPPORTED: libFuzzer :: trace-malloc-threaded.test (2856 of 2873) UNSUPPORTED: libFuzzer :: trace-malloc-unbalanced.test (2857 of 2873) PASS: libFuzzer :: three-bytes.test (2858 of 2873) PASS: libFuzzer :: trace-malloc.test (2859 of 2873) PASS: libFuzzer :: ulimit.test (2860 of 2873) PASS: libFuzzer :: value-profile-cmp2.test (2861 of 2873) PASS: libFuzzer :: value-profile-cmp3.test (2862 of 2873) PASS: libFuzzer :: minimize_crash.test (2863 of 2873) PASS: libFuzzer :: value-profile-cmp.test (2864 of 2873) PASS: libFuzzer :: value-profile-cmp4.test (2865 of 2873) PASS: libFuzzer :: value-profile-div.test (2866 of 2873) PASS: libFuzzer :: value-profile-mem.test (2867 of 2873) PASS: libFuzzer :: value-profile-set.test (2868 of 2873) PASS: libFuzzer :: value-profile-strcmp.test (2869 of 2873) PASS: libFuzzer :: value-profile-strncmp.test (2870 of 2873) UNSUPPORTED: libFuzzer :: windows-opt-ref.test (2871 of 2873) PASS: libFuzzer :: value-profile-load.test (2872 of 2873) PASS: libFuzzer :: value-profile-switch.test (2873 of 2873)

Hide Details

22 warning(s) in tests. Testing Time: 1208.72s ******************** Failing Tests (1): ThreadSanitizer-x86_64 :: Darwin/mach_vm_allocate.c

Hide Details

Expected Passes : 2048 Expected Failures : 34 Unsupported Tests : 790 Unexpected Failures: 1 FAILED: test/CMakeFiles/check-compiler-rt cd /Users/buildslave/jenkins/workspace/test-mr-clang-stage1-RA/clang-build/tools/clang/runtime/compiler-rt-bins/test && /usr/local/bin/python /Users/buildslave/jenkins/workspace/test-mr-clang-stage1-RA/clang-build/bin/llvm-lit --xunit-xml-output=testresults.xunit.xml -v --timeout=600 /Users/buildslave/jenkins/workspace/test-mr-clang-stage1-RA/clang-build/tools/clang/runtime/compiler-rt-bins/test/builtins/TestCases /Users/buildslave/jenkins/workspace/test-mr-clang-stage1-RA/clang-build/tools/clang/runtime/compiler-rt-bins/test/builtins/Unit/X86_64DarwinConfig /Users/buildslave/jenkins/workspace/test-mr-clang-stage1-RA/clang-build/tools/clang/runtime/compiler-rt-bins/test/lsan/X86_64LsanConfig /Users/buildslave/jenkins/workspace/test-mr-clang-stage1-RA/clang-build/tools/clang/runtime/compiler-rt-bins/test/lsan/X86_64AsanConfig /Users/buildslave/jenkins/workspace/test-mr-clang-stage1-RA/clang-build/tools/clang/runtime/compiler-rt-bins/test/ubsan/Standalone-x86_64 /Users/buildslave/jenkins/workspace/test-mr-clang-stage1-RA/clang-build/tools/clang/runtime/compiler-rt-bins/test/ubsan/AddressSanitizer-x86_64 /Users/buildslave/jenkins/workspace/test-mr-clang-stage1-RA/clang-build/tools/clang/runtime/compiler-rt-bins/test/ubsan/ThreadSanitizer-x86_64 /Users/buildslave/jenkins/workspace/test-mr-clang-stage1-RA/clang-build/tools/clang/runtime/compiler-rt-bins/test/ubsan/StandaloneStatic-x86_64 /Users/buildslave/jenkins/workspace/test-mr-clang-stage1-RA/clang-build/tools/clang/runtime/compiler-rt-bins/test/cfi/Standalone-x86_64 /Users/buildslave/jenkins/workspace/test-mr-clang-stage1-RA/clang-build/tools/clang/runtime/compiler-rt-bins/test/cfi/Devirt-x86_64 /Users/buildslave/jenkins/workspace/test-mr-clang-stage1-RA/clang-build/tools/clang/runtime/compiler-rt-bins/test/sanitizer_common/asan-x86_64-Darwin /Users/buildslave/jenkins/workspace/test-mr-clang-stage1-RA/clang-build/tools/clang/runtime/compiler-rt-bins/test/sanitizer_common/lsan-x86_64-Darwin /Users/buildslave/jenkins/workspace/test-mr-clang-stage1-RA/clang-build/tools/clang/runtime/compiler-rt-bins/test/sanitizer_common/tsan-x86_64-Darwin /Users/buildslave/jenkins/workspace/test-mr-clang-stage1-RA/clang-build/tools/clang/runtime/compiler-rt-bins/test/sanitizer_common/ubsan-x86_64-Darwin /Users/buildslave/jenkins/workspace/test-mr-clang-stage1-RA/clang-build/tools/clang/runtime/compiler-rt-bins/test/sanitizer_common/Unit /Users/buildslave/jenkins/workspace/test-mr-clang-stage1-RA/clang-build/tools/clang/runtime/compiler-rt-bins/test/fuzzer/unit /Users/buildslave/jenkins/workspace/test-mr-clang-stage1-RA/clang-build/tools/clang/runtime/compiler-rt-bins/test/fuzzer/X86_64DefaultDarwinConfig/ /Users/buildslave/jenkins/workspace/test-mr-clang-stage1-RA/clang-build/tools/clang/runtime/compiler-rt-bins/test/asan/X86_64DarwinConfig /Users/buildslave/jenkins/workspace/test-mr-clang-stage1-RA/clang-build/tools/clang/runtime/compiler-rt-bins/test/asan/Unit /Users/buildslave/jenkins/workspace/test-mr-clang-stage1-RA/clang-build/tools/clang/runtime/compiler-rt-bins/test/tsan/X86_64Config /Users/buildslave/jenkins/workspace/test-mr-clang-stage1-RA/clang-build/tools/clang/runtime/compiler-rt-bins/test/tsan/Unit /Users/buildslave/jenkins/workspace/test-mr-clang-stage1-RA/clang-build/tools/clang/runtime/compiler-rt-bins/test/ubsan_minimal/x86_64 /Users/buildslave/jenkins/workspace/test-mr-clang-stage1-RA/clang-build/tools/clang/runtime/compiler-rt-bins/test/profile/Profile-x86_64 /Users/buildslave/jenkins/workspace/test-mr-clang-stage1-RA/clang-build/tools/clang/runtime/compiler-rt-bins/test/xray/X86_64DarwinConfig /Users/buildslave/jenkins/workspace/test-mr-clang-stage1-RA/clang-build/tools/clang/runtime/compiler-rt-bins/test/xray/X86_64HDarwinConfig /Users/buildslave/jenkins/workspace/test-mr-clang-stage1-RA/clang-build/tools/clang/runtime/compiler-rt-bins/test/shadowcallstack/arm64 ninja: build stopped: subcommand failed. [241/679] cd /Users/buildslave/jenkins/workspace/test-mr-clang-stage1-RA/llvm/tools/clang/bindings/python && /usr/local/Cellar/cmake/3.15.1/bin/cmake -E env CLANG_LIBRARY_PATH=/Users/buildslave/jenkins/workspace/test-mr-clang-stage1-RA/clang-build/lib /usr/local/bin/python -m unittest discover .................................................s................................................s.s.......s...s.........s... ---------------------------------------------------------------------- Ran 126 tests in 0.621s

Hide Details

OK (skipped=6) [677/679] : && /Applications/Xcode.app/Contents/Developer/Toolchains/XcodeDefault.xctoolchain/usr/bin/c++ -fPIC -fvisibility-inlines-hidden -Werror=date-time -Werror=unguarded-availability-new -std=c++14 -Wall -Wextra -Wno-unused-parameter -Wwrite-strings -Wcast-qual -Wmissing-field-initializers -pedantic -Wno-long-long -Wimplicit-fallthrough -Wcovered-switch-default -Wno-noexcept-type -Wnon-virtual-dtor -Wdelete-non-virtual-dtor -Wstring-conversion -fdiagnostics-color -O2 -g -isysroot /Applications/Xcode.app/Contents/Developer/Platforms/MacOSX.platform/Developer/SDKs/MacOSX10.14.sdk -mmacosx-version-min=10.9 -Wl,-search_paths_first -Wl,-headerpad_max_install_names -Wl,-dead_strip unittests/tools/llvm-exegesis/PowerPC/CMakeFiles/LLVMExegesisPowerPCTests.dir/AnalysisTest.cpp.o unittests/tools/llvm-exegesis/PowerPC/CMakeFiles/LLVMExegesisPowerPCTests.dir/TargetTest.cpp.o -o unittests/tools/llvm-exegesis/PowerPC/LLVMExegesisPowerPCTests lib/libLLVMMC.a lib/libLLVMMCParser.a lib/libLLVMObject.a lib/libLLVMSupport.a lib/libLLVMSymbolize.a lib/libLLVMPowerPCCodeGen.a lib/libLLVMPowerPCAsmParser.a lib/libLLVMPowerPCDesc.a lib/libLLVMPowerPCDisassembler.a lib/libLLVMPowerPCInfo.a lib/libLLVMSupport.a lib/libgtest_main.a lib/libgtest.a lib/libLLVMExegesis.a lib/libLLVMExegesisPowerPC.a lib/libLLVMDebugInfoPDB.a -lpthread lib/libLLVMPowerPCCodeGen.a lib/libLLVMAsmPrinter.a lib/libLLVMDebugInfoDWARF.a lib/libLLVMPowerPCAsmParser.a lib/libLLVMPowerPCDesc.a lib/libLLVMPowerPCDisassembler.a lib/libLLVMPowerPCInfo.a lib/libLLVMExegesis.a lib/libLLVMMCDisassembler.a lib/libLLVMGlobalISel.a lib/libLLVMSelectionDAG.a lib/libLLVMCodeGen.a lib/libLLVMScalarOpts.a lib/libLLVMAggressiveInstCombine.a lib/libLLVMInstCombine.a lib/libLLVMBitWriter.a lib/libLLVMTransformUtils.a lib/libLLVMMCJIT.a lib/libLLVMExecutionEngine.a lib/libLLVMTarget.a lib/libLLVMAnalysis.a lib/libLLVMProfileData.a lib/libLLVMRuntimeDyld.a lib/libLLVMObjectYAML.a lib/libLLVMObject.a lib/libLLVMMCParser.a lib/libLLVMMC.a lib/libLLVMBitReader.a lib/libLLVMCore.a lib/libLLVMRemarks.a lib/libLLVMBitstreamReader.a lib/libLLVMTextAPI.a lib/libLLVMBinaryFormat.a lib/libLLVMDebugInfoCodeView.a lib/libLLVMDebugInfoMSF.a lib/libLLVMSupport.a -lz -lcurses -lm lib/libLLVMDemangle.a && : FAILED: tools/clang/runtime/CMakeFiles/check-compiler-rt cd /Users/buildslave/jenkins/workspace/test-mr-clang-stage1-RA/clang-build/tools/clang/runtime/compiler-rt-bins && /usr/local/Cellar/cmake/3.15.1/bin/cmake --build . --target check-all --config RelWithDebInfo ninja: build stopped: cannot make progress due to previous errors. Command failed Command: ['/usr/local/bin/ninja', '-v', '-k', '0', 'check-all'] Build step 'Execute shell' marked build as failure New run name is 'rL:372578 - C:372575 - #739' [WARNINGS] Parsing warnings in console log with parser Clang (LLVM based) Skipping warnings blame since Git is the only supported SCM up to now.%n [WARNINGS] Computing warning deltas based on reference build rL:372576 - C:372575 - #738 Recording test results ERROR: Step ‘Publish JUnit test result report’ failed: No test report files were found. Configuration error? IRC notifier plugin: Sending notification to: #llvm-build [BFA] Scanning build for known causes... [BFA] Found failure cause(s): [BFA] Ninja target failed from category Compile [BFA] Compile Error from category Compile [BFA] Assertion failure from category Assert [BFA] Regression test failed from category Test [BFA] Missing test results from category Infrastructure [BFA] Done. 1s Email was triggered for: Failure - 1st Trigger Failure - Any was overridden by another trigger and will not send an email. Trigger Failure - Still was overridden by another trigger and will not send an email. Sending email for trigger: Failure - 1st Not sending mail to unregistered user grimar@accesssoftek.com because your SCM claimed this was associated with a user ID ‘grimar' which your security realm does not recognize; you may need changes in your SCM plugin

Hide Details

Begin Pre-Send Script... Sending email to: llvm-dev@redking.me.uk Andi Bergenn <abergen@apple.com> Andi Bergen <abergen@apple.com> Azhar Mohammed <azhar@apple.com> Finished: FAILURE