FailedConsole Output

Skipping 24,509 KB.. Full Log

Hide Details

[8473/8583] : && /Users/buildslave/jenkins/workspace/test-suite-verify-machineinstrs-aarch64-O0-g/test-suite-build/tools/timeit --summary SingleSource/Regression/C/Regression-C-badidx.link.time /Users/buildslave/jenkins/workspace/test-suite-verify-machineinstrs-aarch64-O0-g/compiler/bin/clang -B /Applications/Xcode.app/Contents/Developer/Toolchains/XcodeDefault.xctoolchain/usr/bin -Wno-unused-command-line-argument -mllvm -verify-machineinstrs -O0 -g -arch arm64 -isysroot /Applications/Xcode.app/Contents/Developer/Platforms/iPhoneOS.platform/Developer/SDKs/iPhoneOS12.1.sdk -Wl,-search_paths_first -Wl,-headerpad_max_install_names -B /Applications/Xcode.app/Contents/Developer/Toolchains/XcodeDefault.xctoolchain/usr/bin SingleSource/Regression/C/CMakeFiles/Regression-C-badidx.dir/badidx.c.o -o SingleSource/Regression/C/Regression-C-badidx -lm && cd /Users/buildslave/jenkins/workspace/test-suite-verify-machineinstrs-aarch64-O0-g/test-suite-build/SingleSource/Regression/C && /usr/local/Cellar/cmake/3.13.1/bin/cmake -E create_symlink /Users/buildslave/jenkins/workspace/test-suite-verify-machineinstrs-aarch64-O0-g/test-suite/SingleSource/Regression/C/badidx.reference_output /Users/buildslave/jenkins/workspace/test-suite-verify-machineinstrs-aarch64-O0-g/test-suite-build/SingleSource/Regression/C/badidx.reference_output [8474/8583] : && /Users/buildslave/jenkins/workspace/test-suite-verify-machineinstrs-aarch64-O0-g/test-suite-build/tools/timeit --summary SingleSource/UnitTests/ObjC++/property-reference-object.link.time /Users/buildslave/jenkins/workspace/test-suite-verify-machineinstrs-aarch64-O0-g/compiler/bin/clang++ -B /Applications/Xcode.app/Contents/Developer/Toolchains/XcodeDefault.xctoolchain/usr/bin -Wno-unused-command-line-argument -mllvm -verify-machineinstrs -O0 -g -arch arm64 -isysroot /Applications/Xcode.app/Contents/Developer/Platforms/iPhoneOS.platform/Developer/SDKs/iPhoneOS12.1.sdk -Wl,-search_paths_first -Wl,-headerpad_max_install_names -B /Applications/Xcode.app/Contents/Developer/Toolchains/XcodeDefault.xctoolchain/usr/bin SingleSource/UnitTests/ObjC++/CMakeFiles/property-reference-object.dir/property-reference-object.mm.o -o SingleSource/UnitTests/ObjC++/property-reference-object -lstdc++ -lobjc -framework Foundation && cd /Users/buildslave/jenkins/workspace/test-suite-verify-machineinstrs-aarch64-O0-g/test-suite-build/SingleSource/UnitTests/ObjC++ && /usr/local/Cellar/cmake/3.13.1/bin/cmake -E create_symlink /Users/buildslave/jenkins/workspace/test-suite-verify-machineinstrs-aarch64-O0-g/test-suite/SingleSource/UnitTests/ObjC++/property-reference-object.reference_output /Users/buildslave/jenkins/workspace/test-suite-verify-machineinstrs-aarch64-O0-g/test-suite-build/SingleSource/UnitTests/ObjC++/property-reference-object.reference_output [8475/8583] /Users/buildslave/jenkins/workspace/test-suite-verify-machineinstrs-aarch64-O0-g/test-suite-build/tools/timeit --summary SingleSource/Regression/C/CMakeFiles/Regression-C-PR640.dir/PR640.c.o.time /Users/buildslave/jenkins/workspace/test-suite-verify-machineinstrs-aarch64-O0-g/compiler/bin/clang -DNDEBUG -B /Applications/Xcode.app/Contents/Developer/Toolchains/XcodeDefault.xctoolchain/usr/bin -Wno-unused-command-line-argument -mllvm -verify-machineinstrs -O0 -g -arch arm64 -isysroot /Applications/Xcode.app/Contents/Developer/Platforms/iPhoneOS.platform/Developer/SDKs/iPhoneOS12.1.sdk -w -Werror=date-time -MD -MT SingleSource/Regression/C/CMakeFiles/Regression-C-PR640.dir/PR640.c.o -MF SingleSource/Regression/C/CMakeFiles/Regression-C-PR640.dir/PR640.c.o.d -o SingleSource/Regression/C/CMakeFiles/Regression-C-PR640.dir/PR640.c.o -c /Users/buildslave/jenkins/workspace/test-suite-verify-machineinstrs-aarch64-O0-g/test-suite/SingleSource/Regression/C/PR640.c [8476/8583] : && /Users/buildslave/jenkins/workspace/test-suite-verify-machineinstrs-aarch64-O0-g/test-suite-build/tools/timeit --summary SingleSource/Regression/C/Regression-C-2004-08-12-InlinerAndAllocas.link.time /Users/buildslave/jenkins/workspace/test-suite-verify-machineinstrs-aarch64-O0-g/compiler/bin/clang -B /Applications/Xcode.app/Contents/Developer/Toolchains/XcodeDefault.xctoolchain/usr/bin -Wno-unused-command-line-argument -mllvm -verify-machineinstrs -O0 -g -arch arm64 -isysroot /Applications/Xcode.app/Contents/Developer/Platforms/iPhoneOS.platform/Developer/SDKs/iPhoneOS12.1.sdk -Wl,-search_paths_first -Wl,-headerpad_max_install_names -B /Applications/Xcode.app/Contents/Developer/Toolchains/XcodeDefault.xctoolchain/usr/bin SingleSource/Regression/C/CMakeFiles/Regression-C-2004-08-12-InlinerAndAllocas.dir/2004-08-12-InlinerAndAllocas.c.o -o SingleSource/Regression/C/Regression-C-2004-08-12-InlinerAndAllocas -lm && cd /Users/buildslave/jenkins/workspace/test-suite-verify-machineinstrs-aarch64-O0-g/test-suite-build/SingleSource/Regression/C && /usr/local/Cellar/cmake/3.13.1/bin/cmake -E create_symlink /Users/buildslave/jenkins/workspace/test-suite-verify-machineinstrs-aarch64-O0-g/test-suite/SingleSource/Regression/C/2004-08-12-InlinerAndAllocas.reference_output /Users/buildslave/jenkins/workspace/test-suite-verify-machineinstrs-aarch64-O0-g/test-suite-build/SingleSource/Regression/C/2004-08-12-InlinerAndAllocas.reference_output [8477/8583] : && /Users/buildslave/jenkins/workspace/test-suite-verify-machineinstrs-aarch64-O0-g/test-suite-build/tools/timeit --summary SingleSource/Regression/C/Regression-C-PR640.link.time /Users/buildslave/jenkins/workspace/test-suite-verify-machineinstrs-aarch64-O0-g/compiler/bin/clang -B /Applications/Xcode.app/Contents/Developer/Toolchains/XcodeDefault.xctoolchain/usr/bin -Wno-unused-command-line-argument -mllvm -verify-machineinstrs -O0 -g -arch arm64 -isysroot /Applications/Xcode.app/Contents/Developer/Platforms/iPhoneOS.platform/Developer/SDKs/iPhoneOS12.1.sdk -Wl,-search_paths_first -Wl,-headerpad_max_install_names -B /Applications/Xcode.app/Contents/Developer/Toolchains/XcodeDefault.xctoolchain/usr/bin SingleSource/Regression/C/CMakeFiles/Regression-C-PR640.dir/PR640.c.o -o SingleSource/Regression/C/Regression-C-PR640 -lm && cd /Users/buildslave/jenkins/workspace/test-suite-verify-machineinstrs-aarch64-O0-g/test-suite-build/SingleSource/Regression/C && /usr/local/Cellar/cmake/3.13.1/bin/cmake -E create_symlink /Users/buildslave/jenkins/workspace/test-suite-verify-machineinstrs-aarch64-O0-g/test-suite/SingleSource/Regression/C/PR640.reference_output /Users/buildslave/jenkins/workspace/test-suite-verify-machineinstrs-aarch64-O0-g/test-suite-build/SingleSource/Regression/C/PR640.reference_output [8478/8583] /Users/buildslave/jenkins/workspace/test-suite-verify-machineinstrs-aarch64-O0-g/test-suite-build/tools/timeit --summary SingleSource/Regression/C/CMakeFiles/Regression-C-PR1386.dir/PR1386.c.o.time /Users/buildslave/jenkins/workspace/test-suite-verify-machineinstrs-aarch64-O0-g/compiler/bin/clang -DNDEBUG -B /Applications/Xcode.app/Contents/Developer/Toolchains/XcodeDefault.xctoolchain/usr/bin -Wno-unused-command-line-argument -mllvm -verify-machineinstrs -O0 -g -arch arm64 -isysroot /Applications/Xcode.app/Contents/Developer/Platforms/iPhoneOS.platform/Developer/SDKs/iPhoneOS12.1.sdk -w -Werror=date-time -MD -MT SingleSource/Regression/C/CMakeFiles/Regression-C-PR1386.dir/PR1386.c.o -MF SingleSource/Regression/C/CMakeFiles/Regression-C-PR1386.dir/PR1386.c.o.d -o SingleSource/Regression/C/CMakeFiles/Regression-C-PR1386.dir/PR1386.c.o -c /Users/buildslave/jenkins/workspace/test-suite-verify-machineinstrs-aarch64-O0-g/test-suite/SingleSource/Regression/C/PR1386.c [8479/8583] /Users/buildslave/jenkins/workspace/test-suite-verify-machineinstrs-aarch64-O0-g/test-suite-build/tools/timeit --summary SingleSource/Regression/C/CMakeFiles/Regression-C-sumarraymalloc.dir/sumarraymalloc.c.o.time /Users/buildslave/jenkins/workspace/test-suite-verify-machineinstrs-aarch64-O0-g/compiler/bin/clang -DNDEBUG -B /Applications/Xcode.app/Contents/Developer/Toolchains/XcodeDefault.xctoolchain/usr/bin -Wno-unused-command-line-argument -mllvm -verify-machineinstrs -O0 -g -arch arm64 -isysroot /Applications/Xcode.app/Contents/Developer/Platforms/iPhoneOS.platform/Developer/SDKs/iPhoneOS12.1.sdk -w -Werror=date-time -MD -MT SingleSource/Regression/C/CMakeFiles/Regression-C-sumarraymalloc.dir/sumarraymalloc.c.o -MF SingleSource/Regression/C/CMakeFiles/Regression-C-sumarraymalloc.dir/sumarraymalloc.c.o.d -o SingleSource/Regression/C/CMakeFiles/Regression-C-sumarraymalloc.dir/sumarraymalloc.c.o -c /Users/buildslave/jenkins/workspace/test-suite-verify-machineinstrs-aarch64-O0-g/test-suite/SingleSource/Regression/C/sumarraymalloc.c [8480/8583] : && /Users/buildslave/jenkins/workspace/test-suite-verify-machineinstrs-aarch64-O0-g/test-suite-build/tools/timeit --summary SingleSource/Regression/C/Regression-C-PR1386.link.time /Users/buildslave/jenkins/workspace/test-suite-verify-machineinstrs-aarch64-O0-g/compiler/bin/clang -B /Applications/Xcode.app/Contents/Developer/Toolchains/XcodeDefault.xctoolchain/usr/bin -Wno-unused-command-line-argument -mllvm -verify-machineinstrs -O0 -g -arch arm64 -isysroot /Applications/Xcode.app/Contents/Developer/Platforms/iPhoneOS.platform/Developer/SDKs/iPhoneOS12.1.sdk -Wl,-search_paths_first -Wl,-headerpad_max_install_names -B /Applications/Xcode.app/Contents/Developer/Toolchains/XcodeDefault.xctoolchain/usr/bin SingleSource/Regression/C/CMakeFiles/Regression-C-PR1386.dir/PR1386.c.o -o SingleSource/Regression/C/Regression-C-PR1386 -lm && cd /Users/buildslave/jenkins/workspace/test-suite-verify-machineinstrs-aarch64-O0-g/test-suite-build/SingleSource/Regression/C && /usr/local/Cellar/cmake/3.13.1/bin/cmake -E create_symlink /Users/buildslave/jenkins/workspace/test-suite-verify-machineinstrs-aarch64-O0-g/test-suite/SingleSource/Regression/C/PR1386.reference_output /Users/buildslave/jenkins/workspace/test-suite-verify-machineinstrs-aarch64-O0-g/test-suite-build/SingleSource/Regression/C/PR1386.reference_output [8481/8583] : && /Users/buildslave/jenkins/workspace/test-suite-verify-machineinstrs-aarch64-O0-g/test-suite-build/tools/timeit --summary SingleSource/Regression/C/Regression-C-sumarraymalloc.link.time /Users/buildslave/jenkins/workspace/test-suite-verify-machineinstrs-aarch64-O0-g/compiler/bin/clang -B /Applications/Xcode.app/Contents/Developer/Toolchains/XcodeDefault.xctoolchain/usr/bin -Wno-unused-command-line-argument -mllvm -verify-machineinstrs -O0 -g -arch arm64 -isysroot /Applications/Xcode.app/Contents/Developer/Platforms/iPhoneOS.platform/Developer/SDKs/iPhoneOS12.1.sdk -Wl,-search_paths_first -Wl,-headerpad_max_install_names -B /Applications/Xcode.app/Contents/Developer/Toolchains/XcodeDefault.xctoolchain/usr/bin SingleSource/Regression/C/CMakeFiles/Regression-C-sumarraymalloc.dir/sumarraymalloc.c.o -o SingleSource/Regression/C/Regression-C-sumarraymalloc -lm && cd /Users/buildslave/jenkins/workspace/test-suite-verify-machineinstrs-aarch64-O0-g/test-suite-build/SingleSource/Regression/C && /usr/local/Cellar/cmake/3.13.1/bin/cmake -E create_symlink /Users/buildslave/jenkins/workspace/test-suite-verify-machineinstrs-aarch64-O0-g/test-suite/SingleSource/Regression/C/sumarraymalloc.reference_output /Users/buildslave/jenkins/workspace/test-suite-verify-machineinstrs-aarch64-O0-g/test-suite-build/SingleSource/Regression/C/sumarraymalloc.reference_output [8482/8583] /Users/buildslave/jenkins/workspace/test-suite-verify-machineinstrs-aarch64-O0-g/test-suite-build/tools/timeit --summary SingleSource/Regression/C/CMakeFiles/Regression-C-ConstructorDestructorAttributes.dir/ConstructorDestructorAttributes.c.o.time /Users/buildslave/jenkins/workspace/test-suite-verify-machineinstrs-aarch64-O0-g/compiler/bin/clang -DNDEBUG -B /Applications/Xcode.app/Contents/Developer/Toolchains/XcodeDefault.xctoolchain/usr/bin -Wno-unused-command-line-argument -mllvm -verify-machineinstrs -O0 -g -arch arm64 -isysroot /Applications/Xcode.app/Contents/Developer/Platforms/iPhoneOS.platform/Developer/SDKs/iPhoneOS12.1.sdk -w -Werror=date-time -MD -MT SingleSource/Regression/C/CMakeFiles/Regression-C-ConstructorDestructorAttributes.dir/ConstructorDestructorAttributes.c.o -MF SingleSource/Regression/C/CMakeFiles/Regression-C-ConstructorDestructorAttributes.dir/ConstructorDestructorAttributes.c.o.d -o SingleSource/Regression/C/CMakeFiles/Regression-C-ConstructorDestructorAttributes.dir/ConstructorDestructorAttributes.c.o -c /Users/buildslave/jenkins/workspace/test-suite-verify-machineinstrs-aarch64-O0-g/test-suite/SingleSource/Regression/C/ConstructorDestructorAttributes.c [8483/8583] /Users/buildslave/jenkins/workspace/test-suite-verify-machineinstrs-aarch64-O0-g/test-suite-build/tools/timeit --summary SingleSource/Regression/C/CMakeFiles/Regression-C-uint64_to_float.dir/uint64_to_float.c.o.time /Users/buildslave/jenkins/workspace/test-suite-verify-machineinstrs-aarch64-O0-g/compiler/bin/clang -DNDEBUG -B /Applications/Xcode.app/Contents/Developer/Toolchains/XcodeDefault.xctoolchain/usr/bin -Wno-unused-command-line-argument -mllvm -verify-machineinstrs -O0 -g -arch arm64 -isysroot /Applications/Xcode.app/Contents/Developer/Platforms/iPhoneOS.platform/Developer/SDKs/iPhoneOS12.1.sdk -w -Werror=date-time -MD -MT SingleSource/Regression/C/CMakeFiles/Regression-C-uint64_to_float.dir/uint64_to_float.c.o -MF SingleSource/Regression/C/CMakeFiles/Regression-C-uint64_to_float.dir/uint64_to_float.c.o.d -o SingleSource/Regression/C/CMakeFiles/Regression-C-uint64_to_float.dir/uint64_to_float.c.o -c /Users/buildslave/jenkins/workspace/test-suite-verify-machineinstrs-aarch64-O0-g/test-suite/SingleSource/Regression/C/uint64_to_float.c [8484/8583] : && /Users/buildslave/jenkins/workspace/test-suite-verify-machineinstrs-aarch64-O0-g/test-suite-build/tools/timeit --summary SingleSource/Regression/C/Regression-C-ConstructorDestructorAttributes.link.time /Users/buildslave/jenkins/workspace/test-suite-verify-machineinstrs-aarch64-O0-g/compiler/bin/clang -B /Applications/Xcode.app/Contents/Developer/Toolchains/XcodeDefault.xctoolchain/usr/bin -Wno-unused-command-line-argument -mllvm -verify-machineinstrs -O0 -g -arch arm64 -isysroot /Applications/Xcode.app/Contents/Developer/Platforms/iPhoneOS.platform/Developer/SDKs/iPhoneOS12.1.sdk -Wl,-search_paths_first -Wl,-headerpad_max_install_names -B /Applications/Xcode.app/Contents/Developer/Toolchains/XcodeDefault.xctoolchain/usr/bin SingleSource/Regression/C/CMakeFiles/Regression-C-ConstructorDestructorAttributes.dir/ConstructorDestructorAttributes.c.o -o SingleSource/Regression/C/Regression-C-ConstructorDestructorAttributes -lm && cd /Users/buildslave/jenkins/workspace/test-suite-verify-machineinstrs-aarch64-O0-g/test-suite-build/SingleSource/Regression/C && /usr/local/Cellar/cmake/3.13.1/bin/cmake -E create_symlink /Users/buildslave/jenkins/workspace/test-suite-verify-machineinstrs-aarch64-O0-g/test-suite/SingleSource/Regression/C/ConstructorDestructorAttributes.reference_output /Users/buildslave/jenkins/workspace/test-suite-verify-machineinstrs-aarch64-O0-g/test-suite-build/SingleSource/Regression/C/ConstructorDestructorAttributes.reference_output [8485/8583] : && /Users/buildslave/jenkins/workspace/test-suite-verify-machineinstrs-aarch64-O0-g/test-suite-build/tools/timeit --summary SingleSource/Regression/C/Regression-C-uint64_to_float.link.time /Users/buildslave/jenkins/workspace/test-suite-verify-machineinstrs-aarch64-O0-g/compiler/bin/clang -B /Applications/Xcode.app/Contents/Developer/Toolchains/XcodeDefault.xctoolchain/usr/bin -Wno-unused-command-line-argument -mllvm -verify-machineinstrs -O0 -g -arch arm64 -isysroot /Applications/Xcode.app/Contents/Developer/Platforms/iPhoneOS.platform/Developer/SDKs/iPhoneOS12.1.sdk -Wl,-search_paths_first -Wl,-headerpad_max_install_names -B /Applications/Xcode.app/Contents/Developer/Toolchains/XcodeDefault.xctoolchain/usr/bin SingleSource/Regression/C/CMakeFiles/Regression-C-uint64_to_float.dir/uint64_to_float.c.o -o SingleSource/Regression/C/Regression-C-uint64_to_float -lm && cd /Users/buildslave/jenkins/workspace/test-suite-verify-machineinstrs-aarch64-O0-g/test-suite-build/SingleSource/Regression/C && /usr/local/Cellar/cmake/3.13.1/bin/cmake -E create_symlink /Users/buildslave/jenkins/workspace/test-suite-verify-machineinstrs-aarch64-O0-g/test-suite/SingleSource/Regression/C/uint64_to_float.reference_output /Users/buildslave/jenkins/workspace/test-suite-verify-machineinstrs-aarch64-O0-g/test-suite-build/SingleSource/Regression/C/uint64_to_float.reference_output [8486/8583] /Users/buildslave/jenkins/workspace/test-suite-verify-machineinstrs-aarch64-O0-g/test-suite-build/tools/timeit --summary SingleSource/Regression/C/CMakeFiles/Regression-C-2008-01-07-LongDouble.dir/2008-01-07-LongDouble.c.o.time /Users/buildslave/jenkins/workspace/test-suite-verify-machineinstrs-aarch64-O0-g/compiler/bin/clang -DNDEBUG -B /Applications/Xcode.app/Contents/Developer/Toolchains/XcodeDefault.xctoolchain/usr/bin -Wno-unused-command-line-argument -mllvm -verify-machineinstrs -O0 -g -arch arm64 -isysroot /Applications/Xcode.app/Contents/Developer/Platforms/iPhoneOS.platform/Developer/SDKs/iPhoneOS12.1.sdk -w -Werror=date-time -MD -MT SingleSource/Regression/C/CMakeFiles/Regression-C-2008-01-07-LongDouble.dir/2008-01-07-LongDouble.c.o -MF SingleSource/Regression/C/CMakeFiles/Regression-C-2008-01-07-LongDouble.dir/2008-01-07-LongDouble.c.o.d -o SingleSource/Regression/C/CMakeFiles/Regression-C-2008-01-07-LongDouble.dir/2008-01-07-LongDouble.c.o -c /Users/buildslave/jenkins/workspace/test-suite-verify-machineinstrs-aarch64-O0-g/test-suite/SingleSource/Regression/C/2008-01-07-LongDouble.c [8487/8583] /Users/buildslave/jenkins/workspace/test-suite-verify-machineinstrs-aarch64-O0-g/test-suite-build/tools/timeit --summary SingleSource/Regression/C/CMakeFiles/Regression-C-DuffsDevice.dir/DuffsDevice.c.o.time /Users/buildslave/jenkins/workspace/test-suite-verify-machineinstrs-aarch64-O0-g/compiler/bin/clang -DNDEBUG -B /Applications/Xcode.app/Contents/Developer/Toolchains/XcodeDefault.xctoolchain/usr/bin -Wno-unused-command-line-argument -mllvm -verify-machineinstrs -O0 -g -arch arm64 -isysroot /Applications/Xcode.app/Contents/Developer/Platforms/iPhoneOS.platform/Developer/SDKs/iPhoneOS12.1.sdk -w -Werror=date-time -MD -MT SingleSource/Regression/C/CMakeFiles/Regression-C-DuffsDevice.dir/DuffsDevice.c.o -MF SingleSource/Regression/C/CMakeFiles/Regression-C-DuffsDevice.dir/DuffsDevice.c.o.d -o SingleSource/Regression/C/CMakeFiles/Regression-C-DuffsDevice.dir/DuffsDevice.c.o -c /Users/buildslave/jenkins/workspace/test-suite-verify-machineinstrs-aarch64-O0-g/test-suite/SingleSource/Regression/C/DuffsDevice.c [8488/8583] : && /Users/buildslave/jenkins/workspace/test-suite-verify-machineinstrs-aarch64-O0-g/test-suite-build/tools/timeit --summary SingleSource/Regression/C/Regression-C-2008-01-07-LongDouble.link.time /Users/buildslave/jenkins/workspace/test-suite-verify-machineinstrs-aarch64-O0-g/compiler/bin/clang -B /Applications/Xcode.app/Contents/Developer/Toolchains/XcodeDefault.xctoolchain/usr/bin -Wno-unused-command-line-argument -mllvm -verify-machineinstrs -O0 -g -arch arm64 -isysroot /Applications/Xcode.app/Contents/Developer/Platforms/iPhoneOS.platform/Developer/SDKs/iPhoneOS12.1.sdk -Wl,-search_paths_first -Wl,-headerpad_max_install_names -B /Applications/Xcode.app/Contents/Developer/Toolchains/XcodeDefault.xctoolchain/usr/bin SingleSource/Regression/C/CMakeFiles/Regression-C-2008-01-07-LongDouble.dir/2008-01-07-LongDouble.c.o -o SingleSource/Regression/C/Regression-C-2008-01-07-LongDouble -lm && cd /Users/buildslave/jenkins/workspace/test-suite-verify-machineinstrs-aarch64-O0-g/test-suite-build/SingleSource/Regression/C && /usr/local/Cellar/cmake/3.13.1/bin/cmake -E create_symlink /Users/buildslave/jenkins/workspace/test-suite-verify-machineinstrs-aarch64-O0-g/test-suite/SingleSource/Regression/C/2008-01-07-LongDouble.reference_output /Users/buildslave/jenkins/workspace/test-suite-verify-machineinstrs-aarch64-O0-g/test-suite-build/SingleSource/Regression/C/2008-01-07-LongDouble.reference_output [8489/8583] : && /Users/buildslave/jenkins/workspace/test-suite-verify-machineinstrs-aarch64-O0-g/test-suite-build/tools/timeit --summary SingleSource/Regression/C/Regression-C-DuffsDevice.link.time /Users/buildslave/jenkins/workspace/test-suite-verify-machineinstrs-aarch64-O0-g/compiler/bin/clang -B /Applications/Xcode.app/Contents/Developer/Toolchains/XcodeDefault.xctoolchain/usr/bin -Wno-unused-command-line-argument -mllvm -verify-machineinstrs -O0 -g -arch arm64 -isysroot /Applications/Xcode.app/Contents/Developer/Platforms/iPhoneOS.platform/Developer/SDKs/iPhoneOS12.1.sdk -Wl,-search_paths_first -Wl,-headerpad_max_install_names -B /Applications/Xcode.app/Contents/Developer/Toolchains/XcodeDefault.xctoolchain/usr/bin SingleSource/Regression/C/CMakeFiles/Regression-C-DuffsDevice.dir/DuffsDevice.c.o -o SingleSource/Regression/C/Regression-C-DuffsDevice -lm && cd /Users/buildslave/jenkins/workspace/test-suite-verify-machineinstrs-aarch64-O0-g/test-suite-build/SingleSource/Regression/C && /usr/local/Cellar/cmake/3.13.1/bin/cmake -E create_symlink /Users/buildslave/jenkins/workspace/test-suite-verify-machineinstrs-aarch64-O0-g/test-suite/SingleSource/Regression/C/DuffsDevice.reference_output /Users/buildslave/jenkins/workspace/test-suite-verify-machineinstrs-aarch64-O0-g/test-suite-build/SingleSource/Regression/C/DuffsDevice.reference_output [8490/8583] /Users/buildslave/jenkins/workspace/test-suite-verify-machineinstrs-aarch64-O0-g/test-suite-build/tools/timeit --summary SingleSource/Regression/C/CMakeFiles/Regression-C-2003-05-22-VarSizeArray.dir/2003-05-22-VarSizeArray.c.o.time /Users/buildslave/jenkins/workspace/test-suite-verify-machineinstrs-aarch64-O0-g/compiler/bin/clang -DNDEBUG -B /Applications/Xcode.app/Contents/Developer/Toolchains/XcodeDefault.xctoolchain/usr/bin -Wno-unused-command-line-argument -mllvm -verify-machineinstrs -O0 -g -arch arm64 -isysroot /Applications/Xcode.app/Contents/Developer/Platforms/iPhoneOS.platform/Developer/SDKs/iPhoneOS12.1.sdk -w -Werror=date-time -MD -MT SingleSource/Regression/C/CMakeFiles/Regression-C-2003-05-22-VarSizeArray.dir/2003-05-22-VarSizeArray.c.o -MF SingleSource/Regression/C/CMakeFiles/Regression-C-2003-05-22-VarSizeArray.dir/2003-05-22-VarSizeArray.c.o.d -o SingleSource/Regression/C/CMakeFiles/Regression-C-2003-05-22-VarSizeArray.dir/2003-05-22-VarSizeArray.c.o -c /Users/buildslave/jenkins/workspace/test-suite-verify-machineinstrs-aarch64-O0-g/test-suite/SingleSource/Regression/C/2003-05-22-VarSizeArray.c [8491/8583] /Users/buildslave/jenkins/workspace/test-suite-verify-machineinstrs-aarch64-O0-g/test-suite-build/tools/timeit --summary SingleSource/Regression/C/CMakeFiles/Regression-C-2003-05-22-LocalTypeTest.dir/2003-05-22-LocalTypeTest.c.o.time /Users/buildslave/jenkins/workspace/test-suite-verify-machineinstrs-aarch64-O0-g/compiler/bin/clang -DNDEBUG -B /Applications/Xcode.app/Contents/Developer/Toolchains/XcodeDefault.xctoolchain/usr/bin -Wno-unused-command-line-argument -mllvm -verify-machineinstrs -O0 -g -arch arm64 -isysroot /Applications/Xcode.app/Contents/Developer/Platforms/iPhoneOS.platform/Developer/SDKs/iPhoneOS12.1.sdk -w -Werror=date-time -MD -MT SingleSource/Regression/C/CMakeFiles/Regression-C-2003-05-22-LocalTypeTest.dir/2003-05-22-LocalTypeTest.c.o -MF SingleSource/Regression/C/CMakeFiles/Regression-C-2003-05-22-LocalTypeTest.dir/2003-05-22-LocalTypeTest.c.o.d -o SingleSource/Regression/C/CMakeFiles/Regression-C-2003-05-22-LocalTypeTest.dir/2003-05-22-LocalTypeTest.c.o -c /Users/buildslave/jenkins/workspace/test-suite-verify-machineinstrs-aarch64-O0-g/test-suite/SingleSource/Regression/C/2003-05-22-LocalTypeTest.c [8492/8583] /Users/buildslave/jenkins/workspace/test-suite-verify-machineinstrs-aarch64-O0-g/test-suite-build/tools/timeit --summary SingleSource/Regression/C/CMakeFiles/Regression-C-2005-05-06-LongLongSignedShift.dir/2005-05-06-LongLongSignedShift.c.o.time /Users/buildslave/jenkins/workspace/test-suite-verify-machineinstrs-aarch64-O0-g/compiler/bin/clang -DNDEBUG -B /Applications/Xcode.app/Contents/Developer/Toolchains/XcodeDefault.xctoolchain/usr/bin -Wno-unused-command-line-argument -mllvm -verify-machineinstrs -O0 -g -arch arm64 -isysroot /Applications/Xcode.app/Contents/Developer/Platforms/iPhoneOS.platform/Developer/SDKs/iPhoneOS12.1.sdk -w -Werror=date-time -MD -MT SingleSource/Regression/C/CMakeFiles/Regression-C-2005-05-06-LongLongSignedShift.dir/2005-05-06-LongLongSignedShift.c.o -MF SingleSource/Regression/C/CMakeFiles/Regression-C-2005-05-06-LongLongSignedShift.dir/2005-05-06-LongLongSignedShift.c.o.d -o SingleSource/Regression/C/CMakeFiles/Regression-C-2005-05-06-LongLongSignedShift.dir/2005-05-06-LongLongSignedShift.c.o -c /Users/buildslave/jenkins/workspace/test-suite-verify-machineinstrs-aarch64-O0-g/test-suite/SingleSource/Regression/C/2005-05-06-LongLongSignedShift.c [8493/8583] : && /Users/buildslave/jenkins/workspace/test-suite-verify-machineinstrs-aarch64-O0-g/test-suite-build/tools/timeit --summary SingleSource/Regression/C/Regression-C-2003-05-22-VarSizeArray.link.time /Users/buildslave/jenkins/workspace/test-suite-verify-machineinstrs-aarch64-O0-g/compiler/bin/clang -B /Applications/Xcode.app/Contents/Developer/Toolchains/XcodeDefault.xctoolchain/usr/bin -Wno-unused-command-line-argument -mllvm -verify-machineinstrs -O0 -g -arch arm64 -isysroot /Applications/Xcode.app/Contents/Developer/Platforms/iPhoneOS.platform/Developer/SDKs/iPhoneOS12.1.sdk -Wl,-search_paths_first -Wl,-headerpad_max_install_names -B /Applications/Xcode.app/Contents/Developer/Toolchains/XcodeDefault.xctoolchain/usr/bin SingleSource/Regression/C/CMakeFiles/Regression-C-2003-05-22-VarSizeArray.dir/2003-05-22-VarSizeArray.c.o -o SingleSource/Regression/C/Regression-C-2003-05-22-VarSizeArray -lm && cd /Users/buildslave/jenkins/workspace/test-suite-verify-machineinstrs-aarch64-O0-g/test-suite-build/SingleSource/Regression/C && /usr/local/Cellar/cmake/3.13.1/bin/cmake -E create_symlink /Users/buildslave/jenkins/workspace/test-suite-verify-machineinstrs-aarch64-O0-g/test-suite/SingleSource/Regression/C/2003-05-22-VarSizeArray.reference_output /Users/buildslave/jenkins/workspace/test-suite-verify-machineinstrs-aarch64-O0-g/test-suite-build/SingleSource/Regression/C/2003-05-22-VarSizeArray.reference_output [8494/8583] : && /Users/buildslave/jenkins/workspace/test-suite-verify-machineinstrs-aarch64-O0-g/test-suite-build/tools/timeit --summary SingleSource/Regression/C/Regression-C-2003-05-22-LocalTypeTest.link.time /Users/buildslave/jenkins/workspace/test-suite-verify-machineinstrs-aarch64-O0-g/compiler/bin/clang -B /Applications/Xcode.app/Contents/Developer/Toolchains/XcodeDefault.xctoolchain/usr/bin -Wno-unused-command-line-argument -mllvm -verify-machineinstrs -O0 -g -arch arm64 -isysroot /Applications/Xcode.app/Contents/Developer/Platforms/iPhoneOS.platform/Developer/SDKs/iPhoneOS12.1.sdk -Wl,-search_paths_first -Wl,-headerpad_max_install_names -B /Applications/Xcode.app/Contents/Developer/Toolchains/XcodeDefault.xctoolchain/usr/bin SingleSource/Regression/C/CMakeFiles/Regression-C-2003-05-22-LocalTypeTest.dir/2003-05-22-LocalTypeTest.c.o -o SingleSource/Regression/C/Regression-C-2003-05-22-LocalTypeTest -lm && cd /Users/buildslave/jenkins/workspace/test-suite-verify-machineinstrs-aarch64-O0-g/test-suite-build/SingleSource/Regression/C && /usr/local/Cellar/cmake/3.13.1/bin/cmake -E create_symlink /Users/buildslave/jenkins/workspace/test-suite-verify-machineinstrs-aarch64-O0-g/test-suite/SingleSource/Regression/C/2003-05-22-LocalTypeTest.reference_output /Users/buildslave/jenkins/workspace/test-suite-verify-machineinstrs-aarch64-O0-g/test-suite-build/SingleSource/Regression/C/2003-05-22-LocalTypeTest.reference_output [8495/8583] /Users/buildslave/jenkins/workspace/test-suite-verify-machineinstrs-aarch64-O0-g/test-suite-build/tools/timeit --summary SingleSource/Regression/C/CMakeFiles/Regression-C-2004-02-03-AggregateCopy.dir/2004-02-03-AggregateCopy.c.o.time /Users/buildslave/jenkins/workspace/test-suite-verify-machineinstrs-aarch64-O0-g/compiler/bin/clang -DNDEBUG -B /Applications/Xcode.app/Contents/Developer/Toolchains/XcodeDefault.xctoolchain/usr/bin -Wno-unused-command-line-argument -mllvm -verify-machineinstrs -O0 -g -arch arm64 -isysroot /Applications/Xcode.app/Contents/Developer/Platforms/iPhoneOS.platform/Developer/SDKs/iPhoneOS12.1.sdk -w -Werror=date-time -MD -MT SingleSource/Regression/C/CMakeFiles/Regression-C-2004-02-03-AggregateCopy.dir/2004-02-03-AggregateCopy.c.o -MF SingleSource/Regression/C/CMakeFiles/Regression-C-2004-02-03-AggregateCopy.dir/2004-02-03-AggregateCopy.c.o.d -o SingleSource/Regression/C/CMakeFiles/Regression-C-2004-02-03-AggregateCopy.dir/2004-02-03-AggregateCopy.c.o -c /Users/buildslave/jenkins/workspace/test-suite-verify-machineinstrs-aarch64-O0-g/test-suite/SingleSource/Regression/C/2004-02-03-AggregateCopy.c [8496/8583] : && /Users/buildslave/jenkins/workspace/test-suite-verify-machineinstrs-aarch64-O0-g/test-suite-build/tools/timeit --summary SingleSource/Regression/C/Regression-C-2005-05-06-LongLongSignedShift.link.time /Users/buildslave/jenkins/workspace/test-suite-verify-machineinstrs-aarch64-O0-g/compiler/bin/clang -B /Applications/Xcode.app/Contents/Developer/Toolchains/XcodeDefault.xctoolchain/usr/bin -Wno-unused-command-line-argument -mllvm -verify-machineinstrs -O0 -g -arch arm64 -isysroot /Applications/Xcode.app/Contents/Developer/Platforms/iPhoneOS.platform/Developer/SDKs/iPhoneOS12.1.sdk -Wl,-search_paths_first -Wl,-headerpad_max_install_names -B /Applications/Xcode.app/Contents/Developer/Toolchains/XcodeDefault.xctoolchain/usr/bin SingleSource/Regression/C/CMakeFiles/Regression-C-2005-05-06-LongLongSignedShift.dir/2005-05-06-LongLongSignedShift.c.o -o SingleSource/Regression/C/Regression-C-2005-05-06-LongLongSignedShift -lm && cd /Users/buildslave/jenkins/workspace/test-suite-verify-machineinstrs-aarch64-O0-g/test-suite-build/SingleSource/Regression/C && /usr/local/Cellar/cmake/3.13.1/bin/cmake -E create_symlink /Users/buildslave/jenkins/workspace/test-suite-verify-machineinstrs-aarch64-O0-g/test-suite/SingleSource/Regression/C/2005-05-06-LongLongSignedShift.reference_output /Users/buildslave/jenkins/workspace/test-suite-verify-machineinstrs-aarch64-O0-g/test-suite-build/SingleSource/Regression/C/2005-05-06-LongLongSignedShift.reference_output [8497/8583] /Users/buildslave/jenkins/workspace/test-suite-verify-machineinstrs-aarch64-O0-g/test-suite-build/tools/timeit --summary SingleSource/Regression/C/CMakeFiles/Regression-C-2004-03-15-IndirectGoto.dir/2004-03-15-IndirectGoto.c.o.time /Users/buildslave/jenkins/workspace/test-suite-verify-machineinstrs-aarch64-O0-g/compiler/bin/clang -DNDEBUG -B /Applications/Xcode.app/Contents/Developer/Toolchains/XcodeDefault.xctoolchain/usr/bin -Wno-unused-command-line-argument -mllvm -verify-machineinstrs -O0 -g -arch arm64 -isysroot /Applications/Xcode.app/Contents/Developer/Platforms/iPhoneOS.platform/Developer/SDKs/iPhoneOS12.1.sdk -w -Werror=date-time -MD -MT SingleSource/Regression/C/CMakeFiles/Regression-C-2004-03-15-IndirectGoto.dir/2004-03-15-IndirectGoto.c.o -MF SingleSource/Regression/C/CMakeFiles/Regression-C-2004-03-15-IndirectGoto.dir/2004-03-15-IndirectGoto.c.o.d -o SingleSource/Regression/C/CMakeFiles/Regression-C-2004-03-15-IndirectGoto.dir/2004-03-15-IndirectGoto.c.o -c /Users/buildslave/jenkins/workspace/test-suite-verify-machineinstrs-aarch64-O0-g/test-suite/SingleSource/Regression/C/2004-03-15-IndirectGoto.c [8498/8583] : && /Users/buildslave/jenkins/workspace/test-suite-verify-machineinstrs-aarch64-O0-g/test-suite-build/tools/timeit --summary SingleSource/Regression/C/Regression-C-2004-02-03-AggregateCopy.link.time /Users/buildslave/jenkins/workspace/test-suite-verify-machineinstrs-aarch64-O0-g/compiler/bin/clang -B /Applications/Xcode.app/Contents/Developer/Toolchains/XcodeDefault.xctoolchain/usr/bin -Wno-unused-command-line-argument -mllvm -verify-machineinstrs -O0 -g -arch arm64 -isysroot /Applications/Xcode.app/Contents/Developer/Platforms/iPhoneOS.platform/Developer/SDKs/iPhoneOS12.1.sdk -Wl,-search_paths_first -Wl,-headerpad_max_install_names -B /Applications/Xcode.app/Contents/Developer/Toolchains/XcodeDefault.xctoolchain/usr/bin SingleSource/Regression/C/CMakeFiles/Regression-C-2004-02-03-AggregateCopy.dir/2004-02-03-AggregateCopy.c.o -o SingleSource/Regression/C/Regression-C-2004-02-03-AggregateCopy -lm && cd /Users/buildslave/jenkins/workspace/test-suite-verify-machineinstrs-aarch64-O0-g/test-suite-build/SingleSource/Regression/C && /usr/local/Cellar/cmake/3.13.1/bin/cmake -E create_symlink /Users/buildslave/jenkins/workspace/test-suite-verify-machineinstrs-aarch64-O0-g/test-suite/SingleSource/Regression/C/2004-02-03-AggregateCopy.reference_output /Users/buildslave/jenkins/workspace/test-suite-verify-machineinstrs-aarch64-O0-g/test-suite-build/SingleSource/Regression/C/2004-02-03-AggregateCopy.reference_output [8499/8583] /Users/buildslave/jenkins/workspace/test-suite-verify-machineinstrs-aarch64-O0-g/test-suite-build/tools/timeit --summary SingleSource/Regression/C/CMakeFiles/Regression-C-2003-10-12-GlobalVarInitializers.dir/2003-10-12-GlobalVarInitializers.c.o.time /Users/buildslave/jenkins/workspace/test-suite-verify-machineinstrs-aarch64-O0-g/compiler/bin/clang -DNDEBUG -B /Applications/Xcode.app/Contents/Developer/Toolchains/XcodeDefault.xctoolchain/usr/bin -Wno-unused-command-line-argument -mllvm -verify-machineinstrs -O0 -g -arch arm64 -isysroot /Applications/Xcode.app/Contents/Developer/Platforms/iPhoneOS.platform/Developer/SDKs/iPhoneOS12.1.sdk -w -Werror=date-time -MD -MT SingleSource/Regression/C/CMakeFiles/Regression-C-2003-10-12-GlobalVarInitializers.dir/2003-10-12-GlobalVarInitializers.c.o -MF SingleSource/Regression/C/CMakeFiles/Regression-C-2003-10-12-GlobalVarInitializers.dir/2003-10-12-GlobalVarInitializers.c.o.d -o SingleSource/Regression/C/CMakeFiles/Regression-C-2003-10-12-GlobalVarInitializers.dir/2003-10-12-GlobalVarInitializers.c.o -c /Users/buildslave/jenkins/workspace/test-suite-verify-machineinstrs-aarch64-O0-g/test-suite/SingleSource/Regression/C/2003-10-12-GlobalVarInitializers.c [8500/8583] /Users/buildslave/jenkins/workspace/test-suite-verify-machineinstrs-aarch64-O0-g/test-suite-build/tools/timeit --summary SingleSource/UnitTests/ObjC++/CMakeFiles/property-reference.dir/property-reference.mm.o.time /Users/buildslave/jenkins/workspace/test-suite-verify-machineinstrs-aarch64-O0-g/compiler/bin/clang++ -DNDEBUG -B /Applications/Xcode.app/Contents/Developer/Toolchains/XcodeDefault.xctoolchain/usr/bin -Wno-unused-command-line-argument -mllvm -verify-machineinstrs -O0 -g -arch arm64 -isysroot /Applications/Xcode.app/Contents/Developer/Platforms/iPhoneOS.platform/Developer/SDKs/iPhoneOS12.1.sdk -w -Werror=date-time -MD -MT SingleSource/UnitTests/ObjC++/CMakeFiles/property-reference.dir/property-reference.mm.o -MF SingleSource/UnitTests/ObjC++/CMakeFiles/property-reference.dir/property-reference.mm.o.d -o SingleSource/UnitTests/ObjC++/CMakeFiles/property-reference.dir/property-reference.mm.o -c /Users/buildslave/jenkins/workspace/test-suite-verify-machineinstrs-aarch64-O0-g/test-suite/SingleSource/UnitTests/ObjC++/property-reference.mm [8501/8583] /Users/buildslave/jenkins/workspace/test-suite-verify-machineinstrs-aarch64-O0-g/test-suite-build/tools/timeit --summary SingleSource/Regression/C/CMakeFiles/Regression-C-PR10189.dir/PR10189.c.o.time /Users/buildslave/jenkins/workspace/test-suite-verify-machineinstrs-aarch64-O0-g/compiler/bin/clang -DNDEBUG -B /Applications/Xcode.app/Contents/Developer/Toolchains/XcodeDefault.xctoolchain/usr/bin -Wno-unused-command-line-argument -mllvm -verify-machineinstrs -O0 -g -arch arm64 -isysroot /Applications/Xcode.app/Contents/Developer/Platforms/iPhoneOS.platform/Developer/SDKs/iPhoneOS12.1.sdk -w -Werror=date-time -MD -MT SingleSource/Regression/C/CMakeFiles/Regression-C-PR10189.dir/PR10189.c.o -MF SingleSource/Regression/C/CMakeFiles/Regression-C-PR10189.dir/PR10189.c.o.d -o SingleSource/Regression/C/CMakeFiles/Regression-C-PR10189.dir/PR10189.c.o -c /Users/buildslave/jenkins/workspace/test-suite-verify-machineinstrs-aarch64-O0-g/test-suite/SingleSource/Regression/C/PR10189.c [8502/8583] /Users/buildslave/jenkins/workspace/test-suite-verify-machineinstrs-aarch64-O0-g/test-suite-build/tools/timeit --summary SingleSource/Regression/C/CMakeFiles/Regression-C-2003-06-16-VolatileError.dir/2003-06-16-VolatileError.c.o.time /Users/buildslave/jenkins/workspace/test-suite-verify-machineinstrs-aarch64-O0-g/compiler/bin/clang -DNDEBUG -B /Applications/Xcode.app/Contents/Developer/Toolchains/XcodeDefault.xctoolchain/usr/bin -Wno-unused-command-line-argument -mllvm -verify-machineinstrs -O0 -g -arch arm64 -isysroot /Applications/Xcode.app/Contents/Developer/Platforms/iPhoneOS.platform/Developer/SDKs/iPhoneOS12.1.sdk -w -Werror=date-time -MD -MT SingleSource/Regression/C/CMakeFiles/Regression-C-2003-06-16-VolatileError.dir/2003-06-16-VolatileError.c.o -MF SingleSource/Regression/C/CMakeFiles/Regression-C-2003-06-16-VolatileError.dir/2003-06-16-VolatileError.c.o.d -o SingleSource/Regression/C/CMakeFiles/Regression-C-2003-06-16-VolatileError.dir/2003-06-16-VolatileError.c.o -c /Users/buildslave/jenkins/workspace/test-suite-verify-machineinstrs-aarch64-O0-g/test-suite/SingleSource/Regression/C/2003-06-16-VolatileError.c [8503/8583] : && /Users/buildslave/jenkins/workspace/test-suite-verify-machineinstrs-aarch64-O0-g/test-suite-build/tools/timeit --summary SingleSource/Regression/C/Regression-C-2004-03-15-IndirectGoto.link.time /Users/buildslave/jenkins/workspace/test-suite-verify-machineinstrs-aarch64-O0-g/compiler/bin/clang -B /Applications/Xcode.app/Contents/Developer/Toolchains/XcodeDefault.xctoolchain/usr/bin -Wno-unused-command-line-argument -mllvm -verify-machineinstrs -O0 -g -arch arm64 -isysroot /Applications/Xcode.app/Contents/Developer/Platforms/iPhoneOS.platform/Developer/SDKs/iPhoneOS12.1.sdk -Wl,-search_paths_first -Wl,-headerpad_max_install_names -B /Applications/Xcode.app/Contents/Developer/Toolchains/XcodeDefault.xctoolchain/usr/bin SingleSource/Regression/C/CMakeFiles/Regression-C-2004-03-15-IndirectGoto.dir/2004-03-15-IndirectGoto.c.o -o SingleSource/Regression/C/Regression-C-2004-03-15-IndirectGoto -lm && cd /Users/buildslave/jenkins/workspace/test-suite-verify-machineinstrs-aarch64-O0-g/test-suite-build/SingleSource/Regression/C && /usr/local/Cellar/cmake/3.13.1/bin/cmake -E create_symlink /Users/buildslave/jenkins/workspace/test-suite-verify-machineinstrs-aarch64-O0-g/test-suite/SingleSource/Regression/C/2004-03-15-IndirectGoto.reference_output /Users/buildslave/jenkins/workspace/test-suite-verify-machineinstrs-aarch64-O0-g/test-suite-build/SingleSource/Regression/C/2004-03-15-IndirectGoto.reference_output [8504/8583] : && /Users/buildslave/jenkins/workspace/test-suite-verify-machineinstrs-aarch64-O0-g/test-suite-build/tools/timeit --summary SingleSource/Regression/C/Regression-C-2003-10-12-GlobalVarInitializers.link.time /Users/buildslave/jenkins/workspace/test-suite-verify-machineinstrs-aarch64-O0-g/compiler/bin/clang -B /Applications/Xcode.app/Contents/Developer/Toolchains/XcodeDefault.xctoolchain/usr/bin -Wno-unused-command-line-argument -mllvm -verify-machineinstrs -O0 -g -arch arm64 -isysroot /Applications/Xcode.app/Contents/Developer/Platforms/iPhoneOS.platform/Developer/SDKs/iPhoneOS12.1.sdk -Wl,-search_paths_first -Wl,-headerpad_max_install_names -B /Applications/Xcode.app/Contents/Developer/Toolchains/XcodeDefault.xctoolchain/usr/bin SingleSource/Regression/C/CMakeFiles/Regression-C-2003-10-12-GlobalVarInitializers.dir/2003-10-12-GlobalVarInitializers.c.o -o SingleSource/Regression/C/Regression-C-2003-10-12-GlobalVarInitializers -lm && cd /Users/buildslave/jenkins/workspace/test-suite-verify-machineinstrs-aarch64-O0-g/test-suite-build/SingleSource/Regression/C && /usr/local/Cellar/cmake/3.13.1/bin/cmake -E create_symlink /Users/buildslave/jenkins/workspace/test-suite-verify-machineinstrs-aarch64-O0-g/test-suite/SingleSource/Regression/C/2003-10-12-GlobalVarInitializers.reference_output /Users/buildslave/jenkins/workspace/test-suite-verify-machineinstrs-aarch64-O0-g/test-suite-build/SingleSource/Regression/C/2003-10-12-GlobalVarInitializers.reference_output [8505/8583] : && /Users/buildslave/jenkins/workspace/test-suite-verify-machineinstrs-aarch64-O0-g/test-suite-build/tools/timeit --summary SingleSource/UnitTests/ObjC++/property-reference.link.time /Users/buildslave/jenkins/workspace/test-suite-verify-machineinstrs-aarch64-O0-g/compiler/bin/clang++ -B /Applications/Xcode.app/Contents/Developer/Toolchains/XcodeDefault.xctoolchain/usr/bin -Wno-unused-command-line-argument -mllvm -verify-machineinstrs -O0 -g -arch arm64 -isysroot /Applications/Xcode.app/Contents/Developer/Platforms/iPhoneOS.platform/Developer/SDKs/iPhoneOS12.1.sdk -Wl,-search_paths_first -Wl,-headerpad_max_install_names -B /Applications/Xcode.app/Contents/Developer/Toolchains/XcodeDefault.xctoolchain/usr/bin SingleSource/UnitTests/ObjC++/CMakeFiles/property-reference.dir/property-reference.mm.o -o SingleSource/UnitTests/ObjC++/property-reference -lstdc++ -lobjc -framework Foundation && cd /Users/buildslave/jenkins/workspace/test-suite-verify-machineinstrs-aarch64-O0-g/test-suite-build/SingleSource/UnitTests/ObjC++ && /usr/local/Cellar/cmake/3.13.1/bin/cmake -E create_symlink /Users/buildslave/jenkins/workspace/test-suite-verify-machineinstrs-aarch64-O0-g/test-suite/SingleSource/UnitTests/ObjC++/property-reference.reference_output /Users/buildslave/jenkins/workspace/test-suite-verify-machineinstrs-aarch64-O0-g/test-suite-build/SingleSource/UnitTests/ObjC++/property-reference.reference_output [8506/8583] : && /Users/buildslave/jenkins/workspace/test-suite-verify-machineinstrs-aarch64-O0-g/test-suite-build/tools/timeit --summary SingleSource/Regression/C/Regression-C-PR10189.link.time /Users/buildslave/jenkins/workspace/test-suite-verify-machineinstrs-aarch64-O0-g/compiler/bin/clang -B /Applications/Xcode.app/Contents/Developer/Toolchains/XcodeDefault.xctoolchain/usr/bin -Wno-unused-command-line-argument -mllvm -verify-machineinstrs -O0 -g -arch arm64 -isysroot /Applications/Xcode.app/Contents/Developer/Platforms/iPhoneOS.platform/Developer/SDKs/iPhoneOS12.1.sdk -Wl,-search_paths_first -Wl,-headerpad_max_install_names -B /Applications/Xcode.app/Contents/Developer/Toolchains/XcodeDefault.xctoolchain/usr/bin SingleSource/Regression/C/CMakeFiles/Regression-C-PR10189.dir/PR10189.c.o -o SingleSource/Regression/C/Regression-C-PR10189 -lm && cd /Users/buildslave/jenkins/workspace/test-suite-verify-machineinstrs-aarch64-O0-g/test-suite-build/SingleSource/Regression/C && /usr/local/Cellar/cmake/3.13.1/bin/cmake -E create_symlink /Users/buildslave/jenkins/workspace/test-suite-verify-machineinstrs-aarch64-O0-g/test-suite/SingleSource/Regression/C/PR10189.reference_output /Users/buildslave/jenkins/workspace/test-suite-verify-machineinstrs-aarch64-O0-g/test-suite-build/SingleSource/Regression/C/PR10189.reference_output [8507/8583] : && /Users/buildslave/jenkins/workspace/test-suite-verify-machineinstrs-aarch64-O0-g/test-suite-build/tools/timeit --summary SingleSource/Regression/C/Regression-C-2003-06-16-VolatileError.link.time /Users/buildslave/jenkins/workspace/test-suite-verify-machineinstrs-aarch64-O0-g/compiler/bin/clang -B /Applications/Xcode.app/Contents/Developer/Toolchains/XcodeDefault.xctoolchain/usr/bin -Wno-unused-command-line-argument -mllvm -verify-machineinstrs -O0 -g -arch arm64 -isysroot /Applications/Xcode.app/Contents/Developer/Platforms/iPhoneOS.platform/Developer/SDKs/iPhoneOS12.1.sdk -Wl,-search_paths_first -Wl,-headerpad_max_install_names -B /Applications/Xcode.app/Contents/Developer/Toolchains/XcodeDefault.xctoolchain/usr/bin SingleSource/Regression/C/CMakeFiles/Regression-C-2003-06-16-VolatileError.dir/2003-06-16-VolatileError.c.o -o SingleSource/Regression/C/Regression-C-2003-06-16-VolatileError -lm && cd /Users/buildslave/jenkins/workspace/test-suite-verify-machineinstrs-aarch64-O0-g/test-suite-build/SingleSource/Regression/C && /usr/local/Cellar/cmake/3.13.1/bin/cmake -E create_symlink /Users/buildslave/jenkins/workspace/test-suite-verify-machineinstrs-aarch64-O0-g/test-suite/SingleSource/Regression/C/2003-06-16-VolatileError.reference_output /Users/buildslave/jenkins/workspace/test-suite-verify-machineinstrs-aarch64-O0-g/test-suite-build/SingleSource/Regression/C/2003-06-16-VolatileError.reference_output [8508/8583] /Users/buildslave/jenkins/workspace/test-suite-verify-machineinstrs-aarch64-O0-g/test-suite-build/tools/timeit --summary SingleSource/Regression/C/CMakeFiles/Regression-C-2003-05-21-BitfieldHandling.dir/2003-05-21-BitfieldHandling.c.o.time /Users/buildslave/jenkins/workspace/test-suite-verify-machineinstrs-aarch64-O0-g/compiler/bin/clang -DNDEBUG -B /Applications/Xcode.app/Contents/Developer/Toolchains/XcodeDefault.xctoolchain/usr/bin -Wno-unused-command-line-argument -mllvm -verify-machineinstrs -O0 -g -arch arm64 -isysroot /Applications/Xcode.app/Contents/Developer/Platforms/iPhoneOS.platform/Developer/SDKs/iPhoneOS12.1.sdk -w -Werror=date-time -MD -MT SingleSource/Regression/C/CMakeFiles/Regression-C-2003-05-21-BitfieldHandling.dir/2003-05-21-BitfieldHandling.c.o -MF SingleSource/Regression/C/CMakeFiles/Regression-C-2003-05-21-BitfieldHandling.dir/2003-05-21-BitfieldHandling.c.o.d -o SingleSource/Regression/C/CMakeFiles/Regression-C-2003-05-21-BitfieldHandling.dir/2003-05-21-BitfieldHandling.c.o -c /Users/buildslave/jenkins/workspace/test-suite-verify-machineinstrs-aarch64-O0-g/test-suite/SingleSource/Regression/C/2003-05-21-BitfieldHandling.c [8509/8583] /Users/buildslave/jenkins/workspace/test-suite-verify-machineinstrs-aarch64-O0-g/test-suite-build/tools/timeit --summary SingleSource/Regression/C/CMakeFiles/Regression-C-PR491.dir/PR491.c.o.time /Users/buildslave/jenkins/workspace/test-suite-verify-machineinstrs-aarch64-O0-g/compiler/bin/clang -DNDEBUG -B /Applications/Xcode.app/Contents/Developer/Toolchains/XcodeDefault.xctoolchain/usr/bin -Wno-unused-command-line-argument -mllvm -verify-machineinstrs -O0 -g -arch arm64 -isysroot /Applications/Xcode.app/Contents/Developer/Platforms/iPhoneOS.platform/Developer/SDKs/iPhoneOS12.1.sdk -w -Werror=date-time -MD -MT SingleSource/Regression/C/CMakeFiles/Regression-C-PR491.dir/PR491.c.o -MF SingleSource/Regression/C/CMakeFiles/Regression-C-PR491.dir/PR491.c.o.d -o SingleSource/Regression/C/CMakeFiles/Regression-C-PR491.dir/PR491.c.o -c /Users/buildslave/jenkins/workspace/test-suite-verify-machineinstrs-aarch64-O0-g/test-suite/SingleSource/Regression/C/PR491.c [8510/8583] /Users/buildslave/jenkins/workspace/test-suite-verify-machineinstrs-aarch64-O0-g/test-suite-build/tools/timeit --summary SingleSource/Regression/C/CMakeFiles/Regression-C-testtrace.dir/testtrace.c.o.time /Users/buildslave/jenkins/workspace/test-suite-verify-machineinstrs-aarch64-O0-g/compiler/bin/clang -DNDEBUG -B /Applications/Xcode.app/Contents/Developer/Toolchains/XcodeDefault.xctoolchain/usr/bin -Wno-unused-command-line-argument -mllvm -verify-machineinstrs -O0 -g -arch arm64 -isysroot /Applications/Xcode.app/Contents/Developer/Platforms/iPhoneOS.platform/Developer/SDKs/iPhoneOS12.1.sdk -w -Werror=date-time -MD -MT SingleSource/Regression/C/CMakeFiles/Regression-C-testtrace.dir/testtrace.c.o -MF SingleSource/Regression/C/CMakeFiles/Regression-C-testtrace.dir/testtrace.c.o.d -o SingleSource/Regression/C/CMakeFiles/Regression-C-testtrace.dir/testtrace.c.o -c /Users/buildslave/jenkins/workspace/test-suite-verify-machineinstrs-aarch64-O0-g/test-suite/SingleSource/Regression/C/testtrace.c [8511/8583] : && /Users/buildslave/jenkins/workspace/test-suite-verify-machineinstrs-aarch64-O0-g/test-suite-build/tools/timeit --summary SingleSource/Regression/C/Regression-C-2003-05-21-BitfieldHandling.link.time /Users/buildslave/jenkins/workspace/test-suite-verify-machineinstrs-aarch64-O0-g/compiler/bin/clang -B /Applications/Xcode.app/Contents/Developer/Toolchains/XcodeDefault.xctoolchain/usr/bin -Wno-unused-command-line-argument -mllvm -verify-machineinstrs -O0 -g -arch arm64 -isysroot /Applications/Xcode.app/Contents/Developer/Platforms/iPhoneOS.platform/Developer/SDKs/iPhoneOS12.1.sdk -Wl,-search_paths_first -Wl,-headerpad_max_install_names -B /Applications/Xcode.app/Contents/Developer/Toolchains/XcodeDefault.xctoolchain/usr/bin SingleSource/Regression/C/CMakeFiles/Regression-C-2003-05-21-BitfieldHandling.dir/2003-05-21-BitfieldHandling.c.o -o SingleSource/Regression/C/Regression-C-2003-05-21-BitfieldHandling -lm && cd /Users/buildslave/jenkins/workspace/test-suite-verify-machineinstrs-aarch64-O0-g/test-suite-build/SingleSource/Regression/C && /usr/local/Cellar/cmake/3.13.1/bin/cmake -E create_symlink /Users/buildslave/jenkins/workspace/test-suite-verify-machineinstrs-aarch64-O0-g/test-suite/SingleSource/Regression/C/2003-05-21-BitfieldHandling.reference_output /Users/buildslave/jenkins/workspace/test-suite-verify-machineinstrs-aarch64-O0-g/test-suite-build/SingleSource/Regression/C/2003-05-21-BitfieldHandling.reference_output [8512/8583] /Users/buildslave/jenkins/workspace/test-suite-verify-machineinstrs-aarch64-O0-g/test-suite-build/tools/timeit --summary SingleSource/Regression/C/CMakeFiles/Regression-C-2003-05-21-UnionTest.dir/2003-05-21-UnionTest.c.o.time /Users/buildslave/jenkins/workspace/test-suite-verify-machineinstrs-aarch64-O0-g/compiler/bin/clang -DNDEBUG -B /Applications/Xcode.app/Contents/Developer/Toolchains/XcodeDefault.xctoolchain/usr/bin -Wno-unused-command-line-argument -mllvm -verify-machineinstrs -O0 -g -arch arm64 -isysroot /Applications/Xcode.app/Contents/Developer/Platforms/iPhoneOS.platform/Developer/SDKs/iPhoneOS12.1.sdk -w -Werror=date-time -MD -MT SingleSource/Regression/C/CMakeFiles/Regression-C-2003-05-21-UnionTest.dir/2003-05-21-UnionTest.c.o -MF SingleSource/Regression/C/CMakeFiles/Regression-C-2003-05-21-UnionTest.dir/2003-05-21-UnionTest.c.o.d -o SingleSource/Regression/C/CMakeFiles/Regression-C-2003-05-21-UnionTest.dir/2003-05-21-UnionTest.c.o -c /Users/buildslave/jenkins/workspace/test-suite-verify-machineinstrs-aarch64-O0-g/test-suite/SingleSource/Regression/C/2003-05-21-UnionTest.c [8513/8583] : && /Users/buildslave/jenkins/workspace/test-suite-verify-machineinstrs-aarch64-O0-g/test-suite-build/tools/timeit --summary SingleSource/Regression/C/Regression-C-PR491.link.time /Users/buildslave/jenkins/workspace/test-suite-verify-machineinstrs-aarch64-O0-g/compiler/bin/clang -B /Applications/Xcode.app/Contents/Developer/Toolchains/XcodeDefault.xctoolchain/usr/bin -Wno-unused-command-line-argument -mllvm -verify-machineinstrs -O0 -g -arch arm64 -isysroot /Applications/Xcode.app/Contents/Developer/Platforms/iPhoneOS.platform/Developer/SDKs/iPhoneOS12.1.sdk -Wl,-search_paths_first -Wl,-headerpad_max_install_names -B /Applications/Xcode.app/Contents/Developer/Toolchains/XcodeDefault.xctoolchain/usr/bin SingleSource/Regression/C/CMakeFiles/Regression-C-PR491.dir/PR491.c.o -o SingleSource/Regression/C/Regression-C-PR491 -lm && cd /Users/buildslave/jenkins/workspace/test-suite-verify-machineinstrs-aarch64-O0-g/test-suite-build/SingleSource/Regression/C && /usr/local/Cellar/cmake/3.13.1/bin/cmake -E create_symlink /Users/buildslave/jenkins/workspace/test-suite-verify-machineinstrs-aarch64-O0-g/test-suite/SingleSource/Regression/C/PR491.reference_output /Users/buildslave/jenkins/workspace/test-suite-verify-machineinstrs-aarch64-O0-g/test-suite-build/SingleSource/Regression/C/PR491.reference_output [8514/8583] /Users/buildslave/jenkins/workspace/test-suite-verify-machineinstrs-aarch64-O0-g/test-suite-build/tools/timeit --summary SingleSource/Regression/C/CMakeFiles/Regression-C-2003-05-21-UnionBitfields.dir/2003-05-21-UnionBitfields.c.o.time /Users/buildslave/jenkins/workspace/test-suite-verify-machineinstrs-aarch64-O0-g/compiler/bin/clang -DNDEBUG -B /Applications/Xcode.app/Contents/Developer/Toolchains/XcodeDefault.xctoolchain/usr/bin -Wno-unused-command-line-argument -mllvm -verify-machineinstrs -O0 -g -arch arm64 -isysroot /Applications/Xcode.app/Contents/Developer/Platforms/iPhoneOS.platform/Developer/SDKs/iPhoneOS12.1.sdk -w -Werror=date-time -MD -MT SingleSource/Regression/C/CMakeFiles/Regression-C-2003-05-21-UnionBitfields.dir/2003-05-21-UnionBitfields.c.o -MF SingleSource/Regression/C/CMakeFiles/Regression-C-2003-05-21-UnionBitfields.dir/2003-05-21-UnionBitfields.c.o.d -o SingleSource/Regression/C/CMakeFiles/Regression-C-2003-05-21-UnionBitfields.dir/2003-05-21-UnionBitfields.c.o -c /Users/buildslave/jenkins/workspace/test-suite-verify-machineinstrs-aarch64-O0-g/test-suite/SingleSource/Regression/C/2003-05-21-UnionBitfields.c [8515/8583] : && /Users/buildslave/jenkins/workspace/test-suite-verify-machineinstrs-aarch64-O0-g/test-suite-build/tools/timeit --summary SingleSource/Regression/C/Regression-C-testtrace.link.time /Users/buildslave/jenkins/workspace/test-suite-verify-machineinstrs-aarch64-O0-g/compiler/bin/clang -B /Applications/Xcode.app/Contents/Developer/Toolchains/XcodeDefault.xctoolchain/usr/bin -Wno-unused-command-line-argument -mllvm -verify-machineinstrs -O0 -g -arch arm64 -isysroot /Applications/Xcode.app/Contents/Developer/Platforms/iPhoneOS.platform/Developer/SDKs/iPhoneOS12.1.sdk -Wl,-search_paths_first -Wl,-headerpad_max_install_names -B /Applications/Xcode.app/Contents/Developer/Toolchains/XcodeDefault.xctoolchain/usr/bin SingleSource/Regression/C/CMakeFiles/Regression-C-testtrace.dir/testtrace.c.o -o SingleSource/Regression/C/Regression-C-testtrace -lm && cd /Users/buildslave/jenkins/workspace/test-suite-verify-machineinstrs-aarch64-O0-g/test-suite-build/SingleSource/Regression/C && /usr/local/Cellar/cmake/3.13.1/bin/cmake -E create_symlink /Users/buildslave/jenkins/workspace/test-suite-verify-machineinstrs-aarch64-O0-g/test-suite/SingleSource/Regression/C/testtrace.reference_output /Users/buildslave/jenkins/workspace/test-suite-verify-machineinstrs-aarch64-O0-g/test-suite-build/SingleSource/Regression/C/testtrace.reference_output [8516/8583] /Users/buildslave/jenkins/workspace/test-suite-verify-machineinstrs-aarch64-O0-g/test-suite-build/tools/timeit --summary SingleSource/Regression/C/CMakeFiles/Regression-C-2003-06-16-InvalidInitializer.dir/2003-06-16-InvalidInitializer.c.o.time /Users/buildslave/jenkins/workspace/test-suite-verify-machineinstrs-aarch64-O0-g/compiler/bin/clang -DNDEBUG -B /Applications/Xcode.app/Contents/Developer/Toolchains/XcodeDefault.xctoolchain/usr/bin -Wno-unused-command-line-argument -mllvm -verify-machineinstrs -O0 -g -arch arm64 -isysroot /Applications/Xcode.app/Contents/Developer/Platforms/iPhoneOS.platform/Developer/SDKs/iPhoneOS12.1.sdk -w -Werror=date-time -MD -MT SingleSource/Regression/C/CMakeFiles/Regression-C-2003-06-16-InvalidInitializer.dir/2003-06-16-InvalidInitializer.c.o -MF SingleSource/Regression/C/CMakeFiles/Regression-C-2003-06-16-InvalidInitializer.dir/2003-06-16-InvalidInitializer.c.o.d -o SingleSource/Regression/C/CMakeFiles/Regression-C-2003-06-16-InvalidInitializer.dir/2003-06-16-InvalidInitializer.c.o -c /Users/buildslave/jenkins/workspace/test-suite-verify-machineinstrs-aarch64-O0-g/test-suite/SingleSource/Regression/C/2003-06-16-InvalidInitializer.c [8517/8583] : && /Users/buildslave/jenkins/workspace/test-suite-verify-machineinstrs-aarch64-O0-g/test-suite-build/tools/timeit --summary SingleSource/Regression/C/Regression-C-2003-05-21-UnionTest.link.time /Users/buildslave/jenkins/workspace/test-suite-verify-machineinstrs-aarch64-O0-g/compiler/bin/clang -B /Applications/Xcode.app/Contents/Developer/Toolchains/XcodeDefault.xctoolchain/usr/bin -Wno-unused-command-line-argument -mllvm -verify-machineinstrs -O0 -g -arch arm64 -isysroot /Applications/Xcode.app/Contents/Developer/Platforms/iPhoneOS.platform/Developer/SDKs/iPhoneOS12.1.sdk -Wl,-search_paths_first -Wl,-headerpad_max_install_names -B /Applications/Xcode.app/Contents/Developer/Toolchains/XcodeDefault.xctoolchain/usr/bin SingleSource/Regression/C/CMakeFiles/Regression-C-2003-05-21-UnionTest.dir/2003-05-21-UnionTest.c.o -o SingleSource/Regression/C/Regression-C-2003-05-21-UnionTest -lm && cd /Users/buildslave/jenkins/workspace/test-suite-verify-machineinstrs-aarch64-O0-g/test-suite-build/SingleSource/Regression/C && /usr/local/Cellar/cmake/3.13.1/bin/cmake -E create_symlink /Users/buildslave/jenkins/workspace/test-suite-verify-machineinstrs-aarch64-O0-g/test-suite/SingleSource/Regression/C/2003-05-21-UnionTest.reference_output /Users/buildslave/jenkins/workspace/test-suite-verify-machineinstrs-aarch64-O0-g/test-suite-build/SingleSource/Regression/C/2003-05-21-UnionTest.reference_output [8518/8583] /Users/buildslave/jenkins/workspace/test-suite-verify-machineinstrs-aarch64-O0-g/test-suite-build/tools/timeit --summary SingleSource/Regression/C++/CMakeFiles/Regression-C++-global_type.dir/global_type.cpp.o.time /Users/buildslave/jenkins/workspace/test-suite-verify-machineinstrs-aarch64-O0-g/compiler/bin/clang++ -DNDEBUG -B /Applications/Xcode.app/Contents/Developer/Toolchains/XcodeDefault.xctoolchain/usr/bin -Wno-unused-command-line-argument -mllvm -verify-machineinstrs -O0 -g -arch arm64 -isysroot /Applications/Xcode.app/Contents/Developer/Platforms/iPhoneOS.platform/Developer/SDKs/iPhoneOS12.1.sdk -w -Werror=date-time -MD -MT SingleSource/Regression/C++/CMakeFiles/Regression-C++-global_type.dir/global_type.cpp.o -MF SingleSource/Regression/C++/CMakeFiles/Regression-C++-global_type.dir/global_type.cpp.o.d -o SingleSource/Regression/C++/CMakeFiles/Regression-C++-global_type.dir/global_type.cpp.o -c /Users/buildslave/jenkins/workspace/test-suite-verify-machineinstrs-aarch64-O0-g/test-suite/SingleSource/Regression/C++/global_type.cpp [8519/8583] : && /Users/buildslave/jenkins/workspace/test-suite-verify-machineinstrs-aarch64-O0-g/test-suite-build/tools/timeit --summary SingleSource/Regression/C/Regression-C-2003-06-16-InvalidInitializer.link.time /Users/buildslave/jenkins/workspace/test-suite-verify-machineinstrs-aarch64-O0-g/compiler/bin/clang -B /Applications/Xcode.app/Contents/Developer/Toolchains/XcodeDefault.xctoolchain/usr/bin -Wno-unused-command-line-argument -mllvm -verify-machineinstrs -O0 -g -arch arm64 -isysroot /Applications/Xcode.app/Contents/Developer/Platforms/iPhoneOS.platform/Developer/SDKs/iPhoneOS12.1.sdk -Wl,-search_paths_first -Wl,-headerpad_max_install_names -B /Applications/Xcode.app/Contents/Developer/Toolchains/XcodeDefault.xctoolchain/usr/bin SingleSource/Regression/C/CMakeFiles/Regression-C-2003-06-16-InvalidInitializer.dir/2003-06-16-InvalidInitializer.c.o -o SingleSource/Regression/C/Regression-C-2003-06-16-InvalidInitializer -lm && cd /Users/buildslave/jenkins/workspace/test-suite-verify-machineinstrs-aarch64-O0-g/test-suite-build/SingleSource/Regression/C && /usr/local/Cellar/cmake/3.13.1/bin/cmake -E create_symlink /Users/buildslave/jenkins/workspace/test-suite-verify-machineinstrs-aarch64-O0-g/test-suite/SingleSource/Regression/C/2003-06-16-InvalidInitializer.reference_output /Users/buildslave/jenkins/workspace/test-suite-verify-machineinstrs-aarch64-O0-g/test-suite-build/SingleSource/Regression/C/2003-06-16-InvalidInitializer.reference_output [8520/8583] : && /Users/buildslave/jenkins/workspace/test-suite-verify-machineinstrs-aarch64-O0-g/test-suite-build/tools/timeit --summary SingleSource/Regression/C/Regression-C-2003-05-21-UnionBitfields.link.time /Users/buildslave/jenkins/workspace/test-suite-verify-machineinstrs-aarch64-O0-g/compiler/bin/clang -B /Applications/Xcode.app/Contents/Developer/Toolchains/XcodeDefault.xctoolchain/usr/bin -Wno-unused-command-line-argument -mllvm -verify-machineinstrs -O0 -g -arch arm64 -isysroot /Applications/Xcode.app/Contents/Developer/Platforms/iPhoneOS.platform/Developer/SDKs/iPhoneOS12.1.sdk -Wl,-search_paths_first -Wl,-headerpad_max_install_names -B /Applications/Xcode.app/Contents/Developer/Toolchains/XcodeDefault.xctoolchain/usr/bin SingleSource/Regression/C/CMakeFiles/Regression-C-2003-05-21-UnionBitfields.dir/2003-05-21-UnionBitfields.c.o -o SingleSource/Regression/C/Regression-C-2003-05-21-UnionBitfields -lm && cd /Users/buildslave/jenkins/workspace/test-suite-verify-machineinstrs-aarch64-O0-g/test-suite-build/SingleSource/Regression/C && /usr/local/Cellar/cmake/3.13.1/bin/cmake -E create_symlink /Users/buildslave/jenkins/workspace/test-suite-verify-machineinstrs-aarch64-O0-g/test-suite/SingleSource/Regression/C/2003-05-21-UnionBitfields.reference_output /Users/buildslave/jenkins/workspace/test-suite-verify-machineinstrs-aarch64-O0-g/test-suite-build/SingleSource/Regression/C/2003-05-21-UnionBitfields.reference_output [8521/8583] /Users/buildslave/jenkins/workspace/test-suite-verify-machineinstrs-aarch64-O0-g/test-suite-build/tools/timeit --summary SingleSource/Regression/C/CMakeFiles/Regression-C-2003-05-14-initialize-string.dir/2003-05-14-initialize-string.c.o.time /Users/buildslave/jenkins/workspace/test-suite-verify-machineinstrs-aarch64-O0-g/compiler/bin/clang -DNDEBUG -B /Applications/Xcode.app/Contents/Developer/Toolchains/XcodeDefault.xctoolchain/usr/bin -Wno-unused-command-line-argument -mllvm -verify-machineinstrs -O0 -g -arch arm64 -isysroot /Applications/Xcode.app/Contents/Developer/Platforms/iPhoneOS.platform/Developer/SDKs/iPhoneOS12.1.sdk -w -Werror=date-time -MD -MT SingleSource/Regression/C/CMakeFiles/Regression-C-2003-05-14-initialize-string.dir/2003-05-14-initialize-string.c.o -MF SingleSource/Regression/C/CMakeFiles/Regression-C-2003-05-14-initialize-string.dir/2003-05-14-initialize-string.c.o.d -o SingleSource/Regression/C/CMakeFiles/Regression-C-2003-05-14-initialize-string.dir/2003-05-14-initialize-string.c.o -c /Users/buildslave/jenkins/workspace/test-suite-verify-machineinstrs-aarch64-O0-g/test-suite/SingleSource/Regression/C/2003-05-14-initialize-string.c [8522/8583] : && /Users/buildslave/jenkins/workspace/test-suite-verify-machineinstrs-aarch64-O0-g/test-suite-build/tools/timeit --summary SingleSource/Regression/C++/Regression-C++-global_type.link.time /Users/buildslave/jenkins/workspace/test-suite-verify-machineinstrs-aarch64-O0-g/compiler/bin/clang++ -B /Applications/Xcode.app/Contents/Developer/Toolchains/XcodeDefault.xctoolchain/usr/bin -Wno-unused-command-line-argument -mllvm -verify-machineinstrs -O0 -g -arch arm64 -isysroot /Applications/Xcode.app/Contents/Developer/Platforms/iPhoneOS.platform/Developer/SDKs/iPhoneOS12.1.sdk -Wl,-search_paths_first -Wl,-headerpad_max_install_names -B /Applications/Xcode.app/Contents/Developer/Toolchains/XcodeDefault.xctoolchain/usr/bin SingleSource/Regression/C++/CMakeFiles/Regression-C++-global_type.dir/global_type.cpp.o -o SingleSource/Regression/C++/Regression-C++-global_type -lstdc++ && cd /Users/buildslave/jenkins/workspace/test-suite-verify-machineinstrs-aarch64-O0-g/test-suite-build/SingleSource/Regression/C++ && /usr/local/Cellar/cmake/3.13.1/bin/cmake -E create_symlink /Users/buildslave/jenkins/workspace/test-suite-verify-machineinstrs-aarch64-O0-g/test-suite/SingleSource/Regression/C++/global_type.reference_output /Users/buildslave/jenkins/workspace/test-suite-verify-machineinstrs-aarch64-O0-g/test-suite-build/SingleSource/Regression/C++/global_type.reference_output [8523/8583] : && /Users/buildslave/jenkins/workspace/test-suite-verify-machineinstrs-aarch64-O0-g/test-suite-build/tools/timeit --summary SingleSource/Regression/C/Regression-C-2003-05-14-initialize-string.link.time /Users/buildslave/jenkins/workspace/test-suite-verify-machineinstrs-aarch64-O0-g/compiler/bin/clang -B /Applications/Xcode.app/Contents/Developer/Toolchains/XcodeDefault.xctoolchain/usr/bin -Wno-unused-command-line-argument -mllvm -verify-machineinstrs -O0 -g -arch arm64 -isysroot /Applications/Xcode.app/Contents/Developer/Platforms/iPhoneOS.platform/Developer/SDKs/iPhoneOS12.1.sdk -Wl,-search_paths_first -Wl,-headerpad_max_install_names -B /Applications/Xcode.app/Contents/Developer/Toolchains/XcodeDefault.xctoolchain/usr/bin SingleSource/Regression/C/CMakeFiles/Regression-C-2003-05-14-initialize-string.dir/2003-05-14-initialize-string.c.o -o SingleSource/Regression/C/Regression-C-2003-05-14-initialize-string -lm && cd /Users/buildslave/jenkins/workspace/test-suite-verify-machineinstrs-aarch64-O0-g/test-suite-build/SingleSource/Regression/C && /usr/local/Cellar/cmake/3.13.1/bin/cmake -E create_symlink /Users/buildslave/jenkins/workspace/test-suite-verify-machineinstrs-aarch64-O0-g/test-suite/SingleSource/Regression/C/2003-05-14-initialize-string.reference_output /Users/buildslave/jenkins/workspace/test-suite-verify-machineinstrs-aarch64-O0-g/test-suite-build/SingleSource/Regression/C/2003-05-14-initialize-string.reference_output [8524/8583] /Users/buildslave/jenkins/workspace/test-suite-verify-machineinstrs-aarch64-O0-g/test-suite-build/tools/timeit --summary SingleSource/Regression/C++/CMakeFiles/Regression-C++-short_circuit_dtor.dir/short_circuit_dtor.cpp.o.time /Users/buildslave/jenkins/workspace/test-suite-verify-machineinstrs-aarch64-O0-g/compiler/bin/clang++ -DNDEBUG -B /Applications/Xcode.app/Contents/Developer/Toolchains/XcodeDefault.xctoolchain/usr/bin -Wno-unused-command-line-argument -mllvm -verify-machineinstrs -O0 -g -arch arm64 -isysroot /Applications/Xcode.app/Contents/Developer/Platforms/iPhoneOS.platform/Developer/SDKs/iPhoneOS12.1.sdk -w -Werror=date-time -MD -MT SingleSource/Regression/C++/CMakeFiles/Regression-C++-short_circuit_dtor.dir/short_circuit_dtor.cpp.o -MF SingleSource/Regression/C++/CMakeFiles/Regression-C++-short_circuit_dtor.dir/short_circuit_dtor.cpp.o.d -o SingleSource/Regression/C++/CMakeFiles/Regression-C++-short_circuit_dtor.dir/short_circuit_dtor.cpp.o -c /Users/buildslave/jenkins/workspace/test-suite-verify-machineinstrs-aarch64-O0-g/test-suite/SingleSource/Regression/C++/short_circuit_dtor.cpp [8525/8583] /Users/buildslave/jenkins/workspace/test-suite-verify-machineinstrs-aarch64-O0-g/test-suite-build/tools/timeit --summary SingleSource/Regression/C++/CMakeFiles/Regression-C++-pointer_member.dir/pointer_member.cpp.o.time /Users/buildslave/jenkins/workspace/test-suite-verify-machineinstrs-aarch64-O0-g/compiler/bin/clang++ -DNDEBUG -B /Applications/Xcode.app/Contents/Developer/Toolchains/XcodeDefault.xctoolchain/usr/bin -Wno-unused-command-line-argument -mllvm -verify-machineinstrs -O0 -g -arch arm64 -isysroot /Applications/Xcode.app/Contents/Developer/Platforms/iPhoneOS.platform/Developer/SDKs/iPhoneOS12.1.sdk -w -Werror=date-time -MD -MT SingleSource/Regression/C++/CMakeFiles/Regression-C++-pointer_member.dir/pointer_member.cpp.o -MF SingleSource/Regression/C++/CMakeFiles/Regression-C++-pointer_member.dir/pointer_member.cpp.o.d -o SingleSource/Regression/C++/CMakeFiles/Regression-C++-pointer_member.dir/pointer_member.cpp.o -c /Users/buildslave/jenkins/workspace/test-suite-verify-machineinstrs-aarch64-O0-g/test-suite/SingleSource/Regression/C++/pointer_member.cpp [8526/8583] /Users/buildslave/jenkins/workspace/test-suite-verify-machineinstrs-aarch64-O0-g/test-suite-build/tools/timeit --summary SingleSource/Regression/C++/CMakeFiles/Regression-C++-2003-06-08-BaseType.dir/2003-06-08-BaseType.cpp.o.time /Users/buildslave/jenkins/workspace/test-suite-verify-machineinstrs-aarch64-O0-g/compiler/bin/clang++ -DNDEBUG -B /Applications/Xcode.app/Contents/Developer/Toolchains/XcodeDefault.xctoolchain/usr/bin -Wno-unused-command-line-argument -mllvm -verify-machineinstrs -O0 -g -arch arm64 -isysroot /Applications/Xcode.app/Contents/Developer/Platforms/iPhoneOS.platform/Developer/SDKs/iPhoneOS12.1.sdk -w -Werror=date-time -MD -MT SingleSource/Regression/C++/CMakeFiles/Regression-C++-2003-06-08-BaseType.dir/2003-06-08-BaseType.cpp.o -MF SingleSource/Regression/C++/CMakeFiles/Regression-C++-2003-06-08-BaseType.dir/2003-06-08-BaseType.cpp.o.d -o SingleSource/Regression/C++/CMakeFiles/Regression-C++-2003-06-08-BaseType.dir/2003-06-08-BaseType.cpp.o -c /Users/buildslave/jenkins/workspace/test-suite-verify-machineinstrs-aarch64-O0-g/test-suite/SingleSource/Regression/C++/2003-06-08-BaseType.cpp [8527/8583] /Users/buildslave/jenkins/workspace/test-suite-verify-machineinstrs-aarch64-O0-g/test-suite-build/tools/timeit --summary SingleSource/Regression/C++/CMakeFiles/Regression-C++-pointer_method2.dir/pointer_method2.cpp.o.time /Users/buildslave/jenkins/workspace/test-suite-verify-machineinstrs-aarch64-O0-g/compiler/bin/clang++ -DNDEBUG -B /Applications/Xcode.app/Contents/Developer/Toolchains/XcodeDefault.xctoolchain/usr/bin -Wno-unused-command-line-argument -mllvm -verify-machineinstrs -O0 -g -arch arm64 -isysroot /Applications/Xcode.app/Contents/Developer/Platforms/iPhoneOS.platform/Developer/SDKs/iPhoneOS12.1.sdk -w -Werror=date-time -MD -MT SingleSource/Regression/C++/CMakeFiles/Regression-C++-pointer_method2.dir/pointer_method2.cpp.o -MF SingleSource/Regression/C++/CMakeFiles/Regression-C++-pointer_method2.dir/pointer_method2.cpp.o.d -o SingleSource/Regression/C++/CMakeFiles/Regression-C++-pointer_method2.dir/pointer_method2.cpp.o -c /Users/buildslave/jenkins/workspace/test-suite-verify-machineinstrs-aarch64-O0-g/test-suite/SingleSource/Regression/C++/pointer_method2.cpp [8528/8583] : && /Users/buildslave/jenkins/workspace/test-suite-verify-machineinstrs-aarch64-O0-g/test-suite-build/tools/timeit --summary SingleSource/Regression/C++/Regression-C++-short_circuit_dtor.link.time /Users/buildslave/jenkins/workspace/test-suite-verify-machineinstrs-aarch64-O0-g/compiler/bin/clang++ -B /Applications/Xcode.app/Contents/Developer/Toolchains/XcodeDefault.xctoolchain/usr/bin -Wno-unused-command-line-argument -mllvm -verify-machineinstrs -O0 -g -arch arm64 -isysroot /Applications/Xcode.app/Contents/Developer/Platforms/iPhoneOS.platform/Developer/SDKs/iPhoneOS12.1.sdk -Wl,-search_paths_first -Wl,-headerpad_max_install_names -B /Applications/Xcode.app/Contents/Developer/Toolchains/XcodeDefault.xctoolchain/usr/bin SingleSource/Regression/C++/CMakeFiles/Regression-C++-short_circuit_dtor.dir/short_circuit_dtor.cpp.o -o SingleSource/Regression/C++/Regression-C++-short_circuit_dtor -lstdc++ && cd /Users/buildslave/jenkins/workspace/test-suite-verify-machineinstrs-aarch64-O0-g/test-suite-build/SingleSource/Regression/C++ && /usr/local/Cellar/cmake/3.13.1/bin/cmake -E create_symlink /Users/buildslave/jenkins/workspace/test-suite-verify-machineinstrs-aarch64-O0-g/test-suite/SingleSource/Regression/C++/short_circuit_dtor.reference_output /Users/buildslave/jenkins/workspace/test-suite-verify-machineinstrs-aarch64-O0-g/test-suite-build/SingleSource/Regression/C++/short_circuit_dtor.reference_output [8529/8583] : && /Users/buildslave/jenkins/workspace/test-suite-verify-machineinstrs-aarch64-O0-g/test-suite-build/tools/timeit --summary SingleSource/Regression/C++/Regression-C++-pointer_member.link.time /Users/buildslave/jenkins/workspace/test-suite-verify-machineinstrs-aarch64-O0-g/compiler/bin/clang++ -B /Applications/Xcode.app/Contents/Developer/Toolchains/XcodeDefault.xctoolchain/usr/bin -Wno-unused-command-line-argument -mllvm -verify-machineinstrs -O0 -g -arch arm64 -isysroot /Applications/Xcode.app/Contents/Developer/Platforms/iPhoneOS.platform/Developer/SDKs/iPhoneOS12.1.sdk -Wl,-search_paths_first -Wl,-headerpad_max_install_names -B /Applications/Xcode.app/Contents/Developer/Toolchains/XcodeDefault.xctoolchain/usr/bin SingleSource/Regression/C++/CMakeFiles/Regression-C++-pointer_member.dir/pointer_member.cpp.o -o SingleSource/Regression/C++/Regression-C++-pointer_member -lstdc++ && cd /Users/buildslave/jenkins/workspace/test-suite-verify-machineinstrs-aarch64-O0-g/test-suite-build/SingleSource/Regression/C++ && /usr/local/Cellar/cmake/3.13.1/bin/cmake -E create_symlink /Users/buildslave/jenkins/workspace/test-suite-verify-machineinstrs-aarch64-O0-g/test-suite/SingleSource/Regression/C++/pointer_member.reference_output /Users/buildslave/jenkins/workspace/test-suite-verify-machineinstrs-aarch64-O0-g/test-suite-build/SingleSource/Regression/C++/pointer_member.reference_output [8530/8583] : && /Users/buildslave/jenkins/workspace/test-suite-verify-machineinstrs-aarch64-O0-g/test-suite-build/tools/timeit --summary SingleSource/Regression/C++/Regression-C++-2003-06-08-BaseType.link.time /Users/buildslave/jenkins/workspace/test-suite-verify-machineinstrs-aarch64-O0-g/compiler/bin/clang++ -B /Applications/Xcode.app/Contents/Developer/Toolchains/XcodeDefault.xctoolchain/usr/bin -Wno-unused-command-line-argument -mllvm -verify-machineinstrs -O0 -g -arch arm64 -isysroot /Applications/Xcode.app/Contents/Developer/Platforms/iPhoneOS.platform/Developer/SDKs/iPhoneOS12.1.sdk -Wl,-search_paths_first -Wl,-headerpad_max_install_names -B /Applications/Xcode.app/Contents/Developer/Toolchains/XcodeDefault.xctoolchain/usr/bin SingleSource/Regression/C++/CMakeFiles/Regression-C++-2003-06-08-BaseType.dir/2003-06-08-BaseType.cpp.o -o SingleSource/Regression/C++/Regression-C++-2003-06-08-BaseType -lstdc++ && cd /Users/buildslave/jenkins/workspace/test-suite-verify-machineinstrs-aarch64-O0-g/test-suite-build/SingleSource/Regression/C++ && /usr/local/Cellar/cmake/3.13.1/bin/cmake -E create_symlink /Users/buildslave/jenkins/workspace/test-suite-verify-machineinstrs-aarch64-O0-g/test-suite/SingleSource/Regression/C++/2003-06-08-BaseType.reference_output /Users/buildslave/jenkins/workspace/test-suite-verify-machineinstrs-aarch64-O0-g/test-suite-build/SingleSource/Regression/C++/2003-06-08-BaseType.reference_output [8531/8583] : && /Users/buildslave/jenkins/workspace/test-suite-verify-machineinstrs-aarch64-O0-g/test-suite-build/tools/timeit --summary SingleSource/Regression/C++/Regression-C++-pointer_method2.link.time /Users/buildslave/jenkins/workspace/test-suite-verify-machineinstrs-aarch64-O0-g/compiler/bin/clang++ -B /Applications/Xcode.app/Contents/Developer/Toolchains/XcodeDefault.xctoolchain/usr/bin -Wno-unused-command-line-argument -mllvm -verify-machineinstrs -O0 -g -arch arm64 -isysroot /Applications/Xcode.app/Contents/Developer/Platforms/iPhoneOS.platform/Developer/SDKs/iPhoneOS12.1.sdk -Wl,-search_paths_first -Wl,-headerpad_max_install_names -B /Applications/Xcode.app/Contents/Developer/Toolchains/XcodeDefault.xctoolchain/usr/bin SingleSource/Regression/C++/CMakeFiles/Regression-C++-pointer_method2.dir/pointer_method2.cpp.o -o SingleSource/Regression/C++/Regression-C++-pointer_method2 -lstdc++ && cd /Users/buildslave/jenkins/workspace/test-suite-verify-machineinstrs-aarch64-O0-g/test-suite-build/SingleSource/Regression/C++ && /usr/local/Cellar/cmake/3.13.1/bin/cmake -E create_symlink /Users/buildslave/jenkins/workspace/test-suite-verify-machineinstrs-aarch64-O0-g/test-suite/SingleSource/Regression/C++/pointer_method2.reference_output /Users/buildslave/jenkins/workspace/test-suite-verify-machineinstrs-aarch64-O0-g/test-suite-build/SingleSource/Regression/C++/pointer_method2.reference_output [8532/8583] /Users/buildslave/jenkins/workspace/test-suite-verify-machineinstrs-aarch64-O0-g/test-suite-build/tools/timeit --summary SingleSource/Regression/C++/CMakeFiles/Regression-C++-2003-09-29-NonPODsByValue.dir/2003-09-29-NonPODsByValue.cpp.o.time /Users/buildslave/jenkins/workspace/test-suite-verify-machineinstrs-aarch64-O0-g/compiler/bin/clang++ -DNDEBUG -B /Applications/Xcode.app/Contents/Developer/Toolchains/XcodeDefault.xctoolchain/usr/bin -Wno-unused-command-line-argument -mllvm -verify-machineinstrs -O0 -g -arch arm64 -isysroot /Applications/Xcode.app/Contents/Developer/Platforms/iPhoneOS.platform/Developer/SDKs/iPhoneOS12.1.sdk -w -Werror=date-time -MD -MT SingleSource/Regression/C++/CMakeFiles/Regression-C++-2003-09-29-NonPODsByValue.dir/2003-09-29-NonPODsByValue.cpp.o -MF SingleSource/Regression/C++/CMakeFiles/Regression-C++-2003-09-29-NonPODsByValue.dir/2003-09-29-NonPODsByValue.cpp.o.d -o SingleSource/Regression/C++/CMakeFiles/Regression-C++-2003-09-29-NonPODsByValue.dir/2003-09-29-NonPODsByValue.cpp.o -c /Users/buildslave/jenkins/workspace/test-suite-verify-machineinstrs-aarch64-O0-g/test-suite/SingleSource/Regression/C++/2003-09-29-NonPODsByValue.cpp [8533/8583] : && /Users/buildslave/jenkins/workspace/test-suite-verify-machineinstrs-aarch64-O0-g/test-suite-build/tools/timeit --summary SingleSource/Regression/C++/Regression-C++-2003-09-29-NonPODsByValue.link.time /Users/buildslave/jenkins/workspace/test-suite-verify-machineinstrs-aarch64-O0-g/compiler/bin/clang++ -B /Applications/Xcode.app/Contents/Developer/Toolchains/XcodeDefault.xctoolchain/usr/bin -Wno-unused-command-line-argument -mllvm -verify-machineinstrs -O0 -g -arch arm64 -isysroot /Applications/Xcode.app/Contents/Developer/Platforms/iPhoneOS.platform/Developer/SDKs/iPhoneOS12.1.sdk -Wl,-search_paths_first -Wl,-headerpad_max_install_names -B /Applications/Xcode.app/Contents/Developer/Toolchains/XcodeDefault.xctoolchain/usr/bin SingleSource/Regression/C++/CMakeFiles/Regression-C++-2003-09-29-NonPODsByValue.dir/2003-09-29-NonPODsByValue.cpp.o -o SingleSource/Regression/C++/Regression-C++-2003-09-29-NonPODsByValue -lstdc++ && cd /Users/buildslave/jenkins/workspace/test-suite-verify-machineinstrs-aarch64-O0-g/test-suite-build/SingleSource/Regression/C++ && /usr/local/Cellar/cmake/3.13.1/bin/cmake -E create_symlink /Users/buildslave/jenkins/workspace/test-suite-verify-machineinstrs-aarch64-O0-g/test-suite/SingleSource/Regression/C++/2003-09-29-NonPODsByValue.reference_output /Users/buildslave/jenkins/workspace/test-suite-verify-machineinstrs-aarch64-O0-g/test-suite-build/SingleSource/Regression/C++/2003-09-29-NonPODsByValue.reference_output [8534/8583] /Users/buildslave/jenkins/workspace/test-suite-verify-machineinstrs-aarch64-O0-g/test-suite-build/tools/timeit --summary SingleSource/Regression/C++/CMakeFiles/Regression-C++-2011-03-28-Bitfield.dir/2011-03-28-Bitfield.cpp.o.time /Users/buildslave/jenkins/workspace/test-suite-verify-machineinstrs-aarch64-O0-g/compiler/bin/clang++ -DNDEBUG -B /Applications/Xcode.app/Contents/Developer/Toolchains/XcodeDefault.xctoolchain/usr/bin -Wno-unused-command-line-argument -mllvm -verify-machineinstrs -O0 -g -arch arm64 -isysroot /Applications/Xcode.app/Contents/Developer/Platforms/iPhoneOS.platform/Developer/SDKs/iPhoneOS12.1.sdk -w -Werror=date-time -MD -MT SingleSource/Regression/C++/CMakeFiles/Regression-C++-2011-03-28-Bitfield.dir/2011-03-28-Bitfield.cpp.o -MF SingleSource/Regression/C++/CMakeFiles/Regression-C++-2011-03-28-Bitfield.dir/2011-03-28-Bitfield.cpp.o.d -o SingleSource/Regression/C++/CMakeFiles/Regression-C++-2011-03-28-Bitfield.dir/2011-03-28-Bitfield.cpp.o -c /Users/buildslave/jenkins/workspace/test-suite-verify-machineinstrs-aarch64-O0-g/test-suite/SingleSource/Regression/C++/2011-03-28-Bitfield.cpp [8535/8583] /Users/buildslave/jenkins/workspace/test-suite-verify-machineinstrs-aarch64-O0-g/test-suite-build/tools/timeit --summary SingleSource/Regression/C++/CMakeFiles/Regression-C++-2008-01-29-ParamAliasesReturn.dir/2008-01-29-ParamAliasesReturn.cpp.o.time /Users/buildslave/jenkins/workspace/test-suite-verify-machineinstrs-aarch64-O0-g/compiler/bin/clang++ -DNDEBUG -B /Applications/Xcode.app/Contents/Developer/Toolchains/XcodeDefault.xctoolchain/usr/bin -Wno-unused-command-line-argument -mllvm -verify-machineinstrs -O0 -g -arch arm64 -isysroot /Applications/Xcode.app/Contents/Developer/Platforms/iPhoneOS.platform/Developer/SDKs/iPhoneOS12.1.sdk -w -Werror=date-time -MD -MT SingleSource/Regression/C++/CMakeFiles/Regression-C++-2008-01-29-ParamAliasesReturn.dir/2008-01-29-ParamAliasesReturn.cpp.o -MF SingleSource/Regression/C++/CMakeFiles/Regression-C++-2008-01-29-ParamAliasesReturn.dir/2008-01-29-ParamAliasesReturn.cpp.o.d -o SingleSource/Regression/C++/CMakeFiles/Regression-C++-2008-01-29-ParamAliasesReturn.dir/2008-01-29-ParamAliasesReturn.cpp.o -c /Users/buildslave/jenkins/workspace/test-suite-verify-machineinstrs-aarch64-O0-g/test-suite/SingleSource/Regression/C++/2008-01-29-ParamAliasesReturn.cpp [8536/8583] /Users/buildslave/jenkins/workspace/test-suite-verify-machineinstrs-aarch64-O0-g/test-suite-build/tools/timeit --summary SingleSource/Regression/C++/CMakeFiles/Regression-C++-pointer_method.dir/pointer_method.cpp.o.time /Users/buildslave/jenkins/workspace/test-suite-verify-machineinstrs-aarch64-O0-g/compiler/bin/clang++ -DNDEBUG -B /Applications/Xcode.app/Contents/Developer/Toolchains/XcodeDefault.xctoolchain/usr/bin -Wno-unused-command-line-argument -mllvm -verify-machineinstrs -O0 -g -arch arm64 -isysroot /Applications/Xcode.app/Contents/Developer/Platforms/iPhoneOS.platform/Developer/SDKs/iPhoneOS12.1.sdk -w -Werror=date-time -MD -MT SingleSource/Regression/C++/CMakeFiles/Regression-C++-pointer_method.dir/pointer_method.cpp.o -MF SingleSource/Regression/C++/CMakeFiles/Regression-C++-pointer_method.dir/pointer_method.cpp.o.d -o SingleSource/Regression/C++/CMakeFiles/Regression-C++-pointer_method.dir/pointer_method.cpp.o -c /Users/buildslave/jenkins/workspace/test-suite-verify-machineinstrs-aarch64-O0-g/test-suite/SingleSource/Regression/C++/pointer_method.cpp [8537/8583] /Users/buildslave/jenkins/workspace/test-suite-verify-machineinstrs-aarch64-O0-g/test-suite-build/tools/timeit --summary SingleSource/Regression/C++/CMakeFiles/Regression-C++-2003-08-20-EnumSizeProblem.dir/2003-08-20-EnumSizeProblem.cpp.o.time /Users/buildslave/jenkins/workspace/test-suite-verify-machineinstrs-aarch64-O0-g/compiler/bin/clang++ -DNDEBUG -B /Applications/Xcode.app/Contents/Developer/Toolchains/XcodeDefault.xctoolchain/usr/bin -Wno-unused-command-line-argument -mllvm -verify-machineinstrs -O0 -g -arch arm64 -isysroot /Applications/Xcode.app/Contents/Developer/Platforms/iPhoneOS.platform/Developer/SDKs/iPhoneOS12.1.sdk -w -Werror=date-time -MD -MT SingleSource/Regression/C++/CMakeFiles/Regression-C++-2003-08-20-EnumSizeProblem.dir/2003-08-20-EnumSizeProblem.cpp.o -MF SingleSource/Regression/C++/CMakeFiles/Regression-C++-2003-08-20-EnumSizeProblem.dir/2003-08-20-EnumSizeProblem.cpp.o.d -o SingleSource/Regression/C++/CMakeFiles/Regression-C++-2003-08-20-EnumSizeProblem.dir/2003-08-20-EnumSizeProblem.cpp.o -c /Users/buildslave/jenkins/workspace/test-suite-verify-machineinstrs-aarch64-O0-g/test-suite/SingleSource/Regression/C++/2003-08-20-EnumSizeProblem.cpp [8538/8583] /Users/buildslave/jenkins/workspace/test-suite-verify-machineinstrs-aarch64-O0-g/test-suite-build/tools/timeit --summary SingleSource/Regression/C++/CMakeFiles/Regression-C++-global_ctor.dir/global_ctor.cpp.o.time /Users/buildslave/jenkins/workspace/test-suite-verify-machineinstrs-aarch64-O0-g/compiler/bin/clang++ -DNDEBUG -B /Applications/Xcode.app/Contents/Developer/Toolchains/XcodeDefault.xctoolchain/usr/bin -Wno-unused-command-line-argument -mllvm -verify-machineinstrs -O0 -g -arch arm64 -isysroot /Applications/Xcode.app/Contents/Developer/Platforms/iPhoneOS.platform/Developer/SDKs/iPhoneOS12.1.sdk -w -Werror=date-time -MD -MT SingleSource/Regression/C++/CMakeFiles/Regression-C++-global_ctor.dir/global_ctor.cpp.o -MF SingleSource/Regression/C++/CMakeFiles/Regression-C++-global_ctor.dir/global_ctor.cpp.o.d -o SingleSource/Regression/C++/CMakeFiles/Regression-C++-global_ctor.dir/global_ctor.cpp.o -c /Users/buildslave/jenkins/workspace/test-suite-verify-machineinstrs-aarch64-O0-g/test-suite/SingleSource/Regression/C++/global_ctor.cpp [8539/8583] : && /Users/buildslave/jenkins/workspace/test-suite-verify-machineinstrs-aarch64-O0-g/test-suite-build/tools/timeit --summary SingleSource/Regression/C++/Regression-C++-2011-03-28-Bitfield.link.time /Users/buildslave/jenkins/workspace/test-suite-verify-machineinstrs-aarch64-O0-g/compiler/bin/clang++ -B /Applications/Xcode.app/Contents/Developer/Toolchains/XcodeDefault.xctoolchain/usr/bin -Wno-unused-command-line-argument -mllvm -verify-machineinstrs -O0 -g -arch arm64 -isysroot /Applications/Xcode.app/Contents/Developer/Platforms/iPhoneOS.platform/Developer/SDKs/iPhoneOS12.1.sdk -Wl,-search_paths_first -Wl,-headerpad_max_install_names -B /Applications/Xcode.app/Contents/Developer/Toolchains/XcodeDefault.xctoolchain/usr/bin SingleSource/Regression/C++/CMakeFiles/Regression-C++-2011-03-28-Bitfield.dir/2011-03-28-Bitfield.cpp.o -o SingleSource/Regression/C++/Regression-C++-2011-03-28-Bitfield -lstdc++ && cd /Users/buildslave/jenkins/workspace/test-suite-verify-machineinstrs-aarch64-O0-g/test-suite-build/SingleSource/Regression/C++ && /usr/local/Cellar/cmake/3.13.1/bin/cmake -E create_symlink /Users/buildslave/jenkins/workspace/test-suite-verify-machineinstrs-aarch64-O0-g/test-suite/SingleSource/Regression/C++/2011-03-28-Bitfield.reference_output /Users/buildslave/jenkins/workspace/test-suite-verify-machineinstrs-aarch64-O0-g/test-suite-build/SingleSource/Regression/C++/2011-03-28-Bitfield.reference_output [8540/8583] : && /Users/buildslave/jenkins/workspace/test-suite-verify-machineinstrs-aarch64-O0-g/test-suite-build/tools/timeit --summary SingleSource/Regression/C++/Regression-C++-pointer_method.link.time /Users/buildslave/jenkins/workspace/test-suite-verify-machineinstrs-aarch64-O0-g/compiler/bin/clang++ -B /Applications/Xcode.app/Contents/Developer/Toolchains/XcodeDefault.xctoolchain/usr/bin -Wno-unused-command-line-argument -mllvm -verify-machineinstrs -O0 -g -arch arm64 -isysroot /Applications/Xcode.app/Contents/Developer/Platforms/iPhoneOS.platform/Developer/SDKs/iPhoneOS12.1.sdk -Wl,-search_paths_first -Wl,-headerpad_max_install_names -B /Applications/Xcode.app/Contents/Developer/Toolchains/XcodeDefault.xctoolchain/usr/bin SingleSource/Regression/C++/CMakeFiles/Regression-C++-pointer_method.dir/pointer_method.cpp.o -o SingleSource/Regression/C++/Regression-C++-pointer_method -lstdc++ && cd /Users/buildslave/jenkins/workspace/test-suite-verify-machineinstrs-aarch64-O0-g/test-suite-build/SingleSource/Regression/C++ && /usr/local/Cellar/cmake/3.13.1/bin/cmake -E create_symlink /Users/buildslave/jenkins/workspace/test-suite-verify-machineinstrs-aarch64-O0-g/test-suite/SingleSource/Regression/C++/pointer_method.reference_output /Users/buildslave/jenkins/workspace/test-suite-verify-machineinstrs-aarch64-O0-g/test-suite-build/SingleSource/Regression/C++/pointer_method.reference_output [8541/8583] : && /Users/buildslave/jenkins/workspace/test-suite-verify-machineinstrs-aarch64-O0-g/test-suite-build/tools/timeit --summary SingleSource/Regression/C++/Regression-C++-2008-01-29-ParamAliasesReturn.link.time /Users/buildslave/jenkins/workspace/test-suite-verify-machineinstrs-aarch64-O0-g/compiler/bin/clang++ -B /Applications/Xcode.app/Contents/Developer/Toolchains/XcodeDefault.xctoolchain/usr/bin -Wno-unused-command-line-argument -mllvm -verify-machineinstrs -O0 -g -arch arm64 -isysroot /Applications/Xcode.app/Contents/Developer/Platforms/iPhoneOS.platform/Developer/SDKs/iPhoneOS12.1.sdk -Wl,-search_paths_first -Wl,-headerpad_max_install_names -B /Applications/Xcode.app/Contents/Developer/Toolchains/XcodeDefault.xctoolchain/usr/bin SingleSource/Regression/C++/CMakeFiles/Regression-C++-2008-01-29-ParamAliasesReturn.dir/2008-01-29-ParamAliasesReturn.cpp.o -o SingleSource/Regression/C++/Regression-C++-2008-01-29-ParamAliasesReturn -lstdc++ && cd /Users/buildslave/jenkins/workspace/test-suite-verify-machineinstrs-aarch64-O0-g/test-suite-build/SingleSource/Regression/C++ && /usr/local/Cellar/cmake/3.13.1/bin/cmake -E create_symlink /Users/buildslave/jenkins/workspace/test-suite-verify-machineinstrs-aarch64-O0-g/test-suite/SingleSource/Regression/C++/2008-01-29-ParamAliasesReturn.reference_output /Users/buildslave/jenkins/workspace/test-suite-verify-machineinstrs-aarch64-O0-g/test-suite-build/SingleSource/Regression/C++/2008-01-29-ParamAliasesReturn.reference_output [8542/8583] : && /Users/buildslave/jenkins/workspace/test-suite-verify-machineinstrs-aarch64-O0-g/test-suite-build/tools/timeit --summary SingleSource/Regression/C++/Regression-C++-2003-08-20-EnumSizeProblem.link.time /Users/buildslave/jenkins/workspace/test-suite-verify-machineinstrs-aarch64-O0-g/compiler/bin/clang++ -B /Applications/Xcode.app/Contents/Developer/Toolchains/XcodeDefault.xctoolchain/usr/bin -Wno-unused-command-line-argument -mllvm -verify-machineinstrs -O0 -g -arch arm64 -isysroot /Applications/Xcode.app/Contents/Developer/Platforms/iPhoneOS.platform/Developer/SDKs/iPhoneOS12.1.sdk -Wl,-search_paths_first -Wl,-headerpad_max_install_names -B /Applications/Xcode.app/Contents/Developer/Toolchains/XcodeDefault.xctoolchain/usr/bin SingleSource/Regression/C++/CMakeFiles/Regression-C++-2003-08-20-EnumSizeProblem.dir/2003-08-20-EnumSizeProblem.cpp.o -o SingleSource/Regression/C++/Regression-C++-2003-08-20-EnumSizeProblem -lstdc++ && cd /Users/buildslave/jenkins/workspace/test-suite-verify-machineinstrs-aarch64-O0-g/test-suite-build/SingleSource/Regression/C++ && /usr/local/Cellar/cmake/3.13.1/bin/cmake -E create_symlink /Users/buildslave/jenkins/workspace/test-suite-verify-machineinstrs-aarch64-O0-g/test-suite/SingleSource/Regression/C++/2003-08-20-EnumSizeProblem.reference_output /Users/buildslave/jenkins/workspace/test-suite-verify-machineinstrs-aarch64-O0-g/test-suite-build/SingleSource/Regression/C++/2003-08-20-EnumSizeProblem.reference_output [8543/8583] : && /Users/buildslave/jenkins/workspace/test-suite-verify-machineinstrs-aarch64-O0-g/test-suite-build/tools/timeit --summary SingleSource/Regression/C++/Regression-C++-global_ctor.link.time /Users/buildslave/jenkins/workspace/test-suite-verify-machineinstrs-aarch64-O0-g/compiler/bin/clang++ -B /Applications/Xcode.app/Contents/Developer/Toolchains/XcodeDefault.xctoolchain/usr/bin -Wno-unused-command-line-argument -mllvm -verify-machineinstrs -O0 -g -arch arm64 -isysroot /Applications/Xcode.app/Contents/Developer/Platforms/iPhoneOS.platform/Developer/SDKs/iPhoneOS12.1.sdk -Wl,-search_paths_first -Wl,-headerpad_max_install_names -B /Applications/Xcode.app/Contents/Developer/Toolchains/XcodeDefault.xctoolchain/usr/bin SingleSource/Regression/C++/CMakeFiles/Regression-C++-global_ctor.dir/global_ctor.cpp.o -o SingleSource/Regression/C++/Regression-C++-global_ctor -lstdc++ && cd /Users/buildslave/jenkins/workspace/test-suite-verify-machineinstrs-aarch64-O0-g/test-suite-build/SingleSource/Regression/C++ && /usr/local/Cellar/cmake/3.13.1/bin/cmake -E create_symlink /Users/buildslave/jenkins/workspace/test-suite-verify-machineinstrs-aarch64-O0-g/test-suite/SingleSource/Regression/C++/global_ctor.reference_output /Users/buildslave/jenkins/workspace/test-suite-verify-machineinstrs-aarch64-O0-g/test-suite-build/SingleSource/Regression/C++/global_ctor.reference_output [8544/8583] /Users/buildslave/jenkins/workspace/test-suite-verify-machineinstrs-aarch64-O0-g/test-suite-build/tools/timeit --summary SingleSource/Regression/C++/CMakeFiles/Regression-C++-2003-06-13-Crasher.dir/2003-06-13-Crasher.cpp.o.time /Users/buildslave/jenkins/workspace/test-suite-verify-machineinstrs-aarch64-O0-g/compiler/bin/clang++ -DNDEBUG -B /Applications/Xcode.app/Contents/Developer/Toolchains/XcodeDefault.xctoolchain/usr/bin -Wno-unused-command-line-argument -mllvm -verify-machineinstrs -O0 -g -arch arm64 -isysroot /Applications/Xcode.app/Contents/Developer/Platforms/iPhoneOS.platform/Developer/SDKs/iPhoneOS12.1.sdk -w -Werror=date-time -MD -MT SingleSource/Regression/C++/CMakeFiles/Regression-C++-2003-06-13-Crasher.dir/2003-06-13-Crasher.cpp.o -MF SingleSource/Regression/C++/CMakeFiles/Regression-C++-2003-06-13-Crasher.dir/2003-06-13-Crasher.cpp.o.d -o SingleSource/Regression/C++/CMakeFiles/Regression-C++-2003-06-13-Crasher.dir/2003-06-13-Crasher.cpp.o -c /Users/buildslave/jenkins/workspace/test-suite-verify-machineinstrs-aarch64-O0-g/test-suite/SingleSource/Regression/C++/2003-06-13-Crasher.cpp [8545/8583] /Users/buildslave/jenkins/workspace/test-suite-verify-machineinstrs-aarch64-O0-g/test-suite-build/tools/timeit --summary SingleSource/Regression/C++/CMakeFiles/Regression-C++-2003-06-08-VirtualFunctions.dir/2003-06-08-VirtualFunctions.cpp.o.time /Users/buildslave/jenkins/workspace/test-suite-verify-machineinstrs-aarch64-O0-g/compiler/bin/clang++ -DNDEBUG -B /Applications/Xcode.app/Contents/Developer/Toolchains/XcodeDefault.xctoolchain/usr/bin -Wno-unused-command-line-argument -mllvm -verify-machineinstrs -O0 -g -arch arm64 -isysroot /Applications/Xcode.app/Contents/Developer/Platforms/iPhoneOS.platform/Developer/SDKs/iPhoneOS12.1.sdk -w -Werror=date-time -MD -MT SingleSource/Regression/C++/CMakeFiles/Regression-C++-2003-06-08-VirtualFunctions.dir/2003-06-08-VirtualFunctions.cpp.o -MF SingleSource/Regression/C++/CMakeFiles/Regression-C++-2003-06-08-VirtualFunctions.dir/2003-06-08-VirtualFunctions.cpp.o.d -o SingleSource/Regression/C++/CMakeFiles/Regression-C++-2003-06-08-VirtualFunctions.dir/2003-06-08-VirtualFunctions.cpp.o -c /Users/buildslave/jenkins/workspace/test-suite-verify-machineinstrs-aarch64-O0-g/test-suite/SingleSource/Regression/C++/2003-06-08-VirtualFunctions.cpp [8546/8583] : && /Users/buildslave/jenkins/workspace/test-suite-verify-machineinstrs-aarch64-O0-g/test-suite-build/tools/timeit --summary SingleSource/Regression/C++/Regression-C++-2003-06-13-Crasher.link.time /Users/buildslave/jenkins/workspace/test-suite-verify-machineinstrs-aarch64-O0-g/compiler/bin/clang++ -B /Applications/Xcode.app/Contents/Developer/Toolchains/XcodeDefault.xctoolchain/usr/bin -Wno-unused-command-line-argument -mllvm -verify-machineinstrs -O0 -g -arch arm64 -isysroot /Applications/Xcode.app/Contents/Developer/Platforms/iPhoneOS.platform/Developer/SDKs/iPhoneOS12.1.sdk -Wl,-search_paths_first -Wl,-headerpad_max_install_names -B /Applications/Xcode.app/Contents/Developer/Toolchains/XcodeDefault.xctoolchain/usr/bin SingleSource/Regression/C++/CMakeFiles/Regression-C++-2003-06-13-Crasher.dir/2003-06-13-Crasher.cpp.o -o SingleSource/Regression/C++/Regression-C++-2003-06-13-Crasher -lstdc++ && cd /Users/buildslave/jenkins/workspace/test-suite-verify-machineinstrs-aarch64-O0-g/test-suite-build/SingleSource/Regression/C++ && /usr/local/Cellar/cmake/3.13.1/bin/cmake -E create_symlink /Users/buildslave/jenkins/workspace/test-suite-verify-machineinstrs-aarch64-O0-g/test-suite/SingleSource/Regression/C++/2003-06-13-Crasher.reference_output /Users/buildslave/jenkins/workspace/test-suite-verify-machineinstrs-aarch64-O0-g/test-suite-build/SingleSource/Regression/C++/2003-06-13-Crasher.reference_output [8547/8583] : && /Users/buildslave/jenkins/workspace/test-suite-verify-machineinstrs-aarch64-O0-g/test-suite-build/tools/timeit --summary SingleSource/Regression/C++/Regression-C++-2003-06-08-VirtualFunctions.link.time /Users/buildslave/jenkins/workspace/test-suite-verify-machineinstrs-aarch64-O0-g/compiler/bin/clang++ -B /Applications/Xcode.app/Contents/Developer/Toolchains/XcodeDefault.xctoolchain/usr/bin -Wno-unused-command-line-argument -mllvm -verify-machineinstrs -O0 -g -arch arm64 -isysroot /Applications/Xcode.app/Contents/Developer/Platforms/iPhoneOS.platform/Developer/SDKs/iPhoneOS12.1.sdk -Wl,-search_paths_first -Wl,-headerpad_max_install_names -B /Applications/Xcode.app/Contents/Developer/Toolchains/XcodeDefault.xctoolchain/usr/bin SingleSource/Regression/C++/CMakeFiles/Regression-C++-2003-06-08-VirtualFunctions.dir/2003-06-08-VirtualFunctions.cpp.o -o SingleSource/Regression/C++/Regression-C++-2003-06-08-VirtualFunctions -lstdc++ && cd /Users/buildslave/jenkins/workspace/test-suite-verify-machineinstrs-aarch64-O0-g/test-suite-build/SingleSource/Regression/C++ && /usr/local/Cellar/cmake/3.13.1/bin/cmake -E create_symlink /Users/buildslave/jenkins/workspace/test-suite-verify-machineinstrs-aarch64-O0-g/test-suite/SingleSource/Regression/C++/2003-06-08-VirtualFunctions.reference_output /Users/buildslave/jenkins/workspace/test-suite-verify-machineinstrs-aarch64-O0-g/test-suite-build/SingleSource/Regression/C++/2003-06-08-VirtualFunctions.reference_output [8548/8583] /Users/buildslave/jenkins/workspace/test-suite-verify-machineinstrs-aarch64-O0-g/test-suite-build/tools/timeit --summary SingleSource/Regression/C++/CMakeFiles/Regression-C++-2003-05-14-expr_stmt.dir/2003-05-14-expr_stmt.cpp.o.time /Users/buildslave/jenkins/workspace/test-suite-verify-machineinstrs-aarch64-O0-g/compiler/bin/clang++ -DNDEBUG -B /Applications/Xcode.app/Contents/Developer/Toolchains/XcodeDefault.xctoolchain/usr/bin -Wno-unused-command-line-argument -mllvm -verify-machineinstrs -O0 -g -arch arm64 -isysroot /Applications/Xcode.app/Contents/Developer/Platforms/iPhoneOS.platform/Developer/SDKs/iPhoneOS12.1.sdk -w -Werror=date-time -MD -MT SingleSource/Regression/C++/CMakeFiles/Regression-C++-2003-05-14-expr_stmt.dir/2003-05-14-expr_stmt.cpp.o -MF SingleSource/Regression/C++/CMakeFiles/Regression-C++-2003-05-14-expr_stmt.dir/2003-05-14-expr_stmt.cpp.o.d -o SingleSource/Regression/C++/CMakeFiles/Regression-C++-2003-05-14-expr_stmt.dir/2003-05-14-expr_stmt.cpp.o -c /Users/buildslave/jenkins/workspace/test-suite-verify-machineinstrs-aarch64-O0-g/test-suite/SingleSource/Regression/C++/2003-05-14-expr_stmt.cpp [8549/8583] /Users/buildslave/jenkins/workspace/test-suite-verify-machineinstrs-aarch64-O0-g/test-suite-build/tools/timeit --summary SingleSource/Regression/C++/CMakeFiles/Regression-C++-2003-05-14-array-init.dir/2003-05-14-array-init.cpp.o.time /Users/buildslave/jenkins/workspace/test-suite-verify-machineinstrs-aarch64-O0-g/compiler/bin/clang++ -DNDEBUG -B /Applications/Xcode.app/Contents/Developer/Toolchains/XcodeDefault.xctoolchain/usr/bin -Wno-unused-command-line-argument -mllvm -verify-machineinstrs -O0 -g -arch arm64 -isysroot /Applications/Xcode.app/Contents/Developer/Platforms/iPhoneOS.platform/Developer/SDKs/iPhoneOS12.1.sdk -w -Werror=date-time -MD -MT SingleSource/Regression/C++/CMakeFiles/Regression-C++-2003-05-14-array-init.dir/2003-05-14-array-init.cpp.o -MF SingleSource/Regression/C++/CMakeFiles/Regression-C++-2003-05-14-array-init.dir/2003-05-14-array-init.cpp.o.d -o SingleSource/Regression/C++/CMakeFiles/Regression-C++-2003-05-14-array-init.dir/2003-05-14-array-init.cpp.o -c /Users/buildslave/jenkins/workspace/test-suite-verify-machineinstrs-aarch64-O0-g/test-suite/SingleSource/Regression/C++/2003-05-14-array-init.cpp [8550/8583] : && /Users/buildslave/jenkins/workspace/test-suite-verify-machineinstrs-aarch64-O0-g/test-suite-build/tools/timeit --summary SingleSource/Regression/C++/Regression-C++-2003-05-14-expr_stmt.link.time /Users/buildslave/jenkins/workspace/test-suite-verify-machineinstrs-aarch64-O0-g/compiler/bin/clang++ -B /Applications/Xcode.app/Contents/Developer/Toolchains/XcodeDefault.xctoolchain/usr/bin -Wno-unused-command-line-argument -mllvm -verify-machineinstrs -O0 -g -arch arm64 -isysroot /Applications/Xcode.app/Contents/Developer/Platforms/iPhoneOS.platform/Developer/SDKs/iPhoneOS12.1.sdk -Wl,-search_paths_first -Wl,-headerpad_max_install_names -B /Applications/Xcode.app/Contents/Developer/Toolchains/XcodeDefault.xctoolchain/usr/bin SingleSource/Regression/C++/CMakeFiles/Regression-C++-2003-05-14-expr_stmt.dir/2003-05-14-expr_stmt.cpp.o -o SingleSource/Regression/C++/Regression-C++-2003-05-14-expr_stmt -lstdc++ && cd /Users/buildslave/jenkins/workspace/test-suite-verify-machineinstrs-aarch64-O0-g/test-suite-build/SingleSource/Regression/C++ && /usr/local/Cellar/cmake/3.13.1/bin/cmake -E create_symlink /Users/buildslave/jenkins/workspace/test-suite-verify-machineinstrs-aarch64-O0-g/test-suite/SingleSource/Regression/C++/2003-05-14-expr_stmt.reference_output /Users/buildslave/jenkins/workspace/test-suite-verify-machineinstrs-aarch64-O0-g/test-suite-build/SingleSource/Regression/C++/2003-05-14-expr_stmt.reference_output [8551/8583] : && /Users/buildslave/jenkins/workspace/test-suite-verify-machineinstrs-aarch64-O0-g/test-suite-build/tools/timeit --summary SingleSource/Regression/C++/Regression-C++-2003-05-14-array-init.link.time /Users/buildslave/jenkins/workspace/test-suite-verify-machineinstrs-aarch64-O0-g/compiler/bin/clang++ -B /Applications/Xcode.app/Contents/Developer/Toolchains/XcodeDefault.xctoolchain/usr/bin -Wno-unused-command-line-argument -mllvm -verify-machineinstrs -O0 -g -arch arm64 -isysroot /Applications/Xcode.app/Contents/Developer/Platforms/iPhoneOS.platform/Developer/SDKs/iPhoneOS12.1.sdk -Wl,-search_paths_first -Wl,-headerpad_max_install_names -B /Applications/Xcode.app/Contents/Developer/Toolchains/XcodeDefault.xctoolchain/usr/bin SingleSource/Regression/C++/CMakeFiles/Regression-C++-2003-05-14-array-init.dir/2003-05-14-array-init.cpp.o -o SingleSource/Regression/C++/Regression-C++-2003-05-14-array-init -lstdc++ && cd /Users/buildslave/jenkins/workspace/test-suite-verify-machineinstrs-aarch64-O0-g/test-suite-build/SingleSource/Regression/C++ && /usr/local/Cellar/cmake/3.13.1/bin/cmake -E create_symlink /Users/buildslave/jenkins/workspace/test-suite-verify-machineinstrs-aarch64-O0-g/test-suite/SingleSource/Regression/C++/2003-05-14-array-init.reference_output /Users/buildslave/jenkins/workspace/test-suite-verify-machineinstrs-aarch64-O0-g/test-suite-build/SingleSource/Regression/C++/2003-05-14-array-init.reference_output [8552/8583] /Users/buildslave/jenkins/workspace/test-suite-verify-machineinstrs-aarch64-O0-g/test-suite-build/tools/timeit --summary SingleSource/Regression/C++/CMakeFiles/Regression-C++-BuiltinTypeInfo.dir/BuiltinTypeInfo.cpp.o.time /Users/buildslave/jenkins/workspace/test-suite-verify-machineinstrs-aarch64-O0-g/compiler/bin/clang++ -DNDEBUG -B /Applications/Xcode.app/Contents/Developer/Toolchains/XcodeDefault.xctoolchain/usr/bin -Wno-unused-command-line-argument -mllvm -verify-machineinstrs -O0 -g -arch arm64 -isysroot /Applications/Xcode.app/Contents/Developer/Platforms/iPhoneOS.platform/Developer/SDKs/iPhoneOS12.1.sdk -w -Werror=date-time -MD -MT SingleSource/Regression/C++/CMakeFiles/Regression-C++-BuiltinTypeInfo.dir/BuiltinTypeInfo.cpp.o -MF SingleSource/Regression/C++/CMakeFiles/Regression-C++-BuiltinTypeInfo.dir/BuiltinTypeInfo.cpp.o.d -o SingleSource/Regression/C++/CMakeFiles/Regression-C++-BuiltinTypeInfo.dir/BuiltinTypeInfo.cpp.o -c /Users/buildslave/jenkins/workspace/test-suite-verify-machineinstrs-aarch64-O0-g/test-suite/SingleSource/Regression/C++/BuiltinTypeInfo.cpp [8553/8583] /Users/buildslave/jenkins/workspace/test-suite-verify-machineinstrs-aarch64-O0-g/test-suite-build/tools/timeit --summary SingleSource/Regression/C++/CMakeFiles/Regression-C++-fixups.dir/fixups.cpp.o.time /Users/buildslave/jenkins/workspace/test-suite-verify-machineinstrs-aarch64-O0-g/compiler/bin/clang++ -DNDEBUG -B /Applications/Xcode.app/Contents/Developer/Toolchains/XcodeDefault.xctoolchain/usr/bin -Wno-unused-command-line-argument -mllvm -verify-machineinstrs -O0 -g -arch arm64 -isysroot /Applications/Xcode.app/Contents/Developer/Platforms/iPhoneOS.platform/Developer/SDKs/iPhoneOS12.1.sdk -w -Werror=date-time -MD -MT SingleSource/Regression/C++/CMakeFiles/Regression-C++-fixups.dir/fixups.cpp.o -MF SingleSource/Regression/C++/CMakeFiles/Regression-C++-fixups.dir/fixups.cpp.o.d -o SingleSource/Regression/C++/CMakeFiles/Regression-C++-fixups.dir/fixups.cpp.o -c /Users/buildslave/jenkins/workspace/test-suite-verify-machineinstrs-aarch64-O0-g/test-suite/SingleSource/Regression/C++/fixups.cpp [8554/8583] /Users/buildslave/jenkins/workspace/test-suite-verify-machineinstrs-aarch64-O0-g/test-suite-build/tools/timeit --summary SingleSource/Regression/C++/EH/CMakeFiles/Regression-C++-throw_rethrow_test.dir/throw_rethrow_test.cpp.o.time /Users/buildslave/jenkins/workspace/test-suite-verify-machineinstrs-aarch64-O0-g/compiler/bin/clang++ -DNDEBUG -B /Applications/Xcode.app/Contents/Developer/Toolchains/XcodeDefault.xctoolchain/usr/bin -Wno-unused-command-line-argument -mllvm -verify-machineinstrs -O0 -g -arch arm64 -isysroot /Applications/Xcode.app/Contents/Developer/Platforms/iPhoneOS.platform/Developer/SDKs/iPhoneOS12.1.sdk -w -Werror=date-time -MD -MT SingleSource/Regression/C++/EH/CMakeFiles/Regression-C++-throw_rethrow_test.dir/throw_rethrow_test.cpp.o -MF SingleSource/Regression/C++/EH/CMakeFiles/Regression-C++-throw_rethrow_test.dir/throw_rethrow_test.cpp.o.d -o SingleSource/Regression/C++/EH/CMakeFiles/Regression-C++-throw_rethrow_test.dir/throw_rethrow_test.cpp.o -c /Users/buildslave/jenkins/workspace/test-suite-verify-machineinstrs-aarch64-O0-g/test-suite/SingleSource/Regression/C++/EH/throw_rethrow_test.cpp [8555/8583] /Users/buildslave/jenkins/workspace/test-suite-verify-machineinstrs-aarch64-O0-g/test-suite-build/tools/timeit --summary SingleSource/Regression/C++/EH/CMakeFiles/Regression-C++-simple_rethrow.dir/simple_rethrow.cpp.o.time /Users/buildslave/jenkins/workspace/test-suite-verify-machineinstrs-aarch64-O0-g/compiler/bin/clang++ -DNDEBUG -B /Applications/Xcode.app/Contents/Developer/Toolchains/XcodeDefault.xctoolchain/usr/bin -Wno-unused-command-line-argument -mllvm -verify-machineinstrs -O0 -g -arch arm64 -isysroot /Applications/Xcode.app/Contents/Developer/Platforms/iPhoneOS.platform/Developer/SDKs/iPhoneOS12.1.sdk -w -Werror=date-time -MD -MT SingleSource/Regression/C++/EH/CMakeFiles/Regression-C++-simple_rethrow.dir/simple_rethrow.cpp.o -MF SingleSource/Regression/C++/EH/CMakeFiles/Regression-C++-simple_rethrow.dir/simple_rethrow.cpp.o.d -o SingleSource/Regression/C++/EH/CMakeFiles/Regression-C++-simple_rethrow.dir/simple_rethrow.cpp.o -c /Users/buildslave/jenkins/workspace/test-suite-verify-machineinstrs-aarch64-O0-g/test-suite/SingleSource/Regression/C++/EH/simple_rethrow.cpp [8556/8583] : && /Users/buildslave/jenkins/workspace/test-suite-verify-machineinstrs-aarch64-O0-g/test-suite-build/tools/timeit --summary SingleSource/Regression/C++/Regression-C++-BuiltinTypeInfo.link.time /Users/buildslave/jenkins/workspace/test-suite-verify-machineinstrs-aarch64-O0-g/compiler/bin/clang++ -B /Applications/Xcode.app/Contents/Developer/Toolchains/XcodeDefault.xctoolchain/usr/bin -Wno-unused-command-line-argument -mllvm -verify-machineinstrs -O0 -g -arch arm64 -isysroot /Applications/Xcode.app/Contents/Developer/Platforms/iPhoneOS.platform/Developer/SDKs/iPhoneOS12.1.sdk -Wl,-search_paths_first -Wl,-headerpad_max_install_names -B /Applications/Xcode.app/Contents/Developer/Toolchains/XcodeDefault.xctoolchain/usr/bin SingleSource/Regression/C++/CMakeFiles/Regression-C++-BuiltinTypeInfo.dir/BuiltinTypeInfo.cpp.o -o SingleSource/Regression/C++/Regression-C++-BuiltinTypeInfo -lstdc++ && cd /Users/buildslave/jenkins/workspace/test-suite-verify-machineinstrs-aarch64-O0-g/test-suite-build/SingleSource/Regression/C++ && /usr/local/Cellar/cmake/3.13.1/bin/cmake -E create_symlink /Users/buildslave/jenkins/workspace/test-suite-verify-machineinstrs-aarch64-O0-g/test-suite/SingleSource/Regression/C++/BuiltinTypeInfo.reference_output /Users/buildslave/jenkins/workspace/test-suite-verify-machineinstrs-aarch64-O0-g/test-suite-build/SingleSource/Regression/C++/BuiltinTypeInfo.reference_output [8557/8583] : && /Users/buildslave/jenkins/workspace/test-suite-verify-machineinstrs-aarch64-O0-g/test-suite-build/tools/timeit --summary SingleSource/Regression/C++/Regression-C++-fixups.link.time /Users/buildslave/jenkins/workspace/test-suite-verify-machineinstrs-aarch64-O0-g/compiler/bin/clang++ -B /Applications/Xcode.app/Contents/Developer/Toolchains/XcodeDefault.xctoolchain/usr/bin -Wno-unused-command-line-argument -mllvm -verify-machineinstrs -O0 -g -arch arm64 -isysroot /Applications/Xcode.app/Contents/Developer/Platforms/iPhoneOS.platform/Developer/SDKs/iPhoneOS12.1.sdk -Wl,-search_paths_first -Wl,-headerpad_max_install_names -B /Applications/Xcode.app/Contents/Developer/Toolchains/XcodeDefault.xctoolchain/usr/bin SingleSource/Regression/C++/CMakeFiles/Regression-C++-fixups.dir/fixups.cpp.o -o SingleSource/Regression/C++/Regression-C++-fixups -lstdc++ && cd /Users/buildslave/jenkins/workspace/test-suite-verify-machineinstrs-aarch64-O0-g/test-suite-build/SingleSource/Regression/C++ && /usr/local/Cellar/cmake/3.13.1/bin/cmake -E create_symlink /Users/buildslave/jenkins/workspace/test-suite-verify-machineinstrs-aarch64-O0-g/test-suite/SingleSource/Regression/C++/fixups.reference_output /Users/buildslave/jenkins/workspace/test-suite-verify-machineinstrs-aarch64-O0-g/test-suite-build/SingleSource/Regression/C++/fixups.reference_output [8558/8583] : && /Users/buildslave/jenkins/workspace/test-suite-verify-machineinstrs-aarch64-O0-g/test-suite-build/tools/timeit --summary SingleSource/Regression/C++/EH/Regression-C++-throw_rethrow_test.link.time /Users/buildslave/jenkins/workspace/test-suite-verify-machineinstrs-aarch64-O0-g/compiler/bin/clang++ -B /Applications/Xcode.app/Contents/Developer/Toolchains/XcodeDefault.xctoolchain/usr/bin -Wno-unused-command-line-argument -mllvm -verify-machineinstrs -O0 -g -arch arm64 -isysroot /Applications/Xcode.app/Contents/Developer/Platforms/iPhoneOS.platform/Developer/SDKs/iPhoneOS12.1.sdk -Wl,-search_paths_first -Wl,-headerpad_max_install_names -B /Applications/Xcode.app/Contents/Developer/Toolchains/XcodeDefault.xctoolchain/usr/bin SingleSource/Regression/C++/EH/CMakeFiles/Regression-C++-throw_rethrow_test.dir/throw_rethrow_test.cpp.o -o SingleSource/Regression/C++/EH/Regression-C++-throw_rethrow_test -lstdc++ && cd /Users/buildslave/jenkins/workspace/test-suite-verify-machineinstrs-aarch64-O0-g/test-suite-build/SingleSource/Regression/C++/EH && /usr/local/Cellar/cmake/3.13.1/bin/cmake -E create_symlink /Users/buildslave/jenkins/workspace/test-suite-verify-machineinstrs-aarch64-O0-g/test-suite/SingleSource/Regression/C++/EH/throw_rethrow_test.reference_output /Users/buildslave/jenkins/workspace/test-suite-verify-machineinstrs-aarch64-O0-g/test-suite-build/SingleSource/Regression/C++/EH/throw_rethrow_test.reference_output [8559/8583] : && /Users/buildslave/jenkins/workspace/test-suite-verify-machineinstrs-aarch64-O0-g/test-suite-build/tools/timeit --summary SingleSource/Regression/C++/EH/Regression-C++-simple_rethrow.link.time /Users/buildslave/jenkins/workspace/test-suite-verify-machineinstrs-aarch64-O0-g/compiler/bin/clang++ -B /Applications/Xcode.app/Contents/Developer/Toolchains/XcodeDefault.xctoolchain/usr/bin -Wno-unused-command-line-argument -mllvm -verify-machineinstrs -O0 -g -arch arm64 -isysroot /Applications/Xcode.app/Contents/Developer/Platforms/iPhoneOS.platform/Developer/SDKs/iPhoneOS12.1.sdk -Wl,-search_paths_first -Wl,-headerpad_max_install_names -B /Applications/Xcode.app/Contents/Developer/Toolchains/XcodeDefault.xctoolchain/usr/bin SingleSource/Regression/C++/EH/CMakeFiles/Regression-C++-simple_rethrow.dir/simple_rethrow.cpp.o -o SingleSource/Regression/C++/EH/Regression-C++-simple_rethrow -lstdc++ && cd /Users/buildslave/jenkins/workspace/test-suite-verify-machineinstrs-aarch64-O0-g/test-suite-build/SingleSource/Regression/C++/EH && /usr/local/Cellar/cmake/3.13.1/bin/cmake -E create_symlink /Users/buildslave/jenkins/workspace/test-suite-verify-machineinstrs-aarch64-O0-g/test-suite/SingleSource/Regression/C++/EH/simple_rethrow.reference_output /Users/buildslave/jenkins/workspace/test-suite-verify-machineinstrs-aarch64-O0-g/test-suite-build/SingleSource/Regression/C++/EH/simple_rethrow.reference_output [8560/8583] /Users/buildslave/jenkins/workspace/test-suite-verify-machineinstrs-aarch64-O0-g/test-suite-build/tools/timeit --summary SingleSource/Regression/C++/EH/CMakeFiles/Regression-C++-dead_try_block.dir/dead_try_block.cpp.o.time /Users/buildslave/jenkins/workspace/test-suite-verify-machineinstrs-aarch64-O0-g/compiler/bin/clang++ -DNDEBUG -B /Applications/Xcode.app/Contents/Developer/Toolchains/XcodeDefault.xctoolchain/usr/bin -Wno-unused-command-line-argument -mllvm -verify-machineinstrs -O0 -g -arch arm64 -isysroot /Applications/Xcode.app/Contents/Developer/Platforms/iPhoneOS.platform/Developer/SDKs/iPhoneOS12.1.sdk -w -Werror=date-time -MD -MT SingleSource/Regression/C++/EH/CMakeFiles/Regression-C++-dead_try_block.dir/dead_try_block.cpp.o -MF SingleSource/Regression/C++/EH/CMakeFiles/Regression-C++-dead_try_block.dir/dead_try_block.cpp.o.d -o SingleSource/Regression/C++/EH/CMakeFiles/Regression-C++-dead_try_block.dir/dead_try_block.cpp.o -c /Users/buildslave/jenkins/workspace/test-suite-verify-machineinstrs-aarch64-O0-g/test-suite/SingleSource/Regression/C++/EH/dead_try_block.cpp [8561/8583] /Users/buildslave/jenkins/workspace/test-suite-verify-machineinstrs-aarch64-O0-g/test-suite-build/tools/timeit --summary SingleSource/Regression/C++/EH/CMakeFiles/Regression-C++-inlined_cleanup.dir/inlined_cleanup.cpp.o.time /Users/buildslave/jenkins/workspace/test-suite-verify-machineinstrs-aarch64-O0-g/compiler/bin/clang++ -DNDEBUG -B /Applications/Xcode.app/Contents/Developer/Toolchains/XcodeDefault.xctoolchain/usr/bin -Wno-unused-command-line-argument -mllvm -verify-machineinstrs -O0 -g -arch arm64 -isysroot /Applications/Xcode.app/Contents/Developer/Platforms/iPhoneOS.platform/Developer/SDKs/iPhoneOS12.1.sdk -w -Werror=date-time -MD -MT SingleSource/Regression/C++/EH/CMakeFiles/Regression-C++-inlined_cleanup.dir/inlined_cleanup.cpp.o -MF SingleSource/Regression/C++/EH/CMakeFiles/Regression-C++-inlined_cleanup.dir/inlined_cleanup.cpp.o.d -o SingleSource/Regression/C++/EH/CMakeFiles/Regression-C++-inlined_cleanup.dir/inlined_cleanup.cpp.o -c /Users/buildslave/jenkins/workspace/test-suite-verify-machineinstrs-aarch64-O0-g/test-suite/SingleSource/Regression/C++/EH/inlined_cleanup.cpp [8562/8583] : && /Users/buildslave/jenkins/workspace/test-suite-verify-machineinstrs-aarch64-O0-g/test-suite-build/tools/timeit --summary SingleSource/Regression/C++/EH/Regression-C++-dead_try_block.link.time /Users/buildslave/jenkins/workspace/test-suite-verify-machineinstrs-aarch64-O0-g/compiler/bin/clang++ -B /Applications/Xcode.app/Contents/Developer/Toolchains/XcodeDefault.xctoolchain/usr/bin -Wno-unused-command-line-argument -mllvm -verify-machineinstrs -O0 -g -arch arm64 -isysroot /Applications/Xcode.app/Contents/Developer/Platforms/iPhoneOS.platform/Developer/SDKs/iPhoneOS12.1.sdk -Wl,-search_paths_first -Wl,-headerpad_max_install_names -B /Applications/Xcode.app/Contents/Developer/Toolchains/XcodeDefault.xctoolchain/usr/bin SingleSource/Regression/C++/EH/CMakeFiles/Regression-C++-dead_try_block.dir/dead_try_block.cpp.o -o SingleSource/Regression/C++/EH/Regression-C++-dead_try_block -lstdc++ && cd /Users/buildslave/jenkins/workspace/test-suite-verify-machineinstrs-aarch64-O0-g/test-suite-build/SingleSource/Regression/C++/EH && /usr/local/Cellar/cmake/3.13.1/bin/cmake -E create_symlink /Users/buildslave/jenkins/workspace/test-suite-verify-machineinstrs-aarch64-O0-g/test-suite/SingleSource/Regression/C++/EH/dead_try_block.reference_output /Users/buildslave/jenkins/workspace/test-suite-verify-machineinstrs-aarch64-O0-g/test-suite-build/SingleSource/Regression/C++/EH/dead_try_block.reference_output [8563/8583] : && /Users/buildslave/jenkins/workspace/test-suite-verify-machineinstrs-aarch64-O0-g/test-suite-build/tools/timeit --summary SingleSource/Regression/C++/EH/Regression-C++-inlined_cleanup.link.time /Users/buildslave/jenkins/workspace/test-suite-verify-machineinstrs-aarch64-O0-g/compiler/bin/clang++ -B /Applications/Xcode.app/Contents/Developer/Toolchains/XcodeDefault.xctoolchain/usr/bin -Wno-unused-command-line-argument -mllvm -verify-machineinstrs -O0 -g -arch arm64 -isysroot /Applications/Xcode.app/Contents/Developer/Platforms/iPhoneOS.platform/Developer/SDKs/iPhoneOS12.1.sdk -Wl,-search_paths_first -Wl,-headerpad_max_install_names -B /Applications/Xcode.app/Contents/Developer/Toolchains/XcodeDefault.xctoolchain/usr/bin SingleSource/Regression/C++/EH/CMakeFiles/Regression-C++-inlined_cleanup.dir/inlined_cleanup.cpp.o -o SingleSource/Regression/C++/EH/Regression-C++-inlined_cleanup -lstdc++ && cd /Users/buildslave/jenkins/workspace/test-suite-verify-machineinstrs-aarch64-O0-g/test-suite-build/SingleSource/Regression/C++/EH && /usr/local/Cellar/cmake/3.13.1/bin/cmake -E create_symlink /Users/buildslave/jenkins/workspace/test-suite-verify-machineinstrs-aarch64-O0-g/test-suite/SingleSource/Regression/C++/EH/inlined_cleanup.reference_output /Users/buildslave/jenkins/workspace/test-suite-verify-machineinstrs-aarch64-O0-g/test-suite-build/SingleSource/Regression/C++/EH/inlined_cleanup.reference_output [8564/8583] /Users/buildslave/jenkins/workspace/test-suite-verify-machineinstrs-aarch64-O0-g/test-suite-build/tools/timeit --summary SingleSource/Regression/C++/EH/CMakeFiles/Regression-C++-ctor_dtor_count.dir/ctor_dtor_count.cpp.o.time /Users/buildslave/jenkins/workspace/test-suite-verify-machineinstrs-aarch64-O0-g/compiler/bin/clang++ -DNDEBUG -B /Applications/Xcode.app/Contents/Developer/Toolchains/XcodeDefault.xctoolchain/usr/bin -Wno-unused-command-line-argument -mllvm -verify-machineinstrs -O0 -g -arch arm64 -isysroot /Applications/Xcode.app/Contents/Developer/Platforms/iPhoneOS.platform/Developer/SDKs/iPhoneOS12.1.sdk -w -Werror=date-time -MD -MT SingleSource/Regression/C++/EH/CMakeFiles/Regression-C++-ctor_dtor_count.dir/ctor_dtor_count.cpp.o -MF SingleSource/Regression/C++/EH/CMakeFiles/Regression-C++-ctor_dtor_count.dir/ctor_dtor_count.cpp.o.d -o SingleSource/Regression/C++/EH/CMakeFiles/Regression-C++-ctor_dtor_count.dir/ctor_dtor_count.cpp.o -c /Users/buildslave/jenkins/workspace/test-suite-verify-machineinstrs-aarch64-O0-g/test-suite/SingleSource/Regression/C++/EH/ctor_dtor_count.cpp [8565/8583] : && /Users/buildslave/jenkins/workspace/test-suite-verify-machineinstrs-aarch64-O0-g/test-suite-build/tools/timeit --summary SingleSource/Regression/C++/EH/Regression-C++-ctor_dtor_count.link.time /Users/buildslave/jenkins/workspace/test-suite-verify-machineinstrs-aarch64-O0-g/compiler/bin/clang++ -B /Applications/Xcode.app/Contents/Developer/Toolchains/XcodeDefault.xctoolchain/usr/bin -Wno-unused-command-line-argument -mllvm -verify-machineinstrs -O0 -g -arch arm64 -isysroot /Applications/Xcode.app/Contents/Developer/Platforms/iPhoneOS.platform/Developer/SDKs/iPhoneOS12.1.sdk -Wl,-search_paths_first -Wl,-headerpad_max_install_names -B /Applications/Xcode.app/Contents/Developer/Toolchains/XcodeDefault.xctoolchain/usr/bin SingleSource/Regression/C++/EH/CMakeFiles/Regression-C++-ctor_dtor_count.dir/ctor_dtor_count.cpp.o -o SingleSource/Regression/C++/EH/Regression-C++-ctor_dtor_count -lstdc++ && cd /Users/buildslave/jenkins/workspace/test-suite-verify-machineinstrs-aarch64-O0-g/test-suite-build/SingleSource/Regression/C++/EH && /usr/local/Cellar/cmake/3.13.1/bin/cmake -E create_symlink /Users/buildslave/jenkins/workspace/test-suite-verify-machineinstrs-aarch64-O0-g/test-suite/SingleSource/Regression/C++/EH/ctor_dtor_count.reference_output /Users/buildslave/jenkins/workspace/test-suite-verify-machineinstrs-aarch64-O0-g/test-suite-build/SingleSource/Regression/C++/EH/ctor_dtor_count.reference_output [8566/8583] /Users/buildslave/jenkins/workspace/test-suite-verify-machineinstrs-aarch64-O0-g/test-suite-build/tools/timeit --summary SingleSource/Regression/C++/EH/CMakeFiles/Regression-C++-ctor_dtor_count-2.dir/ctor_dtor_count-2.cpp.o.time /Users/buildslave/jenkins/workspace/test-suite-verify-machineinstrs-aarch64-O0-g/compiler/bin/clang++ -DNDEBUG -B /Applications/Xcode.app/Contents/Developer/Toolchains/XcodeDefault.xctoolchain/usr/bin -Wno-unused-command-line-argument -mllvm -verify-machineinstrs -O0 -g -arch arm64 -isysroot /Applications/Xcode.app/Contents/Developer/Platforms/iPhoneOS.platform/Developer/SDKs/iPhoneOS12.1.sdk -w -Werror=date-time -MD -MT SingleSource/Regression/C++/EH/CMakeFiles/Regression-C++-ctor_dtor_count-2.dir/ctor_dtor_count-2.cpp.o -MF SingleSource/Regression/C++/EH/CMakeFiles/Regression-C++-ctor_dtor_count-2.dir/ctor_dtor_count-2.cpp.o.d -o SingleSource/Regression/C++/EH/CMakeFiles/Regression-C++-ctor_dtor_count-2.dir/ctor_dtor_count-2.cpp.o -c /Users/buildslave/jenkins/workspace/test-suite-verify-machineinstrs-aarch64-O0-g/test-suite/SingleSource/Regression/C++/EH/ctor_dtor_count-2.cpp [8567/8583] /Users/buildslave/jenkins/workspace/test-suite-verify-machineinstrs-aarch64-O0-g/test-suite-build/tools/timeit --summary SingleSource/Regression/C++/EH/CMakeFiles/Regression-C++-recursive-throw.dir/recursive-throw.cpp.o.time /Users/buildslave/jenkins/workspace/test-suite-verify-machineinstrs-aarch64-O0-g/compiler/bin/clang++ -DNDEBUG -B /Applications/Xcode.app/Contents/Developer/Toolchains/XcodeDefault.xctoolchain/usr/bin -Wno-unused-command-line-argument -mllvm -verify-machineinstrs -O0 -g -arch arm64 -isysroot /Applications/Xcode.app/Contents/Developer/Platforms/iPhoneOS.platform/Developer/SDKs/iPhoneOS12.1.sdk -w -Werror=date-time -MD -MT SingleSource/Regression/C++/EH/CMakeFiles/Regression-C++-recursive-throw.dir/recursive-throw.cpp.o -MF SingleSource/Regression/C++/EH/CMakeFiles/Regression-C++-recursive-throw.dir/recursive-throw.cpp.o.d -o SingleSource/Regression/C++/EH/CMakeFiles/Regression-C++-recursive-throw.dir/recursive-throw.cpp.o -c /Users/buildslave/jenkins/workspace/test-suite-verify-machineinstrs-aarch64-O0-g/test-suite/SingleSource/Regression/C++/EH/recursive-throw.cpp [8568/8583] : && /Users/buildslave/jenkins/workspace/test-suite-verify-machineinstrs-aarch64-O0-g/test-suite-build/tools/timeit --summary SingleSource/Regression/C++/EH/Regression-C++-ctor_dtor_count-2.link.time /Users/buildslave/jenkins/workspace/test-suite-verify-machineinstrs-aarch64-O0-g/compiler/bin/clang++ -B /Applications/Xcode.app/Contents/Developer/Toolchains/XcodeDefault.xctoolchain/usr/bin -Wno-unused-command-line-argument -mllvm -verify-machineinstrs -O0 -g -arch arm64 -isysroot /Applications/Xcode.app/Contents/Developer/Platforms/iPhoneOS.platform/Developer/SDKs/iPhoneOS12.1.sdk -Wl,-search_paths_first -Wl,-headerpad_max_install_names -B /Applications/Xcode.app/Contents/Developer/Toolchains/XcodeDefault.xctoolchain/usr/bin SingleSource/Regression/C++/EH/CMakeFiles/Regression-C++-ctor_dtor_count-2.dir/ctor_dtor_count-2.cpp.o -o SingleSource/Regression/C++/EH/Regression-C++-ctor_dtor_count-2 -lstdc++ && cd /Users/buildslave/jenkins/workspace/test-suite-verify-machineinstrs-aarch64-O0-g/test-suite-build/SingleSource/Regression/C++/EH && /usr/local/Cellar/cmake/3.13.1/bin/cmake -E create_symlink /Users/buildslave/jenkins/workspace/test-suite-verify-machineinstrs-aarch64-O0-g/test-suite/SingleSource/Regression/C++/EH/ctor_dtor_count-2.reference_output /Users/buildslave/jenkins/workspace/test-suite-verify-machineinstrs-aarch64-O0-g/test-suite-build/SingleSource/Regression/C++/EH/ctor_dtor_count-2.reference_output [8569/8583] /Users/buildslave/jenkins/workspace/test-suite-verify-machineinstrs-aarch64-O0-g/test-suite-build/tools/timeit --summary SingleSource/Regression/C++/EH/CMakeFiles/Regression-C++-ConditionalExpr.dir/ConditionalExpr.cpp.o.time /Users/buildslave/jenkins/workspace/test-suite-verify-machineinstrs-aarch64-O0-g/compiler/bin/clang++ -DNDEBUG -B /Applications/Xcode.app/Contents/Developer/Toolchains/XcodeDefault.xctoolchain/usr/bin -Wno-unused-command-line-argument -mllvm -verify-machineinstrs -O0 -g -arch arm64 -isysroot /Applications/Xcode.app/Contents/Developer/Platforms/iPhoneOS.platform/Developer/SDKs/iPhoneOS12.1.sdk -w -Werror=date-time -MD -MT SingleSource/Regression/C++/EH/CMakeFiles/Regression-C++-ConditionalExpr.dir/ConditionalExpr.cpp.o -MF SingleSource/Regression/C++/EH/CMakeFiles/Regression-C++-ConditionalExpr.dir/ConditionalExpr.cpp.o.d -o SingleSource/Regression/C++/EH/CMakeFiles/Regression-C++-ConditionalExpr.dir/ConditionalExpr.cpp.o -c /Users/buildslave/jenkins/workspace/test-suite-verify-machineinstrs-aarch64-O0-g/test-suite/SingleSource/Regression/C++/EH/ConditionalExpr.cpp [8570/8583] : && /Users/buildslave/jenkins/workspace/test-suite-verify-machineinstrs-aarch64-O0-g/test-suite-build/tools/timeit --summary SingleSource/Regression/C++/EH/Regression-C++-recursive-throw.link.time /Users/buildslave/jenkins/workspace/test-suite-verify-machineinstrs-aarch64-O0-g/compiler/bin/clang++ -B /Applications/Xcode.app/Contents/Developer/Toolchains/XcodeDefault.xctoolchain/usr/bin -Wno-unused-command-line-argument -mllvm -verify-machineinstrs -O0 -g -arch arm64 -isysroot /Applications/Xcode.app/Contents/Developer/Platforms/iPhoneOS.platform/Developer/SDKs/iPhoneOS12.1.sdk -Wl,-search_paths_first -Wl,-headerpad_max_install_names -B /Applications/Xcode.app/Contents/Developer/Toolchains/XcodeDefault.xctoolchain/usr/bin SingleSource/Regression/C++/EH/CMakeFiles/Regression-C++-recursive-throw.dir/recursive-throw.cpp.o -o SingleSource/Regression/C++/EH/Regression-C++-recursive-throw -lstdc++ && cd /Users/buildslave/jenkins/workspace/test-suite-verify-machineinstrs-aarch64-O0-g/test-suite-build/SingleSource/Regression/C++/EH && /usr/local/Cellar/cmake/3.13.1/bin/cmake -E create_symlink /Users/buildslave/jenkins/workspace/test-suite-verify-machineinstrs-aarch64-O0-g/test-suite/SingleSource/Regression/C++/EH/recursive-throw.reference_output /Users/buildslave/jenkins/workspace/test-suite-verify-machineinstrs-aarch64-O0-g/test-suite-build/SingleSource/Regression/C++/EH/recursive-throw.reference_output [8571/8583] : && /Users/buildslave/jenkins/workspace/test-suite-verify-machineinstrs-aarch64-O0-g/test-suite-build/tools/timeit --summary SingleSource/Regression/C++/EH/Regression-C++-ConditionalExpr.link.time /Users/buildslave/jenkins/workspace/test-suite-verify-machineinstrs-aarch64-O0-g/compiler/bin/clang++ -B /Applications/Xcode.app/Contents/Developer/Toolchains/XcodeDefault.xctoolchain/usr/bin -Wno-unused-command-line-argument -mllvm -verify-machineinstrs -O0 -g -arch arm64 -isysroot /Applications/Xcode.app/Contents/Developer/Platforms/iPhoneOS.platform/Developer/SDKs/iPhoneOS12.1.sdk -Wl,-search_paths_first -Wl,-headerpad_max_install_names -B /Applications/Xcode.app/Contents/Developer/Toolchains/XcodeDefault.xctoolchain/usr/bin SingleSource/Regression/C++/EH/CMakeFiles/Regression-C++-ConditionalExpr.dir/ConditionalExpr.cpp.o -o SingleSource/Regression/C++/EH/Regression-C++-ConditionalExpr -lstdc++ && cd /Users/buildslave/jenkins/workspace/test-suite-verify-machineinstrs-aarch64-O0-g/test-suite-build/SingleSource/Regression/C++/EH && /usr/local/Cellar/cmake/3.13.1/bin/cmake -E create_symlink /Users/buildslave/jenkins/workspace/test-suite-verify-machineinstrs-aarch64-O0-g/test-suite/SingleSource/Regression/C++/EH/ConditionalExpr.reference_output /Users/buildslave/jenkins/workspace/test-suite-verify-machineinstrs-aarch64-O0-g/test-suite-build/SingleSource/Regression/C++/EH/ConditionalExpr.reference_output [8572/8583] /Users/buildslave/jenkins/workspace/test-suite-verify-machineinstrs-aarch64-O0-g/test-suite-build/tools/timeit --summary SingleSource/Regression/C++/EH/CMakeFiles/Regression-C++-simple_throw.dir/simple_throw.cpp.o.time /Users/buildslave/jenkins/workspace/test-suite-verify-machineinstrs-aarch64-O0-g/compiler/bin/clang++ -DNDEBUG -B /Applications/Xcode.app/Contents/Developer/Toolchains/XcodeDefault.xctoolchain/usr/bin -Wno-unused-command-line-argument -mllvm -verify-machineinstrs -O0 -g -arch arm64 -isysroot /Applications/Xcode.app/Contents/Developer/Platforms/iPhoneOS.platform/Developer/SDKs/iPhoneOS12.1.sdk -w -Werror=date-time -MD -MT SingleSource/Regression/C++/EH/CMakeFiles/Regression-C++-simple_throw.dir/simple_throw.cpp.o -MF SingleSource/Regression/C++/EH/CMakeFiles/Regression-C++-simple_throw.dir/simple_throw.cpp.o.d -o SingleSource/Regression/C++/EH/CMakeFiles/Regression-C++-simple_throw.dir/simple_throw.cpp.o -c /Users/buildslave/jenkins/workspace/test-suite-verify-machineinstrs-aarch64-O0-g/test-suite/SingleSource/Regression/C++/EH/simple_throw.cpp [8573/8583] /Users/buildslave/jenkins/workspace/test-suite-verify-machineinstrs-aarch64-O0-g/test-suite-build/tools/timeit --summary SingleSource/Regression/C++/EH/CMakeFiles/Regression-C++-exception_spec_test.dir/exception_spec_test.cpp.o.time /Users/buildslave/jenkins/workspace/test-suite-verify-machineinstrs-aarch64-O0-g/compiler/bin/clang++ -DNDEBUG -B /Applications/Xcode.app/Contents/Developer/Toolchains/XcodeDefault.xctoolchain/usr/bin -Wno-unused-command-line-argument -mllvm -verify-machineinstrs -O0 -g -arch arm64 -isysroot /Applications/Xcode.app/Contents/Developer/Platforms/iPhoneOS.platform/Developer/SDKs/iPhoneOS12.1.sdk -w -Werror=date-time -MD -MT SingleSource/Regression/C++/EH/CMakeFiles/Regression-C++-exception_spec_test.dir/exception_spec_test.cpp.o -MF SingleSource/Regression/C++/EH/CMakeFiles/Regression-C++-exception_spec_test.dir/exception_spec_test.cpp.o.d -o SingleSource/Regression/C++/EH/CMakeFiles/Regression-C++-exception_spec_test.dir/exception_spec_test.cpp.o -c /Users/buildslave/jenkins/workspace/test-suite-verify-machineinstrs-aarch64-O0-g/test-suite/SingleSource/Regression/C++/EH/exception_spec_test.cpp [8574/8583] : && /Users/buildslave/jenkins/workspace/test-suite-verify-machineinstrs-aarch64-O0-g/test-suite-build/tools/timeit --summary SingleSource/Regression/C++/EH/Regression-C++-simple_throw.link.time /Users/buildslave/jenkins/workspace/test-suite-verify-machineinstrs-aarch64-O0-g/compiler/bin/clang++ -B /Applications/Xcode.app/Contents/Developer/Toolchains/XcodeDefault.xctoolchain/usr/bin -Wno-unused-command-line-argument -mllvm -verify-machineinstrs -O0 -g -arch arm64 -isysroot /Applications/Xcode.app/Contents/Developer/Platforms/iPhoneOS.platform/Developer/SDKs/iPhoneOS12.1.sdk -Wl,-search_paths_first -Wl,-headerpad_max_install_names -B /Applications/Xcode.app/Contents/Developer/Toolchains/XcodeDefault.xctoolchain/usr/bin SingleSource/Regression/C++/EH/CMakeFiles/Regression-C++-simple_throw.dir/simple_throw.cpp.o -o SingleSource/Regression/C++/EH/Regression-C++-simple_throw -lstdc++ && cd /Users/buildslave/jenkins/workspace/test-suite-verify-machineinstrs-aarch64-O0-g/test-suite-build/SingleSource/Regression/C++/EH && /usr/local/Cellar/cmake/3.13.1/bin/cmake -E create_symlink /Users/buildslave/jenkins/workspace/test-suite-verify-machineinstrs-aarch64-O0-g/test-suite/SingleSource/Regression/C++/EH/simple_throw.reference_output /Users/buildslave/jenkins/workspace/test-suite-verify-machineinstrs-aarch64-O0-g/test-suite-build/SingleSource/Regression/C++/EH/simple_throw.reference_output [8575/8583] : && /Users/buildslave/jenkins/workspace/test-suite-verify-machineinstrs-aarch64-O0-g/test-suite-build/tools/timeit --summary SingleSource/Regression/C++/EH/Regression-C++-exception_spec_test.link.time /Users/buildslave/jenkins/workspace/test-suite-verify-machineinstrs-aarch64-O0-g/compiler/bin/clang++ -B /Applications/Xcode.app/Contents/Developer/Toolchains/XcodeDefault.xctoolchain/usr/bin -Wno-unused-command-line-argument -mllvm -verify-machineinstrs -O0 -g -arch arm64 -isysroot /Applications/Xcode.app/Contents/Developer/Platforms/iPhoneOS.platform/Developer/SDKs/iPhoneOS12.1.sdk -Wl,-search_paths_first -Wl,-headerpad_max_install_names -B /Applications/Xcode.app/Contents/Developer/Toolchains/XcodeDefault.xctoolchain/usr/bin SingleSource/Regression/C++/EH/CMakeFiles/Regression-C++-exception_spec_test.dir/exception_spec_test.cpp.o -o SingleSource/Regression/C++/EH/Regression-C++-exception_spec_test -lstdc++ && cd /Users/buildslave/jenkins/workspace/test-suite-verify-machineinstrs-aarch64-O0-g/test-suite-build/SingleSource/Regression/C++/EH && /usr/local/Cellar/cmake/3.13.1/bin/cmake -E create_symlink /Users/buildslave/jenkins/workspace/test-suite-verify-machineinstrs-aarch64-O0-g/test-suite/SingleSource/Regression/C++/EH/exception_spec_test.reference_output /Users/buildslave/jenkins/workspace/test-suite-verify-machineinstrs-aarch64-O0-g/test-suite-build/SingleSource/Regression/C++/EH/exception_spec_test.reference_output [8576/8583] /Users/buildslave/jenkins/workspace/test-suite-verify-machineinstrs-aarch64-O0-g/test-suite-build/tools/timeit --summary SingleSource/Regression/C++/EH/CMakeFiles/Regression-C++-function_try_block.dir/function_try_block.cpp.o.time /Users/buildslave/jenkins/workspace/test-suite-verify-machineinstrs-aarch64-O0-g/compiler/bin/clang++ -DNDEBUG -B /Applications/Xcode.app/Contents/Developer/Toolchains/XcodeDefault.xctoolchain/usr/bin -Wno-unused-command-line-argument -mllvm -verify-machineinstrs -O0 -g -arch arm64 -isysroot /Applications/Xcode.app/Contents/Developer/Platforms/iPhoneOS.platform/Developer/SDKs/iPhoneOS12.1.sdk -w -Werror=date-time -MD -MT SingleSource/Regression/C++/EH/CMakeFiles/Regression-C++-function_try_block.dir/function_try_block.cpp.o -MF SingleSource/Regression/C++/EH/CMakeFiles/Regression-C++-function_try_block.dir/function_try_block.cpp.o.d -o SingleSource/Regression/C++/EH/CMakeFiles/Regression-C++-function_try_block.dir/function_try_block.cpp.o -c /Users/buildslave/jenkins/workspace/test-suite-verify-machineinstrs-aarch64-O0-g/test-suite/SingleSource/Regression/C++/EH/function_try_block.cpp [8577/8583] : && /Users/buildslave/jenkins/workspace/test-suite-verify-machineinstrs-aarch64-O0-g/test-suite-build/tools/timeit --summary SingleSource/Regression/C++/EH/Regression-C++-function_try_block.link.time /Users/buildslave/jenkins/workspace/test-suite-verify-machineinstrs-aarch64-O0-g/compiler/bin/clang++ -B /Applications/Xcode.app/Contents/Developer/Toolchains/XcodeDefault.xctoolchain/usr/bin -Wno-unused-command-line-argument -mllvm -verify-machineinstrs -O0 -g -arch arm64 -isysroot /Applications/Xcode.app/Contents/Developer/Platforms/iPhoneOS.platform/Developer/SDKs/iPhoneOS12.1.sdk -Wl,-search_paths_first -Wl,-headerpad_max_install_names -B /Applications/Xcode.app/Contents/Developer/Toolchains/XcodeDefault.xctoolchain/usr/bin SingleSource/Regression/C++/EH/CMakeFiles/Regression-C++-function_try_block.dir/function_try_block.cpp.o -o SingleSource/Regression/C++/EH/Regression-C++-function_try_block -lstdc++ && cd /Users/buildslave/jenkins/workspace/test-suite-verify-machineinstrs-aarch64-O0-g/test-suite-build/SingleSource/Regression/C++/EH && /usr/local/Cellar/cmake/3.13.1/bin/cmake -E create_symlink /Users/buildslave/jenkins/workspace/test-suite-verify-machineinstrs-aarch64-O0-g/test-suite/SingleSource/Regression/C++/EH/function_try_block.reference_output /Users/buildslave/jenkins/workspace/test-suite-verify-machineinstrs-aarch64-O0-g/test-suite-build/SingleSource/Regression/C++/EH/function_try_block.reference_output [8578/8583] /Users/buildslave/jenkins/workspace/test-suite-verify-machineinstrs-aarch64-O0-g/test-suite-build/tools/timeit --summary SingleSource/Regression/C++/EH/CMakeFiles/Regression-C++-class_hierarchy.dir/class_hierarchy.cpp.o.time /Users/buildslave/jenkins/workspace/test-suite-verify-machineinstrs-aarch64-O0-g/compiler/bin/clang++ -DNDEBUG -B /Applications/Xcode.app/Contents/Developer/Toolchains/XcodeDefault.xctoolchain/usr/bin -Wno-unused-command-line-argument -mllvm -verify-machineinstrs -O0 -g -arch arm64 -isysroot /Applications/Xcode.app/Contents/Developer/Platforms/iPhoneOS.platform/Developer/SDKs/iPhoneOS12.1.sdk -w -Werror=date-time -MD -MT SingleSource/Regression/C++/EH/CMakeFiles/Regression-C++-class_hierarchy.dir/class_hierarchy.cpp.o -MF SingleSource/Regression/C++/EH/CMakeFiles/Regression-C++-class_hierarchy.dir/class_hierarchy.cpp.o.d -o SingleSource/Regression/C++/EH/CMakeFiles/Regression-C++-class_hierarchy.dir/class_hierarchy.cpp.o -c /Users/buildslave/jenkins/workspace/test-suite-verify-machineinstrs-aarch64-O0-g/test-suite/SingleSource/Regression/C++/EH/class_hierarchy.cpp [8579/8583] : && /Users/buildslave/jenkins/workspace/test-suite-verify-machineinstrs-aarch64-O0-g/test-suite-build/tools/timeit --summary SingleSource/Regression/C++/EH/Regression-C++-class_hierarchy.link.time /Users/buildslave/jenkins/workspace/test-suite-verify-machineinstrs-aarch64-O0-g/compiler/bin/clang++ -B /Applications/Xcode.app/Contents/Developer/Toolchains/XcodeDefault.xctoolchain/usr/bin -Wno-unused-command-line-argument -mllvm -verify-machineinstrs -O0 -g -arch arm64 -isysroot /Applications/Xcode.app/Contents/Developer/Platforms/iPhoneOS.platform/Developer/SDKs/iPhoneOS12.1.sdk -Wl,-search_paths_first -Wl,-headerpad_max_install_names -B /Applications/Xcode.app/Contents/Developer/Toolchains/XcodeDefault.xctoolchain/usr/bin SingleSource/Regression/C++/EH/CMakeFiles/Regression-C++-class_hierarchy.dir/class_hierarchy.cpp.o -o SingleSource/Regression/C++/EH/Regression-C++-class_hierarchy -lstdc++ && cd /Users/buildslave/jenkins/workspace/test-suite-verify-machineinstrs-aarch64-O0-g/test-suite-build/SingleSource/Regression/C++/EH && /usr/local/Cellar/cmake/3.13.1/bin/cmake -E create_symlink /Users/buildslave/jenkins/workspace/test-suite-verify-machineinstrs-aarch64-O0-g/test-suite/SingleSource/Regression/C++/EH/class_hierarchy.reference_output /Users/buildslave/jenkins/workspace/test-suite-verify-machineinstrs-aarch64-O0-g/test-suite-build/SingleSource/Regression/C++/EH/class_hierarchy.reference_output [8580/8583] /Users/buildslave/jenkins/workspace/test-suite-verify-machineinstrs-aarch64-O0-g/test-suite-build/tools/timeit --summary SingleSource/Regression/C++/CMakeFiles/Regression-C++-ofstream_ctor.dir/ofstream_ctor.cpp.o.time /Users/buildslave/jenkins/workspace/test-suite-verify-machineinstrs-aarch64-O0-g/compiler/bin/clang++ -DNDEBUG -B /Applications/Xcode.app/Contents/Developer/Toolchains/XcodeDefault.xctoolchain/usr/bin -Wno-unused-command-line-argument -mllvm -verify-machineinstrs -O0 -g -arch arm64 -isysroot /Applications/Xcode.app/Contents/Developer/Platforms/iPhoneOS.platform/Developer/SDKs/iPhoneOS12.1.sdk -w -Werror=date-time -MD -MT SingleSource/Regression/C++/CMakeFiles/Regression-C++-ofstream_ctor.dir/ofstream_ctor.cpp.o -MF SingleSource/Regression/C++/CMakeFiles/Regression-C++-ofstream_ctor.dir/ofstream_ctor.cpp.o.d -o SingleSource/Regression/C++/CMakeFiles/Regression-C++-ofstream_ctor.dir/ofstream_ctor.cpp.o -c /Users/buildslave/jenkins/workspace/test-suite-verify-machineinstrs-aarch64-O0-g/test-suite/SingleSource/Regression/C++/ofstream_ctor.cpp [8581/8583] : && /Users/buildslave/jenkins/workspace/test-suite-verify-machineinstrs-aarch64-O0-g/test-suite-build/tools/timeit --summary SingleSource/Regression/C++/Regression-C++-ofstream_ctor.link.time /Users/buildslave/jenkins/workspace/test-suite-verify-machineinstrs-aarch64-O0-g/compiler/bin/clang++ -B /Applications/Xcode.app/Contents/Developer/Toolchains/XcodeDefault.xctoolchain/usr/bin -Wno-unused-command-line-argument -mllvm -verify-machineinstrs -O0 -g -arch arm64 -isysroot /Applications/Xcode.app/Contents/Developer/Platforms/iPhoneOS.platform/Developer/SDKs/iPhoneOS12.1.sdk -Wl,-search_paths_first -Wl,-headerpad_max_install_names -B /Applications/Xcode.app/Contents/Developer/Toolchains/XcodeDefault.xctoolchain/usr/bin SingleSource/Regression/C++/CMakeFiles/Regression-C++-ofstream_ctor.dir/ofstream_ctor.cpp.o -o SingleSource/Regression/C++/Regression-C++-ofstream_ctor -lstdc++ && cd /Users/buildslave/jenkins/workspace/test-suite-verify-machineinstrs-aarch64-O0-g/test-suite-build/SingleSource/Regression/C++ && /usr/local/Cellar/cmake/3.13.1/bin/cmake -E create_symlink /Users/buildslave/jenkins/workspace/test-suite-verify-machineinstrs-aarch64-O0-g/test-suite/SingleSource/Regression/C++/ofstream_ctor.reference_output /Users/buildslave/jenkins/workspace/test-suite-verify-machineinstrs-aarch64-O0-g/test-suite-build/SingleSource/Regression/C++/ofstream_ctor.reference_output [8582/8583] /Users/buildslave/jenkins/workspace/test-suite-verify-machineinstrs-aarch64-O0-g/test-suite-build/tools/timeit --summary SingleSource/UnitTests/Vector/AArch64/CMakeFiles/aarch64_neon_intrinsics.dir/aarch64_neon_intrinsics.c.o.time /Users/buildslave/jenkins/workspace/test-suite-verify-machineinstrs-aarch64-O0-g/compiler/bin/clang -DNDEBUG -B /Applications/Xcode.app/Contents/Developer/Toolchains/XcodeDefault.xctoolchain/usr/bin -Wno-unused-command-line-argument -mllvm -verify-machineinstrs -O0 -g -arch arm64 -isysroot /Applications/Xcode.app/Contents/Developer/Platforms/iPhoneOS.platform/Developer/SDKs/iPhoneOS12.1.sdk -w -Werror=date-time -std=c99 -MD -MT SingleSource/UnitTests/Vector/AArch64/CMakeFiles/aarch64_neon_intrinsics.dir/aarch64_neon_intrinsics.c.o -MF SingleSource/UnitTests/Vector/AArch64/CMakeFiles/aarch64_neon_intrinsics.dir/aarch64_neon_intrinsics.c.o.d -o SingleSource/UnitTests/Vector/AArch64/CMakeFiles/aarch64_neon_intrinsics.dir/aarch64_neon_intrinsics.c.o -c /Users/buildslave/jenkins/workspace/test-suite-verify-machineinstrs-aarch64-O0-g/test-suite/SingleSource/UnitTests/Vector/AArch64/aarch64_neon_intrinsics.c FAILED: SingleSource/UnitTests/Vector/AArch64/CMakeFiles/aarch64_neon_intrinsics.dir/aarch64_neon_intrinsics.c.o /Users/buildslave/jenkins/workspace/test-suite-verify-machineinstrs-aarch64-O0-g/test-suite-build/tools/timeit --summary SingleSource/UnitTests/Vector/AArch64/CMakeFiles/aarch64_neon_intrinsics.dir/aarch64_neon_intrinsics.c.o.time /Users/buildslave/jenkins/workspace/test-suite-verify-machineinstrs-aarch64-O0-g/compiler/bin/clang -DNDEBUG -B /Applications/Xcode.app/Contents/Developer/Toolchains/XcodeDefault.xctoolchain/usr/bin -Wno-unused-command-line-argument -mllvm -verify-machineinstrs -O0 -g -arch arm64 -isysroot /Applications/Xcode.app/Contents/Developer/Platforms/iPhoneOS.platform/Developer/SDKs/iPhoneOS12.1.sdk -w -Werror=date-time -std=c99 -MD -MT SingleSource/UnitTests/Vector/AArch64/CMakeFiles/aarch64_neon_intrinsics.dir/aarch64_neon_intrinsics.c.o -MF SingleSource/UnitTests/Vector/AArch64/CMakeFiles/aarch64_neon_intrinsics.dir/aarch64_neon_intrinsics.c.o.d -o SingleSource/UnitTests/Vector/AArch64/CMakeFiles/aarch64_neon_intrinsics.dir/aarch64_neon_intrinsics.c.o -c /Users/buildslave/jenkins/workspace/test-suite-verify-machineinstrs-aarch64-O0-g/test-suite/SingleSource/UnitTests/Vector/AArch64/aarch64_neon_intrinsics.c Assertion failed: (IsVector && "cannot get number of elements on scalar/aggregate"), function getNumElements, file /Users/buildslave/jenkins/workspace/clang-stage1-RA/llvm-project/llvm/include/llvm/Support/LowLevelTypeImpl.h, line 100. Stack dump: 0. Program arguments: /Users/buildslave/jenkins/workspace/test-suite-verify-machineinstrs-aarch64-O0-g/compiler/bin/clang-10 -cc1 -triple arm64-apple-ios12.1.0 -Wdeprecated-objc-isa-usage -Werror=deprecated-objc-isa-usage -Werror=implicit-function-declaration -emit-obj -mrelax-all -disable-free -main-file-name aarch64_neon_intrinsics.c -mrelocation-model pic -pic-level 2 -mthread-model posix -mframe-pointer=all -fno-rounding-math -masm-verbose -munwind-tables -target-sdk-version=12.1 -target-cpu cyclone -target-feature +fp-armv8 -target-feature +neon -target-feature +crypto -target-feature +zcm -target-feature +zcz -target-feature +sha2 -target-feature +aes -target-abi darwinpcs -fallow-half-arguments-and-returns -dwarf-column-info -debug-info-kind=standalone -dwarf-version=4 -debugger-tuning=lldb -target-linker-version 409.12 -resource-dir /Users/buildslave/jenkins/workspace/test-suite-verify-machineinstrs-aarch64-O0-g/compiler/lib/clang/10.0.0 -dependency-file SingleSource/UnitTests/Vector/AArch64/CMakeFiles/aarch64_neon_intrinsics.dir/aarch64_neon_intrinsics.c.o.d -MT SingleSource/UnitTests/Vector/AArch64/CMakeFiles/aarch64_neon_intrinsics.dir/aarch64_neon_intrinsics.c.o -sys-header-deps -isysroot /Applications/Xcode.app/Contents/Developer/Platforms/iPhoneOS.platform/Developer/SDKs/iPhoneOS12.1.sdk -D NDEBUG -internal-isystem /Applications/Xcode.app/Contents/Developer/Platforms/iPhoneOS.platform/Developer/SDKs/iPhoneOS12.1.sdk/usr/local/include -internal-isystem /Users/buildslave/jenkins/workspace/test-suite-verify-machineinstrs-aarch64-O0-g/compiler/lib/clang/10.0.0/include -internal-externc-isystem /Applications/Xcode.app/Contents/Developer/Platforms/iPhoneOS.platform/Developer/SDKs/iPhoneOS12.1.sdk/usr/include -O0 -Wno-unused-command-line-argument -Werror=date-time -w -std=c99 -fdebug-compilation-dir /Users/buildslave/jenkins/workspace/test-suite-verify-machineinstrs-aarch64-O0-g/test-suite-build -ferror-limit 19 -fmessage-length 0 -stack-protector 1 -fblocks -fencode-extended-block-signature -fregister-global-dtors-with-atexit -fgnuc-version=4.2.1 -fobjc-runtime=ios-12.1.0 -fmax-type-align=16 -fdiagnostics-show-option -mllvm -verify-machineinstrs -o SingleSource/UnitTests/Vector/AArch64/CMakeFiles/aarch64_neon_intrinsics.dir/aarch64_neon_intrinsics.c.o -x c /Users/buildslave/jenkins/workspace/test-suite-verify-machineinstrs-aarch64-O0-g/test-suite/SingleSource/UnitTests/Vector/AArch64/aarch64_neon_intrinsics.c 1. <eof> parser at end of file 2. Code generation 3. Running pass 'Function Pass Manager' on module '/Users/buildslave/jenkins/workspace/test-suite-verify-machineinstrs-aarch64-O0-g/test-suite/SingleSource/UnitTests/Vector/AArch64/aarch64_neon_intrinsics.c'. 4. Running pass 'AArch64PreLegalizerCombiner' on function '@dotests_1255' 0 clang-10 0x0000000102326c88 llvm::sys::PrintStackTrace(llvm::raw_ostream&) + 40 1 clang-10 0x0000000102325e45 llvm::sys::RunSignalHandlers() + 85 2 clang-10 0x0000000102327298 SignalHandler(int) + 264 3 libsystem_platform.dylib 0x00007fff6009bb3d _sigtramp + 29 4 libsystem_platform.dylib 0xbbe0000000000036 _sigtramp + 13537679745071072534 5 libsystem_c.dylib 0x00007fff5ff5a1c9 abort + 127 6 libsystem_c.dylib 0x00007fff5ff22868 basename_r + 0 7 clang-10 0x0000000102c7b3c8 llvm::CombinerHelper::matchCombineShuffleVector(llvm::MachineInstr&, llvm::SmallVectorImpl<llvm::Register>&) + 232 8 clang-10 0x0000000102c7b2a2 llvm::CombinerHelper::tryCombineShuffleVector(llvm::MachineInstr&) + 50 9 clang-10 0x00000001006bbf8c (anonymous namespace)::AArch64PreLegalizerCombinerInfo::combine(llvm::GISelChangeObserver&, llvm::MachineInstr&, llvm::MachineIRBuilder&) const + 140 10 clang-10 0x0000000102c79a0c llvm::Combiner::combineMachineInstrs(llvm::MachineFunction&, llvm::GISelCSEInfo*) + 2988 11 clang-10 0x00000001006bbcdc (anonymous namespace)::AArch64PreLegalizerCombiner::runOnMachineFunction(llvm::MachineFunction&) + 1324 12 clang-10 0x00000001018d670a llvm::MachineFunctionPass::runOnFunction(llvm::Function&) + 330 13 clang-10 0x0000000101c19fca llvm::FPPassManager::runOnFunction(llvm::Function&) + 826 14 clang-10 0x0000000101c1a313 llvm::FPPassManager::runOnModule(llvm::Module&) + 67 15 clang-10 0x0000000101c1a7e6 llvm::legacy::PassManagerImpl::run(llvm::Module&) + 902 16 clang-10 0x000000010254a9df clang::EmitBackendOutput(clang::DiagnosticsEngine&, clang::HeaderSearchOptions const&, clang::CodeGenOptions const&, clang::TargetOptions const&, clang::LangOptions const&, llvm::DataLayout const&, llvm::Module*, clang::BackendAction, std::__1::unique_ptr<llvm::raw_pwrite_stream, std::__1::default_delete<llvm::raw_pwrite_stream> >) + 15039 17 clang-10 0x00000001027d2766 clang::BackendConsumer::HandleTranslationUnit(clang::ASTContext&) + 1094 18 clang-10 0x00000001038158b3 clang::ParseAST(clang::Sema&, bool, bool) + 643 19 clang-10 0x0000000102a80584 clang::FrontendAction::Execute() + 84 20 clang-10 0x0000000102a2baa5 clang::CompilerInstance::ExecuteAction(clang::FrontendAction&) + 1557 21 clang-10 0x0000000102af602f clang::ExecuteCompilerInvocation(clang::CompilerInstance*) + 1759 22 clang-10 0x00000001005a5ce8 cc1_main(llvm::ArrayRef<char const*>, char const*, void*) + 2392 23 clang-10 0x00000001005a3433 main + 10819 24 libdyld.dylib 0x00007fff5feb2085 start + 1 clang-10: error: unable to execute command: Abort trap: 6 clang-10: error: clang frontend command failed due to signal (use -v to see invocation) clang version 10.0.0 (https://github.com/llvm/llvm-project.git b9213dfec4d8ce42d90507c25545564f4a0bbfb8) Target: aarch64-apple-darwin18.0.0 Thread model: posix InstalledDir: /Users/buildslave/jenkins/workspace/test-suite-verify-machineinstrs-aarch64-O0-g/compiler/bin clang-10: note: diagnostic msg: PLEASE submit a bug report to https://bugs.llvm.org/ and include the crash backtrace, preprocessed source, and associated run script. clang-10: note: diagnostic msg: ********************

Hide Details

PLEASE ATTACH THE FOLLOWING FILES TO THE BUG REPORT: Preprocessed source(s) and associated run script(s) are located at: clang-10: note: diagnostic msg: /var/folders/09/r4vw4v8n5kb67jl66zvlbljw0000gn/T/aarch64_neon_intrinsics-94192b.c clang-10: note: diagnostic msg: /var/folders/09/r4vw4v8n5kb67jl66zvlbljw0000gn/T/aarch64_neon_intrinsics-94192b.sh clang-10: note: diagnostic msg: Crash backtrace is located in clang-10: note: diagnostic msg: /Users/buildslave/Library/Logs/DiagnosticReports/clang-10_<YYYY-MM-DD-HHMMSS>_<hostname>.crash clang-10: note: diagnostic msg: (choose the .crash file that corresponds to your crash) clang-10: note: diagnostic msg:

Hide Details

******************** ninja: build stopped: cannot make progress due to previous errors. *Build failed!* (return code 1) [Pipeline] } [Pipeline] // stage [Pipeline] stage [Pipeline] { (post) [Pipeline] sh + curl http://labmaster2:8080/green/job/test-suite-verify-machineinstrs-aarch64-O0-g/6262/consoleText -s + config/zorg/jenkins/inspect_log.py [Pipeline] readFile [Pipeline] readTrusted Obtained zorg/jenkins/job_description.template from git https://github.com/llvm-mirror/zorg.git [Pipeline] } [Pipeline] // stage [Pipeline] } [Pipeline] // node sh: line 1: 6535 Terminated: 15 sleep 3 [Pipeline] End of Pipeline [BFA] Scanning build for known causes... [BFA] Found failure cause(s): [BFA] Compile Error from category Compile [BFA] Assertion failure from category Assert [BFA] Ninja target failed from category Compile [BFA] Done. 6s Finished: FAILURE