Started 28 days ago
Took 1 hr 23 min

Failed Build clang-d331651-g4cc0c2998d6-t3725-b3725.tar.gz (Nov 12, 2019 8:42:11 AM)

Issues

Found 4 issues:
Ninja target: aarch64_neon_intrinsics.c.o
[7287/8583] /Users/buildslave/jenkins/workspace/test-suite-verify-machineinstrs-aarch64-O0-g/test-suite-build/tools/timeit --summary MultiSource/Benchmarks/MiBench/consumer-typeset/CMakeFiles/consumer-typeset.dir/z04.c.o.time /Users/buildslave/jenkins/workspace/test-suite-verify-machineinstrs-aarch64-O0-g/compiler/bin/clang -DNDEBUG  -B /Applications/Xcode.app/Contents/Developer/Toolchains/XcodeDefault.xctoolchain/usr/bin    -Wno-unused-command-line-argument -mllvm -verify-machineinstrs -O0 -g -arch arm64 -isysroot /Applications/Xcode.app/Contents/Developer/Platforms/iPhoneOS.platform/Developer/SDKs/iPhoneOS12.1.sdk   -w -Werror=date-time -DOS_UNIX=1 -DOS_DOS=0 -DOS_MAC=0 -DDB_FIX=0 -DUSE_STAT=1 -DSAFE_DFT=0 -DCOLLATE=1 -DLIB_DIR=\"lout.lib\" -DFONT_DIR=\"font\" -DMAPS_DIR=\"maps\" -DINCL_DIR=\"include\" -DDATA_DIR=\"data\" -DHYPH_DIR=\"hyph\" -DLOCALE_DIR=\"locale\" -DCHAR_IN=1 -DCHAR_OUT=0 -DLOCALE_ON=1 -DASSERT_ON=1 -DDEBUG_ON=0 -DPDF_COMPRESSION=0 -D_FORTIFY_SOURCE=0 -MD -MT MultiSource/Benchmarks/MiBench/consumer-typeset/CMakeFiles/consumer-typeset.dir/z04.c.o -MF MultiSource/Benchmarks/MiBench/consumer-typeset/CMakeFiles/consumer-typeset.dir/z04.c.o.d -o MultiSource/Benchmarks/MiBench/consumer-typeset/CMakeFiles/consumer-typeset.dir/z04.c.o   -c /Users/buildslave/jenkins/workspace/test-suite-verify-machineinstrs-aarch64-O0-g/test-suite/MultiSource/Benchmarks/MiBench/consumer-typeset/z04.c
[7288/8583] /Users/buildslave/jenkins/workspace/test-suite-verify-machineinstrs-aarch64-O0-g/test-suite-build/tools/timeit --summary MultiSource/Benchmarks/MiBench/consumer-typeset/CMakeFiles/consumer-typeset.dir/z03.c.o.time /Users/buildslave/jenkins/workspace/test-suite-verify-machineinstrs-aarch64-O0-g/compiler/bin/clang -DNDEBUG  -B /Applications/Xcode.app/Contents/Developer/Toolchains/XcodeDefault.xctoolchain/usr/bin    -Wno-unused-command-line-argument -mllvm -verify-machineinstrs -O0 -g -arch arm64 -isysroot /Applications/Xcode.app/Contents/Developer/Platforms/iPhoneOS.platform/Developer/SDKs/iPhoneOS12.1.sdk   -w -Werror=date-time -DOS_UNIX=1 -DOS_DOS=0 -DOS_MAC=0 -DDB_FIX=0 -DUSE_STAT=1 -DSAFE_DFT=0 -DCOLLATE=1 -DLIB_DIR=\"lout.lib\" -DFONT_DIR=\"font\" -DMAPS_DIR=\"maps\" -DINCL_DIR=\"include\" -DDATA_DIR=\"data\" -DHYPH_DIR=\"hyph\" -DLOCALE_DIR=\"locale\" -DCHAR_IN=1 -DCHAR_OUT=0 -DLOCALE_ON=1 -DASSERT_ON=1 -DDEBUG_ON=0 -DPDF_COMPRESSION=0 -D_FORTIFY_SOURCE=0 -MD -MT MultiSource/Benchmarks/MiBench/consumer-typeset/CMakeFiles/consumer-typeset.dir/z03.c.o -MF MultiSource/Benchmarks/MiBench/consumer-typeset/CMakeFiles/consumer-typeset.dir/z03.c.o.d -o MultiSource/Benchmarks/MiBench/consumer-typeset/CMakeFiles/consumer-typeset.dir/z03.c.o   -c /Users/buildslave/jenkins/workspace/test-suite-verify-machineinstrs-aarch64-O0-g/test-suite/MultiSource/Benchmarks/MiBench/consumer-typeset/z03.c
[7289/8583] /Users/buildslave/jenkins/workspace/test-suite-verify-machineinstrs-aarch64-O0-g/test-suite-build/tools/timeit --summary MultiSource/Benchmarks/MiBench/consumer-typeset/CMakeFiles/consumer-typeset.dir/z01.c.o.time /Users/buildslave/jenkins/workspace/test-suite-verify-machineinstrs-aarch64-O0-g/compiler/bin/clang -DNDEBUG  -B /Applications/Xcode.app/Contents/Developer/Toolchains/XcodeDefault.xctoolchain/usr/bin    -Wno-unused-command-line-argument -mllvm -verify-machineinstrs -O0 -g -arch arm64 -isysroot /Applications/Xcode.app/Contents/Developer/Platforms/iPhoneOS.platform/Developer/SDKs/iPhoneOS12.1.sdk   -w -Werror=date-time -DOS_UNIX=1 -DOS_DOS=0 -DOS_MAC=0 -DDB_FIX=0 -DUSE_STAT=1 -DSAFE_DFT=0 -DCOLLATE=1 -DLIB_DIR=\"lout.lib\" -DFONT_DIR=\"font\" -DMAPS_DIR=\"maps\" -DINCL_DIR=\"include\" -DDATA_DIR=\"data\" -DHYPH_DIR=\"hyph\" -DLOCALE_DIR=\"locale\" -DCHAR_IN=1 -DCHAR_OUT=0 -DLOCALE_ON=1 -DASSERT_ON=1 -DDEBUG_ON=0 -DPDF_COMPRESSION=0 -D_FORTIFY_SOURCE=0 -MD -MT MultiSource/Benchmarks/MiBench/consumer-typeset/CMakeFiles/consumer-typeset.dir/z01.c.o -MF MultiSource/Benchmarks/MiBench/consumer-typeset/CMakeFiles/consumer-typeset.dir/z01.c.o.d -o MultiSource/Benchmarks/MiBench/consumer-typeset/CMakeFiles/consumer-typeset.dir/z01.c.o   -c /Users/buildslave/jenkins/workspace/test-suite-verify-machineinstrs-aarch64-O0-g/test-suite/MultiSource/Benchmarks/MiBench/consumer-typeset/z01.c
[7290/8583] /Users/buildslave/jenkins/workspace/test-suite-verify-machineinstrs-aarch64-O0-g/test-suite-build/tools/timeit --summary MultiSource/Benchmarks/MiBench/consumer-typeset/CMakeFiles/consumer-typeset.dir/z02.c.o.time /Users/buildslave/jenkins/workspace/test-suite-verify-machineinstrs-aarch64-O0-g/compiler/bin/clang -DNDEBUG  -B /Applications/Xcode.app/Contents/Developer/Toolchains/XcodeDefault.xctoolchain/usr/bin    -Wno-unused-command-line-argument -mllvm -verify-machineinstrs -O0 -g -arch arm64 -isysroot /Applications/Xcode.app/Contents/Developer/Platforms/iPhoneOS.platform/Developer/SDKs/iPhoneOS12.1.sdk   -w -Werror=date-time -DOS_UNIX=1 -DOS_DOS=0 -DOS_MAC=0 -DDB_FIX=0 -DUSE_STAT=1 -DSAFE_DFT=0 -DCOLLATE=1 -DLIB_DIR=\"lout.lib\" -DFONT_DIR=\"font\" -DMAPS_DIR=\"maps\" -DINCL_DIR=\"include\" -DDATA_DIR=\"data\" -DHYPH_DIR=\"hyph\" -DLOCALE_DIR=\"locale\" -DCHAR_IN=1 -DCHAR_OUT=0 -DLOCALE_ON=1 -DASSERT_ON=1 -DDEBUG_ON=0 -DPDF_COMPRESSION=0 -D_FORTIFY_SOURCE=0 -MD -MT MultiSource/Benchmarks/MiBench/consumer-typeset/CMakeFiles/consumer-typeset.dir/z02.c.o -MF MultiSource/Benchmarks/MiBench/consumer-typeset/CMakeFiles/consumer-typeset.dir/z02.c.o.d -o MultiSource/Benchmarks/MiBench/consumer-typeset/CMakeFiles/consumer-typeset.dir/z02.c.o   -c /Users/buildslave/jenkins/workspace/test-suite-verify-machineinstrs-aarch64-O0-g/test-suite/MultiSource/Benchmarks/MiBench/consumer-typeset/z02.c
[7291/8583] /Users/buildslave/jenkins/workspace/test-suite-verify-machineinstrs-aarch64-O0-g/test-suite-build/tools/timeit --summary SingleSource/UnitTests/Vector/AArch64/CMakeFiles/aarch64_neon_intrinsics.dir/aarch64_neon_intrinsics.c.o.time /Users/buildslave/jenkins/workspace/test-suite-verify-machineinstrs-aarch64-O0-g/compiler/bin/clang -DNDEBUG  -B /Applications/Xcode.app/Contents/Developer/Toolchains/XcodeDefault.xctoolchain/usr/bin    -Wno-unused-command-line-argument -mllvm -verify-machineinstrs -O0 -g -arch arm64 -isysroot /Applications/Xcode.app/Contents/Developer/Platforms/iPhoneOS.platform/Developer/SDKs/iPhoneOS12.1.sdk   -w -Werror=date-time -std=c99 -MD -MT SingleSource/UnitTests/Vector/AArch64/CMakeFiles/aarch64_neon_intrinsics.dir/aarch64_neon_intrinsics.c.o -MF SingleSource/UnitTests/Vector/AArch64/CMakeFiles/aarch64_neon_intrinsics.dir/aarch64_neon_intrinsics.c.o.d -o SingleSource/UnitTests/Vector/AArch64/CMakeFiles/aarch64_neon_intrinsics.dir/aarch64_neon_intrinsics.c.o   -c /Users/buildslave/jenkins/workspace/test-suite-verify-machineinstrs-aarch64-O0-g/test-suite/SingleSource/UnitTests/Vector/AArch64/aarch64_neon_intrinsics.c
FAILED: SingleSource/UnitTests/Vector/AArch64/CMakeFiles/aarch64_neon_intrinsics.dir/aarch64_neon_intrinsics.c.o 
/Users/buildslave/jenkins/workspace/test-suite-verify-machineinstrs-aarch64-O0-g/test-suite-build/tools/timeit --summary SingleSource/UnitTests/Vector/AArch64/CMakeFiles/aarch64_neon_intrinsics.dir/aarch64_neon_intrinsics.c.o.time /Users/buildslave/jenkins/workspace/test-suite-verify-machineinstrs-aarch64-O0-g/compiler/bin/clang -DNDEBUG  -B /Applications/Xcode.app/Contents/Developer/Toolchains/XcodeDefault.xctoolchain/usr/bin    -Wno-unused-command-line-argument -mllvm -verify-machineinstrs -O0 -g -arch arm64 -isysroot /Applications/Xcode.app/Contents/Developer/Platforms/iPhoneOS.platform/Developer/SDKs/iPhoneOS12.1.sdk   -w -Werror=date-time -std=c99 -MD -MT SingleSource/UnitTests/Vector/AArch64/CMakeFiles/aarch64_neon_intrinsics.dir/aarch64_neon_intrinsics.c.o -MF SingleSource/UnitTests/Vector/AArch64/CMakeFiles/aarch64_neon_intrinsics.dir/aarch64_neon_intrinsics.c.o.d -o SingleSource/UnitTests/Vector/AArch64/CMakeFiles/aarch64_neon_intrinsics.dir/aarch64_neon_intrinsics.c.o   -c /Users/buildslave/jenkins/workspace/test-suite-verify-machineinstrs-aarch64-O0-g/test-suite/SingleSource/UnitTests/Vector/AArch64/aarch64_neon_intrinsics.c
Assertion failed: (IsVector && "cannot get number of elements on scalar/aggregate"), function getNumElements, file /Users/buildslave/jenkins/workspace/clang-stage1-RA/llvm-project/llvm/include/llvm/Support/LowLevelTypeImpl.h, line 100.
assertion: IsVector && "cannot get number of elements on scalar/aggregate"
[7289/8583] /Users/buildslave/jenkins/workspace/test-suite-verify-machineinstrs-aarch64-O0-g/test-suite-build/tools/timeit --summary MultiSource/Benchmarks/MiBench/consumer-typeset/CMakeFiles/consumer-typeset.dir/z01.c.o.time /Users/buildslave/jenkins/workspace/test-suite-verify-machineinstrs-aarch64-O0-g/compiler/bin/clang -DNDEBUG  -B /Applications/Xcode.app/Contents/Developer/Toolchains/XcodeDefault.xctoolchain/usr/bin    -Wno-unused-command-line-argument -mllvm -verify-machineinstrs -O0 -g -arch arm64 -isysroot /Applications/Xcode.app/Contents/Developer/Platforms/iPhoneOS.platform/Developer/SDKs/iPhoneOS12.1.sdk   -w -Werror=date-time -DOS_UNIX=1 -DOS_DOS=0 -DOS_MAC=0 -DDB_FIX=0 -DUSE_STAT=1 -DSAFE_DFT=0 -DCOLLATE=1 -DLIB_DIR=\"lout.lib\" -DFONT_DIR=\"font\" -DMAPS_DIR=\"maps\" -DINCL_DIR=\"include\" -DDATA_DIR=\"data\" -DHYPH_DIR=\"hyph\" -DLOCALE_DIR=\"locale\" -DCHAR_IN=1 -DCHAR_OUT=0 -DLOCALE_ON=1 -DASSERT_ON=1 -DDEBUG_ON=0 -DPDF_COMPRESSION=0 -D_FORTIFY_SOURCE=0 -MD -MT MultiSource/Benchmarks/MiBench/consumer-typeset/CMakeFiles/consumer-typeset.dir/z01.c.o -MF MultiSource/Benchmarks/MiBench/consumer-typeset/CMakeFiles/consumer-typeset.dir/z01.c.o.d -o MultiSource/Benchmarks/MiBench/consumer-typeset/CMakeFiles/consumer-typeset.dir/z01.c.o   -c /Users/buildslave/jenkins/workspace/test-suite-verify-machineinstrs-aarch64-O0-g/test-suite/MultiSource/Benchmarks/MiBench/consumer-typeset/z01.c
[7290/8583] /Users/buildslave/jenkins/workspace/test-suite-verify-machineinstrs-aarch64-O0-g/test-suite-build/tools/timeit --summary MultiSource/Benchmarks/MiBench/consumer-typeset/CMakeFiles/consumer-typeset.dir/z02.c.o.time /Users/buildslave/jenkins/workspace/test-suite-verify-machineinstrs-aarch64-O0-g/compiler/bin/clang -DNDEBUG  -B /Applications/Xcode.app/Contents/Developer/Toolchains/XcodeDefault.xctoolchain/usr/bin    -Wno-unused-command-line-argument -mllvm -verify-machineinstrs -O0 -g -arch arm64 -isysroot /Applications/Xcode.app/Contents/Developer/Platforms/iPhoneOS.platform/Developer/SDKs/iPhoneOS12.1.sdk   -w -Werror=date-time -DOS_UNIX=1 -DOS_DOS=0 -DOS_MAC=0 -DDB_FIX=0 -DUSE_STAT=1 -DSAFE_DFT=0 -DCOLLATE=1 -DLIB_DIR=\"lout.lib\" -DFONT_DIR=\"font\" -DMAPS_DIR=\"maps\" -DINCL_DIR=\"include\" -DDATA_DIR=\"data\" -DHYPH_DIR=\"hyph\" -DLOCALE_DIR=\"locale\" -DCHAR_IN=1 -DCHAR_OUT=0 -DLOCALE_ON=1 -DASSERT_ON=1 -DDEBUG_ON=0 -DPDF_COMPRESSION=0 -D_FORTIFY_SOURCE=0 -MD -MT MultiSource/Benchmarks/MiBench/consumer-typeset/CMakeFiles/consumer-typeset.dir/z02.c.o -MF MultiSource/Benchmarks/MiBench/consumer-typeset/CMakeFiles/consumer-typeset.dir/z02.c.o.d -o MultiSource/Benchmarks/MiBench/consumer-typeset/CMakeFiles/consumer-typeset.dir/z02.c.o   -c /Users/buildslave/jenkins/workspace/test-suite-verify-machineinstrs-aarch64-O0-g/test-suite/MultiSource/Benchmarks/MiBench/consumer-typeset/z02.c
[7291/8583] /Users/buildslave/jenkins/workspace/test-suite-verify-machineinstrs-aarch64-O0-g/test-suite-build/tools/timeit --summary SingleSource/UnitTests/Vector/AArch64/CMakeFiles/aarch64_neon_intrinsics.dir/aarch64_neon_intrinsics.c.o.time /Users/buildslave/jenkins/workspace/test-suite-verify-machineinstrs-aarch64-O0-g/compiler/bin/clang -DNDEBUG  -B /Applications/Xcode.app/Contents/Developer/Toolchains/XcodeDefault.xctoolchain/usr/bin    -Wno-unused-command-line-argument -mllvm -verify-machineinstrs -O0 -g -arch arm64 -isysroot /Applications/Xcode.app/Contents/Developer/Platforms/iPhoneOS.platform/Developer/SDKs/iPhoneOS12.1.sdk   -w -Werror=date-time -std=c99 -MD -MT SingleSource/UnitTests/Vector/AArch64/CMakeFiles/aarch64_neon_intrinsics.dir/aarch64_neon_intrinsics.c.o -MF SingleSource/UnitTests/Vector/AArch64/CMakeFiles/aarch64_neon_intrinsics.dir/aarch64_neon_intrinsics.c.o.d -o SingleSource/UnitTests/Vector/AArch64/CMakeFiles/aarch64_neon_intrinsics.dir/aarch64_neon_intrinsics.c.o   -c /Users/buildslave/jenkins/workspace/test-suite-verify-machineinstrs-aarch64-O0-g/test-suite/SingleSource/UnitTests/Vector/AArch64/aarch64_neon_intrinsics.c
FAILED: SingleSource/UnitTests/Vector/AArch64/CMakeFiles/aarch64_neon_intrinsics.dir/aarch64_neon_intrinsics.c.o 
/Users/buildslave/jenkins/workspace/test-suite-verify-machineinstrs-aarch64-O0-g/test-suite-build/tools/timeit --summary SingleSource/UnitTests/Vector/AArch64/CMakeFiles/aarch64_neon_intrinsics.dir/aarch64_neon_intrinsics.c.o.time /Users/buildslave/jenkins/workspace/test-suite-verify-machineinstrs-aarch64-O0-g/compiler/bin/clang -DNDEBUG  -B /Applications/Xcode.app/Contents/Developer/Toolchains/XcodeDefault.xctoolchain/usr/bin    -Wno-unused-command-line-argument -mllvm -verify-machineinstrs -O0 -g -arch arm64 -isysroot /Applications/Xcode.app/Contents/Developer/Platforms/iPhoneOS.platform/Developer/SDKs/iPhoneOS12.1.sdk   -w -Werror=date-time -std=c99 -MD -MT SingleSource/UnitTests/Vector/AArch64/CMakeFiles/aarch64_neon_intrinsics.dir/aarch64_neon_intrinsics.c.o -MF SingleSource/UnitTests/Vector/AArch64/CMakeFiles/aarch64_neon_intrinsics.dir/aarch64_neon_intrinsics.c.o.d -o SingleSource/UnitTests/Vector/AArch64/CMakeFiles/aarch64_neon_intrinsics.dir/aarch64_neon_intrinsics.c.o   -c /Users/buildslave/jenkins/workspace/test-suite-verify-machineinstrs-aarch64-O0-g/test-suite/SingleSource/UnitTests/Vector/AArch64/aarch64_neon_intrinsics.c
Assertion failed: (IsVector && "cannot get number of elements on scalar/aggregate"), function getNumElements, file /Users/buildslave/jenkins/workspace/clang-stage1-RA/llvm-project/llvm/include/llvm/Support/LowLevelTypeImpl.h, line 100.
Stack dump:
0.	Program arguments: /Users/buildslave/jenkins/workspace/test-suite-verify-machineinstrs-aarch64-O0-g/compiler/bin/clang-10 -cc1 -triple arm64-apple-ios12.1.0 -Wdeprecated-objc-isa-usage -Werror=deprecated-objc-isa-usage -Werror=implicit-function-declaration -emit-obj -mrelax-all -disable-free -main-file-name aarch64_neon_intrinsics.c -mrelocation-model pic -pic-level 2 -mthread-model posix -mframe-pointer=all -fno-rounding-math -masm-verbose -munwind-tables -target-sdk-version=12.1 -target-cpu cyclone -target-feature +fp-armv8 -target-feature +neon -target-feature +crypto -target-feature +zcm -target-feature +zcz -target-feature +sha2 -target-feature +aes -target-abi darwinpcs -fallow-half-arguments-and-returns -dwarf-column-info -debug-info-kind=standalone -dwarf-version=4 -debugger-tuning=lldb -target-linker-version 409.12 -resource-dir /Users/buildslave/jenkins/workspace/test-suite-verify-machineinstrs-aarch64-O0-g/compiler/lib/clang/10.0.0 -dependency-file SingleSource/UnitTests/Vector/AArch64/CMakeFiles/aarch64_neon_intrinsics.dir/aarch64_neon_intrinsics.c.o.d -MT SingleSource/UnitTests/Vector/AArch64/CMakeFiles/aarch64_neon_intrinsics.dir/aarch64_neon_intrinsics.c.o -sys-header-deps -isysroot /Applications/Xcode.app/Contents/Developer/Platforms/iPhoneOS.platform/Developer/SDKs/iPhoneOS12.1.sdk -D NDEBUG -internal-isystem /Applications/Xcode.app/Contents/Developer/Platforms/iPhoneOS.platform/Developer/SDKs/iPhoneOS12.1.sdk/usr/local/include -internal-isystem /Users/buildslave/jenkins/workspace/test-suite-verify-machineinstrs-aarch64-O0-g/compiler/lib/clang/10.0.0/include -internal-externc-isystem /Applications/Xcode.app/Contents/Developer/Platforms/iPhoneOS.platform/Developer/SDKs/iPhoneOS12.1.sdk/usr/include -O0 -Wno-unused-command-line-argument -Werror=date-time -w -std=c99 -fdebug-compilation-dir /Users/buildslave/jenkins/workspace/test-suite-verify-machineinstrs-aarch64-O0-g/test-suite-build -ferror-limit 19 -fmessage-length 0 -stack-protector 1 -fblocks -fencode-extended-block-signature -fregister-global-dtors-with-atexit -fgnuc-version=4.2.1 -fobjc-runtime=ios-12.1.0 -fmax-type-align=16 -fdiagnostics-show-option -mllvm -verify-machineinstrs -o SingleSource/UnitTests/Vector/AArch64/CMakeFiles/aarch64_neon_intrinsics.dir/aarch64_neon_intrinsics.c.o -x c /Users/buildslave/jenkins/workspace/test-suite-verify-machineinstrs-aarch64-O0-g/test-suite/SingleSource/UnitTests/Vector/AArch64/aarch64_neon_intrinsics.c 
Error: unable to execute command: Abort trap: 6
20 clang-10                 0x000000010d57c7f5 clang::CompilerInstance::ExecuteAction(clang::FrontendAction&) + 1557
21 clang-10                 0x000000010d646daf clang::ExecuteCompilerInvocation(clang::CompilerInstance*) + 1759
22 clang-10                 0x000000010b0ee508 cc1_main(llvm::ArrayRef<char const*>, char const*, void*) + 2392
23 clang-10                 0x000000010b0ebc53 main + 10819
24 libdyld.dylib            0x00007fff5feb2085 start + 1
clang-10: error: unable to execute command: Abort trap: 6
clang-10: error: clang frontend command failed due to signal (use -v to see invocation)
clang version 10.0.0 (https://github.com/llvm/llvm-project.git 4cc0c2998d64156c9f848a8c2b2aed375ebd58b6)
Error: clang frontend command failed due to signal (use -v to see invocation)
21 clang-10                 0x000000010d646daf clang::ExecuteCompilerInvocation(clang::CompilerInstance*) + 1759
22 clang-10                 0x000000010b0ee508 cc1_main(llvm::ArrayRef<char const*>, char const*, void*) + 2392
23 clang-10                 0x000000010b0ebc53 main + 10819
24 libdyld.dylib            0x00007fff5feb2085 start + 1
clang-10: error: unable to execute command: Abort trap: 6
clang-10: error: clang frontend command failed due to signal (use -v to see invocation)
clang version 10.0.0 (https://github.com/llvm/llvm-project.git 4cc0c2998d64156c9f848a8c2b2aed375ebd58b6)
Target: aarch64-apple-darwin18.0.0

Build Log

Changes
  1. AArch64: add arm64_32 support to Clang. (detail)
  2. Mark llvm::ConstantExpr::getAsInstruction as const (detail)
  3. [lldb] Fix some warnings in the python plugin (detail)
  4. [lldb] Fix more -Wdeprecated-copy warnings (detail)
  5. Revert "Fix lookup of symbols at the same address with no size vs. size" (detail)
  6. [Examples] Add IRTransformations directory to examples. (detail)
  7. [PowerPC][NFC]Fix typo in desc for enable-ppc-prefetching (detail)

Started by upstream project relay-test-suite-verify-machineinstrs build number 6712
originally caused by:

This run spent:

  • 1 hr 5 min waiting;
  • 1 hr 23 min build duration;
  • 1 hr 23 min total from scheduled to completion.
Revision: 4cc0c2998d64156c9f848a8c2b2aed375ebd58b6
  • detached

Identified problems

Compile Error

This build failed because of a compile error. Below is a list of all errors in the build log:
Indication 1

Assertion failure

This build failed because of an assertion failure. Below is a list of all errors in the build log:
Indication 2

Ninja target failed

Below is a link to the first failed ninja target.
Indication 3