Started 20 hr ago
Took 50 min

Failed Build clang-d346458-g66774771903-t8002-b8002.tar.gz (Mar 27, 2020 9:34:52 PM)

Issues

Found 3 issues:
Ninja target: AArch64_halide_runtime.bc.o
[2359/8583] /Users/buildslave/jenkins/workspace/test-suite-verify-machineinstrs-aarch64-O0-g/test-suite-build/tools/timeit --summary Bitcode/simd_ops/CMakeFiles/simd_ops_test_op_saba_989.dir/AArch64_scalar_tests/scalar_test_op_saba_989.bc.o.time /Users/buildslave/jenkins/workspace/test-suite-verify-machineinstrs-aarch64-O0-g/compiler/bin/clang++  -DNDEBUG  -B /Applications/Xcode.app/Contents/Developer/Toolchains/XcodeDefault.xctoolchain/usr/bin    -Wno-unused-command-line-argument -mllvm -verify-machineinstrs -O0 -g -arch arm64 -isysroot /Applications/Xcode.app/Contents/Developer/Platforms/iPhoneOS.platform/Developer/SDKs/iPhoneOS12.1.sdk   -w -Werror=date-time -MD -MT Bitcode/simd_ops/CMakeFiles/simd_ops_test_op_saba_989.dir/AArch64_scalar_tests/scalar_test_op_saba_989.bc.o -MF Bitcode/simd_ops/CMakeFiles/simd_ops_test_op_saba_989.dir/AArch64_scalar_tests/scalar_test_op_saba_989.bc.o.d -o Bitcode/simd_ops/CMakeFiles/simd_ops_test_op_saba_989.dir/AArch64_scalar_tests/scalar_test_op_saba_989.bc.o -c /Users/buildslave/jenkins/workspace/test-suite-verify-machineinstrs-aarch64-O0-g/test-suite/Bitcode/simd_ops/AArch64_scalar_tests/scalar_test_op_saba_989.bc
[2360/8583] /Users/buildslave/jenkins/workspace/test-suite-verify-machineinstrs-aarch64-O0-g/test-suite-build/tools/timeit --summary Bitcode/simd_ops/CMakeFiles/simd_ops_test_op_neg_870.dir/AArch64_tests/test_op_neg_870.bc.o.time /Users/buildslave/jenkins/workspace/test-suite-verify-machineinstrs-aarch64-O0-g/compiler/bin/clang++  -DNDEBUG  -B /Applications/Xcode.app/Contents/Developer/Toolchains/XcodeDefault.xctoolchain/usr/bin    -Wno-unused-command-line-argument -mllvm -verify-machineinstrs -O0 -g -arch arm64 -isysroot /Applications/Xcode.app/Contents/Developer/Platforms/iPhoneOS.platform/Developer/SDKs/iPhoneOS12.1.sdk   -w -Werror=date-time -MD -MT Bitcode/simd_ops/CMakeFiles/simd_ops_test_op_neg_870.dir/AArch64_tests/test_op_neg_870.bc.o -MF Bitcode/simd_ops/CMakeFiles/simd_ops_test_op_neg_870.dir/AArch64_tests/test_op_neg_870.bc.o.d -o Bitcode/simd_ops/CMakeFiles/simd_ops_test_op_neg_870.dir/AArch64_tests/test_op_neg_870.bc.o -c /Users/buildslave/jenkins/workspace/test-suite-verify-machineinstrs-aarch64-O0-g/test-suite/Bitcode/simd_ops/AArch64_tests/test_op_neg_870.bc
[2361/8583] /Users/buildslave/jenkins/workspace/test-suite-verify-machineinstrs-aarch64-O0-g/test-suite-build/tools/timeit --summary Bitcode/simd_ops/CMakeFiles/simd_ops_test_op_fcmeq_1061.dir/AArch64_halide_runtime.bc.o.time /Users/buildslave/jenkins/workspace/test-suite-verify-machineinstrs-aarch64-O0-g/compiler/bin/clang++  -DNDEBUG  -B /Applications/Xcode.app/Contents/Developer/Toolchains/XcodeDefault.xctoolchain/usr/bin    -Wno-unused-command-line-argument -mllvm -verify-machineinstrs -O0 -g -arch arm64 -isysroot /Applications/Xcode.app/Contents/Developer/Platforms/iPhoneOS.platform/Developer/SDKs/iPhoneOS12.1.sdk   -w -Werror=date-time -MD -MT Bitcode/simd_ops/CMakeFiles/simd_ops_test_op_fcmeq_1061.dir/AArch64_halide_runtime.bc.o -MF Bitcode/simd_ops/CMakeFiles/simd_ops_test_op_fcmeq_1061.dir/AArch64_halide_runtime.bc.o.d -o Bitcode/simd_ops/CMakeFiles/simd_ops_test_op_fcmeq_1061.dir/AArch64_halide_runtime.bc.o -c /Users/buildslave/jenkins/workspace/test-suite-verify-machineinstrs-aarch64-O0-g/test-suite/Bitcode/simd_ops/AArch64_halide_runtime.bc
[2362/8583] /Users/buildslave/jenkins/workspace/test-suite-verify-machineinstrs-aarch64-O0-g/test-suite-build/tools/timeit --summary Bitcode/simd_ops/CMakeFiles/simd_ops_test_op_neg_870.dir/AArch64_scalar_tests/scalar_test_op_neg_870.bc.o.time /Users/buildslave/jenkins/workspace/test-suite-verify-machineinstrs-aarch64-O0-g/compiler/bin/clang++  -DNDEBUG  -B /Applications/Xcode.app/Contents/Developer/Toolchains/XcodeDefault.xctoolchain/usr/bin    -Wno-unused-command-line-argument -mllvm -verify-machineinstrs -O0 -g -arch arm64 -isysroot /Applications/Xcode.app/Contents/Developer/Platforms/iPhoneOS.platform/Developer/SDKs/iPhoneOS12.1.sdk   -w -Werror=date-time -MD -MT Bitcode/simd_ops/CMakeFiles/simd_ops_test_op_neg_870.dir/AArch64_scalar_tests/scalar_test_op_neg_870.bc.o -MF Bitcode/simd_ops/CMakeFiles/simd_ops_test_op_neg_870.dir/AArch64_scalar_tests/scalar_test_op_neg_870.bc.o.d -o Bitcode/simd_ops/CMakeFiles/simd_ops_test_op_neg_870.dir/AArch64_scalar_tests/scalar_test_op_neg_870.bc.o -c /Users/buildslave/jenkins/workspace/test-suite-verify-machineinstrs-aarch64-O0-g/test-suite/Bitcode/simd_ops/AArch64_scalar_tests/scalar_test_op_neg_870.bc
[2363/8583] /Users/buildslave/jenkins/workspace/test-suite-verify-machineinstrs-aarch64-O0-g/test-suite-build/tools/timeit --summary Bitcode/simd_ops/CMakeFiles/simd_ops_test_op_mul_854.dir/AArch64_halide_runtime.bc.o.time /Users/buildslave/jenkins/workspace/test-suite-verify-machineinstrs-aarch64-O0-g/compiler/bin/clang++  -DNDEBUG  -B /Applications/Xcode.app/Contents/Developer/Toolchains/XcodeDefault.xctoolchain/usr/bin    -Wno-unused-command-line-argument -mllvm -verify-machineinstrs -O0 -g -arch arm64 -isysroot /Applications/Xcode.app/Contents/Developer/Platforms/iPhoneOS.platform/Developer/SDKs/iPhoneOS12.1.sdk   -w -Werror=date-time -MD -MT Bitcode/simd_ops/CMakeFiles/simd_ops_test_op_mul_854.dir/AArch64_halide_runtime.bc.o -MF Bitcode/simd_ops/CMakeFiles/simd_ops_test_op_mul_854.dir/AArch64_halide_runtime.bc.o.d -o Bitcode/simd_ops/CMakeFiles/simd_ops_test_op_mul_854.dir/AArch64_halide_runtime.bc.o -c /Users/buildslave/jenkins/workspace/test-suite-verify-machineinstrs-aarch64-O0-g/test-suite/Bitcode/simd_ops/AArch64_halide_runtime.bc
FAILED: Bitcode/simd_ops/CMakeFiles/simd_ops_test_op_mul_854.dir/AArch64_halide_runtime.bc.o 
/Users/buildslave/jenkins/workspace/test-suite-verify-machineinstrs-aarch64-O0-g/test-suite-build/tools/timeit --summary Bitcode/simd_ops/CMakeFiles/simd_ops_test_op_mul_854.dir/AArch64_halide_runtime.bc.o.time /Users/buildslave/jenkins/workspace/test-suite-verify-machineinstrs-aarch64-O0-g/compiler/bin/clang++  -DNDEBUG  -B /Applications/Xcode.app/Contents/Developer/Toolchains/XcodeDefault.xctoolchain/usr/bin    -Wno-unused-command-line-argument -mllvm -verify-machineinstrs -O0 -g -arch arm64 -isysroot /Applications/Xcode.app/Contents/Developer/Platforms/iPhoneOS.platform/Developer/SDKs/iPhoneOS12.1.sdk   -w -Werror=date-time -MD -MT Bitcode/simd_ops/CMakeFiles/simd_ops_test_op_mul_854.dir/AArch64_halide_runtime.bc.o -MF Bitcode/simd_ops/CMakeFiles/simd_ops_test_op_mul_854.dir/AArch64_halide_runtime.bc.o.d -o Bitcode/simd_ops/CMakeFiles/simd_ops_test_op_mul_854.dir/AArch64_halide_runtime.bc.o -c /Users/buildslave/jenkins/workspace/test-suite-verify-machineinstrs-aarch64-O0-g/test-suite/Bitcode/simd_ops/AArch64_halide_runtime.bc
Assertion failed: (NumOperands == (isCopyLike(MI) ? 1 : MI.getNumOperands()) && "NumOperands must match, see constructor"), function verify, file /Users/buildslave/jenkins/workspace/clang-stage1-RA/llvm-project/llvm/lib/CodeGen/GlobalISel/RegisterBankInfo.cpp, line 602.
assertion: NumOperands == (isCopyLike(MI) ? 1 : MI.getNumOperands()) && "NumOperands must match, see constructor"
[2361/8583] /Users/buildslave/jenkins/workspace/test-suite-verify-machineinstrs-aarch64-O0-g/test-suite-build/tools/timeit --summary Bitcode/simd_ops/CMakeFiles/simd_ops_test_op_fcmeq_1061.dir/AArch64_halide_runtime.bc.o.time /Users/buildslave/jenkins/workspace/test-suite-verify-machineinstrs-aarch64-O0-g/compiler/bin/clang++  -DNDEBUG  -B /Applications/Xcode.app/Contents/Developer/Toolchains/XcodeDefault.xctoolchain/usr/bin    -Wno-unused-command-line-argument -mllvm -verify-machineinstrs -O0 -g -arch arm64 -isysroot /Applications/Xcode.app/Contents/Developer/Platforms/iPhoneOS.platform/Developer/SDKs/iPhoneOS12.1.sdk   -w -Werror=date-time -MD -MT Bitcode/simd_ops/CMakeFiles/simd_ops_test_op_fcmeq_1061.dir/AArch64_halide_runtime.bc.o -MF Bitcode/simd_ops/CMakeFiles/simd_ops_test_op_fcmeq_1061.dir/AArch64_halide_runtime.bc.o.d -o Bitcode/simd_ops/CMakeFiles/simd_ops_test_op_fcmeq_1061.dir/AArch64_halide_runtime.bc.o -c /Users/buildslave/jenkins/workspace/test-suite-verify-machineinstrs-aarch64-O0-g/test-suite/Bitcode/simd_ops/AArch64_halide_runtime.bc
[2362/8583] /Users/buildslave/jenkins/workspace/test-suite-verify-machineinstrs-aarch64-O0-g/test-suite-build/tools/timeit --summary Bitcode/simd_ops/CMakeFiles/simd_ops_test_op_neg_870.dir/AArch64_scalar_tests/scalar_test_op_neg_870.bc.o.time /Users/buildslave/jenkins/workspace/test-suite-verify-machineinstrs-aarch64-O0-g/compiler/bin/clang++  -DNDEBUG  -B /Applications/Xcode.app/Contents/Developer/Toolchains/XcodeDefault.xctoolchain/usr/bin    -Wno-unused-command-line-argument -mllvm -verify-machineinstrs -O0 -g -arch arm64 -isysroot /Applications/Xcode.app/Contents/Developer/Platforms/iPhoneOS.platform/Developer/SDKs/iPhoneOS12.1.sdk   -w -Werror=date-time -MD -MT Bitcode/simd_ops/CMakeFiles/simd_ops_test_op_neg_870.dir/AArch64_scalar_tests/scalar_test_op_neg_870.bc.o -MF Bitcode/simd_ops/CMakeFiles/simd_ops_test_op_neg_870.dir/AArch64_scalar_tests/scalar_test_op_neg_870.bc.o.d -o Bitcode/simd_ops/CMakeFiles/simd_ops_test_op_neg_870.dir/AArch64_scalar_tests/scalar_test_op_neg_870.bc.o -c /Users/buildslave/jenkins/workspace/test-suite-verify-machineinstrs-aarch64-O0-g/test-suite/Bitcode/simd_ops/AArch64_scalar_tests/scalar_test_op_neg_870.bc
[2363/8583] /Users/buildslave/jenkins/workspace/test-suite-verify-machineinstrs-aarch64-O0-g/test-suite-build/tools/timeit --summary Bitcode/simd_ops/CMakeFiles/simd_ops_test_op_mul_854.dir/AArch64_halide_runtime.bc.o.time /Users/buildslave/jenkins/workspace/test-suite-verify-machineinstrs-aarch64-O0-g/compiler/bin/clang++  -DNDEBUG  -B /Applications/Xcode.app/Contents/Developer/Toolchains/XcodeDefault.xctoolchain/usr/bin    -Wno-unused-command-line-argument -mllvm -verify-machineinstrs -O0 -g -arch arm64 -isysroot /Applications/Xcode.app/Contents/Developer/Platforms/iPhoneOS.platform/Developer/SDKs/iPhoneOS12.1.sdk   -w -Werror=date-time -MD -MT Bitcode/simd_ops/CMakeFiles/simd_ops_test_op_mul_854.dir/AArch64_halide_runtime.bc.o -MF Bitcode/simd_ops/CMakeFiles/simd_ops_test_op_mul_854.dir/AArch64_halide_runtime.bc.o.d -o Bitcode/simd_ops/CMakeFiles/simd_ops_test_op_mul_854.dir/AArch64_halide_runtime.bc.o -c /Users/buildslave/jenkins/workspace/test-suite-verify-machineinstrs-aarch64-O0-g/test-suite/Bitcode/simd_ops/AArch64_halide_runtime.bc
FAILED: Bitcode/simd_ops/CMakeFiles/simd_ops_test_op_mul_854.dir/AArch64_halide_runtime.bc.o 
/Users/buildslave/jenkins/workspace/test-suite-verify-machineinstrs-aarch64-O0-g/test-suite-build/tools/timeit --summary Bitcode/simd_ops/CMakeFiles/simd_ops_test_op_mul_854.dir/AArch64_halide_runtime.bc.o.time /Users/buildslave/jenkins/workspace/test-suite-verify-machineinstrs-aarch64-O0-g/compiler/bin/clang++  -DNDEBUG  -B /Applications/Xcode.app/Contents/Developer/Toolchains/XcodeDefault.xctoolchain/usr/bin    -Wno-unused-command-line-argument -mllvm -verify-machineinstrs -O0 -g -arch arm64 -isysroot /Applications/Xcode.app/Contents/Developer/Platforms/iPhoneOS.platform/Developer/SDKs/iPhoneOS12.1.sdk   -w -Werror=date-time -MD -MT Bitcode/simd_ops/CMakeFiles/simd_ops_test_op_mul_854.dir/AArch64_halide_runtime.bc.o -MF Bitcode/simd_ops/CMakeFiles/simd_ops_test_op_mul_854.dir/AArch64_halide_runtime.bc.o.d -o Bitcode/simd_ops/CMakeFiles/simd_ops_test_op_mul_854.dir/AArch64_halide_runtime.bc.o -c /Users/buildslave/jenkins/workspace/test-suite-verify-machineinstrs-aarch64-O0-g/test-suite/Bitcode/simd_ops/AArch64_halide_runtime.bc
Assertion failed: (NumOperands == (isCopyLike(MI) ? 1 : MI.getNumOperands()) && "NumOperands must match, see constructor"), function verify, file /Users/buildslave/jenkins/workspace/clang-stage1-RA/llvm-project/llvm/lib/CodeGen/GlobalISel/RegisterBankInfo.cpp, line 602.
PLEASE submit a bug report to https://bugs.llvm.org/ and include the crash backtrace, preprocessed source, and associated run script.
Stack dump:
Error: clang frontend command failed due to signal (use -v to see invocation)
26 clang++                  0x0000000106dafbed clang::driver::Compilation::ExecuteCommand(clang::driver::Command const&, clang::driver::Command const*&) const + 221
27 clang++                  0x0000000106db001b clang::driver::Compilation::ExecuteJobs(clang::driver::JobList const&, llvm::SmallVectorImpl<std::__1::pair<int, clang::driver::Command const*> >&) const + 107
28 clang++                  0x0000000106dc3e6b clang::driver::Driver::ExecuteCompilation(clang::driver::Compilation&, llvm::SmallVectorImpl<std::__1::pair<int, clang::driver::Command const*> >&) + 203
29 clang++                  0x00000001048f73e5 main + 10917
30 libdyld.dylib            0x00007fff5feb2085 start + 1
clang-11: error: clang frontend command failed due to signal (use -v to see invocation)
clang version 11.0.0 (https://github.com/llvm/llvm-project.git 66774771903a0d32e9909e0d40d6f9b1e51b43c0)
Target: aarch64-apple-darwin18.0.0

Build Log

Changes
  1. [MLIR][NFC] Move TestDialect -> Dialect/Test (details)
  2. Improve error recovery from missing '>' in template argument list. (details)
  3. [compiler-rt] Fall back to internal_uname() when called early (details)
  4. Revert "[FileCollector] Add a method to add a whole directory and it contents." (details)
  5. Verify number of result types in generated builder. (details)

Started by upstream project relay-test-suite-verify-machineinstrs build number 7312
originally caused by:

This run spent:

  • 5 sec waiting;
  • 50 min build duration;
  • 50 min total from scheduled to completion.
Revision: 857d592f5e815f8227fc6348635c70b679788951
  • refs/remotes/origin/master
Revision: 66774771903a0d32e9909e0d40d6f9b1e51b43c0
  • detached
Revision: 9c9f6f8aaca07b783b4a2db2b68f7878a61bd97a
  • refs/remotes/origin/master
Revision: 60afc42e311b7996a973779fbdf297e1cb57dea9
  • refs/remotes/origin/master

Identified problems

Compile Error

This build failed because of a compile error. Below is a list of all errors in the build log:
Indication 1

Assertion failure

This build failed because of an assertion failure. Below is a list of all errors in the build log:
Indication 2

Ninja target failed

Below is a link to the first failed ninja target.
Indication 3