Started 1 mo 24 days ago
Took 38 min

Failed Build clang-d329542-gee86804cf1b-t2911-b2911.tar.gz (Oct 14, 2019 9:49:25 AM)

Issues

Found 3 issues:
Ninja target: oggenc.c.o
[7854/8583] /Users/buildslave/jenkins/workspace/test-suite-verify-machineinstrs-aarch64-O3/test-suite-build/tools/timeit --summary MultiSource/Benchmarks/DOE-ProxyApps-C++/HPCCG/CMakeFiles/HPCCG.dir/waxpby.cpp.o.time /Users/buildslave/jenkins/workspace/test-suite-verify-machineinstrs-aarch64-O3/compiler/bin/clang++  -DNDEBUG  -B /Applications/Xcode.app/Contents/Developer/Toolchains/XcodeDefault.xctoolchain/usr/bin    -Wno-unused-command-line-argument -mllvm -verify-machineinstrs -O3 -arch arm64 -isysroot /Applications/Xcode.app/Contents/Developer/Platforms/iPhoneOS.platform/Developer/SDKs/iPhoneOS12.1.sdk   -w -Werror=date-time -DREDSTORM -MD -MT MultiSource/Benchmarks/DOE-ProxyApps-C++/HPCCG/CMakeFiles/HPCCG.dir/waxpby.cpp.o -MF MultiSource/Benchmarks/DOE-ProxyApps-C++/HPCCG/CMakeFiles/HPCCG.dir/waxpby.cpp.o.d -o MultiSource/Benchmarks/DOE-ProxyApps-C++/HPCCG/CMakeFiles/HPCCG.dir/waxpby.cpp.o -c /Users/buildslave/jenkins/workspace/test-suite-verify-machineinstrs-aarch64-O3/test-suite/MultiSource/Benchmarks/DOE-ProxyApps-C++/HPCCG/waxpby.cpp
[7855/8583] /Users/buildslave/jenkins/workspace/test-suite-verify-machineinstrs-aarch64-O3/test-suite-build/tools/timeit --summary MultiSource/Benchmarks/DOE-ProxyApps-C++/HPCCG/CMakeFiles/HPCCG.dir/main.cpp.o.time /Users/buildslave/jenkins/workspace/test-suite-verify-machineinstrs-aarch64-O3/compiler/bin/clang++  -DNDEBUG  -B /Applications/Xcode.app/Contents/Developer/Toolchains/XcodeDefault.xctoolchain/usr/bin    -Wno-unused-command-line-argument -mllvm -verify-machineinstrs -O3 -arch arm64 -isysroot /Applications/Xcode.app/Contents/Developer/Platforms/iPhoneOS.platform/Developer/SDKs/iPhoneOS12.1.sdk   -w -Werror=date-time -DREDSTORM -MD -MT MultiSource/Benchmarks/DOE-ProxyApps-C++/HPCCG/CMakeFiles/HPCCG.dir/main.cpp.o -MF MultiSource/Benchmarks/DOE-ProxyApps-C++/HPCCG/CMakeFiles/HPCCG.dir/main.cpp.o.d -o MultiSource/Benchmarks/DOE-ProxyApps-C++/HPCCG/CMakeFiles/HPCCG.dir/main.cpp.o -c /Users/buildslave/jenkins/workspace/test-suite-verify-machineinstrs-aarch64-O3/test-suite/MultiSource/Benchmarks/DOE-ProxyApps-C++/HPCCG/main.cpp
[7856/8583] /Users/buildslave/jenkins/workspace/test-suite-verify-machineinstrs-aarch64-O3/test-suite-build/tools/timeit --summary MultiSource/Benchmarks/DOE-ProxyApps-C++/HPCCG/CMakeFiles/HPCCG.dir/read_HPC_row.cpp.o.time /Users/buildslave/jenkins/workspace/test-suite-verify-machineinstrs-aarch64-O3/compiler/bin/clang++  -DNDEBUG  -B /Applications/Xcode.app/Contents/Developer/Toolchains/XcodeDefault.xctoolchain/usr/bin    -Wno-unused-command-line-argument -mllvm -verify-machineinstrs -O3 -arch arm64 -isysroot /Applications/Xcode.app/Contents/Developer/Platforms/iPhoneOS.platform/Developer/SDKs/iPhoneOS12.1.sdk   -w -Werror=date-time -DREDSTORM -MD -MT MultiSource/Benchmarks/DOE-ProxyApps-C++/HPCCG/CMakeFiles/HPCCG.dir/read_HPC_row.cpp.o -MF MultiSource/Benchmarks/DOE-ProxyApps-C++/HPCCG/CMakeFiles/HPCCG.dir/read_HPC_row.cpp.o.d -o MultiSource/Benchmarks/DOE-ProxyApps-C++/HPCCG/CMakeFiles/HPCCG.dir/read_HPC_row.cpp.o -c /Users/buildslave/jenkins/workspace/test-suite-verify-machineinstrs-aarch64-O3/test-suite/MultiSource/Benchmarks/DOE-ProxyApps-C++/HPCCG/read_HPC_row.cpp
[7857/8583] : && /Users/buildslave/jenkins/workspace/test-suite-verify-machineinstrs-aarch64-O3/test-suite-build/tools/timeit --summary MultiSource/Benchmarks/DOE-ProxyApps-C++/HPCCG/HPCCG.link.time /Users/buildslave/jenkins/workspace/test-suite-verify-machineinstrs-aarch64-O3/compiler/bin/clang++  -B /Applications/Xcode.app/Contents/Developer/Toolchains/XcodeDefault.xctoolchain/usr/bin    -Wno-unused-command-line-argument -mllvm -verify-machineinstrs -O3 -arch arm64 -isysroot /Applications/Xcode.app/Contents/Developer/Platforms/iPhoneOS.platform/Developer/SDKs/iPhoneOS12.1.sdk -Wl,-search_paths_first -Wl,-headerpad_max_install_names -B /Applications/Xcode.app/Contents/Developer/Toolchains/XcodeDefault.xctoolchain/usr/bin MultiSource/Benchmarks/DOE-ProxyApps-C++/HPCCG/CMakeFiles/HPCCG.dir/HPCCG.cpp.o MultiSource/Benchmarks/DOE-ProxyApps-C++/HPCCG/CMakeFiles/HPCCG.dir/HPC_Sparse_Matrix.cpp.o MultiSource/Benchmarks/DOE-ProxyApps-C++/HPCCG/CMakeFiles/HPCCG.dir/HPC_sparsemv.cpp.o MultiSource/Benchmarks/DOE-ProxyApps-C++/HPCCG/CMakeFiles/HPCCG.dir/YAML_Doc.cpp.o MultiSource/Benchmarks/DOE-ProxyApps-C++/HPCCG/CMakeFiles/HPCCG.dir/YAML_Element.cpp.o MultiSource/Benchmarks/DOE-ProxyApps-C++/HPCCG/CMakeFiles/HPCCG.dir/compute_residual.cpp.o MultiSource/Benchmarks/DOE-ProxyApps-C++/HPCCG/CMakeFiles/HPCCG.dir/ddot.cpp.o MultiSource/Benchmarks/DOE-ProxyApps-C++/HPCCG/CMakeFiles/HPCCG.dir/dump_matlab_matrix.cpp.o MultiSource/Benchmarks/DOE-ProxyApps-C++/HPCCG/CMakeFiles/HPCCG.dir/exchange_externals.cpp.o MultiSource/Benchmarks/DOE-ProxyApps-C++/HPCCG/CMakeFiles/HPCCG.dir/generate_matrix.cpp.o MultiSource/Benchmarks/DOE-ProxyApps-C++/HPCCG/CMakeFiles/HPCCG.dir/main.cpp.o MultiSource/Benchmarks/DOE-ProxyApps-C++/HPCCG/CMakeFiles/HPCCG.dir/make_local_matrix.cpp.o MultiSource/Benchmarks/DOE-ProxyApps-C++/HPCCG/CMakeFiles/HPCCG.dir/mytimer.cpp.o MultiSource/Benchmarks/DOE-ProxyApps-C++/HPCCG/CMakeFiles/HPCCG.dir/read_HPC_row.cpp.o MultiSource/Benchmarks/DOE-ProxyApps-C++/HPCCG/CMakeFiles/HPCCG.dir/waxpby.cpp.o  -o MultiSource/Benchmarks/DOE-ProxyApps-C++/HPCCG/HPCCG  -lm && cd /Users/buildslave/jenkins/workspace/test-suite-verify-machineinstrs-aarch64-O3/test-suite-build/MultiSource/Benchmarks/DOE-ProxyApps-C++/HPCCG && /usr/local/Cellar/cmake/3.13.1/bin/cmake -E create_symlink /Users/buildslave/jenkins/workspace/test-suite-verify-machineinstrs-aarch64-O3/test-suite/MultiSource/Benchmarks/DOE-ProxyApps-C++/HPCCG/HPCCG.reference_output /Users/buildslave/jenkins/workspace/test-suite-verify-machineinstrs-aarch64-O3/test-suite-build/MultiSource/Benchmarks/DOE-ProxyApps-C++/HPCCG/HPCCG.reference_output
[7858/8583] /Users/buildslave/jenkins/workspace/test-suite-verify-machineinstrs-aarch64-O3/test-suite-build/tools/timeit --summary MultiSource/Applications/oggenc/CMakeFiles/oggenc.dir/oggenc.c.o.time /Users/buildslave/jenkins/workspace/test-suite-verify-machineinstrs-aarch64-O3/compiler/bin/clang -DNDEBUG  -B /Applications/Xcode.app/Contents/Developer/Toolchains/XcodeDefault.xctoolchain/usr/bin    -Wno-unused-command-line-argument -mllvm -verify-machineinstrs -O3 -arch arm64 -isysroot /Applications/Xcode.app/Contents/Developer/Platforms/iPhoneOS.platform/Developer/SDKs/iPhoneOS12.1.sdk   -w -Werror=date-time -fno-strict-aliasing -MD -MT MultiSource/Applications/oggenc/CMakeFiles/oggenc.dir/oggenc.c.o -MF MultiSource/Applications/oggenc/CMakeFiles/oggenc.dir/oggenc.c.o.d -o MultiSource/Applications/oggenc/CMakeFiles/oggenc.dir/oggenc.c.o   -c /Users/buildslave/jenkins/workspace/test-suite-verify-machineinstrs-aarch64-O3/test-suite/MultiSource/Applications/oggenc/oggenc.c
FAILED: MultiSource/Applications/oggenc/CMakeFiles/oggenc.dir/oggenc.c.o 
/Users/buildslave/jenkins/workspace/test-suite-verify-machineinstrs-aarch64-O3/test-suite-build/tools/timeit --summary MultiSource/Applications/oggenc/CMakeFiles/oggenc.dir/oggenc.c.o.time /Users/buildslave/jenkins/workspace/test-suite-verify-machineinstrs-aarch64-O3/compiler/bin/clang -DNDEBUG  -B /Applications/Xcode.app/Contents/Developer/Toolchains/XcodeDefault.xctoolchain/usr/bin    -Wno-unused-command-line-argument -mllvm -verify-machineinstrs -O3 -arch arm64 -isysroot /Applications/Xcode.app/Contents/Developer/Platforms/iPhoneOS.platform/Developer/SDKs/iPhoneOS12.1.sdk   -w -Werror=date-time -fno-strict-aliasing -MD -MT MultiSource/Applications/oggenc/CMakeFiles/oggenc.dir/oggenc.c.o -MF MultiSource/Applications/oggenc/CMakeFiles/oggenc.dir/oggenc.c.o.d -o MultiSource/Applications/oggenc/CMakeFiles/oggenc.dir/oggenc.c.o   -c /Users/buildslave/jenkins/workspace/test-suite-verify-machineinstrs-aarch64-O3/test-suite/MultiSource/Applications/oggenc/oggenc.c
clang-10: error: unable to execute command: Killed: 9
Error: unable to execute command: Killed: 9
[7856/8583] /Users/buildslave/jenkins/workspace/test-suite-verify-machineinstrs-aarch64-O3/test-suite-build/tools/timeit --summary MultiSource/Benchmarks/DOE-ProxyApps-C++/HPCCG/CMakeFiles/HPCCG.dir/read_HPC_row.cpp.o.time /Users/buildslave/jenkins/workspace/test-suite-verify-machineinstrs-aarch64-O3/compiler/bin/clang++  -DNDEBUG  -B /Applications/Xcode.app/Contents/Developer/Toolchains/XcodeDefault.xctoolchain/usr/bin    -Wno-unused-command-line-argument -mllvm -verify-machineinstrs -O3 -arch arm64 -isysroot /Applications/Xcode.app/Contents/Developer/Platforms/iPhoneOS.platform/Developer/SDKs/iPhoneOS12.1.sdk   -w -Werror=date-time -DREDSTORM -MD -MT MultiSource/Benchmarks/DOE-ProxyApps-C++/HPCCG/CMakeFiles/HPCCG.dir/read_HPC_row.cpp.o -MF MultiSource/Benchmarks/DOE-ProxyApps-C++/HPCCG/CMakeFiles/HPCCG.dir/read_HPC_row.cpp.o.d -o MultiSource/Benchmarks/DOE-ProxyApps-C++/HPCCG/CMakeFiles/HPCCG.dir/read_HPC_row.cpp.o -c /Users/buildslave/jenkins/workspace/test-suite-verify-machineinstrs-aarch64-O3/test-suite/MultiSource/Benchmarks/DOE-ProxyApps-C++/HPCCG/read_HPC_row.cpp
[7857/8583] : && /Users/buildslave/jenkins/workspace/test-suite-verify-machineinstrs-aarch64-O3/test-suite-build/tools/timeit --summary MultiSource/Benchmarks/DOE-ProxyApps-C++/HPCCG/HPCCG.link.time /Users/buildslave/jenkins/workspace/test-suite-verify-machineinstrs-aarch64-O3/compiler/bin/clang++  -B /Applications/Xcode.app/Contents/Developer/Toolchains/XcodeDefault.xctoolchain/usr/bin    -Wno-unused-command-line-argument -mllvm -verify-machineinstrs -O3 -arch arm64 -isysroot /Applications/Xcode.app/Contents/Developer/Platforms/iPhoneOS.platform/Developer/SDKs/iPhoneOS12.1.sdk -Wl,-search_paths_first -Wl,-headerpad_max_install_names -B /Applications/Xcode.app/Contents/Developer/Toolchains/XcodeDefault.xctoolchain/usr/bin MultiSource/Benchmarks/DOE-ProxyApps-C++/HPCCG/CMakeFiles/HPCCG.dir/HPCCG.cpp.o MultiSource/Benchmarks/DOE-ProxyApps-C++/HPCCG/CMakeFiles/HPCCG.dir/HPC_Sparse_Matrix.cpp.o MultiSource/Benchmarks/DOE-ProxyApps-C++/HPCCG/CMakeFiles/HPCCG.dir/HPC_sparsemv.cpp.o MultiSource/Benchmarks/DOE-ProxyApps-C++/HPCCG/CMakeFiles/HPCCG.dir/YAML_Doc.cpp.o MultiSource/Benchmarks/DOE-ProxyApps-C++/HPCCG/CMakeFiles/HPCCG.dir/YAML_Element.cpp.o MultiSource/Benchmarks/DOE-ProxyApps-C++/HPCCG/CMakeFiles/HPCCG.dir/compute_residual.cpp.o MultiSource/Benchmarks/DOE-ProxyApps-C++/HPCCG/CMakeFiles/HPCCG.dir/ddot.cpp.o MultiSource/Benchmarks/DOE-ProxyApps-C++/HPCCG/CMakeFiles/HPCCG.dir/dump_matlab_matrix.cpp.o MultiSource/Benchmarks/DOE-ProxyApps-C++/HPCCG/CMakeFiles/HPCCG.dir/exchange_externals.cpp.o MultiSource/Benchmarks/DOE-ProxyApps-C++/HPCCG/CMakeFiles/HPCCG.dir/generate_matrix.cpp.o MultiSource/Benchmarks/DOE-ProxyApps-C++/HPCCG/CMakeFiles/HPCCG.dir/main.cpp.o MultiSource/Benchmarks/DOE-ProxyApps-C++/HPCCG/CMakeFiles/HPCCG.dir/make_local_matrix.cpp.o MultiSource/Benchmarks/DOE-ProxyApps-C++/HPCCG/CMakeFiles/HPCCG.dir/mytimer.cpp.o MultiSource/Benchmarks/DOE-ProxyApps-C++/HPCCG/CMakeFiles/HPCCG.dir/read_HPC_row.cpp.o MultiSource/Benchmarks/DOE-ProxyApps-C++/HPCCG/CMakeFiles/HPCCG.dir/waxpby.cpp.o  -o MultiSource/Benchmarks/DOE-ProxyApps-C++/HPCCG/HPCCG  -lm && cd /Users/buildslave/jenkins/workspace/test-suite-verify-machineinstrs-aarch64-O3/test-suite-build/MultiSource/Benchmarks/DOE-ProxyApps-C++/HPCCG && /usr/local/Cellar/cmake/3.13.1/bin/cmake -E create_symlink /Users/buildslave/jenkins/workspace/test-suite-verify-machineinstrs-aarch64-O3/test-suite/MultiSource/Benchmarks/DOE-ProxyApps-C++/HPCCG/HPCCG.reference_output /Users/buildslave/jenkins/workspace/test-suite-verify-machineinstrs-aarch64-O3/test-suite-build/MultiSource/Benchmarks/DOE-ProxyApps-C++/HPCCG/HPCCG.reference_output
[7858/8583] /Users/buildslave/jenkins/workspace/test-suite-verify-machineinstrs-aarch64-O3/test-suite-build/tools/timeit --summary MultiSource/Applications/oggenc/CMakeFiles/oggenc.dir/oggenc.c.o.time /Users/buildslave/jenkins/workspace/test-suite-verify-machineinstrs-aarch64-O3/compiler/bin/clang -DNDEBUG  -B /Applications/Xcode.app/Contents/Developer/Toolchains/XcodeDefault.xctoolchain/usr/bin    -Wno-unused-command-line-argument -mllvm -verify-machineinstrs -O3 -arch arm64 -isysroot /Applications/Xcode.app/Contents/Developer/Platforms/iPhoneOS.platform/Developer/SDKs/iPhoneOS12.1.sdk   -w -Werror=date-time -fno-strict-aliasing -MD -MT MultiSource/Applications/oggenc/CMakeFiles/oggenc.dir/oggenc.c.o -MF MultiSource/Applications/oggenc/CMakeFiles/oggenc.dir/oggenc.c.o.d -o MultiSource/Applications/oggenc/CMakeFiles/oggenc.dir/oggenc.c.o   -c /Users/buildslave/jenkins/workspace/test-suite-verify-machineinstrs-aarch64-O3/test-suite/MultiSource/Applications/oggenc/oggenc.c
FAILED: MultiSource/Applications/oggenc/CMakeFiles/oggenc.dir/oggenc.c.o 
/Users/buildslave/jenkins/workspace/test-suite-verify-machineinstrs-aarch64-O3/test-suite-build/tools/timeit --summary MultiSource/Applications/oggenc/CMakeFiles/oggenc.dir/oggenc.c.o.time /Users/buildslave/jenkins/workspace/test-suite-verify-machineinstrs-aarch64-O3/compiler/bin/clang -DNDEBUG  -B /Applications/Xcode.app/Contents/Developer/Toolchains/XcodeDefault.xctoolchain/usr/bin    -Wno-unused-command-line-argument -mllvm -verify-machineinstrs -O3 -arch arm64 -isysroot /Applications/Xcode.app/Contents/Developer/Platforms/iPhoneOS.platform/Developer/SDKs/iPhoneOS12.1.sdk   -w -Werror=date-time -fno-strict-aliasing -MD -MT MultiSource/Applications/oggenc/CMakeFiles/oggenc.dir/oggenc.c.o -MF MultiSource/Applications/oggenc/CMakeFiles/oggenc.dir/oggenc.c.o.d -o MultiSource/Applications/oggenc/CMakeFiles/oggenc.dir/oggenc.c.o   -c /Users/buildslave/jenkins/workspace/test-suite-verify-machineinstrs-aarch64-O3/test-suite/MultiSource/Applications/oggenc/oggenc.c
clang-10: error: unable to execute command: Killed: 9
clang-10: error: clang frontend command failed due to signal (use -v to see invocation)
clang version 10.0.0 (https://github.com/llvm/llvm-project.git ee86804cf1bc7f9d9935261231b95e8f30dd7c03)
Error: clang frontend command failed due to signal (use -v to see invocation)
[7857/8583] : && /Users/buildslave/jenkins/workspace/test-suite-verify-machineinstrs-aarch64-O3/test-suite-build/tools/timeit --summary MultiSource/Benchmarks/DOE-ProxyApps-C++/HPCCG/HPCCG.link.time /Users/buildslave/jenkins/workspace/test-suite-verify-machineinstrs-aarch64-O3/compiler/bin/clang++  -B /Applications/Xcode.app/Contents/Developer/Toolchains/XcodeDefault.xctoolchain/usr/bin    -Wno-unused-command-line-argument -mllvm -verify-machineinstrs -O3 -arch arm64 -isysroot /Applications/Xcode.app/Contents/Developer/Platforms/iPhoneOS.platform/Developer/SDKs/iPhoneOS12.1.sdk -Wl,-search_paths_first -Wl,-headerpad_max_install_names -B /Applications/Xcode.app/Contents/Developer/Toolchains/XcodeDefault.xctoolchain/usr/bin MultiSource/Benchmarks/DOE-ProxyApps-C++/HPCCG/CMakeFiles/HPCCG.dir/HPCCG.cpp.o MultiSource/Benchmarks/DOE-ProxyApps-C++/HPCCG/CMakeFiles/HPCCG.dir/HPC_Sparse_Matrix.cpp.o MultiSource/Benchmarks/DOE-ProxyApps-C++/HPCCG/CMakeFiles/HPCCG.dir/HPC_sparsemv.cpp.o MultiSource/Benchmarks/DOE-ProxyApps-C++/HPCCG/CMakeFiles/HPCCG.dir/YAML_Doc.cpp.o MultiSource/Benchmarks/DOE-ProxyApps-C++/HPCCG/CMakeFiles/HPCCG.dir/YAML_Element.cpp.o MultiSource/Benchmarks/DOE-ProxyApps-C++/HPCCG/CMakeFiles/HPCCG.dir/compute_residual.cpp.o MultiSource/Benchmarks/DOE-ProxyApps-C++/HPCCG/CMakeFiles/HPCCG.dir/ddot.cpp.o MultiSource/Benchmarks/DOE-ProxyApps-C++/HPCCG/CMakeFiles/HPCCG.dir/dump_matlab_matrix.cpp.o MultiSource/Benchmarks/DOE-ProxyApps-C++/HPCCG/CMakeFiles/HPCCG.dir/exchange_externals.cpp.o MultiSource/Benchmarks/DOE-ProxyApps-C++/HPCCG/CMakeFiles/HPCCG.dir/generate_matrix.cpp.o MultiSource/Benchmarks/DOE-ProxyApps-C++/HPCCG/CMakeFiles/HPCCG.dir/main.cpp.o MultiSource/Benchmarks/DOE-ProxyApps-C++/HPCCG/CMakeFiles/HPCCG.dir/make_local_matrix.cpp.o MultiSource/Benchmarks/DOE-ProxyApps-C++/HPCCG/CMakeFiles/HPCCG.dir/mytimer.cpp.o MultiSource/Benchmarks/DOE-ProxyApps-C++/HPCCG/CMakeFiles/HPCCG.dir/read_HPC_row.cpp.o MultiSource/Benchmarks/DOE-ProxyApps-C++/HPCCG/CMakeFiles/HPCCG.dir/waxpby.cpp.o  -o MultiSource/Benchmarks/DOE-ProxyApps-C++/HPCCG/HPCCG  -lm && cd /Users/buildslave/jenkins/workspace/test-suite-verify-machineinstrs-aarch64-O3/test-suite-build/MultiSource/Benchmarks/DOE-ProxyApps-C++/HPCCG && /usr/local/Cellar/cmake/3.13.1/bin/cmake -E create_symlink /Users/buildslave/jenkins/workspace/test-suite-verify-machineinstrs-aarch64-O3/test-suite/MultiSource/Benchmarks/DOE-ProxyApps-C++/HPCCG/HPCCG.reference_output /Users/buildslave/jenkins/workspace/test-suite-verify-machineinstrs-aarch64-O3/test-suite-build/MultiSource/Benchmarks/DOE-ProxyApps-C++/HPCCG/HPCCG.reference_output
[7858/8583] /Users/buildslave/jenkins/workspace/test-suite-verify-machineinstrs-aarch64-O3/test-suite-build/tools/timeit --summary MultiSource/Applications/oggenc/CMakeFiles/oggenc.dir/oggenc.c.o.time /Users/buildslave/jenkins/workspace/test-suite-verify-machineinstrs-aarch64-O3/compiler/bin/clang -DNDEBUG  -B /Applications/Xcode.app/Contents/Developer/Toolchains/XcodeDefault.xctoolchain/usr/bin    -Wno-unused-command-line-argument -mllvm -verify-machineinstrs -O3 -arch arm64 -isysroot /Applications/Xcode.app/Contents/Developer/Platforms/iPhoneOS.platform/Developer/SDKs/iPhoneOS12.1.sdk   -w -Werror=date-time -fno-strict-aliasing -MD -MT MultiSource/Applications/oggenc/CMakeFiles/oggenc.dir/oggenc.c.o -MF MultiSource/Applications/oggenc/CMakeFiles/oggenc.dir/oggenc.c.o.d -o MultiSource/Applications/oggenc/CMakeFiles/oggenc.dir/oggenc.c.o   -c /Users/buildslave/jenkins/workspace/test-suite-verify-machineinstrs-aarch64-O3/test-suite/MultiSource/Applications/oggenc/oggenc.c
FAILED: MultiSource/Applications/oggenc/CMakeFiles/oggenc.dir/oggenc.c.o 
/Users/buildslave/jenkins/workspace/test-suite-verify-machineinstrs-aarch64-O3/test-suite-build/tools/timeit --summary MultiSource/Applications/oggenc/CMakeFiles/oggenc.dir/oggenc.c.o.time /Users/buildslave/jenkins/workspace/test-suite-verify-machineinstrs-aarch64-O3/compiler/bin/clang -DNDEBUG  -B /Applications/Xcode.app/Contents/Developer/Toolchains/XcodeDefault.xctoolchain/usr/bin    -Wno-unused-command-line-argument -mllvm -verify-machineinstrs -O3 -arch arm64 -isysroot /Applications/Xcode.app/Contents/Developer/Platforms/iPhoneOS.platform/Developer/SDKs/iPhoneOS12.1.sdk   -w -Werror=date-time -fno-strict-aliasing -MD -MT MultiSource/Applications/oggenc/CMakeFiles/oggenc.dir/oggenc.c.o -MF MultiSource/Applications/oggenc/CMakeFiles/oggenc.dir/oggenc.c.o.d -o MultiSource/Applications/oggenc/CMakeFiles/oggenc.dir/oggenc.c.o   -c /Users/buildslave/jenkins/workspace/test-suite-verify-machineinstrs-aarch64-O3/test-suite/MultiSource/Applications/oggenc/oggenc.c
clang-10: error: unable to execute command: Killed: 9
clang-10: error: clang frontend command failed due to signal (use -v to see invocation)
clang version 10.0.0 (https://github.com/llvm/llvm-project.git ee86804cf1bc7f9d9935261231b95e8f30dd7c03)
Target: aarch64-apple-darwin18.0.0

Build Log

Changes
  1. DWARFExpression: Fix/add support for (v4) debug_loc base address (detail)
  2. [DebugInfo] Fix truncation of call site immediates (detail)
  3. [llvm-size] Tidy up error messages (PR42970) (detail)
  4. [AArch64] Stackframe accesses to SVE objects. (detail)
  5. [Alignment][NFC] Move and type functions from MathExtras to Alignment (detail)
  6. [RISCV] enable LTO support, pass some options to linker. (detail)
  7. [CostModel][X86] Add CTPOP scalar costs (PR43656) (detail)
  8. minidump: Use yaml for memory info tests (detail)
  9. [ARM] Add some VMOVN tests. NFC (detail)
  10. [libc++][test] Silence more warnings in variant tests (detail)
  11. [x86] add tests for possible select to sra transforms; NFC (detail)
  12. Revert r374771 "[llvm-size] Tidy up error messages (PR42970)" (detail)
  13. [ARM] Selection for MVE VMOVN (detail)
  14. [IRBuilder] Update IRBuilder::CreateFNeg(...) to return a UnaryOperator (detail)
  15. [x86] adjust select to sra tests; NFC (detail)

Started by upstream project relay-test-suite-verify-machineinstrs build number 6454
originally caused by:

This run spent:

  • 5 sec waiting;
  • 38 min build duration;
  • 38 min total from scheduled to completion.
Revision: ee86804cf1bc7f9d9935261231b95e8f30dd7c03
  • detached

Identified problems

Ninja target failed

Below is a link to the first failed ninja target.
Indication 1

Compile Error

This build failed because of a compile error. Below is a list of all errors in the build log:
Indication 2