Started 1 mo 3 days ago
Took 1 hr 3 min

Failed Build clang-d329607-g078bec6c48d-t2928-b2928.tar.gz (Oct 14, 2019 8:50:54 PM)

Issues

Found 3 issues:
Ninja target: oggenc.c.o
[7633/8583] /Users/buildslave/jenkins/workspace/test-suite-verify-machineinstrs-aarch64-O3/test-suite-build/tools/timeit --summary MultiSource/Benchmarks/DOE-ProxyApps-C++/CLAMR/CMakeFiles/CLAMR.dir/Function.cc.o.time /Users/buildslave/jenkins/workspace/test-suite-verify-machineinstrs-aarch64-O3/compiler/bin/clang++  -DNDEBUG  -B /Applications/Xcode.app/Contents/Developer/Toolchains/XcodeDefault.xctoolchain/usr/bin    -Wno-unused-command-line-argument -mllvm -verify-machineinstrs -O3 -arch arm64 -isysroot /Applications/Xcode.app/Contents/Developer/Platforms/iPhoneOS.platform/Developer/SDKs/iPhoneOS12.1.sdk   -w -Werror=date-time -MD -MT MultiSource/Benchmarks/DOE-ProxyApps-C++/CLAMR/CMakeFiles/CLAMR.dir/Function.cc.o -MF MultiSource/Benchmarks/DOE-ProxyApps-C++/CLAMR/CMakeFiles/CLAMR.dir/Function.cc.o.d -o MultiSource/Benchmarks/DOE-ProxyApps-C++/CLAMR/CMakeFiles/CLAMR.dir/Function.cc.o -c /Users/buildslave/jenkins/workspace/test-suite-verify-machineinstrs-aarch64-O3/test-suite/MultiSource/Benchmarks/DOE-ProxyApps-C++/CLAMR/Function.cc
[7634/8583] /Users/buildslave/jenkins/workspace/test-suite-verify-machineinstrs-aarch64-O3/test-suite-build/tools/timeit --summary MultiSource/Benchmarks/DOE-ProxyApps-C++/CLAMR/CMakeFiles/CLAMR.dir/KDTree.c.o.time /Users/buildslave/jenkins/workspace/test-suite-verify-machineinstrs-aarch64-O3/compiler/bin/clang -DNDEBUG  -B /Applications/Xcode.app/Contents/Developer/Toolchains/XcodeDefault.xctoolchain/usr/bin    -Wno-unused-command-line-argument -mllvm -verify-machineinstrs -O3 -arch arm64 -isysroot /Applications/Xcode.app/Contents/Developer/Platforms/iPhoneOS.platform/Developer/SDKs/iPhoneOS12.1.sdk   -w -Werror=date-time -MD -MT MultiSource/Benchmarks/DOE-ProxyApps-C++/CLAMR/CMakeFiles/CLAMR.dir/KDTree.c.o -MF MultiSource/Benchmarks/DOE-ProxyApps-C++/CLAMR/CMakeFiles/CLAMR.dir/KDTree.c.o.d -o MultiSource/Benchmarks/DOE-ProxyApps-C++/CLAMR/CMakeFiles/CLAMR.dir/KDTree.c.o   -c /Users/buildslave/jenkins/workspace/test-suite-verify-machineinstrs-aarch64-O3/test-suite/MultiSource/Benchmarks/DOE-ProxyApps-C++/CLAMR/KDTree.c
[7635/8583] /Users/buildslave/jenkins/workspace/test-suite-verify-machineinstrs-aarch64-O3/test-suite-build/tools/timeit --summary MultiSource/Benchmarks/DOE-ProxyApps-C++/miniFE/CMakeFiles/miniFE.dir/main.cpp.o.time /Users/buildslave/jenkins/workspace/test-suite-verify-machineinstrs-aarch64-O3/compiler/bin/clang++  -DNDEBUG -I/Users/buildslave/jenkins/workspace/test-suite-verify-machineinstrs-aarch64-O3/test-suite/MultiSource/Benchmarks/DOE-ProxyApps-C++/miniFE -B /Applications/Xcode.app/Contents/Developer/Toolchains/XcodeDefault.xctoolchain/usr/bin    -Wno-unused-command-line-argument -mllvm -verify-machineinstrs -O3 -arch arm64 -isysroot /Applications/Xcode.app/Contents/Developer/Platforms/iPhoneOS.platform/Developer/SDKs/iPhoneOS12.1.sdk   -w -Werror=date-time -I. -DMINIFE_SCALAR=double -DMINIFE_LOCAL_ORDINAL=int -DMINIFE_GLOBAL_ORDINAL=int -DMINIFE_CSR_MATRIX -DREDSTORM -MD -MT MultiSource/Benchmarks/DOE-ProxyApps-C++/miniFE/CMakeFiles/miniFE.dir/main.cpp.o -MF MultiSource/Benchmarks/DOE-ProxyApps-C++/miniFE/CMakeFiles/miniFE.dir/main.cpp.o.d -o MultiSource/Benchmarks/DOE-ProxyApps-C++/miniFE/CMakeFiles/miniFE.dir/main.cpp.o -c /Users/buildslave/jenkins/workspace/test-suite-verify-machineinstrs-aarch64-O3/test-suite/MultiSource/Benchmarks/DOE-ProxyApps-C++/miniFE/main.cpp
[7636/8583] : && /Users/buildslave/jenkins/workspace/test-suite-verify-machineinstrs-aarch64-O3/test-suite-build/tools/timeit --summary MultiSource/Benchmarks/DOE-ProxyApps-C++/miniFE/miniFE.link.time /Users/buildslave/jenkins/workspace/test-suite-verify-machineinstrs-aarch64-O3/compiler/bin/clang++  -B /Applications/Xcode.app/Contents/Developer/Toolchains/XcodeDefault.xctoolchain/usr/bin    -Wno-unused-command-line-argument -mllvm -verify-machineinstrs -O3 -arch arm64 -isysroot /Applications/Xcode.app/Contents/Developer/Platforms/iPhoneOS.platform/Developer/SDKs/iPhoneOS12.1.sdk -Wl,-search_paths_first -Wl,-headerpad_max_install_names -B /Applications/Xcode.app/Contents/Developer/Toolchains/XcodeDefault.xctoolchain/usr/bin MultiSource/Benchmarks/DOE-ProxyApps-C++/miniFE/CMakeFiles/miniFE.dir/BoxPartition.cpp.o MultiSource/Benchmarks/DOE-ProxyApps-C++/miniFE/CMakeFiles/miniFE.dir/YAML_Doc.cpp.o MultiSource/Benchmarks/DOE-ProxyApps-C++/miniFE/CMakeFiles/miniFE.dir/YAML_Element.cpp.o MultiSource/Benchmarks/DOE-ProxyApps-C++/miniFE/CMakeFiles/miniFE.dir/main.cpp.o MultiSource/Benchmarks/DOE-ProxyApps-C++/miniFE/CMakeFiles/miniFE.dir/mytimer.cpp.o MultiSource/Benchmarks/DOE-ProxyApps-C++/miniFE/CMakeFiles/miniFE.dir/param_utils.cpp.o MultiSource/Benchmarks/DOE-ProxyApps-C++/miniFE/CMakeFiles/miniFE.dir/utils.cpp.o  -o MultiSource/Benchmarks/DOE-ProxyApps-C++/miniFE/miniFE  -lm && cd /Users/buildslave/jenkins/workspace/test-suite-verify-machineinstrs-aarch64-O3/test-suite-build/MultiSource/Benchmarks/DOE-ProxyApps-C++/miniFE && /usr/local/Cellar/cmake/3.13.1/bin/cmake -E create_symlink /Users/buildslave/jenkins/workspace/test-suite-verify-machineinstrs-aarch64-O3/test-suite/MultiSource/Benchmarks/DOE-ProxyApps-C++/miniFE/miniFE.reference_output /Users/buildslave/jenkins/workspace/test-suite-verify-machineinstrs-aarch64-O3/test-suite-build/MultiSource/Benchmarks/DOE-ProxyApps-C++/miniFE/miniFE.reference_output
[7637/8583] /Users/buildslave/jenkins/workspace/test-suite-verify-machineinstrs-aarch64-O3/test-suite-build/tools/timeit --summary MultiSource/Applications/oggenc/CMakeFiles/oggenc.dir/oggenc.c.o.time /Users/buildslave/jenkins/workspace/test-suite-verify-machineinstrs-aarch64-O3/compiler/bin/clang -DNDEBUG  -B /Applications/Xcode.app/Contents/Developer/Toolchains/XcodeDefault.xctoolchain/usr/bin    -Wno-unused-command-line-argument -mllvm -verify-machineinstrs -O3 -arch arm64 -isysroot /Applications/Xcode.app/Contents/Developer/Platforms/iPhoneOS.platform/Developer/SDKs/iPhoneOS12.1.sdk   -w -Werror=date-time -fno-strict-aliasing -MD -MT MultiSource/Applications/oggenc/CMakeFiles/oggenc.dir/oggenc.c.o -MF MultiSource/Applications/oggenc/CMakeFiles/oggenc.dir/oggenc.c.o.d -o MultiSource/Applications/oggenc/CMakeFiles/oggenc.dir/oggenc.c.o   -c /Users/buildslave/jenkins/workspace/test-suite-verify-machineinstrs-aarch64-O3/test-suite/MultiSource/Applications/oggenc/oggenc.c
FAILED: MultiSource/Applications/oggenc/CMakeFiles/oggenc.dir/oggenc.c.o 
/Users/buildslave/jenkins/workspace/test-suite-verify-machineinstrs-aarch64-O3/test-suite-build/tools/timeit --summary MultiSource/Applications/oggenc/CMakeFiles/oggenc.dir/oggenc.c.o.time /Users/buildslave/jenkins/workspace/test-suite-verify-machineinstrs-aarch64-O3/compiler/bin/clang -DNDEBUG  -B /Applications/Xcode.app/Contents/Developer/Toolchains/XcodeDefault.xctoolchain/usr/bin    -Wno-unused-command-line-argument -mllvm -verify-machineinstrs -O3 -arch arm64 -isysroot /Applications/Xcode.app/Contents/Developer/Platforms/iPhoneOS.platform/Developer/SDKs/iPhoneOS12.1.sdk   -w -Werror=date-time -fno-strict-aliasing -MD -MT MultiSource/Applications/oggenc/CMakeFiles/oggenc.dir/oggenc.c.o -MF MultiSource/Applications/oggenc/CMakeFiles/oggenc.dir/oggenc.c.o.d -o MultiSource/Applications/oggenc/CMakeFiles/oggenc.dir/oggenc.c.o   -c /Users/buildslave/jenkins/workspace/test-suite-verify-machineinstrs-aarch64-O3/test-suite/MultiSource/Applications/oggenc/oggenc.c
clang-10: error: unable to execute command: Killed: 9
Error: unable to execute command: Killed: 9
[7635/8583] /Users/buildslave/jenkins/workspace/test-suite-verify-machineinstrs-aarch64-O3/test-suite-build/tools/timeit --summary MultiSource/Benchmarks/DOE-ProxyApps-C++/miniFE/CMakeFiles/miniFE.dir/main.cpp.o.time /Users/buildslave/jenkins/workspace/test-suite-verify-machineinstrs-aarch64-O3/compiler/bin/clang++  -DNDEBUG -I/Users/buildslave/jenkins/workspace/test-suite-verify-machineinstrs-aarch64-O3/test-suite/MultiSource/Benchmarks/DOE-ProxyApps-C++/miniFE -B /Applications/Xcode.app/Contents/Developer/Toolchains/XcodeDefault.xctoolchain/usr/bin    -Wno-unused-command-line-argument -mllvm -verify-machineinstrs -O3 -arch arm64 -isysroot /Applications/Xcode.app/Contents/Developer/Platforms/iPhoneOS.platform/Developer/SDKs/iPhoneOS12.1.sdk   -w -Werror=date-time -I. -DMINIFE_SCALAR=double -DMINIFE_LOCAL_ORDINAL=int -DMINIFE_GLOBAL_ORDINAL=int -DMINIFE_CSR_MATRIX -DREDSTORM -MD -MT MultiSource/Benchmarks/DOE-ProxyApps-C++/miniFE/CMakeFiles/miniFE.dir/main.cpp.o -MF MultiSource/Benchmarks/DOE-ProxyApps-C++/miniFE/CMakeFiles/miniFE.dir/main.cpp.o.d -o MultiSource/Benchmarks/DOE-ProxyApps-C++/miniFE/CMakeFiles/miniFE.dir/main.cpp.o -c /Users/buildslave/jenkins/workspace/test-suite-verify-machineinstrs-aarch64-O3/test-suite/MultiSource/Benchmarks/DOE-ProxyApps-C++/miniFE/main.cpp
[7636/8583] : && /Users/buildslave/jenkins/workspace/test-suite-verify-machineinstrs-aarch64-O3/test-suite-build/tools/timeit --summary MultiSource/Benchmarks/DOE-ProxyApps-C++/miniFE/miniFE.link.time /Users/buildslave/jenkins/workspace/test-suite-verify-machineinstrs-aarch64-O3/compiler/bin/clang++  -B /Applications/Xcode.app/Contents/Developer/Toolchains/XcodeDefault.xctoolchain/usr/bin    -Wno-unused-command-line-argument -mllvm -verify-machineinstrs -O3 -arch arm64 -isysroot /Applications/Xcode.app/Contents/Developer/Platforms/iPhoneOS.platform/Developer/SDKs/iPhoneOS12.1.sdk -Wl,-search_paths_first -Wl,-headerpad_max_install_names -B /Applications/Xcode.app/Contents/Developer/Toolchains/XcodeDefault.xctoolchain/usr/bin MultiSource/Benchmarks/DOE-ProxyApps-C++/miniFE/CMakeFiles/miniFE.dir/BoxPartition.cpp.o MultiSource/Benchmarks/DOE-ProxyApps-C++/miniFE/CMakeFiles/miniFE.dir/YAML_Doc.cpp.o MultiSource/Benchmarks/DOE-ProxyApps-C++/miniFE/CMakeFiles/miniFE.dir/YAML_Element.cpp.o MultiSource/Benchmarks/DOE-ProxyApps-C++/miniFE/CMakeFiles/miniFE.dir/main.cpp.o MultiSource/Benchmarks/DOE-ProxyApps-C++/miniFE/CMakeFiles/miniFE.dir/mytimer.cpp.o MultiSource/Benchmarks/DOE-ProxyApps-C++/miniFE/CMakeFiles/miniFE.dir/param_utils.cpp.o MultiSource/Benchmarks/DOE-ProxyApps-C++/miniFE/CMakeFiles/miniFE.dir/utils.cpp.o  -o MultiSource/Benchmarks/DOE-ProxyApps-C++/miniFE/miniFE  -lm && cd /Users/buildslave/jenkins/workspace/test-suite-verify-machineinstrs-aarch64-O3/test-suite-build/MultiSource/Benchmarks/DOE-ProxyApps-C++/miniFE && /usr/local/Cellar/cmake/3.13.1/bin/cmake -E create_symlink /Users/buildslave/jenkins/workspace/test-suite-verify-machineinstrs-aarch64-O3/test-suite/MultiSource/Benchmarks/DOE-ProxyApps-C++/miniFE/miniFE.reference_output /Users/buildslave/jenkins/workspace/test-suite-verify-machineinstrs-aarch64-O3/test-suite-build/MultiSource/Benchmarks/DOE-ProxyApps-C++/miniFE/miniFE.reference_output
[7637/8583] /Users/buildslave/jenkins/workspace/test-suite-verify-machineinstrs-aarch64-O3/test-suite-build/tools/timeit --summary MultiSource/Applications/oggenc/CMakeFiles/oggenc.dir/oggenc.c.o.time /Users/buildslave/jenkins/workspace/test-suite-verify-machineinstrs-aarch64-O3/compiler/bin/clang -DNDEBUG  -B /Applications/Xcode.app/Contents/Developer/Toolchains/XcodeDefault.xctoolchain/usr/bin    -Wno-unused-command-line-argument -mllvm -verify-machineinstrs -O3 -arch arm64 -isysroot /Applications/Xcode.app/Contents/Developer/Platforms/iPhoneOS.platform/Developer/SDKs/iPhoneOS12.1.sdk   -w -Werror=date-time -fno-strict-aliasing -MD -MT MultiSource/Applications/oggenc/CMakeFiles/oggenc.dir/oggenc.c.o -MF MultiSource/Applications/oggenc/CMakeFiles/oggenc.dir/oggenc.c.o.d -o MultiSource/Applications/oggenc/CMakeFiles/oggenc.dir/oggenc.c.o   -c /Users/buildslave/jenkins/workspace/test-suite-verify-machineinstrs-aarch64-O3/test-suite/MultiSource/Applications/oggenc/oggenc.c
FAILED: MultiSource/Applications/oggenc/CMakeFiles/oggenc.dir/oggenc.c.o 
/Users/buildslave/jenkins/workspace/test-suite-verify-machineinstrs-aarch64-O3/test-suite-build/tools/timeit --summary MultiSource/Applications/oggenc/CMakeFiles/oggenc.dir/oggenc.c.o.time /Users/buildslave/jenkins/workspace/test-suite-verify-machineinstrs-aarch64-O3/compiler/bin/clang -DNDEBUG  -B /Applications/Xcode.app/Contents/Developer/Toolchains/XcodeDefault.xctoolchain/usr/bin    -Wno-unused-command-line-argument -mllvm -verify-machineinstrs -O3 -arch arm64 -isysroot /Applications/Xcode.app/Contents/Developer/Platforms/iPhoneOS.platform/Developer/SDKs/iPhoneOS12.1.sdk   -w -Werror=date-time -fno-strict-aliasing -MD -MT MultiSource/Applications/oggenc/CMakeFiles/oggenc.dir/oggenc.c.o -MF MultiSource/Applications/oggenc/CMakeFiles/oggenc.dir/oggenc.c.o.d -o MultiSource/Applications/oggenc/CMakeFiles/oggenc.dir/oggenc.c.o   -c /Users/buildslave/jenkins/workspace/test-suite-verify-machineinstrs-aarch64-O3/test-suite/MultiSource/Applications/oggenc/oggenc.c
clang-10: error: unable to execute command: Killed: 9
clang-10: error: clang frontend command failed due to signal (use -v to see invocation)
clang version 10.0.0 (https://github.com/llvm/llvm-project.git 078bec6c48dd9d17ab9720897d2bb7ccbb886763)
Error: clang frontend command failed due to signal (use -v to see invocation)
[7636/8583] : && /Users/buildslave/jenkins/workspace/test-suite-verify-machineinstrs-aarch64-O3/test-suite-build/tools/timeit --summary MultiSource/Benchmarks/DOE-ProxyApps-C++/miniFE/miniFE.link.time /Users/buildslave/jenkins/workspace/test-suite-verify-machineinstrs-aarch64-O3/compiler/bin/clang++  -B /Applications/Xcode.app/Contents/Developer/Toolchains/XcodeDefault.xctoolchain/usr/bin    -Wno-unused-command-line-argument -mllvm -verify-machineinstrs -O3 -arch arm64 -isysroot /Applications/Xcode.app/Contents/Developer/Platforms/iPhoneOS.platform/Developer/SDKs/iPhoneOS12.1.sdk -Wl,-search_paths_first -Wl,-headerpad_max_install_names -B /Applications/Xcode.app/Contents/Developer/Toolchains/XcodeDefault.xctoolchain/usr/bin MultiSource/Benchmarks/DOE-ProxyApps-C++/miniFE/CMakeFiles/miniFE.dir/BoxPartition.cpp.o MultiSource/Benchmarks/DOE-ProxyApps-C++/miniFE/CMakeFiles/miniFE.dir/YAML_Doc.cpp.o MultiSource/Benchmarks/DOE-ProxyApps-C++/miniFE/CMakeFiles/miniFE.dir/YAML_Element.cpp.o MultiSource/Benchmarks/DOE-ProxyApps-C++/miniFE/CMakeFiles/miniFE.dir/main.cpp.o MultiSource/Benchmarks/DOE-ProxyApps-C++/miniFE/CMakeFiles/miniFE.dir/mytimer.cpp.o MultiSource/Benchmarks/DOE-ProxyApps-C++/miniFE/CMakeFiles/miniFE.dir/param_utils.cpp.o MultiSource/Benchmarks/DOE-ProxyApps-C++/miniFE/CMakeFiles/miniFE.dir/utils.cpp.o  -o MultiSource/Benchmarks/DOE-ProxyApps-C++/miniFE/miniFE  -lm && cd /Users/buildslave/jenkins/workspace/test-suite-verify-machineinstrs-aarch64-O3/test-suite-build/MultiSource/Benchmarks/DOE-ProxyApps-C++/miniFE && /usr/local/Cellar/cmake/3.13.1/bin/cmake -E create_symlink /Users/buildslave/jenkins/workspace/test-suite-verify-machineinstrs-aarch64-O3/test-suite/MultiSource/Benchmarks/DOE-ProxyApps-C++/miniFE/miniFE.reference_output /Users/buildslave/jenkins/workspace/test-suite-verify-machineinstrs-aarch64-O3/test-suite-build/MultiSource/Benchmarks/DOE-ProxyApps-C++/miniFE/miniFE.reference_output
[7637/8583] /Users/buildslave/jenkins/workspace/test-suite-verify-machineinstrs-aarch64-O3/test-suite-build/tools/timeit --summary MultiSource/Applications/oggenc/CMakeFiles/oggenc.dir/oggenc.c.o.time /Users/buildslave/jenkins/workspace/test-suite-verify-machineinstrs-aarch64-O3/compiler/bin/clang -DNDEBUG  -B /Applications/Xcode.app/Contents/Developer/Toolchains/XcodeDefault.xctoolchain/usr/bin    -Wno-unused-command-line-argument -mllvm -verify-machineinstrs -O3 -arch arm64 -isysroot /Applications/Xcode.app/Contents/Developer/Platforms/iPhoneOS.platform/Developer/SDKs/iPhoneOS12.1.sdk   -w -Werror=date-time -fno-strict-aliasing -MD -MT MultiSource/Applications/oggenc/CMakeFiles/oggenc.dir/oggenc.c.o -MF MultiSource/Applications/oggenc/CMakeFiles/oggenc.dir/oggenc.c.o.d -o MultiSource/Applications/oggenc/CMakeFiles/oggenc.dir/oggenc.c.o   -c /Users/buildslave/jenkins/workspace/test-suite-verify-machineinstrs-aarch64-O3/test-suite/MultiSource/Applications/oggenc/oggenc.c
FAILED: MultiSource/Applications/oggenc/CMakeFiles/oggenc.dir/oggenc.c.o 
/Users/buildslave/jenkins/workspace/test-suite-verify-machineinstrs-aarch64-O3/test-suite-build/tools/timeit --summary MultiSource/Applications/oggenc/CMakeFiles/oggenc.dir/oggenc.c.o.time /Users/buildslave/jenkins/workspace/test-suite-verify-machineinstrs-aarch64-O3/compiler/bin/clang -DNDEBUG  -B /Applications/Xcode.app/Contents/Developer/Toolchains/XcodeDefault.xctoolchain/usr/bin    -Wno-unused-command-line-argument -mllvm -verify-machineinstrs -O3 -arch arm64 -isysroot /Applications/Xcode.app/Contents/Developer/Platforms/iPhoneOS.platform/Developer/SDKs/iPhoneOS12.1.sdk   -w -Werror=date-time -fno-strict-aliasing -MD -MT MultiSource/Applications/oggenc/CMakeFiles/oggenc.dir/oggenc.c.o -MF MultiSource/Applications/oggenc/CMakeFiles/oggenc.dir/oggenc.c.o.d -o MultiSource/Applications/oggenc/CMakeFiles/oggenc.dir/oggenc.c.o   -c /Users/buildslave/jenkins/workspace/test-suite-verify-machineinstrs-aarch64-O3/test-suite/MultiSource/Applications/oggenc/oggenc.c
clang-10: error: unable to execute command: Killed: 9
clang-10: error: clang frontend command failed due to signal (use -v to see invocation)
clang version 10.0.0 (https://github.com/llvm/llvm-project.git 078bec6c48dd9d17ab9720897d2bb7ccbb886763)
Target: aarch64-apple-darwin18.0.0

Build Log

Changes
  1. Revert "Dead Virtual Function Elimination" (detail)
  2. fix (detail)
  3. [lit] Add argument check: --timeout must be non-negative integer (detail)
  4. [X86] Add encoding tests for avx512pf vgatherpf/vscatterpf instructions. (detail)
  5. [X86] Teach X86MCodeEmitter to properly encode zmm16-zmm31 as index (detail)
  6. [MemorySSA] Update for partial unswitch. (detail)
  7. Revert [InstCombine] fold a shifted bool zext to a select (detail)
  8. Revert "fix" (detail)
  9. [lldb-server/android] Show more processes by relaxing some checks (detail)
  10. [libc++][test] Use <version> to get config on MSVC (detail)
  11. [WebAssembly] Trapping fptoint builtins and intrinsics (detail)
  12. [RISCV] Support fast calling convention (detail)

Started by upstream project relay-test-suite-verify-machineinstrs build number 6460
originally caused by:

This run spent:

  • 5.8 sec waiting;
  • 1 hr 3 min build duration;
  • 1 hr 3 min total from scheduled to completion.
Revision: 078bec6c48dd9d17ab9720897d2bb7ccbb886763
  • detached

Identified problems

Ninja target failed

Below is a link to the first failed ninja target.
Indication 1

Compile Error

This build failed because of a compile error. Below is a list of all errors in the build log:
Indication 2