FailedConsole Output

Skipping 8,378 KB.. Full Log
n-x86_64-Darwin :: Posix/sanitizer_set_report_fd_test.cpp (3026 of 4717)
UNSUPPORTED: SanitizerCommon-lsan-x86_64-Darwin :: Posix/vis.cpp (3027 of 4717)
PASS: SanitizerCommon-lsan-x86_64-Darwin :: Posix/posix_memalign-alignment.cpp (3028 of 4717)
UNSUPPORTED: SanitizerCommon-lsan-x86_64-Darwin :: Posix/wcsxfrm.c (3029 of 4717)
PASS: SanitizerCommon-lsan-x86_64-Darwin :: Posix/wcsdup.c (3030 of 4717)
PASS: SanitizerCommon-lsan-x86_64-Darwin :: Posix/sysctl.cpp (3031 of 4717)
UNSUPPORTED: SanitizerCommon-lsan-x86_64-Darwin :: corelimit.cpp (3032 of 4717)
XFAIL: SanitizerCommon-lsan-x86_64-Darwin :: Posix/weak_hook_test.cpp (3033 of 4717)
PASS: SanitizerCommon-lsan-x86_64-Darwin :: ctype.c (3034 of 4717)
PASS: SanitizerCommon-lsan-x86_64-Darwin :: fopen_nullptr.c (3035 of 4717)
UNSUPPORTED: SanitizerCommon-lsan-x86_64-Darwin :: hard_rss_limit_mb_test.cpp (3036 of 4717)
PASS: SanitizerCommon-lsan-x86_64-Darwin :: malloc_hook.cpp (3037 of 4717)
PASS: SanitizerCommon-lsan-x86_64-Darwin :: options-help.cpp (3038 of 4717)
PASS: SanitizerCommon-lsan-x86_64-Darwin :: options-include.cpp (3039 of 4717)
PASS: SanitizerCommon-lsan-x86_64-Darwin :: options-invalid.cpp (3040 of 4717)
UNSUPPORTED: SanitizerCommon-lsan-x86_64-Darwin :: print-stack-trace.cpp (3041 of 4717)
PASS: SanitizerCommon-lsan-x86_64-Darwin :: printf-ldbl.c (3042 of 4717)
PASS: SanitizerCommon-lsan-x86_64-Darwin :: get_module_and_offset_for_pc.cpp (3043 of 4717)
UNSUPPORTED: SanitizerCommon-lsan-x86_64-Darwin :: reallocarray-overflow.cpp (3044 of 4717)
PASS: SanitizerCommon-lsan-x86_64-Darwin :: pthread_mutexattr_get.cpp (3045 of 4717)
PASS: SanitizerCommon-lsan-x86_64-Darwin :: sanitizer_coverage_no_prune.cpp (3046 of 4717)
PASS: SanitizerCommon-lsan-x86_64-Darwin :: sanitizer_coverage_inline8bit_counter.cpp (3047 of 4717)
UNSUPPORTED: SanitizerCommon-lsan-x86_64-Darwin :: sanitizer_coverage_symbolize.cpp (3048 of 4717)
XFAIL: SanitizerCommon-lsan-x86_64-Darwin :: sanitizer_coverage_trace_pc_guard-dso.cpp (3049 of 4717)
UNSUPPORTED: SanitizerCommon-lsan-x86_64-Darwin :: sanitizer_coverage_trace_pc_guard-init.cpp (3050 of 4717)
PASS: SanitizerCommon-lsan-x86_64-Darwin :: sanitizer_coverage_stack_depth.cpp (3051 of 4717)
PASS: SanitizerCommon-lsan-x86_64-Darwin :: sanitizer_coverage_trace_pc_guard.cpp (3052 of 4717)
PASS: SanitizerCommon-lsan-x86_64-Darwin :: scanf-ldbl.c (3053 of 4717)
PASS: SanitizerCommon-lsan-x86_64-Darwin :: strcasestr.c (3054 of 4717)
PASS: SanitizerCommon-lsan-x86_64-Darwin :: strcspn.c (3055 of 4717)
PASS: SanitizerCommon-lsan-x86_64-Darwin :: strnlen.c (3056 of 4717)
PASS: SanitizerCommon-lsan-x86_64-Darwin :: strpbrk.c (3057 of 4717)
PASS: SanitizerCommon-lsan-x86_64-Darwin :: strspn.c (3058 of 4717)
PASS: SanitizerCommon-lsan-x86_64-Darwin :: strstr.c (3059 of 4717)
PASS: SanitizerCommon-lsan-x86_64-Darwin :: symbolize_pc.cpp (3060 of 4717)
XFAIL: SanitizerCommon-lsan-x86_64-Darwin :: symbolize_pc_inline.cpp (3061 of 4717)
PASS: SanitizerCommon-lsan-x86_64-Darwin :: wcrtomb.c (3062 of 4717)
PASS: SanitizerCommon-lsan-x86_64-Darwin :: allocator_returns_null.cpp (3063 of 4717)
PASS: SanitizerCommon-lsan-x86_64-Darwin :: wctomb.c (3064 of 4717)
PASS: SanitizerCommon-tsan-x86_64-Darwin :: Darwin/fputs_puts_null.cpp (3065 of 4717)
XFAIL: SanitizerCommon-lsan-x86_64-Darwin :: symbolize_stack.cpp (3066 of 4717)
PASS: SanitizerCommon-tsan-x86_64-Darwin :: Darwin/abort_on_error.cpp (3067 of 4717)
UNSUPPORTED: SanitizerCommon-tsan-x86_64-Darwin :: FreeBSD/capsicum.cpp (3068 of 4717)
UNSUPPORTED: SanitizerCommon-tsan-x86_64-Darwin :: FreeBSD/fdevname.cpp (3069 of 4717)
UNSUPPORTED: SanitizerCommon-tsan-x86_64-Darwin :: Linux/abort_on_error.cpp (3070 of 4717)
UNSUPPORTED: SanitizerCommon-tsan-x86_64-Darwin :: Linux/aligned_alloc-alignment.cpp (3071 of 4717)
UNSUPPORTED: SanitizerCommon-tsan-x86_64-Darwin :: Linux/aligned_alloc.c (3072 of 4717)
UNSUPPORTED: SanitizerCommon-tsan-x86_64-Darwin :: Linux/allow_user_segv.cpp (3073 of 4717)
UNSUPPORTED: SanitizerCommon-tsan-x86_64-Darwin :: Linux/assert.cpp (3074 of 4717)
UNSUPPORTED: SanitizerCommon-tsan-x86_64-Darwin :: Linux/clock_gettime.c (3075 of 4717)
UNSUPPORTED: SanitizerCommon-tsan-x86_64-Darwin :: Linux/closedir.c (3076 of 4717)
UNSUPPORTED: SanitizerCommon-tsan-x86_64-Darwin :: Linux/decorate_proc_maps.cpp (3077 of 4717)
UNSUPPORTED: SanitizerCommon-tsan-x86_64-Darwin :: Linux/deepbind.cpp (3078 of 4717)
UNSUPPORTED: SanitizerCommon-tsan-x86_64-Darwin :: Linux/getpwnam_r_invalid_user.cpp (3079 of 4717)
UNSUPPORTED: SanitizerCommon-tsan-x86_64-Darwin :: Linux/getrandom.cpp (3080 of 4717)
UNSUPPORTED: SanitizerCommon-tsan-x86_64-Darwin :: Linux/iconv_test.c (3081 of 4717)
UNSUPPORTED: SanitizerCommon-tsan-x86_64-Darwin :: Linux/ill.cpp (3082 of 4717)
UNSUPPORTED: SanitizerCommon-tsan-x86_64-Darwin :: Linux/mallopt.cpp (3083 of 4717)
UNSUPPORTED: SanitizerCommon-tsan-x86_64-Darwin :: Linux/mlock_test.cpp (3084 of 4717)
UNSUPPORTED: SanitizerCommon-tsan-x86_64-Darwin :: Linux/mmap64_test.c (3085 of 4717)
UNSUPPORTED: SanitizerCommon-tsan-x86_64-Darwin :: Linux/mmap_write_exec.cpp (3086 of 4717)
UNSUPPORTED: SanitizerCommon-tsan-x86_64-Darwin :: Linux/mprobe.cpp (3087 of 4717)
UNSUPPORTED: SanitizerCommon-tsan-x86_64-Darwin :: Linux/name_to_handle_at.cpp (3088 of 4717)
UNSUPPORTED: SanitizerCommon-tsan-x86_64-Darwin :: Linux/new_delete_test.cpp (3089 of 4717)
UNSUPPORTED: SanitizerCommon-tsan-x86_64-Darwin :: Linux/open_memstream.cpp (3090 of 4717)
UNSUPPORTED: SanitizerCommon-tsan-x86_64-Darwin :: Linux/pthread_mutex.cpp (3091 of 4717)
UNSUPPORTED: SanitizerCommon-tsan-x86_64-Darwin :: Linux/ptrace.cpp (3092 of 4717)
UNSUPPORTED: SanitizerCommon-tsan-x86_64-Darwin :: Linux/pvalloc-overflow.cpp (3093 of 4717)
UNSUPPORTED: SanitizerCommon-tsan-x86_64-Darwin :: Linux/recv_msg_trunc.cpp (3094 of 4717)
UNSUPPORTED: SanitizerCommon-tsan-x86_64-Darwin :: Linux/sched_getparam.cpp (3095 of 4717)
UNSUPPORTED: SanitizerCommon-tsan-x86_64-Darwin :: Linux/sem_init_glibc.cpp (3096 of 4717)
UNSUPPORTED: SanitizerCommon-tsan-x86_64-Darwin :: Linux/signal_segv_handler.cpp (3097 of 4717)
UNSUPPORTED: SanitizerCommon-tsan-x86_64-Darwin :: Linux/soft_rss_limit_mb_test.cpp (3098 of 4717)
UNSUPPORTED: SanitizerCommon-tsan-x86_64-Darwin :: Linux/sysconf_interceptor_bypass_test.cpp (3099 of 4717)
UNSUPPORTED: SanitizerCommon-tsan-x86_64-Darwin :: Linux/timerfd.cpp (3100 of 4717)
UNSUPPORTED: SanitizerCommon-tsan-x86_64-Darwin :: Linux/unexpected_format_specifier_test.cpp (3101 of 4717)
UNSUPPORTED: SanitizerCommon-tsan-x86_64-Darwin :: NetBSD/asysctl.cpp (3102 of 4717)
UNSUPPORTED: SanitizerCommon-tsan-x86_64-Darwin :: NetBSD/cdb.cpp (3103 of 4717)
UNSUPPORTED: SanitizerCommon-tsan-x86_64-Darwin :: NetBSD/faccessat.cpp (3104 of 4717)
UNSUPPORTED: SanitizerCommon-tsan-x86_64-Darwin :: NetBSD/fparseln.cpp (3105 of 4717)
UNSUPPORTED: SanitizerCommon-tsan-x86_64-Darwin :: NetBSD/funopen2.cpp (3106 of 4717)
UNSUPPORTED: SanitizerCommon-tsan-x86_64-Darwin :: NetBSD/getgrouplist.cpp (3107 of 4717)
UNSUPPORTED: SanitizerCommon-tsan-x86_64-Darwin :: NetBSD/getgroupmembership.cpp (3108 of 4717)
UNSUPPORTED: SanitizerCommon-tsan-x86_64-Darwin :: NetBSD/getvfsstat.cpp (3109 of 4717)
UNSUPPORTED: SanitizerCommon-tsan-x86_64-Darwin :: NetBSD/gid_from_group.cpp (3110 of 4717)
UNSUPPORTED: SanitizerCommon-tsan-x86_64-Darwin :: NetBSD/group_from_gid.cpp (3111 of 4717)
UNSUPPORTED: SanitizerCommon-tsan-x86_64-Darwin :: NetBSD/md2.cpp (3112 of 4717)
UNSUPPORTED: SanitizerCommon-tsan-x86_64-Darwin :: NetBSD/md4.cpp (3113 of 4717)
UNSUPPORTED: SanitizerCommon-tsan-x86_64-Darwin :: NetBSD/md5.cpp (3114 of 4717)
UNSUPPORTED: SanitizerCommon-tsan-x86_64-Darwin :: NetBSD/mi_vector_hash.cpp (3115 of 4717)
UNSUPPORTED: SanitizerCommon-tsan-x86_64-Darwin :: NetBSD/netent.cpp (3116 of 4717)
UNSUPPORTED: SanitizerCommon-tsan-x86_64-Darwin :: NetBSD/paccept.cpp (3117 of 4717)
UNSUPPORTED: SanitizerCommon-tsan-x86_64-Darwin :: NetBSD/protoent.cpp (3118 of 4717)
UNSUPPORTED: SanitizerCommon-tsan-x86_64-Darwin :: NetBSD/rmd160.cpp (3119 of 4717)
UNSUPPORTED: SanitizerCommon-tsan-x86_64-Darwin :: NetBSD/sha1.cpp (3120 of 4717)
UNSUPPORTED: SanitizerCommon-tsan-x86_64-Darwin :: NetBSD/sha2.cpp (3121 of 4717)
UNSUPPORTED: SanitizerCommon-tsan-x86_64-Darwin :: NetBSD/statvfs1.cpp (3122 of 4717)
UNSUPPORTED: SanitizerCommon-tsan-x86_64-Darwin :: NetBSD/strmode.cpp (3123 of 4717)
UNSUPPORTED: SanitizerCommon-tsan-x86_64-Darwin :: NetBSD/strtoi.cpp (3124 of 4717)
UNSUPPORTED: SanitizerCommon-tsan-x86_64-Darwin :: NetBSD/sysctlgetmibinfo.cpp (3125 of 4717)
UNSUPPORTED: SanitizerCommon-tsan-x86_64-Darwin :: NetBSD/ttyent.cpp (3126 of 4717)
UNSUPPORTED: SanitizerCommon-tsan-x86_64-Darwin :: NetBSD/uid_from_user.cpp (3127 of 4717)
UNSUPPORTED: SanitizerCommon-tsan-x86_64-Darwin :: NetBSD/user_from_uid.cpp (3128 of 4717)
PASS: SanitizerCommon-tsan-x86_64-Darwin :: Posix/access.cpp (3129 of 4717)
PASS: SanitizerCommon-tsan-x86_64-Darwin :: Darwin/malloc_zone.cpp (3130 of 4717)
PASS: SanitizerCommon-tsan-x86_64-Darwin :: Darwin/print-stack-trace.cpp (3131 of 4717)
PASS: SanitizerCommon-tsan-x86_64-Darwin :: Posix/arc4random.cpp (3132 of 4717)
PASS: SanitizerCommon-tsan-x86_64-Darwin :: Posix/devname.cpp (3133 of 4717)
PASS: SanitizerCommon-tsan-x86_64-Darwin :: Posix/devname_r.cpp (3134 of 4717)
UNSUPPORTED: SanitizerCommon-tsan-x86_64-Darwin :: Posix/dump_registers.cpp (3135 of 4717)
PASS: SanitizerCommon-tsan-x86_64-Darwin :: Posix/feof_fileno_ferror.cpp (3136 of 4717)
PASS: SanitizerCommon-tsan-x86_64-Darwin :: Posix/fgetc_ungetc_getc.cpp (3137 of 4717)
PASS: SanitizerCommon-tsan-x86_64-Darwin :: Posix/dump_instruction_bytes.cpp (3138 of 4717)
PASS: SanitizerCommon-tsan-x86_64-Darwin :: Posix/fgetln.cpp (3139 of 4717)
PASS: SanitizerCommon-tsan-x86_64-Darwin :: Posix/fgets.cpp (3140 of 4717)
PASS: SanitizerCommon-tsan-x86_64-Darwin :: Posix/dedup_token_length_test.cpp (3141 of 4717)
PASS: SanitizerCommon-tsan-x86_64-Darwin :: Posix/fputc_putc_putchar.cpp (3142 of 4717)
UNSUPPORTED: SanitizerCommon-tsan-x86_64-Darwin :: Posix/fseek.cpp (3143 of 4717)
UNSUPPORTED: SanitizerCommon-tsan-x86_64-Darwin :: Posix/fts.cpp (3144 of 4717)
UNSUPPORTED: SanitizerCommon-tsan-x86_64-Darwin :: Posix/funopen.cpp (3145 of 4717)
PASS: SanitizerCommon-tsan-x86_64-Darwin :: Posix/fputs_puts.cpp (3146 of 4717)
UNSUPPORTED: SanitizerCommon-tsan-x86_64-Darwin :: Posix/getfsent.cpp (3147 of 4717)
PASS: SanitizerCommon-tsan-x86_64-Darwin :: Posix/getc_unlocked.cpp (3148 of 4717)
PASS: SanitizerCommon-tsan-x86_64-Darwin :: Posix/getmntinfo.cpp (3149 of 4717)
PASS: SanitizerCommon-tsan-x86_64-Darwin :: Posix/fpe.cpp (3150 of 4717)
PASS: SanitizerCommon-tsan-x86_64-Darwin :: Posix/getusershell.cpp (3151 of 4717)
PASS: SanitizerCommon-tsan-x86_64-Darwin :: Posix/getpass.cpp (3152 of 4717)
PASS: SanitizerCommon-tsan-x86_64-Darwin :: Posix/getpw_getgr.cpp (3153 of 4717)
PASS: SanitizerCommon-tsan-x86_64-Darwin :: Posix/lstat.cpp (3154 of 4717)
PASS: SanitizerCommon-tsan-x86_64-Darwin :: Posix/illegal_read_test.cpp (3155 of 4717)
UNSUPPORTED: SanitizerCommon-tsan-x86_64-Darwin :: Posix/nl_langinfo.cpp (3156 of 4717)
PASS: SanitizerCommon-tsan-x86_64-Darwin :: Posix/illegal_write_test.cpp (3157 of 4717)
PASS: SanitizerCommon-tsan-x86_64-Darwin :: Posix/mmap_test.c (3158 of 4717)
PASS: SanitizerCommon-tsan-x86_64-Darwin :: Posix/popen.cpp (3159 of 4717)
PASS: SanitizerCommon-tsan-x86_64-Darwin :: Posix/putc_putchar_unlocked.cpp (3160 of 4717)
PASS: SanitizerCommon-tsan-x86_64-Darwin :: Posix/readlink.c (3161 of 4717)
UNSUPPORTED: SanitizerCommon-tsan-x86_64-Darwin :: Posix/regex.cpp (3162 of 4717)
PASS: SanitizerCommon-tsan-x86_64-Darwin :: Posix/readlinkat.c (3163 of 4717)
PASS: SanitizerCommon-tsan-x86_64-Darwin :: Posix/sanitizer_set_death_callback_test.cpp (3164 of 4717)
PASS: SanitizerCommon-tsan-x86_64-Darwin :: Posix/setvbuf.cpp (3165 of 4717)
UNSUPPORTED: SanitizerCommon-tsan-x86_64-Darwin :: Posix/sl_add.cpp (3166 of 4717)
PASS: SanitizerCommon-tsan-x86_64-Darwin :: Posix/strlcat.cpp (3167 of 4717)
PASS: SanitizerCommon-tsan-x86_64-Darwin :: Posix/strlcpy.cpp (3168 of 4717)
UNSUPPORTED: SanitizerCommon-tsan-x86_64-Darwin :: Posix/strtonum.cpp (3169 of 4717)
UNSUPPORTED: SanitizerCommon-tsan-x86_64-Darwin :: Posix/strxfrm.c (3170 of 4717)
PASS: SanitizerCommon-tsan-x86_64-Darwin :: Posix/sanitizer_set_report_fd_test.cpp (3171 of 4717)
UNSUPPORTED: SanitizerCommon-tsan-x86_64-Darwin :: Posix/vis.cpp (3172 of 4717)
PASS: SanitizerCommon-tsan-x86_64-Darwin :: Posix/wcsdup.c (3173 of 4717)
UNSUPPORTED: SanitizerCommon-tsan-x86_64-Darwin :: Posix/wcsxfrm.c (3174 of 4717)
PASS: SanitizerCommon-tsan-x86_64-Darwin :: Posix/sysctl.cpp (3175 of 4717)
PASS: SanitizerCommon-tsan-x86_64-Darwin :: Posix/posix_memalign-alignment.cpp (3176 of 4717)
PASS: SanitizerCommon-tsan-x86_64-Darwin :: Posix/weak_hook_test.cpp (3177 of 4717)
PASS: SanitizerCommon-tsan-x86_64-Darwin :: corelimit.cpp (3178 of 4717)
PASS: SanitizerCommon-tsan-x86_64-Darwin :: ctype.c (3179 of 4717)
PASS: SanitizerCommon-tsan-x86_64-Darwin :: fopen_nullptr.c (3180 of 4717)
UNSUPPORTED: SanitizerCommon-tsan-x86_64-Darwin :: hard_rss_limit_mb_test.cpp (3181 of 4717)
PASS: SanitizerCommon-tsan-x86_64-Darwin :: malloc_hook.cpp (3182 of 4717)
PASS: SanitizerCommon-tsan-x86_64-Darwin :: get_module_and_offset_for_pc.cpp (3183 of 4717)
PASS: SanitizerCommon-tsan-x86_64-Darwin :: options-help.cpp (3184 of 4717)
PASS: SanitizerCommon-tsan-x86_64-Darwin :: options-invalid.cpp (3185 of 4717)
UNSUPPORTED: SanitizerCommon-tsan-x86_64-Darwin :: print-stack-trace.cpp (3186 of 4717)
PASS: SanitizerCommon-tsan-x86_64-Darwin :: printf-ldbl.c (3187 of 4717)
PASS: SanitizerCommon-tsan-x86_64-Darwin :: pthread_mutexattr_get.cpp (3188 of 4717)
UNSUPPORTED: SanitizerCommon-tsan-x86_64-Darwin :: reallocarray-overflow.cpp (3189 of 4717)
PASS: SanitizerCommon-tsan-x86_64-Darwin :: options-include.cpp (3190 of 4717)
XFAIL: SanitizerCommon-tsan-x86_64-Darwin :: sanitizer_coverage_no_prune.cpp (3191 of 4717)
XFAIL: SanitizerCommon-tsan-x86_64-Darwin :: sanitizer_coverage_inline8bit_counter.cpp (3192 of 4717)
UNSUPPORTED: SanitizerCommon-tsan-x86_64-Darwin :: sanitizer_coverage_symbolize.cpp (3193 of 4717)
XFAIL: SanitizerCommon-tsan-x86_64-Darwin :: sanitizer_coverage_stack_depth.cpp (3194 of 4717)
UNSUPPORTED: SanitizerCommon-tsan-x86_64-Darwin :: sanitizer_coverage_trace_pc_guard-init.cpp (3195 of 4717)
XFAIL: SanitizerCommon-tsan-x86_64-Darwin :: sanitizer_coverage_trace_pc_guard-dso.cpp (3196 of 4717)
XFAIL: SanitizerCommon-tsan-x86_64-Darwin :: sanitizer_coverage_trace_pc_guard.cpp (3197 of 4717)
PASS: SanitizerCommon-tsan-x86_64-Darwin :: scanf-ldbl.c (3198 of 4717)
PASS: SanitizerCommon-tsan-x86_64-Darwin :: strcasestr.c (3199 of 4717)
PASS: SanitizerCommon-tsan-x86_64-Darwin :: strcspn.c (3200 of 4717)
PASS: SanitizerCommon-tsan-x86_64-Darwin :: strnlen.c (3201 of 4717)
PASS: SanitizerCommon-tsan-x86_64-Darwin :: strpbrk.c (3202 of 4717)
PASS: SanitizerCommon-tsan-x86_64-Darwin :: strspn.c (3203 of 4717)
PASS: SanitizerCommon-tsan-x86_64-Darwin :: strstr.c (3204 of 4717)
PASS: SanitizerCommon-tsan-x86_64-Darwin :: symbolize_pc.cpp (3205 of 4717)
XFAIL: SanitizerCommon-tsan-x86_64-Darwin :: symbolize_pc_inline.cpp (3206 of 4717)
PASS: SanitizerCommon-tsan-x86_64-Darwin :: wcrtomb.c (3207 of 4717)
PASS: SanitizerCommon-tsan-x86_64-Darwin :: allocator_returns_null.cpp (3208 of 4717)
PASS: SanitizerCommon-tsan-x86_64-Darwin :: wctomb.c (3209 of 4717)
PASS: SanitizerCommon-ubsan-i386-Darwin :: Darwin/fputs_puts_null.cpp (3210 of 4717)
PASS: SanitizerCommon-tsan-x86_64-Darwin :: symbolize_stack.cpp (3211 of 4717)
XFAIL: SanitizerCommon-ubsan-i386-Darwin :: Darwin/malloc_zone.cpp (3212 of 4717)
UNSUPPORTED: SanitizerCommon-ubsan-i386-Darwin :: FreeBSD/capsicum.cpp (3213 of 4717)
UNSUPPORTED: SanitizerCommon-ubsan-i386-Darwin :: FreeBSD/fdevname.cpp (3214 of 4717)
UNSUPPORTED: SanitizerCommon-ubsan-i386-Darwin :: Linux/abort_on_error.cpp (3215 of 4717)
UNSUPPORTED: SanitizerCommon-ubsan-i386-Darwin :: Linux/aligned_alloc-alignment.cpp (3216 of 4717)
UNSUPPORTED: SanitizerCommon-ubsan-i386-Darwin :: Linux/aligned_alloc.c (3217 of 4717)
UNSUPPORTED: SanitizerCommon-ubsan-i386-Darwin :: Linux/allow_user_segv.cpp (3218 of 4717)
UNSUPPORTED: SanitizerCommon-ubsan-i386-Darwin :: Linux/assert.cpp (3219 of 4717)
UNSUPPORTED: SanitizerCommon-ubsan-i386-Darwin :: Linux/clock_gettime.c (3220 of 4717)
UNSUPPORTED: SanitizerCommon-ubsan-i386-Darwin :: Linux/closedir.c (3221 of 4717)
UNSUPPORTED: SanitizerCommon-ubsan-i386-Darwin :: Linux/decorate_proc_maps.cpp (3222 of 4717)
UNSUPPORTED: SanitizerCommon-ubsan-i386-Darwin :: Linux/deepbind.cpp (3223 of 4717)
UNSUPPORTED: SanitizerCommon-ubsan-i386-Darwin :: Linux/getpwnam_r_invalid_user.cpp (3224 of 4717)
UNSUPPORTED: SanitizerCommon-ubsan-i386-Darwin :: Linux/getrandom.cpp (3225 of 4717)
UNSUPPORTED: SanitizerCommon-ubsan-i386-Darwin :: Linux/iconv_test.c (3226 of 4717)
UNSUPPORTED: SanitizerCommon-ubsan-i386-Darwin :: Linux/ill.cpp (3227 of 4717)
UNSUPPORTED: SanitizerCommon-ubsan-i386-Darwin :: Linux/mallopt.cpp (3228 of 4717)
UNSUPPORTED: SanitizerCommon-ubsan-i386-Darwin :: Linux/mlock_test.cpp (3229 of 4717)
UNSUPPORTED: SanitizerCommon-ubsan-i386-Darwin :: Linux/mmap64_test.c (3230 of 4717)
UNSUPPORTED: SanitizerCommon-ubsan-i386-Darwin :: Linux/mmap_write_exec.cpp (3231 of 4717)
UNSUPPORTED: SanitizerCommon-ubsan-i386-Darwin :: Linux/mprobe.cpp (3232 of 4717)
UNSUPPORTED: SanitizerCommon-ubsan-i386-Darwin :: Linux/name_to_handle_at.cpp (3233 of 4717)
UNSUPPORTED: SanitizerCommon-ubsan-i386-Darwin :: Linux/new_delete_test.cpp (3234 of 4717)
UNSUPPORTED: SanitizerCommon-ubsan-i386-Darwin :: Linux/open_memstream.cpp (3235 of 4717)
UNSUPPORTED: SanitizerCommon-ubsan-i386-Darwin :: Linux/pthread_mutex.cpp (3236 of 4717)
UNSUPPORTED: SanitizerCommon-ubsan-i386-Darwin :: Linux/ptrace.cpp (3237 of 4717)
UNSUPPORTED: SanitizerCommon-ubsan-i386-Darwin :: Linux/pvalloc-overflow.cpp (3238 of 4717)
UNSUPPORTED: SanitizerCommon-ubsan-i386-Darwin :: Linux/recv_msg_trunc.cpp (3239 of 4717)
UNSUPPORTED: SanitizerCommon-ubsan-i386-Darwin :: Linux/sched_getparam.cpp (3240 of 4717)
UNSUPPORTED: SanitizerCommon-ubsan-i386-Darwin :: Linux/sem_init_glibc.cpp (3241 of 4717)
UNSUPPORTED: SanitizerCommon-ubsan-i386-Darwin :: Linux/signal_segv_handler.cpp (3242 of 4717)
UNSUPPORTED: SanitizerCommon-ubsan-i386-Darwin :: Linux/soft_rss_limit_mb_test.cpp (3243 of 4717)
UNSUPPORTED: SanitizerCommon-ubsan-i386-Darwin :: Linux/sysconf_interceptor_bypass_test.cpp (3244 of 4717)
UNSUPPORTED: SanitizerCommon-ubsan-i386-Darwin :: Linux/timerfd.cpp (3245 of 4717)
UNSUPPORTED: SanitizerCommon-ubsan-i386-Darwin :: Linux/unexpected_format_specifier_test.cpp (3246 of 4717)
UNSUPPORTED: SanitizerCommon-ubsan-i386-Darwin :: NetBSD/asysctl.cpp (3247 of 4717)
UNSUPPORTED: SanitizerCommon-ubsan-i386-Darwin :: NetBSD/cdb.cpp (3248 of 4717)
UNSUPPORTED: SanitizerCommon-ubsan-i386-Darwin :: NetBSD/faccessat.cpp (3249 of 4717)
UNSUPPORTED: SanitizerCommon-ubsan-i386-Darwin :: NetBSD/fparseln.cpp (3250 of 4717)
UNSUPPORTED: SanitizerCommon-ubsan-i386-Darwin :: NetBSD/funopen2.cpp (3251 of 4717)
UNSUPPORTED: SanitizerCommon-ubsan-i386-Darwin :: NetBSD/getgrouplist.cpp (3252 of 4717)
UNSUPPORTED: SanitizerCommon-ubsan-i386-Darwin :: NetBSD/getgroupmembership.cpp (3253 of 4717)
UNSUPPORTED: SanitizerCommon-ubsan-i386-Darwin :: NetBSD/getvfsstat.cpp (3254 of 4717)
UNSUPPORTED: SanitizerCommon-ubsan-i386-Darwin :: NetBSD/gid_from_group.cpp (3255 of 4717)
UNSUPPORTED: SanitizerCommon-ubsan-i386-Darwin :: NetBSD/group_from_gid.cpp (3256 of 4717)
UNSUPPORTED: SanitizerCommon-ubsan-i386-Darwin :: NetBSD/md2.cpp (3257 of 4717)
UNSUPPORTED: SanitizerCommon-ubsan-i386-Darwin :: NetBSD/md4.cpp (3258 of 4717)
UNSUPPORTED: SanitizerCommon-ubsan-i386-Darwin :: NetBSD/md5.cpp (3259 of 4717)
UNSUPPORTED: SanitizerCommon-ubsan-i386-Darwin :: NetBSD/mi_vector_hash.cpp (3260 of 4717)
UNSUPPORTED: SanitizerCommon-ubsan-i386-Darwin :: NetBSD/netent.cpp (3261 of 4717)
UNSUPPORTED: SanitizerCommon-ubsan-i386-Darwin :: NetBSD/paccept.cpp (3262 of 4717)
UNSUPPORTED: SanitizerCommon-ubsan-i386-Darwin :: NetBSD/protoent.cpp (3263 of 4717)
UNSUPPORTED: SanitizerCommon-ubsan-i386-Darwin :: NetBSD/rmd160.cpp (3264 of 4717)
UNSUPPORTED: SanitizerCommon-ubsan-i386-Darwin :: NetBSD/sha1.cpp (3265 of 4717)
UNSUPPORTED: SanitizerCommon-ubsan-i386-Darwin :: NetBSD/sha2.cpp (3266 of 4717)
UNSUPPORTED: SanitizerCommon-ubsan-i386-Darwin :: NetBSD/statvfs1.cpp (3267 of 4717)
UNSUPPORTED: SanitizerCommon-ubsan-i386-Darwin :: NetBSD/strmode.cpp (3268 of 4717)
UNSUPPORTED: SanitizerCommon-ubsan-i386-Darwin :: NetBSD/strtoi.cpp (3269 of 4717)
UNSUPPORTED: SanitizerCommon-ubsan-i386-Darwin :: NetBSD/sysctlgetmibinfo.cpp (3270 of 4717)
UNSUPPORTED: SanitizerCommon-ubsan-i386-Darwin :: NetBSD/ttyent.cpp (3271 of 4717)
UNSUPPORTED: SanitizerCommon-ubsan-i386-Darwin :: NetBSD/uid_from_user.cpp (3272 of 4717)
UNSUPPORTED: SanitizerCommon-ubsan-i386-Darwin :: NetBSD/user_from_uid.cpp (3273 of 4717)
PASS: SanitizerCommon-ubsan-i386-Darwin :: Darwin/abort_on_error.cpp (3274 of 4717)
PASS: SanitizerCommon-ubsan-i386-Darwin :: Posix/access.cpp (3275 of 4717)
PASS: SanitizerCommon-ubsan-i386-Darwin :: Posix/arc4random.cpp (3276 of 4717)
PASS: SanitizerCommon-ubsan-i386-Darwin :: Posix/devname.cpp (3277 of 4717)
PASS: SanitizerCommon-ubsan-i386-Darwin :: Darwin/print-stack-trace.cpp (3278 of 4717)
PASS: SanitizerCommon-ubsan-i386-Darwin :: Posix/devname_r.cpp (3279 of 4717)
UNSUPPORTED: SanitizerCommon-ubsan-i386-Darwin :: Posix/dump_registers.cpp (3280 of 4717)
PASS: SanitizerCommon-ubsan-i386-Darwin :: Posix/feof_fileno_ferror.cpp (3281 of 4717)
PASS: SanitizerCommon-ubsan-i386-Darwin :: Posix/fgetc_ungetc_getc.cpp (3282 of 4717)
PASS: SanitizerCommon-ubsan-i386-Darwin :: Posix/dump_instruction_bytes.cpp (3283 of 4717)
PASS: SanitizerCommon-ubsan-i386-Darwin :: Posix/fgetln.cpp (3284 of 4717)
UNSUPPORTED: SanitizerCommon-ubsan-i386-Darwin :: Posix/fpe.cpp (3285 of 4717)
PASS: SanitizerCommon-ubsan-i386-Darwin :: Posix/fgets.cpp (3286 of 4717)
PASS: SanitizerCommon-ubsan-i386-Darwin :: Posix/fputc_putc_putchar.cpp (3287 of 4717)
PASS: SanitizerCommon-ubsan-i386-Darwin :: Posix/fputs_puts.cpp (3288 of 4717)
UNSUPPORTED: SanitizerCommon-ubsan-i386-Darwin :: Posix/fseek.cpp (3289 of 4717)
UNSUPPORTED: SanitizerCommon-ubsan-i386-Darwin :: Posix/fts.cpp (3290 of 4717)
UNSUPPORTED: SanitizerCommon-ubsan-i386-Darwin :: Posix/funopen.cpp (3291 of 4717)
UNSUPPORTED: SanitizerCommon-ubsan-i386-Darwin :: Posix/getfsent.cpp (3292 of 4717)
PASS: SanitizerCommon-ubsan-i386-Darwin :: Posix/dedup_token_length_test.cpp (3293 of 4717)
PASS: SanitizerCommon-ubsan-i386-Darwin :: Posix/getc_unlocked.cpp (3294 of 4717)
PASS: SanitizerCommon-ubsan-i386-Darwin :: Posix/getpass.cpp (3295 of 4717)
PASS: SanitizerCommon-ubsan-i386-Darwin :: Posix/getmntinfo.cpp (3296 of 4717)
PASS: SanitizerCommon-ubsan-i386-Darwin :: Posix/getusershell.cpp (3297 of 4717)
PASS: SanitizerCommon-ubsan-i386-Darwin :: Posix/illegal_read_test.cpp (3298 of 4717)
PASS: SanitizerCommon-ubsan-i386-Darwin :: Posix/getpw_getgr.cpp (3299 of 4717)
PASS: SanitizerCommon-ubsan-i386-Darwin :: Posix/lstat.cpp (3300 of 4717)
UNSUPPORTED: SanitizerCommon-ubsan-i386-Darwin :: Posix/nl_langinfo.cpp (3301 of 4717)
PASS: SanitizerCommon-ubsan-i386-Darwin :: Posix/mmap_test.c (3302 of 4717)
UNSUPPORTED: SanitizerCommon-ubsan-i386-Darwin :: Posix/posix_memalign-alignment.cpp (3303 of 4717)
PASS: SanitizerCommon-ubsan-i386-Darwin :: Posix/illegal_write_test.cpp (3304 of 4717)
PASS: SanitizerCommon-ubsan-i386-Darwin :: Posix/readlink.c (3305 of 4717)
PASS: SanitizerCommon-ubsan-i386-Darwin :: Posix/readlinkat.c (3306 of 4717)
UNSUPPORTED: SanitizerCommon-ubsan-i386-Darwin :: Posix/regex.cpp (3307 of 4717)
PASS: SanitizerCommon-ubsan-i386-Darwin :: Posix/popen.cpp (3308 of 4717)
PASS: SanitizerCommon-ubsan-i386-Darwin :: Posix/putc_putchar_unlocked.cpp (3309 of 4717)
XFAIL: SanitizerCommon-ubsan-i386-Darwin :: Posix/sanitizer_set_death_callback_test.cpp (3310 of 4717)
UNSUPPORTED: SanitizerCommon-ubsan-i386-Darwin :: Posix/sl_add.cpp (3311 of 4717)
PASS: SanitizerCommon-ubsan-i386-Darwin :: Posix/setvbuf.cpp (3312 of 4717)
PASS: SanitizerCommon-ubsan-i386-Darwin :: Posix/strlcat.cpp (3313 of 4717)
UNSUPPORTED: SanitizerCommon-ubsan-i386-Darwin :: Posix/strtonum.cpp (3314 of 4717)
UNSUPPORTED: SanitizerCommon-ubsan-i386-Darwin :: Posix/strxfrm.c (3315 of 4717)
PASS: SanitizerCommon-ubsan-i386-Darwin :: Posix/strlcpy.cpp (3316 of 4717)
UNSUPPORTED: SanitizerCommon-ubsan-i386-Darwin :: Posix/vis.cpp (3317 of 4717)
PASS: SanitizerCommon-ubsan-i386-Darwin :: Posix/wcsdup.c (3318 of 4717)
UNSUPPORTED: SanitizerCommon-ubsan-i386-Darwin :: Posix/wcsxfrm.c (3319 of 4717)
PASS: SanitizerCommon-ubsan-i386-Darwin :: Posix/sysctl.cpp (3320 of 4717)
UNSUPPORTED: SanitizerCommon-ubsan-i386-Darwin :: allocator_returns_null.cpp (3321 of 4717)
UNSUPPORTED: SanitizerCommon-ubsan-i386-Darwin :: corelimit.cpp (3322 of 4717)
PASS: SanitizerCommon-ubsan-i386-Darwin :: ctype.c (3323 of 4717)
XFAIL: SanitizerCommon-ubsan-i386-Darwin :: Posix/weak_hook_test.cpp (3324 of 4717)
UNSUPPORTED: SanitizerCommon-ubsan-i386-Darwin :: get_module_and_offset_for_pc.cpp (3325 of 4717)
UNSUPPORTED: SanitizerCommon-ubsan-i386-Darwin :: hard_rss_limit_mb_test.cpp (3326 of 4717)
PASS: SanitizerCommon-ubsan-i386-Darwin :: fopen_nullptr.c (3327 of 4717)
PASS: SanitizerCommon-ubsan-i386-Darwin :: options-help.cpp (3328 of 4717)
PASS: SanitizerCommon-ubsan-i386-Darwin :: options-include.cpp (3329 of 4717)
XFAIL: SanitizerCommon-ubsan-i386-Darwin :: malloc_hook.cpp (3330 of 4717)
UNSUPPORTED: SanitizerCommon-ubsan-i386-Darwin :: print-stack-trace.cpp (3331 of 4717)
PASS: SanitizerCommon-ubsan-i386-Darwin :: printf-ldbl.c (3332 of 4717)
PASS: SanitizerCommon-ubsan-i386-Darwin :: options-invalid.cpp (3333 of 4717)
UNSUPPORTED: SanitizerCommon-ubsan-i386-Darwin :: reallocarray-overflow.cpp (3334 of 4717)
UNSUPPORTED: SanitizerCommon-ubsan-i386-Darwin :: sanitizer_coverage_inline8bit_counter.cpp (3335 of 4717)
UNSUPPORTED: SanitizerCommon-ubsan-i386-Darwin :: sanitizer_coverage_no_prune.cpp (3336 of 4717)
PASS: SanitizerCommon-ubsan-i386-Darwin :: Posix/sanitizer_set_report_fd_test.cpp (3337 of 4717)
UNSUPPORTED: SanitizerCommon-ubsan-i386-Darwin :: sanitizer_coverage_symbolize.cpp (3338 of 4717)
UNSUPPORTED: SanitizerCommon-ubsan-i386-Darwin :: sanitizer_coverage_trace_pc_guard-dso.cpp (3339 of 4717)
UNSUPPORTED: SanitizerCommon-ubsan-i386-Darwin :: sanitizer_coverage_trace_pc_guard-init.cpp (3340 of 4717)
UNSUPPORTED: SanitizerCommon-ubsan-i386-Darwin :: sanitizer_coverage_trace_pc_guard.cpp (3341 of 4717)
PASS: SanitizerCommon-ubsan-i386-Darwin :: scanf-ldbl.c (3342 of 4717)
PASS: SanitizerCommon-ubsan-i386-Darwin :: pthread_mutexattr_get.cpp (3343 of 4717)
PASS: SanitizerCommon-ubsan-i386-Darwin :: strcasestr.c (3344 of 4717)
PASS: SanitizerCommon-ubsan-i386-Darwin :: strcspn.c (3345 of 4717)
PASS: SanitizerCommon-ubsan-i386-Darwin :: strnlen.c (3346 of 4717)
PASS: SanitizerCommon-ubsan-i386-Darwin :: strpbrk.c (3347 of 4717)
PASS: SanitizerCommon-ubsan-i386-Darwin :: sanitizer_coverage_stack_depth.cpp (3348 of 4717)
PASS: SanitizerCommon-ubsan-i386-Darwin :: strspn.c (3349 of 4717)
PASS: SanitizerCommon-ubsan-i386-Darwin :: strstr.c (3350 of 4717)
PASS: SanitizerCommon-ubsan-i386-Darwin :: symbolize_pc.cpp (3351 of 4717)
XFAIL: SanitizerCommon-ubsan-i386-Darwin :: symbolize_pc_inline.cpp (3352 of 4717)
PASS: SanitizerCommon-ubsan-i386-Darwin :: wcrtomb.c (3353 of 4717)
PASS: SanitizerCommon-ubsan-i386-Darwin :: wctomb.c (3354 of 4717)
PASS: SanitizerCommon-ubsan-x86_64-Darwin :: Darwin/fputs_puts_null.cpp (3355 of 4717)
XFAIL: SanitizerCommon-ubsan-x86_64-Darwin :: Darwin/malloc_zone.cpp (3356 of 4717)
PASS: SanitizerCommon-ubsan-x86_64-Darwin :: Darwin/abort_on_error.cpp (3357 of 4717)
UNSUPPORTED: SanitizerCommon-ubsan-x86_64-Darwin :: FreeBSD/capsicum.cpp (3358 of 4717)
UNSUPPORTED: SanitizerCommon-ubsan-x86_64-Darwin :: FreeBSD/fdevname.cpp (3359 of 4717)
UNSUPPORTED: SanitizerCommon-ubsan-x86_64-Darwin :: Linux/abort_on_error.cpp (3360 of 4717)
UNSUPPORTED: SanitizerCommon-ubsan-x86_64-Darwin :: Linux/aligned_alloc-alignment.cpp (3361 of 4717)
UNSUPPORTED: SanitizerCommon-ubsan-x86_64-Darwin :: Linux/aligned_alloc.c (3362 of 4717)
UNSUPPORTED: SanitizerCommon-ubsan-x86_64-Darwin :: Linux/allow_user_segv.cpp (3363 of 4717)
UNSUPPORTED: SanitizerCommon-ubsan-x86_64-Darwin :: Linux/assert.cpp (3364 of 4717)
UNSUPPORTED: SanitizerCommon-ubsan-x86_64-Darwin :: Linux/clock_gettime.c (3365 of 4717)
UNSUPPORTED: SanitizerCommon-ubsan-x86_64-Darwin :: Linux/closedir.c (3366 of 4717)
UNSUPPORTED: SanitizerCommon-ubsan-x86_64-Darwin :: Linux/decorate_proc_maps.cpp (3367 of 4717)
UNSUPPORTED: SanitizerCommon-ubsan-x86_64-Darwin :: Linux/deepbind.cpp (3368 of 4717)
UNSUPPORTED: SanitizerCommon-ubsan-x86_64-Darwin :: Linux/getpwnam_r_invalid_user.cpp (3369 of 4717)
UNSUPPORTED: SanitizerCommon-ubsan-x86_64-Darwin :: Linux/getrandom.cpp (3370 of 4717)
UNSUPPORTED: SanitizerCommon-ubsan-x86_64-Darwin :: Linux/iconv_test.c (3371 of 4717)
UNSUPPORTED: SanitizerCommon-ubsan-x86_64-Darwin :: Linux/ill.cpp (3372 of 4717)
UNSUPPORTED: SanitizerCommon-ubsan-x86_64-Darwin :: Linux/mallopt.cpp (3373 of 4717)
UNSUPPORTED: SanitizerCommon-ubsan-x86_64-Darwin :: Linux/mlock_test.cpp (3374 of 4717)
UNSUPPORTED: SanitizerCommon-ubsan-x86_64-Darwin :: Linux/mmap64_test.c (3375 of 4717)
UNSUPPORTED: SanitizerCommon-ubsan-x86_64-Darwin :: Linux/mmap_write_exec.cpp (3376 of 4717)
UNSUPPORTED: SanitizerCommon-ubsan-x86_64-Darwin :: Linux/mprobe.cpp (3377 of 4717)
UNSUPPORTED: SanitizerCommon-ubsan-x86_64-Darwin :: Linux/name_to_handle_at.cpp (3378 of 4717)
UNSUPPORTED: SanitizerCommon-ubsan-x86_64-Darwin :: Linux/new_delete_test.cpp (3379 of 4717)
UNSUPPORTED: SanitizerCommon-ubsan-x86_64-Darwin :: Linux/open_memstream.cpp (3380 of 4717)
UNSUPPORTED: SanitizerCommon-ubsan-x86_64-Darwin :: Linux/pthread_mutex.cpp (3381 of 4717)
UNSUPPORTED: SanitizerCommon-ubsan-x86_64-Darwin :: Linux/ptrace.cpp (3382 of 4717)
UNSUPPORTED: SanitizerCommon-ubsan-x86_64-Darwin :: Linux/pvalloc-overflow.cpp (3383 of 4717)
UNSUPPORTED: SanitizerCommon-ubsan-x86_64-Darwin :: Linux/recv_msg_trunc.cpp (3384 of 4717)
UNSUPPORTED: SanitizerCommon-ubsan-x86_64-Darwin :: Linux/sched_getparam.cpp (3385 of 4717)
UNSUPPORTED: SanitizerCommon-ubsan-x86_64-Darwin :: Linux/sem_init_glibc.cpp (3386 of 4717)
UNSUPPORTED: SanitizerCommon-ubsan-x86_64-Darwin :: Linux/signal_segv_handler.cpp (3387 of 4717)
UNSUPPORTED: SanitizerCommon-ubsan-x86_64-Darwin :: Linux/soft_rss_limit_mb_test.cpp (3388 of 4717)
UNSUPPORTED: SanitizerCommon-ubsan-x86_64-Darwin :: Linux/sysconf_interceptor_bypass_test.cpp (3389 of 4717)
UNSUPPORTED: SanitizerCommon-ubsan-x86_64-Darwin :: Linux/timerfd.cpp (3390 of 4717)
UNSUPPORTED: SanitizerCommon-ubsan-x86_64-Darwin :: Linux/unexpected_format_specifier_test.cpp (3391 of 4717)
UNSUPPORTED: SanitizerCommon-ubsan-x86_64-Darwin :: NetBSD/asysctl.cpp (3392 of 4717)
UNSUPPORTED: SanitizerCommon-ubsan-x86_64-Darwin :: NetBSD/cdb.cpp (3393 of 4717)
UNSUPPORTED: SanitizerCommon-ubsan-x86_64-Darwin :: NetBSD/faccessat.cpp (3394 of 4717)
UNSUPPORTED: SanitizerCommon-ubsan-x86_64-Darwin :: NetBSD/fparseln.cpp (3395 of 4717)
UNSUPPORTED: SanitizerCommon-ubsan-x86_64-Darwin :: NetBSD/funopen2.cpp (3396 of 4717)
UNSUPPORTED: SanitizerCommon-ubsan-x86_64-Darwin :: NetBSD/getgrouplist.cpp (3397 of 4717)
UNSUPPORTED: SanitizerCommon-ubsan-x86_64-Darwin :: NetBSD/getgroupmembership.cpp (3398 of 4717)
UNSUPPORTED: SanitizerCommon-ubsan-x86_64-Darwin :: NetBSD/getvfsstat.cpp (3399 of 4717)
UNSUPPORTED: SanitizerCommon-ubsan-x86_64-Darwin :: NetBSD/gid_from_group.cpp (3400 of 4717)
UNSUPPORTED: SanitizerCommon-ubsan-x86_64-Darwin :: NetBSD/group_from_gid.cpp (3401 of 4717)
UNSUPPORTED: SanitizerCommon-ubsan-x86_64-Darwin :: NetBSD/md2.cpp (3402 of 4717)
UNSUPPORTED: SanitizerCommon-ubsan-x86_64-Darwin :: NetBSD/md4.cpp (3403 of 4717)
UNSUPPORTED: SanitizerCommon-ubsan-x86_64-Darwin :: NetBSD/md5.cpp (3404 of 4717)
UNSUPPORTED: SanitizerCommon-ubsan-x86_64-Darwin :: NetBSD/mi_vector_hash.cpp (3405 of 4717)
UNSUPPORTED: SanitizerCommon-ubsan-x86_64-Darwin :: NetBSD/netent.cpp (3406 of 4717)
UNSUPPORTED: SanitizerCommon-ubsan-x86_64-Darwin :: NetBSD/paccept.cpp (3407 of 4717)
UNSUPPORTED: SanitizerCommon-ubsan-x86_64-Darwin :: NetBSD/protoent.cpp (3408 of 4717)
UNSUPPORTED: SanitizerCommon-ubsan-x86_64-Darwin :: NetBSD/rmd160.cpp (3409 of 4717)
UNSUPPORTED: SanitizerCommon-ubsan-x86_64-Darwin :: NetBSD/sha1.cpp (3410 of 4717)
UNSUPPORTED: SanitizerCommon-ubsan-x86_64-Darwin :: NetBSD/sha2.cpp (3411 of 4717)
UNSUPPORTED: SanitizerCommon-ubsan-x86_64-Darwin :: NetBSD/statvfs1.cpp (3412 of 4717)
UNSUPPORTED: SanitizerCommon-ubsan-x86_64-Darwin :: NetBSD/strmode.cpp (3413 of 4717)
UNSUPPORTED: SanitizerCommon-ubsan-x86_64-Darwin :: NetBSD/strtoi.cpp (3414 of 4717)
UNSUPPORTED: SanitizerCommon-ubsan-x86_64-Darwin :: NetBSD/sysctlgetmibinfo.cpp (3415 of 4717)
UNSUPPORTED: SanitizerCommon-ubsan-x86_64-Darwin :: NetBSD/ttyent.cpp (3416 of 4717)
UNSUPPORTED: SanitizerCommon-ubsan-x86_64-Darwin :: NetBSD/uid_from_user.cpp (3417 of 4717)
UNSUPPORTED: SanitizerCommon-ubsan-x86_64-Darwin :: NetBSD/user_from_uid.cpp (3418 of 4717)
PASS: SanitizerCommon-ubsan-x86_64-Darwin :: Posix/access.cpp (3419 of 4717)
PASS: SanitizerCommon-ubsan-i386-Darwin :: symbolize_stack.cpp (3420 of 4717)
PASS: SanitizerCommon-ubsan-x86_64-Darwin :: Posix/arc4random.cpp (3421 of 4717)
PASS: SanitizerCommon-ubsan-x86_64-Darwin :: Darwin/print-stack-trace.cpp (3422 of 4717)
PASS: SanitizerCommon-ubsan-x86_64-Darwin :: Posix/devname.cpp (3423 of 4717)
PASS: SanitizerCommon-ubsan-x86_64-Darwin :: Posix/devname_r.cpp (3424 of 4717)
UNSUPPORTED: SanitizerCommon-ubsan-x86_64-Darwin :: Posix/dump_registers.cpp (3425 of 4717)
PASS: SanitizerCommon-ubsan-x86_64-Darwin :: Posix/feof_fileno_ferror.cpp (3426 of 4717)
PASS: SanitizerCommon-ubsan-x86_64-Darwin :: Posix/fgetc_ungetc_getc.cpp (3427 of 4717)
PASS: SanitizerCommon-ubsan-x86_64-Darwin :: Posix/dump_instruction_bytes.cpp (3428 of 4717)
PASS: SanitizerCommon-ubsan-x86_64-Darwin :: Posix/fgetln.cpp (3429 of 4717)
PASS: SanitizerCommon-ubsan-x86_64-Darwin :: Posix/fgets.cpp (3430 of 4717)
PASS: SanitizerCommon-ubsan-x86_64-Darwin :: Posix/fputc_putc_putchar.cpp (3431 of 4717)
PASS: SanitizerCommon-ubsan-x86_64-Darwin :: Posix/fputs_puts.cpp (3432 of 4717)
UNSUPPORTED: SanitizerCommon-ubsan-x86_64-Darwin :: Posix/fseek.cpp (3433 of 4717)
UNSUPPORTED: SanitizerCommon-ubsan-x86_64-Darwin :: Posix/fts.cpp (3434 of 4717)
UNSUPPORTED: SanitizerCommon-ubsan-x86_64-Darwin :: Posix/funopen.cpp (3435 of 4717)
PASS: SanitizerCommon-ubsan-x86_64-Darwin :: Posix/dedup_token_length_test.cpp (3436 of 4717)
UNSUPPORTED: SanitizerCommon-ubsan-x86_64-Darwin :: Posix/getfsent.cpp (3437 of 4717)
PASS: SanitizerCommon-ubsan-x86_64-Darwin :: Posix/getc_unlocked.cpp (3438 of 4717)
PASS: SanitizerCommon-ubsan-x86_64-Darwin :: Posix/getmntinfo.cpp (3439 of 4717)
PASS: SanitizerCommon-ubsan-x86_64-Darwin :: Posix/fpe.cpp (3440 of 4717)
PASS: SanitizerCommon-ubsan-x86_64-Darwin :: Posix/getpass.cpp (3441 of 4717)
PASS: SanitizerCommon-ubsan-x86_64-Darwin :: Posix/getusershell.cpp (3442 of 4717)
PASS: SanitizerCommon-ubsan-x86_64-Darwin :: Posix/getpw_getgr.cpp (3443 of 4717)
PASS: SanitizerCommon-ubsan-x86_64-Darwin :: Posix/illegal_read_test.cpp (3444 of 4717)
PASS: SanitizerCommon-ubsan-x86_64-Darwin :: Posix/mmap_test.c (3445 of 4717)
UNSUPPORTED: SanitizerCommon-ubsan-x86_64-Darwin :: Posix/nl_langinfo.cpp (3446 of 4717)
PASS: SanitizerCommon-ubsan-x86_64-Darwin :: Posix/illegal_write_test.cpp (3447 of 4717)
UNSUPPORTED: SanitizerCommon-ubsan-x86_64-Darwin :: Posix/posix_memalign-alignment.cpp (3448 of 4717)
PASS: SanitizerCommon-ubsan-x86_64-Darwin :: Posix/lstat.cpp (3449 of 4717)
PASS: SanitizerCommon-ubsan-x86_64-Darwin :: Posix/readlink.c (3450 of 4717)
PASS: SanitizerCommon-ubsan-x86_64-Darwin :: Posix/popen.cpp (3451 of 4717)
UNSUPPORTED: SanitizerCommon-ubsan-x86_64-Darwin :: Posix/regex.cpp (3452 of 4717)
PASS: SanitizerCommon-ubsan-x86_64-Darwin :: Posix/readlinkat.c (3453 of 4717)
PASS: SanitizerCommon-ubsan-x86_64-Darwin :: Posix/putc_putchar_unlocked.cpp (3454 of 4717)
XFAIL: SanitizerCommon-ubsan-x86_64-Darwin :: Posix/sanitizer_set_death_callback_test.cpp (3455 of 4717)
UNSUPPORTED: SanitizerCommon-ubsan-x86_64-Darwin :: Posix/sl_add.cpp (3456 of 4717)
PASS: SanitizerCommon-ubsan-x86_64-Darwin :: Posix/setvbuf.cpp (3457 of 4717)
PASS: SanitizerCommon-ubsan-x86_64-Darwin :: Posix/strlcat.cpp (3458 of 4717)
UNSUPPORTED: SanitizerCommon-ubsan-x86_64-Darwin :: Posix/strtonum.cpp (3459 of 4717)
UNSUPPORTED: SanitizerCommon-ubsan-x86_64-Darwin :: Posix/strxfrm.c (3460 of 4717)
PASS: SanitizerCommon-ubsan-x86_64-Darwin :: Posix/strlcpy.cpp (3461 of 4717)
UNSUPPORTED: SanitizerCommon-ubsan-x86_64-Darwin :: Posix/vis.cpp (3462 of 4717)
PASS: SanitizerCommon-ubsan-x86_64-Darwin :: Posix/wcsdup.c (3463 of 4717)
UNSUPPORTED: SanitizerCommon-ubsan-x86_64-Darwin :: Posix/wcsxfrm.c (3464 of 4717)
PASS: SanitizerCommon-ubsan-x86_64-Darwin :: Posix/sysctl.cpp (3465 of 4717)
UNSUPPORTED: SanitizerCommon-ubsan-x86_64-Darwin :: allocator_returns_null.cpp (3466 of 4717)
UNSUPPORTED: SanitizerCommon-ubsan-x86_64-Darwin :: corelimit.cpp (3467 of 4717)
PASS: SanitizerCommon-ubsan-x86_64-Darwin :: ctype.c (3468 of 4717)
PASS: SanitizerCommon-ubsan-x86_64-Darwin :: fopen_nullptr.c (3469 of 4717)
XFAIL: SanitizerCommon-ubsan-x86_64-Darwin :: Posix/weak_hook_test.cpp (3470 of 4717)
UNSUPPORTED: SanitizerCommon-ubsan-x86_64-Darwin :: hard_rss_limit_mb_test.cpp (3471 of 4717)
XFAIL: SanitizerCommon-ubsan-x86_64-Darwin :: malloc_hook.cpp (3472 of 4717)
PASS: SanitizerCommon-ubsan-x86_64-Darwin :: options-help.cpp (3473 of 4717)
PASS: SanitizerCommon-ubsan-x86_64-Darwin :: Posix/sanitizer_set_report_fd_test.cpp (3474 of 4717)
PASS: SanitizerCommon-ubsan-x86_64-Darwin :: options-include.cpp (3475 of 4717)
UNSUPPORTED: SanitizerCommon-ubsan-x86_64-Darwin :: print-stack-trace.cpp (3476 of 4717)
PASS: SanitizerCommon-ubsan-x86_64-Darwin :: printf-ldbl.c (3477 of 4717)
PASS: SanitizerCommon-ubsan-x86_64-Darwin :: options-invalid.cpp (3478 of 4717)
UNSUPPORTED: SanitizerCommon-ubsan-x86_64-Darwin :: reallocarray-overflow.cpp (3479 of 4717)
PASS: SanitizerCommon-ubsan-x86_64-Darwin :: pthread_mutexattr_get.cpp (3480 of 4717)
PASS: SanitizerCommon-ubsan-x86_64-Darwin :: sanitizer_coverage_inline8bit_counter.cpp (3481 of 4717)
XFAIL: SanitizerCommon-ubsan-x86_64-Darwin :: sanitizer_coverage_no_prune.cpp (3482 of 4717)
UNSUPPORTED: SanitizerCommon-ubsan-x86_64-Darwin :: sanitizer_coverage_symbolize.cpp (3483 of 4717)
UNSUPPORTED: SanitizerCommon-ubsan-x86_64-Darwin :: sanitizer_coverage_trace_pc_guard-dso.cpp (3484 of 4717)
UNSUPPORTED: SanitizerCommon-ubsan-x86_64-Darwin :: sanitizer_coverage_trace_pc_guard-init.cpp (3485 of 4717)
UNSUPPORTED: SanitizerCommon-ubsan-x86_64-Darwin :: sanitizer_coverage_trace_pc_guard.cpp (3486 of 4717)
PASS: SanitizerCommon-ubsan-x86_64-Darwin :: scanf-ldbl.c (3487 of 4717)
PASS: SanitizerCommon-ubsan-x86_64-Darwin :: strcasestr.c (3488 of 4717)
PASS: SanitizerCommon-ubsan-x86_64-Darwin :: strcspn.c (3489 of 4717)
PASS: SanitizerCommon-ubsan-x86_64-Darwin :: get_module_and_offset_for_pc.cpp (3490 of 4717)
PASS: SanitizerCommon-ubsan-x86_64-Darwin :: strnlen.c (3491 of 4717)
PASS: SanitizerCommon-ubsan-x86_64-Darwin :: strpbrk.c (3492 of 4717)
PASS: SanitizerCommon-ubsan-x86_64-Darwin :: sanitizer_coverage_stack_depth.cpp (3493 of 4717)
UNSUPPORTED: ShadowCallStack :: init.c (3494 of 4717)
UNSUPPORTED: ShadowCallStack :: overflow.c (3495 of 4717)
PASS: SanitizerCommon-ubsan-x86_64-Darwin :: strspn.c (3496 of 4717)
PASS: SanitizerCommon-ubsan-x86_64-Darwin :: strstr.c (3497 of 4717)
PASS: SanitizerCommon-ubsan-x86_64-Darwin :: symbolize_pc.cpp (3498 of 4717)
XFAIL: SanitizerCommon-ubsan-x86_64-Darwin :: symbolize_pc_inline.cpp (3499 of 4717)
PASS: SanitizerCommon-ubsan-x86_64-Darwin :: wcrtomb.c (3500 of 4717)
PASS: SanitizerCommon-ubsan-x86_64-Darwin :: wctomb.c (3501 of 4717)
PASS: ThreadSanitizer-Unit :: rtl/./TsanRtlTest-x86_64-Test/Posix.ThreadLocalAccesses (3502 of 4717)
PASS: ThreadSanitizer-Unit :: rtl/./TsanRtlTest-x86_64-Test/Posix.CondBasic (3503 of 4717)
PASS: ThreadSanitizer-Unit :: rtl/./TsanRtlTest-x86_64-Test/Posix.ThreadSpecificDtors (3504 of 4717)
PASS: ThreadSanitizer-Unit :: rtl/./TsanRtlTest-x86_64-Test/ThreadSanitizer.BasicMutex (3505 of 4717)
PASS: SanitizerCommon-ubsan-x86_64-Darwin :: symbolize_stack.cpp (3506 of 4717)
PASS: ThreadSanitizer-Unit :: rtl/./TsanRtlTest-x86_64-Test/ThreadSanitizer.BasicRwMutex (3507 of 4717)
PASS: ThreadSanitizer-Unit :: rtl/./TsanRtlTest-x86_64-Test/ThreadSanitizer.BasicSpinMutex (3508 of 4717)
PASS: ThreadSanitizer-Unit :: rtl/./TsanRtlTest-x86_64-Test/ThreadSanitizer.BenignRaceOnVptr (3509 of 4717)
PASS: ThreadSanitizer-Unit :: rtl/./TsanRtlTest-x86_64-Test/ThreadSanitizer.FuncCall (3510 of 4717)
PASS: ThreadSanitizer-Unit :: rtl/./TsanRtlTest-x86_64-Test/ThreadSanitizer.HarmfulRaceOnVptr (3511 of 4717)
PASS: ThreadSanitizer-Unit :: rtl/./TsanRtlTest-x86_64-Test/ThreadSanitizer.LockedWriteThenRead (3512 of 4717)
PASS: ThreadSanitizer-Unit :: rtl/./TsanRtlTest-x86_64-Test/ThreadSanitizer.Memcpy (3513 of 4717)
PASS: ThreadSanitizer-Unit :: rtl/./TsanRtlTest-x86_64-Test/ThreadSanitizer.MemcpyRace1 (3514 of 4717)
PASS: ThreadSanitizer-Unit :: rtl/./TsanRtlTest-x86_64-Test/ThreadSanitizer.MemcpyRace2 (3515 of 4717)
PASS: ThreadSanitizer-Unit :: rtl/./TsanRtlTest-x86_64-Test/ThreadSanitizer.MemcpyRace3 (3516 of 4717)
PASS: ThreadSanitizer-Unit :: rtl/./TsanRtlTest-x86_64-Test/ThreadSanitizer.MemcpyStack (3517 of 4717)
PASS: ThreadSanitizer-Unit :: rtl/./TsanRtlTest-x86_64-Test/ThreadSanitizer.MemsetRace1 (3518 of 4717)
PASS: ThreadSanitizer-Unit :: rtl/./TsanRtlTest-x86_64-Test/ThreadSanitizer.Mutex (3519 of 4717)
PASS: ThreadSanitizer-Unit :: rtl/./TsanRtlTest-x86_64-Test/ThreadSanitizer.NoRaceWithOffset (3520 of 4717)
PASS: ThreadSanitizer-Unit :: rtl/./TsanRtlTest-x86_64-Test/ThreadSanitizer.RaceWithDeadThread (3521 of 4717)
PASS: ThreadSanitizer-Unit :: rtl/./TsanRtlTest-x86_64-Test/ThreadSanitizer.RaceWithOffset (3522 of 4717)
PASS: ThreadSanitizer-Unit :: rtl/./TsanRtlTest-x86_64-Test/ThreadSanitizer.RaceWithOffset2 (3523 of 4717)
PASS: ThreadSanitizer-Unit :: rtl/./TsanRtlTest-x86_64-Test/ThreadSanitizer.ReadReadNoRace (3524 of 4717)
PASS: ThreadSanitizer-Unit :: rtl/./TsanRtlTest-x86_64-Test/ThreadSanitizer.ReadWriteRace (3525 of 4717)
PASS: ThreadSanitizer-Unit :: rtl/./TsanRtlTest-x86_64-Test/ThreadSanitizer.ReportDeadThread (3526 of 4717)
PASS: ThreadSanitizer-Unit :: rtl/./TsanRtlTest-x86_64-Test/ThreadSanitizer.ReportRace (3527 of 4717)
PASS: ThreadSanitizer-Unit :: rtl/./TsanRtlTest-x86_64-Test/ThreadSanitizer.RwMutex (3528 of 4717)
PASS: ThreadSanitizer-Unit :: rtl/./TsanRtlTest-x86_64-Test/ThreadSanitizer.SimpleWrite (3529 of 4717)
PASS: ThreadSanitizer-Unit :: rtl/./TsanRtlTest-x86_64-Test/ThreadSanitizer.SimpleWriteWrite (3530 of 4717)
PASS: ThreadSanitizer-Unit :: rtl/./TsanRtlTest-x86_64-Test/ThreadSanitizer.SpinMutex (3531 of 4717)
PASS: ThreadSanitizer-Unit :: rtl/./TsanRtlTest-x86_64-Test/ThreadSanitizer.StaticMutex (3532 of 4717)
PASS: ThreadSanitizer-Unit :: rtl/./TsanRtlTest-x86_64-Test/ThreadSanitizer.ThreadDetach1 (3533 of 4717)
PASS: ThreadSanitizer-Unit :: rtl/./TsanRtlTest-x86_64-Test/ThreadSanitizer.ThreadDetach2 (3534 of 4717)
PASS: ThreadSanitizer-Unit :: rtl/./TsanRtlTest-x86_64-Test/ThreadSanitizer.ThreadSync (3535 of 4717)
PASS: ThreadSanitizer-Unit :: rtl/./TsanRtlTest-x86_64-Test/ThreadSanitizer.WriteReadRace (3536 of 4717)
PASS: ThreadSanitizer-Unit :: rtl/./TsanRtlTest-x86_64-Test/ThreadSanitizer.WriteThenLockedRead (3537 of 4717)
PASS: ThreadSanitizer-Unit :: rtl/./TsanRtlTest-x86_64-Test/ThreadSanitizer.WriteThenRead (3538 of 4717)
PASS: ThreadSanitizer-Unit :: rtl/./TsanRtlTest-x86_64-Test/ThreadSanitizer.WriteWriteRace (3539 of 4717)
PASS: ThreadSanitizer-Unit :: unit/./TsanUnitTest-x86_64-Test/Clock.ChunkedBasic (3540 of 4717)
PASS: ThreadSanitizer-Unit :: unit/./TsanUnitTest-x86_64-Test/Clock.AcquireRelease (3541 of 4717)
PASS: ThreadSanitizer-Unit :: unit/./TsanUnitTest-x86_64-Test/Clock.DifferentSizes (3542 of 4717)
PASS: ThreadSanitizer-Unit :: unit/./TsanUnitTest-x86_64-Test/Clock.Growth (3543 of 4717)
PASS: ThreadSanitizer-Unit :: unit/./TsanUnitTest-x86_64-Test/Clock.Growth2 (3544 of 4717)
PASS: ThreadSanitizer-Unit :: unit/./TsanUnitTest-x86_64-Test/Clock.Fuzzer (3545 of 4717)
PASS: ThreadSanitizer-Unit :: unit/./TsanUnitTest-x86_64-Test/Clock.Iter (3546 of 4717)
PASS: ThreadSanitizer-Unit :: unit/./TsanUnitTest-x86_64-Test/Clock.RepeatedAcquire (3547 of 4717)
PASS: ThreadSanitizer-Unit :: unit/./TsanUnitTest-x86_64-Test/Clock.ManyThreads (3548 of 4717)
PASS: ThreadSanitizer-Unit :: unit/./TsanUnitTest-x86_64-Test/Clock.VectorBasic (3549 of 4717)
PASS: ThreadSanitizer-Unit :: unit/./TsanUnitTest-x86_64-Test/Flags.Basic (3550 of 4717)
PASS: ThreadSanitizer-Unit :: unit/./TsanUnitTest-x86_64-Test/Flags.DefaultValues (3551 of 4717)
PASS: ThreadSanitizer-Unit :: unit/./TsanUnitTest-x86_64-Test/Flags.ParseDefaultOptions (3552 of 4717)
PASS: ThreadSanitizer-Unit :: unit/./TsanUnitTest-x86_64-Test/Flags.ParseEnvOptions (3553 of 4717)
PASS: ThreadSanitizer-Unit :: unit/./TsanUnitTest-x86_64-Test/Flags.ParsePriority (3554 of 4717)
PASS: ThreadSanitizer-Unit :: unit/./TsanUnitTest-x86_64-Test/MetaMap.Basic (3555 of 4717)
PASS: ThreadSanitizer-Unit :: unit/./TsanUnitTest-x86_64-Test/MetaMap.MoveMemory (3556 of 4717)
PASS: ThreadSanitizer-Unit :: unit/./TsanUnitTest-x86_64-Test/MetaMap.FreeRange (3557 of 4717)
PASS: ThreadSanitizer-Unit :: unit/./TsanUnitTest-x86_64-Test/MetaMap.ResetSync (3558 of 4717)
PASS: ThreadSanitizer-Unit :: unit/./TsanUnitTest-x86_64-Test/MetaMap.Sync (3559 of 4717)
PASS: ThreadSanitizer-Unit :: unit/./TsanUnitTest-x86_64-Test/Mman.AlignedAlloc (3560 of 4717)
PASS: ThreadSanitizer-Unit :: unit/./TsanUnitTest-x86_64-Test/Mman.Internal (3561 of 4717)
PASS: ThreadSanitizer-Unit :: unit/./TsanUnitTest-x86_64-Test/Mman.PosixMemalign (3562 of 4717)
PASS: ThreadSanitizer-Unit :: unit/./TsanUnitTest-x86_64-Test/Mman.Stats (3563 of 4717)
PASS: ThreadSanitizer-Unit :: unit/./TsanUnitTest-x86_64-Test/Mman.UsableSize (3564 of 4717)
PASS: ThreadSanitizer-Unit :: unit/./TsanUnitTest-x86_64-Test/Mman.Memalign (3565 of 4717)
PASS: ThreadSanitizer-Unit :: unit/./TsanUnitTest-x86_64-Test/Mman.User (3566 of 4717)
PASS: ThreadSanitizer-Unit :: unit/./TsanUnitTest-x86_64-Test/Mman.UserRealloc (3567 of 4717)
PASS: ThreadSanitizer-Unit :: unit/./TsanUnitTest-x86_64-Test/Mman.Valloc (3568 of 4717)
PASS: ThreadSanitizer-Unit :: unit/./TsanUnitTest-x86_64-Test/Mutex.ReadWrite (3569 of 4717)
PASS: ThreadSanitizer-Unit :: unit/./TsanUnitTest-x86_64-Test/Mutex.SpinWrite (3570 of 4717)
PASS: ThreadSanitizer-Unit :: unit/./TsanUnitTest-x86_64-Test/Mutex.Write (3571 of 4717)
PASS: ThreadSanitizer-Unit :: unit/./TsanUnitTest-x86_64-Test/Shadow.Celling (3572 of 4717)
PASS: ThreadSanitizer-Unit :: unit/./TsanUnitTest-x86_64-Test/Shadow.FastState (3573 of 4717)
PASS: ThreadSanitizer-Unit :: unit/./TsanUnitTest-x86_64-Test/Shadow.Mapping (3574 of 4717)
PASS: ThreadSanitizer-Unit :: unit/./TsanUnitTest-x86_64-Test/StackTrace.BasicBuffered (3575 of 4717)
PASS: ThreadSanitizer-Unit :: unit/./TsanUnitTest-x86_64-Test/StackTrace.BasicVarSize (3576 of 4717)
PASS: ThreadSanitizer-Unit :: unit/./TsanUnitTest-x86_64-Test/StackTrace.TrimBuffered (3577 of 4717)
PASS: ThreadSanitizer-Unit :: unit/./TsanUnitTest-x86_64-Test/StackTrace.TrimVarSize (3578 of 4717)
PASS: ThreadSanitizer-x86_64 :: Darwin/dlopen.cpp (3579 of 4717)
PASS: ThreadSanitizer-x86_64 :: Darwin/debug_external.cpp (3580 of 4717)
PASS: ThreadSanitizer-x86_64 :: Darwin/external-dups.cpp (3581 of 4717)
PASS: ThreadSanitizer-x86_64 :: Darwin/external-lib.cpp (3582 of 4717)
PASS: ThreadSanitizer-x86_64 :: Darwin/external-noninstrumented-module.cpp (3583 of 4717)
PASS: ThreadSanitizer-x86_64 :: Darwin/deadlock.mm (3584 of 4717)
PASS: ThreadSanitizer-x86_64 :: Darwin/external-ignore-noninstrumented.cpp (3585 of 4717)
PASS: ThreadSanitizer-x86_64 :: Darwin/external-swift-debugging.cpp (3586 of 4717)
PASS: ThreadSanitizer-x86_64 :: Darwin/external-swift.cpp (3587 of 4717)
PASS: ThreadSanitizer-x86_64 :: Darwin/ignore-noninstrumented.mm (3588 of 4717)
PASS: ThreadSanitizer-x86_64 :: Darwin/gcd-sync-block-copy.mm (3589 of 4717)
PASS: ThreadSanitizer-x86_64 :: Darwin/external.cpp (3590 of 4717)
PASS: ThreadSanitizer-x86_64 :: Darwin/libcxx-future.mm (3591 of 4717)
PASS: ThreadSanitizer-x86_64 :: Darwin/libcxx-shared-ptr-recursive.mm (3592 of 4717)
PASS: ThreadSanitizer-x86_64 :: Darwin/libcxx-call-once.mm (3593 of 4717)
PASS: ThreadSanitizer-x86_64 :: Darwin/mach_vm_allocate.c (3594 of 4717)
PASS: ThreadSanitizer-x86_64 :: Darwin/main_tid.mm (3595 of 4717)
PASS: ThreadSanitizer-x86_64 :: Darwin/libcxx-shared-ptr-stress.mm (3596 of 4717)
PASS: ThreadSanitizer-x86_64 :: Darwin/malloc-stack-logging.cpp (3597 of 4717)
PASS: ThreadSanitizer-x86_64 :: Darwin/libcxx-shared-ptr.mm (3598 of 4717)
PASS: ThreadSanitizer-x86_64 :: Darwin/malloc_size.mm (3599 of 4717)
PASS: ThreadSanitizer-x86_64 :: Darwin/norace-objcxx-run-time.mm (3600 of 4717)
PASS: ThreadSanitizer-x86_64 :: Darwin/objc-race.mm (3601 of 4717)
PASS: ThreadSanitizer-x86_64 :: Darwin/objc-simple.mm (3602 of 4717)
PASS: ThreadSanitizer-x86_64 :: Darwin/objc-synchronize-cycle-tagged.mm (3603 of 4717)
PASS: ThreadSanitizer-x86_64 :: Darwin/objc-synchronize-cycle.mm (3604 of 4717)
PASS: ThreadSanitizer-x86_64 :: Darwin/objc-synchronize-nested-recursive.mm (3605 of 4717)
PASS: ThreadSanitizer-x86_64 :: Darwin/objc-double-property.mm (3606 of 4717)
PASS: ThreadSanitizer-x86_64 :: Darwin/os_unfair_lock.c (3607 of 4717)
PASS: ThreadSanitizer-x86_64 :: Darwin/objc-synchronize.mm (3608 of 4717)
PASS: ThreadSanitizer-x86_64 :: Darwin/objc-synchronize-tagged.mm (3609 of 4717)
PASS: ThreadSanitizer-x86_64 :: Darwin/osatomics-add.mm (3610 of 4717)
PASS: ThreadSanitizer-x86_64 :: Darwin/osatomics-bitops.mm (3611 of 4717)
PASS: ThreadSanitizer-x86_64 :: Darwin/osspinlock-norace.cpp (3612 of 4717)
PASS: ThreadSanitizer-x86_64 :: Darwin/realloc-zero.cpp (3613 of 4717)
PASS: ThreadSanitizer-x86_64 :: Darwin/osatomics-list.mm (3614 of 4717)
PASS: ThreadSanitizer-x86_64 :: Darwin/signals-blocked.cpp (3615 of 4717)
PASS: ThreadSanitizer-x86_64 :: Darwin/symbolizer-dladdr.cpp (3616 of 4717)
PASS: ThreadSanitizer-x86_64 :: Darwin/symbolizer-atos.cpp (3617 of 4717)
PASS: ThreadSanitizer-x86_64 :: Darwin/workerthreads.mm (3618 of 4717)
PASS: ThreadSanitizer-x86_64 :: Darwin/xpc-cancel.mm (3619 of 4717)
UNSUPPORTED: ThreadSanitizer-x86_64 :: Linux/check_memcpy.c (3620 of 4717)
UNSUPPORTED: ThreadSanitizer-x86_64 :: Linux/check_preinit.cpp (3621 of 4717)
UNSUPPORTED: ThreadSanitizer-x86_64 :: Linux/double_race.cpp (3622 of 4717)
UNSUPPORTED: ThreadSanitizer-x86_64 :: Linux/mutex_robust.cpp (3623 of 4717)
UNSUPPORTED: ThreadSanitizer-x86_64 :: Linux/mutex_robust2.cpp (3624 of 4717)
UNSUPPORTED: ThreadSanitizer-x86_64 :: Linux/pie_no_aslr.cpp (3625 of 4717)
UNSUPPORTED: ThreadSanitizer-x86_64 :: Linux/thread_timedjoin.c (3626 of 4717)
UNSUPPORTED: ThreadSanitizer-x86_64 :: Linux/thread_tryjoin.c (3627 of 4717)
UNSUPPORTED: ThreadSanitizer-x86_64 :: Linux/user_fopen.cpp (3628 of 4717)
UNSUPPORTED: ThreadSanitizer-x86_64 :: Linux/user_malloc.cpp (3629 of 4717)
PASS: ThreadSanitizer-x86_64 :: Darwin/xpc-race.mm (3630 of 4717)
PASS: ThreadSanitizer-x86_64 :: annotate_happens_before.cpp (3631 of 4717)
PASS: ThreadSanitizer-x86_64 :: aligned_vs_unaligned_race.cpp (3632 of 4717)
PASS: ThreadSanitizer-x86_64 :: atexit.cpp (3633 of 4717)
PASS: ThreadSanitizer-x86_64 :: atexit2.cpp (3634 of 4717)
PASS: ThreadSanitizer-x86_64 :: Darwin/xpc.mm (3635 of 4717)
PASS: ThreadSanitizer-x86_64 :: atexit3.cpp (3636 of 4717)
PASS: ThreadSanitizer-x86_64 :: atomic_free2.cpp (3637 of 4717)
PASS: ThreadSanitizer-x86_64 :: atomic_free3.cpp (3638 of 4717)
PASS: ThreadSanitizer-x86_64 :: atomic_hle.cpp (3639 of 4717)
PASS: ThreadSanitizer-x86_64 :: atomic_norace.cpp (3640 of 4717)
PASS: ThreadSanitizer-x86_64 :: atomic_stack.cpp (3641 of 4717)
PASS: ThreadSanitizer-x86_64 :: atomic_race.cpp (3642 of 4717)
UNSUPPORTED: ThreadSanitizer-x86_64 :: barrier.cpp (3643 of 4717)
UNSUPPORTED: ThreadSanitizer-x86_64 :: bench_acquire_only.cpp (3644 of 4717)
UNSUPPORTED: ThreadSanitizer-x86_64 :: bench_acquire_release.cpp (3645 of 4717)
UNSUPPORTED: ThreadSanitizer-x86_64 :: bench_local_mutex.cpp (3646 of 4717)
UNSUPPORTED: ThreadSanitizer-x86_64 :: bench_mutex.cpp (3647 of 4717)
UNSUPPORTED: ThreadSanitizer-x86_64 :: bench_release_only.cpp (3648 of 4717)
UNSUPPORTED: ThreadSanitizer-x86_64 :: bench_rwmutex.cpp (3649 of 4717)
PASS: ThreadSanitizer-x86_64 :: bench_shadow_flush.cpp (3650 of 4717)
UNSUPPORTED: ThreadSanitizer-x86_64 :: bench_single_writer.cpp (3651 of 4717)
UNSUPPORTED: ThreadSanitizer-x86_64 :: bench_ten_mutexes.cpp (3652 of 4717)
PASS: ThreadSanitizer-x86_64 :: atomic_store.cpp (3653 of 4717)
PASS: ThreadSanitizer-x86_64 :: benign_race.cpp (3654 of 4717)
PASS: ThreadSanitizer-x86_64 :: blacklist.cpp (3655 of 4717)
PASS: ThreadSanitizer-x86_64 :: cond.c (3656 of 4717)
PASS: ThreadSanitizer-x86_64 :: blacklist2.cpp (3657 of 4717)
PASS: ThreadSanitizer-x86_64 :: cond_cancel.c (3658 of 4717)
PASS: ThreadSanitizer-x86_64 :: cond_destruction.cpp (3659 of 4717)
UNSUPPORTED: ThreadSanitizer-x86_64 :: cond_version.c (3660 of 4717)
PASS: ThreadSanitizer-x86_64 :: cond_race.cpp (3661 of 4717)
PASS: ThreadSanitizer-x86_64 :: atomic_free.cpp (3662 of 4717)
PASS: ThreadSanitizer-x86_64 :: custom_mutex0.cpp (3663 of 4717)
PASS: ThreadSanitizer-x86_64 :: custom_mutex1.cpp (3664 of 4717)
PASS: ThreadSanitizer-x86_64 :: custom_mutex2.cpp (3665 of 4717)
PASS: ThreadSanitizer-x86_64 :: custom_mutex3.cpp (3666 of 4717)
PASS: ThreadSanitizer-x86_64 :: cxa_guard_acquire.cpp (3667 of 4717)
PASS: ThreadSanitizer-x86_64 :: custom_mutex4.cpp (3668 of 4717)
UNSUPPORTED: ThreadSanitizer-x86_64 :: debug_alloc_stack.cpp (3669 of 4717)
PASS: ThreadSanitizer-x86_64 :: debug_locate.cpp (3670 of 4717)
PASS: ThreadSanitizer-x86_64 :: custom_mutex5.cpp (3671 of 4717)
PASS: ThreadSanitizer-x86_64 :: debugging.cpp (3672 of 4717)
PASS: ThreadSanitizer-x86_64 :: default_options.cpp (3673 of 4717)
UNSUPPORTED: ThreadSanitizer-x86_64 :: dl_iterate_phdr.cpp (3674 of 4717)
PASS: ThreadSanitizer-x86_64 :: deep_stack1.cpp (3675 of 4717)
PASS: ThreadSanitizer-x86_64 :: dlclose.cpp (3676 of 4717)
PASS: ThreadSanitizer-x86_64 :: dtls.c (3677 of 4717)
PASS: ThreadSanitizer-x86_64 :: fd_close_norace.cpp (3678 of 4717)
PASS: ThreadSanitizer-x86_64 :: exceptions.cpp (3679 of 4717)
PASS: ThreadSanitizer-x86_64 :: fd_close_norace2.cpp (3680 of 4717)
PASS: ThreadSanitizer-x86_64 :: fd_dup_norace.cpp (3681 of 4717)
PASS: ThreadSanitizer-x86_64 :: fd_dup_norace2.cpp (3682 of 4717)
PASS: ThreadSanitizer-x86_64 :: fd_dup_race.cpp (3683 of 4717)
PASS: ThreadSanitizer-x86_64 :: fd_location.cpp (3684 of 4717)
PASS: ThreadSanitizer-x86_64 :: fd_pipe_norace.cpp (3685 of 4717)
PASS: ThreadSanitizer-x86_64 :: fd_socket_connect_norace.cpp (3686 of 4717)
PASS: ThreadSanitizer-x86_64 :: fd_pipe_race.cpp (3687 of 4717)
PASS: ThreadSanitizer-x86_64 :: fd_socketpair_norace.cpp (3688 of 4717)
PASS: ThreadSanitizer-x86_64 :: fd_socket_norace.cpp (3689 of 4717)
PASS: ThreadSanitizer-x86_64 :: deadlock_detector_stress_test.cpp (3690 of 4717)
PASS: ThreadSanitizer-x86_64 :: fd_stdout_race.cpp (3691 of 4717)
PASS: ThreadSanitizer-x86_64 :: fd_tid_recycled.cpp (3692 of 4717)
PASS: ThreadSanitizer-x86_64 :: fiber_asm.cpp (3693 of 4717)
PASS: ThreadSanitizer-x86_64 :: fiber_from_thread.cpp (3694 of 4717)
PASS: ThreadSanitizer-x86_64 :: fiber_longjmp.cpp (3695 of 4717)
PASS: ThreadSanitizer-x86_64 :: fiber_simple.cpp (3696 of 4717)
PASS: ThreadSanitizer-x86_64 :: fiber_race.cpp (3697 of 4717)
PASS: ThreadSanitizer-x86_64 :: fiber_two_threads.cpp (3698 of 4717)
PASS: ThreadSanitizer-x86_64 :: fork_atexit.cpp (3699 of 4717)
PASS: ThreadSanitizer-x86_64 :: fork_multithreaded3.cpp (3700 of 4717)
PASS: ThreadSanitizer-x86_64 :: fork_multithreaded.cpp (3701 of 4717)
PASS: ThreadSanitizer-x86_64 :: free_race2.c (3702 of 4717)
PASS: ThreadSanitizer-x86_64 :: free_race.c (3703 of 4717)
PASS: ThreadSanitizer-x86_64 :: getline_nohang.cpp (3704 of 4717)
PASS: ThreadSanitizer-x86_64 :: fork_deadlock.cpp (3705 of 4717)
PASS: ThreadSanitizer-x86_64 :: global_race2.cpp (3706 of 4717)
PASS: ThreadSanitizer-x86_64 :: global_race3.cpp (3707 of 4717)
PASS: ThreadSanitizer-x86_64 :: halt_on_error.cpp (3708 of 4717)
PASS: ThreadSanitizer-x86_64 :: heap_race.cpp (3709 of 4717)
PASS: ThreadSanitizer-x86_64 :: ignore_free.cpp (3710 of 4717)
PASS: ThreadSanitizer-x86_64 :: ignore_lib0.cpp (3711 of 4717)
PASS: ThreadSanitizer-x86_64 :: ignore_lib1.cpp (3712 of 4717)
PASS: ThreadSanitizer-x86_64 :: ignore_lib2.cpp (3713 of 4717)
PASS: ThreadSanitizer-x86_64 :: ignore_lib3.cpp (3714 of 4717)
PASS: ThreadSanitizer-x86_64 :: global_race.cpp (3715 of 4717)
PASS: ThreadSanitizer-x86_64 :: ignore_malloc.cpp (3716 of 4717)
PASS: ThreadSanitizer-x86_64 :: ignore_race.cpp (3717 of 4717)
PASS: ThreadSanitizer-x86_64 :: ignore_lib5.cpp (3718 of 4717)
PASS: ThreadSanitizer-x86_64 :: ignore_sync.cpp (3719 of 4717)
PASS: ThreadSanitizer-x86_64 :: ignore_lib4.cpp (3720 of 4717)
PASS: ThreadSanitizer-x86_64 :: ignored-interceptors-mmap.cpp (3721 of 4717)
PASS: ThreadSanitizer-x86_64 :: inlined_memcpy_race.cpp (3722 of 4717)
PASS: ThreadSanitizer-x86_64 :: interface_atomic_test.c (3723 of 4717)
PASS: ThreadSanitizer-x86_64 :: inlined_memcpy_race2.cpp (3724 of 4717)
PASS: ThreadSanitizer-x86_64 :: java_finalizer.cpp (3725 of 4717)
PASS: ThreadSanitizer-x86_64 :: java_alloc.cpp (3726 of 4717)
PASS: ThreadSanitizer-x86_64 :: java_find.cpp (3727 of 4717)
PASS: ThreadSanitizer-x86_64 :: java_heap_init.cpp (3728 of 4717)
PASS: ThreadSanitizer-x86_64 :: java_lock.cpp (3729 of 4717)
PASS: ThreadSanitizer-x86_64 :: java_lock_move.cpp (3730 of 4717)
PASS: ThreadSanitizer-x86_64 :: java_lock_rec.cpp (3731 of 4717)
PASS: ThreadSanitizer-x86_64 :: java_lock_rec_race.cpp (3732 of 4717)
PASS: ThreadSanitizer-x86_64 :: java_move_overlap.cpp (3733 of 4717)
PASS: ThreadSanitizer-x86_64 :: java_race.cpp (3734 of 4717)
PASS: ThreadSanitizer-x86_64 :: java_move_overlap_race.cpp (3735 of 4717)
PASS: ThreadSanitizer-x86_64 :: java_race_move.cpp (3736 of 4717)
PASS: ThreadSanitizer-x86_64 :: java_race_pc.cpp (3737 of 4717)
PASS: ThreadSanitizer-x86_64 :: java_rwlock.cpp (3738 of 4717)
PASS: ThreadSanitizer-x86_64 :: java_symbolization.cpp (3739 of 4717)
PASS: ThreadSanitizer-x86_64 :: java_volatile.cpp (3740 of 4717)
PASS: ThreadSanitizer-x86_64 :: java_symbolization_legacy.cpp (3741 of 4717)
PASS: ThreadSanitizer-x86_64 :: libdispatch/after.c (3742 of 4717)
PASS: ThreadSanitizer-x86_64 :: libdispatch/apply-race.c (3743 of 4717)
PASS: ThreadSanitizer-x86_64 :: large_malloc_meta.cpp (3744 of 4717)
PASS: ThreadSanitizer-x86_64 :: libdispatch/apply.c (3745 of 4717)
PASS: ThreadSanitizer-x86_64 :: libdispatch/async-norace.c (3746 of 4717)
PASS: ThreadSanitizer-x86_64 :: libcxx/std_shared_ptr.cpp (3747 of 4717)
PASS: ThreadSanitizer-x86_64 :: libdispatch/barrier.c (3748 of 4717)
PASS: ThreadSanitizer-x86_64 :: libdispatch/async-race.c (3749 of 4717)
PASS: ThreadSanitizer-x86_64 :: libdispatch/barrier-race.c (3750 of 4717)
PASS: ThreadSanitizer-x86_64 :: libdispatch/blocks.c (3751 of 4717)
PASS: ThreadSanitizer-x86_64 :: libdispatch/data.c (3752 of 4717)
PASS: ThreadSanitizer-x86_64 :: libdispatch/fd.c (3753 of 4717)
PASS: ThreadSanitizer-x86_64 :: libdispatch/dispatch_once_deadlock.c (3754 of 4717)
PASS: ThreadSanitizer-x86_64 :: libdispatch/dispatch_main.c (3755 of 4717)
PASS: ThreadSanitizer-x86_64 :: libdispatch/groups-leave.c (3756 of 4717)
PASS: ThreadSanitizer-x86_64 :: libdispatch/groups-norace.c (3757 of 4717)
PASS: ThreadSanitizer-x86_64 :: libdispatch/groups-destructor.cpp (3758 of 4717)
PASS: ThreadSanitizer-x86_64 :: libdispatch/io-barrier.c (3759 of 4717)
PASS: ThreadSanitizer-x86_64 :: libdispatch/io-barrier-race.c (3760 of 4717)
PASS: ThreadSanitizer-x86_64 :: libdispatch/io-cleanup.c (3761 of 4717)
PASS: ThreadSanitizer-x86_64 :: libdispatch/groups-stress.c (3762 of 4717)
PASS: ThreadSanitizer-x86_64 :: libdispatch/io.c (3763 of 4717)
PASS: ThreadSanitizer-x86_64 :: libdispatch/io-race.c (3764 of 4717)
PASS: ThreadSanitizer-x86_64 :: libdispatch/once.c (3765 of 4717)
PASS: ThreadSanitizer-x86_64 :: libdispatch/semaphore-norace.c (3766 of 4717)
PASS: ThreadSanitizer-x86_64 :: libdispatch/serial-queue-norace.c (3767 of 4717)
PASS: ThreadSanitizer-x86_64 :: libdispatch/source-cancel.c (3768 of 4717)
PASS: ThreadSanitizer-x86_64 :: libdispatch/source-cancel2.c (3769 of 4717)
PASS: ThreadSanitizer-x86_64 :: libdispatch/source-event.c (3770 of 4717)
PASS: ThreadSanitizer-x86_64 :: libdispatch/source-event2.c (3771 of 4717)
PASS: ThreadSanitizer-x86_64 :: libdispatch/source-registration.c (3772 of 4717)
PASS: ThreadSanitizer-x86_64 :: libdispatch/source-registration2.c (3773 of 4717)
PASS: ThreadSanitizer-x86_64 :: libdispatch/suspend.c (3774 of 4717)
PASS: ThreadSanitizer-x86_64 :: libdispatch/source-serial.c (3775 of 4717)
PASS: ThreadSanitizer-x86_64 :: libdispatch/sync-block-copy.cpp (3776 of 4717)
PASS: ThreadSanitizer-x86_64 :: libdispatch/sync-norace.c (3777 of 4717)
PASS: ThreadSanitizer-x86_64 :: libdispatch/target-queue-norace.c (3778 of 4717)
PASS: ThreadSanitizer-x86_64 :: libdispatch/sync-race.c (3779 of 4717)
PASS: ThreadSanitizer-x86_64 :: longjmp.cpp (3780 of 4717)
PASS: ThreadSanitizer-x86_64 :: longjmp2.cpp (3781 of 4717)
PASS: ThreadSanitizer-x86_64 :: longjmp3.cpp (3782 of 4717)
PASS: ThreadSanitizer-x86_64 :: longjmp4.cpp (3783 of 4717)
PASS: ThreadSanitizer-x86_64 :: load_shared_lib.cpp (3784 of 4717)
PASS: ThreadSanitizer-x86_64 :: malloc_overflow.cpp (3785 of 4717)
UNSUPPORTED: ThreadSanitizer-x86_64 :: map32bit.cpp (3786 of 4717)
PASS: ThreadSanitizer-x86_64 :: lots_of_threads.c (3787 of 4717)
PASS: ThreadSanitizer-x86_64 :: malloc_stack.cpp (3788 of 4717)
PASS: ThreadSanitizer-x86_64 :: memcmp_race.cpp (3789 of 4717)
PASS: ThreadSanitizer-x86_64 :: mmap_large.cpp (3790 of 4717)
PASS: ThreadSanitizer-x86_64 :: memcpy_race.cpp (3791 of 4717)
PASS: ThreadSanitizer-x86_64 :: mmap_stress.cpp (3792 of 4717)
PASS: ThreadSanitizer-x86_64 :: mop1.c (3793 of 4717)
XFAIL: ThreadSanitizer-x86_64 :: must_deadlock.cpp (3794 of 4717)
PASS: ThreadSanitizer-x86_64 :: mop_with_offset.cpp (3795 of 4717)
PASS: ThreadSanitizer-x86_64 :: mutex_annotations.cpp (3796 of 4717)
PASS: ThreadSanitizer-x86_64 :: mop_with_offset2.cpp (3797 of 4717)
PASS: ThreadSanitizer-x86_64 :: mutex_bad_read_lock.cpp (3798 of 4717)
PASS: ThreadSanitizer-x86_64 :: mutex_bad_read_unlock.cpp (3799 of 4717)
PASS: ThreadSanitizer-x86_64 :: mutex_bad_unlock.cpp (3800 of 4717)
PASS: ThreadSanitizer-x86_64 :: mutex_destroy_locked.cpp (3801 of 4717)
PASS: ThreadSanitizer-x86_64 :: mutex_destroy_locked2.cpp (3802 of 4717)
PASS: ThreadSanitizer-x86_64 :: mutex_double_lock.cpp (3803 of 4717)
PASS: ThreadSanitizer-x86_64 :: mutex_cycle2.c (3804 of 4717)
PASS: ThreadSanitizer-x86_64 :: mutex_cycle_long.c (3805 of 4717)
PASS: ThreadSanitizer-x86_64 :: mutexset1.cpp (3806 of 4717)
PASS: ThreadSanitizer-x86_64 :: mutex_lock_destroyed.cpp (3807 of 4717)
PASS: ThreadSanitizer-x86_64 :: mutexset2.cpp (3808 of 4717)
PASS: ThreadSanitizer-x86_64 :: mutexset3.cpp (3809 of 4717)
PASS: ThreadSanitizer-x86_64 :: mutexset4.cpp (3810 of 4717)
PASS: ThreadSanitizer-x86_64 :: mutexset5.cpp (3811 of 4717)
PASS: ThreadSanitizer-x86_64 :: mutexset6.cpp (3812 of 4717)
PASS: ThreadSanitizer-x86_64 :: mutexset7.cpp (3813 of 4717)
PASS: ThreadSanitizer-x86_64 :: pie_test.cpp (3814 of 4717)
PASS: ThreadSanitizer-x86_64 :: mutexset8.cpp (3815 of 4717)
PASS: ThreadSanitizer-x86_64 :: pthread_atfork_deadlock.c (3816 of 4717)
UNSUPPORTED: ThreadSanitizer-x86_64 :: race_on_barrier.c (3817 of 4717)
UNSUPPORTED: ThreadSanitizer-x86_64 :: race_on_barrier2.c (3818 of 4717)
PASS: ThreadSanitizer-x86_64 :: printf-1.c (3819 of 4717)
PASS: ThreadSanitizer-x86_64 :: pthread_key.cpp (3820 of 4717)
PASS: ThreadSanitizer-x86_64 :: race_on_heap.cpp (3821 of 4717)
PASS: ThreadSanitizer-x86_64 :: race_on_fputs.cpp (3822 of 4717)
PASS: ThreadSanitizer-x86_64 :: race_on_mutex.c (3823 of 4717)
PASS: ThreadSanitizer-x86_64 :: race_on_mutex2.c (3824 of 4717)
PASS: ThreadSanitizer-x86_64 :: race_on_puts.cpp (3825 of 4717)
PASS: ThreadSanitizer-x86_64 :: race_on_read.cpp (3826 of 4717)
PASS: ThreadSanitizer-x86_64 :: race_on_speculative_load.cpp (3827 of 4717)
PASS: ThreadSanitizer-x86_64 :: race_on_write.cpp (3828 of 4717)
PASS: ThreadSanitizer-x86_64 :: race_stress.cpp (3829 of 4717)
PASS: ThreadSanitizer-x86_64 :: race_top_suppression.cpp (3830 of 4717)
PASS: ThreadSanitizer-x86_64 :: race_top_suppression1.cpp (3831 of 4717)
PASS: ThreadSanitizer-x86_64 :: race_with_finished_thread.cpp (3832 of 4717)
PASS: ThreadSanitizer-x86_64 :: setuid.c (3833 of 4717)
PASS: ThreadSanitizer-x86_64 :: real_deadlock_detector_stress_test.cpp (3834 of 4717)
PASS: ThreadSanitizer-x86_64 :: signal_block.cpp (3835 of 4717)
PASS: ThreadSanitizer-x86_64 :: setuid2.c (3836 of 4717)
PASS: ThreadSanitizer-x86_64 :: restore_stack.cpp (3837 of 4717)
PASS: ThreadSanitizer-x86_64 :: signal_longjmp.cpp (3838 of 4717)
PASS: ThreadSanitizer-x86_64 :: signal_cond.cpp (3839 of 4717)
PASS: ThreadSanitizer-x86_64 :: signal_errno.cpp (3840 of 4717)
UNSUPPORTED: ThreadSanitizer-x86_64 :: signal_recursive.cpp (3841 of 4717)
UNSUPPORTED: ThreadSanitizer-x86_64 :: signal_reset.cpp (3842 of 4717)
UNSUPPORTED: ThreadSanitizer-x86_64 :: signal_sync.cpp (3843 of 4717)
UNSUPPORTED: ThreadSanitizer-x86_64 :: signal_sync2.cpp (3844 of 4717)
UNSUPPORTED: ThreadSanitizer-x86_64 :: signal_thread.cpp (3845 of 4717)
PASS: ThreadSanitizer-x86_64 :: signal_pause.cpp (3846 of 4717)
PASS: ThreadSanitizer-x86_64 :: signal_write.cpp (3847 of 4717)
PASS: ThreadSanitizer-x86_64 :: signal_malloc.cpp (3848 of 4717)
PASS: ThreadSanitizer-x86_64 :: sigsuspend.cpp (3849 of 4717)
PASS: ThreadSanitizer-x86_64 :: simple_race.c (3850 of 4717)
PASS: ThreadSanitizer-x86_64 :: simple_race.cpp (3851 of 4717)
PASS: ThreadSanitizer-x86_64 :: simple_stack2.cpp (3852 of 4717)
PASS: ThreadSanitizer-x86_64 :: sleep_sync.cpp (3853 of 4717)
PASS: ThreadSanitizer-x86_64 :: sleep_sync2.cpp (3854 of 4717)
PASS: ThreadSanitizer-x86_64 :: simple_stack.c (3855 of 4717)
PASS: ThreadSanitizer-x86_64 :: stack_race.cpp (3856 of 4717)
PASS: ThreadSanitizer-x86_64 :: static_init1.cpp (3857 of 4717)
PASS: ThreadSanitizer-x86_64 :: stack_sync_reuse.cpp (3858 of 4717)
PASS: ThreadSanitizer-x86_64 :: stack_race2.cpp (3859 of 4717)
PASS: ThreadSanitizer-x86_64 :: static_init2.cpp (3860 of 4717)
PASS: ThreadSanitizer-x86_64 :: static_init4.cpp (3861 of 4717)
PASS: ThreadSanitizer-x86_64 :: static_init3.cpp (3862 of 4717)
UNSUPPORTED: ThreadSanitizer-x86_64 :: strerror_r.cpp (3863 of 4717)
UNSUPPORTED: ThreadSanitizer-x86_64 :: sunrpc.cpp (3864 of 4717)
PASS: ThreadSanitizer-x86_64 :: static_init5.cpp (3865 of 4717)
PASS: ThreadSanitizer-x86_64 :: static_init6.cpp (3866 of 4717)
PASS: ThreadSanitizer-x86_64 :: suppress_same_address.cpp (3867 of 4717)
PASS: ThreadSanitizer-x86_64 :: suppress_same_stacks.cpp (3868 of 4717)
PASS: ThreadSanitizer-x86_64 :: suppressions_global.cpp (3869 of 4717)
PASS: ThreadSanitizer-x86_64 :: suppressions_mutex.cpp (3870 of 4717)
PASS: ThreadSanitizer-x86_64 :: suppressions_race.cpp (3871 of 4717)
PASS: ThreadSanitizer-x86_64 :: suppressions_race2.cpp (3872 of 4717)
PASS: ThreadSanitizer-x86_64 :: thread_detach.c (3873 of 4717)
PASS: ThreadSanitizer-x86_64 :: thread_detach2.c (3874 of 4717)
PASS: ThreadSanitizer-x86_64 :: thread_end_with_ignore.cpp (3875 of 4717)
PASS: ThreadSanitizer-x86_64 :: thread_end_with_ignore2.cpp (3876 of 4717)
PASS: ThreadSanitizer-x86_64 :: thread_end_with_ignore3.cpp (3877 of 4717)
PASS: ThreadSanitizer-x86_64 :: thread_exit.c (3878 of 4717)
PASS: ThreadSanitizer-x86_64 :: thread_leak.c (3879 of 4717)
PASS: ThreadSanitizer-x86_64 :: thread_leak2.c (3880 of 4717)
PASS: ThreadSanitizer-x86_64 :: thread_leak4.c (3881 of 4717)
PASS: ThreadSanitizer-x86_64 :: thread_leak3.c (3882 of 4717)
UNSUPPORTED: ThreadSanitizer-x86_64 :: thread_name2.cpp (3883 of 4717)
PASS: ThreadSanitizer-x86_64 :: thread_name.cpp (3884 of 4717)
PASS: ThreadSanitizer-x86_64 :: thread_leak5.c (3885 of 4717)
PASS: ThreadSanitizer-x86_64 :: tiny_race.c (3886 of 4717)
PASS: ThreadSanitizer-x86_64 :: tls_race.cpp (3887 of 4717)
PASS: ThreadSanitizer-x86_64 :: tls_race2.cpp (3888 of 4717)
PASS: ThreadSanitizer-x86_64 :: unaligned_norace.cpp (3889 of 4717)
PASS: ThreadSanitizer-x86_64 :: tsan-vs-gvn.cpp (3890 of 4717)
PASS: ThreadSanitizer-x86_64 :: virtual_inheritance_compile_bug.cpp (3891 of 4717)
PASS: ThreadSanitizer-x86_64 :: vfork.cpp (3892 of 4717)
PASS: ThreadSanitizer-x86_64 :: vptr_benign_race.cpp (3893 of 4717)
PASS: ThreadSanitizer-x86_64 :: vptr_harmful_race.cpp (3894 of 4717)
PASS: ThreadSanitizer-x86_64 :: unaligned_race.cpp (3895 of 4717)
PASS: ThreadSanitizer-x86_64 :: vptr_harmful_race2.cpp (3896 of 4717)
PASS: ThreadSanitizer-x86_64 :: vptr_harmful_race4.cpp (3897 of 4717)
PASS: ThreadSanitizer-x86_64 :: vptr_harmful_race3.cpp (3898 of 4717)
PASS: UBSan-AddressSanitizer-i386 :: TestCases/Float/cast-overflow.cpp (3899 of 4717)
PASS: ThreadSanitizer-x86_64 :: write_in_reader_lock.cpp (3900 of 4717)
PASS: UBSan-AddressSanitizer-i386 :: TestCases/ImplicitConversion/integer-sign-change-blacklist.c (3901 of 4717)
PASS: UBSan-AddressSanitizer-i386 :: TestCases/ImplicitConversion/integer-sign-change-summary.cpp (3902 of 4717)
PASS: UBSan-AddressSanitizer-i386 :: TestCases/ImplicitConversion/integer-arithmetic-value-change.c (3903 of 4717)
PASS: UBSan-AddressSanitizer-i386 :: TestCases/ImplicitConversion/integer-conversion.c (3904 of 4717)
PASS: UBSan-AddressSanitizer-i386 :: TestCases/ImplicitConversion/integer-sign-change.c (3905 of 4717)
PASS: UBSan-AddressSanitizer-i386 :: TestCases/ImplicitConversion/integer-truncation.c (3906 of 4717)
PASS: UBSan-AddressSanitizer-i386 :: TestCases/ImplicitConversion/signed-integer-truncation-or-sign-change-summary.cpp (3907 of 4717)
PASS: UBSan-AddressSanitizer-i386 :: TestCases/ImplicitConversion/signed-integer-truncation-summary.cpp (3908 of 4717)
PASS: UBSan-AddressSanitizer-i386 :: TestCases/ImplicitConversion/signed-integer-truncation-blacklist.c (3909 of 4717)
PASS: UBSan-AddressSanitizer-i386 :: TestCases/ImplicitConversion/signed-integer-truncation-or-sign-change-blacklist.c (3910 of 4717)
PASS: UBSan-AddressSanitizer-i386 :: TestCases/ImplicitConversion/unsigned-integer-truncation-summary.cpp (3911 of 4717)
PASS: UBSan-AddressSanitizer-i386 :: TestCases/ImplicitConversion/signed-integer-truncation.c (3912 of 4717)
PASS: UBSan-AddressSanitizer-i386 :: TestCases/Integer/add-overflow.cpp (3913 of 4717)
PASS: UBSan-AddressSanitizer-i386 :: TestCases/Integer/div-overflow.cpp (3914 of 4717)
PASS: UBSan-AddressSanitizer-i386 :: TestCases/ImplicitConversion/unsigned-integer-truncation.c (3915 of 4717)
PASS: UBSan-AddressSanitizer-i386 :: TestCases/Integer/div-zero.cpp (3916 of 4717)
PASS: UBSan-AddressSanitizer-i386 :: TestCases/Integer/mul-overflow.cpp (3917 of 4717)
PASS: UBSan-AddressSanitizer-i386 :: TestCases/ImplicitConversion/unsigned-integer-truncation-blacklist.c (3918 of 4717)
PASS: UBSan-AddressSanitizer-i386 :: TestCases/Integer/incdec-overflow.cpp (3919 of 4717)
PASS: UBSan-AddressSanitizer-i386 :: TestCases/Integer/negate-overflow.cpp (3920 of 4717)
PASS: UBSan-AddressSanitizer-i386 :: TestCases/Integer/no-recover.cpp (3921 of 4717)
PASS: UBSan-AddressSanitizer-i386 :: TestCases/Integer/summary.cpp (3922 of 4717)
PASS: UBSan-AddressSanitizer-i386 :: TestCases/Integer/sub-overflow.cpp (3923 of 4717)
PASS: UBSan-AddressSanitizer-i386 :: TestCases/Integer/uadd-overflow.cpp (3924 of 4717)
PASS: UBSan-AddressSanitizer-i386 :: TestCases/Integer/suppressions.cpp (3925 of 4717)
PASS: UBSan-AddressSanitizer-i386 :: TestCases/Integer/uincdec-overflow.cpp (3926 of 4717)
PASS: UBSan-AddressSanitizer-i386 :: TestCases/Integer/umul-overflow.cpp (3927 of 4717)
UNSUPPORTED: UBSan-AddressSanitizer-i386 :: TestCases/Misc/Linux/print_stack_trace.cpp (3928 of 4717)
UNSUPPORTED: UBSan-AddressSanitizer-i386 :: TestCases/Misc/Linux/ubsan_options.cpp (3929 of 4717)
PASS: UBSan-AddressSanitizer-i386 :: TestCases/Misc/bool.cpp (3930 of 4717)
PASS: UBSan-AddressSanitizer-i386 :: TestCases/Integer/shift.cpp (3931 of 4717)
UNSUPPORTED: UBSan-AddressSanitizer-i386 :: TestCases/Misc/builtins.cpp (3932 of 4717)
PASS: UBSan-AddressSanitizer-i386 :: TestCases/Integer/usub-overflow.cpp (3933 of 4717)
PASS: UBSan-AddressSanitizer-i386 :: TestCases/Misc/bounds.cpp (3934 of 4717)
PASS: UBSan-AddressSanitizer-i386 :: TestCases/Misc/deduplication.cpp (3935 of 4717)
PASS: UBSan-AddressSanitizer-i386 :: TestCases/Misc/enum.cpp (3936 of 4717)
PASS: UBSan-AddressSanitizer-i386 :: TestCases/Misc/log-path_test.cpp (3937 of 4717)
PASS: UBSan-AddressSanitizer-i386 :: TestCases/Misc/coverage-levels.cpp (3938 of 4717)
UNSUPPORTED: UBSan-AddressSanitizer-i386 :: TestCases/Misc/no-interception.cpp (3939 of 4717)
PASS: UBSan-AddressSanitizer-i386 :: TestCases/Misc/monitor.cpp (3940 of 4717)
PASS: UBSan-AddressSanitizer-i386 :: TestCases/Misc/nonnull.cpp (3941 of 4717)
PASS: UBSan-AddressSanitizer-i386 :: TestCases/Misc/nonnull-arg.cpp (3942 of 4717)
PASS: UBSan-AddressSanitizer-i386 :: TestCases/Misc/missing_return.cpp (3943 of 4717)
PASS: UBSan-AddressSanitizer-i386 :: TestCases/Misc/print_summary.c (3944 of 4717)
PASS: UBSan-AddressSanitizer-i386 :: TestCases/Misc/nullability.c (3945 of 4717)
PASS: UBSan-AddressSanitizer-i386 :: TestCases/Misc/vla.c (3946 of 4717)
PASS: UBSan-AddressSanitizer-i386 :: TestCases/Misc/unreachable.cpp (3947 of 4717)
PASS: UBSan-AddressSanitizer-i386 :: TestCases/Pointer/alignment-assumption-attribute-align_value-on-paramvar.cpp (3948 of 4717)
PASS: UBSan-AddressSanitizer-i386 :: TestCases/Pointer/alignment-assumption-attribute-align_value-on-lvalue.cpp (3949 of 4717)
PASS: UBSan-AddressSanitizer-i386 :: TestCases/Pointer/alignment-assumption-attribute-alloc_align-on-function-variable.cpp (3950 of 4717)
PASS: UBSan-AddressSanitizer-i386 :: TestCases/Pointer/alignment-assumption-attribute-alloc_align-on-function.cpp (3951 of 4717)
PASS: UBSan-AddressSanitizer-i386 :: TestCases/Pointer/alignment-assumption-attribute-assume_aligned-on-function-two-params.cpp (3952 of 4717)
PASS: UBSan-AddressSanitizer-i386 :: TestCases/Pointer/alignment-assumption-attribute-assume_aligned-on-function.cpp (3953 of 4717)
PASS: UBSan-AddressSanitizer-i386 :: TestCases/Pointer/alignment-assumption-blacklist.cpp (3954 of 4717)
PASS: UBSan-AddressSanitizer-i386 :: TestCases/Pointer/alignment-assumption-builtin_assume_aligned-three-params-variable.cpp (3955 of 4717)
PASS: UBSan-AddressSanitizer-i386 :: TestCases/Pointer/alignment-assumption-builtin_assume_aligned-three-params.cpp (3956 of 4717)
PASS: UBSan-AddressSanitizer-i386 :: TestCases/Pointer/alignment-assumption-summary.cpp (3957 of 4717)
PASS: UBSan-AddressSanitizer-i386 :: TestCases/Pointer/alignment-assumption-builtin_assume_aligned-two-params.cpp (3958 of 4717)
PASS: UBSan-AddressSanitizer-i386 :: TestCases/Pointer/unsigned-index-expression.cpp (3959 of 4717)
UNSUPPORTED: UBSan-AddressSanitizer-i386 :: TestCases/TypeCheck/Function/function.cpp (3960 of 4717)
UNSUPPORTED: UBSan-AddressSanitizer-i386 :: TestCases/TypeCheck/Linux/PR33221.cpp (3961 of 4717)
PASS: UBSan-AddressSanitizer-i386 :: TestCases/Pointer/index-overflow.cpp (3962 of 4717)
PASS: UBSan-AddressSanitizer-i386 :: TestCases/TypeCheck/PR33221.cpp (3963 of 4717)
PASS: UBSan-AddressSanitizer-i386 :: TestCases/TypeCheck/null.cpp (3964 of 4717)
PASS: UBSan-AddressSanitizer-i386 :: TestCases/TypeCheck/vptr-corrupted-vtable-itanium.cpp (3965 of 4717)
PASS: UBSan-AddressSanitizer-i386 :: TestCases/TypeCheck/vptr-non-unique-typeinfo.cpp (3966 of 4717)
PASS: UBSan-AddressSanitizer-i386 :: TestCases/TypeCheck/vptr-virtual-base-construction.cpp (3967 of 4717)
PASS: UBSan-AddressSanitizer-i386 :: TestCases/Pointer/alignment-assumption-openmp.cpp (3968 of 4717)
PASS: UBSan-AddressSanitizer-i386 :: TestCases/TypeCheck/vptr-virtual-base.cpp (3969 of 4717)
PASS: UBSan-AddressSanitizer-i386 :: TestCases/TypeCheck/misaligned.cpp (3970 of 4717)
PASS: UBSan-AddressSanitizer-x86_64 :: TestCases/Float/cast-overflow.cpp (3971 of 4717)
PASS: UBSan-AddressSanitizer-x86_64 :: TestCases/ImplicitConversion/integer-arithmetic-value-change.c (3972 of 4717)
PASS: UBSan-AddressSanitizer-x86_64 :: TestCases/ImplicitConversion/integer-conversion.c (3973 of 4717)
PASS: UBSan-AddressSanitizer-x86_64 :: TestCases/ImplicitConversion/integer-sign-change-summary.cpp (3974 of 4717)
PASS: UBSan-AddressSanitizer-x86_64 :: TestCases/ImplicitConversion/integer-sign-change-blacklist.c (3975 of 4717)
PASS: UBSan-AddressSanitizer-i386 :: TestCases/TypeCheck/vptr.cpp (3976 of 4717)
PASS: UBSan-AddressSanitizer-x86_64 :: TestCases/ImplicitConversion/integer-sign-change.c (3977 of 4717)
PASS: UBSan-AddressSanitizer-x86_64 :: TestCases/ImplicitConversion/integer-truncation.c (3978 of 4717)
PASS: UBSan-AddressSanitizer-x86_64 :: TestCases/ImplicitConversion/signed-integer-truncation-or-sign-change-summary.cpp (3979 of 4717)
PASS: UBSan-AddressSanitizer-x86_64 :: TestCases/ImplicitConversion/signed-integer-truncation-summary.cpp (3980 of 4717)
PASS: UBSan-AddressSanitizer-x86_64 :: TestCases/ImplicitConversion/signed-integer-truncation-blacklist.c (3981 of 4717)
PASS: UBSan-AddressSanitizer-x86_64 :: TestCases/ImplicitConversion/signed-integer-truncation-or-sign-change-blacklist.c (3982 of 4717)
PASS: UBSan-AddressSanitizer-x86_64 :: TestCases/ImplicitConversion/unsigned-integer-truncation-summary.cpp (3983 of 4717)
PASS: UBSan-AddressSanitizer-x86_64 :: TestCases/ImplicitConversion/signed-integer-truncation.c (3984 of 4717)
PASS: UBSan-AddressSanitizer-x86_64 :: TestCases/Integer/add-overflow.cpp (3985 of 4717)
PASS: UBSan-AddressSanitizer-x86_64 :: TestCases/Integer/div-overflow.cpp (3986 of 4717)
PASS: UBSan-AddressSanitizer-x86_64 :: TestCases/Integer/div-zero.cpp (3987 of 4717)
PASS: UBSan-AddressSanitizer-x86_64 :: TestCases/Integer/incdec-overflow.cpp (3988 of 4717)
PASS: UBSan-AddressSanitizer-x86_64 :: TestCases/Integer/mul-overflow.cpp (3989 of 4717)
PASS: UBSan-AddressSanitizer-x86_64 :: TestCases/ImplicitConversion/unsigned-integer-truncation.c (3990 of 4717)
PASS: UBSan-AddressSanitizer-x86_64 :: TestCases/Integer/negate-overflow.cpp (3991 of 4717)
PASS: UBSan-AddressSanitizer-x86_64 :: TestCases/Integer/no-recover.cpp (3992 of 4717)
PASS: UBSan-AddressSanitizer-x86_64 :: TestCases/ImplicitConversion/unsigned-integer-truncation-blacklist.c (3993 of 4717)
PASS: UBSan-AddressSanitizer-x86_64 :: TestCases/Integer/sub-overflow.cpp (3994 of 4717)
PASS: UBSan-AddressSanitizer-x86_64 :: TestCases/Integer/summary.cpp (3995 of 4717)
PASS: UBSan-AddressSanitizer-x86_64 :: TestCases/Integer/uadd-overflow.cpp (3996 of 4717)
PASS: UBSan-AddressSanitizer-x86_64 :: TestCases/Integer/suppressions.cpp (3997 of 4717)
PASS: UBSan-AddressSanitizer-x86_64 :: TestCases/Integer/uincdec-overflow.cpp (3998 of 4717)
PASS: UBSan-AddressSanitizer-x86_64 :: TestCases/Integer/umul-overflow.cpp (3999 of 4717)
UNSUPPORTED: UBSan-AddressSanitizer-x86_64 :: TestCases/Misc/Linux/print_stack_trace.cpp (4000 of 4717)
UNSUPPORTED: UBSan-AddressSanitizer-x86_64 :: TestCases/Misc/Linux/ubsan_options.cpp (4001 of 4717)
PASS: UBSan-AddressSanitizer-x86_64 :: TestCases/Integer/shift.cpp (4002 of 4717)
PASS: UBSan-AddressSanitizer-x86_64 :: TestCases/Misc/bool.cpp (4003 of 4717)
PASS: UBSan-AddressSanitizer-x86_64 :: TestCases/Integer/usub-overflow.cpp (4004 of 4717)
PASS: UBSan-AddressSanitizer-x86_64 :: TestCases/Misc/builtins.cpp (4005 of 4717)
PASS: UBSan-AddressSanitizer-x86_64 :: TestCases/Misc/deduplication.cpp (4006 of 4717)
PASS: UBSan-AddressSanitizer-x86_64 :: TestCases/Misc/bounds.cpp (4007 of 4717)
PASS: UBSan-AddressSanitizer-x86_64 :: TestCases/Misc/enum.cpp (4008 of 4717)
PASS: UBSan-AddressSanitizer-x86_64 :: TestCases/Misc/log-path_test.cpp (4009 of 4717)
PASS: UBSan-AddressSanitizer-x86_64 :: TestCases/Misc/coverage-levels.cpp (4010 of 4717)
UNSUPPORTED: UBSan-AddressSanitizer-x86_64 :: TestCases/Misc/no-interception.cpp (4011 of 4717)
PASS: UBSan-AddressSanitizer-x86_64 :: TestCases/Misc/monitor.cpp (4012 of 4717)
PASS: UBSan-AddressSanitizer-x86_64 :: TestCases/Misc/missing_return.cpp (4013 of 4717)
PASS: UBSan-AddressSanitizer-x86_64 :: TestCases/Misc/nonnull.cpp (4014 of 4717)
PASS: UBSan-AddressSanitizer-x86_64 :: TestCases/Misc/print_summary.c (4015 of 4717)
PASS: UBSan-AddressSanitizer-x86_64 :: TestCases/Misc/nullability.c (4016 of 4717)
PASS: UBSan-AddressSanitizer-x86_64 :: TestCases/Misc/nonnull-arg.cpp (4017 of 4717)
PASS: UBSan-AddressSanitizer-x86_64 :: TestCases/Misc/vla.c (4018 of 4717)
PASS: UBSan-AddressSanitizer-x86_64 :: TestCases/Misc/unreachable.cpp (4019 of 4717)
PASS: UBSan-AddressSanitizer-x86_64 :: TestCases/Pointer/alignment-assumption-attribute-align_value-on-lvalue.cpp (4020 of 4717)
PASS: UBSan-AddressSanitizer-x86_64 :: TestCases/Pointer/alignment-assumption-attribute-align_value-on-paramvar.cpp (4021 of 4717)
PASS: UBSan-AddressSanitizer-x86_64 :: TestCases/Pointer/alignment-assumption-attribute-alloc_align-on-function-variable.cpp (4022 of 4717)
PASS: UBSan-AddressSanitizer-x86_64 :: TestCases/Pointer/alignment-assumption-attribute-alloc_align-on-function.cpp (4023 of 4717)
PASS: UBSan-AddressSanitizer-x86_64 :: TestCases/Pointer/alignment-assumption-attribute-assume_aligned-on-function-two-params.cpp (4024 of 4717)
PASS: UBSan-AddressSanitizer-x86_64 :: TestCases/Pointer/alignment-assumption-attribute-assume_aligned-on-function.cpp (4025 of 4717)
PASS: UBSan-AddressSanitizer-x86_64 :: TestCases/Pointer/alignment-assumption-blacklist.cpp (4026 of 4717)
PASS: UBSan-AddressSanitizer-x86_64 :: TestCases/Pointer/alignment-assumption-builtin_assume_aligned-three-params.cpp (4027 of 4717)
PASS: UBSan-AddressSanitizer-x86_64 :: TestCases/Pointer/alignment-assumption-builtin_assume_aligned-three-params-variable.cpp (4028 of 4717)
PASS: UBSan-AddressSanitizer-x86_64 :: TestCases/Pointer/alignment-assumption-builtin_assume_aligned-two-params.cpp (4029 of 4717)
PASS: UBSan-AddressSanitizer-x86_64 :: TestCases/Pointer/alignment-assumption-summary.cpp (4030 of 4717)
PASS: UBSan-AddressSanitizer-x86_64 :: TestCases/Pointer/unsigned-index-expression.cpp (4031 of 4717)
PASS: UBSan-AddressSanitizer-x86_64 :: TestCases/Pointer/index-overflow.cpp (4032 of 4717)
UNSUPPORTED: UBSan-AddressSanitizer-x86_64 :: TestCases/TypeCheck/Linux/PR33221.cpp (4033 of 4717)
PASS: UBSan-AddressSanitizer-x86_64 :: TestCases/TypeCheck/PR33221.cpp (4034 of 4717)
PASS: UBSan-AddressSanitizer-x86_64 :: TestCases/Pointer/alignment-assumption-openmp.cpp (4035 of 4717)
PASS: UBSan-AddressSanitizer-x86_64 :: TestCases/TypeCheck/null.cpp (4036 of 4717)
PASS: UBSan-Minimal-x86_64 :: TestCases/alignment-assumption.c (4037 of 4717)
PASS: UBSan-Minimal-x86_64 :: TestCases/alignment-assumption.c (4038 of 4717)
PASS: UBSan-Minimal-x86_64 :: TestCases/implicit-integer-sign-change.c (4039 of 4717)
PASS: UBSan-AddressSanitizer-x86_64 :: TestCases/TypeCheck/Function/function.cpp (4040 of 4717)
PASS: UBSan-Minimal-x86_64 :: TestCases/implicit-integer-sign-change.c (4041 of 4717)
PASS: UBSan-AddressSanitizer-x86_64 :: TestCases/TypeCheck/vptr-corrupted-vtable-itanium.cpp (4042 of 4717)
PASS: UBSan-Minimal-x86_64 :: TestCases/implicit-signed-integer-truncation-or-sign-change.c (4043 of 4717)
PASS: UBSan-Minimal-x86_64 :: TestCases/implicit-signed-integer-truncation-or-sign-change.c (4044 of 4717)
PASS: UBSan-AddressSanitizer-x86_64 :: TestCases/TypeCheck/misaligned.cpp (4045 of 4717)
PASS: UBSan-Minimal-x86_64 :: TestCases/implicit-signed-integer-truncation.c (4046 of 4717)
PASS: UBSan-Minimal-x86_64 :: TestCases/implicit-signed-integer-truncation.c (4047 of 4717)
PASS: UBSan-Minimal-x86_64 :: TestCases/implicit-unsigned-integer-truncation.c (4048 of 4717)
PASS: UBSan-Minimal-x86_64 :: TestCases/implicit-unsigned-integer-truncation.c (4049 of 4717)
PASS: UBSan-Minimal-x86_64 :: TestCases/recover-dedup-limit.cpp (4050 of 4717)
PASS: UBSan-AddressSanitizer-x86_64 :: TestCases/TypeCheck/vptr-virtual-base-construction.cpp (4051 of 4717)
PASS: UBSan-Minimal-x86_64 :: TestCases/recover-dedup-limit.cpp (4052 of 4717)
PASS: UBSan-AddressSanitizer-x86_64 :: TestCases/TypeCheck/vptr-non-unique-typeinfo.cpp (4053 of 4717)
PASS: UBSan-Minimal-x86_64 :: TestCases/recover-dedup.cpp (4054 of 4717)
PASS: UBSan-Minimal-x86_64 :: TestCases/test-darwin-interface.c (4055 of 4717)
PASS: UBSan-Minimal-x86_64 :: TestCases/test-darwin-interface.c (4056 of 4717)
PASS: UBSan-Minimal-x86_64 :: TestCases/recover-dedup.cpp (4057 of 4717)
PASS: UBSan-AddressSanitizer-x86_64 :: TestCases/TypeCheck/vptr-virtual-base.cpp (4058 of 4717)
UNSUPPORTED: UBSan-Standalone-i386 :: TestCases/ImplicitConversion/integer-sign-change-summary.cpp (4059 of 4717)
PASS: UBSan-Minimal-x86_64 :: TestCases/uadd-overflow.cpp (4060 of 4717)
PASS: UBSan-Minimal-x86_64 :: TestCases/uadd-overflow.cpp (4061 of 4717)
PASS: UBSan-Standalone-i386 :: TestCases/Float/cast-overflow.cpp (4062 of 4717)
PASS: UBSan-Standalone-i386 :: TestCases/ImplicitConversion/integer-sign-change-blacklist.c (4063 of 4717)
UNSUPPORTED: UBSan-Standalone-i386 :: TestCases/ImplicitConversion/signed-integer-truncation-or-sign-change-summary.cpp (4064 of 4717)
UNSUPPORTED: UBSan-Standalone-i386 :: TestCases/ImplicitConversion/signed-integer-truncation-summary.cpp (4065 of 4717)
PASS: UBSan-Standalone-i386 :: TestCases/ImplicitConversion/integer-truncation.c (4066 of 4717)
PASS: UBSan-Standalone-i386 :: TestCases/ImplicitConversion/integer-sign-change.c (4067 of 4717)
UNSUPPORTED: UBSan-Standalone-i386 :: TestCases/ImplicitConversion/unsigned-integer-truncation-summary.cpp (4068 of 4717)
PASS: UBSan-Standalone-i386 :: TestCases/ImplicitConversion/signed-integer-truncation-or-sign-change-blacklist.c (4069 of 4717)
PASS: UBSan-Standalone-i386 :: TestCases/ImplicitConversion/integer-arithmetic-value-change.c (4070 of 4717)
PASS: UBSan-Standalone-i386 :: TestCases/ImplicitConversion/signed-integer-truncation-blacklist.c (4071 of 4717)
PASS: UBSan-Standalone-i386 :: TestCases/ImplicitConversion/integer-conversion.c (4072 of 4717)
PASS: UBSan-Standalone-i386 :: TestCases/Integer/div-overflow.cpp (4073 of 4717)
PASS: UBSan-Standalone-i386 :: TestCases/Integer/add-overflow.cpp (4074 of 4717)
PASS: UBSan-Standalone-i386 :: TestCases/Integer/mul-overflow.cpp (4075 of 4717)
PASS: UBSan-Standalone-i386 :: TestCases/Integer/div-zero.cpp (4076 of 4717)
PASS: UBSan-Standalone-i386 :: TestCases/ImplicitConversion/signed-integer-truncation.c (4077 of 4717)
PASS: UBSan-Standalone-i386 :: TestCases/Integer/negate-overflow.cpp (4078 of 4717)
UNSUPPORTED: UBSan-Standalone-i386 :: TestCases/Integer/summary.cpp (4079 of 4717)
PASS: UBSan-Standalone-i386 :: TestCases/Integer/incdec-overflow.cpp (4080 of 4717)
PASS: UBSan-Standalone-i386 :: TestCases/Integer/no-recover.cpp (4081 of 4717)
PASS: UBSan-Standalone-i386 :: TestCases/Integer/sub-overflow.cpp (4082 of 4717)
PASS: UBSan-Standalone-i386 :: TestCases/Integer/uadd-overflow.cpp (4083 of 4717)
PASS: UBSan-Standalone-i386 :: TestCases/Integer/umul-overflow.cpp (4084 of 4717)
UNSUPPORTED: UBSan-Standalone-i386 :: TestCases/Misc/Linux/print_stack_trace.cpp (4085 of 4717)
UNSUPPORTED: UBSan-Standalone-i386 :: TestCases/Misc/Linux/ubsan_options.cpp (4086 of 4717)
PASS: UBSan-Standalone-i386 :: TestCases/Integer/uincdec-overflow.cpp (4087 of 4717)
PASS: UBSan-Standalone-i386 :: TestCases/Misc/bool.cpp (4088 of 4717)
UNSUPPORTED: UBSan-Standalone-i386 :: TestCases/Misc/builtins.cpp (4089 of 4717)
PASS: UBSan-Standalone-i386 :: TestCases/Misc/bounds.cpp (4090 of 4717)
PASS: UBSan-Standalone-i386 :: TestCases/Integer/usub-overflow.cpp (4091 of 4717)
PASS: UBSan-Standalone-i386 :: TestCases/Misc/deduplication.cpp (4092 of 4717)
PASS: UBSan-Standalone-i386 :: TestCases/Integer/suppressions.cpp (4093 of 4717)
PASS: UBSan-Standalone-i386 :: TestCases/Misc/enum.cpp (4094 of 4717)
PASS: UBSan-Standalone-i386 :: TestCases/ImplicitConversion/unsigned-integer-truncation.c (4095 of 4717)
UNSUPPORTED: UBSan-Standalone-i386 :: TestCases/Misc/no-interception.cpp (4096 of 4717)
PASS: UBSan-Standalone-i386 :: TestCases/Misc/coverage-levels.cpp (4097 of 4717)
PASS: UBSan-Standalone-i386 :: TestCases/Misc/monitor.cpp (4098 of 4717)
PASS: UBSan-Standalone-i386 :: TestCases/Misc/log-path_test.cpp (4099 of 4717)
PASS: UBSan-Standalone-i386 :: TestCases/Misc/nonnull-arg.cpp (4100 of 4717)
PASS: UBSan-Standalone-i386 :: TestCases/Misc/print_summary.c (4101 of 4717)
PASS: UBSan-Standalone-i386 :: TestCases/Integer/shift.cpp (4102 of 4717)
PASS: UBSan-Standalone-i386 :: TestCases/Misc/nullability.c (4103 of 4717)
PASS: UBSan-Standalone-i386 :: TestCases/Misc/nonnull.cpp (4104 of 4717)
PASS: UBSan-Standalone-i386 :: TestCases/Misc/vla.c (4105 of 4717)
PASS: UBSan-Standalone-i386 :: TestCases/Misc/unreachable.cpp (4106 of 4717)
PASS: UBSan-Standalone-i386 :: TestCases/ImplicitConversion/unsigned-integer-truncation-blacklist.c (4107 of 4717)
PASS: UBSan-Standalone-i386 :: TestCases/Misc/missing_return.cpp (4108 of 4717)
PASS: UBSan-Standalone-i386 :: TestCases/Pointer/alignment-assumption-blacklist.cpp (4109 of 4717)
PASS: UBSan-Standalone-i386 :: TestCases/Pointer/alignment-assumption-attribute-align_value-on-paramvar.cpp (4110 of 4717)
PASS: UBSan-Standalone-i386 :: TestCases/Pointer/alignment-assumption-attribute-align_value-on-lvalue.cpp (4111 of 4717)
PASS: UBSan-Standalone-i386 :: TestCases/Pointer/alignment-assumption-attribute-alloc_align-on-function-variable.cpp (4112 of 4717)
PASS: UBSan-Standalone-i386 :: TestCases/Pointer/alignment-assumption-attribute-alloc_align-on-function.cpp (4113 of 4717)
UNSUPPORTED: UBSan-Standalone-i386 :: TestCases/Pointer/alignment-assumption-summary.cpp (4114 of 4717)
PASS: UBSan-Standalone-i386 :: TestCases/Pointer/alignment-assumption-attribute-assume_aligned-on-function-two-params.cpp (4115 of 4717)
PASS: UBSan-Standalone-i386 :: TestCases/Pointer/unsigned-index-expression.cpp (4116 of 4717)
UNSUPPORTED: UBSan-Standalone-i386 :: TestCases/TypeCheck/Function/function.cpp (4117 of 4717)
UNSUPPORTED: UBSan-Standalone-i386 :: TestCases/TypeCheck/Linux/PR33221.cpp (4118 of 4717)
PASS: UBSan-Standalone-i386 :: TestCases/Pointer/alignment-assumption-attribute-assume_aligned-on-function.cpp (4119 of 4717)
PASS: UBSan-Standalone-i386 :: TestCases/TypeCheck/PR33221.cpp (4120 of 4717)
PASS: UBSan-Standalone-i386 :: TestCases/Pointer/index-overflow.cpp (4121 of 4717)
PASS: UBSan-Standalone-i386 :: TestCases/TypeCheck/null.cpp (4122 of 4717)
PASS: UBSan-Standalone-i386 :: TestCases/TypeCheck/vptr-non-unique-typeinfo.cpp (4123 of 4717)
PASS: UBSan-Standalone-i386 :: TestCases/TypeCheck/vptr-corrupted-vtable-itanium.cpp (4124 of 4717)
PASS: UBSan-Standalone-i386 :: TestCases/TypeCheck/vptr-virtual-base-construction.cpp (4125 of 4717)
PASS: UBSan-Standalone-i386 :: TestCases/TypeCheck/vptr-virtual-base.cpp (4126 of 4717)
PASS: UBSan-Standalone-i386 :: TestCases/Pointer/alignment-assumption-builtin_assume_aligned-three-params-variable.cpp (4127 of 4717)
PASS: UBSan-Standalone-x86_64 :: TestCases/Float/cast-overflow.cpp (4128 of 4717)
PASS: UBSan-Standalone-i386 :: TestCases/Pointer/alignment-assumption-builtin_assume_aligned-three-params.cpp (4129 of 4717)
PASS: UBSan-Standalone-i386 :: TestCases/Pointer/alignment-assumption-builtin_assume_aligned-two-params.cpp (4130 of 4717)
UNSUPPORTED: UBSan-Standalone-x86_64 :: TestCases/ImplicitConversion/integer-sign-change-summary.cpp (4131 of 4717)
PASS: UBSan-Standalone-i386 :: TestCases/Pointer/alignment-assumption-openmp.cpp (4132 of 4717)
PASS: UBSan-Standalone-i386 :: TestCases/TypeCheck/misaligned.cpp (4133 of 4717)
PASS: UBSan-Standalone-x86_64 :: TestCases/ImplicitConversion/integer-sign-change-blacklist.c (4134 of 4717)
PASS: UBSan-Standalone-x86_64 :: TestCases/ImplicitConversion/integer-arithmetic-value-change.c (4135 of 4717)
UNSUPPORTED: UBSan-Standalone-x86_64 :: TestCases/ImplicitConversion/signed-integer-truncation-or-sign-change-summary.cpp (4136 of 4717)
UNSUPPORTED: UBSan-Standalone-x86_64 :: TestCases/ImplicitConversion/signed-integer-truncation-summary.cpp (4137 of 4717)
PASS: UBSan-Standalone-x86_64 :: TestCases/ImplicitConversion/integer-conversion.c (4138 of 4717)
PASS: UBSan-Standalone-x86_64 :: TestCases/ImplicitConversion/integer-truncation.c (4139 of 4717)
UNSUPPORTED: UBSan-Standalone-x86_64 :: TestCases/ImplicitConversion/unsigned-integer-truncation-summary.cpp (4140 of 4717)
PASS: UBSan-Standalone-x86_64 :: TestCases/ImplicitConversion/integer-sign-change.c (4141 of 4717)
PASS: UBSan-Standalone-x86_64 :: TestCases/ImplicitConversion/signed-integer-truncation-blacklist.c (4142 of 4717)
PASS: UBSan-Standalone-x86_64 :: TestCases/Integer/div-overflow.cpp (4143 of 4717)
PASS: UBSan-Standalone-x86_64 :: TestCases/Integer/add-overflow.cpp (4144 of 4717)
PASS: UBSan-Standalone-x86_64 :: TestCases/Integer/div-zero.cpp (4145 of 4717)
PASS: UBSan-AddressSanitizer-x86_64 :: TestCases/TypeCheck/vptr.cpp (4146 of 4717)
PASS: UBSan-Standalone-x86_64 :: TestCases/ImplicitConversion/signed-integer-truncation-or-sign-change-blacklist.c (4147 of 4717)
PASS: UBSan-Standalone-x86_64 :: TestCases/Integer/mul-overflow.cpp (4148 of 4717)
PASS: UBSan-Standalone-x86_64 :: TestCases/Integer/incdec-overflow.cpp (4149 of 4717)
PASS: UBSan-Standalone-x86_64 :: TestCases/Integer/negate-overflow.cpp (4150 of 4717)
UNSUPPORTED: UBSan-Standalone-x86_64 :: TestCases/Integer/summary.cpp (4151 of 4717)
PASS: UBSan-Standalone-x86_64 :: TestCases/Integer/no-recover.cpp (4152 of 4717)
PASS: UBSan-Standalone-x86_64 :: TestCases/Integer/sub-overflow.cpp (4153 of 4717)
PASS: UBSan-Standalone-x86_64 :: TestCases/Integer/uadd-overflow.cpp (4154 of 4717)
PASS: UBSan-Standalone-x86_64 :: TestCases/ImplicitConversion/signed-integer-truncation.c (4155 of 4717)
PASS: UBSan-Standalone-x86_64 :: TestCases/Integer/umul-overflow.cpp (4156 of 4717)
UNSUPPORTED: UBSan-Standalone-x86_64 :: TestCases/Misc/Linux/print_stack_trace.cpp (4157 of 4717)
UNSUPPORTED: UBSan-Standalone-x86_64 :: TestCases/Misc/Linux/ubsan_options.cpp (4158 of 4717)
PASS: UBSan-Standalone-x86_64 :: TestCases/Integer/uincdec-overflow.cpp (4159 of 4717)
PASS: UBSan-Standalone-x86_64 :: TestCases/Misc/bool.cpp (4160 of 4717)
PASS: UBSan-Standalone-x86_64 :: TestCases/ImplicitConversion/unsigned-integer-truncation.c (4161 of 4717)
PASS: UBSan-Standalone-x86_64 :: TestCases/Misc/bounds.cpp (4162 of 4717)
PASS: UBSan-Standalone-x86_64 :: TestCases/Integer/usub-overflow.cpp (4163 of 4717)
PASS: UBSan-Standalone-x86_64 :: TestCases/Misc/deduplication.cpp (4164 of 4717)
PASS: UBSan-Standalone-x86_64 :: TestCases/Integer/suppressions.cpp (4165 of 4717)
PASS: UBSan-Standalone-x86_64 :: TestCases/Misc/builtins.cpp (4166 of 4717)
PASS: UBSan-Standalone-x86_64 :: TestCases/Misc/monitor.cpp (4167 of 4717)
UNSUPPORTED: UBSan-Standalone-x86_64 :: TestCases/Misc/no-interception.cpp (4168 of 4717)
PASS: UBSan-Standalone-x86_64 :: TestCases/ImplicitConversion/unsigned-integer-truncation-blacklist.c (4169 of 4717)
PASS: UBSan-Standalone-x86_64 :: TestCases/Misc/enum.cpp (4170 of 4717)
PASS: UBSan-Standalone-x86_64 :: TestCases/Integer/shift.cpp (4171 of 4717)
PASS: UBSan-Standalone-x86_64 :: TestCases/Misc/nonnull-arg.cpp (4172 of 4717)
PASS: UBSan-Standalone-x86_64 :: TestCases/Misc/coverage-levels.cpp (4173 of 4717)
PASS: UBSan-Standalone-x86_64 :: TestCases/Misc/log-path_test.cpp (4174 of 4717)
PASS: UBSan-Standalone-x86_64 :: TestCases/Misc/print_summary.c (4175 of 4717)
PASS: UBSan-Standalone-x86_64 :: TestCases/Misc/nonnull.cpp (4176 of 4717)
PASS: UBSan-Standalone-x86_64 :: TestCases/Misc/nullability.c (4177 of 4717)
PASS: UBSan-Standalone-x86_64 :: TestCases/Misc/vla.c (4178 of 4717)
PASS: UBSan-Standalone-x86_64 :: TestCases/Misc/unreachable.cpp (4179 of 4717)
PASS: UBSan-Standalone-x86_64 :: TestCases/Misc/missing_return.cpp (4180 of 4717)
PASS: UBSan-Standalone-x86_64 :: TestCases/Pointer/alignment-assumption-blacklist.cpp (4181 of 4717)
PASS: UBSan-Standalone-x86_64 :: TestCases/Pointer/alignment-assumption-attribute-align_value-on-paramvar.cpp (4182 of 4717)
PASS: UBSan-Standalone-x86_64 :: TestCases/Pointer/alignment-assumption-attribute-alloc_align-on-function.cpp (4183 of 4717)
PASS: UBSan-Standalone-x86_64 :: TestCases/Pointer/alignment-assumption-attribute-alloc_align-on-function-variable.cpp (4184 of 4717)
PASS: UBSan-Standalone-x86_64 :: TestCases/Pointer/alignment-assumption-attribute-align_value-on-lvalue.cpp (4185 of 4717)
UNSUPPORTED: UBSan-Standalone-x86_64 :: TestCases/Pointer/alignment-assumption-summary.cpp (4186 of 4717)
PASS: UBSan-Standalone-x86_64 :: TestCases/Pointer/alignment-assumption-attribute-assume_aligned-on-function-two-params.cpp (4187 of 4717)
PASS: UBSan-Standalone-x86_64 :: TestCases/Pointer/alignment-assumption-attribute-assume_aligned-on-function.cpp (4188 of 4717)
PASS: UBSan-Standalone-x86_64 :: TestCases/Pointer/unsigned-index-expression.cpp (4189 of 4717)
UNSUPPORTED: UBSan-Standalone-x86_64 :: TestCases/TypeCheck/Linux/PR33221.cpp (4190 of 4717)
PASS: UBSan-Standalone-x86_64 :: TestCases/TypeCheck/PR33221.cpp (4191 of 4717)
PASS: UBSan-Standalone-x86_64 :: TestCases/Pointer/index-overflow.cpp (4192 of 4717)
PASS: UBSan-Standalone-x86_64 :: TestCases/TypeCheck/null.cpp (4193 of 4717)
PASS: UBSan-Standalone-x86_64 :: TestCases/TypeCheck/vptr-corrupted-vtable-itanium.cpp (4194 of 4717)
PASS: UBSan-Standalone-i386 :: TestCases/TypeCheck/vptr.cpp (4195 of 4717)
PASS: UBSan-Standalone-x86_64 :: TestCases/Pointer/alignment-assumption-builtin_assume_aligned-three-params-variable.cpp (4196 of 4717)
PASS: UBSan-Standalone-x86_64 :: TestCases/TypeCheck/vptr-virtual-base-construction.cpp (4197 of 4717)
PASS: UBSan-Standalone-x86_64 :: TestCases/TypeCheck/vptr-virtual-base.cpp (4198 of 4717)
PASS: UBSan-Standalone-x86_64 :: TestCases/TypeCheck/vptr-non-unique-typeinfo.cpp (4199 of 4717)
PASS: UBSan-StandaloneStatic-i386 :: TestCases/Float/cast-overflow.cpp (4200 of 4717)
PASS: UBSan-Standalone-x86_64 :: TestCases/Pointer/alignment-assumption-builtin_assume_aligned-two-params.cpp (4201 of 4717)
PASS: UBSan-Standalone-x86_64 :: TestCases/Pointer/alignment-assumption-builtin_assume_aligned-three-params.cpp (4202 of 4717)
UNSUPPORTED: UBSan-StandaloneStatic-i386 :: TestCases/ImplicitConversion/integer-sign-change-summary.cpp (4203 of 4717)
PASS: UBSan-Standalone-x86_64 :: TestCases/Pointer/alignment-assumption-openmp.cpp (4204 of 4717)
PASS: UBSan-Standalone-x86_64 :: TestCases/TypeCheck/misaligned.cpp (4205 of 4717)
PASS: UBSan-StandaloneStatic-i386 :: TestCases/ImplicitConversion/integer-sign-change-blacklist.c (4206 of 4717)
PASS: UBSan-Standalone-x86_64 :: TestCases/TypeCheck/Function/function.cpp (4207 of 4717)
UNSUPPORTED: UBSan-StandaloneStatic-i386 :: TestCases/ImplicitConversion/signed-integer-truncation-or-sign-change-summary.cpp (4208 of 4717)
UNSUPPORTED: UBSan-StandaloneStatic-i386 :: TestCases/ImplicitConversion/signed-integer-truncation-summary.cpp (4209 of 4717)
PASS: UBSan-StandaloneStatic-i386 :: TestCases/ImplicitConversion/integer-arithmetic-value-change.c (4210 of 4717)
PASS: UBSan-StandaloneStatic-i386 :: TestCases/ImplicitConversion/integer-truncation.c (4211 of 4717)
UNSUPPORTED: UBSan-StandaloneStatic-i386 :: TestCases/ImplicitConversion/unsigned-integer-truncation-summary.cpp (4212 of 4717)
PASS: UBSan-StandaloneStatic-i386 :: TestCases/ImplicitConversion/integer-conversion.c (4213 of 4717)
PASS: UBSan-StandaloneStatic-i386 :: TestCases/ImplicitConversion/integer-sign-change.c (4214 of 4717)
PASS: UBSan-StandaloneStatic-i386 :: TestCases/Integer/div-overflow.cpp (4215 of 4717)
PASS: UBSan-StandaloneStatic-i386 :: TestCases/ImplicitConversion/signed-integer-truncation-blacklist.c (4216 of 4717)
PASS: UBSan-StandaloneStatic-i386 :: TestCases/Integer/add-overflow.cpp (4217 of 4717)
PASS: UBSan-StandaloneStatic-i386 :: TestCases/Integer/mul-overflow.cpp (4218 of 4717)
PASS: UBSan-StandaloneStatic-i386 :: TestCases/Integer/div-zero.cpp (4219 of 4717)
PASS: UBSan-StandaloneStatic-i386 :: TestCases/Integer/incdec-overflow.cpp (4220 of 4717)
PASS: UBSan-StandaloneStatic-i386 :: TestCases/Integer/negate-overflow.cpp (4221 of 4717)
PASS: UBSan-StandaloneStatic-i386 :: TestCases/ImplicitConversion/signed-integer-truncation-or-sign-change-blacklist.c (4222 of 4717)
UNSUPPORTED: UBSan-StandaloneStatic-i386 :: TestCases/Integer/summary.cpp (4223 of 4717)
PASS: UBSan-StandaloneStatic-i386 :: TestCases/Integer/no-recover.cpp (4224 of 4717)
PASS: UBSan-StandaloneStatic-i386 :: TestCases/Integer/sub-overflow.cpp (4225 of 4717)
PASS: UBSan-StandaloneStatic-i386 :: TestCases/Integer/uadd-overflow.cpp (4226 of 4717)
PASS: UBSan-StandaloneStatic-i386 :: TestCases/Integer/umul-overflow.cpp (4227 of 4717)
PASS: UBSan-StandaloneStatic-i386 :: TestCases/ImplicitConversion/signed-integer-truncation.c (4228 of 4717)
UNSUPPORTED: UBSan-StandaloneStatic-i386 :: TestCases/Misc/Linux/print_stack_trace.cpp (4229 of 4717)
UNSUPPORTED: UBSan-StandaloneStatic-i386 :: TestCases/Misc/Linux/ubsan_options.cpp (4230 of 4717)
PASS: UBSan-StandaloneStatic-i386 :: TestCases/Misc/bool.cpp (4231 of 4717)
PASS: UBSan-StandaloneStatic-i386 :: TestCases/Integer/uincdec-overflow.cpp (4232 of 4717)
UNSUPPORTED: UBSan-StandaloneStatic-i386 :: TestCases/Misc/builtins.cpp (4233 of 4717)
UNSUPPORTED: UBSan-StandaloneStatic-i386 :: TestCases/Misc/coverage-levels.cpp (4234 of 4717)
PASS: UBSan-StandaloneStatic-i386 :: TestCases/Misc/deduplication.cpp (4235 of 4717)
PASS: UBSan-StandaloneStatic-i386 :: TestCases/Misc/bounds.cpp (4236 of 4717)
PASS: UBSan-StandaloneStatic-i386 :: TestCases/Integer/usub-overflow.cpp (4237 of 4717)
PASS: UBSan-StandaloneStatic-i386 :: TestCases/ImplicitConversion/unsigned-integer-truncation.c (4238 of 4717)
PASS: UBSan-StandaloneStatic-i386 :: TestCases/Integer/suppressions.cpp (4239 of 4717)
UNSUPPORTED: UBSan-StandaloneStatic-i386 :: TestCases/Misc/no-interception.cpp (4240 of 4717)
PASS: UBSan-StandaloneStatic-i386 :: TestCases/Misc/monitor.cpp (4241 of 4717)
PASS: UBSan-StandaloneStatic-i386 :: TestCases/Misc/enum.cpp (4242 of 4717)
PASS: UBSan-StandaloneStatic-i386 :: TestCases/Misc/nonnull-arg.cpp (4243 of 4717)
PASS: UBSan-StandaloneStatic-i386 :: TestCases/ImplicitConversion/unsigned-integer-truncation-blacklist.c (4244 of 4717)
PASS: UBSan-StandaloneStatic-i386 :: TestCases/Misc/log-path_test.cpp (4245 of 4717)
PASS: UBSan-StandaloneStatic-i386 :: TestCases/Misc/nullability.c (4246 of 4717)
PASS: UBSan-StandaloneStatic-i386 :: TestCases/Misc/nonnull.cpp (4247 of 4717)
PASS: UBSan-StandaloneStatic-i386 :: TestCases/Integer/shift.cpp (4248 of 4717)
PASS: UBSan-StandaloneStatic-i386 :: TestCases/Misc/print_summary.c (4249 of 4717)
PASS: UBSan-StandaloneStatic-i386 :: TestCases/Misc/vla.c (4250 of 4717)
PASS: UBSan-StandaloneStatic-i386 :: TestCases/Misc/unreachable.cpp (4251 of 4717)
PASS: UBSan-StandaloneStatic-i386 :: TestCases/Misc/missing_return.cpp (4252 of 4717)
PASS: UBSan-StandaloneStatic-i386 :: TestCases/Pointer/alignment-assumption-blacklist.cpp (4253 of 4717)
PASS: UBSan-StandaloneStatic-i386 :: TestCases/Pointer/alignment-assumption-attribute-alloc_align-on-function.cpp (4254 of 4717)
PASS: UBSan-StandaloneStatic-i386 :: TestCases/Pointer/alignment-assumption-attribute-alloc_align-on-function-variable.cpp (4255 of 4717)
PASS: UBSan-StandaloneStatic-i386 :: TestCases/Pointer/alignment-assumption-attribute-align_value-on-paramvar.cpp (4256 of 4717)
PASS: UBSan-StandaloneStatic-i386 :: TestCases/Pointer/alignment-assumption-attribute-align_value-on-lvalue.cpp (4257 of 4717)
UNSUPPORTED: UBSan-StandaloneStatic-i386 :: TestCases/Pointer/alignment-assumption-summary.cpp (4258 of 4717)
PASS: UBSan-StandaloneStatic-i386 :: TestCases/Pointer/alignment-assumption-attribute-assume_aligned-on-function-two-params.cpp (4259 of 4717)
PASS: UBSan-StandaloneStatic-i386 :: TestCases/Pointer/alignment-assumption-attribute-assume_aligned-on-function.cpp (4260 of 4717)
UNSUPPORTED: UBSan-StandaloneStatic-i386 :: TestCases/TypeCheck/Function/function.cpp (4261 of 4717)
UNSUPPORTED: UBSan-StandaloneStatic-i386 :: TestCases/TypeCheck/Linux/PR33221.cpp (4262 of 4717)
PASS: UBSan-StandaloneStatic-i386 :: TestCases/Pointer/unsigned-index-expression.cpp (4263 of 4717)
PASS: UBSan-StandaloneStatic-i386 :: TestCases/TypeCheck/PR33221.cpp (4264 of 4717)
PASS: UBSan-StandaloneStatic-i386 :: TestCases/Pointer/index-overflow.cpp (4265 of 4717)
PASS: UBSan-StandaloneStatic-i386 :: TestCases/TypeCheck/null.cpp (4266 of 4717)
PASS: UBSan-StandaloneStatic-i386 :: TestCases/TypeCheck/vptr-non-unique-typeinfo.cpp (4267 of 4717)
PASS: UBSan-StandaloneStatic-i386 :: TestCases/TypeCheck/vptr-corrupted-vtable-itanium.cpp (4268 of 4717)
PASS: UBSan-Standalone-x86_64 :: TestCases/TypeCheck/vptr.cpp (4269 of 4717)
PASS: UBSan-StandaloneStatic-i386 :: TestCases/TypeCheck/vptr-virtual-base-construction.cpp (4270 of 4717)
PASS: UBSan-StandaloneStatic-i386 :: TestCases/Pointer/alignment-assumption-builtin_assume_aligned-three-params-variable.cpp (4271 of 4717)
PASS: UBSan-StandaloneStatic-i386 :: TestCases/TypeCheck/vptr-virtual-base.cpp (4272 of 4717)
PASS: UBSan-StandaloneStatic-x86_64 :: TestCases/Float/cast-overflow.cpp (4273 of 4717)
PASS: UBSan-StandaloneStatic-i386 :: TestCases/TypeCheck/misaligned.cpp (4274 of 4717)
UNSUPPORTED: UBSan-StandaloneStatic-x86_64 :: TestCases/ImplicitConversion/integer-sign-change-summary.cpp (4275 of 4717)
PASS: UBSan-StandaloneStatic-i386 :: TestCases/Pointer/alignment-assumption-openmp.cpp (4276 of 4717)
PASS: UBSan-StandaloneStatic-i386 :: TestCases/Pointer/alignment-assumption-builtin_assume_aligned-two-params.cpp (4277 of 4717)
PASS: UBSan-StandaloneStatic-i386 :: TestCases/Pointer/alignment-assumption-builtin_assume_aligned-three-params.cpp (4278 of 4717)
PASS: UBSan-StandaloneStatic-x86_64 :: TestCases/ImplicitConversion/integer-sign-change-blacklist.c (4279 of 4717)
UNSUPPORTED: UBSan-StandaloneStatic-x86_64 :: TestCases/ImplicitConversion/signed-integer-truncation-or-sign-change-summary.cpp (4280 of 4717)
UNSUPPORTED: UBSan-StandaloneStatic-x86_64 :: TestCases/ImplicitConversion/signed-integer-truncation-summary.cpp (4281 of 4717)
PASS: UBSan-StandaloneStatic-x86_64 :: TestCases/ImplicitConversion/integer-arithmetic-value-change.c (4282 of 4717)
PASS: UBSan-StandaloneStatic-x86_64 :: TestCases/ImplicitConversion/integer-conversion.c (4283 of 4717)
UNSUPPORTED: UBSan-StandaloneStatic-x86_64 :: TestCases/ImplicitConversion/unsigned-integer-truncation-summary.cpp (4284 of 4717)
PASS: UBSan-StandaloneStatic-x86_64 :: TestCases/ImplicitConversion/signed-integer-truncation.c (4285 of 4717)
PASS: UBSan-StandaloneStatic-x86_64 :: TestCases/ImplicitConversion/integer-truncation.c (4286 of 4717)
PASS: UBSan-StandaloneStatic-x86_64 :: TestCases/ImplicitConversion/integer-sign-change.c (4287 of 4717)
PASS: UBSan-StandaloneStatic-x86_64 :: TestCases/ImplicitConversion/signed-integer-truncation-or-sign-change-blacklist.c (4288 of 4717)
PASS: UBSan-StandaloneStatic-x86_64 :: TestCases/Integer/div-overflow.cpp (4289 of 4717)
PASS: UBSan-StandaloneStatic-x86_64 :: TestCases/ImplicitConversion/signed-integer-truncation-blacklist.c (4290 of 4717)
PASS: UBSan-StandaloneStatic-x86_64 :: TestCases/Integer/mul-overflow.cpp (4291 of 4717)
PASS: UBSan-StandaloneStatic-x86_64 :: TestCases/Integer/add-overflow.cpp (4292 of 4717)
PASS: UBSan-StandaloneStatic-x86_64 :: TestCases/Integer/div-zero.cpp (4293 of 4717)
PASS: UBSan-StandaloneStatic-x86_64 :: TestCases/Integer/negate-overflow.cpp (4294 of 4717)
UNSUPPORTED: UBSan-StandaloneStatic-x86_64 :: TestCases/Integer/summary.cpp (4295 of 4717)
PASS: UBSan-StandaloneStatic-x86_64 :: TestCases/Integer/incdec-overflow.cpp (4296 of 4717)
PASS: UBSan-StandaloneStatic-x86_64 :: TestCases/Integer/no-recover.cpp (4297 of 4717)
PASS: UBSan-StandaloneStatic-x86_64 :: TestCases/Integer/sub-overflow.cpp (4298 of 4717)
PASS: UBSan-StandaloneStatic-x86_64 :: TestCases/Integer/umul-overflow.cpp (4299 of 4717)
PASS: UBSan-StandaloneStatic-x86_64 :: TestCases/Integer/uadd-overflow.cpp (4300 of 4717)
UNSUPPORTED: UBSan-StandaloneStatic-x86_64 :: TestCases/Misc/Linux/print_stack_trace.cpp (4301 of 4717)
UNSUPPORTED: UBSan-StandaloneStatic-x86_64 :: TestCases/Misc/Linux/ubsan_options.cpp (4302 of 4717)
PASS: UBSan-StandaloneStatic-x86_64 :: TestCases/Integer/uincdec-overflow.cpp (4303 of 4717)
PASS: UBSan-StandaloneStatic-x86_64 :: TestCases/Misc/bool.cpp (4304 of 4717)
PASS: UBSan-StandaloneStatic-x86_64 :: TestCases/Misc/bounds.cpp (4305 of 4717)
UNSUPPORTED: UBSan-StandaloneStatic-x86_64 :: TestCases/Misc/coverage-levels.cpp (4306 of 4717)
PASS: UBSan-StandaloneStatic-x86_64 :: TestCases/Misc/builtins.cpp (4307 of 4717)
PASS: UBSan-StandaloneStatic-x86_64 :: TestCases/Integer/usub-overflow.cpp (4308 of 4717)
PASS: UBSan-StandaloneStatic-x86_64 :: TestCases/Misc/deduplication.cpp (4309 of 4717)
PASS: UBSan-StandaloneStatic-x86_64 :: TestCases/ImplicitConversion/unsigned-integer-truncation.c (4310 of 4717)
PASS: UBSan-StandaloneStatic-x86_64 :: TestCases/Misc/monitor.cpp (4311 of 4717)
UNSUPPORTED: UBSan-StandaloneStatic-x86_64 :: TestCases/Misc/no-interception.cpp (4312 of 4717)
PASS: UBSan-StandaloneStatic-x86_64 :: TestCases/Misc/enum.cpp (4313 of 4717)
PASS: UBSan-StandaloneStatic-x86_64 :: TestCases/Integer/suppressions.cpp (4314 of 4717)
PASS: UBSan-StandaloneStatic-x86_64 :: TestCases/Misc/log-path_test.cpp (4315 of 4717)
PASS: UBSan-StandaloneStatic-x86_64 :: TestCases/Misc/nullability.c (4316 of 4717)
PASS: UBSan-StandaloneStatic-x86_64 :: TestCases/Misc/nonnull-arg.cpp (4317 of 4717)
PASS: UBSan-StandaloneStatic-x86_64 :: TestCases/Misc/print_summary.c (4318 of 4717)
PASS: UBSan-StandaloneStatic-x86_64 :: TestCases/Misc/nonnull.cpp (4319 of 4717)
PASS: UBSan-StandaloneStatic-x86_64 :: TestCases/ImplicitConversion/unsigned-integer-truncation-blacklist.c (4320 of 4717)
PASS: UBSan-StandaloneStatic-x86_64 :: TestCases/Integer/shift.cpp (4321 of 4717)
PASS: UBSan-StandaloneStatic-x86_64 :: TestCases/Misc/vla.c (4322 of 4717)
PASS: UBSan-StandaloneStatic-x86_64 :: TestCases/Misc/unreachable.cpp (4323 of 4717)
PASS: UBSan-StandaloneStatic-x86_64 :: TestCases/Misc/missing_return.cpp (4324 of 4717)
PASS: UBSan-StandaloneStatic-x86_64 :: TestCases/Pointer/alignment-assumption-blacklist.cpp (4325 of 4717)
PASS: UBSan-StandaloneStatic-x86_64 :: TestCases/Pointer/alignment-assumption-attribute-alloc_align-on-function-variable.cpp (4326 of 4717)
PASS: UBSan-StandaloneStatic-x86_64 :: TestCases/Pointer/alignment-assumption-attribute-align_value-on-paramvar.cpp (4327 of 4717)
PASS: UBSan-StandaloneStatic-x86_64 :: TestCases/Pointer/alignment-assumption-attribute-align_value-on-lvalue.cpp (4328 of 4717)
PASS: UBSan-StandaloneStatic-x86_64 :: TestCases/Pointer/alignment-assumption-attribute-alloc_align-on-function.cpp (4329 of 4717)
UNSUPPORTED: UBSan-StandaloneStatic-x86_64 :: TestCases/Pointer/alignment-assumption-summary.cpp (4330 of 4717)
PASS: UBSan-StandaloneStatic-x86_64 :: TestCases/Pointer/alignment-assumption-attribute-assume_aligned-on-function-two-params.cpp (4331 of 4717)
PASS: UBSan-StandaloneStatic-x86_64 :: TestCases/Pointer/unsigned-index-expression.cpp (4332 of 4717)
PASS: UBSan-StandaloneStatic-x86_64 :: TestCases/Pointer/alignment-assumption-attribute-assume_aligned-on-function.cpp (4333 of 4717)
UNSUPPORTED: UBSan-StandaloneStatic-x86_64 :: TestCases/TypeCheck/Linux/PR33221.cpp (4334 of 4717)
PASS: UBSan-StandaloneStatic-x86_64 :: TestCases/Pointer/index-overflow.cpp (4335 of 4717)
PASS: UBSan-StandaloneStatic-x86_64 :: TestCases/TypeCheck/PR33221.cpp (4336 of 4717)
PASS: UBSan-StandaloneStatic-x86_64 :: TestCases/TypeCheck/null.cpp (4337 of 4717)
PASS: UBSan-StandaloneStatic-x86_64 :: TestCases/Pointer/alignment-assumption-builtin_assume_aligned-three-params-variable.cpp (4338 of 4717)
PASS: UBSan-StandaloneStatic-x86_64 :: TestCases/TypeCheck/vptr-corrupted-vtable-itanium.cpp (4339 of 4717)
PASS: UBSan-StandaloneStatic-i386 :: TestCases/TypeCheck/vptr.cpp (4340 of 4717)
PASS: UBSan-StandaloneStatic-x86_64 :: TestCases/TypeCheck/vptr-virtual-base-construction.cpp (4341 of 4717)
PASS: UBSan-StandaloneStatic-x86_64 :: TestCases/TypeCheck/vptr-non-unique-typeinfo.cpp (4342 of 4717)
PASS: UBSan-StandaloneStatic-x86_64 :: TestCases/TypeCheck/vptr-virtual-base.cpp (4343 of 4717)
PASS: UBSan-StandaloneStatic-x86_64 :: TestCases/Pointer/alignment-assumption-openmp.cpp (4344 of 4717)
PASS: UBSan-StandaloneStatic-x86_64 :: TestCases/Pointer/alignment-assumption-builtin_assume_aligned-two-params.cpp (4345 of 4717)
PASS: UBSan-StandaloneStatic-x86_64 :: TestCases/Pointer/alignment-assumption-builtin_assume_aligned-three-params.cpp (4346 of 4717)
PASS: UBSan-StandaloneStatic-x86_64 :: TestCases/TypeCheck/misaligned.cpp (4347 of 4717)
PASS: UBSan-StandaloneStatic-x86_64 :: TestCases/TypeCheck/Function/function.cpp (4348 of 4717)
PASS: UBSan-ThreadSanitizer-x86_64 :: TestCases/Float/cast-overflow.cpp (4349 of 4717)
PASS: UBSan-StandaloneStatic-x86_64 :: TestCases/TypeCheck/vptr.cpp (4350 of 4717)
PASS: UBSan-ThreadSanitizer-x86_64 :: TestCases/ImplicitConversion/integer-sign-change-blacklist.c (4351 of 4717)
PASS: UBSan-ThreadSanitizer-x86_64 :: TestCases/ImplicitConversion/integer-sign-change-summary.cpp (4352 of 4717)
PASS: UBSan-ThreadSanitizer-x86_64 :: TestCases/ImplicitConversion/integer-arithmetic-value-change.c (4353 of 4717)
PASS: UBSan-ThreadSanitizer-x86_64 :: TestCases/ImplicitConversion/integer-conversion.c (4354 of 4717)
PASS: UBSan-ThreadSanitizer-x86_64 :: TestCases/ImplicitConversion/integer-sign-change.c (4355 of 4717)
PASS: UBSan-ThreadSanitizer-x86_64 :: TestCases/ImplicitConversion/integer-truncation.c (4356 of 4717)
PASS: UBSan-ThreadSanitizer-x86_64 :: TestCases/ImplicitConversion/signed-integer-truncation-or-sign-change-summary.cpp (4357 of 4717)
PASS: UBSan-ThreadSanitizer-x86_64 :: TestCases/ImplicitConversion/signed-integer-truncation-summary.cpp (4358 of 4717)
PASS: UBSan-ThreadSanitizer-x86_64 :: TestCases/ImplicitConversion/signed-integer-truncation-blacklist.c (4359 of 4717)
PASS: UBSan-ThreadSanitizer-x86_64 :: TestCases/ImplicitConversion/signed-integer-truncation-or-sign-change-blacklist.c (4360 of 4717)
PASS: UBSan-ThreadSanitizer-x86_64 :: TestCases/ImplicitConversion/unsigned-integer-truncation-summary.cpp (4361 of 4717)
PASS: UBSan-ThreadSanitizer-x86_64 :: TestCases/ImplicitConversion/signed-integer-truncation.c (4362 of 4717)
PASS: UBSan-ThreadSanitizer-x86_64 :: TestCases/Integer/add-overflow.cpp (4363 of 4717)
PASS: UBSan-ThreadSanitizer-x86_64 :: TestCases/Integer/div-overflow.cpp (4364 of 4717)
PASS: UBSan-ThreadSanitizer-x86_64 :: TestCases/Integer/div-zero.cpp (4365 of 4717)
PASS: UBSan-ThreadSanitizer-x86_64 :: TestCases/Integer/incdec-overflow.cpp (4366 of 4717)
PASS: UBSan-ThreadSanitizer-x86_64 :: TestCases/Integer/mul-overflow.cpp (4367 of 4717)
PASS: UBSan-ThreadSanitizer-x86_64 :: TestCases/ImplicitConversion/unsigned-integer-truncation-blacklist.c (4368 of 4717)
PASS: UBSan-ThreadSanitizer-x86_64 :: TestCases/Integer/negate-overflow.cpp (4369 of 4717)
PASS: UBSan-ThreadSanitizer-x86_64 :: TestCases/ImplicitConversion/unsigned-integer-truncation.c (4370 of 4717)
PASS: UBSan-ThreadSanitizer-x86_64 :: TestCases/Integer/no-recover.cpp (4371 of 4717)
UNSUPPORTED: UBSan-ThreadSanitizer-x86_64 :: TestCases/Integer/summary.cpp (4372 of 4717)
PASS: UBSan-ThreadSanitizer-x86_64 :: TestCases/Integer/sub-overflow.cpp (4373 of 4717)
PASS: UBSan-ThreadSanitizer-x86_64 :: TestCases/Integer/uadd-overflow.cpp (4374 of 4717)
PASS: UBSan-ThreadSanitizer-x86_64 :: TestCases/Integer/suppressions.cpp (4375 of 4717)
PASS: UBSan-ThreadSanitizer-x86_64 :: TestCases/Integer/umul-overflow.cpp (4376 of 4717)
PASS: UBSan-ThreadSanitizer-x86_64 :: TestCases/Integer/uincdec-overflow.cpp (4377 of 4717)
UNSUPPORTED: UBSan-ThreadSanitizer-x86_64 :: TestCases/Misc/Linux/print_stack_trace.cpp (4378 of 4717)
UNSUPPORTED: UBSan-ThreadSanitizer-x86_64 :: TestCases/Misc/Linux/ubsan_options.cpp (4379 of 4717)
PASS: UBSan-ThreadSanitizer-x86_64 :: TestCases/Misc/bool.cpp (4380 of 4717)
PASS: UBSan-ThreadSanitizer-x86_64 :: TestCases/Integer/usub-overflow.cpp (4381 of 4717)
PASS: UBSan-ThreadSanitizer-x86_64 :: TestCases/Misc/builtins.cpp (4382 of 4717)
XFAIL: UBSan-ThreadSanitizer-x86_64 :: TestCases/Misc/coverage-levels.cpp (4383 of 4717)
PASS: UBSan-ThreadSanitizer-x86_64 :: TestCases/Misc/bounds.cpp (4384 of 4717)
PASS: UBSan-ThreadSanitizer-x86_64 :: TestCases/Integer/shift.cpp (4385 of 4717)
PASS: UBSan-ThreadSanitizer-x86_64 :: TestCases/Misc/deduplication.cpp (4386 of 4717)
PASS: UBSan-ThreadSanitizer-x86_64 :: TestCases/Misc/missing_return.cpp (4387 of 4717)
PASS: UBSan-ThreadSanitizer-x86_64 :: TestCases/Misc/enum.cpp (4388 of 4717)
UNSUPPORTED: UBSan-ThreadSanitizer-x86_64 :: TestCases/Misc/no-interception.cpp (4389 of 4717)
PASS: UBSan-ThreadSanitizer-x86_64 :: TestCases/Misc/log-path_test.cpp (4390 of 4717)
PASS: UBSan-ThreadSanitizer-x86_64 :: TestCases/Misc/monitor.cpp (4391 of 4717)
PASS: UBSan-ThreadSanitizer-x86_64 :: TestCases/Misc/nullability.c (4392 of 4717)
PASS: UBSan-ThreadSanitizer-x86_64 :: TestCases/Misc/nonnull.cpp (4393 of 4717)
PASS: UBSan-ThreadSanitizer-x86_64 :: TestCases/Misc/print_summary.c (4394 of 4717)
PASS: UBSan-ThreadSanitizer-x86_64 :: TestCases/Misc/unreachable.cpp (4395 of 4717)
PASS: UBSan-ThreadSanitizer-x86_64 :: TestCases/Misc/nonnull-arg.cpp (4396 of 4717)
PASS: UBSan-ThreadSanitizer-x86_64 :: TestCases/Misc/vla.c (4397 of 4717)
PASS: UBSan-ThreadSanitizer-x86_64 :: TestCases/Pointer/alignment-assumption-attribute-align_value-on-lvalue.cpp (4398 of 4717)
PASS: UBSan-ThreadSanitizer-x86_64 :: TestCases/Pointer/alignment-assumption-attribute-align_value-on-paramvar.cpp (4399 of 4717)
PASS: UBSan-ThreadSanitizer-x86_64 :: TestCases/Pointer/alignment-assumption-attribute-alloc_align-on-function-variable.cpp (4400 of 4717)
PASS: UBSan-ThreadSanitizer-x86_64 :: TestCases/Pointer/alignment-assumption-attribute-alloc_align-on-function.cpp (4401 of 4717)
PASS: UBSan-ThreadSanitizer-x86_64 :: TestCases/Pointer/alignment-assumption-attribute-assume_aligned-on-function-two-params.cpp (4402 of 4717)
PASS: UBSan-ThreadSanitizer-x86_64 :: TestCases/Pointer/alignment-assumption-attribute-assume_aligned-on-function.cpp (4403 of 4717)
PASS: UBSan-ThreadSanitizer-x86_64 :: TestCases/Pointer/alignment-assumption-blacklist.cpp (4404 of 4717)
PASS: UBSan-ThreadSanitizer-x86_64 :: TestCases/Pointer/alignment-assumption-builtin_assume_aligned-three-params-variable.cpp (4405 of 4717)
PASS: UBSan-ThreadSanitizer-x86_64 :: TestCases/Pointer/alignment-assumption-builtin_assume_aligned-three-params.cpp (4406 of 4717)
PASS: UBSan-ThreadSanitizer-x86_64 :: TestCases/Pointer/alignment-assumption-builtin_assume_aligned-two-params.cpp (4407 of 4717)
PASS: UBSan-ThreadSanitizer-x86_64 :: TestCases/Pointer/alignment-assumption-summary.cpp (4408 of 4717)
PASS: UBSan-ThreadSanitizer-x86_64 :: TestCases/Pointer/unsigned-index-expression.cpp (4409 of 4717)
PASS: UBSan-ThreadSanitizer-x86_64 :: TestCases/Pointer/index-overflow.cpp (4410 of 4717)
UNSUPPORTED: UBSan-ThreadSanitizer-x86_64 :: TestCases/TypeCheck/Linux/PR33221.cpp (4411 of 4717)
PASS: UBSan-ThreadSanitizer-x86_64 :: TestCases/TypeCheck/PR33221.cpp (4412 of 4717)
PASS: UBSan-ThreadSanitizer-x86_64 :: TestCases/TypeCheck/Function/function.cpp (4413 of 4717)
PASS: UBSan-ThreadSanitizer-x86_64 :: TestCases/Pointer/alignment-assumption-openmp.cpp (4414 of 4717)
UNSUPPORTED: XRay-x86_64-darwin :: TestCases/Posix/always-never-instrument.cpp (4415 of 4717)
UNSUPPORTED: XRay-x86_64-darwin :: TestCases/Posix/arg1-arg0-logging.cpp (4416 of 4717)
UNSUPPORTED: XRay-x86_64-darwin :: TestCases/Posix/arg1-logger.cpp (4417 of 4717)
UNSUPPORTED: XRay-x86_64-darwin :: TestCases/Posix/arg1-logging-implicit-this.cpp (4418 of 4717)
UNSUPPORTED: XRay-x86_64-darwin :: TestCases/Posix/argv0-log-file-name.cpp (4419 of 4717)
UNSUPPORTED: XRay-x86_64-darwin :: TestCases/Posix/basic-filtering.cpp (4420 of 4717)
UNSUPPORTED: XRay-x86_64-darwin :: TestCases/Posix/c-test.cpp (4421 of 4717)
UNSUPPORTED: XRay-x86_64-darwin :: TestCases/Posix/clang-no-xray-instrument.cpp (4422 of 4717)
UNSUPPORTED: XRay-x86_64-darwin :: TestCases/Posix/common-trampoline-alignment.cpp (4423 of 4717)
UNSUPPORTED: XRay-x86_64-darwin :: TestCases/Posix/coverage-sample.cpp (4424 of 4717)
UNSUPPORTED: XRay-x86_64-darwin :: TestCases/Posix/custom-event-handler-alignment.cpp (4425 of 4717)
UNSUPPORTED: XRay-x86_64-darwin :: TestCases/Posix/custom-event-logging.cpp (4426 of 4717)
UNSUPPORTED: XRay-x86_64-darwin :: TestCases/Posix/fdr-mode-inmemory.cpp (4427 of 4717)
UNSUPPORTED: XRay-x86_64-darwin :: TestCases/Posix/fdr-mode-multiple.cpp (4428 of 4717)
UNSUPPORTED: XRay-x86_64-darwin :: TestCases/Posix/fdr-mode.cpp (4429 of 4717)
UNSUPPORTED: XRay-x86_64-darwin :: TestCases/Posix/fdr-reinit.cpp (4430 of 4717)
UNSUPPORTED: XRay-x86_64-darwin :: TestCases/Posix/fdr-single-thread.cpp (4431 of 4717)
UNSUPPORTED: XRay-x86_64-darwin :: TestCases/Posix/fdr-thread-order.cpp (4432 of 4717)
UNSUPPORTED: XRay-x86_64-darwin :: TestCases/Posix/fixedsize-logging.cpp (4433 of 4717)
UNSUPPORTED: XRay-x86_64-darwin :: TestCases/Posix/fork_basic_logging.cpp (4434 of 4717)
UNSUPPORTED: XRay-x86_64-darwin :: TestCases/Posix/func-id-utils.cpp (4435 of 4717)
UNSUPPORTED: XRay-x86_64-darwin :: TestCases/Posix/logging-modes.cpp (4436 of 4717)
UNSUPPORTED: XRay-x86_64-darwin :: TestCases/Posix/optional-inmemory-log.cpp (4437 of 4717)
UNSUPPORTED: XRay-x86_64-darwin :: TestCases/Posix/patching-unpatching.cpp (4438 of 4717)
UNSUPPORTED: XRay-x86_64-darwin :: TestCases/Posix/pic_test.cpp (4439 of 4717)
UNSUPPORTED: XRay-x86_64-darwin :: TestCases/Posix/profiling-multi-threaded.cpp (4440 of 4717)
UNSUPPORTED: XRay-x86_64-darwin :: TestCases/Posix/profiling-single-threaded.cpp (4441 of 4717)
UNSUPPORTED: XRay-x86_64-darwin :: TestCases/Posix/quiet-start.cpp (4442 of 4717)
UNSUPPORTED: XRay-x86_64h-darwin :: TestCases/Posix/always-never-instrument.cpp (4443 of 4717)
UNSUPPORTED: XRay-x86_64h-darwin :: TestCases/Posix/arg1-arg0-logging.cpp (4444 of 4717)
UNSUPPORTED: XRay-x86_64h-darwin :: TestCases/Posix/arg1-logger.cpp (4445 of 4717)
UNSUPPORTED: XRay-x86_64h-darwin :: TestCases/Posix/arg1-logging-implicit-this.cpp (4446 of 4717)
UNSUPPORTED: XRay-x86_64h-darwin :: TestCases/Posix/argv0-log-file-name.cpp (4447 of 4717)
UNSUPPORTED: XRay-x86_64h-darwin :: TestCases/Posix/basic-filtering.cpp (4448 of 4717)
UNSUPPORTED: XRay-x86_64h-darwin :: TestCases/Posix/c-test.cpp (4449 of 4717)
UNSUPPORTED: XRay-x86_64h-darwin :: TestCases/Posix/clang-no-xray-instrument.cpp (4450 of 4717)
UNSUPPORTED: XRay-x86_64h-darwin :: TestCases/Posix/common-trampoline-alignment.cpp (4451 of 4717)
UNSUPPORTED: XRay-x86_64h-darwin :: TestCases/Posix/coverage-sample.cpp (4452 of 4717)
UNSUPPORTED: XRay-x86_64h-darwin :: TestCases/Posix/custom-event-handler-alignment.cpp (4453 of 4717)
UNSUPPORTED: XRay-x86_64h-darwin :: TestCases/Posix/custom-event-logging.cpp (4454 of 4717)
UNSUPPORTED: XRay-x86_64h-darwin :: TestCases/Posix/fdr-mode-inmemory.cpp (4455 of 4717)
UNSUPPORTED: XRay-x86_64h-darwin :: TestCases/Posix/fdr-mode-multiple.cpp (4456 of 4717)
UNSUPPORTED: XRay-x86_64h-darwin :: TestCases/Posix/fdr-mode.cpp (4457 of 4717)
UNSUPPORTED: XRay-x86_64h-darwin :: TestCases/Posix/fdr-reinit.cpp (4458 of 4717)
UNSUPPORTED: XRay-x86_64h-darwin :: TestCases/Posix/fdr-single-thread.cpp (4459 of 4717)
UNSUPPORTED: XRay-x86_64h-darwin :: TestCases/Posix/fdr-thread-order.cpp (4460 of 4717)
UNSUPPORTED: XRay-x86_64h-darwin :: TestCases/Posix/fixedsize-logging.cpp (4461 of 4717)
UNSUPPORTED: XRay-x86_64h-darwin :: TestCases/Posix/fork_basic_logging.cpp (4462 of 4717)
UNSUPPORTED: XRay-x86_64h-darwin :: TestCases/Posix/func-id-utils.cpp (4463 of 4717)
UNSUPPORTED: XRay-x86_64h-darwin :: TestCases/Posix/logging-modes.cpp (4464 of 4717)
UNSUPPORTED: XRay-x86_64h-darwin :: TestCases/Posix/optional-inmemory-log.cpp (4465 of 4717)
UNSUPPORTED: XRay-x86_64h-darwin :: TestCases/Posix/patching-unpatching.cpp (4466 of 4717)
UNSUPPORTED: XRay-x86_64h-darwin :: TestCases/Posix/pic_test.cpp (4467 of 4717)
UNSUPPORTED: XRay-x86_64h-darwin :: TestCases/Posix/profiling-multi-threaded.cpp (4468 of 4717)
UNSUPPORTED: XRay-x86_64h-darwin :: TestCases/Posix/profiling-single-threaded.cpp (4469 of 4717)
UNSUPPORTED: XRay-x86_64h-darwin :: TestCases/Posix/quiet-start.cpp (4470 of 4717)
PASS: UBSan-ThreadSanitizer-x86_64 :: TestCases/TypeCheck/vptr-corrupted-vtable-itanium.cpp (4471 of 4717)
PASS: UBSan-ThreadSanitizer-x86_64 :: TestCases/TypeCheck/vptr-non-unique-typeinfo.cpp (4472 of 4717)
PASS: cfi-devirt-i386 :: bad-split.cpp (4473 of 4717)
PASS: UBSan-ThreadSanitizer-x86_64 :: TestCases/TypeCheck/vptr-virtual-base-construction.cpp (4474 of 4717)
PASS: cfi-devirt-i386 :: anon-namespace.cpp (4475 of 4717)
PASS: UBSan-ThreadSanitizer-x86_64 :: TestCases/TypeCheck/vptr-virtual-base.cpp (4476 of 4717)
UNSUPPORTED: cfi-devirt-i386 :: cross-dso/icall/diag.cpp (4477 of 4717)
UNSUPPORTED: cfi-devirt-i386 :: cross-dso/icall/dlopen.cpp (4478 of 4717)
UNSUPPORTED: cfi-devirt-i386 :: cross-dso/icall/icall-from-dso.cpp (4479 of 4717)
UNSUPPORTED: cfi-devirt-i386 :: cross-dso/icall/icall.cpp (4480 of 4717)
UNSUPPORTED: cfi-devirt-i386 :: cross-dso/shadow_is_read_only.cpp (4481 of 4717)
UNSUPPORTED: cfi-devirt-i386 :: cross-dso/simple-fail.cpp (4482 of 4717)
UNSUPPORTED: cfi-devirt-i386 :: cross-dso/simple-pass.cpp (4483 of 4717)
UNSUPPORTED: cfi-devirt-i386 :: cross-dso/stats.cpp (4484 of 4717)
UNSUPPORTED: cfi-devirt-i386 :: cross-dso/target_out_of_bounds.cpp (4485 of 4717)
PASS: cfi-devirt-i386 :: bad-cast.cpp (4486 of 4717)
UNSUPPORTED: cfi-devirt-i386 :: icall/external-call.c (4487 of 4717)
XFAIL: cfi-devirt-i386 :: icall/weak.c (4488 of 4717)
UNSUPPORTED: cfi-devirt-i386 :: icall/wrong-signature-mixed-lto.c (4489 of 4717)
PASS: cfi-devirt-i386 :: create-derivers.test (4490 of 4717)
PASS: UBSan-ThreadSanitizer-x86_64 :: TestCases/TypeCheck/null.cpp (4491 of 4717)
PASS: cfi-devirt-i386 :: cross-dso-diagnostic.cpp (4492 of 4717)
PASS: cfi-devirt-i386 :: icall/bad-signature.c (4493 of 4717)
XFAIL: cfi-devirt-i386 :: sibling.cpp (4494 of 4717)
PASS: cfi-devirt-i386 :: mfcall.cpp (4495 of 4717)
PASS: cfi-devirt-i386 :: base-derived-destructor.cpp (4496 of 4717)
UNSUPPORTED: cfi-devirt-i386 :: stats.cpp (4497 of 4717)
XFAIL: cfi-devirt-i386 :: simple-pass.cpp (4498 of 4717)
PASS: cfi-devirt-i386 :: nvcall.cpp (4499 of 4717)
PASS: cfi-devirt-i386 :: overwrite.cpp (4500 of 4717)
PASS: cfi-devirt-i386 :: target_uninstrumented.cpp (4501 of 4717)
PASS: cfi-devirt-i386 :: vtable-may-alias.cpp (4502 of 4717)
XFAIL: cfi-devirt-i386 :: two-vcalls.cpp (4503 of 4717)
PASS: cfi-devirt-i386 :: multiple-inheritance.cpp (4504 of 4717)
PASS: cfi-devirt-x86_64 :: bad-split.cpp (4505 of 4717)
PASS: UBSan-ThreadSanitizer-x86_64 :: TestCases/TypeCheck/misaligned.cpp (4506 of 4717)
PASS: cfi-devirt-x86_64 :: create-derivers.test (4507 of 4717)
UNSUPPORTED: cfi-devirt-x86_64 :: cross-dso/icall/diag.cpp (4508 of 4717)
UNSUPPORTED: cfi-devirt-x86_64 :: cross-dso/icall/dlopen.cpp (4509 of 4717)
UNSUPPORTED: cfi-devirt-x86_64 :: cross-dso/icall/icall-from-dso.cpp (4510 of 4717)
UNSUPPORTED: cfi-devirt-x86_64 :: cross-dso/icall/icall.cpp (4511 of 4717)
UNSUPPORTED: cfi-devirt-x86_64 :: cross-dso/shadow_is_read_only.cpp (4512 of 4717)
UNSUPPORTED: cfi-devirt-x86_64 :: cross-dso/simple-fail.cpp (4513 of 4717)
UNSUPPORTED: cfi-devirt-x86_64 :: cross-dso/simple-pass.cpp (4514 of 4717)
UNSUPPORTED: cfi-devirt-x86_64 :: cross-dso/stats.cpp (4515 of 4717)
UNSUPPORTED: cfi-devirt-x86_64 :: cross-dso/target_out_of_bounds.cpp (4516 of 4717)
PASS: cfi-devirt-x86_64 :: cross-dso-diagnostic.cpp (4517 of 4717)
UNSUPPORTED: cfi-devirt-x86_64 :: icall/external-call.c (4518 of 4717)
XFAIL: cfi-devirt-x86_64 :: icall/weak.c (4519 of 4717)
UNSUPPORTED: cfi-devirt-x86_64 :: icall/wrong-signature-mixed-lto.c (4520 of 4717)
PASS: cfi-devirt-x86_64 :: icall/bad-signature.c (4521 of 4717)
PASS: cfi-devirt-i386 :: vdtor.cpp (4522 of 4717)
PASS: cfi-devirt-x86_64 :: bad-cast.cpp (4523 of 4717)
PASS: cfi-devirt-x86_64 :: anon-namespace.cpp (4524 of 4717)
XFAIL: cfi-devirt-x86_64 :: sibling.cpp (4525 of 4717)
PASS: cfi-devirt-x86_64 :: mfcall.cpp (4526 of 4717)
PASS: cfi-devirt-x86_64 :: base-derived-destructor.cpp (4527 of 4717)
UNSUPPORTED: cfi-devirt-x86_64 :: stats.cpp (4528 of 4717)
PASS: cfi-devirt-x86_64 :: nvcall.cpp (4529 of 4717)
PASS: cfi-devirt-x86_64 :: overwrite.cpp (4530 of 4717)
XFAIL: cfi-devirt-x86_64 :: simple-pass.cpp (4531 of 4717)
PASS: cfi-devirt-x86_64 :: vtable-may-alias.cpp (4532 of 4717)
PASS: cfi-devirt-x86_64 :: target_uninstrumented.cpp (4533 of 4717)
XFAIL: cfi-devirt-x86_64 :: two-vcalls.cpp (4534 of 4717)
PASS: cfi-standalone-i386 :: bad-split.cpp (4535 of 4717)
PASS: cfi-devirt-x86_64 :: multiple-inheritance.cpp (4536 of 4717)
PASS: cfi-standalone-i386 :: create-derivers.test (4537 of 4717)
PASS: cfi-devirt-x86_64 :: vdtor.cpp (4538 of 4717)
UNSUPPORTED: cfi-standalone-i386 :: cross-dso/icall/diag.cpp (4539 of 4717)
UNSUPPORTED: cfi-standalone-i386 :: cross-dso/icall/dlopen.cpp (4540 of 4717)
UNSUPPORTED: cfi-standalone-i386 :: cross-dso/icall/icall-from-dso.cpp (4541 of 4717)
UNSUPPORTED: cfi-standalone-i386 :: cross-dso/icall/icall.cpp (4542 of 4717)
UNSUPPORTED: cfi-standalone-i386 :: cross-dso/shadow_is_read_only.cpp (4543 of 4717)
UNSUPPORTED: cfi-standalone-i386 :: cross-dso/simple-fail.cpp (4544 of 4717)
UNSUPPORTED: cfi-standalone-i386 :: cross-dso/simple-pass.cpp (4545 of 4717)
UNSUPPORTED: cfi-standalone-i386 :: cross-dso/stats.cpp (4546 of 4717)
UNSUPPORTED: cfi-standalone-i386 :: cross-dso/target_out_of_bounds.cpp (4547 of 4717)
PASS: cfi-standalone-i386 :: cross-dso-diagnostic.cpp (4548 of 4717)
UNSUPPORTED: cfi-standalone-i386 :: icall/external-call.c (4549 of 4717)
PASS: cfi-standalone-i386 :: bad-cast.cpp (4550 of 4717)
UNSUPPORTED: cfi-standalone-i386 :: icall/wrong-signature-mixed-lto.c (4551 of 4717)
XFAIL: cfi-standalone-i386 :: icall/weak.c (4552 of 4717)
PASS: cfi-standalone-i386 :: anon-namespace.cpp (4553 of 4717)
PASS: cfi-standalone-i386 :: icall/bad-signature.c (4554 of 4717)
PASS: cfi-devirt-i386 :: simple-fail.cpp (4555 of 4717)
XFAIL: cfi-standalone-i386 :: sibling.cpp (4556 of 4717)
PASS: cfi-standalone-i386 :: base-derived-destructor.cpp (4557 of 4717)
PASS: cfi-standalone-i386 :: mfcall.cpp (4558 of 4717)
PASS: cfi-standalone-i386 :: nvcall.cpp (4559 of 4717)
XFAIL: cfi-standalone-i386 :: simple-pass.cpp (4560 of 4717)
PASS: cfi-standalone-i386 :: stats.cpp (4561 of 4717)
PASS: cfi-standalone-i386 :: target_uninstrumented.cpp (4562 of 4717)
PASS: cfi-standalone-i386 :: vtable-may-alias.cpp (4563 of 4717)
PASS: cfi-standalone-i386 :: overwrite.cpp (4564 of 4717)
XFAIL: cfi-standalone-i386 :: two-vcalls.cpp (4565 of 4717)
PASS: cfi-standalone-i386 :: multiple-inheritance.cpp (4566 of 4717)
PASS: cfi-standalone-x86_64 :: bad-split.cpp (4567 of 4717)
PASS: cfi-standalone-x86_64 :: create-derivers.test (4568 of 4717)
PASS: cfi-standalone-x86_64 :: cross-dso-diagnostic.cpp (4569 of 4717)
UNSUPPORTED: cfi-standalone-x86_64 :: cross-dso/icall/diag.cpp (4570 of 4717)
UNSUPPORTED: cfi-standalone-x86_64 :: cross-dso/icall/dlopen.cpp (4571 of 4717)
UNSUPPORTED: cfi-standalone-x86_64 :: cross-dso/icall/icall-from-dso.cpp (4572 of 4717)
UNSUPPORTED: cfi-standalone-x86_64 :: cross-dso/icall/icall.cpp (4573 of 4717)
UNSUPPORTED: cfi-standalone-x86_64 :: cross-dso/shadow_is_read_only.cpp (4574 of 4717)
UNSUPPORTED: cfi-standalone-x86_64 :: cross-dso/simple-fail.cpp (4575 of 4717)
UNSUPPORTED: cfi-standalone-x86_64 :: cross-dso/simple-pass.cpp (4576 of 4717)
UNSUPPORTED: cfi-standalone-x86_64 :: cross-dso/stats.cpp (4577 of 4717)
UNSUPPORTED: cfi-standalone-x86_64 :: cross-dso/target_out_of_bounds.cpp (4578 of 4717)
PASS: cfi-standalone-i386 :: vdtor.cpp (4579 of 4717)
UNSUPPORTED: cfi-standalone-x86_64 :: icall/external-call.c (4580 of 4717)
XFAIL: cfi-standalone-x86_64 :: icall/weak.c (4581 of 4717)
UNSUPPORTED: cfi-standalone-x86_64 :: icall/wrong-signature-mixed-lto.c (4582 of 4717)
PASS: cfi-standalone-x86_64 :: bad-cast.cpp (4583 of 4717)
PASS: cfi-standalone-x86_64 :: anon-namespace.cpp (4584 of 4717)
PASS: cfi-standalone-x86_64 :: icall/bad-signature.c (4585 of 4717)
PASS: cfi-devirt-x86_64 :: simple-fail.cpp (4586 of 4717)
XFAIL: cfi-standalone-x86_64 :: sibling.cpp (4587 of 4717)
PASS: cfi-standalone-x86_64 :: base-derived-destructor.cpp (4588 of 4717)
PASS: cfi-standalone-x86_64 :: mfcall.cpp (4589 of 4717)
XFAIL: cfi-standalone-x86_64 :: simple-pass.cpp (4590 of 4717)
PASS: cfi-standalone-x86_64 :: stats.cpp (4591 of 4717)
PASS: cfi-standalone-x86_64 :: nvcall.cpp (4592 of 4717)
PASS: cfi-standalone-x86_64 :: target_uninstrumented.cpp (4593 of 4717)
PASS: cfi-standalone-x86_64 :: overwrite.cpp (4594 of 4717)
PASS: cfi-standalone-x86_64 :: vtable-may-alias.cpp (4595 of 4717)
UNSUPPORTED: libFuzzer :: afl-driver-close-fd-mask.test (4596 of 4717)
XFAIL: cfi-standalone-x86_64 :: two-vcalls.cpp (4597 of 4717)
PASS: libFuzzer :: acquire-crash-state.test (4598 of 4717)
UNSUPPORTED: libFuzzer :: afl-driver.test (4599 of 4717)
PASS: cfi-standalone-x86_64 :: multiple-inheritance.cpp (4600 of 4717)
PASS: libFuzzer :: bad-strcmp.test (4601 of 4717)
PASS: UBSan-ThreadSanitizer-x86_64 :: TestCases/TypeCheck/vptr.cpp (4602 of 4717)
PASS: libFuzzer :: bogus-initialize.test (4603 of 4717)
PASS: cfi-standalone-x86_64 :: vdtor.cpp (4604 of 4717)
PASS: libFuzzer :: buffer-overflow-on-input.test (4605 of 4717)
PASS: cfi-standalone-i386 :: simple-fail.cpp (4606 of 4717)
PASS: libFuzzer :: caller-callee.test (4607 of 4717)
UNSUPPORTED: libFuzzer :: compressed.test (4608 of 4717)
PASS: libFuzzer :: afl-driver-stderr.test (4609 of 4717)
PASS: libFuzzer :: counters.test (4610 of 4717)
PASS: cfi-standalone-x86_64 :: simple-fail.cpp (4611 of 4717)
PASS: libFuzzer :: coverage.test (4612 of 4717)
PASS: libFuzzer :: cxxstring.test (4613 of 4717)
UNSUPPORTED: libFuzzer :: dataflow.test (4614 of 4717)
PASS: libFuzzer :: dead-stripping.test (4615 of 4717)
UNSUPPORTED: libFuzzer :: deep-recursion.test (4616 of 4717)
PASS: libFuzzer :: cross_over.test (4617 of 4717)
UNSUPPORTED: libFuzzer :: disable-leaks.test (4618 of 4717)
PASS: libFuzzer :: deprecated-instrumentation.test (4619 of 4717)
UNSUPPORTED: libFuzzer :: equivalence-signals.test (4620 of 4717)
UNSUPPORTED: libFuzzer :: equivalence.test (4621 of 4717)
PASS: libFuzzer :: dso.test (4622 of 4717)
PASS: libFuzzer :: cleanse.test (4623 of 4717)
UNSUPPORTED: libFuzzer :: extra-counters.test (4624 of 4717)
UNSUPPORTED: libFuzzer :: features_dir.test (4625 of 4717)
UNSUPPORTED: libFuzzer :: fork-sigusr.test (4626 of 4717)
UNSUPPORTED: libFuzzer :: fork-ubsan.test (4627 of 4717)
UNSUPPORTED: libFuzzer :: fork.test (4628 of 4717)
PASS: libFuzzer :: exit-report.test (4629 of 4717)
PASS: libFuzzer :: full-coverage-set.test (4630 of 4717)
PASS: libFuzzer :: exit_on_src_pos.test (4631 of 4717)
PASS: libFuzzer :: fuzzer-alignment-assumption.test (4632 of 4717)
PASS: libFuzzer :: fuzzer-customcrossoverandmutate.test (4633 of 4717)
PASS: libFuzzer :: fuzzer-custommutator.test (4634 of 4717)
PASS: libFuzzer :: fuzzer-customcrossover.test (4635 of 4717)
PASS: libFuzzer :: fuzzer-dirs.test (4636 of 4717)
PASS: libFuzzer :: fuzzer-dict.test (4637 of 4717)
PASS: libFuzzer :: fuzzer-fdmask.test (4638 of 4717)
PASS: libFuzzer :: fuzzer-finalstats.test (4639 of 4717)
PASS: libFuzzer :: fuzzer-implicit-integer-sign-change.test (4640 of 4717)
PASS: libFuzzer :: fuzzer-implicit-signed-integer-truncation-or-sign-change.test (4641 of 4717)
PASS: libFuzzer :: fuzzer-flags.test (4642 of 4717)
UNSUPPORTED: libFuzzer :: fuzzer-leak.test (4643 of 4717)
UNSUPPORTED: libFuzzer :: fuzzer-oom-with-profile.test (4644 of 4717)
PASS: libFuzzer :: fuzzer-implicit-signed-integer-truncation.test (4645 of 4717)
PASS: libFuzzer :: fuzzer-implicit-unsigned-integer-truncation.test (4646 of 4717)
PASS: libFuzzer :: fuzzer-printcovpcs.test (4647 of 4717)
PASS: libFuzzer :: fuzzer-seed.test (4648 of 4717)
PASS: libFuzzer :: fuzzer-runs.test (4649 of 4717)
PASS: libFuzzer :: fuzzer-segv.test (4650 of 4717)
PASS: libFuzzer :: fuzzer-oom.test (4651 of 4717)
PASS: libFuzzer :: fuzzer-singleinputs.test (4652 of 4717)
PASS: libFuzzer :: fuzzer-threaded.test (4653 of 4717)
UNSUPPORTED: libFuzzer :: gc-sections.test (4654 of 4717)
PASS: libFuzzer :: fuzzer-ubsan.test (4655 of 4717)
UNSUPPORTED: libFuzzer :: large.test (4656 of 4717)
PASS: libFuzzer :: initialize.test (4657 of 4717)
UNSUPPORTED: libFuzzer :: libcxx.test (4658 of 4717)
UNSUPPORTED: libFuzzer :: magic-separator.test (4659 of 4717)
PASS: libFuzzer :: max-number-of-runs.test (4660 of 4717)
PASS: libFuzzer :: len_control.test (4661 of 4717)
PASS: libFuzzer :: memcmp64.test (4662 of 4717)
PASS: libFuzzer :: memcmp.test (4663 of 4717)
PASS: libFuzzer :: fuzzer-timeout.test (4664 of 4717)
UNSUPPORTED: libFuzzer :: merge-sigusr.test (4665 of 4717)
PASS: libFuzzer :: merge-posix.test (4666 of 4717)
PASS: libFuzzer :: merge-control-file.test (4667 of 4717)
PASS: libFuzzer :: merge_two_step.test (4668 of 4717)
PASS: libFuzzer :: merge.test (4669 of 4717)
UNSUPPORTED: libFuzzer :: msan-param-unpoison.test (4670 of 4717)
UNSUPPORTED: libFuzzer :: msan.test (4671 of 4717)
PASS: libFuzzer :: not-instrumented.test (4672 of 4717)
PASS: libFuzzer :: null-deref-on-empty.test (4673 of 4717)
PASS: libFuzzer :: minimize_two_crashes.test (4674 of 4717)
UNSUPPORTED: libFuzzer :: only-some-bytes-fork.test (4675 of 4717)
UNSUPPORTED: libFuzzer :: only-some-bytes.test (4676 of 4717)
PASS: libFuzzer :: null-deref.test (4677 of 4717)
UNSUPPORTED: libFuzzer :: print-func.test (4678 of 4717)
PASS: libFuzzer :: overwrite-input.test (4679 of 4717)
PASS: libFuzzer :: recommended-dictionary.test (4680 of 4717)
PASS: libFuzzer :: read-binary.test (4681 of 4717)
PASS: libFuzzer :: reduce_inputs.test (4682 of 4717)
PASS: libFuzzer :: reload.test (4683 of 4717)
PASS: libFuzzer :: repeated-bytes.test (4684 of 4717)
PASS: libFuzzer :: seed_inputs.test (4685 of 4717)
UNSUPPORTED: libFuzzer :: sigint.test (4686 of 4717)
UNSUPPORTED: libFuzzer :: sigusr.test (4687 of 4717)
UNSUPPORTED: libFuzzer :: simple-cmp.test (4688 of 4717)
PASS: libFuzzer :: shrink.test (4689 of 4717)
PASS: libFuzzer :: standalone.test (4690 of 4717)
PASS: libFuzzer :: strcmp.test (4691 of 4717)
PASS: libFuzzer :: simple.test (4692 of 4717)
PASS: libFuzzer :: strncmp-oob.test (4693 of 4717)
PASS: libFuzzer :: strstr.test (4694 of 4717)
PASS: libFuzzer :: swap-cmp.test (4695 of 4717)
PASS: libFuzzer :: minimize_crash.test (4696 of 4717)
UNSUPPORTED: libFuzzer :: target-function.test (4697 of 4717)
PASS: libFuzzer :: symbolize-deadlock.test (4698 of 4717)
UNSUPPORTED: libFuzzer :: trace-malloc-2.test (4699 of 4717)
UNSUPPORTED: libFuzzer :: trace-malloc-threaded.test (4700 of 4717)
UNSUPPORTED: libFuzzer :: trace-malloc-unbalanced.test (4701 of 4717)
PASS: libFuzzer :: strncmp.test (4702 of 4717)
PASS: libFuzzer :: three-bytes.test (4703 of 4717)
PASS: libFuzzer :: trace-malloc.test (4704 of 4717)
PASS: libFuzzer :: ulimit.test (4705 of 4717)
PASS: libFuzzer :: value-profile-cmp2.test (4706 of 4717)
PASS: libFuzzer :: value-profile-cmp3.test (4707 of 4717)
PASS: libFuzzer :: value-profile-div.test (4708 of 4717)
PASS: libFuzzer :: value-profile-cmp4.test (4709 of 4717)
PASS: libFuzzer :: value-profile-cmp.test (4710 of 4717)
PASS: libFuzzer :: value-profile-mem.test (4711 of 4717)
PASS: libFuzzer :: value-profile-strcmp.test (4712 of 4717)
PASS: libFuzzer :: value-profile-strncmp.test (4713 of 4717)
PASS: libFuzzer :: value-profile-set.test (4714 of 4717)
UNSUPPORTED: libFuzzer :: windows-opt-ref.test (4715 of 4717)
PASS: libFuzzer :: value-profile-load.test (4716 of 4717)
PASS: libFuzzer :: value-profile-switch.test (4717 of 4717)

Hide Details

23 warning(s) in tests. Testing Time: 1941.32s ******************** Failing Tests (1): Builtins-i386-darwin :: compiler_rt_logbf_test.c

Hide Details

Expected Passes : 3294 Expected Failures : 54 Unsupported Tests : 1368 Unexpected Failures: 1 FAILED: test/CMakeFiles/check-compiler-rt cd /Users/buildslave/jenkins/workspace/clang-stage1-cmake-RA-expensive/clang-build/tools/clang/runtime/compiler-rt-bins/test && /usr/local/bin/python /Users/buildslave/jenkins/workspace/clang-stage1-cmake-RA-expensive/clang-build/bin/llvm-lit --xunit-xml-output=testresults.xunit.xml -v --timeout=600 /Users/buildslave/jenkins/workspace/clang-stage1-cmake-RA-expensive/clang-build/tools/clang/runtime/compiler-rt-bins/test/builtins/TestCases /Users/buildslave/jenkins/workspace/clang-stage1-cmake-RA-expensive/clang-build/tools/clang/runtime/compiler-rt-bins/test/builtins/Unit/I386DarwinConfig /Users/buildslave/jenkins/workspace/clang-stage1-cmake-RA-expensive/clang-build/tools/clang/runtime/compiler-rt-bins/test/builtins/Unit/X86_64DarwinConfig /Users/buildslave/jenkins/workspace/clang-stage1-cmake-RA-expensive/clang-build/tools/clang/runtime/compiler-rt-bins/test/lsan/I386LsanConfig /Users/buildslave/jenkins/workspace/clang-stage1-cmake-RA-expensive/clang-build/tools/clang/runtime/compiler-rt-bins/test/lsan/I386AsanConfig /Users/buildslave/jenkins/workspace/clang-stage1-cmake-RA-expensive/clang-build/tools/clang/runtime/compiler-rt-bins/test/lsan/X86_64LsanConfig /Users/buildslave/jenkins/workspace/clang-stage1-cmake-RA-expensive/clang-build/tools/clang/runtime/compiler-rt-bins/test/lsan/X86_64AsanConfig /Users/buildslave/jenkins/workspace/clang-stage1-cmake-RA-expensive/clang-build/tools/clang/runtime/compiler-rt-bins/test/ubsan/Standalone-i386 /Users/buildslave/jenkins/workspace/clang-stage1-cmake-RA-expensive/clang-build/tools/clang/runtime/compiler-rt-bins/test/ubsan/AddressSanitizer-i386 /Users/buildslave/jenkins/workspace/clang-stage1-cmake-RA-expensive/clang-build/tools/clang/runtime/compiler-rt-bins/test/ubsan/Standalone-x86_64 /Users/buildslave/jenkins/workspace/clang-stage1-cmake-RA-expensive/clang-build/tools/clang/runtime/compiler-rt-bins/test/ubsan/AddressSanitizer-x86_64 /Users/buildslave/jenkins/workspace/clang-stage1-cmake-RA-expensive/clang-build/tools/clang/runtime/compiler-rt-bins/test/ubsan/ThreadSanitizer-x86_64 /Users/buildslave/jenkins/workspace/clang-stage1-cmake-RA-expensive/clang-build/tools/clang/runtime/compiler-rt-bins/test/ubsan/StandaloneStatic-i386 /Users/buildslave/jenkins/workspace/clang-stage1-cmake-RA-expensive/clang-build/tools/clang/runtime/compiler-rt-bins/test/ubsan/StandaloneStatic-x86_64 /Users/buildslave/jenkins/workspace/clang-stage1-cmake-RA-expensive/clang-build/tools/clang/runtime/compiler-rt-bins/test/cfi/Standalone-i386 /Users/buildslave/jenkins/workspace/clang-stage1-cmake-RA-expensive/clang-build/tools/clang/runtime/compiler-rt-bins/test/cfi/Devirt-i386 /Users/buildslave/jenkins/workspace/clang-stage1-cmake-RA-expensive/clang-build/tools/clang/runtime/compiler-rt-bins/test/cfi/Standalone-x86_64 /Users/buildslave/jenkins/workspace/clang-stage1-cmake-RA-expensive/clang-build/tools/clang/runtime/compiler-rt-bins/test/cfi/Devirt-x86_64 /Users/buildslave/jenkins/workspace/clang-stage1-cmake-RA-expensive/clang-build/tools/clang/runtime/compiler-rt-bins/test/sanitizer_common/asan-i386-Darwin /Users/buildslave/jenkins/workspace/clang-stage1-cmake-RA-expensive/clang-build/tools/clang/runtime/compiler-rt-bins/test/sanitizer_common/asan-x86_64-Darwin /Users/buildslave/jenkins/workspace/clang-stage1-cmake-RA-expensive/clang-build/tools/clang/runtime/compiler-rt-bins/test/sanitizer_common/lsan-x86_64-Darwin /Users/buildslave/jenkins/workspace/clang-stage1-cmake-RA-expensive/clang-build/tools/clang/runtime/compiler-rt-bins/test/sanitizer_common/tsan-x86_64-Darwin /Users/buildslave/jenkins/workspace/clang-stage1-cmake-RA-expensive/clang-build/tools/clang/runtime/compiler-rt-bins/test/sanitizer_common/ubsan-i386-Darwin /Users/buildslave/jenkins/workspace/clang-stage1-cmake-RA-expensive/clang-build/tools/clang/runtime/compiler-rt-bins/test/sanitizer_common/ubsan-x86_64-Darwin /Users/buildslave/jenkins/workspace/clang-stage1-cmake-RA-expensive/clang-build/tools/clang/runtime/compiler-rt-bins/test/sanitizer_common/Unit /Users/buildslave/jenkins/workspace/clang-stage1-cmake-RA-expensive/clang-build/tools/clang/runtime/compiler-rt-bins/test/fuzzer/unit /Users/buildslave/jenkins/workspace/clang-stage1-cmake-RA-expensive/clang-build/tools/clang/runtime/compiler-rt-bins/test/fuzzer/X86_64DefaultDarwinConfig/ /Users/buildslave/jenkins/workspace/clang-stage1-cmake-RA-expensive/clang-build/tools/clang/runtime/compiler-rt-bins/test/asan/I386DarwinConfig /Users/buildslave/jenkins/workspace/clang-stage1-cmake-RA-expensive/clang-build/tools/clang/runtime/compiler-rt-bins/test/asan/X86_64DarwinConfig /Users/buildslave/jenkins/workspace/clang-stage1-cmake-RA-expensive/clang-build/tools/clang/runtime/compiler-rt-bins/test/asan/Unit /Users/buildslave/jenkins/workspace/clang-stage1-cmake-RA-expensive/clang-build/tools/clang/runtime/compiler-rt-bins/test/tsan/X86_64Config /Users/buildslave/jenkins/workspace/clang-stage1-cmake-RA-expensive/clang-build/tools/clang/runtime/compiler-rt-bins/test/tsan/Unit /Users/buildslave/jenkins/workspace/clang-stage1-cmake-RA-expensive/clang-build/tools/clang/runtime/compiler-rt-bins/test/ubsan_minimal/i386 /Users/buildslave/jenkins/workspace/clang-stage1-cmake-RA-expensive/clang-build/tools/clang/runtime/compiler-rt-bins/test/ubsan_minimal/x86_64 /Users/buildslave/jenkins/workspace/clang-stage1-cmake-RA-expensive/clang-build/tools/clang/runtime/compiler-rt-bins/test/profile/Profile-i386 /Users/buildslave/jenkins/workspace/clang-stage1-cmake-RA-expensive/clang-build/tools/clang/runtime/compiler-rt-bins/test/profile/Profile-x86_64 /Users/buildslave/jenkins/workspace/clang-stage1-cmake-RA-expensive/clang-build/tools/clang/runtime/compiler-rt-bins/test/xray/X86_64DarwinConfig /Users/buildslave/jenkins/workspace/clang-stage1-cmake-RA-expensive/clang-build/tools/clang/runtime/compiler-rt-bins/test/xray/X86_64HDarwinConfig /Users/buildslave/jenkins/workspace/clang-stage1-cmake-RA-expensive/clang-build/tools/clang/runtime/compiler-rt-bins/test/shadowcallstack/arm64 ninja: build stopped: subcommand failed. [250/676] cd /Users/buildslave/jenkins/workspace/clang-stage1-cmake-RA-expensive/llvm/tools/clang/bindings/python && /usr/local/Cellar/cmake/3.13.1/bin/cmake -E env CLANG_LIBRARY_PATH=/Users/buildslave/jenkins/workspace/clang-stage1-cmake-RA-expensive/clang-build/lib /usr/local/bin/python -m unittest discover ..........s..s......................................................................s.s.......s...s........................... ---------------------------------------------------------------------- Ran 126 tests in 3.045s

Hide Details

OK (skipped=6) [286/676] /Applications/Xcode.app/Contents/Developer/Toolchains/XcodeDefault.xctoolchain/usr/bin/c++ -DEXPENSIVE_CHECKS -DGTEST_HAS_RTTI=0 -DGTEST_HAS_TR1_TUPLE=0 -DGTEST_LANG_CXX11=1 -D_DEBUG -D_GLIBCXX_DEBUG -D__STDC_CONSTANT_MACROS -D__STDC_FORMAT_MACROS -D__STDC_LIMIT_MACROS -Iunittests/ADT -I/Users/buildslave/jenkins/workspace/clang-stage1-cmake-RA-expensive/llvm/unittests/ADT -I/Applications/Xcode.app/Contents/Developer/Platforms/MacOSX.platform/Developer/SDKs/MacOSX10.13.sdk/usr/include/libxml2 -Iinclude -I/Users/buildslave/jenkins/workspace/clang-stage1-cmake-RA-expensive/llvm/include -I/Users/buildslave/jenkins/workspace/clang-stage1-cmake-RA-expensive/llvm/utils/unittest/googletest/include -I/Users/buildslave/jenkins/workspace/clang-stage1-cmake-RA-expensive/llvm/utils/unittest/googlemock/include -fPIC -fvisibility-inlines-hidden -Werror=date-time -Werror=unguarded-availability-new -std=c++14 -Wall -Wextra -Wno-unused-parameter -Wwrite-strings -Wcast-qual -Wmissing-field-initializers -pedantic -Wno-long-long -Wimplicit-fallthrough -Wcovered-switch-default -Wno-noexcept-type -Wnon-virtual-dtor -Wdelete-non-virtual-dtor -Wstring-conversion -fdiagnostics-color -O3 -isysroot /Applications/Xcode.app/Contents/Developer/Platforms/MacOSX.platform/Developer/SDKs/MacOSX10.13.sdk -mmacosx-version-min=10.9 -UNDEBUG -Wno-variadic-macros -Wno-gnu-zero-variadic-macro-arguments -fno-exceptions -fno-rtti -MD -MT unittests/ADT/CMakeFiles/ADTTests.dir/ArrayRefTest.cpp.o -MF unittests/ADT/CMakeFiles/ADTTests.dir/ArrayRefTest.cpp.o.d -o unittests/ADT/CMakeFiles/ADTTests.dir/ArrayRefTest.cpp.o -c /Users/buildslave/jenkins/workspace/clang-stage1-cmake-RA-expensive/llvm/unittests/ADT/ArrayRefTest.cpp /Users/buildslave/jenkins/workspace/clang-stage1-cmake-RA-expensive/llvm/unittests/ADT/ArrayRefTest.cpp:254:25: warning: suggest braces around initialization of subobject [-Wmissing-braces] std::array<int, 5> A1{42, -5, 0, 1000000, -1000000}; ^~~~~~~~~~~~~~~~~~~~~~~~~~~~ { } 1 warning generated. [674/676] : && /Applications/Xcode.app/Contents/Developer/Toolchains/XcodeDefault.xctoolchain/usr/bin/c++ -fPIC -fvisibility-inlines-hidden -Werror=date-time -Werror=unguarded-availability-new -std=c++14 -Wall -Wextra -Wno-unused-parameter -Wwrite-strings -Wcast-qual -Wmissing-field-initializers -pedantic -Wno-long-long -Wimplicit-fallthrough -Wcovered-switch-default -Wno-noexcept-type -Wnon-virtual-dtor -Wdelete-non-virtual-dtor -Wstring-conversion -fdiagnostics-color -O3 -isysroot /Applications/Xcode.app/Contents/Developer/Platforms/MacOSX.platform/Developer/SDKs/MacOSX10.13.sdk -mmacosx-version-min=10.9 -Wl,-search_paths_first -Wl,-headerpad_max_install_names -Wl,-dead_strip unittests/tools/llvm-exegesis/X86/CMakeFiles/LLVMExegesisX86Tests.dir/AssemblerTest.cpp.o unittests/tools/llvm-exegesis/X86/CMakeFiles/LLVMExegesisX86Tests.dir/BenchmarkResultTest.cpp.o unittests/tools/llvm-exegesis/X86/CMakeFiles/LLVMExegesisX86Tests.dir/RegisterAliasingTest.cpp.o unittests/tools/llvm-exegesis/X86/CMakeFiles/LLVMExegesisX86Tests.dir/SchedClassResolutionTest.cpp.o unittests/tools/llvm-exegesis/X86/CMakeFiles/LLVMExegesisX86Tests.dir/SnippetGeneratorTest.cpp.o unittests/tools/llvm-exegesis/X86/CMakeFiles/LLVMExegesisX86Tests.dir/TargetTest.cpp.o -o unittests/tools/llvm-exegesis/X86/LLVMExegesisX86Tests lib/libLLVMMC.a lib/libLLVMMCParser.a lib/libLLVMObject.a lib/libLLVMSupport.a lib/libLLVMSymbolize.a lib/libLLVMX86CodeGen.a lib/libLLVMX86AsmParser.a lib/libLLVMX86Desc.a lib/libLLVMX86Disassembler.a lib/libLLVMX86Info.a lib/libLLVMX86Utils.a lib/libLLVMSupport.a lib/libgtest_main.a lib/libgtest.a lib/libLLVMExegesis.a lib/libLLVMExegesisX86.a lib/libLLVMDebugInfoPDB.a -lpthread lib/libLLVMX86CodeGen.a lib/libLLVMAsmPrinter.a lib/libLLVMDebugInfoDWARF.a lib/libLLVMX86AsmParser.a lib/libLLVMX86Desc.a lib/libLLVMX86Disassembler.a lib/libLLVMX86Info.a lib/libLLVMX86Utils.a lib/libLLVMExegesis.a lib/libLLVMGlobalISel.a lib/libLLVMSelectionDAG.a lib/libLLVMCodeGen.a lib/libLLVMBitWriter.a lib/libLLVMScalarOpts.a lib/libLLVMAggressiveInstCombine.a lib/libLLVMInstCombine.a lib/libLLVMTransformUtils.a lib/libLLVMMCDisassembler.a lib/libLLVMMCJIT.a lib/libLLVMExecutionEngine.a lib/libLLVMTarget.a lib/libLLVMAnalysis.a lib/libLLVMProfileData.a lib/libLLVMRuntimeDyld.a lib/libLLVMObjectYAML.a lib/libLLVMObject.a lib/libLLVMMCParser.a lib/libLLVMMC.a lib/libLLVMBitReader.a lib/libLLVMCore.a lib/libLLVMRemarks.a lib/libLLVMBitstreamReader.a lib/libLLVMTextAPI.a lib/libLLVMBinaryFormat.a lib/libLLVMDebugInfoCodeView.a lib/libLLVMDebugInfoMSF.a lib/libLLVMSupport.a -lz -lcurses -lm lib/libLLVMDemangle.a && : FAILED: tools/clang/runtime/CMakeFiles/check-compiler-rt cd /Users/buildslave/jenkins/workspace/clang-stage1-cmake-RA-expensive/clang-build/tools/clang/runtime/compiler-rt-bins && /usr/local/Cellar/cmake/3.13.1/bin/cmake --build . --target check-all --config Release ninja: build stopped: cannot make progress due to previous errors. Command failed Command: ['/usr/local/bin/ninja', '-v', '-k', '0', 'check-all'] Build step 'Execute shell' marked build as failure Recording test results ERROR: Step ‘Publish JUnit test result report’ failed: No test report files were found. Configuration error? [BFA] Scanning build for known causes... [BFA] Found failure cause(s): [BFA] Missing test results from category Infrastructure [BFA] Regression test failed from category Test [BFA] Ninja target failed from category Compile [BFA] Done. 2s No emails were triggered. Finished: FAILURE