FailedConsole Output

Skipping 653 KB.. Full Log
Xcode.app/Contents/Developer/Platforms/MacOSX.platform/Developer/SDKs/MacOSX10.13.sdk -mmacosx-version-min=10.9   -UNDEBUG  -fno-exceptions -fno-rtti -MD -MT lib/IR/CMakeFiles/LLVMCore.dir/DIBuilder.cpp.o -MF lib/IR/CMakeFiles/LLVMCore.dir/DIBuilder.cpp.o.d -o lib/IR/CMakeFiles/LLVMCore.dir/DIBuilder.cpp.o -c /Users/buildslave/jenkins/workspace/clang-stage1-cmake-RA-expensive/llvm/lib/IR/DIBuilder.cpp
[255/4517] /Applications/Xcode.app/Contents/Developer/Toolchains/XcodeDefault.xctoolchain/usr/bin/c++  -DEXPENSIVE_CHECKS -DGTEST_HAS_RTTI=0 -D_DEBUG -D_GLIBCXX_DEBUG -D__STDC_CONSTANT_MACROS -D__STDC_FORMAT_MACROS -D__STDC_LIMIT_MACROS -Ilib/IR -I/Users/buildslave/jenkins/workspace/clang-stage1-cmake-RA-expensive/llvm/lib/IR -I/Applications/Xcode.app/Contents/Developer/Platforms/MacOSX.platform/Developer/SDKs/MacOSX10.13.sdk/usr/include/libxml2 -Iinclude -I/Users/buildslave/jenkins/workspace/clang-stage1-cmake-RA-expensive/llvm/include -fPIC -fvisibility-inlines-hidden -Werror=date-time -Werror=unguarded-availability-new -std=c++14 -Wall -Wextra -Wno-unused-parameter -Wwrite-strings -Wcast-qual -Wmissing-field-initializers -pedantic -Wno-long-long -Wimplicit-fallthrough -Wcovered-switch-default -Wno-noexcept-type -Wnon-virtual-dtor -Wdelete-non-virtual-dtor -Wstring-conversion -fdiagnostics-color -O3  -isysroot /Applications/Xcode.app/Contents/Developer/Platforms/MacOSX.platform/Developer/SDKs/MacOSX10.13.sdk -mmacosx-version-min=10.9   -UNDEBUG  -fno-exceptions -fno-rtti -MD -MT lib/IR/CMakeFiles/LLVMCore.dir/DebugLoc.cpp.o -MF lib/IR/CMakeFiles/LLVMCore.dir/DebugLoc.cpp.o.d -o lib/IR/CMakeFiles/LLVMCore.dir/DebugLoc.cpp.o -c /Users/buildslave/jenkins/workspace/clang-stage1-cmake-RA-expensive/llvm/lib/IR/DebugLoc.cpp
[256/4517] /Applications/Xcode.app/Contents/Developer/Toolchains/XcodeDefault.xctoolchain/usr/bin/c++  -DEXPENSIVE_CHECKS -DGTEST_HAS_RTTI=0 -D_DEBUG -D_GLIBCXX_DEBUG -D__STDC_CONSTANT_MACROS -D__STDC_FORMAT_MACROS -D__STDC_LIMIT_MACROS -Ilib/IR -I/Users/buildslave/jenkins/workspace/clang-stage1-cmake-RA-expensive/llvm/lib/IR -I/Applications/Xcode.app/Contents/Developer/Platforms/MacOSX.platform/Developer/SDKs/MacOSX10.13.sdk/usr/include/libxml2 -Iinclude -I/Users/buildslave/jenkins/workspace/clang-stage1-cmake-RA-expensive/llvm/include -fPIC -fvisibility-inlines-hidden -Werror=date-time -Werror=unguarded-availability-new -std=c++14 -Wall -Wextra -Wno-unused-parameter -Wwrite-strings -Wcast-qual -Wmissing-field-initializers -pedantic -Wno-long-long -Wimplicit-fallthrough -Wcovered-switch-default -Wno-noexcept-type -Wnon-virtual-dtor -Wdelete-non-virtual-dtor -Wstring-conversion -fdiagnostics-color -O3  -isysroot /Applications/Xcode.app/Contents/Developer/Platforms/MacOSX.platform/Developer/SDKs/MacOSX10.13.sdk -mmacosx-version-min=10.9   -UNDEBUG  -fno-exceptions -fno-rtti -MD -MT lib/IR/CMakeFiles/LLVMCore.dir/DiagnosticPrinter.cpp.o -MF lib/IR/CMakeFiles/LLVMCore.dir/DiagnosticPrinter.cpp.o.d -o lib/IR/CMakeFiles/LLVMCore.dir/DiagnosticPrinter.cpp.o -c /Users/buildslave/jenkins/workspace/clang-stage1-cmake-RA-expensive/llvm/lib/IR/DiagnosticPrinter.cpp
[257/4517] /Applications/Xcode.app/Contents/Developer/Toolchains/XcodeDefault.xctoolchain/usr/bin/c++  -DEXPENSIVE_CHECKS -DGTEST_HAS_RTTI=0 -D_DEBUG -D_GLIBCXX_DEBUG -D__STDC_CONSTANT_MACROS -D__STDC_FORMAT_MACROS -D__STDC_LIMIT_MACROS -Ilib/IR -I/Users/buildslave/jenkins/workspace/clang-stage1-cmake-RA-expensive/llvm/lib/IR -I/Applications/Xcode.app/Contents/Developer/Platforms/MacOSX.platform/Developer/SDKs/MacOSX10.13.sdk/usr/include/libxml2 -Iinclude -I/Users/buildslave/jenkins/workspace/clang-stage1-cmake-RA-expensive/llvm/include -fPIC -fvisibility-inlines-hidden -Werror=date-time -Werror=unguarded-availability-new -std=c++14 -Wall -Wextra -Wno-unused-parameter -Wwrite-strings -Wcast-qual -Wmissing-field-initializers -pedantic -Wno-long-long -Wimplicit-fallthrough -Wcovered-switch-default -Wno-noexcept-type -Wnon-virtual-dtor -Wdelete-non-virtual-dtor -Wstring-conversion -fdiagnostics-color -O3  -isysroot /Applications/Xcode.app/Contents/Developer/Platforms/MacOSX.platform/Developer/SDKs/MacOSX10.13.sdk -mmacosx-version-min=10.9   -UNDEBUG  -fno-exceptions -fno-rtti -MD -MT lib/IR/CMakeFiles/LLVMCore.dir/DebugInfo.cpp.o -MF lib/IR/CMakeFiles/LLVMCore.dir/DebugInfo.cpp.o.d -o lib/IR/CMakeFiles/LLVMCore.dir/DebugInfo.cpp.o -c /Users/buildslave/jenkins/workspace/clang-stage1-cmake-RA-expensive/llvm/lib/IR/DebugInfo.cpp
[258/4517] /Applications/Xcode.app/Contents/Developer/Toolchains/XcodeDefault.xctoolchain/usr/bin/c++  -DEXPENSIVE_CHECKS -DGTEST_HAS_RTTI=0 -D_DEBUG -D_GLIBCXX_DEBUG -D__STDC_CONSTANT_MACROS -D__STDC_FORMAT_MACROS -D__STDC_LIMIT_MACROS -Ilib/IR -I/Users/buildslave/jenkins/workspace/clang-stage1-cmake-RA-expensive/llvm/lib/IR -I/Applications/Xcode.app/Contents/Developer/Platforms/MacOSX.platform/Developer/SDKs/MacOSX10.13.sdk/usr/include/libxml2 -Iinclude -I/Users/buildslave/jenkins/workspace/clang-stage1-cmake-RA-expensive/llvm/include -fPIC -fvisibility-inlines-hidden -Werror=date-time -Werror=unguarded-availability-new -std=c++14 -Wall -Wextra -Wno-unused-parameter -Wwrite-strings -Wcast-qual -Wmissing-field-initializers -pedantic -Wno-long-long -Wimplicit-fallthrough -Wcovered-switch-default -Wno-noexcept-type -Wnon-virtual-dtor -Wdelete-non-virtual-dtor -Wstring-conversion -fdiagnostics-color -O3  -isysroot /Applications/Xcode.app/Contents/Developer/Platforms/MacOSX.platform/Developer/SDKs/MacOSX10.13.sdk -mmacosx-version-min=10.9   -UNDEBUG  -fno-exceptions -fno-rtti -MD -MT lib/IR/CMakeFiles/LLVMCore.dir/AutoUpgrade.cpp.o -MF lib/IR/CMakeFiles/LLVMCore.dir/AutoUpgrade.cpp.o.d -o lib/IR/CMakeFiles/LLVMCore.dir/AutoUpgrade.cpp.o -c /Users/buildslave/jenkins/workspace/clang-stage1-cmake-RA-expensive/llvm/lib/IR/AutoUpgrade.cpp
[259/4517] /Applications/Xcode.app/Contents/Developer/Toolchains/XcodeDefault.xctoolchain/usr/bin/c++  -DEXPENSIVE_CHECKS -DGTEST_HAS_RTTI=0 -D_DEBUG -D_GLIBCXX_DEBUG -D__STDC_CONSTANT_MACROS -D__STDC_FORMAT_MACROS -D__STDC_LIMIT_MACROS -Ilib/IR -I/Users/buildslave/jenkins/workspace/clang-stage1-cmake-RA-expensive/llvm/lib/IR -I/Applications/Xcode.app/Contents/Developer/Platforms/MacOSX.platform/Developer/SDKs/MacOSX10.13.sdk/usr/include/libxml2 -Iinclude -I/Users/buildslave/jenkins/workspace/clang-stage1-cmake-RA-expensive/llvm/include -fPIC -fvisibility-inlines-hidden -Werror=date-time -Werror=unguarded-availability-new -std=c++14 -Wall -Wextra -Wno-unused-parameter -Wwrite-strings -Wcast-qual -Wmissing-field-initializers -pedantic -Wno-long-long -Wimplicit-fallthrough -Wcovered-switch-default -Wno-noexcept-type -Wnon-virtual-dtor -Wdelete-non-virtual-dtor -Wstring-conversion -fdiagnostics-color -O3  -isysroot /Applications/Xcode.app/Contents/Developer/Platforms/MacOSX.platform/Developer/SDKs/MacOSX10.13.sdk -mmacosx-version-min=10.9   -UNDEBUG  -fno-exceptions -fno-rtti -MD -MT lib/IR/CMakeFiles/LLVMCore.dir/GVMaterializer.cpp.o -MF lib/IR/CMakeFiles/LLVMCore.dir/GVMaterializer.cpp.o.d -o lib/IR/CMakeFiles/LLVMCore.dir/GVMaterializer.cpp.o -c /Users/buildslave/jenkins/workspace/clang-stage1-cmake-RA-expensive/llvm/lib/IR/GVMaterializer.cpp
[260/4517] /Applications/Xcode.app/Contents/Developer/Toolchains/XcodeDefault.xctoolchain/usr/bin/c++  -DEXPENSIVE_CHECKS -DGTEST_HAS_RTTI=0 -D_DEBUG -D_GLIBCXX_DEBUG -D__STDC_CONSTANT_MACROS -D__STDC_FORMAT_MACROS -D__STDC_LIMIT_MACROS -Ilib/IR -I/Users/buildslave/jenkins/workspace/clang-stage1-cmake-RA-expensive/llvm/lib/IR -I/Applications/Xcode.app/Contents/Developer/Platforms/MacOSX.platform/Developer/SDKs/MacOSX10.13.sdk/usr/include/libxml2 -Iinclude -I/Users/buildslave/jenkins/workspace/clang-stage1-cmake-RA-expensive/llvm/include -fPIC -fvisibility-inlines-hidden -Werror=date-time -Werror=unguarded-availability-new -std=c++14 -Wall -Wextra -Wno-unused-parameter -Wwrite-strings -Wcast-qual -Wmissing-field-initializers -pedantic -Wno-long-long -Wimplicit-fallthrough -Wcovered-switch-default -Wno-noexcept-type -Wnon-virtual-dtor -Wdelete-non-virtual-dtor -Wstring-conversion -fdiagnostics-color -O3  -isysroot /Applications/Xcode.app/Contents/Developer/Platforms/MacOSX.platform/Developer/SDKs/MacOSX10.13.sdk -mmacosx-version-min=10.9   -UNDEBUG  -fno-exceptions -fno-rtti -MD -MT lib/IR/CMakeFiles/LLVMCore.dir/DiagnosticInfo.cpp.o -MF lib/IR/CMakeFiles/LLVMCore.dir/DiagnosticInfo.cpp.o.d -o lib/IR/CMakeFiles/LLVMCore.dir/DiagnosticInfo.cpp.o -c /Users/buildslave/jenkins/workspace/clang-stage1-cmake-RA-expensive/llvm/lib/IR/DiagnosticInfo.cpp
[261/4517] /Applications/Xcode.app/Contents/Developer/Toolchains/XcodeDefault.xctoolchain/usr/bin/c++  -DEXPENSIVE_CHECKS -DGTEST_HAS_RTTI=0 -D_DEBUG -D_GLIBCXX_DEBUG -D__STDC_CONSTANT_MACROS -D__STDC_FORMAT_MACROS -D__STDC_LIMIT_MACROS -Ilib/IR -I/Users/buildslave/jenkins/workspace/clang-stage1-cmake-RA-expensive/llvm/lib/IR -I/Applications/Xcode.app/Contents/Developer/Platforms/MacOSX.platform/Developer/SDKs/MacOSX10.13.sdk/usr/include/libxml2 -Iinclude -I/Users/buildslave/jenkins/workspace/clang-stage1-cmake-RA-expensive/llvm/include -fPIC -fvisibility-inlines-hidden -Werror=date-time -Werror=unguarded-availability-new -std=c++14 -Wall -Wextra -Wno-unused-parameter -Wwrite-strings -Wcast-qual -Wmissing-field-initializers -pedantic -Wno-long-long -Wimplicit-fallthrough -Wcovered-switch-default -Wno-noexcept-type -Wnon-virtual-dtor -Wdelete-non-virtual-dtor -Wstring-conversion -fdiagnostics-color -O3  -isysroot /Applications/Xcode.app/Contents/Developer/Platforms/MacOSX.platform/Developer/SDKs/MacOSX10.13.sdk -mmacosx-version-min=10.9   -UNDEBUG  -fno-exceptions -fno-rtti -MD -MT lib/IR/CMakeFiles/LLVMCore.dir/Core.cpp.o -MF lib/IR/CMakeFiles/LLVMCore.dir/Core.cpp.o.d -o lib/IR/CMakeFiles/LLVMCore.dir/Core.cpp.o -c /Users/buildslave/jenkins/workspace/clang-stage1-cmake-RA-expensive/llvm/lib/IR/Core.cpp
[262/4517] /Applications/Xcode.app/Contents/Developer/Toolchains/XcodeDefault.xctoolchain/usr/bin/c++  -DEXPENSIVE_CHECKS -DGTEST_HAS_RTTI=0 -D_DEBUG -D_GLIBCXX_DEBUG -D__STDC_CONSTANT_MACROS -D__STDC_FORMAT_MACROS -D__STDC_LIMIT_MACROS -Ilib/IR -I/Users/buildslave/jenkins/workspace/clang-stage1-cmake-RA-expensive/llvm/lib/IR -I/Applications/Xcode.app/Contents/Developer/Platforms/MacOSX.platform/Developer/SDKs/MacOSX10.13.sdk/usr/include/libxml2 -Iinclude -I/Users/buildslave/jenkins/workspace/clang-stage1-cmake-RA-expensive/llvm/include -fPIC -fvisibility-inlines-hidden -Werror=date-time -Werror=unguarded-availability-new -std=c++14 -Wall -Wextra -Wno-unused-parameter -Wwrite-strings -Wcast-qual -Wmissing-field-initializers -pedantic -Wno-long-long -Wimplicit-fallthrough -Wcovered-switch-default -Wno-noexcept-type -Wnon-virtual-dtor -Wdelete-non-virtual-dtor -Wstring-conversion -fdiagnostics-color -O3  -isysroot /Applications/Xcode.app/Contents/Developer/Platforms/MacOSX.platform/Developer/SDKs/MacOSX10.13.sdk -mmacosx-version-min=10.9   -UNDEBUG  -fno-exceptions -fno-rtti -MD -MT lib/IR/CMakeFiles/LLVMCore.dir/Constants.cpp.o -MF lib/IR/CMakeFiles/LLVMCore.dir/Constants.cpp.o.d -o lib/IR/CMakeFiles/LLVMCore.dir/Constants.cpp.o -c /Users/buildslave/jenkins/workspace/clang-stage1-cmake-RA-expensive/llvm/lib/IR/Constants.cpp
[263/4517] /Applications/Xcode.app/Contents/Developer/Toolchains/XcodeDefault.xctoolchain/usr/bin/c++  -DEXPENSIVE_CHECKS -DGTEST_HAS_RTTI=0 -D_DEBUG -D_GLIBCXX_DEBUG -D__STDC_CONSTANT_MACROS -D__STDC_FORMAT_MACROS -D__STDC_LIMIT_MACROS -Ilib/IR -I/Users/buildslave/jenkins/workspace/clang-stage1-cmake-RA-expensive/llvm/lib/IR -I/Applications/Xcode.app/Contents/Developer/Platforms/MacOSX.platform/Developer/SDKs/MacOSX10.13.sdk/usr/include/libxml2 -Iinclude -I/Users/buildslave/jenkins/workspace/clang-stage1-cmake-RA-expensive/llvm/include -fPIC -fvisibility-inlines-hidden -Werror=date-time -Werror=unguarded-availability-new -std=c++14 -Wall -Wextra -Wno-unused-parameter -Wwrite-strings -Wcast-qual -Wmissing-field-initializers -pedantic -Wno-long-long -Wimplicit-fallthrough -Wcovered-switch-default -Wno-noexcept-type -Wnon-virtual-dtor -Wdelete-non-virtual-dtor -Wstring-conversion -fdiagnostics-color -O3  -isysroot /Applications/Xcode.app/Contents/Developer/Platforms/MacOSX.platform/Developer/SDKs/MacOSX10.13.sdk -mmacosx-version-min=10.9   -UNDEBUG  -fno-exceptions -fno-rtti -MD -MT lib/IR/CMakeFiles/LLVMCore.dir/IRPrintingPasses.cpp.o -MF lib/IR/CMakeFiles/LLVMCore.dir/IRPrintingPasses.cpp.o.d -o lib/IR/CMakeFiles/LLVMCore.dir/IRPrintingPasses.cpp.o -c /Users/buildslave/jenkins/workspace/clang-stage1-cmake-RA-expensive/llvm/lib/IR/IRPrintingPasses.cpp
[264/4517] /Applications/Xcode.app/Contents/Developer/Toolchains/XcodeDefault.xctoolchain/usr/bin/c++  -DEXPENSIVE_CHECKS -DGTEST_HAS_RTTI=0 -D_DEBUG -D_GLIBCXX_DEBUG -D__STDC_CONSTANT_MACROS -D__STDC_FORMAT_MACROS -D__STDC_LIMIT_MACROS -Ilib/IR -I/Users/buildslave/jenkins/workspace/clang-stage1-cmake-RA-expensive/llvm/lib/IR -I/Applications/Xcode.app/Contents/Developer/Platforms/MacOSX.platform/Developer/SDKs/MacOSX10.13.sdk/usr/include/libxml2 -Iinclude -I/Users/buildslave/jenkins/workspace/clang-stage1-cmake-RA-expensive/llvm/include -fPIC -fvisibility-inlines-hidden -Werror=date-time -Werror=unguarded-availability-new -std=c++14 -Wall -Wextra -Wno-unused-parameter -Wwrite-strings -Wcast-qual -Wmissing-field-initializers -pedantic -Wno-long-long -Wimplicit-fallthrough -Wcovered-switch-default -Wno-noexcept-type -Wnon-virtual-dtor -Wdelete-non-virtual-dtor -Wstring-conversion -fdiagnostics-color -O3  -isysroot /Applications/Xcode.app/Contents/Developer/Platforms/MacOSX.platform/Developer/SDKs/MacOSX10.13.sdk -mmacosx-version-min=10.9   -UNDEBUG  -fno-exceptions -fno-rtti -MD -MT lib/IR/CMakeFiles/LLVMCore.dir/AsmWriter.cpp.o -MF lib/IR/CMakeFiles/LLVMCore.dir/AsmWriter.cpp.o.d -o lib/IR/CMakeFiles/LLVMCore.dir/AsmWriter.cpp.o -c /Users/buildslave/jenkins/workspace/clang-stage1-cmake-RA-expensive/llvm/lib/IR/AsmWriter.cpp
[265/4517] /Applications/Xcode.app/Contents/Developer/Toolchains/XcodeDefault.xctoolchain/usr/bin/c++  -DEXPENSIVE_CHECKS -DGTEST_HAS_RTTI=0 -D_DEBUG -D_GLIBCXX_DEBUG -D__STDC_CONSTANT_MACROS -D__STDC_FORMAT_MACROS -D__STDC_LIMIT_MACROS -Ilib/IR -I/Users/buildslave/jenkins/workspace/clang-stage1-cmake-RA-expensive/llvm/lib/IR -I/Applications/Xcode.app/Contents/Developer/Platforms/MacOSX.platform/Developer/SDKs/MacOSX10.13.sdk/usr/include/libxml2 -Iinclude -I/Users/buildslave/jenkins/workspace/clang-stage1-cmake-RA-expensive/llvm/include -fPIC -fvisibility-inlines-hidden -Werror=date-time -Werror=unguarded-availability-new -std=c++14 -Wall -Wextra -Wno-unused-parameter -Wwrite-strings -Wcast-qual -Wmissing-field-initializers -pedantic -Wno-long-long -Wimplicit-fallthrough -Wcovered-switch-default -Wno-noexcept-type -Wnon-virtual-dtor -Wdelete-non-virtual-dtor -Wstring-conversion -fdiagnostics-color -O3  -isysroot /Applications/Xcode.app/Contents/Developer/Platforms/MacOSX.platform/Developer/SDKs/MacOSX10.13.sdk -mmacosx-version-min=10.9   -UNDEBUG  -fno-exceptions -fno-rtti -MD -MT lib/IR/CMakeFiles/LLVMCore.dir/IRBuilder.cpp.o -MF lib/IR/CMakeFiles/LLVMCore.dir/IRBuilder.cpp.o.d -o lib/IR/CMakeFiles/LLVMCore.dir/IRBuilder.cpp.o -c /Users/buildslave/jenkins/workspace/clang-stage1-cmake-RA-expensive/llvm/lib/IR/IRBuilder.cpp
[266/4517] /Applications/Xcode.app/Contents/Developer/Toolchains/XcodeDefault.xctoolchain/usr/bin/c++  -DEXPENSIVE_CHECKS -DGTEST_HAS_RTTI=0 -D_DEBUG -D_GLIBCXX_DEBUG -D__STDC_CONSTANT_MACROS -D__STDC_FORMAT_MACROS -D__STDC_LIMIT_MACROS -Ilib/IR -I/Users/buildslave/jenkins/workspace/clang-stage1-cmake-RA-expensive/llvm/lib/IR -I/Applications/Xcode.app/Contents/Developer/Platforms/MacOSX.platform/Developer/SDKs/MacOSX10.13.sdk/usr/include/libxml2 -Iinclude -I/Users/buildslave/jenkins/workspace/clang-stage1-cmake-RA-expensive/llvm/include -fPIC -fvisibility-inlines-hidden -Werror=date-time -Werror=unguarded-availability-new -std=c++14 -Wall -Wextra -Wno-unused-parameter -Wwrite-strings -Wcast-qual -Wmissing-field-initializers -pedantic -Wno-long-long -Wimplicit-fallthrough -Wcovered-switch-default -Wno-noexcept-type -Wnon-virtual-dtor -Wdelete-non-virtual-dtor -Wstring-conversion -fdiagnostics-color -O3  -isysroot /Applications/Xcode.app/Contents/Developer/Platforms/MacOSX.platform/Developer/SDKs/MacOSX10.13.sdk -mmacosx-version-min=10.9   -UNDEBUG  -fno-exceptions -fno-rtti -MD -MT lib/IR/CMakeFiles/LLVMCore.dir/Globals.cpp.o -MF lib/IR/CMakeFiles/LLVMCore.dir/Globals.cpp.o.d -o lib/IR/CMakeFiles/LLVMCore.dir/Globals.cpp.o -c /Users/buildslave/jenkins/workspace/clang-stage1-cmake-RA-expensive/llvm/lib/IR/Globals.cpp
[267/4517] /Applications/Xcode.app/Contents/Developer/Toolchains/XcodeDefault.xctoolchain/usr/bin/c++  -DEXPENSIVE_CHECKS -DGTEST_HAS_RTTI=0 -D_DEBUG -D_GLIBCXX_DEBUG -D__STDC_CONSTANT_MACROS -D__STDC_FORMAT_MACROS -D__STDC_LIMIT_MACROS -Ilib/IR -I/Users/buildslave/jenkins/workspace/clang-stage1-cmake-RA-expensive/llvm/lib/IR -I/Applications/Xcode.app/Contents/Developer/Platforms/MacOSX.platform/Developer/SDKs/MacOSX10.13.sdk/usr/include/libxml2 -Iinclude -I/Users/buildslave/jenkins/workspace/clang-stage1-cmake-RA-expensive/llvm/include -fPIC -fvisibility-inlines-hidden -Werror=date-time -Werror=unguarded-availability-new -std=c++14 -Wall -Wextra -Wno-unused-parameter -Wwrite-strings -Wcast-qual -Wmissing-field-initializers -pedantic -Wno-long-long -Wimplicit-fallthrough -Wcovered-switch-default -Wno-noexcept-type -Wnon-virtual-dtor -Wdelete-non-virtual-dtor -Wstring-conversion -fdiagnostics-color -O3  -isysroot /Applications/Xcode.app/Contents/Developer/Platforms/MacOSX.platform/Developer/SDKs/MacOSX10.13.sdk -mmacosx-version-min=10.9   -UNDEBUG  -fno-exceptions -fno-rtti -MD -MT lib/IR/CMakeFiles/LLVMCore.dir/Function.cpp.o -MF lib/IR/CMakeFiles/LLVMCore.dir/Function.cpp.o.d -o lib/IR/CMakeFiles/LLVMCore.dir/Function.cpp.o -c /Users/buildslave/jenkins/workspace/clang-stage1-cmake-RA-expensive/llvm/lib/IR/Function.cpp
[268/4517] /Applications/Xcode.app/Contents/Developer/Toolchains/XcodeDefault.xctoolchain/usr/bin/c++  -DEXPENSIVE_CHECKS -DGTEST_HAS_RTTI=0 -D_DEBUG -D_GLIBCXX_DEBUG -D__STDC_CONSTANT_MACROS -D__STDC_FORMAT_MACROS -D__STDC_LIMIT_MACROS -Ilib/IR -I/Users/buildslave/jenkins/workspace/clang-stage1-cmake-RA-expensive/llvm/lib/IR -I/Applications/Xcode.app/Contents/Developer/Platforms/MacOSX.platform/Developer/SDKs/MacOSX10.13.sdk/usr/include/libxml2 -Iinclude -I/Users/buildslave/jenkins/workspace/clang-stage1-cmake-RA-expensive/llvm/include -fPIC -fvisibility-inlines-hidden -Werror=date-time -Werror=unguarded-availability-new -std=c++14 -Wall -Wextra -Wno-unused-parameter -Wwrite-strings -Wcast-qual -Wmissing-field-initializers -pedantic -Wno-long-long -Wimplicit-fallthrough -Wcovered-switch-default -Wno-noexcept-type -Wnon-virtual-dtor -Wdelete-non-virtual-dtor -Wstring-conversion -fdiagnostics-color -O3  -isysroot /Applications/Xcode.app/Contents/Developer/Platforms/MacOSX.platform/Developer/SDKs/MacOSX10.13.sdk -mmacosx-version-min=10.9   -UNDEBUG  -fno-exceptions -fno-rtti -MD -MT lib/IR/CMakeFiles/LLVMCore.dir/InlineAsm.cpp.o -MF lib/IR/CMakeFiles/LLVMCore.dir/InlineAsm.cpp.o.d -o lib/IR/CMakeFiles/LLVMCore.dir/InlineAsm.cpp.o -c /Users/buildslave/jenkins/workspace/clang-stage1-cmake-RA-expensive/llvm/lib/IR/InlineAsm.cpp
[269/4517] /Applications/Xcode.app/Contents/Developer/Toolchains/XcodeDefault.xctoolchain/usr/bin/c++  -DEXPENSIVE_CHECKS -DGTEST_HAS_RTTI=0 -D_DEBUG -D_GLIBCXX_DEBUG -D__STDC_CONSTANT_MACROS -D__STDC_FORMAT_MACROS -D__STDC_LIMIT_MACROS -Ilib/IR -I/Users/buildslave/jenkins/workspace/clang-stage1-cmake-RA-expensive/llvm/lib/IR -I/Applications/Xcode.app/Contents/Developer/Platforms/MacOSX.platform/Developer/SDKs/MacOSX10.13.sdk/usr/include/libxml2 -Iinclude -I/Users/buildslave/jenkins/workspace/clang-stage1-cmake-RA-expensive/llvm/include -fPIC -fvisibility-inlines-hidden -Werror=date-time -Werror=unguarded-availability-new -std=c++14 -Wall -Wextra -Wno-unused-parameter -Wwrite-strings -Wcast-qual -Wmissing-field-initializers -pedantic -Wno-long-long -Wimplicit-fallthrough -Wcovered-switch-default -Wno-noexcept-type -Wnon-virtual-dtor -Wdelete-non-virtual-dtor -Wstring-conversion -fdiagnostics-color -O3  -isysroot /Applications/Xcode.app/Contents/Developer/Platforms/MacOSX.platform/Developer/SDKs/MacOSX10.13.sdk -mmacosx-version-min=10.9   -UNDEBUG  -fno-exceptions -fno-rtti -MD -MT lib/IR/CMakeFiles/LLVMCore.dir/Instruction.cpp.o -MF lib/IR/CMakeFiles/LLVMCore.dir/Instruction.cpp.o.d -o lib/IR/CMakeFiles/LLVMCore.dir/Instruction.cpp.o -c /Users/buildslave/jenkins/workspace/clang-stage1-cmake-RA-expensive/llvm/lib/IR/Instruction.cpp
[270/4517] /Applications/Xcode.app/Contents/Developer/Toolchains/XcodeDefault.xctoolchain/usr/bin/c++  -DEXPENSIVE_CHECKS -DGTEST_HAS_RTTI=0 -D_DEBUG -D_GLIBCXX_DEBUG -D__STDC_CONSTANT_MACROS -D__STDC_FORMAT_MACROS -D__STDC_LIMIT_MACROS -Ilib/IR -I/Users/buildslave/jenkins/workspace/clang-stage1-cmake-RA-expensive/llvm/lib/IR -I/Applications/Xcode.app/Contents/Developer/Platforms/MacOSX.platform/Developer/SDKs/MacOSX10.13.sdk/usr/include/libxml2 -Iinclude -I/Users/buildslave/jenkins/workspace/clang-stage1-cmake-RA-expensive/llvm/include -fPIC -fvisibility-inlines-hidden -Werror=date-time -Werror=unguarded-availability-new -std=c++14 -Wall -Wextra -Wno-unused-parameter -Wwrite-strings -Wcast-qual -Wmissing-field-initializers -pedantic -Wno-long-long -Wimplicit-fallthrough -Wcovered-switch-default -Wno-noexcept-type -Wnon-virtual-dtor -Wdelete-non-virtual-dtor -Wstring-conversion -fdiagnostics-color -O3  -isysroot /Applications/Xcode.app/Contents/Developer/Platforms/MacOSX.platform/Developer/SDKs/MacOSX10.13.sdk -mmacosx-version-min=10.9   -UNDEBUG  -fno-exceptions -fno-rtti -MD -MT lib/IR/CMakeFiles/LLVMCore.dir/DebugInfoMetadata.cpp.o -MF lib/IR/CMakeFiles/LLVMCore.dir/DebugInfoMetadata.cpp.o.d -o lib/IR/CMakeFiles/LLVMCore.dir/DebugInfoMetadata.cpp.o -c /Users/buildslave/jenkins/workspace/clang-stage1-cmake-RA-expensive/llvm/lib/IR/DebugInfoMetadata.cpp
[271/4517] /Applications/Xcode.app/Contents/Developer/Toolchains/XcodeDefault.xctoolchain/usr/bin/c++  -DEXPENSIVE_CHECKS -DGTEST_HAS_RTTI=0 -D_DEBUG -D_GLIBCXX_DEBUG -D__STDC_CONSTANT_MACROS -D__STDC_FORMAT_MACROS -D__STDC_LIMIT_MACROS -Ilib/IR -I/Users/buildslave/jenkins/workspace/clang-stage1-cmake-RA-expensive/llvm/lib/IR -I/Applications/Xcode.app/Contents/Developer/Platforms/MacOSX.platform/Developer/SDKs/MacOSX10.13.sdk/usr/include/libxml2 -Iinclude -I/Users/buildslave/jenkins/workspace/clang-stage1-cmake-RA-expensive/llvm/include -fPIC -fvisibility-inlines-hidden -Werror=date-time -Werror=unguarded-availability-new -std=c++14 -Wall -Wextra -Wno-unused-parameter -Wwrite-strings -Wcast-qual -Wmissing-field-initializers -pedantic -Wno-long-long -Wimplicit-fallthrough -Wcovered-switch-default -Wno-noexcept-type -Wnon-virtual-dtor -Wdelete-non-virtual-dtor -Wstring-conversion -fdiagnostics-color -O3  -isysroot /Applications/Xcode.app/Contents/Developer/Platforms/MacOSX.platform/Developer/SDKs/MacOSX10.13.sdk -mmacosx-version-min=10.9   -UNDEBUG  -fno-exceptions -fno-rtti -MD -MT lib/IR/CMakeFiles/LLVMCore.dir/IntrinsicInst.cpp.o -MF lib/IR/CMakeFiles/LLVMCore.dir/IntrinsicInst.cpp.o.d -o lib/IR/CMakeFiles/LLVMCore.dir/IntrinsicInst.cpp.o -c /Users/buildslave/jenkins/workspace/clang-stage1-cmake-RA-expensive/llvm/lib/IR/IntrinsicInst.cpp
[272/4517] /Applications/Xcode.app/Contents/Developer/Toolchains/XcodeDefault.xctoolchain/usr/bin/c++  -DEXPENSIVE_CHECKS -DGTEST_HAS_RTTI=0 -D_DEBUG -D_GLIBCXX_DEBUG -D__STDC_CONSTANT_MACROS -D__STDC_FORMAT_MACROS -D__STDC_LIMIT_MACROS -Ilib/IR -I/Users/buildslave/jenkins/workspace/clang-stage1-cmake-RA-expensive/llvm/lib/IR -I/Applications/Xcode.app/Contents/Developer/Platforms/MacOSX.platform/Developer/SDKs/MacOSX10.13.sdk/usr/include/libxml2 -Iinclude -I/Users/buildslave/jenkins/workspace/clang-stage1-cmake-RA-expensive/llvm/include -fPIC -fvisibility-inlines-hidden -Werror=date-time -Werror=unguarded-availability-new -std=c++14 -Wall -Wextra -Wno-unused-parameter -Wwrite-strings -Wcast-qual -Wmissing-field-initializers -pedantic -Wno-long-long -Wimplicit-fallthrough -Wcovered-switch-default -Wno-noexcept-type -Wnon-virtual-dtor -Wdelete-non-virtual-dtor -Wstring-conversion -fdiagnostics-color -O3  -isysroot /Applications/Xcode.app/Contents/Developer/Platforms/MacOSX.platform/Developer/SDKs/MacOSX10.13.sdk -mmacosx-version-min=10.9   -UNDEBUG  -fno-exceptions -fno-rtti -MD -MT lib/IR/CMakeFiles/LLVMCore.dir/MDBuilder.cpp.o -MF lib/IR/CMakeFiles/LLVMCore.dir/MDBuilder.cpp.o.d -o lib/IR/CMakeFiles/LLVMCore.dir/MDBuilder.cpp.o -c /Users/buildslave/jenkins/workspace/clang-stage1-cmake-RA-expensive/llvm/lib/IR/MDBuilder.cpp
[273/4517] /Applications/Xcode.app/Contents/Developer/Toolchains/XcodeDefault.xctoolchain/usr/bin/c++  -DEXPENSIVE_CHECKS -DGTEST_HAS_RTTI=0 -D_DEBUG -D_GLIBCXX_DEBUG -D__STDC_CONSTANT_MACROS -D__STDC_FORMAT_MACROS -D__STDC_LIMIT_MACROS -Ilib/IR -I/Users/buildslave/jenkins/workspace/clang-stage1-cmake-RA-expensive/llvm/lib/IR -I/Applications/Xcode.app/Contents/Developer/Platforms/MacOSX.platform/Developer/SDKs/MacOSX10.13.sdk/usr/include/libxml2 -Iinclude -I/Users/buildslave/jenkins/workspace/clang-stage1-cmake-RA-expensive/llvm/include -fPIC -fvisibility-inlines-hidden -Werror=date-time -Werror=unguarded-availability-new -std=c++14 -Wall -Wextra -Wno-unused-parameter -Wwrite-strings -Wcast-qual -Wmissing-field-initializers -pedantic -Wno-long-long -Wimplicit-fallthrough -Wcovered-switch-default -Wno-noexcept-type -Wnon-virtual-dtor -Wdelete-non-virtual-dtor -Wstring-conversion -fdiagnostics-color -O3  -isysroot /Applications/Xcode.app/Contents/Developer/Platforms/MacOSX.platform/Developer/SDKs/MacOSX10.13.sdk -mmacosx-version-min=10.9   -UNDEBUG  -fno-exceptions -fno-rtti -MD -MT lib/IR/CMakeFiles/LLVMCore.dir/Mangler.cpp.o -MF lib/IR/CMakeFiles/LLVMCore.dir/Mangler.cpp.o.d -o lib/IR/CMakeFiles/LLVMCore.dir/Mangler.cpp.o -c /Users/buildslave/jenkins/workspace/clang-stage1-cmake-RA-expensive/llvm/lib/IR/Mangler.cpp
[274/4517] /Applications/Xcode.app/Contents/Developer/Toolchains/XcodeDefault.xctoolchain/usr/bin/c++  -DEXPENSIVE_CHECKS -DGTEST_HAS_RTTI=0 -D_DEBUG -D_GLIBCXX_DEBUG -D__STDC_CONSTANT_MACROS -D__STDC_FORMAT_MACROS -D__STDC_LIMIT_MACROS -Ilib/IR -I/Users/buildslave/jenkins/workspace/clang-stage1-cmake-RA-expensive/llvm/lib/IR -I/Applications/Xcode.app/Contents/Developer/Platforms/MacOSX.platform/Developer/SDKs/MacOSX10.13.sdk/usr/include/libxml2 -Iinclude -I/Users/buildslave/jenkins/workspace/clang-stage1-cmake-RA-expensive/llvm/include -fPIC -fvisibility-inlines-hidden -Werror=date-time -Werror=unguarded-availability-new -std=c++14 -Wall -Wextra -Wno-unused-parameter -Wwrite-strings -Wcast-qual -Wmissing-field-initializers -pedantic -Wno-long-long -Wimplicit-fallthrough -Wcovered-switch-default -Wno-noexcept-type -Wnon-virtual-dtor -Wdelete-non-virtual-dtor -Wstring-conversion -fdiagnostics-color -O3  -isysroot /Applications/Xcode.app/Contents/Developer/Platforms/MacOSX.platform/Developer/SDKs/MacOSX10.13.sdk -mmacosx-version-min=10.9   -UNDEBUG  -fno-exceptions -fno-rtti -MD -MT lib/IR/CMakeFiles/LLVMCore.dir/LLVMContext.cpp.o -MF lib/IR/CMakeFiles/LLVMCore.dir/LLVMContext.cpp.o.d -o lib/IR/CMakeFiles/LLVMCore.dir/LLVMContext.cpp.o -c /Users/buildslave/jenkins/workspace/clang-stage1-cmake-RA-expensive/llvm/lib/IR/LLVMContext.cpp
[275/4517] /Applications/Xcode.app/Contents/Developer/Toolchains/XcodeDefault.xctoolchain/usr/bin/c++  -DEXPENSIVE_CHECKS -DGTEST_HAS_RTTI=0 -D_DEBUG -D_GLIBCXX_DEBUG -D__STDC_CONSTANT_MACROS -D__STDC_FORMAT_MACROS -D__STDC_LIMIT_MACROS -Ilib/IR -I/Users/buildslave/jenkins/workspace/clang-stage1-cmake-RA-expensive/llvm/lib/IR -I/Applications/Xcode.app/Contents/Developer/Platforms/MacOSX.platform/Developer/SDKs/MacOSX10.13.sdk/usr/include/libxml2 -Iinclude -I/Users/buildslave/jenkins/workspace/clang-stage1-cmake-RA-expensive/llvm/include -fPIC -fvisibility-inlines-hidden -Werror=date-time -Werror=unguarded-availability-new -std=c++14 -Wall -Wextra -Wno-unused-parameter -Wwrite-strings -Wcast-qual -Wmissing-field-initializers -pedantic -Wno-long-long -Wimplicit-fallthrough -Wcovered-switch-default -Wno-noexcept-type -Wnon-virtual-dtor -Wdelete-non-virtual-dtor -Wstring-conversion -fdiagnostics-color -O3  -isysroot /Applications/Xcode.app/Contents/Developer/Platforms/MacOSX.platform/Developer/SDKs/MacOSX10.13.sdk -mmacosx-version-min=10.9   -UNDEBUG  -fno-exceptions -fno-rtti -MD -MT lib/IR/CMakeFiles/LLVMCore.dir/OptBisect.cpp.o -MF lib/IR/CMakeFiles/LLVMCore.dir/OptBisect.cpp.o.d -o lib/IR/CMakeFiles/LLVMCore.dir/OptBisect.cpp.o -c /Users/buildslave/jenkins/workspace/clang-stage1-cmake-RA-expensive/llvm/lib/IR/OptBisect.cpp
[276/4517] /Applications/Xcode.app/Contents/Developer/Toolchains/XcodeDefault.xctoolchain/usr/bin/c++  -DEXPENSIVE_CHECKS -DGTEST_HAS_RTTI=0 -D_DEBUG -D_GLIBCXX_DEBUG -D__STDC_CONSTANT_MACROS -D__STDC_FORMAT_MACROS -D__STDC_LIMIT_MACROS -Ilib/IR -I/Users/buildslave/jenkins/workspace/clang-stage1-cmake-RA-expensive/llvm/lib/IR -I/Applications/Xcode.app/Contents/Developer/Platforms/MacOSX.platform/Developer/SDKs/MacOSX10.13.sdk/usr/include/libxml2 -Iinclude -I/Users/buildslave/jenkins/workspace/clang-stage1-cmake-RA-expensive/llvm/include -fPIC -fvisibility-inlines-hidden -Werror=date-time -Werror=unguarded-availability-new -std=c++14 -Wall -Wextra -Wno-unused-parameter -Wwrite-strings -Wcast-qual -Wmissing-field-initializers -pedantic -Wno-long-long -Wimplicit-fallthrough -Wcovered-switch-default -Wno-noexcept-type -Wnon-virtual-dtor -Wdelete-non-virtual-dtor -Wstring-conversion -fdiagnostics-color -O3  -isysroot /Applications/Xcode.app/Contents/Developer/Platforms/MacOSX.platform/Developer/SDKs/MacOSX10.13.sdk -mmacosx-version-min=10.9   -UNDEBUG  -fno-exceptions -fno-rtti -MD -MT lib/IR/CMakeFiles/LLVMCore.dir/Instructions.cpp.o -MF lib/IR/CMakeFiles/LLVMCore.dir/Instructions.cpp.o.d -o lib/IR/CMakeFiles/LLVMCore.dir/Instructions.cpp.o -c /Users/buildslave/jenkins/workspace/clang-stage1-cmake-RA-expensive/llvm/lib/IR/Instructions.cpp
[277/4517] /Applications/Xcode.app/Contents/Developer/Toolchains/XcodeDefault.xctoolchain/usr/bin/c++  -DEXPENSIVE_CHECKS -DGTEST_HAS_RTTI=0 -D_DEBUG -D_GLIBCXX_DEBUG -D__STDC_CONSTANT_MACROS -D__STDC_FORMAT_MACROS -D__STDC_LIMIT_MACROS -Ilib/IR -I/Users/buildslave/jenkins/workspace/clang-stage1-cmake-RA-expensive/llvm/lib/IR -I/Applications/Xcode.app/Contents/Developer/Platforms/MacOSX.platform/Developer/SDKs/MacOSX10.13.sdk/usr/include/libxml2 -Iinclude -I/Users/buildslave/jenkins/workspace/clang-stage1-cmake-RA-expensive/llvm/include -fPIC -fvisibility-inlines-hidden -Werror=date-time -Werror=unguarded-availability-new -std=c++14 -Wall -Wextra -Wno-unused-parameter -Wwrite-strings -Wcast-qual -Wmissing-field-initializers -pedantic -Wno-long-long -Wimplicit-fallthrough -Wcovered-switch-default -Wno-noexcept-type -Wnon-virtual-dtor -Wdelete-non-virtual-dtor -Wstring-conversion -fdiagnostics-color -O3  -isysroot /Applications/Xcode.app/Contents/Developer/Platforms/MacOSX.platform/Developer/SDKs/MacOSX10.13.sdk -mmacosx-version-min=10.9   -UNDEBUG  -fno-exceptions -fno-rtti -MD -MT lib/IR/CMakeFiles/LLVMCore.dir/Operator.cpp.o -MF lib/IR/CMakeFiles/LLVMCore.dir/Operator.cpp.o.d -o lib/IR/CMakeFiles/LLVMCore.dir/Operator.cpp.o -c /Users/buildslave/jenkins/workspace/clang-stage1-cmake-RA-expensive/llvm/lib/IR/Operator.cpp
[278/4517] /Applications/Xcode.app/Contents/Developer/Toolchains/XcodeDefault.xctoolchain/usr/bin/c++  -DEXPENSIVE_CHECKS -DGTEST_HAS_RTTI=0 -D_DEBUG -D_GLIBCXX_DEBUG -D__STDC_CONSTANT_MACROS -D__STDC_FORMAT_MACROS -D__STDC_LIMIT_MACROS -Ilib/IR -I/Users/buildslave/jenkins/workspace/clang-stage1-cmake-RA-expensive/llvm/lib/IR -I/Applications/Xcode.app/Contents/Developer/Platforms/MacOSX.platform/Developer/SDKs/MacOSX10.13.sdk/usr/include/libxml2 -Iinclude -I/Users/buildslave/jenkins/workspace/clang-stage1-cmake-RA-expensive/llvm/include -fPIC -fvisibility-inlines-hidden -Werror=date-time -Werror=unguarded-availability-new -std=c++14 -Wall -Wextra -Wno-unused-parameter -Wwrite-strings -Wcast-qual -Wmissing-field-initializers -pedantic -Wno-long-long -Wimplicit-fallthrough -Wcovered-switch-default -Wno-noexcept-type -Wnon-virtual-dtor -Wdelete-non-virtual-dtor -Wstring-conversion -fdiagnostics-color -O3  -isysroot /Applications/Xcode.app/Contents/Developer/Platforms/MacOSX.platform/Developer/SDKs/MacOSX10.13.sdk -mmacosx-version-min=10.9   -UNDEBUG  -fno-exceptions -fno-rtti -MD -MT lib/IR/CMakeFiles/LLVMCore.dir/Dominators.cpp.o -MF lib/IR/CMakeFiles/LLVMCore.dir/Dominators.cpp.o.d -o lib/IR/CMakeFiles/LLVMCore.dir/Dominators.cpp.o -c /Users/buildslave/jenkins/workspace/clang-stage1-cmake-RA-expensive/llvm/lib/IR/Dominators.cpp
[279/4517] /Applications/Xcode.app/Contents/Developer/Toolchains/XcodeDefault.xctoolchain/usr/bin/c++  -DEXPENSIVE_CHECKS -DGTEST_HAS_RTTI=0 -D_DEBUG -D_GLIBCXX_DEBUG -D__STDC_CONSTANT_MACROS -D__STDC_FORMAT_MACROS -D__STDC_LIMIT_MACROS -Ilib/IR -I/Users/buildslave/jenkins/workspace/clang-stage1-cmake-RA-expensive/llvm/lib/IR -I/Applications/Xcode.app/Contents/Developer/Platforms/MacOSX.platform/Developer/SDKs/MacOSX10.13.sdk/usr/include/libxml2 -Iinclude -I/Users/buildslave/jenkins/workspace/clang-stage1-cmake-RA-expensive/llvm/include -fPIC -fvisibility-inlines-hidden -Werror=date-time -Werror=unguarded-availability-new -std=c++14 -Wall -Wextra -Wno-unused-parameter -Wwrite-strings -Wcast-qual -Wmissing-field-initializers -pedantic -Wno-long-long -Wimplicit-fallthrough -Wcovered-switch-default -Wno-noexcept-type -Wnon-virtual-dtor -Wdelete-non-virtual-dtor -Wstring-conversion -fdiagnostics-color -O3  -isysroot /Applications/Xcode.app/Contents/Developer/Platforms/MacOSX.platform/Developer/SDKs/MacOSX10.13.sdk -mmacosx-version-min=10.9   -UNDEBUG  -fno-exceptions -fno-rtti -MD -MT lib/IR/CMakeFiles/LLVMCore.dir/Module.cpp.o -MF lib/IR/CMakeFiles/LLVMCore.dir/Module.cpp.o.d -o lib/IR/CMakeFiles/LLVMCore.dir/Module.cpp.o -c /Users/buildslave/jenkins/workspace/clang-stage1-cmake-RA-expensive/llvm/lib/IR/Module.cpp
[280/4517] /Applications/Xcode.app/Contents/Developer/Toolchains/XcodeDefault.xctoolchain/usr/bin/c++  -DEXPENSIVE_CHECKS -DGTEST_HAS_RTTI=0 -D_DEBUG -D_GLIBCXX_DEBUG -D__STDC_CONSTANT_MACROS -D__STDC_FORMAT_MACROS -D__STDC_LIMIT_MACROS -Ilib/IR -I/Users/buildslave/jenkins/workspace/clang-stage1-cmake-RA-expensive/llvm/lib/IR -I/Applications/Xcode.app/Contents/Developer/Platforms/MacOSX.platform/Developer/SDKs/MacOSX10.13.sdk/usr/include/libxml2 -Iinclude -I/Users/buildslave/jenkins/workspace/clang-stage1-cmake-RA-expensive/llvm/include -fPIC -fvisibility-inlines-hidden -Werror=date-time -Werror=unguarded-availability-new -std=c++14 -Wall -Wextra -Wno-unused-parameter -Wwrite-strings -Wcast-qual -Wmissing-field-initializers -pedantic -Wno-long-long -Wimplicit-fallthrough -Wcovered-switch-default -Wno-noexcept-type -Wnon-virtual-dtor -Wdelete-non-virtual-dtor -Wstring-conversion -fdiagnostics-color -O3  -isysroot /Applications/Xcode.app/Contents/Developer/Platforms/MacOSX.platform/Developer/SDKs/MacOSX10.13.sdk -mmacosx-version-min=10.9   -UNDEBUG  -fno-exceptions -fno-rtti -MD -MT lib/IR/CMakeFiles/LLVMCore.dir/Pass.cpp.o -MF lib/IR/CMakeFiles/LLVMCore.dir/Pass.cpp.o.d -o lib/IR/CMakeFiles/LLVMCore.dir/Pass.cpp.o -c /Users/buildslave/jenkins/workspace/clang-stage1-cmake-RA-expensive/llvm/lib/IR/Pass.cpp
[281/4517] /Applications/Xcode.app/Contents/Developer/Toolchains/XcodeDefault.xctoolchain/usr/bin/c++  -DEXPENSIVE_CHECKS -DGTEST_HAS_RTTI=0 -D_DEBUG -D_GLIBCXX_DEBUG -D__STDC_CONSTANT_MACROS -D__STDC_FORMAT_MACROS -D__STDC_LIMIT_MACROS -Ilib/IR -I/Users/buildslave/jenkins/workspace/clang-stage1-cmake-RA-expensive/llvm/lib/IR -I/Applications/Xcode.app/Contents/Developer/Platforms/MacOSX.platform/Developer/SDKs/MacOSX10.13.sdk/usr/include/libxml2 -Iinclude -I/Users/buildslave/jenkins/workspace/clang-stage1-cmake-RA-expensive/llvm/include -fPIC -fvisibility-inlines-hidden -Werror=date-time -Werror=unguarded-availability-new -std=c++14 -Wall -Wextra -Wno-unused-parameter -Wwrite-strings -Wcast-qual -Wmissing-field-initializers -pedantic -Wno-long-long -Wimplicit-fallthrough -Wcovered-switch-default -Wno-noexcept-type -Wnon-virtual-dtor -Wdelete-non-virtual-dtor -Wstring-conversion -fdiagnostics-color -O3  -isysroot /Applications/Xcode.app/Contents/Developer/Platforms/MacOSX.platform/Developer/SDKs/MacOSX10.13.sdk -mmacosx-version-min=10.9   -UNDEBUG  -fno-exceptions -fno-rtti -MD -MT lib/IR/CMakeFiles/LLVMCore.dir/PassInstrumentation.cpp.o -MF lib/IR/CMakeFiles/LLVMCore.dir/PassInstrumentation.cpp.o.d -o lib/IR/CMakeFiles/LLVMCore.dir/PassInstrumentation.cpp.o -c /Users/buildslave/jenkins/workspace/clang-stage1-cmake-RA-expensive/llvm/lib/IR/PassInstrumentation.cpp
[282/4517] /Applications/Xcode.app/Contents/Developer/Toolchains/XcodeDefault.xctoolchain/usr/bin/c++  -DEXPENSIVE_CHECKS -DGTEST_HAS_RTTI=0 -D_DEBUG -D_GLIBCXX_DEBUG -D__STDC_CONSTANT_MACROS -D__STDC_FORMAT_MACROS -D__STDC_LIMIT_MACROS -Ilib/IR -I/Users/buildslave/jenkins/workspace/clang-stage1-cmake-RA-expensive/llvm/lib/IR -I/Applications/Xcode.app/Contents/Developer/Platforms/MacOSX.platform/Developer/SDKs/MacOSX10.13.sdk/usr/include/libxml2 -Iinclude -I/Users/buildslave/jenkins/workspace/clang-stage1-cmake-RA-expensive/llvm/include -fPIC -fvisibility-inlines-hidden -Werror=date-time -Werror=unguarded-availability-new -std=c++14 -Wall -Wextra -Wno-unused-parameter -Wwrite-strings -Wcast-qual -Wmissing-field-initializers -pedantic -Wno-long-long -Wimplicit-fallthrough -Wcovered-switch-default -Wno-noexcept-type -Wnon-virtual-dtor -Wdelete-non-virtual-dtor -Wstring-conversion -fdiagnostics-color -O3  -isysroot /Applications/Xcode.app/Contents/Developer/Platforms/MacOSX.platform/Developer/SDKs/MacOSX10.13.sdk -mmacosx-version-min=10.9   -UNDEBUG  -fno-exceptions -fno-rtti -MD -MT lib/IR/CMakeFiles/LLVMCore.dir/PassRegistry.cpp.o -MF lib/IR/CMakeFiles/LLVMCore.dir/PassRegistry.cpp.o.d -o lib/IR/CMakeFiles/LLVMCore.dir/PassRegistry.cpp.o -c /Users/buildslave/jenkins/workspace/clang-stage1-cmake-RA-expensive/llvm/lib/IR/PassRegistry.cpp
[283/4517] /Applications/Xcode.app/Contents/Developer/Toolchains/XcodeDefault.xctoolchain/usr/bin/c++  -DEXPENSIVE_CHECKS -DGTEST_HAS_RTTI=0 -D_DEBUG -D_GLIBCXX_DEBUG -D__STDC_CONSTANT_MACROS -D__STDC_FORMAT_MACROS -D__STDC_LIMIT_MACROS -Ilib/IR -I/Users/buildslave/jenkins/workspace/clang-stage1-cmake-RA-expensive/llvm/lib/IR -I/Applications/Xcode.app/Contents/Developer/Platforms/MacOSX.platform/Developer/SDKs/MacOSX10.13.sdk/usr/include/libxml2 -Iinclude -I/Users/buildslave/jenkins/workspace/clang-stage1-cmake-RA-expensive/llvm/include -fPIC -fvisibility-inlines-hidden -Werror=date-time -Werror=unguarded-availability-new -std=c++14 -Wall -Wextra -Wno-unused-parameter -Wwrite-strings -Wcast-qual -Wmissing-field-initializers -pedantic -Wno-long-long -Wimplicit-fallthrough -Wcovered-switch-default -Wno-noexcept-type -Wnon-virtual-dtor -Wdelete-non-virtual-dtor -Wstring-conversion -fdiagnostics-color -O3  -isysroot /Applications/Xcode.app/Contents/Developer/Platforms/MacOSX.platform/Developer/SDKs/MacOSX10.13.sdk -mmacosx-version-min=10.9   -UNDEBUG  -fno-exceptions -fno-rtti -MD -MT lib/IR/CMakeFiles/LLVMCore.dir/ModuleSummaryIndex.cpp.o -MF lib/IR/CMakeFiles/LLVMCore.dir/ModuleSummaryIndex.cpp.o.d -o lib/IR/CMakeFiles/LLVMCore.dir/ModuleSummaryIndex.cpp.o -c /Users/buildslave/jenkins/workspace/clang-stage1-cmake-RA-expensive/llvm/lib/IR/ModuleSummaryIndex.cpp
[284/4517] /Applications/Xcode.app/Contents/Developer/Toolchains/XcodeDefault.xctoolchain/usr/bin/c++  -DEXPENSIVE_CHECKS -DGTEST_HAS_RTTI=0 -D_DEBUG -D_GLIBCXX_DEBUG -D__STDC_CONSTANT_MACROS -D__STDC_FORMAT_MACROS -D__STDC_LIMIT_MACROS -Ilib/IR -I/Users/buildslave/jenkins/workspace/clang-stage1-cmake-RA-expensive/llvm/lib/IR -I/Applications/Xcode.app/Contents/Developer/Platforms/MacOSX.platform/Developer/SDKs/MacOSX10.13.sdk/usr/include/libxml2 -Iinclude -I/Users/buildslave/jenkins/workspace/clang-stage1-cmake-RA-expensive/llvm/include -fPIC -fvisibility-inlines-hidden -Werror=date-time -Werror=unguarded-availability-new -std=c++14 -Wall -Wextra -Wno-unused-parameter -Wwrite-strings -Wcast-qual -Wmissing-field-initializers -pedantic -Wno-long-long -Wimplicit-fallthrough -Wcovered-switch-default -Wno-noexcept-type -Wnon-virtual-dtor -Wdelete-non-virtual-dtor -Wstring-conversion -fdiagnostics-color -O3  -isysroot /Applications/Xcode.app/Contents/Developer/Platforms/MacOSX.platform/Developer/SDKs/MacOSX10.13.sdk -mmacosx-version-min=10.9   -UNDEBUG  -fno-exceptions -fno-rtti -MD -MT lib/IR/CMakeFiles/LLVMCore.dir/LegacyPassManager.cpp.o -MF lib/IR/CMakeFiles/LLVMCore.dir/LegacyPassManager.cpp.o.d -o lib/IR/CMakeFiles/LLVMCore.dir/LegacyPassManager.cpp.o -c /Users/buildslave/jenkins/workspace/clang-stage1-cmake-RA-expensive/llvm/lib/IR/LegacyPassManager.cpp
[285/4517] /Applications/Xcode.app/Contents/Developer/Toolchains/XcodeDefault.xctoolchain/usr/bin/c++  -DEXPENSIVE_CHECKS -DGTEST_HAS_RTTI=0 -D_DEBUG -D_GLIBCXX_DEBUG -D__STDC_CONSTANT_MACROS -D__STDC_FORMAT_MACROS -D__STDC_LIMIT_MACROS -Ilib/IR -I/Users/buildslave/jenkins/workspace/clang-stage1-cmake-RA-expensive/llvm/lib/IR -I/Applications/Xcode.app/Contents/Developer/Platforms/MacOSX.platform/Developer/SDKs/MacOSX10.13.sdk/usr/include/libxml2 -Iinclude -I/Users/buildslave/jenkins/workspace/clang-stage1-cmake-RA-expensive/llvm/include -fPIC -fvisibility-inlines-hidden -Werror=date-time -Werror=unguarded-availability-new -std=c++14 -Wall -Wextra -Wno-unused-parameter -Wwrite-strings -Wcast-qual -Wmissing-field-initializers -pedantic -Wno-long-long -Wimplicit-fallthrough -Wcovered-switch-default -Wno-noexcept-type -Wnon-virtual-dtor -Wdelete-non-virtual-dtor -Wstring-conversion -fdiagnostics-color -O3  -isysroot /Applications/Xcode.app/Contents/Developer/Platforms/MacOSX.platform/Developer/SDKs/MacOSX10.13.sdk -mmacosx-version-min=10.9   -UNDEBUG  -fno-exceptions -fno-rtti -MD -MT lib/IR/CMakeFiles/LLVMCore.dir/PassTimingInfo.cpp.o -MF lib/IR/CMakeFiles/LLVMCore.dir/PassTimingInfo.cpp.o.d -o lib/IR/CMakeFiles/LLVMCore.dir/PassTimingInfo.cpp.o -c /Users/buildslave/jenkins/workspace/clang-stage1-cmake-RA-expensive/llvm/lib/IR/PassTimingInfo.cpp
[286/4517] /Applications/Xcode.app/Contents/Developer/Toolchains/XcodeDefault.xctoolchain/usr/bin/c++  -DEXPENSIVE_CHECKS -DGTEST_HAS_RTTI=0 -D_DEBUG -D_GLIBCXX_DEBUG -D__STDC_CONSTANT_MACROS -D__STDC_FORMAT_MACROS -D__STDC_LIMIT_MACROS -Ilib/IR -I/Users/buildslave/jenkins/workspace/clang-stage1-cmake-RA-expensive/llvm/lib/IR -I/Applications/Xcode.app/Contents/Developer/Platforms/MacOSX.platform/Developer/SDKs/MacOSX10.13.sdk/usr/include/libxml2 -Iinclude -I/Users/buildslave/jenkins/workspace/clang-stage1-cmake-RA-expensive/llvm/include -fPIC -fvisibility-inlines-hidden -Werror=date-time -Werror=unguarded-availability-new -std=c++14 -Wall -Wextra -Wno-unused-parameter -Wwrite-strings -Wcast-qual -Wmissing-field-initializers -pedantic -Wno-long-long -Wimplicit-fallthrough -Wcovered-switch-default -Wno-noexcept-type -Wnon-virtual-dtor -Wdelete-non-virtual-dtor -Wstring-conversion -fdiagnostics-color -O3  -isysroot /Applications/Xcode.app/Contents/Developer/Platforms/MacOSX.platform/Developer/SDKs/MacOSX10.13.sdk -mmacosx-version-min=10.9   -UNDEBUG  -fno-exceptions -fno-rtti -MD -MT lib/IR/CMakeFiles/LLVMCore.dir/ProfileSummary.cpp.o -MF lib/IR/CMakeFiles/LLVMCore.dir/ProfileSummary.cpp.o.d -o lib/IR/CMakeFiles/LLVMCore.dir/ProfileSummary.cpp.o -c /Users/buildslave/jenkins/workspace/clang-stage1-cmake-RA-expensive/llvm/lib/IR/ProfileSummary.cpp
[287/4517] /Applications/Xcode.app/Contents/Developer/Toolchains/XcodeDefault.xctoolchain/usr/bin/c++  -DEXPENSIVE_CHECKS -DGTEST_HAS_RTTI=0 -D_DEBUG -D_GLIBCXX_DEBUG -D__STDC_CONSTANT_MACROS -D__STDC_FORMAT_MACROS -D__STDC_LIMIT_MACROS -Ilib/IR -I/Users/buildslave/jenkins/workspace/clang-stage1-cmake-RA-expensive/llvm/lib/IR -I/Applications/Xcode.app/Contents/Developer/Platforms/MacOSX.platform/Developer/SDKs/MacOSX10.13.sdk/usr/include/libxml2 -Iinclude -I/Users/buildslave/jenkins/workspace/clang-stage1-cmake-RA-expensive/llvm/include -fPIC -fvisibility-inlines-hidden -Werror=date-time -Werror=unguarded-availability-new -std=c++14 -Wall -Wextra -Wno-unused-parameter -Wwrite-strings -Wcast-qual -Wmissing-field-initializers -pedantic -Wno-long-long -Wimplicit-fallthrough -Wcovered-switch-default -Wno-noexcept-type -Wnon-virtual-dtor -Wdelete-non-virtual-dtor -Wstring-conversion -fdiagnostics-color -O3  -isysroot /Applications/Xcode.app/Contents/Developer/Platforms/MacOSX.platform/Developer/SDKs/MacOSX10.13.sdk -mmacosx-version-min=10.9   -UNDEBUG  -fno-exceptions -fno-rtti -MD -MT lib/IR/CMakeFiles/LLVMCore.dir/LLVMContextImpl.cpp.o -MF lib/IR/CMakeFiles/LLVMCore.dir/LLVMContextImpl.cpp.o.d -o lib/IR/CMakeFiles/LLVMCore.dir/LLVMContextImpl.cpp.o -c /Users/buildslave/jenkins/workspace/clang-stage1-cmake-RA-expensive/llvm/lib/IR/LLVMContextImpl.cpp
[288/4517] /Applications/Xcode.app/Contents/Developer/Toolchains/XcodeDefault.xctoolchain/usr/bin/c++  -DEXPENSIVE_CHECKS -DGTEST_HAS_RTTI=0 -D_DEBUG -D_GLIBCXX_DEBUG -D__STDC_CONSTANT_MACROS -D__STDC_FORMAT_MACROS -D__STDC_LIMIT_MACROS -Ilib/IR -I/Users/buildslave/jenkins/workspace/clang-stage1-cmake-RA-expensive/llvm/lib/IR -I/Applications/Xcode.app/Contents/Developer/Platforms/MacOSX.platform/Developer/SDKs/MacOSX10.13.sdk/usr/include/libxml2 -Iinclude -I/Users/buildslave/jenkins/workspace/clang-stage1-cmake-RA-expensive/llvm/include -fPIC -fvisibility-inlines-hidden -Werror=date-time -Werror=unguarded-availability-new -std=c++14 -Wall -Wextra -Wno-unused-parameter -Wwrite-strings -Wcast-qual -Wmissing-field-initializers -pedantic -Wno-long-long -Wimplicit-fallthrough -Wcovered-switch-default -Wno-noexcept-type -Wnon-virtual-dtor -Wdelete-non-virtual-dtor -Wstring-conversion -fdiagnostics-color -O3  -isysroot /Applications/Xcode.app/Contents/Developer/Platforms/MacOSX.platform/Developer/SDKs/MacOSX10.13.sdk -mmacosx-version-min=10.9   -UNDEBUG  -fno-exceptions -fno-rtti -MD -MT lib/IR/CMakeFiles/LLVMCore.dir/Use.cpp.o -MF lib/IR/CMakeFiles/LLVMCore.dir/Use.cpp.o.d -o lib/IR/CMakeFiles/LLVMCore.dir/Use.cpp.o -c /Users/buildslave/jenkins/workspace/clang-stage1-cmake-RA-expensive/llvm/lib/IR/Use.cpp
[289/4517] /Applications/Xcode.app/Contents/Developer/Toolchains/XcodeDefault.xctoolchain/usr/bin/c++  -DEXPENSIVE_CHECKS -DGTEST_HAS_RTTI=0 -D_DEBUG -D_GLIBCXX_DEBUG -D__STDC_CONSTANT_MACROS -D__STDC_FORMAT_MACROS -D__STDC_LIMIT_MACROS -Ilib/IR -I/Users/buildslave/jenkins/workspace/clang-stage1-cmake-RA-expensive/llvm/lib/IR -I/Applications/Xcode.app/Contents/Developer/Platforms/MacOSX.platform/Developer/SDKs/MacOSX10.13.sdk/usr/include/libxml2 -Iinclude -I/Users/buildslave/jenkins/workspace/clang-stage1-cmake-RA-expensive/llvm/include -fPIC -fvisibility-inlines-hidden -Werror=date-time -Werror=unguarded-availability-new -std=c++14 -Wall -Wextra -Wno-unused-parameter -Wwrite-strings -Wcast-qual -Wmissing-field-initializers -pedantic -Wno-long-long -Wimplicit-fallthrough -Wcovered-switch-default -Wno-noexcept-type -Wnon-virtual-dtor -Wdelete-non-virtual-dtor -Wstring-conversion -fdiagnostics-color -O3  -isysroot /Applications/Xcode.app/Contents/Developer/Platforms/MacOSX.platform/Developer/SDKs/MacOSX10.13.sdk -mmacosx-version-min=10.9   -UNDEBUG  -fno-exceptions -fno-rtti -MD -MT lib/IR/CMakeFiles/LLVMCore.dir/RemarkStreamer.cpp.o -MF lib/IR/CMakeFiles/LLVMCore.dir/RemarkStreamer.cpp.o.d -o lib/IR/CMakeFiles/LLVMCore.dir/RemarkStreamer.cpp.o -c /Users/buildslave/jenkins/workspace/clang-stage1-cmake-RA-expensive/llvm/lib/IR/RemarkStreamer.cpp
[290/4517] /Applications/Xcode.app/Contents/Developer/Toolchains/XcodeDefault.xctoolchain/usr/bin/c++  -DEXPENSIVE_CHECKS -DGTEST_HAS_RTTI=0 -D_DEBUG -D_GLIBCXX_DEBUG -D__STDC_CONSTANT_MACROS -D__STDC_FORMAT_MACROS -D__STDC_LIMIT_MACROS -Ilib/IR -I/Users/buildslave/jenkins/workspace/clang-stage1-cmake-RA-expensive/llvm/lib/IR -I/Applications/Xcode.app/Contents/Developer/Platforms/MacOSX.platform/Developer/SDKs/MacOSX10.13.sdk/usr/include/libxml2 -Iinclude -I/Users/buildslave/jenkins/workspace/clang-stage1-cmake-RA-expensive/llvm/include -fPIC -fvisibility-inlines-hidden -Werror=date-time -Werror=unguarded-availability-new -std=c++14 -Wall -Wextra -Wno-unused-parameter -Wwrite-strings -Wcast-qual -Wmissing-field-initializers -pedantic -Wno-long-long -Wimplicit-fallthrough -Wcovered-switch-default -Wno-noexcept-type -Wnon-virtual-dtor -Wdelete-non-virtual-dtor -Wstring-conversion -fdiagnostics-color -O3  -isysroot /Applications/Xcode.app/Contents/Developer/Platforms/MacOSX.platform/Developer/SDKs/MacOSX10.13.sdk -mmacosx-version-min=10.9   -UNDEBUG  -fno-exceptions -fno-rtti -MD -MT lib/IR/CMakeFiles/LLVMCore.dir/Statepoint.cpp.o -MF lib/IR/CMakeFiles/LLVMCore.dir/Statepoint.cpp.o.d -o lib/IR/CMakeFiles/LLVMCore.dir/Statepoint.cpp.o -c /Users/buildslave/jenkins/workspace/clang-stage1-cmake-RA-expensive/llvm/lib/IR/Statepoint.cpp
[291/4517] /Applications/Xcode.app/Contents/Developer/Toolchains/XcodeDefault.xctoolchain/usr/bin/c++  -DEXPENSIVE_CHECKS -DGTEST_HAS_RTTI=0 -D_DEBUG -D_GLIBCXX_DEBUG -D__STDC_CONSTANT_MACROS -D__STDC_FORMAT_MACROS -D__STDC_LIMIT_MACROS -Ilib/IR -I/Users/buildslave/jenkins/workspace/clang-stage1-cmake-RA-expensive/llvm/lib/IR -I/Applications/Xcode.app/Contents/Developer/Platforms/MacOSX.platform/Developer/SDKs/MacOSX10.13.sdk/usr/include/libxml2 -Iinclude -I/Users/buildslave/jenkins/workspace/clang-stage1-cmake-RA-expensive/llvm/include -fPIC -fvisibility-inlines-hidden -Werror=date-time -Werror=unguarded-availability-new -std=c++14 -Wall -Wextra -Wno-unused-parameter -Wwrite-strings -Wcast-qual -Wmissing-field-initializers -pedantic -Wno-long-long -Wimplicit-fallthrough -Wcovered-switch-default -Wno-noexcept-type -Wnon-virtual-dtor -Wdelete-non-virtual-dtor -Wstring-conversion -fdiagnostics-color -O3  -isysroot /Applications/Xcode.app/Contents/Developer/Platforms/MacOSX.platform/Developer/SDKs/MacOSX10.13.sdk -mmacosx-version-min=10.9   -UNDEBUG  -fno-exceptions -fno-rtti -MD -MT lib/IR/CMakeFiles/LLVMCore.dir/User.cpp.o -MF lib/IR/CMakeFiles/LLVMCore.dir/User.cpp.o.d -o lib/IR/CMakeFiles/LLVMCore.dir/User.cpp.o -c /Users/buildslave/jenkins/workspace/clang-stage1-cmake-RA-expensive/llvm/lib/IR/User.cpp
[292/4517] /Applications/Xcode.app/Contents/Developer/Toolchains/XcodeDefault.xctoolchain/usr/bin/c++  -DEXPENSIVE_CHECKS -DGTEST_HAS_RTTI=0 -D_DEBUG -D_GLIBCXX_DEBUG -D__STDC_CONSTANT_MACROS -D__STDC_FORMAT_MACROS -D__STDC_LIMIT_MACROS -Ilib/IR -I/Users/buildslave/jenkins/workspace/clang-stage1-cmake-RA-expensive/llvm/lib/IR -I/Applications/Xcode.app/Contents/Developer/Platforms/MacOSX.platform/Developer/SDKs/MacOSX10.13.sdk/usr/include/libxml2 -Iinclude -I/Users/buildslave/jenkins/workspace/clang-stage1-cmake-RA-expensive/llvm/include -fPIC -fvisibility-inlines-hidden -Werror=date-time -Werror=unguarded-availability-new -std=c++14 -Wall -Wextra -Wno-unused-parameter -Wwrite-strings -Wcast-qual -Wmissing-field-initializers -pedantic -Wno-long-long -Wimplicit-fallthrough -Wcovered-switch-default -Wno-noexcept-type -Wnon-virtual-dtor -Wdelete-non-virtual-dtor -Wstring-conversion -fdiagnostics-color -O3  -isysroot /Applications/Xcode.app/Contents/Developer/Platforms/MacOSX.platform/Developer/SDKs/MacOSX10.13.sdk -mmacosx-version-min=10.9   -UNDEBUG  -fno-exceptions -fno-rtti -MD -MT lib/IR/CMakeFiles/LLVMCore.dir/PassManager.cpp.o -MF lib/IR/CMakeFiles/LLVMCore.dir/PassManager.cpp.o.d -o lib/IR/CMakeFiles/LLVMCore.dir/PassManager.cpp.o -c /Users/buildslave/jenkins/workspace/clang-stage1-cmake-RA-expensive/llvm/lib/IR/PassManager.cpp
[293/4517] /Applications/Xcode.app/Contents/Developer/Toolchains/XcodeDefault.xctoolchain/usr/bin/c++  -DEXPENSIVE_CHECKS -DGTEST_HAS_RTTI=0 -D_DEBUG -D_GLIBCXX_DEBUG -D__STDC_CONSTANT_MACROS -D__STDC_FORMAT_MACROS -D__STDC_LIMIT_MACROS -Ilib/IR -I/Users/buildslave/jenkins/workspace/clang-stage1-cmake-RA-expensive/llvm/lib/IR -I/Applications/Xcode.app/Contents/Developer/Platforms/MacOSX.platform/Developer/SDKs/MacOSX10.13.sdk/usr/include/libxml2 -Iinclude -I/Users/buildslave/jenkins/workspace/clang-stage1-cmake-RA-expensive/llvm/include -fPIC -fvisibility-inlines-hidden -Werror=date-time -Werror=unguarded-availability-new -std=c++14 -Wall -Wextra -Wno-unused-parameter -Wwrite-strings -Wcast-qual -Wmissing-field-initializers -pedantic -Wno-long-long -Wimplicit-fallthrough -Wcovered-switch-default -Wno-noexcept-type -Wnon-virtual-dtor -Wdelete-non-virtual-dtor -Wstring-conversion -fdiagnostics-color -O3  -isysroot /Applications/Xcode.app/Contents/Developer/Platforms/MacOSX.platform/Developer/SDKs/MacOSX10.13.sdk -mmacosx-version-min=10.9   -UNDEBUG  -fno-exceptions -fno-rtti -MD -MT lib/IR/CMakeFiles/LLVMCore.dir/TypeFinder.cpp.o -MF lib/IR/CMakeFiles/LLVMCore.dir/TypeFinder.cpp.o.d -o lib/IR/CMakeFiles/LLVMCore.dir/TypeFinder.cpp.o -c /Users/buildslave/jenkins/workspace/clang-stage1-cmake-RA-expensive/llvm/lib/IR/TypeFinder.cpp
[294/4517] /Applications/Xcode.app/Contents/Developer/Toolchains/XcodeDefault.xctoolchain/usr/bin/c++  -DEXPENSIVE_CHECKS -DGTEST_HAS_RTTI=0 -D_DEBUG -D_GLIBCXX_DEBUG -D__STDC_CONSTANT_MACROS -D__STDC_FORMAT_MACROS -D__STDC_LIMIT_MACROS -Ilib/IR -I/Users/buildslave/jenkins/workspace/clang-stage1-cmake-RA-expensive/llvm/lib/IR -I/Applications/Xcode.app/Contents/Developer/Platforms/MacOSX.platform/Developer/SDKs/MacOSX10.13.sdk/usr/include/libxml2 -Iinclude -I/Users/buildslave/jenkins/workspace/clang-stage1-cmake-RA-expensive/llvm/include -fPIC -fvisibility-inlines-hidden -Werror=date-time -Werror=unguarded-availability-new -std=c++14 -Wall -Wextra -Wno-unused-parameter -Wwrite-strings -Wcast-qual -Wmissing-field-initializers -pedantic -Wno-long-long -Wimplicit-fallthrough -Wcovered-switch-default -Wno-noexcept-type -Wnon-virtual-dtor -Wdelete-non-virtual-dtor -Wstring-conversion -fdiagnostics-color -O3  -isysroot /Applications/Xcode.app/Contents/Developer/Platforms/MacOSX.platform/Developer/SDKs/MacOSX10.13.sdk -mmacosx-version-min=10.9   -UNDEBUG  -fno-exceptions -fno-rtti -MD -MT lib/IR/CMakeFiles/LLVMCore.dir/ValueSymbolTable.cpp.o -MF lib/IR/CMakeFiles/LLVMCore.dir/ValueSymbolTable.cpp.o.d -o lib/IR/CMakeFiles/LLVMCore.dir/ValueSymbolTable.cpp.o -c /Users/buildslave/jenkins/workspace/clang-stage1-cmake-RA-expensive/llvm/lib/IR/ValueSymbolTable.cpp
[295/4517] /Applications/Xcode.app/Contents/Developer/Toolchains/XcodeDefault.xctoolchain/usr/bin/c++  -DEXPENSIVE_CHECKS -DGTEST_HAS_RTTI=0 -D_DEBUG -D_GLIBCXX_DEBUG -D__STDC_CONSTANT_MACROS -D__STDC_FORMAT_MACROS -D__STDC_LIMIT_MACROS -Ilib/IR -I/Users/buildslave/jenkins/workspace/clang-stage1-cmake-RA-expensive/llvm/lib/IR -I/Applications/Xcode.app/Contents/Developer/Platforms/MacOSX.platform/Developer/SDKs/MacOSX10.13.sdk/usr/include/libxml2 -Iinclude -I/Users/buildslave/jenkins/workspace/clang-stage1-cmake-RA-expensive/llvm/include -fPIC -fvisibility-inlines-hidden -Werror=date-time -Werror=unguarded-availability-new -std=c++14 -Wall -Wextra -Wno-unused-parameter -Wwrite-strings -Wcast-qual -Wmissing-field-initializers -pedantic -Wno-long-long -Wimplicit-fallthrough -Wcovered-switch-default -Wno-noexcept-type -Wnon-virtual-dtor -Wdelete-non-virtual-dtor -Wstring-conversion -fdiagnostics-color -O3  -isysroot /Applications/Xcode.app/Contents/Developer/Platforms/MacOSX.platform/Developer/SDKs/MacOSX10.13.sdk -mmacosx-version-min=10.9   -UNDEBUG  -fno-exceptions -fno-rtti -MD -MT lib/IR/CMakeFiles/LLVMCore.dir/SafepointIRVerifier.cpp.o -MF lib/IR/CMakeFiles/LLVMCore.dir/SafepointIRVerifier.cpp.o.d -o lib/IR/CMakeFiles/LLVMCore.dir/SafepointIRVerifier.cpp.o -c /Users/buildslave/jenkins/workspace/clang-stage1-cmake-RA-expensive/llvm/lib/IR/SafepointIRVerifier.cpp
[296/4517] /Applications/Xcode.app/Contents/Developer/Toolchains/XcodeDefault.xctoolchain/usr/bin/c++  -DEXPENSIVE_CHECKS -DGTEST_HAS_RTTI=0 -D_DEBUG -D_GLIBCXX_DEBUG -D__STDC_CONSTANT_MACROS -D__STDC_FORMAT_MACROS -D__STDC_LIMIT_MACROS -Ilib/IR -I/Users/buildslave/jenkins/workspace/clang-stage1-cmake-RA-expensive/llvm/lib/IR -I/Applications/Xcode.app/Contents/Developer/Platforms/MacOSX.platform/Developer/SDKs/MacOSX10.13.sdk/usr/include/libxml2 -Iinclude -I/Users/buildslave/jenkins/workspace/clang-stage1-cmake-RA-expensive/llvm/include -fPIC -fvisibility-inlines-hidden -Werror=date-time -Werror=unguarded-availability-new -std=c++14 -Wall -Wextra -Wno-unused-parameter -Wwrite-strings -Wcast-qual -Wmissing-field-initializers -pedantic -Wno-long-long -Wimplicit-fallthrough -Wcovered-switch-default -Wno-noexcept-type -Wnon-virtual-dtor -Wdelete-non-virtual-dtor -Wstring-conversion -fdiagnostics-color -O3  -isysroot /Applications/Xcode.app/Contents/Developer/Platforms/MacOSX.platform/Developer/SDKs/MacOSX10.13.sdk -mmacosx-version-min=10.9   -UNDEBUG  -fno-exceptions -fno-rtti -MD -MT lib/IR/CMakeFiles/LLVMCore.dir/Type.cpp.o -MF lib/IR/CMakeFiles/LLVMCore.dir/Type.cpp.o.d -o lib/IR/CMakeFiles/LLVMCore.dir/Type.cpp.o -c /Users/buildslave/jenkins/workspace/clang-stage1-cmake-RA-expensive/llvm/lib/IR/Type.cpp
[297/4517] /Applications/Xcode.app/Contents/Developer/Toolchains/XcodeDefault.xctoolchain/usr/bin/c++  -DEXPENSIVE_CHECKS -DGTEST_HAS_RTTI=0 -D_DEBUG -D_GLIBCXX_DEBUG -D__STDC_CONSTANT_MACROS -D__STDC_FORMAT_MACROS -D__STDC_LIMIT_MACROS -Ilib/FuzzMutate -I/Users/buildslave/jenkins/workspace/clang-stage1-cmake-RA-expensive/llvm/lib/FuzzMutate -I/Applications/Xcode.app/Contents/Developer/Platforms/MacOSX.platform/Developer/SDKs/MacOSX10.13.sdk/usr/include/libxml2 -Iinclude -I/Users/buildslave/jenkins/workspace/clang-stage1-cmake-RA-expensive/llvm/include -fPIC -fvisibility-inlines-hidden -Werror=date-time -Werror=unguarded-availability-new -std=c++14 -Wall -Wextra -Wno-unused-parameter -Wwrite-strings -Wcast-qual -Wmissing-field-initializers -pedantic -Wno-long-long -Wimplicit-fallthrough -Wcovered-switch-default -Wno-noexcept-type -Wnon-virtual-dtor -Wdelete-non-virtual-dtor -Wstring-conversion -fdiagnostics-color -O3  -isysroot /Applications/Xcode.app/Contents/Developer/Platforms/MacOSX.platform/Developer/SDKs/MacOSX10.13.sdk -mmacosx-version-min=10.9   -UNDEBUG  -fno-exceptions -fno-rtti -MD -MT lib/FuzzMutate/CMakeFiles/LLVMFuzzMutate.dir/OpDescriptor.cpp.o -MF lib/FuzzMutate/CMakeFiles/LLVMFuzzMutate.dir/OpDescriptor.cpp.o.d -o lib/FuzzMutate/CMakeFiles/LLVMFuzzMutate.dir/OpDescriptor.cpp.o -c /Users/buildslave/jenkins/workspace/clang-stage1-cmake-RA-expensive/llvm/lib/FuzzMutate/OpDescriptor.cpp
[298/4517] /Applications/Xcode.app/Contents/Developer/Toolchains/XcodeDefault.xctoolchain/usr/bin/c++  -DEXPENSIVE_CHECKS -DGTEST_HAS_RTTI=0 -D_DEBUG -D_GLIBCXX_DEBUG -D__STDC_CONSTANT_MACROS -D__STDC_FORMAT_MACROS -D__STDC_LIMIT_MACROS -Ilib/FuzzMutate -I/Users/buildslave/jenkins/workspace/clang-stage1-cmake-RA-expensive/llvm/lib/FuzzMutate -I/Applications/Xcode.app/Contents/Developer/Platforms/MacOSX.platform/Developer/SDKs/MacOSX10.13.sdk/usr/include/libxml2 -Iinclude -I/Users/buildslave/jenkins/workspace/clang-stage1-cmake-RA-expensive/llvm/include -fPIC -fvisibility-inlines-hidden -Werror=date-time -Werror=unguarded-availability-new -std=c++14 -Wall -Wextra -Wno-unused-parameter -Wwrite-strings -Wcast-qual -Wmissing-field-initializers -pedantic -Wno-long-long -Wimplicit-fallthrough -Wcovered-switch-default -Wno-noexcept-type -Wnon-virtual-dtor -Wdelete-non-virtual-dtor -Wstring-conversion -fdiagnostics-color -O3  -isysroot /Applications/Xcode.app/Contents/Developer/Platforms/MacOSX.platform/Developer/SDKs/MacOSX10.13.sdk -mmacosx-version-min=10.9   -UNDEBUG  -fno-exceptions -fno-rtti -MD -MT lib/FuzzMutate/CMakeFiles/LLVMFuzzMutate.dir/FuzzerCLI.cpp.o -MF lib/FuzzMutate/CMakeFiles/LLVMFuzzMutate.dir/FuzzerCLI.cpp.o.d -o lib/FuzzMutate/CMakeFiles/LLVMFuzzMutate.dir/FuzzerCLI.cpp.o -c /Users/buildslave/jenkins/workspace/clang-stage1-cmake-RA-expensive/llvm/lib/FuzzMutate/FuzzerCLI.cpp
[299/4517] /Applications/Xcode.app/Contents/Developer/Toolchains/XcodeDefault.xctoolchain/usr/bin/c++  -DEXPENSIVE_CHECKS -DGTEST_HAS_RTTI=0 -D_DEBUG -D_GLIBCXX_DEBUG -D__STDC_CONSTANT_MACROS -D__STDC_FORMAT_MACROS -D__STDC_LIMIT_MACROS -Ilib/IR -I/Users/buildslave/jenkins/workspace/clang-stage1-cmake-RA-expensive/llvm/lib/IR -I/Applications/Xcode.app/Contents/Developer/Platforms/MacOSX.platform/Developer/SDKs/MacOSX10.13.sdk/usr/include/libxml2 -Iinclude -I/Users/buildslave/jenkins/workspace/clang-stage1-cmake-RA-expensive/llvm/include -fPIC -fvisibility-inlines-hidden -Werror=date-time -Werror=unguarded-availability-new -std=c++14 -Wall -Wextra -Wno-unused-parameter -Wwrite-strings -Wcast-qual -Wmissing-field-initializers -pedantic -Wno-long-long -Wimplicit-fallthrough -Wcovered-switch-default -Wno-noexcept-type -Wnon-virtual-dtor -Wdelete-non-virtual-dtor -Wstring-conversion -fdiagnostics-color -O3  -isysroot /Applications/Xcode.app/Contents/Developer/Platforms/MacOSX.platform/Developer/SDKs/MacOSX10.13.sdk -mmacosx-version-min=10.9   -UNDEBUG  -fno-exceptions -fno-rtti -MD -MT lib/IR/CMakeFiles/LLVMCore.dir/Value.cpp.o -MF lib/IR/CMakeFiles/LLVMCore.dir/Value.cpp.o.d -o lib/IR/CMakeFiles/LLVMCore.dir/Value.cpp.o -c /Users/buildslave/jenkins/workspace/clang-stage1-cmake-RA-expensive/llvm/lib/IR/Value.cpp
[300/4517] /Applications/Xcode.app/Contents/Developer/Toolchains/XcodeDefault.xctoolchain/usr/bin/c++  -DEXPENSIVE_CHECKS -DGTEST_HAS_RTTI=0 -D_DEBUG -D_GLIBCXX_DEBUG -D__STDC_CONSTANT_MACROS -D__STDC_FORMAT_MACROS -D__STDC_LIMIT_MACROS -Ilib/IR -I/Users/buildslave/jenkins/workspace/clang-stage1-cmake-RA-expensive/llvm/lib/IR -I/Applications/Xcode.app/Contents/Developer/Platforms/MacOSX.platform/Developer/SDKs/MacOSX10.13.sdk/usr/include/libxml2 -Iinclude -I/Users/buildslave/jenkins/workspace/clang-stage1-cmake-RA-expensive/llvm/include -fPIC -fvisibility-inlines-hidden -Werror=date-time -Werror=unguarded-availability-new -std=c++14 -Wall -Wextra -Wno-unused-parameter -Wwrite-strings -Wcast-qual -Wmissing-field-initializers -pedantic -Wno-long-long -Wimplicit-fallthrough -Wcovered-switch-default -Wno-noexcept-type -Wnon-virtual-dtor -Wdelete-non-virtual-dtor -Wstring-conversion -fdiagnostics-color -O3  -isysroot /Applications/Xcode.app/Contents/Developer/Platforms/MacOSX.platform/Developer/SDKs/MacOSX10.13.sdk -mmacosx-version-min=10.9   -UNDEBUG  -fno-exceptions -fno-rtti -MD -MT lib/IR/CMakeFiles/LLVMCore.dir/Metadata.cpp.o -MF lib/IR/CMakeFiles/LLVMCore.dir/Metadata.cpp.o.d -o lib/IR/CMakeFiles/LLVMCore.dir/Metadata.cpp.o -c /Users/buildslave/jenkins/workspace/clang-stage1-cmake-RA-expensive/llvm/lib/IR/Metadata.cpp
[301/4517] /Applications/Xcode.app/Contents/Developer/Toolchains/XcodeDefault.xctoolchain/usr/bin/c++  -DEXPENSIVE_CHECKS -DGTEST_HAS_RTTI=0 -D_DEBUG -D_GLIBCXX_DEBUG -D__STDC_CONSTANT_MACROS -D__STDC_FORMAT_MACROS -D__STDC_LIMIT_MACROS -Ilib/FuzzMutate -I/Users/buildslave/jenkins/workspace/clang-stage1-cmake-RA-expensive/llvm/lib/FuzzMutate -I/Applications/Xcode.app/Contents/Developer/Platforms/MacOSX.platform/Developer/SDKs/MacOSX10.13.sdk/usr/include/libxml2 -Iinclude -I/Users/buildslave/jenkins/workspace/clang-stage1-cmake-RA-expensive/llvm/include -fPIC -fvisibility-inlines-hidden -Werror=date-time -Werror=unguarded-availability-new -std=c++14 -Wall -Wextra -Wno-unused-parameter -Wwrite-strings -Wcast-qual -Wmissing-field-initializers -pedantic -Wno-long-long -Wimplicit-fallthrough -Wcovered-switch-default -Wno-noexcept-type -Wnon-virtual-dtor -Wdelete-non-virtual-dtor -Wstring-conversion -fdiagnostics-color -O3  -isysroot /Applications/Xcode.app/Contents/Developer/Platforms/MacOSX.platform/Developer/SDKs/MacOSX10.13.sdk -mmacosx-version-min=10.9   -UNDEBUG  -fno-exceptions -fno-rtti -MD -MT lib/FuzzMutate/CMakeFiles/LLVMFuzzMutate.dir/RandomIRBuilder.cpp.o -MF lib/FuzzMutate/CMakeFiles/LLVMFuzzMutate.dir/RandomIRBuilder.cpp.o.d -o lib/FuzzMutate/CMakeFiles/LLVMFuzzMutate.dir/RandomIRBuilder.cpp.o -c /Users/buildslave/jenkins/workspace/clang-stage1-cmake-RA-expensive/llvm/lib/FuzzMutate/RandomIRBuilder.cpp
[302/4517] /Applications/Xcode.app/Contents/Developer/Toolchains/XcodeDefault.xctoolchain/usr/bin/c++  -DEXPENSIVE_CHECKS -DGTEST_HAS_RTTI=0 -D_DEBUG -D_GLIBCXX_DEBUG -D__STDC_CONSTANT_MACROS -D__STDC_FORMAT_MACROS -D__STDC_LIMIT_MACROS -Ilib/FuzzMutate -I/Users/buildslave/jenkins/workspace/clang-stage1-cmake-RA-expensive/llvm/lib/FuzzMutate -I/Applications/Xcode.app/Contents/Developer/Platforms/MacOSX.platform/Developer/SDKs/MacOSX10.13.sdk/usr/include/libxml2 -Iinclude -I/Users/buildslave/jenkins/workspace/clang-stage1-cmake-RA-expensive/llvm/include -fPIC -fvisibility-inlines-hidden -Werror=date-time -Werror=unguarded-availability-new -std=c++14 -Wall -Wextra -Wno-unused-parameter -Wwrite-strings -Wcast-qual -Wmissing-field-initializers -pedantic -Wno-long-long -Wimplicit-fallthrough -Wcovered-switch-default -Wno-noexcept-type -Wnon-virtual-dtor -Wdelete-non-virtual-dtor -Wstring-conversion -fdiagnostics-color -O3  -isysroot /Applications/Xcode.app/Contents/Developer/Platforms/MacOSX.platform/Developer/SDKs/MacOSX10.13.sdk -mmacosx-version-min=10.9   -UNDEBUG  -fno-exceptions -fno-rtti -MD -MT lib/FuzzMutate/CMakeFiles/LLVMFuzzMutate.dir/IRMutator.cpp.o -MF lib/FuzzMutate/CMakeFiles/LLVMFuzzMutate.dir/IRMutator.cpp.o.d -o lib/FuzzMutate/CMakeFiles/LLVMFuzzMutate.dir/IRMutator.cpp.o -c /Users/buildslave/jenkins/workspace/clang-stage1-cmake-RA-expensive/llvm/lib/FuzzMutate/IRMutator.cpp
[303/4517] /Applications/Xcode.app/Contents/Developer/Toolchains/XcodeDefault.xctoolchain/usr/bin/c++  -DEXPENSIVE_CHECKS -DGTEST_HAS_RTTI=0 -D_DEBUG -D_GLIBCXX_DEBUG -D__STDC_CONSTANT_MACROS -D__STDC_FORMAT_MACROS -D__STDC_LIMIT_MACROS -Ilib/CodeGen -I/Users/buildslave/jenkins/workspace/clang-stage1-cmake-RA-expensive/llvm/lib/CodeGen -I/Applications/Xcode.app/Contents/Developer/Platforms/MacOSX.platform/Developer/SDKs/MacOSX10.13.sdk/usr/include/libxml2 -Iinclude -I/Users/buildslave/jenkins/workspace/clang-stage1-cmake-RA-expensive/llvm/include -fPIC -fvisibility-inlines-hidden -Werror=date-time -Werror=unguarded-availability-new -std=c++14 -Wall -Wextra -Wno-unused-parameter -Wwrite-strings -Wcast-qual -Wmissing-field-initializers -pedantic -Wno-long-long -Wimplicit-fallthrough -Wcovered-switch-default -Wno-noexcept-type -Wnon-virtual-dtor -Wdelete-non-virtual-dtor -Wstring-conversion -fdiagnostics-color -O3  -isysroot /Applications/Xcode.app/Contents/Developer/Platforms/MacOSX.platform/Developer/SDKs/MacOSX10.13.sdk -mmacosx-version-min=10.9   -UNDEBUG  -fno-exceptions -fno-rtti -MD -MT lib/CodeGen/CMakeFiles/LLVMCodeGen.dir/AllocationOrder.cpp.o -MF lib/CodeGen/CMakeFiles/LLVMCodeGen.dir/AllocationOrder.cpp.o.d -o lib/CodeGen/CMakeFiles/LLVMCodeGen.dir/AllocationOrder.cpp.o -c /Users/buildslave/jenkins/workspace/clang-stage1-cmake-RA-expensive/llvm/lib/CodeGen/AllocationOrder.cpp
[304/4517] /Applications/Xcode.app/Contents/Developer/Toolchains/XcodeDefault.xctoolchain/usr/bin/c++  -DEXPENSIVE_CHECKS -DGTEST_HAS_RTTI=0 -D_DEBUG -D_GLIBCXX_DEBUG -D__STDC_CONSTANT_MACROS -D__STDC_FORMAT_MACROS -D__STDC_LIMIT_MACROS -Ilib/IRReader -I/Users/buildslave/jenkins/workspace/clang-stage1-cmake-RA-expensive/llvm/lib/IRReader -I/Applications/Xcode.app/Contents/Developer/Platforms/MacOSX.platform/Developer/SDKs/MacOSX10.13.sdk/usr/include/libxml2 -Iinclude -I/Users/buildslave/jenkins/workspace/clang-stage1-cmake-RA-expensive/llvm/include -fPIC -fvisibility-inlines-hidden -Werror=date-time -Werror=unguarded-availability-new -std=c++14 -Wall -Wextra -Wno-unused-parameter -Wwrite-strings -Wcast-qual -Wmissing-field-initializers -pedantic -Wno-long-long -Wimplicit-fallthrough -Wcovered-switch-default -Wno-noexcept-type -Wnon-virtual-dtor -Wdelete-non-virtual-dtor -Wstring-conversion -fdiagnostics-color -O3  -isysroot /Applications/Xcode.app/Contents/Developer/Platforms/MacOSX.platform/Developer/SDKs/MacOSX10.13.sdk -mmacosx-version-min=10.9   -UNDEBUG  -fno-exceptions -fno-rtti -MD -MT lib/IRReader/CMakeFiles/LLVMIRReader.dir/IRReader.cpp.o -MF lib/IRReader/CMakeFiles/LLVMIRReader.dir/IRReader.cpp.o.d -o lib/IRReader/CMakeFiles/LLVMIRReader.dir/IRReader.cpp.o -c /Users/buildslave/jenkins/workspace/clang-stage1-cmake-RA-expensive/llvm/lib/IRReader/IRReader.cpp
[305/4517] : && "/Applications/Xcode.app/Contents/Developer/Toolchains/XcodeDefault.xctoolchain/usr/bin/libtool" -static -no_warning_for_no_symbols -o lib/libLLVMIRReader.a  lib/IRReader/CMakeFiles/LLVMIRReader.dir/IRReader.cpp.o && :
[306/4517] /Applications/Xcode.app/Contents/Developer/Toolchains/XcodeDefault.xctoolchain/usr/bin/c++  -DEXPENSIVE_CHECKS -DGTEST_HAS_RTTI=0 -D_DEBUG -D_GLIBCXX_DEBUG -D__STDC_CONSTANT_MACROS -D__STDC_FORMAT_MACROS -D__STDC_LIMIT_MACROS -Ilib/CodeGen -I/Users/buildslave/jenkins/workspace/clang-stage1-cmake-RA-expensive/llvm/lib/CodeGen -I/Applications/Xcode.app/Contents/Developer/Platforms/MacOSX.platform/Developer/SDKs/MacOSX10.13.sdk/usr/include/libxml2 -Iinclude -I/Users/buildslave/jenkins/workspace/clang-stage1-cmake-RA-expensive/llvm/include -fPIC -fvisibility-inlines-hidden -Werror=date-time -Werror=unguarded-availability-new -std=c++14 -Wall -Wextra -Wno-unused-parameter -Wwrite-strings -Wcast-qual -Wmissing-field-initializers -pedantic -Wno-long-long -Wimplicit-fallthrough -Wcovered-switch-default -Wno-noexcept-type -Wnon-virtual-dtor -Wdelete-non-virtual-dtor -Wstring-conversion -fdiagnostics-color -O3  -isysroot /Applications/Xcode.app/Contents/Developer/Platforms/MacOSX.platform/Developer/SDKs/MacOSX10.13.sdk -mmacosx-version-min=10.9   -UNDEBUG  -fno-exceptions -fno-rtti -MD -MT lib/CodeGen/CMakeFiles/LLVMCodeGen.dir/BuiltinGCs.cpp.o -MF lib/CodeGen/CMakeFiles/LLVMCodeGen.dir/BuiltinGCs.cpp.o.d -o lib/CodeGen/CMakeFiles/LLVMCodeGen.dir/BuiltinGCs.cpp.o -c /Users/buildslave/jenkins/workspace/clang-stage1-cmake-RA-expensive/llvm/lib/CodeGen/BuiltinGCs.cpp
[307/4517] /Applications/Xcode.app/Contents/Developer/Toolchains/XcodeDefault.xctoolchain/usr/bin/c++  -DEXPENSIVE_CHECKS -DGTEST_HAS_RTTI=0 -D_DEBUG -D_GLIBCXX_DEBUG -D__STDC_CONSTANT_MACROS -D__STDC_FORMAT_MACROS -D__STDC_LIMIT_MACROS -Ilib/FuzzMutate -I/Users/buildslave/jenkins/workspace/clang-stage1-cmake-RA-expensive/llvm/lib/FuzzMutate -I/Applications/Xcode.app/Contents/Developer/Platforms/MacOSX.platform/Developer/SDKs/MacOSX10.13.sdk/usr/include/libxml2 -Iinclude -I/Users/buildslave/jenkins/workspace/clang-stage1-cmake-RA-expensive/llvm/include -fPIC -fvisibility-inlines-hidden -Werror=date-time -Werror=unguarded-availability-new -std=c++14 -Wall -Wextra -Wno-unused-parameter -Wwrite-strings -Wcast-qual -Wmissing-field-initializers -pedantic -Wno-long-long -Wimplicit-fallthrough -Wcovered-switch-default -Wno-noexcept-type -Wnon-virtual-dtor -Wdelete-non-virtual-dtor -Wstring-conversion -fdiagnostics-color -O3  -isysroot /Applications/Xcode.app/Contents/Developer/Platforms/MacOSX.platform/Developer/SDKs/MacOSX10.13.sdk -mmacosx-version-min=10.9   -UNDEBUG  -fno-exceptions -fno-rtti -MD -MT lib/FuzzMutate/CMakeFiles/LLVMFuzzMutate.dir/Operations.cpp.o -MF lib/FuzzMutate/CMakeFiles/LLVMFuzzMutate.dir/Operations.cpp.o.d -o lib/FuzzMutate/CMakeFiles/LLVMFuzzMutate.dir/Operations.cpp.o -c /Users/buildslave/jenkins/workspace/clang-stage1-cmake-RA-expensive/llvm/lib/FuzzMutate/Operations.cpp
[308/4517] : && "/Applications/Xcode.app/Contents/Developer/Toolchains/XcodeDefault.xctoolchain/usr/bin/libtool" -static -no_warning_for_no_symbols -o lib/libLLVMFuzzMutate.a  lib/FuzzMutate/CMakeFiles/LLVMFuzzMutate.dir/FuzzerCLI.cpp.o lib/FuzzMutate/CMakeFiles/LLVMFuzzMutate.dir/IRMutator.cpp.o lib/FuzzMutate/CMakeFiles/LLVMFuzzMutate.dir/OpDescriptor.cpp.o lib/FuzzMutate/CMakeFiles/LLVMFuzzMutate.dir/Operations.cpp.o lib/FuzzMutate/CMakeFiles/LLVMFuzzMutate.dir/RandomIRBuilder.cpp.o && :
[309/4517] /Applications/Xcode.app/Contents/Developer/Toolchains/XcodeDefault.xctoolchain/usr/bin/c++  -DEXPENSIVE_CHECKS -DGTEST_HAS_RTTI=0 -D_DEBUG -D_GLIBCXX_DEBUG -D__STDC_CONSTANT_MACROS -D__STDC_FORMAT_MACROS -D__STDC_LIMIT_MACROS -Ilib/CodeGen -I/Users/buildslave/jenkins/workspace/clang-stage1-cmake-RA-expensive/llvm/lib/CodeGen -I/Applications/Xcode.app/Contents/Developer/Platforms/MacOSX.platform/Developer/SDKs/MacOSX10.13.sdk/usr/include/libxml2 -Iinclude -I/Users/buildslave/jenkins/workspace/clang-stage1-cmake-RA-expensive/llvm/include -fPIC -fvisibility-inlines-hidden -Werror=date-time -Werror=unguarded-availability-new -std=c++14 -Wall -Wextra -Wno-unused-parameter -Wwrite-strings -Wcast-qual -Wmissing-field-initializers -pedantic -Wno-long-long -Wimplicit-fallthrough -Wcovered-switch-default -Wno-noexcept-type -Wnon-virtual-dtor -Wdelete-non-virtual-dtor -Wstring-conversion -fdiagnostics-color -O3  -isysroot /Applications/Xcode.app/Contents/Developer/Platforms/MacOSX.platform/Developer/SDKs/MacOSX10.13.sdk -mmacosx-version-min=10.9   -UNDEBUG  -fno-exceptions -fno-rtti -MD -MT lib/CodeGen/CMakeFiles/LLVMCodeGen.dir/Analysis.cpp.o -MF lib/CodeGen/CMakeFiles/LLVMCodeGen.dir/Analysis.cpp.o.d -o lib/CodeGen/CMakeFiles/LLVMCodeGen.dir/Analysis.cpp.o -c /Users/buildslave/jenkins/workspace/clang-stage1-cmake-RA-expensive/llvm/lib/CodeGen/Analysis.cpp
[310/4517] /Applications/Xcode.app/Contents/Developer/Toolchains/XcodeDefault.xctoolchain/usr/bin/c++  -DEXPENSIVE_CHECKS -DGTEST_HAS_RTTI=0 -D_DEBUG -D_GLIBCXX_DEBUG -D__STDC_CONSTANT_MACROS -D__STDC_FORMAT_MACROS -D__STDC_LIMIT_MACROS -Ilib/CodeGen -I/Users/buildslave/jenkins/workspace/clang-stage1-cmake-RA-expensive/llvm/lib/CodeGen -I/Applications/Xcode.app/Contents/Developer/Platforms/MacOSX.platform/Developer/SDKs/MacOSX10.13.sdk/usr/include/libxml2 -Iinclude -I/Users/buildslave/jenkins/workspace/clang-stage1-cmake-RA-expensive/llvm/include -fPIC -fvisibility-inlines-hidden -Werror=date-time -Werror=unguarded-availability-new -std=c++14 -Wall -Wextra -Wno-unused-parameter -Wwrite-strings -Wcast-qual -Wmissing-field-initializers -pedantic -Wno-long-long -Wimplicit-fallthrough -Wcovered-switch-default -Wno-noexcept-type -Wnon-virtual-dtor -Wdelete-non-virtual-dtor -Wstring-conversion -fdiagnostics-color -O3  -isysroot /Applications/Xcode.app/Contents/Developer/Platforms/MacOSX.platform/Developer/SDKs/MacOSX10.13.sdk -mmacosx-version-min=10.9   -UNDEBUG  -fno-exceptions -fno-rtti -MD -MT lib/CodeGen/CMakeFiles/LLVMCodeGen.dir/AggressiveAntiDepBreaker.cpp.o -MF lib/CodeGen/CMakeFiles/LLVMCodeGen.dir/AggressiveAntiDepBreaker.cpp.o.d -o lib/CodeGen/CMakeFiles/LLVMCodeGen.dir/AggressiveAntiDepBreaker.cpp.o -c /Users/buildslave/jenkins/workspace/clang-stage1-cmake-RA-expensive/llvm/lib/CodeGen/AggressiveAntiDepBreaker.cpp
[311/4517] /Applications/Xcode.app/Contents/Developer/Toolchains/XcodeDefault.xctoolchain/usr/bin/c++  -DEXPENSIVE_CHECKS -DGTEST_HAS_RTTI=0 -D_DEBUG -D_GLIBCXX_DEBUG -D__STDC_CONSTANT_MACROS -D__STDC_FORMAT_MACROS -D__STDC_LIMIT_MACROS -Ilib/CodeGen -I/Users/buildslave/jenkins/workspace/clang-stage1-cmake-RA-expensive/llvm/lib/CodeGen -I/Applications/Xcode.app/Contents/Developer/Platforms/MacOSX.platform/Developer/SDKs/MacOSX10.13.sdk/usr/include/libxml2 -Iinclude -I/Users/buildslave/jenkins/workspace/clang-stage1-cmake-RA-expensive/llvm/include -fPIC -fvisibility-inlines-hidden -Werror=date-time -Werror=unguarded-availability-new -std=c++14 -Wall -Wextra -Wno-unused-parameter -Wwrite-strings -Wcast-qual -Wmissing-field-initializers -pedantic -Wno-long-long -Wimplicit-fallthrough -Wcovered-switch-default -Wno-noexcept-type -Wnon-virtual-dtor -Wdelete-non-virtual-dtor -Wstring-conversion -fdiagnostics-color -O3  -isysroot /Applications/Xcode.app/Contents/Developer/Platforms/MacOSX.platform/Developer/SDKs/MacOSX10.13.sdk -mmacosx-version-min=10.9   -UNDEBUG  -fno-exceptions -fno-rtti -MD -MT lib/CodeGen/CMakeFiles/LLVMCodeGen.dir/BreakFalseDeps.cpp.o -MF lib/CodeGen/CMakeFiles/LLVMCodeGen.dir/BreakFalseDeps.cpp.o.d -o lib/CodeGen/CMakeFiles/LLVMCodeGen.dir/BreakFalseDeps.cpp.o -c /Users/buildslave/jenkins/workspace/clang-stage1-cmake-RA-expensive/llvm/lib/CodeGen/BreakFalseDeps.cpp
[312/4517] /Applications/Xcode.app/Contents/Developer/Toolchains/XcodeDefault.xctoolchain/usr/bin/c++  -DEXPENSIVE_CHECKS -DGTEST_HAS_RTTI=0 -D_DEBUG -D_GLIBCXX_DEBUG -D__STDC_CONSTANT_MACROS -D__STDC_FORMAT_MACROS -D__STDC_LIMIT_MACROS -Ilib/CodeGen -I/Users/buildslave/jenkins/workspace/clang-stage1-cmake-RA-expensive/llvm/lib/CodeGen -I/Applications/Xcode.app/Contents/Developer/Platforms/MacOSX.platform/Developer/SDKs/MacOSX10.13.sdk/usr/include/libxml2 -Iinclude -I/Users/buildslave/jenkins/workspace/clang-stage1-cmake-RA-expensive/llvm/include -fPIC -fvisibility-inlines-hidden -Werror=date-time -Werror=unguarded-availability-new -std=c++14 -Wall -Wextra -Wno-unused-parameter -Wwrite-strings -Wcast-qual -Wmissing-field-initializers -pedantic -Wno-long-long -Wimplicit-fallthrough -Wcovered-switch-default -Wno-noexcept-type -Wnon-virtual-dtor -Wdelete-non-virtual-dtor -Wstring-conversion -fdiagnostics-color -O3  -isysroot /Applications/Xcode.app/Contents/Developer/Platforms/MacOSX.platform/Developer/SDKs/MacOSX10.13.sdk -mmacosx-version-min=10.9   -UNDEBUG  -fno-exceptions -fno-rtti -MD -MT lib/CodeGen/CMakeFiles/LLVMCodeGen.dir/BranchRelaxation.cpp.o -MF lib/CodeGen/CMakeFiles/LLVMCodeGen.dir/BranchRelaxation.cpp.o.d -o lib/CodeGen/CMakeFiles/LLVMCodeGen.dir/BranchRelaxation.cpp.o -c /Users/buildslave/jenkins/workspace/clang-stage1-cmake-RA-expensive/llvm/lib/CodeGen/BranchRelaxation.cpp
[313/4517] /Applications/Xcode.app/Contents/Developer/Toolchains/XcodeDefault.xctoolchain/usr/bin/c++  -DEXPENSIVE_CHECKS -DGTEST_HAS_RTTI=0 -D_DEBUG -D_GLIBCXX_DEBUG -D__STDC_CONSTANT_MACROS -D__STDC_FORMAT_MACROS -D__STDC_LIMIT_MACROS -Ilib/CodeGen -I/Users/buildslave/jenkins/workspace/clang-stage1-cmake-RA-expensive/llvm/lib/CodeGen -I/Applications/Xcode.app/Contents/Developer/Platforms/MacOSX.platform/Developer/SDKs/MacOSX10.13.sdk/usr/include/libxml2 -Iinclude -I/Users/buildslave/jenkins/workspace/clang-stage1-cmake-RA-expensive/llvm/include -fPIC -fvisibility-inlines-hidden -Werror=date-time -Werror=unguarded-availability-new -std=c++14 -Wall -Wextra -Wno-unused-parameter -Wwrite-strings -Wcast-qual -Wmissing-field-initializers -pedantic -Wno-long-long -Wimplicit-fallthrough -Wcovered-switch-default -Wno-noexcept-type -Wnon-virtual-dtor -Wdelete-non-virtual-dtor -Wstring-conversion -fdiagnostics-color -O3  -isysroot /Applications/Xcode.app/Contents/Developer/Platforms/MacOSX.platform/Developer/SDKs/MacOSX10.13.sdk -mmacosx-version-min=10.9   -UNDEBUG  -fno-exceptions -fno-rtti -MD -MT lib/CodeGen/CMakeFiles/LLVMCodeGen.dir/CodeGen.cpp.o -MF lib/CodeGen/CMakeFiles/LLVMCodeGen.dir/CodeGen.cpp.o.d -o lib/CodeGen/CMakeFiles/LLVMCodeGen.dir/CodeGen.cpp.o -c /Users/buildslave/jenkins/workspace/clang-stage1-cmake-RA-expensive/llvm/lib/CodeGen/CodeGen.cpp
[314/4517] /Applications/Xcode.app/Contents/Developer/Toolchains/XcodeDefault.xctoolchain/usr/bin/c++  -DEXPENSIVE_CHECKS -DGTEST_HAS_RTTI=0 -D_DEBUG -D_GLIBCXX_DEBUG -D__STDC_CONSTANT_MACROS -D__STDC_FORMAT_MACROS -D__STDC_LIMIT_MACROS -Ilib/CodeGen -I/Users/buildslave/jenkins/workspace/clang-stage1-cmake-RA-expensive/llvm/lib/CodeGen -I/Applications/Xcode.app/Contents/Developer/Platforms/MacOSX.platform/Developer/SDKs/MacOSX10.13.sdk/usr/include/libxml2 -Iinclude -I/Users/buildslave/jenkins/workspace/clang-stage1-cmake-RA-expensive/llvm/include -fPIC -fvisibility-inlines-hidden -Werror=date-time -Werror=unguarded-availability-new -std=c++14 -Wall -Wextra -Wno-unused-parameter -Wwrite-strings -Wcast-qual -Wmissing-field-initializers -pedantic -Wno-long-long -Wimplicit-fallthrough -Wcovered-switch-default -Wno-noexcept-type -Wnon-virtual-dtor -Wdelete-non-virtual-dtor -Wstring-conversion -fdiagnostics-color -O3  -isysroot /Applications/Xcode.app/Contents/Developer/Platforms/MacOSX.platform/Developer/SDKs/MacOSX10.13.sdk -mmacosx-version-min=10.9   -UNDEBUG  -fno-exceptions -fno-rtti -MD -MT lib/CodeGen/CMakeFiles/LLVMCodeGen.dir/AtomicExpandPass.cpp.o -MF lib/CodeGen/CMakeFiles/LLVMCodeGen.dir/AtomicExpandPass.cpp.o.d -o lib/CodeGen/CMakeFiles/LLVMCodeGen.dir/AtomicExpandPass.cpp.o -c /Users/buildslave/jenkins/workspace/clang-stage1-cmake-RA-expensive/llvm/lib/CodeGen/AtomicExpandPass.cpp
[315/4517] /Applications/Xcode.app/Contents/Developer/Toolchains/XcodeDefault.xctoolchain/usr/bin/c++  -DEXPENSIVE_CHECKS -DGTEST_HAS_RTTI=0 -D_DEBUG -D_GLIBCXX_DEBUG -D__STDC_CONSTANT_MACROS -D__STDC_FORMAT_MACROS -D__STDC_LIMIT_MACROS -Ilib/CodeGen -I/Users/buildslave/jenkins/workspace/clang-stage1-cmake-RA-expensive/llvm/lib/CodeGen -I/Applications/Xcode.app/Contents/Developer/Platforms/MacOSX.platform/Developer/SDKs/MacOSX10.13.sdk/usr/include/libxml2 -Iinclude -I/Users/buildslave/jenkins/workspace/clang-stage1-cmake-RA-expensive/llvm/include -fPIC -fvisibility-inlines-hidden -Werror=date-time -Werror=unguarded-availability-new -std=c++14 -Wall -Wextra -Wno-unused-parameter -Wwrite-strings -Wcast-qual -Wmissing-field-initializers -pedantic -Wno-long-long -Wimplicit-fallthrough -Wcovered-switch-default -Wno-noexcept-type -Wnon-virtual-dtor -Wdelete-non-virtual-dtor -Wstring-conversion -fdiagnostics-color -O3  -isysroot /Applications/Xcode.app/Contents/Developer/Platforms/MacOSX.platform/Developer/SDKs/MacOSX10.13.sdk -mmacosx-version-min=10.9   -UNDEBUG  -fno-exceptions -fno-rtti -MD -MT lib/CodeGen/CMakeFiles/LLVMCodeGen.dir/BasicTargetTransformInfo.cpp.o -MF lib/CodeGen/CMakeFiles/LLVMCodeGen.dir/BasicTargetTransformInfo.cpp.o.d -o lib/CodeGen/CMakeFiles/LLVMCodeGen.dir/BasicTargetTransformInfo.cpp.o -c /Users/buildslave/jenkins/workspace/clang-stage1-cmake-RA-expensive/llvm/lib/CodeGen/BasicTargetTransformInfo.cpp
[316/4517] /Applications/Xcode.app/Contents/Developer/Toolchains/XcodeDefault.xctoolchain/usr/bin/c++  -DEXPENSIVE_CHECKS -DGTEST_HAS_RTTI=0 -D_DEBUG -D_GLIBCXX_DEBUG -D__STDC_CONSTANT_MACROS -D__STDC_FORMAT_MACROS -D__STDC_LIMIT_MACROS -Ilib/CodeGen -I/Users/buildslave/jenkins/workspace/clang-stage1-cmake-RA-expensive/llvm/lib/CodeGen -I/Applications/Xcode.app/Contents/Developer/Platforms/MacOSX.platform/Developer/SDKs/MacOSX10.13.sdk/usr/include/libxml2 -Iinclude -I/Users/buildslave/jenkins/workspace/clang-stage1-cmake-RA-expensive/llvm/include -fPIC -fvisibility-inlines-hidden -Werror=date-time -Werror=unguarded-availability-new -std=c++14 -Wall -Wextra -Wno-unused-parameter -Wwrite-strings -Wcast-qual -Wmissing-field-initializers -pedantic -Wno-long-long -Wimplicit-fallthrough -Wcovered-switch-default -Wno-noexcept-type -Wnon-virtual-dtor -Wdelete-non-virtual-dtor -Wstring-conversion -fdiagnostics-color -O3  -isysroot /Applications/Xcode.app/Contents/Developer/Platforms/MacOSX.platform/Developer/SDKs/MacOSX10.13.sdk -mmacosx-version-min=10.9   -UNDEBUG  -fno-exceptions -fno-rtti -MD -MT lib/CodeGen/CMakeFiles/LLVMCodeGen.dir/CalcSpillWeights.cpp.o -MF lib/CodeGen/CMakeFiles/LLVMCodeGen.dir/CalcSpillWeights.cpp.o.d -o lib/CodeGen/CMakeFiles/LLVMCodeGen.dir/CalcSpillWeights.cpp.o -c /Users/buildslave/jenkins/workspace/clang-stage1-cmake-RA-expensive/llvm/lib/CodeGen/CalcSpillWeights.cpp
[317/4517] /Applications/Xcode.app/Contents/Developer/Toolchains/XcodeDefault.xctoolchain/usr/bin/c++  -DEXPENSIVE_CHECKS -DGTEST_HAS_RTTI=0 -D_DEBUG -D_GLIBCXX_DEBUG -D__STDC_CONSTANT_MACROS -D__STDC_FORMAT_MACROS -D__STDC_LIMIT_MACROS -Ilib/CodeGen -I/Users/buildslave/jenkins/workspace/clang-stage1-cmake-RA-expensive/llvm/lib/CodeGen -I/Applications/Xcode.app/Contents/Developer/Platforms/MacOSX.platform/Developer/SDKs/MacOSX10.13.sdk/usr/include/libxml2 -Iinclude -I/Users/buildslave/jenkins/workspace/clang-stage1-cmake-RA-expensive/llvm/include -fPIC -fvisibility-inlines-hidden -Werror=date-time -Werror=unguarded-availability-new -std=c++14 -Wall -Wextra -Wno-unused-parameter -Wwrite-strings -Wcast-qual -Wmissing-field-initializers -pedantic -Wno-long-long -Wimplicit-fallthrough -Wcovered-switch-default -Wno-noexcept-type -Wnon-virtual-dtor -Wdelete-non-virtual-dtor -Wstring-conversion -fdiagnostics-color -O3  -isysroot /Applications/Xcode.app/Contents/Developer/Platforms/MacOSX.platform/Developer/SDKs/MacOSX10.13.sdk -mmacosx-version-min=10.9   -UNDEBUG  -fno-exceptions -fno-rtti -MD -MT lib/CodeGen/CMakeFiles/LLVMCodeGen.dir/CallingConvLower.cpp.o -MF lib/CodeGen/CMakeFiles/LLVMCodeGen.dir/CallingConvLower.cpp.o.d -o lib/CodeGen/CMakeFiles/LLVMCodeGen.dir/CallingConvLower.cpp.o -c /Users/buildslave/jenkins/workspace/clang-stage1-cmake-RA-expensive/llvm/lib/CodeGen/CallingConvLower.cpp
[318/4517] /Applications/Xcode.app/Contents/Developer/Toolchains/XcodeDefault.xctoolchain/usr/bin/c++  -DEXPENSIVE_CHECKS -DGTEST_HAS_RTTI=0 -D_DEBUG -D_GLIBCXX_DEBUG -D__STDC_CONSTANT_MACROS -D__STDC_FORMAT_MACROS -D__STDC_LIMIT_MACROS -Ilib/CodeGen -I/Users/buildslave/jenkins/workspace/clang-stage1-cmake-RA-expensive/llvm/lib/CodeGen -I/Applications/Xcode.app/Contents/Developer/Platforms/MacOSX.platform/Developer/SDKs/MacOSX10.13.sdk/usr/include/libxml2 -Iinclude -I/Users/buildslave/jenkins/workspace/clang-stage1-cmake-RA-expensive/llvm/include -fPIC -fvisibility-inlines-hidden -Werror=date-time -Werror=unguarded-availability-new -std=c++14 -Wall -Wextra -Wno-unused-parameter -Wwrite-strings -Wcast-qual -Wmissing-field-initializers -pedantic -Wno-long-long -Wimplicit-fallthrough -Wcovered-switch-default -Wno-noexcept-type -Wnon-virtual-dtor -Wdelete-non-virtual-dtor -Wstring-conversion -fdiagnostics-color -O3  -isysroot /Applications/Xcode.app/Contents/Developer/Platforms/MacOSX.platform/Developer/SDKs/MacOSX10.13.sdk -mmacosx-version-min=10.9   -UNDEBUG  -fno-exceptions -fno-rtti -MD -MT lib/CodeGen/CMakeFiles/LLVMCodeGen.dir/DeadMachineInstructionElim.cpp.o -MF lib/CodeGen/CMakeFiles/LLVMCodeGen.dir/DeadMachineInstructionElim.cpp.o.d -o lib/CodeGen/CMakeFiles/LLVMCodeGen.dir/DeadMachineInstructionElim.cpp.o -c /Users/buildslave/jenkins/workspace/clang-stage1-cmake-RA-expensive/llvm/lib/CodeGen/DeadMachineInstructionElim.cpp
[319/4517] /Applications/Xcode.app/Contents/Developer/Toolchains/XcodeDefault.xctoolchain/usr/bin/c++  -DEXPENSIVE_CHECKS -DGTEST_HAS_RTTI=0 -D_DEBUG -D_GLIBCXX_DEBUG -D__STDC_CONSTANT_MACROS -D__STDC_FORMAT_MACROS -D__STDC_LIMIT_MACROS -Ilib/CodeGen -I/Users/buildslave/jenkins/workspace/clang-stage1-cmake-RA-expensive/llvm/lib/CodeGen -I/Applications/Xcode.app/Contents/Developer/Platforms/MacOSX.platform/Developer/SDKs/MacOSX10.13.sdk/usr/include/libxml2 -Iinclude -I/Users/buildslave/jenkins/workspace/clang-stage1-cmake-RA-expensive/llvm/include -fPIC -fvisibility-inlines-hidden -Werror=date-time -Werror=unguarded-availability-new -std=c++14 -Wall -Wextra -Wno-unused-parameter -Wwrite-strings -Wcast-qual -Wmissing-field-initializers -pedantic -Wno-long-long -Wimplicit-fallthrough -Wcovered-switch-default -Wno-noexcept-type -Wnon-virtual-dtor -Wdelete-non-virtual-dtor -Wstring-conversion -fdiagnostics-color -O3  -isysroot /Applications/Xcode.app/Contents/Developer/Platforms/MacOSX.platform/Developer/SDKs/MacOSX10.13.sdk -mmacosx-version-min=10.9   -UNDEBUG  -fno-exceptions -fno-rtti -MD -MT lib/CodeGen/CMakeFiles/LLVMCodeGen.dir/BranchFolding.cpp.o -MF lib/CodeGen/CMakeFiles/LLVMCodeGen.dir/BranchFolding.cpp.o.d -o lib/CodeGen/CMakeFiles/LLVMCodeGen.dir/BranchFolding.cpp.o -c /Users/buildslave/jenkins/workspace/clang-stage1-cmake-RA-expensive/llvm/lib/CodeGen/BranchFolding.cpp
[320/4517] /Applications/Xcode.app/Contents/Developer/Toolchains/XcodeDefault.xctoolchain/usr/bin/c++  -DEXPENSIVE_CHECKS -DGTEST_HAS_RTTI=0 -D_DEBUG -D_GLIBCXX_DEBUG -D__STDC_CONSTANT_MACROS -D__STDC_FORMAT_MACROS -D__STDC_LIMIT_MACROS -Ilib/IR -I/Users/buildslave/jenkins/workspace/clang-stage1-cmake-RA-expensive/llvm/lib/IR -I/Applications/Xcode.app/Contents/Developer/Platforms/MacOSX.platform/Developer/SDKs/MacOSX10.13.sdk/usr/include/libxml2 -Iinclude -I/Users/buildslave/jenkins/workspace/clang-stage1-cmake-RA-expensive/llvm/include -fPIC -fvisibility-inlines-hidden -Werror=date-time -Werror=unguarded-availability-new -std=c++14 -Wall -Wextra -Wno-unused-parameter -Wwrite-strings -Wcast-qual -Wmissing-field-initializers -pedantic -Wno-long-long -Wimplicit-fallthrough -Wcovered-switch-default -Wno-noexcept-type -Wnon-virtual-dtor -Wdelete-non-virtual-dtor -Wstring-conversion -fdiagnostics-color -O3  -isysroot /Applications/Xcode.app/Contents/Developer/Platforms/MacOSX.platform/Developer/SDKs/MacOSX10.13.sdk -mmacosx-version-min=10.9   -UNDEBUG  -fno-exceptions -fno-rtti -MD -MT lib/IR/CMakeFiles/LLVMCore.dir/Verifier.cpp.o -MF lib/IR/CMakeFiles/LLVMCore.dir/Verifier.cpp.o.d -o lib/IR/CMakeFiles/LLVMCore.dir/Verifier.cpp.o -c /Users/buildslave/jenkins/workspace/clang-stage1-cmake-RA-expensive/llvm/lib/IR/Verifier.cpp
[321/4517] : && "/Applications/Xcode.app/Contents/Developer/Toolchains/XcodeDefault.xctoolchain/usr/bin/libtool" -static -no_warning_for_no_symbols -o lib/libLLVMCore.a  lib/IR/CMakeFiles/LLVMCore.dir/AbstractCallSite.cpp.o lib/IR/CMakeFiles/LLVMCore.dir/AsmWriter.cpp.o lib/IR/CMakeFiles/LLVMCore.dir/Attributes.cpp.o lib/IR/CMakeFiles/LLVMCore.dir/AutoUpgrade.cpp.o lib/IR/CMakeFiles/LLVMCore.dir/BasicBlock.cpp.o lib/IR/CMakeFiles/LLVMCore.dir/Comdat.cpp.o lib/IR/CMakeFiles/LLVMCore.dir/ConstantFold.cpp.o lib/IR/CMakeFiles/LLVMCore.dir/ConstantRange.cpp.o lib/IR/CMakeFiles/LLVMCore.dir/Constants.cpp.o lib/IR/CMakeFiles/LLVMCore.dir/Core.cpp.o lib/IR/CMakeFiles/LLVMCore.dir/DIBuilder.cpp.o lib/IR/CMakeFiles/LLVMCore.dir/DataLayout.cpp.o lib/IR/CMakeFiles/LLVMCore.dir/DebugInfo.cpp.o lib/IR/CMakeFiles/LLVMCore.dir/DebugInfoMetadata.cpp.o lib/IR/CMakeFiles/LLVMCore.dir/DebugLoc.cpp.o lib/IR/CMakeFiles/LLVMCore.dir/DiagnosticHandler.cpp.o lib/IR/CMakeFiles/LLVMCore.dir/DiagnosticInfo.cpp.o lib/IR/CMakeFiles/LLVMCore.dir/DiagnosticPrinter.cpp.o lib/IR/CMakeFiles/LLVMCore.dir/Dominators.cpp.o lib/IR/CMakeFiles/LLVMCore.dir/Function.cpp.o lib/IR/CMakeFiles/LLVMCore.dir/GVMaterializer.cpp.o lib/IR/CMakeFiles/LLVMCore.dir/Globals.cpp.o lib/IR/CMakeFiles/LLVMCore.dir/IRBuilder.cpp.o lib/IR/CMakeFiles/LLVMCore.dir/IRPrintingPasses.cpp.o lib/IR/CMakeFiles/LLVMCore.dir/InlineAsm.cpp.o lib/IR/CMakeFiles/LLVMCore.dir/Instruction.cpp.o lib/IR/CMakeFiles/LLVMCore.dir/Instructions.cpp.o lib/IR/CMakeFiles/LLVMCore.dir/IntrinsicInst.cpp.o lib/IR/CMakeFiles/LLVMCore.dir/LLVMContext.cpp.o lib/IR/CMakeFiles/LLVMCore.dir/LLVMContextImpl.cpp.o lib/IR/CMakeFiles/LLVMCore.dir/LegacyPassManager.cpp.o lib/IR/CMakeFiles/LLVMCore.dir/MDBuilder.cpp.o lib/IR/CMakeFiles/LLVMCore.dir/Mangler.cpp.o lib/IR/CMakeFiles/LLVMCore.dir/Metadata.cpp.o lib/IR/CMakeFiles/LLVMCore.dir/Module.cpp.o lib/IR/CMakeFiles/LLVMCore.dir/ModuleSummaryIndex.cpp.o lib/IR/CMakeFiles/LLVMCore.dir/Operator.cpp.o lib/IR/CMakeFiles/LLVMCore.dir/OptBisect.cpp.o lib/IR/CMakeFiles/LLVMCore.dir/Pass.cpp.o lib/IR/CMakeFiles/LLVMCore.dir/PassInstrumentation.cpp.o lib/IR/CMakeFiles/LLVMCore.dir/PassManager.cpp.o lib/IR/CMakeFiles/LLVMCore.dir/PassRegistry.cpp.o lib/IR/CMakeFiles/LLVMCore.dir/PassTimingInfo.cpp.o lib/IR/CMakeFiles/LLVMCore.dir/RemarkStreamer.cpp.o lib/IR/CMakeFiles/LLVMCore.dir/SafepointIRVerifier.cpp.o lib/IR/CMakeFiles/LLVMCore.dir/ProfileSummary.cpp.o lib/IR/CMakeFiles/LLVMCore.dir/Statepoint.cpp.o lib/IR/CMakeFiles/LLVMCore.dir/Type.cpp.o lib/IR/CMakeFiles/LLVMCore.dir/TypeFinder.cpp.o lib/IR/CMakeFiles/LLVMCore.dir/Use.cpp.o lib/IR/CMakeFiles/LLVMCore.dir/User.cpp.o lib/IR/CMakeFiles/LLVMCore.dir/Value.cpp.o lib/IR/CMakeFiles/LLVMCore.dir/ValueSymbolTable.cpp.o lib/IR/CMakeFiles/LLVMCore.dir/Verifier.cpp.o && :
[322/4517] /Applications/Xcode.app/Contents/Developer/Toolchains/XcodeDefault.xctoolchain/usr/bin/c++  -DEXPENSIVE_CHECKS -DGTEST_HAS_RTTI=0 -D_DEBUG -D_GLIBCXX_DEBUG -D__STDC_CONSTANT_MACROS -D__STDC_FORMAT_MACROS -D__STDC_LIMIT_MACROS -Ilib/CodeGen -I/Users/buildslave/jenkins/workspace/clang-stage1-cmake-RA-expensive/llvm/lib/CodeGen -I/Applications/Xcode.app/Contents/Developer/Platforms/MacOSX.platform/Developer/SDKs/MacOSX10.13.sdk/usr/include/libxml2 -Iinclude -I/Users/buildslave/jenkins/workspace/clang-stage1-cmake-RA-expensive/llvm/include -fPIC -fvisibility-inlines-hidden -Werror=date-time -Werror=unguarded-availability-new -std=c++14 -Wall -Wextra -Wno-unused-parameter -Wwrite-strings -Wcast-qual -Wmissing-field-initializers -pedantic -Wno-long-long -Wimplicit-fallthrough -Wcovered-switch-default -Wno-noexcept-type -Wnon-virtual-dtor -Wdelete-non-virtual-dtor -Wstring-conversion -fdiagnostics-color -O3  -isysroot /Applications/Xcode.app/Contents/Developer/Platforms/MacOSX.platform/Developer/SDKs/MacOSX10.13.sdk -mmacosx-version-min=10.9   -UNDEBUG  -fno-exceptions -fno-rtti -MD -MT lib/CodeGen/CMakeFiles/LLVMCodeGen.dir/DetectDeadLanes.cpp.o -MF lib/CodeGen/CMakeFiles/LLVMCodeGen.dir/DetectDeadLanes.cpp.o.d -o lib/CodeGen/CMakeFiles/LLVMCodeGen.dir/DetectDeadLanes.cpp.o -c /Users/buildslave/jenkins/workspace/clang-stage1-cmake-RA-expensive/llvm/lib/CodeGen/DetectDeadLanes.cpp
[323/4517] /Applications/Xcode.app/Contents/Developer/Toolchains/XcodeDefault.xctoolchain/usr/bin/c++  -DEXPENSIVE_CHECKS -DGTEST_HAS_RTTI=0 -D_DEBUG -D_GLIBCXX_DEBUG -D__STDC_CONSTANT_MACROS -D__STDC_FORMAT_MACROS -D__STDC_LIMIT_MACROS -Ilib/CodeGen -I/Users/buildslave/jenkins/workspace/clang-stage1-cmake-RA-expensive/llvm/lib/CodeGen -I/Applications/Xcode.app/Contents/Developer/Platforms/MacOSX.platform/Developer/SDKs/MacOSX10.13.sdk/usr/include/libxml2 -Iinclude -I/Users/buildslave/jenkins/workspace/clang-stage1-cmake-RA-expensive/llvm/include -fPIC -fvisibility-inlines-hidden -Werror=date-time -Werror=unguarded-availability-new -std=c++14 -Wall -Wextra -Wno-unused-parameter -Wwrite-strings -Wcast-qual -Wmissing-field-initializers -pedantic -Wno-long-long -Wimplicit-fallthrough -Wcovered-switch-default -Wno-noexcept-type -Wnon-virtual-dtor -Wdelete-non-virtual-dtor -Wstring-conversion -fdiagnostics-color -O3  -isysroot /Applications/Xcode.app/Contents/Developer/Platforms/MacOSX.platform/Developer/SDKs/MacOSX10.13.sdk -mmacosx-version-min=10.9   -UNDEBUG  -fno-exceptions -fno-rtti -MD -MT lib/CodeGen/CMakeFiles/LLVMCodeGen.dir/CFIInstrInserter.cpp.o -MF lib/CodeGen/CMakeFiles/LLVMCodeGen.dir/CFIInstrInserter.cpp.o.d -o lib/CodeGen/CMakeFiles/LLVMCodeGen.dir/CFIInstrInserter.cpp.o -c /Users/buildslave/jenkins/workspace/clang-stage1-cmake-RA-expensive/llvm/lib/CodeGen/CFIInstrInserter.cpp
[324/4517] /Applications/Xcode.app/Contents/Developer/Toolchains/XcodeDefault.xctoolchain/usr/bin/c++  -DEXPENSIVE_CHECKS -DGTEST_HAS_RTTI=0 -D_DEBUG -D_GLIBCXX_DEBUG -D__STDC_CONSTANT_MACROS -D__STDC_FORMAT_MACROS -D__STDC_LIMIT_MACROS -Ilib/CodeGen -I/Users/buildslave/jenkins/workspace/clang-stage1-cmake-RA-expensive/llvm/lib/CodeGen -I/Applications/Xcode.app/Contents/Developer/Platforms/MacOSX.platform/Developer/SDKs/MacOSX10.13.sdk/usr/include/libxml2 -Iinclude -I/Users/buildslave/jenkins/workspace/clang-stage1-cmake-RA-expensive/llvm/include -fPIC -fvisibility-inlines-hidden -Werror=date-time -Werror=unguarded-availability-new -std=c++14 -Wall -Wextra -Wno-unused-parameter -Wwrite-strings -Wcast-qual -Wmissing-field-initializers -pedantic -Wno-long-long -Wimplicit-fallthrough -Wcovered-switch-default -Wno-noexcept-type -Wnon-virtual-dtor -Wdelete-non-virtual-dtor -Wstring-conversion -fdiagnostics-color -O3  -isysroot /Applications/Xcode.app/Contents/Developer/Platforms/MacOSX.platform/Developer/SDKs/MacOSX10.13.sdk -mmacosx-version-min=10.9   -UNDEBUG  -fno-exceptions -fno-rtti -MD -MT lib/CodeGen/CMakeFiles/LLVMCodeGen.dir/CriticalAntiDepBreaker.cpp.o -MF lib/CodeGen/CMakeFiles/LLVMCodeGen.dir/CriticalAntiDepBreaker.cpp.o.d -o lib/CodeGen/CMakeFiles/LLVMCodeGen.dir/CriticalAntiDepBreaker.cpp.o -c /Users/buildslave/jenkins/workspace/clang-stage1-cmake-RA-expensive/llvm/lib/CodeGen/CriticalAntiDepBreaker.cpp
[325/4517] /Applications/Xcode.app/Contents/Developer/Toolchains/XcodeDefault.xctoolchain/usr/bin/c++  -DEXPENSIVE_CHECKS -DGTEST_HAS_RTTI=0 -D_DEBUG -D_GLIBCXX_DEBUG -D__STDC_CONSTANT_MACROS -D__STDC_FORMAT_MACROS -D__STDC_LIMIT_MACROS -Ilib/CodeGen -I/Users/buildslave/jenkins/workspace/clang-stage1-cmake-RA-expensive/llvm/lib/CodeGen -I/Applications/Xcode.app/Contents/Developer/Platforms/MacOSX.platform/Developer/SDKs/MacOSX10.13.sdk/usr/include/libxml2 -Iinclude -I/Users/buildslave/jenkins/workspace/clang-stage1-cmake-RA-expensive/llvm/include -fPIC -fvisibility-inlines-hidden -Werror=date-time -Werror=unguarded-availability-new -std=c++14 -Wall -Wextra -Wno-unused-parameter -Wwrite-strings -Wcast-qual -Wmissing-field-initializers -pedantic -Wno-long-long -Wimplicit-fallthrough -Wcovered-switch-default -Wno-noexcept-type -Wnon-virtual-dtor -Wdelete-non-virtual-dtor -Wstring-conversion -fdiagnostics-color -O3  -isysroot /Applications/Xcode.app/Contents/Developer/Platforms/MacOSX.platform/Developer/SDKs/MacOSX10.13.sdk -mmacosx-version-min=10.9   -UNDEBUG  -fno-exceptions -fno-rtti -MD -MT lib/CodeGen/CMakeFiles/LLVMCodeGen.dir/EdgeBundles.cpp.o -MF lib/CodeGen/CMakeFiles/LLVMCodeGen.dir/EdgeBundles.cpp.o.d -o lib/CodeGen/CMakeFiles/LLVMCodeGen.dir/EdgeBundles.cpp.o -c /Users/buildslave/jenkins/workspace/clang-stage1-cmake-RA-expensive/llvm/lib/CodeGen/EdgeBundles.cpp
[326/4517] /Applications/Xcode.app/Contents/Developer/Toolchains/XcodeDefault.xctoolchain/usr/bin/c++  -DEXPENSIVE_CHECKS -DGTEST_HAS_RTTI=0 -D_DEBUG -D_GLIBCXX_DEBUG -D__STDC_CONSTANT_MACROS -D__STDC_FORMAT_MACROS -D__STDC_LIMIT_MACROS -Ilib/CodeGen -I/Users/buildslave/jenkins/workspace/clang-stage1-cmake-RA-expensive/llvm/lib/CodeGen -I/Applications/Xcode.app/Contents/Developer/Platforms/MacOSX.platform/Developer/SDKs/MacOSX10.13.sdk/usr/include/libxml2 -Iinclude -I/Users/buildslave/jenkins/workspace/clang-stage1-cmake-RA-expensive/llvm/include -fPIC -fvisibility-inlines-hidden -Werror=date-time -Werror=unguarded-availability-new -std=c++14 -Wall -Wextra -Wno-unused-parameter -Wwrite-strings -Wcast-qual -Wmissing-field-initializers -pedantic -Wno-long-long -Wimplicit-fallthrough -Wcovered-switch-default -Wno-noexcept-type -Wnon-virtual-dtor -Wdelete-non-virtual-dtor -Wstring-conversion -fdiagnostics-color -O3  -isysroot /Applications/Xcode.app/Contents/Developer/Platforms/MacOSX.platform/Developer/SDKs/MacOSX10.13.sdk -mmacosx-version-min=10.9   -UNDEBUG  -fno-exceptions -fno-rtti -MD -MT lib/CodeGen/CMakeFiles/LLVMCodeGen.dir/ExpandPostRAPseudos.cpp.o -MF lib/CodeGen/CMakeFiles/LLVMCodeGen.dir/ExpandPostRAPseudos.cpp.o.d -o lib/CodeGen/CMakeFiles/LLVMCodeGen.dir/ExpandPostRAPseudos.cpp.o -c /Users/buildslave/jenkins/workspace/clang-stage1-cmake-RA-expensive/llvm/lib/CodeGen/ExpandPostRAPseudos.cpp
[327/4517] /Applications/Xcode.app/Contents/Developer/Toolchains/XcodeDefault.xctoolchain/usr/bin/c++  -DEXPENSIVE_CHECKS -DGTEST_HAS_RTTI=0 -D_DEBUG -D_GLIBCXX_DEBUG -D__STDC_CONSTANT_MACROS -D__STDC_FORMAT_MACROS -D__STDC_LIMIT_MACROS -Ilib/CodeGen -I/Users/buildslave/jenkins/workspace/clang-stage1-cmake-RA-expensive/llvm/lib/CodeGen -I/Applications/Xcode.app/Contents/Developer/Platforms/MacOSX.platform/Developer/SDKs/MacOSX10.13.sdk/usr/include/libxml2 -Iinclude -I/Users/buildslave/jenkins/workspace/clang-stage1-cmake-RA-expensive/llvm/include -fPIC -fvisibility-inlines-hidden -Werror=date-time -Werror=unguarded-availability-new -std=c++14 -Wall -Wextra -Wno-unused-parameter -Wwrite-strings -Wcast-qual -Wmissing-field-initializers -pedantic -Wno-long-long -Wimplicit-fallthrough -Wcovered-switch-default -Wno-noexcept-type -Wnon-virtual-dtor -Wdelete-non-virtual-dtor -Wstring-conversion -fdiagnostics-color -O3  -isysroot /Applications/Xcode.app/Contents/Developer/Platforms/MacOSX.platform/Developer/SDKs/MacOSX10.13.sdk -mmacosx-version-min=10.9   -UNDEBUG  -fno-exceptions -fno-rtti -MD -MT lib/CodeGen/CMakeFiles/LLVMCodeGen.dir/ExecutionDomainFix.cpp.o -MF lib/CodeGen/CMakeFiles/LLVMCodeGen.dir/ExecutionDomainFix.cpp.o.d -o lib/CodeGen/CMakeFiles/LLVMCodeGen.dir/ExecutionDomainFix.cpp.o -c /Users/buildslave/jenkins/workspace/clang-stage1-cmake-RA-expensive/llvm/lib/CodeGen/ExecutionDomainFix.cpp
[328/4517] /Applications/Xcode.app/Contents/Developer/Toolchains/XcodeDefault.xctoolchain/usr/bin/c++  -DEXPENSIVE_CHECKS -DGTEST_HAS_RTTI=0 -D_DEBUG -D_GLIBCXX_DEBUG -D__STDC_CONSTANT_MACROS -D__STDC_FORMAT_MACROS -D__STDC_LIMIT_MACROS -Ilib/CodeGen -I/Users/buildslave/jenkins/workspace/clang-stage1-cmake-RA-expensive/llvm/lib/CodeGen -I/Applications/Xcode.app/Contents/Developer/Platforms/MacOSX.platform/Developer/SDKs/MacOSX10.13.sdk/usr/include/libxml2 -Iinclude -I/Users/buildslave/jenkins/workspace/clang-stage1-cmake-RA-expensive/llvm/include -fPIC -fvisibility-inlines-hidden -Werror=date-time -Werror=unguarded-availability-new -std=c++14 -Wall -Wextra -Wno-unused-parameter -Wwrite-strings -Wcast-qual -Wmissing-field-initializers -pedantic -Wno-long-long -Wimplicit-fallthrough -Wcovered-switch-default -Wno-noexcept-type -Wnon-virtual-dtor -Wdelete-non-virtual-dtor -Wstring-conversion -fdiagnostics-color -O3  -isysroot /Applications/Xcode.app/Contents/Developer/Platforms/MacOSX.platform/Developer/SDKs/MacOSX10.13.sdk -mmacosx-version-min=10.9   -UNDEBUG  -fno-exceptions -fno-rtti -MD -MT lib/CodeGen/CMakeFiles/LLVMCodeGen.dir/DFAPacketizer.cpp.o -MF lib/CodeGen/CMakeFiles/LLVMCodeGen.dir/DFAPacketizer.cpp.o.d -o lib/CodeGen/CMakeFiles/LLVMCodeGen.dir/DFAPacketizer.cpp.o -c /Users/buildslave/jenkins/workspace/clang-stage1-cmake-RA-expensive/llvm/lib/CodeGen/DFAPacketizer.cpp
[329/4517] /Applications/Xcode.app/Contents/Developer/Toolchains/XcodeDefault.xctoolchain/usr/bin/c++  -DEXPENSIVE_CHECKS -DGTEST_HAS_RTTI=0 -D_DEBUG -D_GLIBCXX_DEBUG -D__STDC_CONSTANT_MACROS -D__STDC_FORMAT_MACROS -D__STDC_LIMIT_MACROS -Ilib/CodeGen -I/Users/buildslave/jenkins/workspace/clang-stage1-cmake-RA-expensive/llvm/lib/CodeGen -I/Applications/Xcode.app/Contents/Developer/Platforms/MacOSX.platform/Developer/SDKs/MacOSX10.13.sdk/usr/include/libxml2 -Iinclude -I/Users/buildslave/jenkins/workspace/clang-stage1-cmake-RA-expensive/llvm/include -fPIC -fvisibility-inlines-hidden -Werror=date-time -Werror=unguarded-availability-new -std=c++14 -Wall -Wextra -Wno-unused-parameter -Wwrite-strings -Wcast-qual -Wmissing-field-initializers -pedantic -Wno-long-long -Wimplicit-fallthrough -Wcovered-switch-default -Wno-noexcept-type -Wnon-virtual-dtor -Wdelete-non-virtual-dtor -Wstring-conversion -fdiagnostics-color -O3  -isysroot /Applications/Xcode.app/Contents/Developer/Platforms/MacOSX.platform/Developer/SDKs/MacOSX10.13.sdk -mmacosx-version-min=10.9   -UNDEBUG  -fno-exceptions -fno-rtti -MD -MT lib/CodeGen/CMakeFiles/LLVMCodeGen.dir/DwarfEHPrepare.cpp.o -MF lib/CodeGen/CMakeFiles/LLVMCodeGen.dir/DwarfEHPrepare.cpp.o.d -o lib/CodeGen/CMakeFiles/LLVMCodeGen.dir/DwarfEHPrepare.cpp.o -c /Users/buildslave/jenkins/workspace/clang-stage1-cmake-RA-expensive/llvm/lib/CodeGen/DwarfEHPrepare.cpp
[330/4517] /Applications/Xcode.app/Contents/Developer/Toolchains/XcodeDefault.xctoolchain/usr/bin/c++  -DEXPENSIVE_CHECKS -DGTEST_HAS_RTTI=0 -D_DEBUG -D_GLIBCXX_DEBUG -D__STDC_CONSTANT_MACROS -D__STDC_FORMAT_MACROS -D__STDC_LIMIT_MACROS -Ilib/CodeGen -I/Users/buildslave/jenkins/workspace/clang-stage1-cmake-RA-expensive/llvm/lib/CodeGen -I/Applications/Xcode.app/Contents/Developer/Platforms/MacOSX.platform/Developer/SDKs/MacOSX10.13.sdk/usr/include/libxml2 -Iinclude -I/Users/buildslave/jenkins/workspace/clang-stage1-cmake-RA-expensive/llvm/include -fPIC -fvisibility-inlines-hidden -Werror=date-time -Werror=unguarded-availability-new -std=c++14 -Wall -Wextra -Wno-unused-parameter -Wwrite-strings -Wcast-qual -Wmissing-field-initializers -pedantic -Wno-long-long -Wimplicit-fallthrough -Wcovered-switch-default -Wno-noexcept-type -Wnon-virtual-dtor -Wdelete-non-virtual-dtor -Wstring-conversion -fdiagnostics-color -O3  -isysroot /Applications/Xcode.app/Contents/Developer/Platforms/MacOSX.platform/Developer/SDKs/MacOSX10.13.sdk -mmacosx-version-min=10.9   -UNDEBUG  -fno-exceptions -fno-rtti -MD -MT lib/CodeGen/CMakeFiles/LLVMCodeGen.dir/ExpandReductions.cpp.o -MF lib/CodeGen/CMakeFiles/LLVMCodeGen.dir/ExpandReductions.cpp.o.d -o lib/CodeGen/CMakeFiles/LLVMCodeGen.dir/ExpandReductions.cpp.o -c /Users/buildslave/jenkins/workspace/clang-stage1-cmake-RA-expensive/llvm/lib/CodeGen/ExpandReductions.cpp
[331/4517] /Applications/Xcode.app/Contents/Developer/Toolchains/XcodeDefault.xctoolchain/usr/bin/c++  -DEXPENSIVE_CHECKS -DGTEST_HAS_RTTI=0 -D_DEBUG -D_GLIBCXX_DEBUG -D__STDC_CONSTANT_MACROS -D__STDC_FORMAT_MACROS -D__STDC_LIMIT_MACROS -Ilib/CodeGen -I/Users/buildslave/jenkins/workspace/clang-stage1-cmake-RA-expensive/llvm/lib/CodeGen -I/Applications/Xcode.app/Contents/Developer/Platforms/MacOSX.platform/Developer/SDKs/MacOSX10.13.sdk/usr/include/libxml2 -Iinclude -I/Users/buildslave/jenkins/workspace/clang-stage1-cmake-RA-expensive/llvm/include -fPIC -fvisibility-inlines-hidden -Werror=date-time -Werror=unguarded-availability-new -std=c++14 -Wall -Wextra -Wno-unused-parameter -Wwrite-strings -Wcast-qual -Wmissing-field-initializers -pedantic -Wno-long-long -Wimplicit-fallthrough -Wcovered-switch-default -Wno-noexcept-type -Wnon-virtual-dtor -Wdelete-non-virtual-dtor -Wstring-conversion -fdiagnostics-color -O3  -isysroot /Applications/Xcode.app/Contents/Developer/Platforms/MacOSX.platform/Developer/SDKs/MacOSX10.13.sdk -mmacosx-version-min=10.9   -UNDEBUG  -fno-exceptions -fno-rtti -MD -MT lib/CodeGen/CMakeFiles/LLVMCodeGen.dir/FaultMaps.cpp.o -MF lib/CodeGen/CMakeFiles/LLVMCodeGen.dir/FaultMaps.cpp.o.d -o lib/CodeGen/CMakeFiles/LLVMCodeGen.dir/FaultMaps.cpp.o -c /Users/buildslave/jenkins/workspace/clang-stage1-cmake-RA-expensive/llvm/lib/CodeGen/FaultMaps.cpp
[332/4517] /Applications/Xcode.app/Contents/Developer/Toolchains/XcodeDefault.xctoolchain/usr/bin/c++  -DEXPENSIVE_CHECKS -DGTEST_HAS_RTTI=0 -D_DEBUG -D_GLIBCXX_DEBUG -D__STDC_CONSTANT_MACROS -D__STDC_FORMAT_MACROS -D__STDC_LIMIT_MACROS -Ilib/CodeGen -I/Users/buildslave/jenkins/workspace/clang-stage1-cmake-RA-expensive/llvm/lib/CodeGen -I/Applications/Xcode.app/Contents/Developer/Platforms/MacOSX.platform/Developer/SDKs/MacOSX10.13.sdk/usr/include/libxml2 -Iinclude -I/Users/buildslave/jenkins/workspace/clang-stage1-cmake-RA-expensive/llvm/include -fPIC -fvisibility-inlines-hidden -Werror=date-time -Werror=unguarded-availability-new -std=c++14 -Wall -Wextra -Wno-unused-parameter -Wwrite-strings -Wcast-qual -Wmissing-field-initializers -pedantic -Wno-long-long -Wimplicit-fallthrough -Wcovered-switch-default -Wno-noexcept-type -Wnon-virtual-dtor -Wdelete-non-virtual-dtor -Wstring-conversion -fdiagnostics-color -O3  -isysroot /Applications/Xcode.app/Contents/Developer/Platforms/MacOSX.platform/Developer/SDKs/MacOSX10.13.sdk -mmacosx-version-min=10.9   -UNDEBUG  -fno-exceptions -fno-rtti -MD -MT lib/CodeGen/CMakeFiles/LLVMCodeGen.dir/GCMetadataPrinter.cpp.o -MF lib/CodeGen/CMakeFiles/LLVMCodeGen.dir/GCMetadataPrinter.cpp.o.d -o lib/CodeGen/CMakeFiles/LLVMCodeGen.dir/GCMetadataPrinter.cpp.o -c /Users/buildslave/jenkins/workspace/clang-stage1-cmake-RA-expensive/llvm/lib/CodeGen/GCMetadataPrinter.cpp
[333/4517] /Applications/Xcode.app/Contents/Developer/Toolchains/XcodeDefault.xctoolchain/usr/bin/c++  -DEXPENSIVE_CHECKS -DGTEST_HAS_RTTI=0 -D_DEBUG -D_GLIBCXX_DEBUG -D__STDC_CONSTANT_MACROS -D__STDC_FORMAT_MACROS -D__STDC_LIMIT_MACROS -Ilib/CodeGen -I/Users/buildslave/jenkins/workspace/clang-stage1-cmake-RA-expensive/llvm/lib/CodeGen -I/Applications/Xcode.app/Contents/Developer/Platforms/MacOSX.platform/Developer/SDKs/MacOSX10.13.sdk/usr/include/libxml2 -Iinclude -I/Users/buildslave/jenkins/workspace/clang-stage1-cmake-RA-expensive/llvm/include -fPIC -fvisibility-inlines-hidden -Werror=date-time -Werror=unguarded-availability-new -std=c++14 -Wall -Wextra -Wno-unused-parameter -Wwrite-strings -Wcast-qual -Wmissing-field-initializers -pedantic -Wno-long-long -Wimplicit-fallthrough -Wcovered-switch-default -Wno-noexcept-type -Wnon-virtual-dtor -Wdelete-non-virtual-dtor -Wstring-conversion -fdiagnostics-color -O3  -isysroot /Applications/Xcode.app/Contents/Developer/Platforms/MacOSX.platform/Developer/SDKs/MacOSX10.13.sdk -mmacosx-version-min=10.9   -UNDEBUG  -fno-exceptions -fno-rtti -MD -MT lib/CodeGen/CMakeFiles/LLVMCodeGen.dir/EarlyIfConversion.cpp.o -MF lib/CodeGen/CMakeFiles/LLVMCodeGen.dir/EarlyIfConversion.cpp.o.d -o lib/CodeGen/CMakeFiles/LLVMCodeGen.dir/EarlyIfConversion.cpp.o -c /Users/buildslave/jenkins/workspace/clang-stage1-cmake-RA-expensive/llvm/lib/CodeGen/EarlyIfConversion.cpp
[334/4517] /Applications/Xcode.app/Contents/Developer/Toolchains/XcodeDefault.xctoolchain/usr/bin/c++  -DEXPENSIVE_CHECKS -DGTEST_HAS_RTTI=0 -D_DEBUG -D_GLIBCXX_DEBUG -D__STDC_CONSTANT_MACROS -D__STDC_FORMAT_MACROS -D__STDC_LIMIT_MACROS -Ilib/CodeGen -I/Users/buildslave/jenkins/workspace/clang-stage1-cmake-RA-expensive/llvm/lib/CodeGen -I/Applications/Xcode.app/Contents/Developer/Platforms/MacOSX.platform/Developer/SDKs/MacOSX10.13.sdk/usr/include/libxml2 -Iinclude -I/Users/buildslave/jenkins/workspace/clang-stage1-cmake-RA-expensive/llvm/include -fPIC -fvisibility-inlines-hidden -Werror=date-time -Werror=unguarded-availability-new -std=c++14 -Wall -Wextra -Wno-unused-parameter -Wwrite-strings -Wcast-qual -Wmissing-field-initializers -pedantic -Wno-long-long -Wimplicit-fallthrough -Wcovered-switch-default -Wno-noexcept-type -Wnon-virtual-dtor -Wdelete-non-virtual-dtor -Wstring-conversion -fdiagnostics-color -O3  -isysroot /Applications/Xcode.app/Contents/Developer/Platforms/MacOSX.platform/Developer/SDKs/MacOSX10.13.sdk -mmacosx-version-min=10.9   -UNDEBUG  -fno-exceptions -fno-rtti -MD -MT lib/CodeGen/CMakeFiles/LLVMCodeGen.dir/FEntryInserter.cpp.o -MF lib/CodeGen/CMakeFiles/LLVMCodeGen.dir/FEntryInserter.cpp.o.d -o lib/CodeGen/CMakeFiles/LLVMCodeGen.dir/FEntryInserter.cpp.o -c /Users/buildslave/jenkins/workspace/clang-stage1-cmake-RA-expensive/llvm/lib/CodeGen/FEntryInserter.cpp
[335/4517] /Applications/Xcode.app/Contents/Developer/Toolchains/XcodeDefault.xctoolchain/usr/bin/c++  -DEXPENSIVE_CHECKS -DGTEST_HAS_RTTI=0 -D_DEBUG -D_GLIBCXX_DEBUG -D__STDC_CONSTANT_MACROS -D__STDC_FORMAT_MACROS -D__STDC_LIMIT_MACROS -Ilib/CodeGen -I/Users/buildslave/jenkins/workspace/clang-stage1-cmake-RA-expensive/llvm/lib/CodeGen -I/Applications/Xcode.app/Contents/Developer/Platforms/MacOSX.platform/Developer/SDKs/MacOSX10.13.sdk/usr/include/libxml2 -Iinclude -I/Users/buildslave/jenkins/workspace/clang-stage1-cmake-RA-expensive/llvm/include -fPIC -fvisibility-inlines-hidden -Werror=date-time -Werror=unguarded-availability-new -std=c++14 -Wall -Wextra -Wno-unused-parameter -Wwrite-strings -Wcast-qual -Wmissing-field-initializers -pedantic -Wno-long-long -Wimplicit-fallthrough -Wcovered-switch-default -Wno-noexcept-type -Wnon-virtual-dtor -Wdelete-non-virtual-dtor -Wstring-conversion -fdiagnostics-color -O3  -isysroot /Applications/Xcode.app/Contents/Developer/Platforms/MacOSX.platform/Developer/SDKs/MacOSX10.13.sdk -mmacosx-version-min=10.9   -UNDEBUG  -fno-exceptions -fno-rtti -MD -MT lib/CodeGen/CMakeFiles/LLVMCodeGen.dir/GCStrategy.cpp.o -MF lib/CodeGen/CMakeFiles/LLVMCodeGen.dir/GCStrategy.cpp.o.d -o lib/CodeGen/CMakeFiles/LLVMCodeGen.dir/GCStrategy.cpp.o -c /Users/buildslave/jenkins/workspace/clang-stage1-cmake-RA-expensive/llvm/lib/CodeGen/GCStrategy.cpp
[336/4517] /Applications/Xcode.app/Contents/Developer/Toolchains/XcodeDefault.xctoolchain/usr/bin/c++  -DEXPENSIVE_CHECKS -DGTEST_HAS_RTTI=0 -D_DEBUG -D_GLIBCXX_DEBUG -D__STDC_CONSTANT_MACROS -D__STDC_FORMAT_MACROS -D__STDC_LIMIT_MACROS -Ilib/CodeGen -I/Users/buildslave/jenkins/workspace/clang-stage1-cmake-RA-expensive/llvm/lib/CodeGen -I/Applications/Xcode.app/Contents/Developer/Platforms/MacOSX.platform/Developer/SDKs/MacOSX10.13.sdk/usr/include/libxml2 -Iinclude -I/Users/buildslave/jenkins/workspace/clang-stage1-cmake-RA-expensive/llvm/include -fPIC -fvisibility-inlines-hidden -Werror=date-time -Werror=unguarded-availability-new -std=c++14 -Wall -Wextra -Wno-unused-parameter -Wwrite-strings -Wcast-qual -Wmissing-field-initializers -pedantic -Wno-long-long -Wimplicit-fallthrough -Wcovered-switch-default -Wno-noexcept-type -Wnon-virtual-dtor -Wdelete-non-virtual-dtor -Wstring-conversion -fdiagnostics-color -O3  -isysroot /Applications/Xcode.app/Contents/Developer/Platforms/MacOSX.platform/Developer/SDKs/MacOSX10.13.sdk -mmacosx-version-min=10.9   -UNDEBUG  -fno-exceptions -fno-rtti -MD -MT lib/CodeGen/CMakeFiles/LLVMCodeGen.dir/ExpandMemCmp.cpp.o -MF lib/CodeGen/CMakeFiles/LLVMCodeGen.dir/ExpandMemCmp.cpp.o.d -o lib/CodeGen/CMakeFiles/LLVMCodeGen.dir/ExpandMemCmp.cpp.o -c /Users/buildslave/jenkins/workspace/clang-stage1-cmake-RA-expensive/llvm/lib/CodeGen/ExpandMemCmp.cpp
[337/4517] /Applications/Xcode.app/Contents/Developer/Toolchains/XcodeDefault.xctoolchain/usr/bin/c++  -DEXPENSIVE_CHECKS -DGTEST_HAS_RTTI=0 -D_DEBUG -D_GLIBCXX_DEBUG -D__STDC_CONSTANT_MACROS -D__STDC_FORMAT_MACROS -D__STDC_LIMIT_MACROS -Ilib/CodeGen -I/Users/buildslave/jenkins/workspace/clang-stage1-cmake-RA-expensive/llvm/lib/CodeGen -I/Applications/Xcode.app/Contents/Developer/Platforms/MacOSX.platform/Developer/SDKs/MacOSX10.13.sdk/usr/include/libxml2 -Iinclude -I/Users/buildslave/jenkins/workspace/clang-stage1-cmake-RA-expensive/llvm/include -fPIC -fvisibility-inlines-hidden -Werror=date-time -Werror=unguarded-availability-new -std=c++14 -Wall -Wextra -Wno-unused-parameter -Wwrite-strings -Wcast-qual -Wmissing-field-initializers -pedantic -Wno-long-long -Wimplicit-fallthrough -Wcovered-switch-default -Wno-noexcept-type -Wnon-virtual-dtor -Wdelete-non-virtual-dtor -Wstring-conversion -fdiagnostics-color -O3  -isysroot /Applications/Xcode.app/Contents/Developer/Platforms/MacOSX.platform/Developer/SDKs/MacOSX10.13.sdk -mmacosx-version-min=10.9   -UNDEBUG  -fno-exceptions -fno-rtti -MD -MT lib/CodeGen/CMakeFiles/LLVMCodeGen.dir/GCMetadata.cpp.o -MF lib/CodeGen/CMakeFiles/LLVMCodeGen.dir/GCMetadata.cpp.o.d -o lib/CodeGen/CMakeFiles/LLVMCodeGen.dir/GCMetadata.cpp.o -c /Users/buildslave/jenkins/workspace/clang-stage1-cmake-RA-expensive/llvm/lib/CodeGen/GCMetadata.cpp
[338/4517] /Applications/Xcode.app/Contents/Developer/Toolchains/XcodeDefault.xctoolchain/usr/bin/c++  -DEXPENSIVE_CHECKS -DGTEST_HAS_RTTI=0 -D_DEBUG -D_GLIBCXX_DEBUG -D__STDC_CONSTANT_MACROS -D__STDC_FORMAT_MACROS -D__STDC_LIMIT_MACROS -Ilib/CodeGen -I/Users/buildslave/jenkins/workspace/clang-stage1-cmake-RA-expensive/llvm/lib/CodeGen -I/Applications/Xcode.app/Contents/Developer/Platforms/MacOSX.platform/Developer/SDKs/MacOSX10.13.sdk/usr/include/libxml2 -Iinclude -I/Users/buildslave/jenkins/workspace/clang-stage1-cmake-RA-expensive/llvm/include -fPIC -fvisibility-inlines-hidden -Werror=date-time -Werror=unguarded-availability-new -std=c++14 -Wall -Wextra -Wno-unused-parameter -Wwrite-strings -Wcast-qual -Wmissing-field-initializers -pedantic -Wno-long-long -Wimplicit-fallthrough -Wcovered-switch-default -Wno-noexcept-type -Wnon-virtual-dtor -Wdelete-non-virtual-dtor -Wstring-conversion -fdiagnostics-color -O3  -isysroot /Applications/Xcode.app/Contents/Developer/Platforms/MacOSX.platform/Developer/SDKs/MacOSX10.13.sdk -mmacosx-version-min=10.9   -UNDEBUG  -fno-exceptions -fno-rtti -MD -MT lib/CodeGen/CMakeFiles/LLVMCodeGen.dir/FuncletLayout.cpp.o -MF lib/CodeGen/CMakeFiles/LLVMCodeGen.dir/FuncletLayout.cpp.o.d -o lib/CodeGen/CMakeFiles/LLVMCodeGen.dir/FuncletLayout.cpp.o -c /Users/buildslave/jenkins/workspace/clang-stage1-cmake-RA-expensive/llvm/lib/CodeGen/FuncletLayout.cpp
[339/4517] /Applications/Xcode.app/Contents/Developer/Toolchains/XcodeDefault.xctoolchain/usr/bin/c++  -DEXPENSIVE_CHECKS -DGTEST_HAS_RTTI=0 -D_DEBUG -D_GLIBCXX_DEBUG -D__STDC_CONSTANT_MACROS -D__STDC_FORMAT_MACROS -D__STDC_LIMIT_MACROS -Ilib/CodeGen -I/Users/buildslave/jenkins/workspace/clang-stage1-cmake-RA-expensive/llvm/lib/CodeGen -I/Applications/Xcode.app/Contents/Developer/Platforms/MacOSX.platform/Developer/SDKs/MacOSX10.13.sdk/usr/include/libxml2 -Iinclude -I/Users/buildslave/jenkins/workspace/clang-stage1-cmake-RA-expensive/llvm/include -fPIC -fvisibility-inlines-hidden -Werror=date-time -Werror=unguarded-availability-new -std=c++14 -Wall -Wextra -Wno-unused-parameter -Wwrite-strings -Wcast-qual -Wmissing-field-initializers -pedantic -Wno-long-long -Wimplicit-fallthrough -Wcovered-switch-default -Wno-noexcept-type -Wnon-virtual-dtor -Wdelete-non-virtual-dtor -Wstring-conversion -fdiagnostics-color -O3  -isysroot /Applications/Xcode.app/Contents/Developer/Platforms/MacOSX.platform/Developer/SDKs/MacOSX10.13.sdk -mmacosx-version-min=10.9   -UNDEBUG  -fno-exceptions -fno-rtti -MD -MT lib/CodeGen/CMakeFiles/LLVMCodeGen.dir/FinalizeISel.cpp.o -MF lib/CodeGen/CMakeFiles/LLVMCodeGen.dir/FinalizeISel.cpp.o.d -o lib/CodeGen/CMakeFiles/LLVMCodeGen.dir/FinalizeISel.cpp.o -c /Users/buildslave/jenkins/workspace/clang-stage1-cmake-RA-expensive/llvm/lib/CodeGen/FinalizeISel.cpp
[340/4517] /Applications/Xcode.app/Contents/Developer/Toolchains/XcodeDefault.xctoolchain/usr/bin/c++  -DEXPENSIVE_CHECKS -DGTEST_HAS_RTTI=0 -D_DEBUG -D_GLIBCXX_DEBUG -D__STDC_CONSTANT_MACROS -D__STDC_FORMAT_MACROS -D__STDC_LIMIT_MACROS -Ilib/CodeGen -I/Users/buildslave/jenkins/workspace/clang-stage1-cmake-RA-expensive/llvm/lib/CodeGen -I/Applications/Xcode.app/Contents/Developer/Platforms/MacOSX.platform/Developer/SDKs/MacOSX10.13.sdk/usr/include/libxml2 -Iinclude -I/Users/buildslave/jenkins/workspace/clang-stage1-cmake-RA-expensive/llvm/include -fPIC -fvisibility-inlines-hidden -Werror=date-time -Werror=unguarded-availability-new -std=c++14 -Wall -Wextra -Wno-unused-parameter -Wwrite-strings -Wcast-qual -Wmissing-field-initializers -pedantic -Wno-long-long -Wimplicit-fallthrough -Wcovered-switch-default -Wno-noexcept-type -Wnon-virtual-dtor -Wdelete-non-virtual-dtor -Wstring-conversion -fdiagnostics-color -O3  -isysroot /Applications/Xcode.app/Contents/Developer/Platforms/MacOSX.platform/Developer/SDKs/MacOSX10.13.sdk -mmacosx-version-min=10.9   -UNDEBUG  -fno-exceptions -fno-rtti -MD -MT lib/CodeGen/CMakeFiles/LLVMCodeGen.dir/IndirectBrExpandPass.cpp.o -MF lib/CodeGen/CMakeFiles/LLVMCodeGen.dir/IndirectBrExpandPass.cpp.o.d -o lib/CodeGen/CMakeFiles/LLVMCodeGen.dir/IndirectBrExpandPass.cpp.o -c /Users/buildslave/jenkins/workspace/clang-stage1-cmake-RA-expensive/llvm/lib/CodeGen/IndirectBrExpandPass.cpp
[341/4517] /Applications/Xcode.app/Contents/Developer/Toolchains/XcodeDefault.xctoolchain/usr/bin/c++  -DEXPENSIVE_CHECKS -DGTEST_HAS_RTTI=0 -D_DEBUG -D_GLIBCXX_DEBUG -D__STDC_CONSTANT_MACROS -D__STDC_FORMAT_MACROS -D__STDC_LIMIT_MACROS -Ilib/CodeGen -I/Users/buildslave/jenkins/workspace/clang-stage1-cmake-RA-expensive/llvm/lib/CodeGen -I/Applications/Xcode.app/Contents/Developer/Platforms/MacOSX.platform/Developer/SDKs/MacOSX10.13.sdk/usr/include/libxml2 -Iinclude -I/Users/buildslave/jenkins/workspace/clang-stage1-cmake-RA-expensive/llvm/include -fPIC -fvisibility-inlines-hidden -Werror=date-time -Werror=unguarded-availability-new -std=c++14 -Wall -Wextra -Wno-unused-parameter -Wwrite-strings -Wcast-qual -Wmissing-field-initializers -pedantic -Wno-long-long -Wimplicit-fallthrough -Wcovered-switch-default -Wno-noexcept-type -Wnon-virtual-dtor -Wdelete-non-virtual-dtor -Wstring-conversion -fdiagnostics-color -O3  -isysroot /Applications/Xcode.app/Contents/Developer/Platforms/MacOSX.platform/Developer/SDKs/MacOSX10.13.sdk -mmacosx-version-min=10.9   -UNDEBUG  -fno-exceptions -fno-rtti -MD -MT lib/CodeGen/CMakeFiles/LLVMCodeGen.dir/GCRootLowering.cpp.o -MF lib/CodeGen/CMakeFiles/LLVMCodeGen.dir/GCRootLowering.cpp.o.d -o lib/CodeGen/CMakeFiles/LLVMCodeGen.dir/GCRootLowering.cpp.o -c /Users/buildslave/jenkins/workspace/clang-stage1-cmake-RA-expensive/llvm/lib/CodeGen/GCRootLowering.cpp
[342/4517] /Applications/Xcode.app/Contents/Developer/Toolchains/XcodeDefault.xctoolchain/usr/bin/c++  -DEXPENSIVE_CHECKS -DGTEST_HAS_RTTI=0 -D_DEBUG -D_GLIBCXX_DEBUG -D__STDC_CONSTANT_MACROS -D__STDC_FORMAT_MACROS -D__STDC_LIMIT_MACROS -Ilib/CodeGen -I/Users/buildslave/jenkins/workspace/clang-stage1-cmake-RA-expensive/llvm/lib/CodeGen -I/Applications/Xcode.app/Contents/Developer/Platforms/MacOSX.platform/Developer/SDKs/MacOSX10.13.sdk/usr/include/libxml2 -Iinclude -I/Users/buildslave/jenkins/workspace/clang-stage1-cmake-RA-expensive/llvm/include -fPIC -fvisibility-inlines-hidden -Werror=date-time -Werror=unguarded-availability-new -std=c++14 -Wall -Wextra -Wno-unused-parameter -Wwrite-strings -Wcast-qual -Wmissing-field-initializers -pedantic -Wno-long-long -Wimplicit-fallthrough -Wcovered-switch-default -Wno-noexcept-type -Wnon-virtual-dtor -Wdelete-non-virtual-dtor -Wstring-conversion -fdiagnostics-color -O3  -isysroot /Applications/Xcode.app/Contents/Developer/Platforms/MacOSX.platform/Developer/SDKs/MacOSX10.13.sdk -mmacosx-version-min=10.9   -UNDEBUG  -fno-exceptions -fno-rtti -MD -MT lib/CodeGen/CMakeFiles/LLVMCodeGen.dir/GlobalMerge.cpp.o -MF lib/CodeGen/CMakeFiles/LLVMCodeGen.dir/GlobalMerge.cpp.o.d -o lib/CodeGen/CMakeFiles/LLVMCodeGen.dir/GlobalMerge.cpp.o -c /Users/buildslave/jenkins/workspace/clang-stage1-cmake-RA-expensive/llvm/lib/CodeGen/GlobalMerge.cpp
[343/4517] /Applications/Xcode.app/Contents/Developer/Toolchains/XcodeDefault.xctoolchain/usr/bin/c++  -DEXPENSIVE_CHECKS -DGTEST_HAS_RTTI=0 -D_DEBUG -D_GLIBCXX_DEBUG -D__STDC_CONSTANT_MACROS -D__STDC_FORMAT_MACROS -D__STDC_LIMIT_MACROS -Ilib/CodeGen -I/Users/buildslave/jenkins/workspace/clang-stage1-cmake-RA-expensive/llvm/lib/CodeGen -I/Applications/Xcode.app/Contents/Developer/Platforms/MacOSX.platform/Developer/SDKs/MacOSX10.13.sdk/usr/include/libxml2 -Iinclude -I/Users/buildslave/jenkins/workspace/clang-stage1-cmake-RA-expensive/llvm/include -fPIC -fvisibility-inlines-hidden -Werror=date-time -Werror=unguarded-availability-new -std=c++14 -Wall -Wextra -Wno-unused-parameter -Wwrite-strings -Wcast-qual -Wmissing-field-initializers -pedantic -Wno-long-long -Wimplicit-fallthrough -Wcovered-switch-default -Wno-noexcept-type -Wnon-virtual-dtor -Wdelete-non-virtual-dtor -Wstring-conversion -fdiagnostics-color -O3  -isysroot /Applications/Xcode.app/Contents/Developer/Platforms/MacOSX.platform/Developer/SDKs/MacOSX10.13.sdk -mmacosx-version-min=10.9   -UNDEBUG  -fno-exceptions -fno-rtti -MD -MT lib/CodeGen/CMakeFiles/LLVMCodeGen.dir/HardwareLoops.cpp.o -MF lib/CodeGen/CMakeFiles/LLVMCodeGen.dir/HardwareLoops.cpp.o.d -o lib/CodeGen/CMakeFiles/LLVMCodeGen.dir/HardwareLoops.cpp.o -c /Users/buildslave/jenkins/workspace/clang-stage1-cmake-RA-expensive/llvm/lib/CodeGen/HardwareLoops.cpp
[344/4517] /Applications/Xcode.app/Contents/Developer/Toolchains/XcodeDefault.xctoolchain/usr/bin/c++  -DEXPENSIVE_CHECKS -DGTEST_HAS_RTTI=0 -D_DEBUG -D_GLIBCXX_DEBUG -D__STDC_CONSTANT_MACROS -D__STDC_FORMAT_MACROS -D__STDC_LIMIT_MACROS -Ilib/CodeGen -I/Users/buildslave/jenkins/workspace/clang-stage1-cmake-RA-expensive/llvm/lib/CodeGen -I/Applications/Xcode.app/Contents/Developer/Platforms/MacOSX.platform/Developer/SDKs/MacOSX10.13.sdk/usr/include/libxml2 -Iinclude -I/Users/buildslave/jenkins/workspace/clang-stage1-cmake-RA-expensive/llvm/include -fPIC -fvisibility-inlines-hidden -Werror=date-time -Werror=unguarded-availability-new -std=c++14 -Wall -Wextra -Wno-unused-parameter -Wwrite-strings -Wcast-qual -Wmissing-field-initializers -pedantic -Wno-long-long -Wimplicit-fallthrough -Wcovered-switch-default -Wno-noexcept-type -Wnon-virtual-dtor -Wdelete-non-virtual-dtor -Wstring-conversion -fdiagnostics-color -O3  -isysroot /Applications/Xcode.app/Contents/Developer/Platforms/MacOSX.platform/Developer/SDKs/MacOSX10.13.sdk -mmacosx-version-min=10.9   -UNDEBUG  -fno-exceptions -fno-rtti -MD -MT lib/CodeGen/CMakeFiles/LLVMCodeGen.dir/ImplicitNullChecks.cpp.o -MF lib/CodeGen/CMakeFiles/LLVMCodeGen.dir/ImplicitNullChecks.cpp.o.d -o lib/CodeGen/CMakeFiles/LLVMCodeGen.dir/ImplicitNullChecks.cpp.o -c /Users/buildslave/jenkins/workspace/clang-stage1-cmake-RA-expensive/llvm/lib/CodeGen/ImplicitNullChecks.cpp
[345/4517] /Applications/Xcode.app/Contents/Developer/Toolchains/XcodeDefault.xctoolchain/usr/bin/c++  -DEXPENSIVE_CHECKS -DGTEST_HAS_RTTI=0 -D_DEBUG -D_GLIBCXX_DEBUG -D__STDC_CONSTANT_MACROS -D__STDC_FORMAT_MACROS -D__STDC_LIMIT_MACROS -Ilib/CodeGen -I/Users/buildslave/jenkins/workspace/clang-stage1-cmake-RA-expensive/llvm/lib/CodeGen -I/Applications/Xcode.app/Contents/Developer/Platforms/MacOSX.platform/Developer/SDKs/MacOSX10.13.sdk/usr/include/libxml2 -Iinclude -I/Users/buildslave/jenkins/workspace/clang-stage1-cmake-RA-expensive/llvm/include -fPIC -fvisibility-inlines-hidden -Werror=date-time -Werror=unguarded-availability-new -std=c++14 -Wall -Wextra -Wno-unused-parameter -Wwrite-strings -Wcast-qual -Wmissing-field-initializers -pedantic -Wno-long-long -Wimplicit-fallthrough -Wcovered-switch-default -Wno-noexcept-type -Wnon-virtual-dtor -Wdelete-non-virtual-dtor -Wstring-conversion -fdiagnostics-color -O3  -isysroot /Applications/Xcode.app/Contents/Developer/Platforms/MacOSX.platform/Developer/SDKs/MacOSX10.13.sdk -mmacosx-version-min=10.9   -UNDEBUG  -fno-exceptions -fno-rtti -MD -MT lib/CodeGen/CMakeFiles/LLVMCodeGen.dir/InterferenceCache.cpp.o -MF lib/CodeGen/CMakeFiles/LLVMCodeGen.dir/InterferenceCache.cpp.o.d -o lib/CodeGen/CMakeFiles/LLVMCodeGen.dir/InterferenceCache.cpp.o -c /Users/buildslave/jenkins/workspace/clang-stage1-cmake-RA-expensive/llvm/lib/CodeGen/InterferenceCache.cpp
[346/4517] /Applications/Xcode.app/Contents/Developer/Toolchains/XcodeDefault.xctoolchain/usr/bin/c++  -DEXPENSIVE_CHECKS -DGTEST_HAS_RTTI=0 -D_DEBUG -D_GLIBCXX_DEBUG -D__STDC_CONSTANT_MACROS -D__STDC_FORMAT_MACROS -D__STDC_LIMIT_MACROS -Ilib/CodeGen -I/Users/buildslave/jenkins/workspace/clang-stage1-cmake-RA-expensive/llvm/lib/CodeGen -I/Applications/Xcode.app/Contents/Developer/Platforms/MacOSX.platform/Developer/SDKs/MacOSX10.13.sdk/usr/include/libxml2 -Iinclude -I/Users/buildslave/jenkins/workspace/clang-stage1-cmake-RA-expensive/llvm/include -fPIC -fvisibility-inlines-hidden -Werror=date-time -Werror=unguarded-availability-new -std=c++14 -Wall -Wextra -Wno-unused-parameter -Wwrite-strings -Wcast-qual -Wmissing-field-initializers -pedantic -Wno-long-long -Wimplicit-fallthrough -Wcovered-switch-default -Wno-noexcept-type -Wnon-virtual-dtor -Wdelete-non-virtual-dtor -Wstring-conversion -fdiagnostics-color -O3  -isysroot /Applications/Xcode.app/Contents/Developer/Platforms/MacOSX.platform/Developer/SDKs/MacOSX10.13.sdk -mmacosx-version-min=10.9   -UNDEBUG  -fno-exceptions -fno-rtti -MD -MT lib/CodeGen/CMakeFiles/LLVMCodeGen.dir/InterleavedAccessPass.cpp.o -MF lib/CodeGen/CMakeFiles/LLVMCodeGen.dir/InterleavedAccessPass.cpp.o.d -o lib/CodeGen/CMakeFiles/LLVMCodeGen.dir/InterleavedAccessPass.cpp.o -c /Users/buildslave/jenkins/workspace/clang-stage1-cmake-RA-expensive/llvm/lib/CodeGen/InterleavedAccessPass.cpp
[347/4517] /Applications/Xcode.app/Contents/Developer/Toolchains/XcodeDefault.xctoolchain/usr/bin/c++  -DEXPENSIVE_CHECKS -DGTEST_HAS_RTTI=0 -D_DEBUG -D_GLIBCXX_DEBUG -D__STDC_CONSTANT_MACROS -D__STDC_FORMAT_MACROS -D__STDC_LIMIT_MACROS -Ilib/CodeGen -I/Users/buildslave/jenkins/workspace/clang-stage1-cmake-RA-expensive/llvm/lib/CodeGen -I/Applications/Xcode.app/Contents/Developer/Platforms/MacOSX.platform/Developer/SDKs/MacOSX10.13.sdk/usr/include/libxml2 -Iinclude -I/Users/buildslave/jenkins/workspace/clang-stage1-cmake-RA-expensive/llvm/include -fPIC -fvisibility-inlines-hidden -Werror=date-time -Werror=unguarded-availability-new -std=c++14 -Wall -Wextra -Wno-unused-parameter -Wwrite-strings -Wcast-qual -Wmissing-field-initializers -pedantic -Wno-long-long -Wimplicit-fallthrough -Wcovered-switch-default -Wno-noexcept-type -Wnon-virtual-dtor -Wdelete-non-virtual-dtor -Wstring-conversion -fdiagnostics-color -O3  -isysroot /Applications/Xcode.app/Contents/Developer/Platforms/MacOSX.platform/Developer/SDKs/MacOSX10.13.sdk -mmacosx-version-min=10.9   -UNDEBUG  -fno-exceptions -fno-rtti -MD -MT lib/CodeGen/CMakeFiles/LLVMCodeGen.dir/IntrinsicLowering.cpp.o -MF lib/CodeGen/CMakeFiles/LLVMCodeGen.dir/IntrinsicLowering.cpp.o.d -o lib/CodeGen/CMakeFiles/LLVMCodeGen.dir/IntrinsicLowering.cpp.o -c /Users/buildslave/jenkins/workspace/clang-stage1-cmake-RA-expensive/llvm/lib/CodeGen/IntrinsicLowering.cpp
[348/4517] /Applications/Xcode.app/Contents/Developer/Toolchains/XcodeDefault.xctoolchain/usr/bin/c++  -DEXPENSIVE_CHECKS -DGTEST_HAS_RTTI=0 -D_DEBUG -D_GLIBCXX_DEBUG -D__STDC_CONSTANT_MACROS -D__STDC_FORMAT_MACROS -D__STDC_LIMIT_MACROS -Ilib/CodeGen -I/Users/buildslave/jenkins/workspace/clang-stage1-cmake-RA-expensive/llvm/lib/CodeGen -I/Applications/Xcode.app/Contents/Developer/Platforms/MacOSX.platform/Developer/SDKs/MacOSX10.13.sdk/usr/include/libxml2 -Iinclude -I/Users/buildslave/jenkins/workspace/clang-stage1-cmake-RA-expensive/llvm/include -fPIC -fvisibility-inlines-hidden -Werror=date-time -Werror=unguarded-availability-new -std=c++14 -Wall -Wextra -Wno-unused-parameter -Wwrite-strings -Wcast-qual -Wmissing-field-initializers -pedantic -Wno-long-long -Wimplicit-fallthrough -Wcovered-switch-default -Wno-noexcept-type -Wnon-virtual-dtor -Wdelete-non-virtual-dtor -Wstring-conversion -fdiagnostics-color -O3  -isysroot /Applications/Xcode.app/Contents/Developer/Platforms/MacOSX.platform/Developer/SDKs/MacOSX10.13.sdk -mmacosx-version-min=10.9   -UNDEBUG  -fno-exceptions -fno-rtti -MD -MT lib/CodeGen/CMakeFiles/LLVMCodeGen.dir/LatencyPriorityQueue.cpp.o -MF lib/CodeGen/CMakeFiles/LLVMCodeGen.dir/LatencyPriorityQueue.cpp.o.d -o lib/CodeGen/CMakeFiles/LLVMCodeGen.dir/LatencyPriorityQueue.cpp.o -c /Users/buildslave/jenkins/workspace/clang-stage1-cmake-RA-expensive/llvm/lib/CodeGen/LatencyPriorityQueue.cpp
[349/4517] /Applications/Xcode.app/Contents/Developer/Toolchains/XcodeDefault.xctoolchain/usr/bin/c++  -DEXPENSIVE_CHECKS -DGTEST_HAS_RTTI=0 -D_DEBUG -D_GLIBCXX_DEBUG -D__STDC_CONSTANT_MACROS -D__STDC_FORMAT_MACROS -D__STDC_LIMIT_MACROS -Ilib/CodeGen -I/Users/buildslave/jenkins/workspace/clang-stage1-cmake-RA-expensive/llvm/lib/CodeGen -I/Applications/Xcode.app/Contents/Developer/Platforms/MacOSX.platform/Developer/SDKs/MacOSX10.13.sdk/usr/include/libxml2 -Iinclude -I/Users/buildslave/jenkins/workspace/clang-stage1-cmake-RA-expensive/llvm/include -fPIC -fvisibility-inlines-hidden -Werror=date-time -Werror=unguarded-availability-new -std=c++14 -Wall -Wextra -Wno-unused-parameter -Wwrite-strings -Wcast-qual -Wmissing-field-initializers -pedantic -Wno-long-long -Wimplicit-fallthrough -Wcovered-switch-default -Wno-noexcept-type -Wnon-virtual-dtor -Wdelete-non-virtual-dtor -Wstring-conversion -fdiagnostics-color -O3  -isysroot /Applications/Xcode.app/Contents/Developer/Platforms/MacOSX.platform/Developer/SDKs/MacOSX10.13.sdk -mmacosx-version-min=10.9   -UNDEBUG  -fno-exceptions -fno-rtti -MD -MT lib/CodeGen/CMakeFiles/LLVMCodeGen.dir/IfConversion.cpp.o -MF lib/CodeGen/CMakeFiles/LLVMCodeGen.dir/IfConversion.cpp.o.d -o lib/CodeGen/CMakeFiles/LLVMCodeGen.dir/IfConversion.cpp.o -c /Users/buildslave/jenkins/workspace/clang-stage1-cmake-RA-expensive/llvm/lib/CodeGen/IfConversion.cpp
[350/4517] /Applications/Xcode.app/Contents/Developer/Toolchains/XcodeDefault.xctoolchain/usr/bin/c++  -DEXPENSIVE_CHECKS -DGTEST_HAS_RTTI=0 -D_DEBUG -D_GLIBCXX_DEBUG -D__STDC_CONSTANT_MACROS -D__STDC_FORMAT_MACROS -D__STDC_LIMIT_MACROS -Ilib/CodeGen -I/Users/buildslave/jenkins/workspace/clang-stage1-cmake-RA-expensive/llvm/lib/CodeGen -I/Applications/Xcode.app/Contents/Developer/Platforms/MacOSX.platform/Developer/SDKs/MacOSX10.13.sdk/usr/include/libxml2 -Iinclude -I/Users/buildslave/jenkins/workspace/clang-stage1-cmake-RA-expensive/llvm/include -fPIC -fvisibility-inlines-hidden -Werror=date-time -Werror=unguarded-availability-new -std=c++14 -Wall -Wextra -Wno-unused-parameter -Wwrite-strings -Wcast-qual -Wmissing-field-initializers -pedantic -Wno-long-long -Wimplicit-fallthrough -Wcovered-switch-default -Wno-noexcept-type -Wnon-virtual-dtor -Wdelete-non-virtual-dtor -Wstring-conversion -fdiagnostics-color -O3  -isysroot /Applications/Xcode.app/Contents/Developer/Platforms/MacOSX.platform/Developer/SDKs/MacOSX10.13.sdk -mmacosx-version-min=10.9   -UNDEBUG  -fno-exceptions -fno-rtti -MD -MT lib/CodeGen/CMakeFiles/LLVMCodeGen.dir/LazyMachineBlockFrequencyInfo.cpp.o -MF lib/CodeGen/CMakeFiles/LLVMCodeGen.dir/LazyMachineBlockFrequencyInfo.cpp.o.d -o lib/CodeGen/CMakeFiles/LLVMCodeGen.dir/LazyMachineBlockFrequencyInfo.cpp.o -c /Users/buildslave/jenkins/workspace/clang-stage1-cmake-RA-expensive/llvm/lib/CodeGen/LazyMachineBlockFrequencyInfo.cpp
[351/4517] /Applications/Xcode.app/Contents/Developer/Toolchains/XcodeDefault.xctoolchain/usr/bin/c++  -DEXPENSIVE_CHECKS -DGTEST_HAS_RTTI=0 -D_DEBUG -D_GLIBCXX_DEBUG -D__STDC_CONSTANT_MACROS -D__STDC_FORMAT_MACROS -D__STDC_LIMIT_MACROS -Ilib/CodeGen -I/Users/buildslave/jenkins/workspace/clang-stage1-cmake-RA-expensive/llvm/lib/CodeGen -I/Applications/Xcode.app/Contents/Developer/Platforms/MacOSX.platform/Developer/SDKs/MacOSX10.13.sdk/usr/include/libxml2 -Iinclude -I/Users/buildslave/jenkins/workspace/clang-stage1-cmake-RA-expensive/llvm/include -fPIC -fvisibility-inlines-hidden -Werror=date-time -Werror=unguarded-availability-new -std=c++14 -Wall -Wextra -Wno-unused-parameter -Wwrite-strings -Wcast-qual -Wmissing-field-initializers -pedantic -Wno-long-long -Wimplicit-fallthrough -Wcovered-switch-default -Wno-noexcept-type -Wnon-virtual-dtor -Wdelete-non-virtual-dtor -Wstring-conversion -fdiagnostics-color -O3  -isysroot /Applications/Xcode.app/Contents/Developer/Platforms/MacOSX.platform/Developer/SDKs/MacOSX10.13.sdk -mmacosx-version-min=10.9   -UNDEBUG  -fno-exceptions -fno-rtti -MD -MT lib/CodeGen/CMakeFiles/LLVMCodeGen.dir/LexicalScopes.cpp.o -MF lib/CodeGen/CMakeFiles/LLVMCodeGen.dir/LexicalScopes.cpp.o.d -o lib/CodeGen/CMakeFiles/LLVMCodeGen.dir/LexicalScopes.cpp.o -c /Users/buildslave/jenkins/workspace/clang-stage1-cmake-RA-expensive/llvm/lib/CodeGen/LexicalScopes.cpp
[352/4517] /Applications/Xcode.app/Contents/Developer/Toolchains/XcodeDefault.xctoolchain/usr/bin/c++  -DEXPENSIVE_CHECKS -DGTEST_HAS_RTTI=0 -D_DEBUG -D_GLIBCXX_DEBUG -D__STDC_CONSTANT_MACROS -D__STDC_FORMAT_MACROS -D__STDC_LIMIT_MACROS -Ilib/CodeGen -I/Users/buildslave/jenkins/workspace/clang-stage1-cmake-RA-expensive/llvm/lib/CodeGen -I/Applications/Xcode.app/Contents/Developer/Platforms/MacOSX.platform/Developer/SDKs/MacOSX10.13.sdk/usr/include/libxml2 -Iinclude -I/Users/buildslave/jenkins/workspace/clang-stage1-cmake-RA-expensive/llvm/include -fPIC -fvisibility-inlines-hidden -Werror=date-time -Werror=unguarded-availability-new -std=c++14 -Wall -Wextra -Wno-unused-parameter -Wwrite-strings -Wcast-qual -Wmissing-field-initializers -pedantic -Wno-long-long -Wimplicit-fallthrough -Wcovered-switch-default -Wno-noexcept-type -Wnon-virtual-dtor -Wdelete-non-virtual-dtor -Wstring-conversion -fdiagnostics-color -O3  -isysroot /Applications/Xcode.app/Contents/Developer/Platforms/MacOSX.platform/Developer/SDKs/MacOSX10.13.sdk -mmacosx-version-min=10.9   -UNDEBUG  -fno-exceptions -fno-rtti -MD -MT lib/CodeGen/CMakeFiles/LLVMCodeGen.dir/InlineSpiller.cpp.o -MF lib/CodeGen/CMakeFiles/LLVMCodeGen.dir/InlineSpiller.cpp.o.d -o lib/CodeGen/CMakeFiles/LLVMCodeGen.dir/InlineSpiller.cpp.o -c /Users/buildslave/jenkins/workspace/clang-stage1-cmake-RA-expensive/llvm/lib/CodeGen/InlineSpiller.cpp
[353/4517] /Applications/Xcode.app/Contents/Developer/Toolchains/XcodeDefault.xctoolchain/usr/bin/c++  -DEXPENSIVE_CHECKS -DGTEST_HAS_RTTI=0 -D_DEBUG -D_GLIBCXX_DEBUG -D__STDC_CONSTANT_MACROS -D__STDC_FORMAT_MACROS -D__STDC_LIMIT_MACROS -Ilib/CodeGen -I/Users/buildslave/jenkins/workspace/clang-stage1-cmake-RA-expensive/llvm/lib/CodeGen -I/Applications/Xcode.app/Contents/Developer/Platforms/MacOSX.platform/Developer/SDKs/MacOSX10.13.sdk/usr/include/libxml2 -Iinclude -I/Users/buildslave/jenkins/workspace/clang-stage1-cmake-RA-expensive/llvm/include -fPIC -fvisibility-inlines-hidden -Werror=date-time -Werror=unguarded-availability-new -std=c++14 -Wall -Wextra -Wno-unused-parameter -Wwrite-strings -Wcast-qual -Wmissing-field-initializers -pedantic -Wno-long-long -Wimplicit-fallthrough -Wcovered-switch-default -Wno-noexcept-type -Wnon-virtual-dtor -Wdelete-non-virtual-dtor -Wstring-conversion -fdiagnostics-color -O3  -isysroot /Applications/Xcode.app/Contents/Developer/Platforms/MacOSX.platform/Developer/SDKs/MacOSX10.13.sdk -mmacosx-version-min=10.9   -UNDEBUG  -fno-exceptions -fno-rtti -MD -MT lib/CodeGen/CMakeFiles/LLVMCodeGen.dir/CodeGenPrepare.cpp.o -MF lib/CodeGen/CMakeFiles/LLVMCodeGen.dir/CodeGenPrepare.cpp.o.d -o lib/CodeGen/CMakeFiles/LLVMCodeGen.dir/CodeGenPrepare.cpp.o -c /Users/buildslave/jenkins/workspace/clang-stage1-cmake-RA-expensive/llvm/lib/CodeGen/CodeGenPrepare.cpp
[354/4517] /Applications/Xcode.app/Contents/Developer/Toolchains/XcodeDefault.xctoolchain/usr/bin/c++  -DEXPENSIVE_CHECKS -DGTEST_HAS_RTTI=0 -D_DEBUG -D_GLIBCXX_DEBUG -D__STDC_CONSTANT_MACROS -D__STDC_FORMAT_MACROS -D__STDC_LIMIT_MACROS -Ilib/CodeGen -I/Users/buildslave/jenkins/workspace/clang-stage1-cmake-RA-expensive/llvm/lib/CodeGen -I/Applications/Xcode.app/Contents/Developer/Platforms/MacOSX.platform/Developer/SDKs/MacOSX10.13.sdk/usr/include/libxml2 -Iinclude -I/Users/buildslave/jenkins/workspace/clang-stage1-cmake-RA-expensive/llvm/include -fPIC -fvisibility-inlines-hidden -Werror=date-time -Werror=unguarded-availability-new -std=c++14 -Wall -Wextra -Wno-unused-parameter -Wwrite-strings -Wcast-qual -Wmissing-field-initializers -pedantic -Wno-long-long -Wimplicit-fallthrough -Wcovered-switch-default -Wno-noexcept-type -Wnon-virtual-dtor -Wdelete-non-virtual-dtor -Wstring-conversion -fdiagnostics-color -O3  -isysroot /Applications/Xcode.app/Contents/Developer/Platforms/MacOSX.platform/Developer/SDKs/MacOSX10.13.sdk -mmacosx-version-min=10.9   -UNDEBUG  -fno-exceptions -fno-rtti -MD -MT lib/CodeGen/CMakeFiles/LLVMCodeGen.dir/InterleavedLoadCombinePass.cpp.o -MF lib/CodeGen/CMakeFiles/LLVMCodeGen.dir/InterleavedLoadCombinePass.cpp.o.d -o lib/CodeGen/CMakeFiles/LLVMCodeGen.dir/InterleavedLoadCombinePass.cpp.o -c /Users/buildslave/jenkins/workspace/clang-stage1-cmake-RA-expensive/llvm/lib/CodeGen/InterleavedLoadCombinePass.cpp
[355/4517] /Applications/Xcode.app/Contents/Developer/Toolchains/XcodeDefault.xctoolchain/usr/bin/c++  -DEXPENSIVE_CHECKS -DGTEST_HAS_RTTI=0 -D_DEBUG -D_GLIBCXX_DEBUG -D__STDC_CONSTANT_MACROS -D__STDC_FORMAT_MACROS -D__STDC_LIMIT_MACROS -Ilib/CodeGen -I/Users/buildslave/jenkins/workspace/clang-stage1-cmake-RA-expensive/llvm/lib/CodeGen -I/Applications/Xcode.app/Contents/Developer/Platforms/MacOSX.platform/Developer/SDKs/MacOSX10.13.sdk/usr/include/libxml2 -Iinclude -I/Users/buildslave/jenkins/workspace/clang-stage1-cmake-RA-expensive/llvm/include -fPIC -fvisibility-inlines-hidden -Werror=date-time -Werror=unguarded-availability-new -std=c++14 -Wall -Wextra -Wno-unused-parameter -Wwrite-strings -Wcast-qual -Wmissing-field-initializers -pedantic -Wno-long-long -Wimplicit-fallthrough -Wcovered-switch-default -Wno-noexcept-type -Wnon-virtual-dtor -Wdelete-non-virtual-dtor -Wstring-conversion -fdiagnostics-color -O3  -isysroot /Applications/Xcode.app/Contents/Developer/Platforms/MacOSX.platform/Developer/SDKs/MacOSX10.13.sdk -mmacosx-version-min=10.9   -UNDEBUG  -fno-exceptions -fno-rtti -MD -MT lib/CodeGen/CMakeFiles/LLVMCodeGen.dir/LivePhysRegs.cpp.o -MF lib/CodeGen/CMakeFiles/LLVMCodeGen.dir/LivePhysRegs.cpp.o.d -o lib/CodeGen/CMakeFiles/LLVMCodeGen.dir/LivePhysRegs.cpp.o -c /Users/buildslave/jenkins/workspace/clang-stage1-cmake-RA-expensive/llvm/lib/CodeGen/LivePhysRegs.cpp
[356/4517] /Applications/Xcode.app/Contents/Developer/Toolchains/XcodeDefault.xctoolchain/usr/bin/c++  -DEXPENSIVE_CHECKS -DGTEST_HAS_RTTI=0 -D_DEBUG -D_GLIBCXX_DEBUG -D__STDC_CONSTANT_MACROS -D__STDC_FORMAT_MACROS -D__STDC_LIMIT_MACROS -Ilib/CodeGen -I/Users/buildslave/jenkins/workspace/clang-stage1-cmake-RA-expensive/llvm/lib/CodeGen -I/Applications/Xcode.app/Contents/Developer/Platforms/MacOSX.platform/Developer/SDKs/MacOSX10.13.sdk/usr/include/libxml2 -Iinclude -I/Users/buildslave/jenkins/workspace/clang-stage1-cmake-RA-expensive/llvm/include -fPIC -fvisibility-inlines-hidden -Werror=date-time -Werror=unguarded-availability-new -std=c++14 -Wall -Wextra -Wno-unused-parameter -Wwrite-strings -Wcast-qual -Wmissing-field-initializers -pedantic -Wno-long-long -Wimplicit-fallthrough -Wcovered-switch-default -Wno-noexcept-type -Wnon-virtual-dtor -Wdelete-non-virtual-dtor -Wstring-conversion -fdiagnostics-color -O3  -isysroot /Applications/Xcode.app/Contents/Developer/Platforms/MacOSX.platform/Developer/SDKs/MacOSX10.13.sdk -mmacosx-version-min=10.9   -UNDEBUG  -fno-exceptions -fno-rtti -MD -MT lib/CodeGen/CMakeFiles/LLVMCodeGen.dir/LiveIntervalUnion.cpp.o -MF lib/CodeGen/CMakeFiles/LLVMCodeGen.dir/LiveIntervalUnion.cpp.o.d -o lib/CodeGen/CMakeFiles/LLVMCodeGen.dir/LiveIntervalUnion.cpp.o -c /Users/buildslave/jenkins/workspace/clang-stage1-cmake-RA-expensive/llvm/lib/CodeGen/LiveIntervalUnion.cpp
[357/4517] /Applications/Xcode.app/Contents/Developer/Toolchains/XcodeDefault.xctoolchain/usr/bin/c++  -DEXPENSIVE_CHECKS -DGTEST_HAS_RTTI=0 -D_DEBUG -D_GLIBCXX_DEBUG -D__STDC_CONSTANT_MACROS -D__STDC_FORMAT_MACROS -D__STDC_LIMIT_MACROS -Ilib/CodeGen -I/Users/buildslave/jenkins/workspace/clang-stage1-cmake-RA-expensive/llvm/lib/CodeGen -I/Applications/Xcode.app/Contents/Developer/Platforms/MacOSX.platform/Developer/SDKs/MacOSX10.13.sdk/usr/include/libxml2 -Iinclude -I/Users/buildslave/jenkins/workspace/clang-stage1-cmake-RA-expensive/llvm/include -fPIC -fvisibility-inlines-hidden -Werror=date-time -Werror=unguarded-availability-new -std=c++14 -Wall -Wextra -Wno-unused-parameter -Wwrite-strings -Wcast-qual -Wmissing-field-initializers -pedantic -Wno-long-long -Wimplicit-fallthrough -Wcovered-switch-default -Wno-noexcept-type -Wnon-virtual-dtor -Wdelete-non-virtual-dtor -Wstring-conversion -fdiagnostics-color -O3  -isysroot /Applications/Xcode.app/Contents/Developer/Platforms/MacOSX.platform/Developer/SDKs/MacOSX10.13.sdk -mmacosx-version-min=10.9   -UNDEBUG  -fno-exceptions -fno-rtti -MD -MT lib/CodeGen/CMakeFiles/LLVMCodeGen.dir/LiveRangeShrink.cpp.o -MF lib/CodeGen/CMakeFiles/LLVMCodeGen.dir/LiveRangeShrink.cpp.o.d -o lib/CodeGen/CMakeFiles/LLVMCodeGen.dir/LiveRangeShrink.cpp.o -c /Users/buildslave/jenkins/workspace/clang-stage1-cmake-RA-expensive/llvm/lib/CodeGen/LiveRangeShrink.cpp
[358/4517] /Applications/Xcode.app/Contents/Developer/Toolchains/XcodeDefault.xctoolchain/usr/bin/c++  -DEXPENSIVE_CHECKS -DGTEST_HAS_RTTI=0 -D_DEBUG -D_GLIBCXX_DEBUG -D__STDC_CONSTANT_MACROS -D__STDC_FORMAT_MACROS -D__STDC_LIMIT_MACROS -Ilib/CodeGen -I/Users/buildslave/jenkins/workspace/clang-stage1-cmake-RA-expensive/llvm/lib/CodeGen -I/Applications/Xcode.app/Contents/Developer/Platforms/MacOSX.platform/Developer/SDKs/MacOSX10.13.sdk/usr/include/libxml2 -Iinclude -I/Users/buildslave/jenkins/workspace/clang-stage1-cmake-RA-expensive/llvm/include -fPIC -fvisibility-inlines-hidden -Werror=date-time -Werror=unguarded-availability-new -std=c++14 -Wall -Wextra -Wno-unused-parameter -Wwrite-strings -Wcast-qual -Wmissing-field-initializers -pedantic -Wno-long-long -Wimplicit-fallthrough -Wcovered-switch-default -Wno-noexcept-type -Wnon-virtual-dtor -Wdelete-non-virtual-dtor -Wstring-conversion -fdiagnostics-color -O3  -isysroot /Applications/Xcode.app/Contents/Developer/Platforms/MacOSX.platform/Developer/SDKs/MacOSX10.13.sdk -mmacosx-version-min=10.9   -UNDEBUG  -fno-exceptions -fno-rtti -MD -MT lib/CodeGen/CMakeFiles/LLVMCodeGen.dir/LiveRangeCalc.cpp.o -MF lib/CodeGen/CMakeFiles/LLVMCodeGen.dir/LiveRangeCalc.cpp.o.d -o lib/CodeGen/CMakeFiles/LLVMCodeGen.dir/LiveRangeCalc.cpp.o -c /Users/buildslave/jenkins/workspace/clang-stage1-cmake-RA-expensive/llvm/lib/CodeGen/LiveRangeCalc.cpp
[359/4517] /Applications/Xcode.app/Contents/Developer/Toolchains/XcodeDefault.xctoolchain/usr/bin/c++  -DEXPENSIVE_CHECKS -DGTEST_HAS_RTTI=0 -D_DEBUG -D_GLIBCXX_DEBUG -D__STDC_CONSTANT_MACROS -D__STDC_FORMAT_MACROS -D__STDC_LIMIT_MACROS -Ilib/CodeGen -I/Users/buildslave/jenkins/workspace/clang-stage1-cmake-RA-expensive/llvm/lib/CodeGen -I/Applications/Xcode.app/Contents/Developer/Platforms/MacOSX.platform/Developer/SDKs/MacOSX10.13.sdk/usr/include/libxml2 -Iinclude -I/Users/buildslave/jenkins/workspace/clang-stage1-cmake-RA-expensive/llvm/include -fPIC -fvisibility-inlines-hidden -Werror=date-time -Werror=unguarded-availability-new -std=c++14 -Wall -Wextra -Wno-unused-parameter -Wwrite-strings -Wcast-qual -Wmissing-field-initializers -pedantic -Wno-long-long -Wimplicit-fallthrough -Wcovered-switch-default -Wno-noexcept-type -Wnon-virtual-dtor -Wdelete-non-virtual-dtor -Wstring-conversion -fdiagnostics-color -O3  -isysroot /Applications/Xcode.app/Contents/Developer/Platforms/MacOSX.platform/Developer/SDKs/MacOSX10.13.sdk -mmacosx-version-min=10.9   -UNDEBUG  -fno-exceptions -fno-rtti -MD -MT lib/CodeGen/CMakeFiles/LLVMCodeGen.dir/LiveInterval.cpp.o -MF lib/CodeGen/CMakeFiles/LLVMCodeGen.dir/LiveInterval.cpp.o.d -o lib/CodeGen/CMakeFiles/LLVMCodeGen.dir/LiveInterval.cpp.o -c /Users/buildslave/jenkins/workspace/clang-stage1-cmake-RA-expensive/llvm/lib/CodeGen/LiveInterval.cpp
[360/4517] /Applications/Xcode.app/Contents/Developer/Toolchains/XcodeDefault.xctoolchain/usr/bin/c++  -DEXPENSIVE_CHECKS -DGTEST_HAS_RTTI=0 -D_DEBUG -D_GLIBCXX_DEBUG -D__STDC_CONSTANT_MACROS -D__STDC_FORMAT_MACROS -D__STDC_LIMIT_MACROS -Ilib/CodeGen -I/Users/buildslave/jenkins/workspace/clang-stage1-cmake-RA-expensive/llvm/lib/CodeGen -I/Applications/Xcode.app/Contents/Developer/Platforms/MacOSX.platform/Developer/SDKs/MacOSX10.13.sdk/usr/include/libxml2 -Iinclude -I/Users/buildslave/jenkins/workspace/clang-stage1-cmake-RA-expensive/llvm/include -fPIC -fvisibility-inlines-hidden -Werror=date-time -Werror=unguarded-availability-new -std=c++14 -Wall -Wextra -Wno-unused-parameter -Wwrite-strings -Wcast-qual -Wmissing-field-initializers -pedantic -Wno-long-long -Wimplicit-fallthrough -Wcovered-switch-default -Wno-noexcept-type -Wnon-virtual-dtor -Wdelete-non-virtual-dtor -Wstring-conversion -fdiagnostics-color -O3  -isysroot /Applications/Xcode.app/Contents/Developer/Platforms/MacOSX.platform/Developer/SDKs/MacOSX10.13.sdk -mmacosx-version-min=10.9   -UNDEBUG  -fno-exceptions -fno-rtti -MD -MT lib/CodeGen/CMakeFiles/LLVMCodeGen.dir/LiveIntervals.cpp.o -MF lib/CodeGen/CMakeFiles/LLVMCodeGen.dir/LiveIntervals.cpp.o.d -o lib/CodeGen/CMakeFiles/LLVMCodeGen.dir/LiveIntervals.cpp.o -c /Users/buildslave/jenkins/workspace/clang-stage1-cmake-RA-expensive/llvm/lib/CodeGen/LiveIntervals.cpp
FATAL: command execution failed
java.io.IOException
	at hudson.remoting.Channel.close(Channel.java:1428)
	at hudson.remoting.Channel.close(Channel.java:1405)
	at hudson.slaves.SlaveComputer.closeChannel(SlaveComputer.java:844)
	at hudson.slaves.SlaveComputer.kill(SlaveComputer.java:811)
	at hudson.model.AbstractCIBase.killComputer(AbstractCIBase.java:89)
	at jenkins.model.Jenkins.access$2100(Jenkins.java:309)
	at jenkins.model.Jenkins$19.run(Jenkins.java:3425)
	at hudson.model.Queue._withLock(Queue.java:1379)
	at hudson.model.Queue.withLock(Queue.java:1256)
	at jenkins.model.Jenkins._cleanUpDisconnectComputers(Jenkins.java:3419)
	at jenkins.model.Jenkins.cleanUp(Jenkins.java:3297)
	at hudson.WebAppMain.contextDestroyed(WebAppMain.java:379)
	at org.eclipse.jetty.server.handler.ContextHandler.callContextDestroyed(ContextHandler.java:965)
	at org.eclipse.jetty.servlet.ServletContextHandler.callContextDestroyed(ServletContextHandler.java:566)
	at org.eclipse.jetty.server.handler.ContextHandler.stopContext(ContextHandler.java:942)
	at org.eclipse.jetty.servlet.ServletContextHandler.stopContext(ServletContextHandler.java:376)
	at org.eclipse.jetty.webapp.WebAppContext.stopWebapp(WebAppContext.java:1503)
	at org.eclipse.jetty.webapp.WebAppContext.stopContext(WebAppContext.java:1467)
	at org.eclipse.jetty.server.handler.ContextHandler.doStop(ContextHandler.java:1009)
	at org.eclipse.jetty.servlet.ServletContextHandler.doStop(ServletContextHandler.java:288)
	at org.eclipse.jetty.webapp.WebAppContext.doStop(WebAppContext.java:569)
	at org.eclipse.jetty.util.component.AbstractLifeCycle.stop(AbstractLifeCycle.java:89)
	at org.eclipse.jetty.util.component.ContainerLifeCycle.stop(ContainerLifeCycle.java:149)
	at org.eclipse.jetty.util.component.ContainerLifeCycle.doStop(ContainerLifeCycle.java:170)
	at org.eclipse.jetty.server.handler.AbstractHandler.doStop(AbstractHandler.java:124)
	at org.eclipse.jetty.server.Server.doStop(Server.java:461)
	at org.eclipse.jetty.util.component.AbstractLifeCycle.stop(AbstractLifeCycle.java:89)
	at winstone.Launcher.shutdown(Launcher.java:310)
	at winstone.ShutdownHook.run(ShutdownHook.java:25)
Caused: hudson.remoting.ChannelClosedException: Channel "unknown": Remote call on green-dragon-02 failed. The channel is closing down or has closed down
	at hudson.remoting.Channel.call(Channel.java:950)
	at hudson.remoting.RemoteInvocationHandler.invoke(RemoteInvocationHandler.java:283)
	at com.sun.proxy.$Proxy96.isAlive(Unknown Source)
	at hudson.Launcher$RemoteLauncher$ProcImpl.isAlive(Launcher.java:1150)
	at hudson.Launcher$RemoteLauncher$ProcImpl.join(Launcher.java:1142)
	at hudson.tasks.CommandInterpreter.join(CommandInterpreter.java:155)
	at hudson.tasks.CommandInterpreter.perform(CommandInterpreter.java:109)
	at hudson.tasks.CommandInterpreter.perform(CommandInterpreter.java:66)
	at hudson.tasks.BuildStepMonitor$1.perform(BuildStepMonitor.java:20)
	at hudson.model.AbstractBuild$AbstractBuildExecution.perform(AbstractBuild.java:741)
	at hudson.model.Build$BuildExecution.build(Build.java:206)
	at hudson.model.Build$BuildExecution.doRun(Build.java:163)
	at hudson.model.AbstractBuild$AbstractBuildExecution.run(AbstractBuild.java:504)
	at hudson.model.Run.execute(Run.java:1818)
	at hudson.model.FreeStyleBuild.run(FreeStyleBuild.java:43)
	at hudson.model.ResourceController.execute(ResourceController.java:97)
	at hudson.model.Executor.run(Executor.java:429)
FATAL: Unable to delete script file /var/folders/9t/lrs73ptj6lv644zvh1fk2_gc0000gn/T/jenkins1321948752211495413.sh
java.io.IOException
	at hudson.remoting.Channel.close(Channel.java:1428)
	at hudson.remoting.Channel.close(Channel.java:1405)
	at hudson.slaves.SlaveComputer.closeChannel(SlaveComputer.java:844)
	at hudson.slaves.SlaveComputer.kill(SlaveComputer.java:811)
	at hudson.model.AbstractCIBase.killComputer(AbstractCIBase.java:89)
	at jenkins.model.Jenkins.access$2100(Jenkins.java:309)
	at jenkins.model.Jenkins$19.run(Jenkins.java:3425)
	at hudson.model.Queue._withLock(Queue.java:1379)
	at hudson.model.Queue.withLock(Queue.java:1256)
	at jenkins.model.Jenkins._cleanUpDisconnectComputers(Jenkins.java:3419)
	at jenkins.model.Jenkins.cleanUp(Jenkins.java:3297)
	at hudson.WebAppMain.contextDestroyed(WebAppMain.java:379)
	at org.eclipse.jetty.server.handler.ContextHandler.callContextDestroyed(ContextHandler.java:965)
	at org.eclipse.jetty.servlet.ServletContextHandler.callContextDestroyed(ServletContextHandler.java:566)
	at org.eclipse.jetty.server.handler.ContextHandler.stopContext(ContextHandler.java:942)
	at org.eclipse.jetty.servlet.ServletContextHandler.stopContext(ServletContextHandler.java:376)
	at org.eclipse.jetty.webapp.WebAppContext.stopWebapp(WebAppContext.java:1503)
	at org.eclipse.jetty.webapp.WebAppContext.stopContext(WebAppContext.java:1467)
	at org.eclipse.jetty.server.handler.ContextHandler.doStop(ContextHandler.java:1009)
	at org.eclipse.jetty.servlet.ServletContextHandler.doStop(ServletContextHandler.java:288)
	at org.eclipse.jetty.webapp.WebAppContext.doStop(WebAppContext.java:569)
	at org.eclipse.jetty.util.component.AbstractLifeCycle.stop(AbstractLifeCycle.java:89)
	at org.eclipse.jetty.util.component.ContainerLifeCycle.stop(ContainerLifeCycle.java:149)
	at org.eclipse.jetty.util.component.ContainerLifeCycle.doStop(ContainerLifeCycle.java:170)
	at org.eclipse.jetty.server.handler.AbstractHandler.doStop(AbstractHandler.java:124)
	at org.eclipse.jetty.server.Server.doStop(Server.java:461)
	at org.eclipse.jetty.util.component.AbstractLifeCycle.stop(AbstractLifeCycle.java:89)
	at winstone.Launcher.shutdown(Launcher.java:310)
	at winstone.ShutdownHook.run(ShutdownHook.java:25)
Caused: hudson.remoting.ChannelClosedException: Channel "unknown": Remote call on green-dragon-02 failed. The channel is closing down or has closed down
	at hudson.remoting.Channel.call(Channel.java:950)
	at hudson.FilePath.act(FilePath.java:1070)
	at hudson.FilePath.act(FilePath.java:1059)
	at hudson.FilePath.delete(FilePath.java:1540)
	at hudson.tasks.CommandInterpreter.perform(CommandInterpreter.java:123)
	at hudson.tasks.CommandInterpreter.perform(CommandInterpreter.java:66)
	at hudson.tasks.BuildStepMonitor$1.perform(BuildStepMonitor.java:20)
	at hudson.model.AbstractBuild$AbstractBuildExecution.perform(AbstractBuild.java:741)
	at hudson.model.Build$BuildExecution.build(Build.java:206)
	at hudson.model.Build$BuildExecution.doRun(Build.java:163)
	at hudson.model.AbstractBuild$AbstractBuildExecution.run(AbstractBuild.java:504)
	at hudson.model.Run.execute(Run.java:1818)
	at hudson.model.FreeStyleBuild.run(FreeStyleBuild.java:43)
	at hudson.model.ResourceController.execute(ResourceController.java:97)
	at hudson.model.Executor.run(Executor.java:429)
Build step 'Execute shell' marked build as failure
ERROR: Step ‘Publish JUnit test result report’ failed: no workspace for clang-stage1-cmake-RA-expensive #14920
[BFA] Scanning build for known causes...
[BFA] No failure causes found
[BFA] Done. 0s
No emails were triggered.
Finished: FAILURE