FailedConsole Output

Skipping 181 KB.. Full Log
000gn/T/tmp.V8lXPf4b/llvm-install/include/c++/v1/bit
-- Installing: /var/folders/9t/lrs73ptj6lv644zvh1fk2_gc0000gn/T/tmp.V8lXPf4b/llvm-install/include/c++/v1/bitset
-- Installing: /var/folders/9t/lrs73ptj6lv644zvh1fk2_gc0000gn/T/tmp.V8lXPf4b/llvm-install/include/c++/v1/cassert
-- Installing: /var/folders/9t/lrs73ptj6lv644zvh1fk2_gc0000gn/T/tmp.V8lXPf4b/llvm-install/include/c++/v1/ccomplex
-- Installing: /var/folders/9t/lrs73ptj6lv644zvh1fk2_gc0000gn/T/tmp.V8lXPf4b/llvm-install/include/c++/v1/cctype
-- Installing: /var/folders/9t/lrs73ptj6lv644zvh1fk2_gc0000gn/T/tmp.V8lXPf4b/llvm-install/include/c++/v1/cerrno
-- Installing: /var/folders/9t/lrs73ptj6lv644zvh1fk2_gc0000gn/T/tmp.V8lXPf4b/llvm-install/include/c++/v1/cfenv
-- Installing: /var/folders/9t/lrs73ptj6lv644zvh1fk2_gc0000gn/T/tmp.V8lXPf4b/llvm-install/include/c++/v1/cfloat
-- Installing: /var/folders/9t/lrs73ptj6lv644zvh1fk2_gc0000gn/T/tmp.V8lXPf4b/llvm-install/include/c++/v1/charconv
-- Installing: /var/folders/9t/lrs73ptj6lv644zvh1fk2_gc0000gn/T/tmp.V8lXPf4b/llvm-install/include/c++/v1/chrono
-- Installing: /var/folders/9t/lrs73ptj6lv644zvh1fk2_gc0000gn/T/tmp.V8lXPf4b/llvm-install/include/c++/v1/cinttypes
-- Installing: /var/folders/9t/lrs73ptj6lv644zvh1fk2_gc0000gn/T/tmp.V8lXPf4b/llvm-install/include/c++/v1/ciso646
-- Installing: /var/folders/9t/lrs73ptj6lv644zvh1fk2_gc0000gn/T/tmp.V8lXPf4b/llvm-install/include/c++/v1/climits
-- Installing: /var/folders/9t/lrs73ptj6lv644zvh1fk2_gc0000gn/T/tmp.V8lXPf4b/llvm-install/include/c++/v1/clocale
-- Installing: /var/folders/9t/lrs73ptj6lv644zvh1fk2_gc0000gn/T/tmp.V8lXPf4b/llvm-install/include/c++/v1/cmath
-- Installing: /var/folders/9t/lrs73ptj6lv644zvh1fk2_gc0000gn/T/tmp.V8lXPf4b/llvm-install/include/c++/v1/codecvt
-- Installing: /var/folders/9t/lrs73ptj6lv644zvh1fk2_gc0000gn/T/tmp.V8lXPf4b/llvm-install/include/c++/v1/compare
-- Installing: /var/folders/9t/lrs73ptj6lv644zvh1fk2_gc0000gn/T/tmp.V8lXPf4b/llvm-install/include/c++/v1/complex
-- Installing: /var/folders/9t/lrs73ptj6lv644zvh1fk2_gc0000gn/T/tmp.V8lXPf4b/llvm-install/include/c++/v1/complex.h
-- Installing: /var/folders/9t/lrs73ptj6lv644zvh1fk2_gc0000gn/T/tmp.V8lXPf4b/llvm-install/include/c++/v1/condition_variable
-- Installing: /var/folders/9t/lrs73ptj6lv644zvh1fk2_gc0000gn/T/tmp.V8lXPf4b/llvm-install/include/c++/v1/csetjmp
-- Installing: /var/folders/9t/lrs73ptj6lv644zvh1fk2_gc0000gn/T/tmp.V8lXPf4b/llvm-install/include/c++/v1/csignal
-- Installing: /var/folders/9t/lrs73ptj6lv644zvh1fk2_gc0000gn/T/tmp.V8lXPf4b/llvm-install/include/c++/v1/cstdarg
-- Installing: /var/folders/9t/lrs73ptj6lv644zvh1fk2_gc0000gn/T/tmp.V8lXPf4b/llvm-install/include/c++/v1/cstdbool
-- Installing: /var/folders/9t/lrs73ptj6lv644zvh1fk2_gc0000gn/T/tmp.V8lXPf4b/llvm-install/include/c++/v1/cstddef
-- Installing: /var/folders/9t/lrs73ptj6lv644zvh1fk2_gc0000gn/T/tmp.V8lXPf4b/llvm-install/include/c++/v1/cstdint
-- Installing: /var/folders/9t/lrs73ptj6lv644zvh1fk2_gc0000gn/T/tmp.V8lXPf4b/llvm-install/include/c++/v1/cstdio
-- Installing: /var/folders/9t/lrs73ptj6lv644zvh1fk2_gc0000gn/T/tmp.V8lXPf4b/llvm-install/include/c++/v1/cstdlib
-- Installing: /var/folders/9t/lrs73ptj6lv644zvh1fk2_gc0000gn/T/tmp.V8lXPf4b/llvm-install/include/c++/v1/cstring
-- Installing: /var/folders/9t/lrs73ptj6lv644zvh1fk2_gc0000gn/T/tmp.V8lXPf4b/llvm-install/include/c++/v1/ctgmath
-- Installing: /var/folders/9t/lrs73ptj6lv644zvh1fk2_gc0000gn/T/tmp.V8lXPf4b/llvm-install/include/c++/v1/ctime
-- Installing: /var/folders/9t/lrs73ptj6lv644zvh1fk2_gc0000gn/T/tmp.V8lXPf4b/llvm-install/include/c++/v1/ctype.h
-- Installing: /var/folders/9t/lrs73ptj6lv644zvh1fk2_gc0000gn/T/tmp.V8lXPf4b/llvm-install/include/c++/v1/cwchar
-- Installing: /var/folders/9t/lrs73ptj6lv644zvh1fk2_gc0000gn/T/tmp.V8lXPf4b/llvm-install/include/c++/v1/cwctype
-- Installing: /var/folders/9t/lrs73ptj6lv644zvh1fk2_gc0000gn/T/tmp.V8lXPf4b/llvm-install/include/c++/v1/deque
-- Installing: /var/folders/9t/lrs73ptj6lv644zvh1fk2_gc0000gn/T/tmp.V8lXPf4b/llvm-install/include/c++/v1/errno.h
-- Installing: /var/folders/9t/lrs73ptj6lv644zvh1fk2_gc0000gn/T/tmp.V8lXPf4b/llvm-install/include/c++/v1/exception
-- Installing: /var/folders/9t/lrs73ptj6lv644zvh1fk2_gc0000gn/T/tmp.V8lXPf4b/llvm-install/include/c++/v1/execution
-- Installing: /var/folders/9t/lrs73ptj6lv644zvh1fk2_gc0000gn/T/tmp.V8lXPf4b/llvm-install/include/c++/v1/experimental/__config
-- Installing: /var/folders/9t/lrs73ptj6lv644zvh1fk2_gc0000gn/T/tmp.V8lXPf4b/llvm-install/include/c++/v1/experimental/__memory
-- Installing: /var/folders/9t/lrs73ptj6lv644zvh1fk2_gc0000gn/T/tmp.V8lXPf4b/llvm-install/include/c++/v1/experimental/algorithm
-- Installing: /var/folders/9t/lrs73ptj6lv644zvh1fk2_gc0000gn/T/tmp.V8lXPf4b/llvm-install/include/c++/v1/experimental/coroutine
-- Installing: /var/folders/9t/lrs73ptj6lv644zvh1fk2_gc0000gn/T/tmp.V8lXPf4b/llvm-install/include/c++/v1/experimental/deque
-- Installing: /var/folders/9t/lrs73ptj6lv644zvh1fk2_gc0000gn/T/tmp.V8lXPf4b/llvm-install/include/c++/v1/experimental/filesystem
-- Installing: /var/folders/9t/lrs73ptj6lv644zvh1fk2_gc0000gn/T/tmp.V8lXPf4b/llvm-install/include/c++/v1/experimental/forward_list
-- Installing: /var/folders/9t/lrs73ptj6lv644zvh1fk2_gc0000gn/T/tmp.V8lXPf4b/llvm-install/include/c++/v1/experimental/functional
-- Installing: /var/folders/9t/lrs73ptj6lv644zvh1fk2_gc0000gn/T/tmp.V8lXPf4b/llvm-install/include/c++/v1/experimental/iterator
-- Installing: /var/folders/9t/lrs73ptj6lv644zvh1fk2_gc0000gn/T/tmp.V8lXPf4b/llvm-install/include/c++/v1/experimental/list
-- Installing: /var/folders/9t/lrs73ptj6lv644zvh1fk2_gc0000gn/T/tmp.V8lXPf4b/llvm-install/include/c++/v1/experimental/map
-- Installing: /var/folders/9t/lrs73ptj6lv644zvh1fk2_gc0000gn/T/tmp.V8lXPf4b/llvm-install/include/c++/v1/experimental/memory_resource
-- Installing: /var/folders/9t/lrs73ptj6lv644zvh1fk2_gc0000gn/T/tmp.V8lXPf4b/llvm-install/include/c++/v1/experimental/propagate_const
-- Installing: /var/folders/9t/lrs73ptj6lv644zvh1fk2_gc0000gn/T/tmp.V8lXPf4b/llvm-install/include/c++/v1/experimental/regex
-- Installing: /var/folders/9t/lrs73ptj6lv644zvh1fk2_gc0000gn/T/tmp.V8lXPf4b/llvm-install/include/c++/v1/experimental/set
-- Installing: /var/folders/9t/lrs73ptj6lv644zvh1fk2_gc0000gn/T/tmp.V8lXPf4b/llvm-install/include/c++/v1/experimental/simd
-- Installing: /var/folders/9t/lrs73ptj6lv644zvh1fk2_gc0000gn/T/tmp.V8lXPf4b/llvm-install/include/c++/v1/experimental/string
-- Installing: /var/folders/9t/lrs73ptj6lv644zvh1fk2_gc0000gn/T/tmp.V8lXPf4b/llvm-install/include/c++/v1/experimental/type_traits
-- Installing: /var/folders/9t/lrs73ptj6lv644zvh1fk2_gc0000gn/T/tmp.V8lXPf4b/llvm-install/include/c++/v1/experimental/unordered_map
-- Installing: /var/folders/9t/lrs73ptj6lv644zvh1fk2_gc0000gn/T/tmp.V8lXPf4b/llvm-install/include/c++/v1/experimental/unordered_set
-- Installing: /var/folders/9t/lrs73ptj6lv644zvh1fk2_gc0000gn/T/tmp.V8lXPf4b/llvm-install/include/c++/v1/experimental/utility
-- Installing: /var/folders/9t/lrs73ptj6lv644zvh1fk2_gc0000gn/T/tmp.V8lXPf4b/llvm-install/include/c++/v1/experimental/vector
-- Installing: /var/folders/9t/lrs73ptj6lv644zvh1fk2_gc0000gn/T/tmp.V8lXPf4b/llvm-install/include/c++/v1/ext/__hash
-- Installing: /var/folders/9t/lrs73ptj6lv644zvh1fk2_gc0000gn/T/tmp.V8lXPf4b/llvm-install/include/c++/v1/ext/hash_map
-- Installing: /var/folders/9t/lrs73ptj6lv644zvh1fk2_gc0000gn/T/tmp.V8lXPf4b/llvm-install/include/c++/v1/ext/hash_set
-- Installing: /var/folders/9t/lrs73ptj6lv644zvh1fk2_gc0000gn/T/tmp.V8lXPf4b/llvm-install/include/c++/v1/fenv.h
-- Installing: /var/folders/9t/lrs73ptj6lv644zvh1fk2_gc0000gn/T/tmp.V8lXPf4b/llvm-install/include/c++/v1/filesystem
-- Installing: /var/folders/9t/lrs73ptj6lv644zvh1fk2_gc0000gn/T/tmp.V8lXPf4b/llvm-install/include/c++/v1/float.h
-- Installing: /var/folders/9t/lrs73ptj6lv644zvh1fk2_gc0000gn/T/tmp.V8lXPf4b/llvm-install/include/c++/v1/forward_list
-- Installing: /var/folders/9t/lrs73ptj6lv644zvh1fk2_gc0000gn/T/tmp.V8lXPf4b/llvm-install/include/c++/v1/fstream
-- Installing: /var/folders/9t/lrs73ptj6lv644zvh1fk2_gc0000gn/T/tmp.V8lXPf4b/llvm-install/include/c++/v1/functional
-- Installing: /var/folders/9t/lrs73ptj6lv644zvh1fk2_gc0000gn/T/tmp.V8lXPf4b/llvm-install/include/c++/v1/future
-- Installing: /var/folders/9t/lrs73ptj6lv644zvh1fk2_gc0000gn/T/tmp.V8lXPf4b/llvm-install/include/c++/v1/initializer_list
-- Installing: /var/folders/9t/lrs73ptj6lv644zvh1fk2_gc0000gn/T/tmp.V8lXPf4b/llvm-install/include/c++/v1/inttypes.h
-- Installing: /var/folders/9t/lrs73ptj6lv644zvh1fk2_gc0000gn/T/tmp.V8lXPf4b/llvm-install/include/c++/v1/iomanip
-- Installing: /var/folders/9t/lrs73ptj6lv644zvh1fk2_gc0000gn/T/tmp.V8lXPf4b/llvm-install/include/c++/v1/ios
-- Installing: /var/folders/9t/lrs73ptj6lv644zvh1fk2_gc0000gn/T/tmp.V8lXPf4b/llvm-install/include/c++/v1/iosfwd
-- Installing: /var/folders/9t/lrs73ptj6lv644zvh1fk2_gc0000gn/T/tmp.V8lXPf4b/llvm-install/include/c++/v1/iostream
-- Installing: /var/folders/9t/lrs73ptj6lv644zvh1fk2_gc0000gn/T/tmp.V8lXPf4b/llvm-install/include/c++/v1/istream
-- Installing: /var/folders/9t/lrs73ptj6lv644zvh1fk2_gc0000gn/T/tmp.V8lXPf4b/llvm-install/include/c++/v1/iterator
-- Installing: /var/folders/9t/lrs73ptj6lv644zvh1fk2_gc0000gn/T/tmp.V8lXPf4b/llvm-install/include/c++/v1/limits
-- Installing: /var/folders/9t/lrs73ptj6lv644zvh1fk2_gc0000gn/T/tmp.V8lXPf4b/llvm-install/include/c++/v1/limits.h
-- Installing: /var/folders/9t/lrs73ptj6lv644zvh1fk2_gc0000gn/T/tmp.V8lXPf4b/llvm-install/include/c++/v1/list
-- Installing: /var/folders/9t/lrs73ptj6lv644zvh1fk2_gc0000gn/T/tmp.V8lXPf4b/llvm-install/include/c++/v1/locale
-- Installing: /var/folders/9t/lrs73ptj6lv644zvh1fk2_gc0000gn/T/tmp.V8lXPf4b/llvm-install/include/c++/v1/locale.h
-- Installing: /var/folders/9t/lrs73ptj6lv644zvh1fk2_gc0000gn/T/tmp.V8lXPf4b/llvm-install/include/c++/v1/map
-- Installing: /var/folders/9t/lrs73ptj6lv644zvh1fk2_gc0000gn/T/tmp.V8lXPf4b/llvm-install/include/c++/v1/math.h
-- Installing: /var/folders/9t/lrs73ptj6lv644zvh1fk2_gc0000gn/T/tmp.V8lXPf4b/llvm-install/include/c++/v1/memory
-- Installing: /var/folders/9t/lrs73ptj6lv644zvh1fk2_gc0000gn/T/tmp.V8lXPf4b/llvm-install/include/c++/v1/module.modulemap
-- Installing: /var/folders/9t/lrs73ptj6lv644zvh1fk2_gc0000gn/T/tmp.V8lXPf4b/llvm-install/include/c++/v1/mutex
-- Installing: /var/folders/9t/lrs73ptj6lv644zvh1fk2_gc0000gn/T/tmp.V8lXPf4b/llvm-install/include/c++/v1/new
-- Installing: /var/folders/9t/lrs73ptj6lv644zvh1fk2_gc0000gn/T/tmp.V8lXPf4b/llvm-install/include/c++/v1/numeric
-- Installing: /var/folders/9t/lrs73ptj6lv644zvh1fk2_gc0000gn/T/tmp.V8lXPf4b/llvm-install/include/c++/v1/optional
-- Installing: /var/folders/9t/lrs73ptj6lv644zvh1fk2_gc0000gn/T/tmp.V8lXPf4b/llvm-install/include/c++/v1/ostream
-- Installing: /var/folders/9t/lrs73ptj6lv644zvh1fk2_gc0000gn/T/tmp.V8lXPf4b/llvm-install/include/c++/v1/queue
-- Installing: /var/folders/9t/lrs73ptj6lv644zvh1fk2_gc0000gn/T/tmp.V8lXPf4b/llvm-install/include/c++/v1/random
-- Installing: /var/folders/9t/lrs73ptj6lv644zvh1fk2_gc0000gn/T/tmp.V8lXPf4b/llvm-install/include/c++/v1/ratio
-- Installing: /var/folders/9t/lrs73ptj6lv644zvh1fk2_gc0000gn/T/tmp.V8lXPf4b/llvm-install/include/c++/v1/regex
-- Installing: /var/folders/9t/lrs73ptj6lv644zvh1fk2_gc0000gn/T/tmp.V8lXPf4b/llvm-install/include/c++/v1/scoped_allocator
-- Installing: /var/folders/9t/lrs73ptj6lv644zvh1fk2_gc0000gn/T/tmp.V8lXPf4b/llvm-install/include/c++/v1/set
-- Installing: /var/folders/9t/lrs73ptj6lv644zvh1fk2_gc0000gn/T/tmp.V8lXPf4b/llvm-install/include/c++/v1/setjmp.h
-- Installing: /var/folders/9t/lrs73ptj6lv644zvh1fk2_gc0000gn/T/tmp.V8lXPf4b/llvm-install/include/c++/v1/shared_mutex
-- Installing: /var/folders/9t/lrs73ptj6lv644zvh1fk2_gc0000gn/T/tmp.V8lXPf4b/llvm-install/include/c++/v1/span
-- Installing: /var/folders/9t/lrs73ptj6lv644zvh1fk2_gc0000gn/T/tmp.V8lXPf4b/llvm-install/include/c++/v1/sstream
-- Installing: /var/folders/9t/lrs73ptj6lv644zvh1fk2_gc0000gn/T/tmp.V8lXPf4b/llvm-install/include/c++/v1/stack
-- Installing: /var/folders/9t/lrs73ptj6lv644zvh1fk2_gc0000gn/T/tmp.V8lXPf4b/llvm-install/include/c++/v1/stdbool.h
-- Installing: /var/folders/9t/lrs73ptj6lv644zvh1fk2_gc0000gn/T/tmp.V8lXPf4b/llvm-install/include/c++/v1/stddef.h
-- Installing: /var/folders/9t/lrs73ptj6lv644zvh1fk2_gc0000gn/T/tmp.V8lXPf4b/llvm-install/include/c++/v1/stdexcept
-- Installing: /var/folders/9t/lrs73ptj6lv644zvh1fk2_gc0000gn/T/tmp.V8lXPf4b/llvm-install/include/c++/v1/stdint.h
-- Installing: /var/folders/9t/lrs73ptj6lv644zvh1fk2_gc0000gn/T/tmp.V8lXPf4b/llvm-install/include/c++/v1/stdio.h
-- Installing: /var/folders/9t/lrs73ptj6lv644zvh1fk2_gc0000gn/T/tmp.V8lXPf4b/llvm-install/include/c++/v1/stdlib.h
-- Installing: /var/folders/9t/lrs73ptj6lv644zvh1fk2_gc0000gn/T/tmp.V8lXPf4b/llvm-install/include/c++/v1/streambuf
-- Installing: /var/folders/9t/lrs73ptj6lv644zvh1fk2_gc0000gn/T/tmp.V8lXPf4b/llvm-install/include/c++/v1/string
-- Installing: /var/folders/9t/lrs73ptj6lv644zvh1fk2_gc0000gn/T/tmp.V8lXPf4b/llvm-install/include/c++/v1/string.h
-- Installing: /var/folders/9t/lrs73ptj6lv644zvh1fk2_gc0000gn/T/tmp.V8lXPf4b/llvm-install/include/c++/v1/string_view
-- Installing: /var/folders/9t/lrs73ptj6lv644zvh1fk2_gc0000gn/T/tmp.V8lXPf4b/llvm-install/include/c++/v1/strstream
-- Installing: /var/folders/9t/lrs73ptj6lv644zvh1fk2_gc0000gn/T/tmp.V8lXPf4b/llvm-install/include/c++/v1/system_error
-- Installing: /var/folders/9t/lrs73ptj6lv644zvh1fk2_gc0000gn/T/tmp.V8lXPf4b/llvm-install/include/c++/v1/tgmath.h
-- Installing: /var/folders/9t/lrs73ptj6lv644zvh1fk2_gc0000gn/T/tmp.V8lXPf4b/llvm-install/include/c++/v1/thread
-- Installing: /var/folders/9t/lrs73ptj6lv644zvh1fk2_gc0000gn/T/tmp.V8lXPf4b/llvm-install/include/c++/v1/tuple
-- Installing: /var/folders/9t/lrs73ptj6lv644zvh1fk2_gc0000gn/T/tmp.V8lXPf4b/llvm-install/include/c++/v1/type_traits
-- Installing: /var/folders/9t/lrs73ptj6lv644zvh1fk2_gc0000gn/T/tmp.V8lXPf4b/llvm-install/include/c++/v1/typeindex
-- Installing: /var/folders/9t/lrs73ptj6lv644zvh1fk2_gc0000gn/T/tmp.V8lXPf4b/llvm-install/include/c++/v1/typeinfo
-- Installing: /var/folders/9t/lrs73ptj6lv644zvh1fk2_gc0000gn/T/tmp.V8lXPf4b/llvm-install/include/c++/v1/unordered_map
-- Installing: /var/folders/9t/lrs73ptj6lv644zvh1fk2_gc0000gn/T/tmp.V8lXPf4b/llvm-install/include/c++/v1/unordered_set
-- Installing: /var/folders/9t/lrs73ptj6lv644zvh1fk2_gc0000gn/T/tmp.V8lXPf4b/llvm-install/include/c++/v1/utility
-- Installing: /var/folders/9t/lrs73ptj6lv644zvh1fk2_gc0000gn/T/tmp.V8lXPf4b/llvm-install/include/c++/v1/valarray
-- Installing: /var/folders/9t/lrs73ptj6lv644zvh1fk2_gc0000gn/T/tmp.V8lXPf4b/llvm-install/include/c++/v1/variant
-- Installing: /var/folders/9t/lrs73ptj6lv644zvh1fk2_gc0000gn/T/tmp.V8lXPf4b/llvm-install/include/c++/v1/vector
-- Installing: /var/folders/9t/lrs73ptj6lv644zvh1fk2_gc0000gn/T/tmp.V8lXPf4b/llvm-install/include/c++/v1/version
-- Installing: /var/folders/9t/lrs73ptj6lv644zvh1fk2_gc0000gn/T/tmp.V8lXPf4b/llvm-install/include/c++/v1/wchar.h
-- Installing: /var/folders/9t/lrs73ptj6lv644zvh1fk2_gc0000gn/T/tmp.V8lXPf4b/llvm-install/include/c++/v1/wctype.h
-- Installing: /var/folders/9t/lrs73ptj6lv644zvh1fk2_gc0000gn/T/tmp.V8lXPf4b/llvm-install/include/c++/v1/support/android/locale_bionic.h
-- Installing: /var/folders/9t/lrs73ptj6lv644zvh1fk2_gc0000gn/T/tmp.V8lXPf4b/llvm-install/include/c++/v1/support/fuchsia/xlocale.h
-- Installing: /var/folders/9t/lrs73ptj6lv644zvh1fk2_gc0000gn/T/tmp.V8lXPf4b/llvm-install/include/c++/v1/support/ibm/limits.h
-- Installing: /var/folders/9t/lrs73ptj6lv644zvh1fk2_gc0000gn/T/tmp.V8lXPf4b/llvm-install/include/c++/v1/support/ibm/locale_mgmt_aix.h
-- Installing: /var/folders/9t/lrs73ptj6lv644zvh1fk2_gc0000gn/T/tmp.V8lXPf4b/llvm-install/include/c++/v1/support/ibm/support.h
-- Installing: /var/folders/9t/lrs73ptj6lv644zvh1fk2_gc0000gn/T/tmp.V8lXPf4b/llvm-install/include/c++/v1/support/ibm/xlocale.h
-- Installing: /var/folders/9t/lrs73ptj6lv644zvh1fk2_gc0000gn/T/tmp.V8lXPf4b/llvm-install/include/c++/v1/support/musl/xlocale.h
-- Installing: /var/folders/9t/lrs73ptj6lv644zvh1fk2_gc0000gn/T/tmp.V8lXPf4b/llvm-install/include/c++/v1/support/newlib/xlocale.h
-- Installing: /var/folders/9t/lrs73ptj6lv644zvh1fk2_gc0000gn/T/tmp.V8lXPf4b/llvm-install/include/c++/v1/support/solaris/floatingpoint.h
-- Installing: /var/folders/9t/lrs73ptj6lv644zvh1fk2_gc0000gn/T/tmp.V8lXPf4b/llvm-install/include/c++/v1/support/solaris/wchar.h
-- Installing: /var/folders/9t/lrs73ptj6lv644zvh1fk2_gc0000gn/T/tmp.V8lXPf4b/llvm-install/include/c++/v1/support/solaris/xlocale.h
-- Installing: /var/folders/9t/lrs73ptj6lv644zvh1fk2_gc0000gn/T/tmp.V8lXPf4b/llvm-install/include/c++/v1/support/win32/limits_msvc_win32.h
-- Installing: /var/folders/9t/lrs73ptj6lv644zvh1fk2_gc0000gn/T/tmp.V8lXPf4b/llvm-install/include/c++/v1/support/win32/locale_win32.h
-- Installing: /var/folders/9t/lrs73ptj6lv644zvh1fk2_gc0000gn/T/tmp.V8lXPf4b/llvm-install/include/c++/v1/support/xlocale/__nop_locale_mgmt.h
-- Installing: /var/folders/9t/lrs73ptj6lv644zvh1fk2_gc0000gn/T/tmp.V8lXPf4b/llvm-install/include/c++/v1/support/xlocale/__posix_l_fallback.h
-- Installing: /var/folders/9t/lrs73ptj6lv644zvh1fk2_gc0000gn/T/tmp.V8lXPf4b/llvm-install/include/c++/v1/support/xlocale/__strtonum_fallback.h
-- Installing: /var/folders/9t/lrs73ptj6lv644zvh1fk2_gc0000gn/T/tmp.V8lXPf4b/llvm-install/include/c++/v1/__config
[214/257] /Users/buildslave/jenkins/libcxx_libcxxabi_trunk_testing/CI_ARCH/32/CI_EXCEPTIONS/OFF/CI_STD/c++2a/host-compiler/bin/clang++  -D_DEBUG -D_LIBCPP_BUILDING_LIBRARY -D_LIBCPP_DEBUG=0 -D_LIBCPP_DISABLE_NEW_DELETE_DEFINITIONS -D_LIBCPP_HAS_COMMENT_LIB_PRAGMA -D_LIBCPP_HAS_NO_PRAGMA_SYSTEM_HEADER -D_LIBCPP_NO_EXCEPTIONS -D__STDC_CONSTANT_MACROS -D__STDC_FORMAT_MACROS -D__STDC_LIMIT_MACROS -Iprojects/libcxx/src -I/Users/buildslave/jenkins/libcxx_libcxxabi_trunk_testing/CI_ARCH/32/CI_EXCEPTIONS/OFF/CI_STD/c++2a/llvm-project/libcxx/src -I/Applications/Xcode.app/Contents/Developer/Platforms/MacOSX.platform/Developer/SDKs/MacOSX10.13.sdk/usr/include/libxml2 -Iinclude -I/Users/buildslave/jenkins/libcxx_libcxxabi_trunk_testing/CI_ARCH/32/CI_EXCEPTIONS/OFF/CI_STD/c++2a/llvm-project/llvm/include -Iprojects/libcxx/include/c++build -I/Users/buildslave/jenkins/libcxx_libcxxabi_trunk_testing/CI_ARCH/32/CI_EXCEPTIONS/OFF/CI_STD/c++2a/llvm-project/libcxx/include -fPIC -fvisibility-inlines-hidden -Werror=date-time -Werror=unguarded-availability-new -std=c++14 -Wall -Wextra -Wno-unused-parameter -Wwrite-strings -Wcast-qual -Wmissing-field-initializers  -Wno-long-long -Wimplicit-fallthrough -Wcovered-switch-default -Wno-noexcept-type -Wnon-virtual-dtor -Wdelete-non-virtual-dtor -Wstring-conversion -fdiagnostics-color -Os  -arch i386 -arch x86_64 -isysroot /Applications/Xcode.app/Contents/Developer/Platforms/MacOSX.platform/Developer/SDKs/MacOSX10.13.sdk   -UNDEBUG -DLIBCXX_BUILDING_LIBCXXABI -std=c++11 -nostdinc++ -fvisibility-inlines-hidden -fvisibility=hidden -Wall -Wextra -W -Wwrite-strings -Wno-unused-parameter -Wno-long-long -Werror=return-type -Wextra-semi -Wno-user-defined-literals -Wno-covered-switch-default -Wno-ignored-attributes -Wno-error -include/var/folders/9t/lrs73ptj6lv644zvh1fk2_gc0000gn/T/tmp.V8lXPf4b/llvm-build/projects/libcxx/__config_site -fno-exceptions -MD -MT projects/libcxx/src/CMakeFiles/cxx_shared.dir/condition_variable_destructor.cpp.o -MF projects/libcxx/src/CMakeFiles/cxx_shared.dir/condition_variable_destructor.cpp.o.d -o projects/libcxx/src/CMakeFiles/cxx_shared.dir/condition_variable_destructor.cpp.o -c /Users/buildslave/jenkins/libcxx_libcxxabi_trunk_testing/CI_ARCH/32/CI_EXCEPTIONS/OFF/CI_STD/c++2a/llvm-project/libcxx/src/condition_variable_destructor.cpp
[215/257] /Users/buildslave/jenkins/libcxx_libcxxabi_trunk_testing/CI_ARCH/32/CI_EXCEPTIONS/OFF/CI_STD/c++2a/host-compiler/bin/clang++  -D_DEBUG -D_LIBCPP_BUILDING_LIBRARY -D_LIBCPP_DEBUG=0 -D_LIBCPP_DISABLE_NEW_DELETE_DEFINITIONS -D_LIBCPP_HAS_COMMENT_LIB_PRAGMA -D_LIBCPP_HAS_NO_PRAGMA_SYSTEM_HEADER -D_LIBCPP_NO_EXCEPTIONS -D__STDC_CONSTANT_MACROS -D__STDC_FORMAT_MACROS -D__STDC_LIMIT_MACROS -Iprojects/libcxx/src -I/Users/buildslave/jenkins/libcxx_libcxxabi_trunk_testing/CI_ARCH/32/CI_EXCEPTIONS/OFF/CI_STD/c++2a/llvm-project/libcxx/src -I/Applications/Xcode.app/Contents/Developer/Platforms/MacOSX.platform/Developer/SDKs/MacOSX10.13.sdk/usr/include/libxml2 -Iinclude -I/Users/buildslave/jenkins/libcxx_libcxxabi_trunk_testing/CI_ARCH/32/CI_EXCEPTIONS/OFF/CI_STD/c++2a/llvm-project/llvm/include -Iprojects/libcxx/include/c++build -I/Users/buildslave/jenkins/libcxx_libcxxabi_trunk_testing/CI_ARCH/32/CI_EXCEPTIONS/OFF/CI_STD/c++2a/llvm-project/libcxx/include -fPIC -fvisibility-inlines-hidden -Werror=date-time -Werror=unguarded-availability-new -std=c++14 -Wall -Wextra -Wno-unused-parameter -Wwrite-strings -Wcast-qual -Wmissing-field-initializers  -Wno-long-long -Wimplicit-fallthrough -Wcovered-switch-default -Wno-noexcept-type -Wnon-virtual-dtor -Wdelete-non-virtual-dtor -Wstring-conversion -fdiagnostics-color -Os  -arch i386 -arch x86_64 -isysroot /Applications/Xcode.app/Contents/Developer/Platforms/MacOSX.platform/Developer/SDKs/MacOSX10.13.sdk   -UNDEBUG -DLIBCXX_BUILDING_LIBCXXABI -std=c++11 -nostdinc++ -fvisibility-inlines-hidden -fvisibility=hidden -Wall -Wextra -W -Wwrite-strings -Wno-unused-parameter -Wno-long-long -Werror=return-type -Wextra-semi -Wno-user-defined-literals -Wno-covered-switch-default -Wno-ignored-attributes -Wno-error -include/var/folders/9t/lrs73ptj6lv644zvh1fk2_gc0000gn/T/tmp.V8lXPf4b/llvm-build/projects/libcxx/__config_site -fno-exceptions -MD -MT projects/libcxx/src/CMakeFiles/cxx_shared.dir/charconv.cpp.o -MF projects/libcxx/src/CMakeFiles/cxx_shared.dir/charconv.cpp.o.d -o projects/libcxx/src/CMakeFiles/cxx_shared.dir/charconv.cpp.o -c /Users/buildslave/jenkins/libcxx_libcxxabi_trunk_testing/CI_ARCH/32/CI_EXCEPTIONS/OFF/CI_STD/c++2a/llvm-project/libcxx/src/charconv.cpp
[216/257] /Users/buildslave/jenkins/libcxx_libcxxabi_trunk_testing/CI_ARCH/32/CI_EXCEPTIONS/OFF/CI_STD/c++2a/host-compiler/bin/clang++  -D_DEBUG -D_LIBCPP_BUILDING_LIBRARY -D_LIBCPP_DEBUG=0 -D_LIBCPP_DISABLE_NEW_DELETE_DEFINITIONS -D_LIBCPP_HAS_COMMENT_LIB_PRAGMA -D_LIBCPP_HAS_NO_PRAGMA_SYSTEM_HEADER -D_LIBCPP_NO_EXCEPTIONS -D__STDC_CONSTANT_MACROS -D__STDC_FORMAT_MACROS -D__STDC_LIMIT_MACROS -Iprojects/libcxx/src -I/Users/buildslave/jenkins/libcxx_libcxxabi_trunk_testing/CI_ARCH/32/CI_EXCEPTIONS/OFF/CI_STD/c++2a/llvm-project/libcxx/src -I/Applications/Xcode.app/Contents/Developer/Platforms/MacOSX.platform/Developer/SDKs/MacOSX10.13.sdk/usr/include/libxml2 -Iinclude -I/Users/buildslave/jenkins/libcxx_libcxxabi_trunk_testing/CI_ARCH/32/CI_EXCEPTIONS/OFF/CI_STD/c++2a/llvm-project/llvm/include -Iprojects/libcxx/include/c++build -I/Users/buildslave/jenkins/libcxx_libcxxabi_trunk_testing/CI_ARCH/32/CI_EXCEPTIONS/OFF/CI_STD/c++2a/llvm-project/libcxx/include -fPIC -fvisibility-inlines-hidden -Werror=date-time -Werror=unguarded-availability-new -std=c++14 -Wall -Wextra -Wno-unused-parameter -Wwrite-strings -Wcast-qual -Wmissing-field-initializers  -Wno-long-long -Wimplicit-fallthrough -Wcovered-switch-default -Wno-noexcept-type -Wnon-virtual-dtor -Wdelete-non-virtual-dtor -Wstring-conversion -fdiagnostics-color -Os  -arch i386 -arch x86_64 -isysroot /Applications/Xcode.app/Contents/Developer/Platforms/MacOSX.platform/Developer/SDKs/MacOSX10.13.sdk   -UNDEBUG -DLIBCXX_BUILDING_LIBCXXABI -std=c++11 -nostdinc++ -fvisibility-inlines-hidden -fvisibility=hidden -Wall -Wextra -W -Wwrite-strings -Wno-unused-parameter -Wno-long-long -Werror=return-type -Wextra-semi -Wno-user-defined-literals -Wno-covered-switch-default -Wno-ignored-attributes -Wno-error -include/var/folders/9t/lrs73ptj6lv644zvh1fk2_gc0000gn/T/tmp.V8lXPf4b/llvm-build/projects/libcxx/__config_site -fno-exceptions -MD -MT projects/libcxx/src/CMakeFiles/cxx_shared.dir/any.cpp.o -MF projects/libcxx/src/CMakeFiles/cxx_shared.dir/any.cpp.o.d -o projects/libcxx/src/CMakeFiles/cxx_shared.dir/any.cpp.o -c /Users/buildslave/jenkins/libcxx_libcxxabi_trunk_testing/CI_ARCH/32/CI_EXCEPTIONS/OFF/CI_STD/c++2a/llvm-project/libcxx/src/any.cpp
[217/257] /Users/buildslave/jenkins/libcxx_libcxxabi_trunk_testing/CI_ARCH/32/CI_EXCEPTIONS/OFF/CI_STD/c++2a/host-compiler/bin/clang++  -D_DEBUG -D_LIBCPP_BUILDING_LIBRARY -D_LIBCPP_DEBUG=0 -D_LIBCPP_DISABLE_NEW_DELETE_DEFINITIONS -D_LIBCPP_HAS_COMMENT_LIB_PRAGMA -D_LIBCPP_HAS_NO_PRAGMA_SYSTEM_HEADER -D_LIBCPP_NO_EXCEPTIONS -D__STDC_CONSTANT_MACROS -D__STDC_FORMAT_MACROS -D__STDC_LIMIT_MACROS -Iprojects/libcxx/src -I/Users/buildslave/jenkins/libcxx_libcxxabi_trunk_testing/CI_ARCH/32/CI_EXCEPTIONS/OFF/CI_STD/c++2a/llvm-project/libcxx/src -I/Applications/Xcode.app/Contents/Developer/Platforms/MacOSX.platform/Developer/SDKs/MacOSX10.13.sdk/usr/include/libxml2 -Iinclude -I/Users/buildslave/jenkins/libcxx_libcxxabi_trunk_testing/CI_ARCH/32/CI_EXCEPTIONS/OFF/CI_STD/c++2a/llvm-project/llvm/include -Iprojects/libcxx/include/c++build -I/Users/buildslave/jenkins/libcxx_libcxxabi_trunk_testing/CI_ARCH/32/CI_EXCEPTIONS/OFF/CI_STD/c++2a/llvm-project/libcxx/include -fPIC -fvisibility-inlines-hidden -Werror=date-time -Werror=unguarded-availability-new -std=c++14 -Wall -Wextra -Wno-unused-parameter -Wwrite-strings -Wcast-qual -Wmissing-field-initializers  -Wno-long-long -Wimplicit-fallthrough -Wcovered-switch-default -Wno-noexcept-type -Wnon-virtual-dtor -Wdelete-non-virtual-dtor -Wstring-conversion -fdiagnostics-color -Os  -arch i386 -arch x86_64 -isysroot /Applications/Xcode.app/Contents/Developer/Platforms/MacOSX.platform/Developer/SDKs/MacOSX10.13.sdk   -UNDEBUG -DLIBCXX_BUILDING_LIBCXXABI -std=c++11 -nostdinc++ -fvisibility-inlines-hidden -fvisibility=hidden -Wall -Wextra -W -Wwrite-strings -Wno-unused-parameter -Wno-long-long -Werror=return-type -Wextra-semi -Wno-user-defined-literals -Wno-covered-switch-default -Wno-ignored-attributes -Wno-error -include/var/folders/9t/lrs73ptj6lv644zvh1fk2_gc0000gn/T/tmp.V8lXPf4b/llvm-build/projects/libcxx/__config_site -fno-exceptions -MD -MT projects/libcxx/src/CMakeFiles/cxx_shared.dir/bind.cpp.o -MF projects/libcxx/src/CMakeFiles/cxx_shared.dir/bind.cpp.o.d -o projects/libcxx/src/CMakeFiles/cxx_shared.dir/bind.cpp.o -c /Users/buildslave/jenkins/libcxx_libcxxabi_trunk_testing/CI_ARCH/32/CI_EXCEPTIONS/OFF/CI_STD/c++2a/llvm-project/libcxx/src/bind.cpp
[218/257] /Users/buildslave/jenkins/libcxx_libcxxabi_trunk_testing/CI_ARCH/32/CI_EXCEPTIONS/OFF/CI_STD/c++2a/host-compiler/bin/clang++  -D_DEBUG -D_LIBCPP_BUILDING_LIBRARY -D_LIBCPP_DEBUG=0 -D_LIBCPP_DISABLE_NEW_DELETE_DEFINITIONS -D_LIBCPP_HAS_COMMENT_LIB_PRAGMA -D_LIBCPP_HAS_NO_PRAGMA_SYSTEM_HEADER -D_LIBCPP_NO_EXCEPTIONS -D__STDC_CONSTANT_MACROS -D__STDC_FORMAT_MACROS -D__STDC_LIMIT_MACROS -Iprojects/libcxx/src -I/Users/buildslave/jenkins/libcxx_libcxxabi_trunk_testing/CI_ARCH/32/CI_EXCEPTIONS/OFF/CI_STD/c++2a/llvm-project/libcxx/src -I/Applications/Xcode.app/Contents/Developer/Platforms/MacOSX.platform/Developer/SDKs/MacOSX10.13.sdk/usr/include/libxml2 -Iinclude -I/Users/buildslave/jenkins/libcxx_libcxxabi_trunk_testing/CI_ARCH/32/CI_EXCEPTIONS/OFF/CI_STD/c++2a/llvm-project/llvm/include -Iprojects/libcxx/include/c++build -I/Users/buildslave/jenkins/libcxx_libcxxabi_trunk_testing/CI_ARCH/32/CI_EXCEPTIONS/OFF/CI_STD/c++2a/llvm-project/libcxx/include -fPIC -fvisibility-inlines-hidden -Werror=date-time -Werror=unguarded-availability-new -std=c++14 -Wall -Wextra -Wno-unused-parameter -Wwrite-strings -Wcast-qual -Wmissing-field-initializers  -Wno-long-long -Wimplicit-fallthrough -Wcovered-switch-default -Wno-noexcept-type -Wnon-virtual-dtor -Wdelete-non-virtual-dtor -Wstring-conversion -fdiagnostics-color -Os  -arch i386 -arch x86_64 -isysroot /Applications/Xcode.app/Contents/Developer/Platforms/MacOSX.platform/Developer/SDKs/MacOSX10.13.sdk   -UNDEBUG -DLIBCXX_BUILDING_LIBCXXABI -std=c++11 -nostdinc++ -fvisibility-inlines-hidden -fvisibility=hidden -Wall -Wextra -W -Wwrite-strings -Wno-unused-parameter -Wno-long-long -Werror=return-type -Wextra-semi -Wno-user-defined-literals -Wno-covered-switch-default -Wno-ignored-attributes -Wno-error -include/var/folders/9t/lrs73ptj6lv644zvh1fk2_gc0000gn/T/tmp.V8lXPf4b/llvm-build/projects/libcxx/__config_site -fno-exceptions -MD -MT projects/libcxx/src/CMakeFiles/cxx_shared.dir/exception.cpp.o -MF projects/libcxx/src/CMakeFiles/cxx_shared.dir/exception.cpp.o.d -o projects/libcxx/src/CMakeFiles/cxx_shared.dir/exception.cpp.o -c /Users/buildslave/jenkins/libcxx_libcxxabi_trunk_testing/CI_ARCH/32/CI_EXCEPTIONS/OFF/CI_STD/c++2a/llvm-project/libcxx/src/exception.cpp
[219/257] /Users/buildslave/jenkins/libcxx_libcxxabi_trunk_testing/CI_ARCH/32/CI_EXCEPTIONS/OFF/CI_STD/c++2a/host-compiler/bin/clang++  -D_DEBUG -D_LIBCPP_BUILDING_LIBRARY -D_LIBCPP_DEBUG=0 -D_LIBCPP_DISABLE_NEW_DELETE_DEFINITIONS -D_LIBCPP_HAS_COMMENT_LIB_PRAGMA -D_LIBCPP_HAS_NO_PRAGMA_SYSTEM_HEADER -D_LIBCPP_NO_EXCEPTIONS -D__STDC_CONSTANT_MACROS -D__STDC_FORMAT_MACROS -D__STDC_LIMIT_MACROS -Iprojects/libcxx/src -I/Users/buildslave/jenkins/libcxx_libcxxabi_trunk_testing/CI_ARCH/32/CI_EXCEPTIONS/OFF/CI_STD/c++2a/llvm-project/libcxx/src -I/Applications/Xcode.app/Contents/Developer/Platforms/MacOSX.platform/Developer/SDKs/MacOSX10.13.sdk/usr/include/libxml2 -Iinclude -I/Users/buildslave/jenkins/libcxx_libcxxabi_trunk_testing/CI_ARCH/32/CI_EXCEPTIONS/OFF/CI_STD/c++2a/llvm-project/llvm/include -Iprojects/libcxx/include/c++build -I/Users/buildslave/jenkins/libcxx_libcxxabi_trunk_testing/CI_ARCH/32/CI_EXCEPTIONS/OFF/CI_STD/c++2a/llvm-project/libcxx/include -fPIC -fvisibility-inlines-hidden -Werror=date-time -Werror=unguarded-availability-new -std=c++14 -Wall -Wextra -Wno-unused-parameter -Wwrite-strings -Wcast-qual -Wmissing-field-initializers  -Wno-long-long -Wimplicit-fallthrough -Wcovered-switch-default -Wno-noexcept-type -Wnon-virtual-dtor -Wdelete-non-virtual-dtor -Wstring-conversion -fdiagnostics-color -Os  -arch i386 -arch x86_64 -isysroot /Applications/Xcode.app/Contents/Developer/Platforms/MacOSX.platform/Developer/SDKs/MacOSX10.13.sdk   -UNDEBUG -DLIBCXX_BUILDING_LIBCXXABI -std=c++11 -nostdinc++ -fvisibility-inlines-hidden -fvisibility=hidden -Wall -Wextra -W -Wwrite-strings -Wno-unused-parameter -Wno-long-long -Werror=return-type -Wextra-semi -Wno-user-defined-literals -Wno-covered-switch-default -Wno-ignored-attributes -Wno-error -include/var/folders/9t/lrs73ptj6lv644zvh1fk2_gc0000gn/T/tmp.V8lXPf4b/llvm-build/projects/libcxx/__config_site -fno-exceptions -MD -MT projects/libcxx/src/CMakeFiles/cxx_shared.dir/functional.cpp.o -MF projects/libcxx/src/CMakeFiles/cxx_shared.dir/functional.cpp.o.d -o projects/libcxx/src/CMakeFiles/cxx_shared.dir/functional.cpp.o -c /Users/buildslave/jenkins/libcxx_libcxxabi_trunk_testing/CI_ARCH/32/CI_EXCEPTIONS/OFF/CI_STD/c++2a/llvm-project/libcxx/src/functional.cpp
[220/257] /Users/buildslave/jenkins/libcxx_libcxxabi_trunk_testing/CI_ARCH/32/CI_EXCEPTIONS/OFF/CI_STD/c++2a/host-compiler/bin/clang++  -D_DEBUG -D_LIBCPP_BUILDING_LIBRARY -D_LIBCPP_DEBUG=0 -D_LIBCPP_DISABLE_NEW_DELETE_DEFINITIONS -D_LIBCPP_HAS_COMMENT_LIB_PRAGMA -D_LIBCPP_HAS_NO_PRAGMA_SYSTEM_HEADER -D_LIBCPP_NO_EXCEPTIONS -D__STDC_CONSTANT_MACROS -D__STDC_FORMAT_MACROS -D__STDC_LIMIT_MACROS -Iprojects/libcxx/src -I/Users/buildslave/jenkins/libcxx_libcxxabi_trunk_testing/CI_ARCH/32/CI_EXCEPTIONS/OFF/CI_STD/c++2a/llvm-project/libcxx/src -I/Applications/Xcode.app/Contents/Developer/Platforms/MacOSX.platform/Developer/SDKs/MacOSX10.13.sdk/usr/include/libxml2 -Iinclude -I/Users/buildslave/jenkins/libcxx_libcxxabi_trunk_testing/CI_ARCH/32/CI_EXCEPTIONS/OFF/CI_STD/c++2a/llvm-project/llvm/include -Iprojects/libcxx/include/c++build -I/Users/buildslave/jenkins/libcxx_libcxxabi_trunk_testing/CI_ARCH/32/CI_EXCEPTIONS/OFF/CI_STD/c++2a/llvm-project/libcxx/include -fPIC -fvisibility-inlines-hidden -Werror=date-time -Werror=unguarded-availability-new -std=c++14 -Wall -Wextra -Wno-unused-parameter -Wwrite-strings -Wcast-qual -Wmissing-field-initializers  -Wno-long-long -Wimplicit-fallthrough -Wcovered-switch-default -Wno-noexcept-type -Wnon-virtual-dtor -Wdelete-non-virtual-dtor -Wstring-conversion -fdiagnostics-color -Os  -arch i386 -arch x86_64 -isysroot /Applications/Xcode.app/Contents/Developer/Platforms/MacOSX.platform/Developer/SDKs/MacOSX10.13.sdk   -UNDEBUG -DLIBCXX_BUILDING_LIBCXXABI -std=c++11 -nostdinc++ -fvisibility-inlines-hidden -fvisibility=hidden -Wall -Wextra -W -Wwrite-strings -Wno-unused-parameter -Wno-long-long -Werror=return-type -Wextra-semi -Wno-user-defined-literals -Wno-covered-switch-default -Wno-ignored-attributes -Wno-error -include/var/folders/9t/lrs73ptj6lv644zvh1fk2_gc0000gn/T/tmp.V8lXPf4b/llvm-build/projects/libcxx/__config_site -fno-exceptions -MD -MT projects/libcxx/src/CMakeFiles/cxx_shared.dir/chrono.cpp.o -MF projects/libcxx/src/CMakeFiles/cxx_shared.dir/chrono.cpp.o.d -o projects/libcxx/src/CMakeFiles/cxx_shared.dir/chrono.cpp.o -c /Users/buildslave/jenkins/libcxx_libcxxabi_trunk_testing/CI_ARCH/32/CI_EXCEPTIONS/OFF/CI_STD/c++2a/llvm-project/libcxx/src/chrono.cpp
[221/257] /Users/buildslave/jenkins/libcxx_libcxxabi_trunk_testing/CI_ARCH/32/CI_EXCEPTIONS/OFF/CI_STD/c++2a/host-compiler/bin/clang++  -D_DEBUG -D_LIBCPP_BUILDING_LIBRARY -D_LIBCPP_DEBUG=0 -D_LIBCPP_DISABLE_NEW_DELETE_DEFINITIONS -D_LIBCPP_HAS_COMMENT_LIB_PRAGMA -D_LIBCPP_HAS_NO_PRAGMA_SYSTEM_HEADER -D_LIBCPP_NO_EXCEPTIONS -D__STDC_CONSTANT_MACROS -D__STDC_FORMAT_MACROS -D__STDC_LIMIT_MACROS -Iprojects/libcxx/src -I/Users/buildslave/jenkins/libcxx_libcxxabi_trunk_testing/CI_ARCH/32/CI_EXCEPTIONS/OFF/CI_STD/c++2a/llvm-project/libcxx/src -I/Applications/Xcode.app/Contents/Developer/Platforms/MacOSX.platform/Developer/SDKs/MacOSX10.13.sdk/usr/include/libxml2 -Iinclude -I/Users/buildslave/jenkins/libcxx_libcxxabi_trunk_testing/CI_ARCH/32/CI_EXCEPTIONS/OFF/CI_STD/c++2a/llvm-project/llvm/include -Iprojects/libcxx/include/c++build -I/Users/buildslave/jenkins/libcxx_libcxxabi_trunk_testing/CI_ARCH/32/CI_EXCEPTIONS/OFF/CI_STD/c++2a/llvm-project/libcxx/include -fPIC -fvisibility-inlines-hidden -Werror=date-time -Werror=unguarded-availability-new -std=c++14 -Wall -Wextra -Wno-unused-parameter -Wwrite-strings -Wcast-qual -Wmissing-field-initializers  -Wno-long-long -Wimplicit-fallthrough -Wcovered-switch-default -Wno-noexcept-type -Wnon-virtual-dtor -Wdelete-non-virtual-dtor -Wstring-conversion -fdiagnostics-color -Os  -arch i386 -arch x86_64 -isysroot /Applications/Xcode.app/Contents/Developer/Platforms/MacOSX.platform/Developer/SDKs/MacOSX10.13.sdk   -UNDEBUG -DLIBCXX_BUILDING_LIBCXXABI -std=c++11 -nostdinc++ -fvisibility-inlines-hidden -fvisibility=hidden -Wall -Wextra -W -Wwrite-strings -Wno-unused-parameter -Wno-long-long -Werror=return-type -Wextra-semi -Wno-user-defined-literals -Wno-covered-switch-default -Wno-ignored-attributes -Wno-error -include/var/folders/9t/lrs73ptj6lv644zvh1fk2_gc0000gn/T/tmp.V8lXPf4b/llvm-build/projects/libcxx/__config_site -fno-exceptions -MD -MT projects/libcxx/src/CMakeFiles/cxx_shared.dir/condition_variable.cpp.o -MF projects/libcxx/src/CMakeFiles/cxx_shared.dir/condition_variable.cpp.o.d -o projects/libcxx/src/CMakeFiles/cxx_shared.dir/condition_variable.cpp.o -c /Users/buildslave/jenkins/libcxx_libcxxabi_trunk_testing/CI_ARCH/32/CI_EXCEPTIONS/OFF/CI_STD/c++2a/llvm-project/libcxx/src/condition_variable.cpp
[222/257] /Users/buildslave/jenkins/libcxx_libcxxabi_trunk_testing/CI_ARCH/32/CI_EXCEPTIONS/OFF/CI_STD/c++2a/host-compiler/bin/clang++  -D_DEBUG -D_LIBCPP_BUILDING_LIBRARY -D_LIBCPP_DEBUG=0 -D_LIBCPP_DISABLE_NEW_DELETE_DEFINITIONS -D_LIBCPP_HAS_COMMENT_LIB_PRAGMA -D_LIBCPP_HAS_NO_PRAGMA_SYSTEM_HEADER -D_LIBCPP_NO_EXCEPTIONS -D__STDC_CONSTANT_MACROS -D__STDC_FORMAT_MACROS -D__STDC_LIMIT_MACROS -Iprojects/libcxx/src -I/Users/buildslave/jenkins/libcxx_libcxxabi_trunk_testing/CI_ARCH/32/CI_EXCEPTIONS/OFF/CI_STD/c++2a/llvm-project/libcxx/src -I/Applications/Xcode.app/Contents/Developer/Platforms/MacOSX.platform/Developer/SDKs/MacOSX10.13.sdk/usr/include/libxml2 -Iinclude -I/Users/buildslave/jenkins/libcxx_libcxxabi_trunk_testing/CI_ARCH/32/CI_EXCEPTIONS/OFF/CI_STD/c++2a/llvm-project/llvm/include -Iprojects/libcxx/include/c++build -I/Users/buildslave/jenkins/libcxx_libcxxabi_trunk_testing/CI_ARCH/32/CI_EXCEPTIONS/OFF/CI_STD/c++2a/llvm-project/libcxx/include -fPIC -fvisibility-inlines-hidden -Werror=date-time -Werror=unguarded-availability-new -std=c++14 -Wall -Wextra -Wno-unused-parameter -Wwrite-strings -Wcast-qual -Wmissing-field-initializers  -Wno-long-long -Wimplicit-fallthrough -Wcovered-switch-default -Wno-noexcept-type -Wnon-virtual-dtor -Wdelete-non-virtual-dtor -Wstring-conversion -fdiagnostics-color -Os  -arch i386 -arch x86_64 -isysroot /Applications/Xcode.app/Contents/Developer/Platforms/MacOSX.platform/Developer/SDKs/MacOSX10.13.sdk   -UNDEBUG -DLIBCXX_BUILDING_LIBCXXABI -std=c++11 -nostdinc++ -fvisibility-inlines-hidden -fvisibility=hidden -Wall -Wextra -W -Wwrite-strings -Wno-unused-parameter -Wno-long-long -Werror=return-type -Wextra-semi -Wno-user-defined-literals -Wno-covered-switch-default -Wno-ignored-attributes -Wno-error -include/var/folders/9t/lrs73ptj6lv644zvh1fk2_gc0000gn/T/tmp.V8lXPf4b/llvm-build/projects/libcxx/__config_site -fno-exceptions -MD -MT projects/libcxx/src/CMakeFiles/cxx_shared.dir/hash.cpp.o -MF projects/libcxx/src/CMakeFiles/cxx_shared.dir/hash.cpp.o.d -o projects/libcxx/src/CMakeFiles/cxx_shared.dir/hash.cpp.o -c /Users/buildslave/jenkins/libcxx_libcxxabi_trunk_testing/CI_ARCH/32/CI_EXCEPTIONS/OFF/CI_STD/c++2a/llvm-project/libcxx/src/hash.cpp
[223/257] /Users/buildslave/jenkins/libcxx_libcxxabi_trunk_testing/CI_ARCH/32/CI_EXCEPTIONS/OFF/CI_STD/c++2a/host-compiler/bin/clang++  -D_DEBUG -D_LIBCPP_BUILDING_LIBRARY -D_LIBCPP_DEBUG=0 -D_LIBCPP_DISABLE_NEW_DELETE_DEFINITIONS -D_LIBCPP_HAS_COMMENT_LIB_PRAGMA -D_LIBCPP_HAS_NO_PRAGMA_SYSTEM_HEADER -D_LIBCPP_NO_EXCEPTIONS -D__STDC_CONSTANT_MACROS -D__STDC_FORMAT_MACROS -D__STDC_LIMIT_MACROS -Iprojects/libcxx/src -I/Users/buildslave/jenkins/libcxx_libcxxabi_trunk_testing/CI_ARCH/32/CI_EXCEPTIONS/OFF/CI_STD/c++2a/llvm-project/libcxx/src -I/Applications/Xcode.app/Contents/Developer/Platforms/MacOSX.platform/Developer/SDKs/MacOSX10.13.sdk/usr/include/libxml2 -Iinclude -I/Users/buildslave/jenkins/libcxx_libcxxabi_trunk_testing/CI_ARCH/32/CI_EXCEPTIONS/OFF/CI_STD/c++2a/llvm-project/llvm/include -Iprojects/libcxx/include/c++build -I/Users/buildslave/jenkins/libcxx_libcxxabi_trunk_testing/CI_ARCH/32/CI_EXCEPTIONS/OFF/CI_STD/c++2a/llvm-project/libcxx/include -fPIC -fvisibility-inlines-hidden -Werror=date-time -Werror=unguarded-availability-new -std=c++14 -Wall -Wextra -Wno-unused-parameter -Wwrite-strings -Wcast-qual -Wmissing-field-initializers  -Wno-long-long -Wimplicit-fallthrough -Wcovered-switch-default -Wno-noexcept-type -Wnon-virtual-dtor -Wdelete-non-virtual-dtor -Wstring-conversion -fdiagnostics-color -Os  -arch i386 -arch x86_64 -isysroot /Applications/Xcode.app/Contents/Developer/Platforms/MacOSX.platform/Developer/SDKs/MacOSX10.13.sdk   -UNDEBUG -DLIBCXX_BUILDING_LIBCXXABI -std=c++11 -nostdinc++ -fvisibility-inlines-hidden -fvisibility=hidden -Wall -Wextra -W -Wwrite-strings -Wno-unused-parameter -Wno-long-long -Werror=return-type -Wextra-semi -Wno-user-defined-literals -Wno-covered-switch-default -Wno-ignored-attributes -Wno-error -include/var/folders/9t/lrs73ptj6lv644zvh1fk2_gc0000gn/T/tmp.V8lXPf4b/llvm-build/projects/libcxx/__config_site -fno-exceptions -MD -MT projects/libcxx/src/CMakeFiles/cxx_shared.dir/debug.cpp.o -MF projects/libcxx/src/CMakeFiles/cxx_shared.dir/debug.cpp.o.d -o projects/libcxx/src/CMakeFiles/cxx_shared.dir/debug.cpp.o -c /Users/buildslave/jenkins/libcxx_libcxxabi_trunk_testing/CI_ARCH/32/CI_EXCEPTIONS/OFF/CI_STD/c++2a/llvm-project/libcxx/src/debug.cpp
[224/257] /Users/buildslave/jenkins/libcxx_libcxxabi_trunk_testing/CI_ARCH/32/CI_EXCEPTIONS/OFF/CI_STD/c++2a/host-compiler/bin/clang++  -D_DEBUG -D_LIBCPP_BUILDING_LIBRARY -D_LIBCPP_DEBUG=0 -D_LIBCPP_DISABLE_NEW_DELETE_DEFINITIONS -D_LIBCPP_HAS_COMMENT_LIB_PRAGMA -D_LIBCPP_HAS_NO_PRAGMA_SYSTEM_HEADER -D_LIBCPP_NO_EXCEPTIONS -D__STDC_CONSTANT_MACROS -D__STDC_FORMAT_MACROS -D__STDC_LIMIT_MACROS -Iprojects/libcxx/src -I/Users/buildslave/jenkins/libcxx_libcxxabi_trunk_testing/CI_ARCH/32/CI_EXCEPTIONS/OFF/CI_STD/c++2a/llvm-project/libcxx/src -I/Applications/Xcode.app/Contents/Developer/Platforms/MacOSX.platform/Developer/SDKs/MacOSX10.13.sdk/usr/include/libxml2 -Iinclude -I/Users/buildslave/jenkins/libcxx_libcxxabi_trunk_testing/CI_ARCH/32/CI_EXCEPTIONS/OFF/CI_STD/c++2a/llvm-project/llvm/include -Iprojects/libcxx/include/c++build -I/Users/buildslave/jenkins/libcxx_libcxxabi_trunk_testing/CI_ARCH/32/CI_EXCEPTIONS/OFF/CI_STD/c++2a/llvm-project/libcxx/include -fPIC -fvisibility-inlines-hidden -Werror=date-time -Werror=unguarded-availability-new -std=c++14 -Wall -Wextra -Wno-unused-parameter -Wwrite-strings -Wcast-qual -Wmissing-field-initializers  -Wno-long-long -Wimplicit-fallthrough -Wcovered-switch-default -Wno-noexcept-type -Wnon-virtual-dtor -Wdelete-non-virtual-dtor -Wstring-conversion -fdiagnostics-color -Os  -arch i386 -arch x86_64 -isysroot /Applications/Xcode.app/Contents/Developer/Platforms/MacOSX.platform/Developer/SDKs/MacOSX10.13.sdk   -UNDEBUG -DLIBCXX_BUILDING_LIBCXXABI -std=c++11 -nostdinc++ -fvisibility-inlines-hidden -fvisibility=hidden -Wall -Wextra -W -Wwrite-strings -Wno-unused-parameter -Wno-long-long -Werror=return-type -Wextra-semi -Wno-user-defined-literals -Wno-covered-switch-default -Wno-ignored-attributes -Wno-error -include/var/folders/9t/lrs73ptj6lv644zvh1fk2_gc0000gn/T/tmp.V8lXPf4b/llvm-build/projects/libcxx/__config_site -fno-exceptions -MD -MT projects/libcxx/src/CMakeFiles/cxx_shared.dir/future.cpp.o -MF projects/libcxx/src/CMakeFiles/cxx_shared.dir/future.cpp.o.d -o projects/libcxx/src/CMakeFiles/cxx_shared.dir/future.cpp.o -c /Users/buildslave/jenkins/libcxx_libcxxabi_trunk_testing/CI_ARCH/32/CI_EXCEPTIONS/OFF/CI_STD/c++2a/llvm-project/libcxx/src/future.cpp
[225/257] /Users/buildslave/jenkins/libcxx_libcxxabi_trunk_testing/CI_ARCH/32/CI_EXCEPTIONS/OFF/CI_STD/c++2a/host-compiler/bin/clang++  -D_DEBUG -D_LIBCPP_BUILDING_LIBRARY -D_LIBCPP_DEBUG=0 -D_LIBCPP_DISABLE_NEW_DELETE_DEFINITIONS -D_LIBCPP_HAS_COMMENT_LIB_PRAGMA -D_LIBCPP_HAS_NO_PRAGMA_SYSTEM_HEADER -D_LIBCPP_NO_EXCEPTIONS -D__STDC_CONSTANT_MACROS -D__STDC_FORMAT_MACROS -D__STDC_LIMIT_MACROS -Iprojects/libcxx/src -I/Users/buildslave/jenkins/libcxx_libcxxabi_trunk_testing/CI_ARCH/32/CI_EXCEPTIONS/OFF/CI_STD/c++2a/llvm-project/libcxx/src -I/Applications/Xcode.app/Contents/Developer/Platforms/MacOSX.platform/Developer/SDKs/MacOSX10.13.sdk/usr/include/libxml2 -Iinclude -I/Users/buildslave/jenkins/libcxx_libcxxabi_trunk_testing/CI_ARCH/32/CI_EXCEPTIONS/OFF/CI_STD/c++2a/llvm-project/llvm/include -Iprojects/libcxx/include/c++build -I/Users/buildslave/jenkins/libcxx_libcxxabi_trunk_testing/CI_ARCH/32/CI_EXCEPTIONS/OFF/CI_STD/c++2a/llvm-project/libcxx/include -fPIC -fvisibility-inlines-hidden -Werror=date-time -Werror=unguarded-availability-new -std=c++14 -Wall -Wextra -Wno-unused-parameter -Wwrite-strings -Wcast-qual -Wmissing-field-initializers  -Wno-long-long -Wimplicit-fallthrough -Wcovered-switch-default -Wno-noexcept-type -Wnon-virtual-dtor -Wdelete-non-virtual-dtor -Wstring-conversion -fdiagnostics-color -Os  -arch i386 -arch x86_64 -isysroot /Applications/Xcode.app/Contents/Developer/Platforms/MacOSX.platform/Developer/SDKs/MacOSX10.13.sdk   -UNDEBUG -DLIBCXX_BUILDING_LIBCXXABI -std=c++11 -nostdinc++ -fvisibility-inlines-hidden -fvisibility=hidden -Wall -Wextra -W -Wwrite-strings -Wno-unused-parameter -Wno-long-long -Werror=return-type -Wextra-semi -Wno-user-defined-literals -Wno-covered-switch-default -Wno-ignored-attributes -Wno-error -include/var/folders/9t/lrs73ptj6lv644zvh1fk2_gc0000gn/T/tmp.V8lXPf4b/llvm-build/projects/libcxx/__config_site -fno-exceptions -MD -MT projects/libcxx/src/CMakeFiles/cxx_shared.dir/mutex_destructor.cpp.o -MF projects/libcxx/src/CMakeFiles/cxx_shared.dir/mutex_destructor.cpp.o.d -o projects/libcxx/src/CMakeFiles/cxx_shared.dir/mutex_destructor.cpp.o -c /Users/buildslave/jenkins/libcxx_libcxxabi_trunk_testing/CI_ARCH/32/CI_EXCEPTIONS/OFF/CI_STD/c++2a/llvm-project/libcxx/src/mutex_destructor.cpp
[226/257] /Users/buildslave/jenkins/libcxx_libcxxabi_trunk_testing/CI_ARCH/32/CI_EXCEPTIONS/OFF/CI_STD/c++2a/host-compiler/bin/clang++  -D_DEBUG -D_LIBCPP_BUILDING_LIBRARY -D_LIBCPP_DEBUG=0 -D_LIBCPP_DISABLE_NEW_DELETE_DEFINITIONS -D_LIBCPP_HAS_COMMENT_LIB_PRAGMA -D_LIBCPP_HAS_NO_PRAGMA_SYSTEM_HEADER -D_LIBCPP_NO_EXCEPTIONS -D__STDC_CONSTANT_MACROS -D__STDC_FORMAT_MACROS -D__STDC_LIMIT_MACROS -Iprojects/libcxx/src -I/Users/buildslave/jenkins/libcxx_libcxxabi_trunk_testing/CI_ARCH/32/CI_EXCEPTIONS/OFF/CI_STD/c++2a/llvm-project/libcxx/src -I/Applications/Xcode.app/Contents/Developer/Platforms/MacOSX.platform/Developer/SDKs/MacOSX10.13.sdk/usr/include/libxml2 -Iinclude -I/Users/buildslave/jenkins/libcxx_libcxxabi_trunk_testing/CI_ARCH/32/CI_EXCEPTIONS/OFF/CI_STD/c++2a/llvm-project/llvm/include -Iprojects/libcxx/include/c++build -I/Users/buildslave/jenkins/libcxx_libcxxabi_trunk_testing/CI_ARCH/32/CI_EXCEPTIONS/OFF/CI_STD/c++2a/llvm-project/libcxx/include -fPIC -fvisibility-inlines-hidden -Werror=date-time -Werror=unguarded-availability-new -std=c++14 -Wall -Wextra -Wno-unused-parameter -Wwrite-strings -Wcast-qual -Wmissing-field-initializers  -Wno-long-long -Wimplicit-fallthrough -Wcovered-switch-default -Wno-noexcept-type -Wnon-virtual-dtor -Wdelete-non-virtual-dtor -Wstring-conversion -fdiagnostics-color -Os  -arch i386 -arch x86_64 -isysroot /Applications/Xcode.app/Contents/Developer/Platforms/MacOSX.platform/Developer/SDKs/MacOSX10.13.sdk   -UNDEBUG -DLIBCXX_BUILDING_LIBCXXABI -std=c++11 -nostdinc++ -fvisibility-inlines-hidden -fvisibility=hidden -Wall -Wextra -W -Wwrite-strings -Wno-unused-parameter -Wno-long-long -Werror=return-type -Wextra-semi -Wno-user-defined-literals -Wno-covered-switch-default -Wno-ignored-attributes -Wno-error -include/var/folders/9t/lrs73ptj6lv644zvh1fk2_gc0000gn/T/tmp.V8lXPf4b/llvm-build/projects/libcxx/__config_site -fno-exceptions -MD -MT projects/libcxx/src/CMakeFiles/cxx_shared.dir/memory.cpp.o -MF projects/libcxx/src/CMakeFiles/cxx_shared.dir/memory.cpp.o.d -o projects/libcxx/src/CMakeFiles/cxx_shared.dir/memory.cpp.o -c /Users/buildslave/jenkins/libcxx_libcxxabi_trunk_testing/CI_ARCH/32/CI_EXCEPTIONS/OFF/CI_STD/c++2a/llvm-project/libcxx/src/memory.cpp
[227/257] /Users/buildslave/jenkins/libcxx_libcxxabi_trunk_testing/CI_ARCH/32/CI_EXCEPTIONS/OFF/CI_STD/c++2a/host-compiler/bin/clang++  -D_DEBUG -D_LIBCPP_BUILDING_LIBRARY -D_LIBCPP_DEBUG=0 -D_LIBCPP_DISABLE_NEW_DELETE_DEFINITIONS -D_LIBCPP_HAS_COMMENT_LIB_PRAGMA -D_LIBCPP_HAS_NO_PRAGMA_SYSTEM_HEADER -D_LIBCPP_NO_EXCEPTIONS -D__STDC_CONSTANT_MACROS -D__STDC_FORMAT_MACROS -D__STDC_LIMIT_MACROS -Iprojects/libcxx/src -I/Users/buildslave/jenkins/libcxx_libcxxabi_trunk_testing/CI_ARCH/32/CI_EXCEPTIONS/OFF/CI_STD/c++2a/llvm-project/libcxx/src -I/Applications/Xcode.app/Contents/Developer/Platforms/MacOSX.platform/Developer/SDKs/MacOSX10.13.sdk/usr/include/libxml2 -Iinclude -I/Users/buildslave/jenkins/libcxx_libcxxabi_trunk_testing/CI_ARCH/32/CI_EXCEPTIONS/OFF/CI_STD/c++2a/llvm-project/llvm/include -Iprojects/libcxx/include/c++build -I/Users/buildslave/jenkins/libcxx_libcxxabi_trunk_testing/CI_ARCH/32/CI_EXCEPTIONS/OFF/CI_STD/c++2a/llvm-project/libcxx/include -fPIC -fvisibility-inlines-hidden -Werror=date-time -Werror=unguarded-availability-new -std=c++14 -Wall -Wextra -Wno-unused-parameter -Wwrite-strings -Wcast-qual -Wmissing-field-initializers  -Wno-long-long -Wimplicit-fallthrough -Wcovered-switch-default -Wno-noexcept-type -Wnon-virtual-dtor -Wdelete-non-virtual-dtor -Wstring-conversion -fdiagnostics-color -Os  -arch i386 -arch x86_64 -isysroot /Applications/Xcode.app/Contents/Developer/Platforms/MacOSX.platform/Developer/SDKs/MacOSX10.13.sdk   -UNDEBUG -DLIBCXX_BUILDING_LIBCXXABI -std=c++11 -nostdinc++ -fvisibility-inlines-hidden -fvisibility=hidden -Wall -Wextra -W -Wwrite-strings -Wno-unused-parameter -Wno-long-long -Werror=return-type -Wextra-semi -Wno-user-defined-literals -Wno-covered-switch-default -Wno-ignored-attributes -Wno-error -include/var/folders/9t/lrs73ptj6lv644zvh1fk2_gc0000gn/T/tmp.V8lXPf4b/llvm-build/projects/libcxx/__config_site -fno-exceptions -MD -MT projects/libcxx/src/CMakeFiles/cxx_shared.dir/new.cpp.o -MF projects/libcxx/src/CMakeFiles/cxx_shared.dir/new.cpp.o.d -o projects/libcxx/src/CMakeFiles/cxx_shared.dir/new.cpp.o -c /Users/buildslave/jenkins/libcxx_libcxxabi_trunk_testing/CI_ARCH/32/CI_EXCEPTIONS/OFF/CI_STD/c++2a/llvm-project/libcxx/src/new.cpp
[228/257] /Users/buildslave/jenkins/libcxx_libcxxabi_trunk_testing/CI_ARCH/32/CI_EXCEPTIONS/OFF/CI_STD/c++2a/host-compiler/bin/clang++  -D_DEBUG -D_LIBCPP_BUILDING_LIBRARY -D_LIBCPP_DEBUG=0 -D_LIBCPP_DISABLE_NEW_DELETE_DEFINITIONS -D_LIBCPP_HAS_COMMENT_LIB_PRAGMA -D_LIBCPP_HAS_NO_PRAGMA_SYSTEM_HEADER -D_LIBCPP_NO_EXCEPTIONS -D__STDC_CONSTANT_MACROS -D__STDC_FORMAT_MACROS -D__STDC_LIMIT_MACROS -Iprojects/libcxx/src -I/Users/buildslave/jenkins/libcxx_libcxxabi_trunk_testing/CI_ARCH/32/CI_EXCEPTIONS/OFF/CI_STD/c++2a/llvm-project/libcxx/src -I/Applications/Xcode.app/Contents/Developer/Platforms/MacOSX.platform/Developer/SDKs/MacOSX10.13.sdk/usr/include/libxml2 -Iinclude -I/Users/buildslave/jenkins/libcxx_libcxxabi_trunk_testing/CI_ARCH/32/CI_EXCEPTIONS/OFF/CI_STD/c++2a/llvm-project/llvm/include -Iprojects/libcxx/include/c++build -I/Users/buildslave/jenkins/libcxx_libcxxabi_trunk_testing/CI_ARCH/32/CI_EXCEPTIONS/OFF/CI_STD/c++2a/llvm-project/libcxx/include -fPIC -fvisibility-inlines-hidden -Werror=date-time -Werror=unguarded-availability-new -std=c++14 -Wall -Wextra -Wno-unused-parameter -Wwrite-strings -Wcast-qual -Wmissing-field-initializers  -Wno-long-long -Wimplicit-fallthrough -Wcovered-switch-default -Wno-noexcept-type -Wnon-virtual-dtor -Wdelete-non-virtual-dtor -Wstring-conversion -fdiagnostics-color -Os  -arch i386 -arch x86_64 -isysroot /Applications/Xcode.app/Contents/Developer/Platforms/MacOSX.platform/Developer/SDKs/MacOSX10.13.sdk   -UNDEBUG -DLIBCXX_BUILDING_LIBCXXABI -std=c++11 -nostdinc++ -fvisibility-inlines-hidden -fvisibility=hidden -Wall -Wextra -W -Wwrite-strings -Wno-unused-parameter -Wno-long-long -Werror=return-type -Wextra-semi -Wno-user-defined-literals -Wno-covered-switch-default -Wno-ignored-attributes -Wno-error -include/var/folders/9t/lrs73ptj6lv644zvh1fk2_gc0000gn/T/tmp.V8lXPf4b/llvm-build/projects/libcxx/__config_site -fno-exceptions -MD -MT projects/libcxx/src/CMakeFiles/cxx_shared.dir/optional.cpp.o -MF projects/libcxx/src/CMakeFiles/cxx_shared.dir/optional.cpp.o.d -o projects/libcxx/src/CMakeFiles/cxx_shared.dir/optional.cpp.o -c /Users/buildslave/jenkins/libcxx_libcxxabi_trunk_testing/CI_ARCH/32/CI_EXCEPTIONS/OFF/CI_STD/c++2a/llvm-project/libcxx/src/optional.cpp
[229/257] /Users/buildslave/jenkins/libcxx_libcxxabi_trunk_testing/CI_ARCH/32/CI_EXCEPTIONS/OFF/CI_STD/c++2a/host-compiler/bin/clang++  -D_DEBUG -D_LIBCPP_BUILDING_LIBRARY -D_LIBCPP_DEBUG=0 -D_LIBCPP_DISABLE_NEW_DELETE_DEFINITIONS -D_LIBCPP_HAS_COMMENT_LIB_PRAGMA -D_LIBCPP_HAS_NO_PRAGMA_SYSTEM_HEADER -D_LIBCPP_NO_EXCEPTIONS -D__STDC_CONSTANT_MACROS -D__STDC_FORMAT_MACROS -D__STDC_LIMIT_MACROS -Iprojects/libcxx/src -I/Users/buildslave/jenkins/libcxx_libcxxabi_trunk_testing/CI_ARCH/32/CI_EXCEPTIONS/OFF/CI_STD/c++2a/llvm-project/libcxx/src -I/Applications/Xcode.app/Contents/Developer/Platforms/MacOSX.platform/Developer/SDKs/MacOSX10.13.sdk/usr/include/libxml2 -Iinclude -I/Users/buildslave/jenkins/libcxx_libcxxabi_trunk_testing/CI_ARCH/32/CI_EXCEPTIONS/OFF/CI_STD/c++2a/llvm-project/llvm/include -Iprojects/libcxx/include/c++build -I/Users/buildslave/jenkins/libcxx_libcxxabi_trunk_testing/CI_ARCH/32/CI_EXCEPTIONS/OFF/CI_STD/c++2a/llvm-project/libcxx/include -fPIC -fvisibility-inlines-hidden -Werror=date-time -Werror=unguarded-availability-new -std=c++14 -Wall -Wextra -Wno-unused-parameter -Wwrite-strings -Wcast-qual -Wmissing-field-initializers  -Wno-long-long -Wimplicit-fallthrough -Wcovered-switch-default -Wno-noexcept-type -Wnon-virtual-dtor -Wdelete-non-virtual-dtor -Wstring-conversion -fdiagnostics-color -Os  -arch i386 -arch x86_64 -isysroot /Applications/Xcode.app/Contents/Developer/Platforms/MacOSX.platform/Developer/SDKs/MacOSX10.13.sdk   -UNDEBUG -DLIBCXX_BUILDING_LIBCXXABI -std=c++11 -nostdinc++ -fvisibility-inlines-hidden -fvisibility=hidden -Wall -Wextra -W -Wwrite-strings -Wno-unused-parameter -Wno-long-long -Werror=return-type -Wextra-semi -Wno-user-defined-literals -Wno-covered-switch-default -Wno-ignored-attributes -Wno-error -include/var/folders/9t/lrs73ptj6lv644zvh1fk2_gc0000gn/T/tmp.V8lXPf4b/llvm-build/projects/libcxx/__config_site -fno-exceptions -MD -MT projects/libcxx/src/CMakeFiles/cxx_shared.dir/iostream.cpp.o -MF projects/libcxx/src/CMakeFiles/cxx_shared.dir/iostream.cpp.o.d -o projects/libcxx/src/CMakeFiles/cxx_shared.dir/iostream.cpp.o -c /Users/buildslave/jenkins/libcxx_libcxxabi_trunk_testing/CI_ARCH/32/CI_EXCEPTIONS/OFF/CI_STD/c++2a/llvm-project/libcxx/src/iostream.cpp
[230/257] /Users/buildslave/jenkins/libcxx_libcxxabi_trunk_testing/CI_ARCH/32/CI_EXCEPTIONS/OFF/CI_STD/c++2a/host-compiler/bin/clang++  -D_DEBUG -D_LIBCPP_BUILDING_LIBRARY -D_LIBCPP_DEBUG=0 -D_LIBCPP_DISABLE_NEW_DELETE_DEFINITIONS -D_LIBCPP_HAS_COMMENT_LIB_PRAGMA -D_LIBCPP_HAS_NO_PRAGMA_SYSTEM_HEADER -D_LIBCPP_NO_EXCEPTIONS -D__STDC_CONSTANT_MACROS -D__STDC_FORMAT_MACROS -D__STDC_LIMIT_MACROS -Iprojects/libcxx/src -I/Users/buildslave/jenkins/libcxx_libcxxabi_trunk_testing/CI_ARCH/32/CI_EXCEPTIONS/OFF/CI_STD/c++2a/llvm-project/libcxx/src -I/Applications/Xcode.app/Contents/Developer/Platforms/MacOSX.platform/Developer/SDKs/MacOSX10.13.sdk/usr/include/libxml2 -Iinclude -I/Users/buildslave/jenkins/libcxx_libcxxabi_trunk_testing/CI_ARCH/32/CI_EXCEPTIONS/OFF/CI_STD/c++2a/llvm-project/llvm/include -Iprojects/libcxx/include/c++build -I/Users/buildslave/jenkins/libcxx_libcxxabi_trunk_testing/CI_ARCH/32/CI_EXCEPTIONS/OFF/CI_STD/c++2a/llvm-project/libcxx/include -fPIC -fvisibility-inlines-hidden -Werror=date-time -Werror=unguarded-availability-new -std=c++14 -Wall -Wextra -Wno-unused-parameter -Wwrite-strings -Wcast-qual -Wmissing-field-initializers  -Wno-long-long -Wimplicit-fallthrough -Wcovered-switch-default -Wno-noexcept-type -Wnon-virtual-dtor -Wdelete-non-virtual-dtor -Wstring-conversion -fdiagnostics-color -Os  -arch i386 -arch x86_64 -isysroot /Applications/Xcode.app/Contents/Developer/Platforms/MacOSX.platform/Developer/SDKs/MacOSX10.13.sdk   -UNDEBUG -DLIBCXX_BUILDING_LIBCXXABI -std=c++11 -nostdinc++ -fvisibility-inlines-hidden -fvisibility=hidden -Wall -Wextra -W -Wwrite-strings -Wno-unused-parameter -Wno-long-long -Werror=return-type -Wextra-semi -Wno-user-defined-literals -Wno-covered-switch-default -Wno-ignored-attributes -Wno-error -include/var/folders/9t/lrs73ptj6lv644zvh1fk2_gc0000gn/T/tmp.V8lXPf4b/llvm-build/projects/libcxx/__config_site -fno-exceptions -MD -MT projects/libcxx/src/CMakeFiles/cxx_shared.dir/mutex.cpp.o -MF projects/libcxx/src/CMakeFiles/cxx_shared.dir/mutex.cpp.o.d -o projects/libcxx/src/CMakeFiles/cxx_shared.dir/mutex.cpp.o -c /Users/buildslave/jenkins/libcxx_libcxxabi_trunk_testing/CI_ARCH/32/CI_EXCEPTIONS/OFF/CI_STD/c++2a/llvm-project/libcxx/src/mutex.cpp
[231/257] /Users/buildslave/jenkins/libcxx_libcxxabi_trunk_testing/CI_ARCH/32/CI_EXCEPTIONS/OFF/CI_STD/c++2a/host-compiler/bin/clang++  -D_DEBUG -D_LIBCPP_BUILDING_LIBRARY -D_LIBCPP_DEBUG=0 -D_LIBCPP_DISABLE_NEW_DELETE_DEFINITIONS -D_LIBCPP_HAS_COMMENT_LIB_PRAGMA -D_LIBCPP_HAS_NO_PRAGMA_SYSTEM_HEADER -D_LIBCPP_NO_EXCEPTIONS -D__STDC_CONSTANT_MACROS -D__STDC_FORMAT_MACROS -D__STDC_LIMIT_MACROS -Iprojects/libcxx/src -I/Users/buildslave/jenkins/libcxx_libcxxabi_trunk_testing/CI_ARCH/32/CI_EXCEPTIONS/OFF/CI_STD/c++2a/llvm-project/libcxx/src -I/Applications/Xcode.app/Contents/Developer/Platforms/MacOSX.platform/Developer/SDKs/MacOSX10.13.sdk/usr/include/libxml2 -Iinclude -I/Users/buildslave/jenkins/libcxx_libcxxabi_trunk_testing/CI_ARCH/32/CI_EXCEPTIONS/OFF/CI_STD/c++2a/llvm-project/llvm/include -Iprojects/libcxx/include/c++build -I/Users/buildslave/jenkins/libcxx_libcxxabi_trunk_testing/CI_ARCH/32/CI_EXCEPTIONS/OFF/CI_STD/c++2a/llvm-project/libcxx/include -fPIC -fvisibility-inlines-hidden -Werror=date-time -Werror=unguarded-availability-new -std=c++14 -Wall -Wextra -Wno-unused-parameter -Wwrite-strings -Wcast-qual -Wmissing-field-initializers  -Wno-long-long -Wimplicit-fallthrough -Wcovered-switch-default -Wno-noexcept-type -Wnon-virtual-dtor -Wdelete-non-virtual-dtor -Wstring-conversion -fdiagnostics-color -Os  -arch i386 -arch x86_64 -isysroot /Applications/Xcode.app/Contents/Developer/Platforms/MacOSX.platform/Developer/SDKs/MacOSX10.13.sdk   -UNDEBUG -DLIBCXX_BUILDING_LIBCXXABI -std=c++11 -nostdinc++ -fvisibility-inlines-hidden -fvisibility=hidden -Wall -Wextra -W -Wwrite-strings -Wno-unused-parameter -Wno-long-long -Werror=return-type -Wextra-semi -Wno-user-defined-literals -Wno-covered-switch-default -Wno-ignored-attributes -Wno-error -include/var/folders/9t/lrs73ptj6lv644zvh1fk2_gc0000gn/T/tmp.V8lXPf4b/llvm-build/projects/libcxx/__config_site -fno-exceptions -MD -MT projects/libcxx/src/CMakeFiles/cxx_shared.dir/algorithm.cpp.o -MF projects/libcxx/src/CMakeFiles/cxx_shared.dir/algorithm.cpp.o.d -o projects/libcxx/src/CMakeFiles/cxx_shared.dir/algorithm.cpp.o -c /Users/buildslave/jenkins/libcxx_libcxxabi_trunk_testing/CI_ARCH/32/CI_EXCEPTIONS/OFF/CI_STD/c++2a/llvm-project/libcxx/src/algorithm.cpp
[232/257] /Users/buildslave/jenkins/libcxx_libcxxabi_trunk_testing/CI_ARCH/32/CI_EXCEPTIONS/OFF/CI_STD/c++2a/host-compiler/bin/clang++  -D_DEBUG -D_LIBCPP_BUILDING_LIBRARY -D_LIBCPP_DEBUG=0 -D_LIBCPP_DISABLE_NEW_DELETE_DEFINITIONS -D_LIBCPP_HAS_COMMENT_LIB_PRAGMA -D_LIBCPP_HAS_NO_PRAGMA_SYSTEM_HEADER -D_LIBCPP_NO_EXCEPTIONS -D__STDC_CONSTANT_MACROS -D__STDC_FORMAT_MACROS -D__STDC_LIMIT_MACROS -Iprojects/libcxx/src -I/Users/buildslave/jenkins/libcxx_libcxxabi_trunk_testing/CI_ARCH/32/CI_EXCEPTIONS/OFF/CI_STD/c++2a/llvm-project/libcxx/src -I/Applications/Xcode.app/Contents/Developer/Platforms/MacOSX.platform/Developer/SDKs/MacOSX10.13.sdk/usr/include/libxml2 -Iinclude -I/Users/buildslave/jenkins/libcxx_libcxxabi_trunk_testing/CI_ARCH/32/CI_EXCEPTIONS/OFF/CI_STD/c++2a/llvm-project/llvm/include -Iprojects/libcxx/include/c++build -I/Users/buildslave/jenkins/libcxx_libcxxabi_trunk_testing/CI_ARCH/32/CI_EXCEPTIONS/OFF/CI_STD/c++2a/llvm-project/libcxx/include -fPIC -fvisibility-inlines-hidden -Werror=date-time -Werror=unguarded-availability-new -std=c++14 -Wall -Wextra -Wno-unused-parameter -Wwrite-strings -Wcast-qual -Wmissing-field-initializers  -Wno-long-long -Wimplicit-fallthrough -Wcovered-switch-default -Wno-noexcept-type -Wnon-virtual-dtor -Wdelete-non-virtual-dtor -Wstring-conversion -fdiagnostics-color -Os  -arch i386 -arch x86_64 -isysroot /Applications/Xcode.app/Contents/Developer/Platforms/MacOSX.platform/Developer/SDKs/MacOSX10.13.sdk   -UNDEBUG -DLIBCXX_BUILDING_LIBCXXABI -std=c++11 -nostdinc++ -fvisibility-inlines-hidden -fvisibility=hidden -Wall -Wextra -W -Wwrite-strings -Wno-unused-parameter -Wno-long-long -Werror=return-type -Wextra-semi -Wno-user-defined-literals -Wno-covered-switch-default -Wno-ignored-attributes -Wno-error -include/var/folders/9t/lrs73ptj6lv644zvh1fk2_gc0000gn/T/tmp.V8lXPf4b/llvm-build/projects/libcxx/__config_site -fno-exceptions -MD -MT projects/libcxx/src/CMakeFiles/cxx_shared.dir/stdexcept.cpp.o -MF projects/libcxx/src/CMakeFiles/cxx_shared.dir/stdexcept.cpp.o.d -o projects/libcxx/src/CMakeFiles/cxx_shared.dir/stdexcept.cpp.o -c /Users/buildslave/jenkins/libcxx_libcxxabi_trunk_testing/CI_ARCH/32/CI_EXCEPTIONS/OFF/CI_STD/c++2a/llvm-project/libcxx/src/stdexcept.cpp
[233/257] /Users/buildslave/jenkins/libcxx_libcxxabi_trunk_testing/CI_ARCH/32/CI_EXCEPTIONS/OFF/CI_STD/c++2a/host-compiler/bin/clang++  -D_DEBUG -D_LIBCPP_BUILDING_LIBRARY -D_LIBCPP_DEBUG=0 -D_LIBCPP_DISABLE_NEW_DELETE_DEFINITIONS -D_LIBCPP_HAS_COMMENT_LIB_PRAGMA -D_LIBCPP_HAS_NO_PRAGMA_SYSTEM_HEADER -D_LIBCPP_NO_EXCEPTIONS -D__STDC_CONSTANT_MACROS -D__STDC_FORMAT_MACROS -D__STDC_LIMIT_MACROS -Iprojects/libcxx/src -I/Users/buildslave/jenkins/libcxx_libcxxabi_trunk_testing/CI_ARCH/32/CI_EXCEPTIONS/OFF/CI_STD/c++2a/llvm-project/libcxx/src -I/Applications/Xcode.app/Contents/Developer/Platforms/MacOSX.platform/Developer/SDKs/MacOSX10.13.sdk/usr/include/libxml2 -Iinclude -I/Users/buildslave/jenkins/libcxx_libcxxabi_trunk_testing/CI_ARCH/32/CI_EXCEPTIONS/OFF/CI_STD/c++2a/llvm-project/llvm/include -Iprojects/libcxx/include/c++build -I/Users/buildslave/jenkins/libcxx_libcxxabi_trunk_testing/CI_ARCH/32/CI_EXCEPTIONS/OFF/CI_STD/c++2a/llvm-project/libcxx/include -fPIC -fvisibility-inlines-hidden -Werror=date-time -Werror=unguarded-availability-new -std=c++14 -Wall -Wextra -Wno-unused-parameter -Wwrite-strings -Wcast-qual -Wmissing-field-initializers  -Wno-long-long -Wimplicit-fallthrough -Wcovered-switch-default -Wno-noexcept-type -Wnon-virtual-dtor -Wdelete-non-virtual-dtor -Wstring-conversion -fdiagnostics-color -Os  -arch i386 -arch x86_64 -isysroot /Applications/Xcode.app/Contents/Developer/Platforms/MacOSX.platform/Developer/SDKs/MacOSX10.13.sdk   -UNDEBUG -DLIBCXX_BUILDING_LIBCXXABI -std=c++11 -nostdinc++ -fvisibility-inlines-hidden -fvisibility=hidden -Wall -Wextra -W -Wwrite-strings -Wno-unused-parameter -Wno-long-long -Werror=return-type -Wextra-semi -Wno-user-defined-literals -Wno-covered-switch-default -Wno-ignored-attributes -Wno-error -include/var/folders/9t/lrs73ptj6lv644zvh1fk2_gc0000gn/T/tmp.V8lXPf4b/llvm-build/projects/libcxx/__config_site -fno-exceptions -MD -MT projects/libcxx/src/CMakeFiles/cxx_shared.dir/shared_mutex.cpp.o -MF projects/libcxx/src/CMakeFiles/cxx_shared.dir/shared_mutex.cpp.o.d -o projects/libcxx/src/CMakeFiles/cxx_shared.dir/shared_mutex.cpp.o -c /Users/buildslave/jenkins/libcxx_libcxxabi_trunk_testing/CI_ARCH/32/CI_EXCEPTIONS/OFF/CI_STD/c++2a/llvm-project/libcxx/src/shared_mutex.cpp
[234/257] /Users/buildslave/jenkins/libcxx_libcxxabi_trunk_testing/CI_ARCH/32/CI_EXCEPTIONS/OFF/CI_STD/c++2a/host-compiler/bin/clang++  -D_DEBUG -D_LIBCPP_BUILDING_LIBRARY -D_LIBCPP_DEBUG=0 -D_LIBCPP_DISABLE_NEW_DELETE_DEFINITIONS -D_LIBCPP_HAS_COMMENT_LIB_PRAGMA -D_LIBCPP_HAS_NO_PRAGMA_SYSTEM_HEADER -D_LIBCPP_NO_EXCEPTIONS -D__STDC_CONSTANT_MACROS -D__STDC_FORMAT_MACROS -D__STDC_LIMIT_MACROS -Iprojects/libcxx/src -I/Users/buildslave/jenkins/libcxx_libcxxabi_trunk_testing/CI_ARCH/32/CI_EXCEPTIONS/OFF/CI_STD/c++2a/llvm-project/libcxx/src -I/Applications/Xcode.app/Contents/Developer/Platforms/MacOSX.platform/Developer/SDKs/MacOSX10.13.sdk/usr/include/libxml2 -Iinclude -I/Users/buildslave/jenkins/libcxx_libcxxabi_trunk_testing/CI_ARCH/32/CI_EXCEPTIONS/OFF/CI_STD/c++2a/llvm-project/llvm/include -Iprojects/libcxx/include/c++build -I/Users/buildslave/jenkins/libcxx_libcxxabi_trunk_testing/CI_ARCH/32/CI_EXCEPTIONS/OFF/CI_STD/c++2a/llvm-project/libcxx/include -fPIC -fvisibility-inlines-hidden -Werror=date-time -Werror=unguarded-availability-new -std=c++14 -Wall -Wextra -Wno-unused-parameter -Wwrite-strings -Wcast-qual -Wmissing-field-initializers  -Wno-long-long -Wimplicit-fallthrough -Wcovered-switch-default -Wno-noexcept-type -Wnon-virtual-dtor -Wdelete-non-virtual-dtor -Wstring-conversion -fdiagnostics-color -Os  -arch i386 -arch x86_64 -isysroot /Applications/Xcode.app/Contents/Developer/Platforms/MacOSX.platform/Developer/SDKs/MacOSX10.13.sdk   -UNDEBUG -DLIBCXX_BUILDING_LIBCXXABI -std=c++11 -nostdinc++ -fvisibility-inlines-hidden -fvisibility=hidden -Wall -Wextra -W -Wwrite-strings -Wno-unused-parameter -Wno-long-long -Werror=return-type -Wextra-semi -Wno-user-defined-literals -Wno-covered-switch-default -Wno-ignored-attributes -Wno-error -include/var/folders/9t/lrs73ptj6lv644zvh1fk2_gc0000gn/T/tmp.V8lXPf4b/llvm-build/projects/libcxx/__config_site -fno-exceptions -MD -MT projects/libcxx/src/CMakeFiles/cxx_shared.dir/typeinfo.cpp.o -MF projects/libcxx/src/CMakeFiles/cxx_shared.dir/typeinfo.cpp.o.d -o projects/libcxx/src/CMakeFiles/cxx_shared.dir/typeinfo.cpp.o -c /Users/buildslave/jenkins/libcxx_libcxxabi_trunk_testing/CI_ARCH/32/CI_EXCEPTIONS/OFF/CI_STD/c++2a/llvm-project/libcxx/src/typeinfo.cpp
[235/257] /Users/buildslave/jenkins/libcxx_libcxxabi_trunk_testing/CI_ARCH/32/CI_EXCEPTIONS/OFF/CI_STD/c++2a/host-compiler/bin/clang++  -D_DEBUG -D_LIBCPP_BUILDING_LIBRARY -D_LIBCPP_DEBUG=0 -D_LIBCPP_DISABLE_NEW_DELETE_DEFINITIONS -D_LIBCPP_HAS_COMMENT_LIB_PRAGMA -D_LIBCPP_HAS_NO_PRAGMA_SYSTEM_HEADER -D_LIBCPP_NO_EXCEPTIONS -D__STDC_CONSTANT_MACROS -D__STDC_FORMAT_MACROS -D__STDC_LIMIT_MACROS -Iprojects/libcxx/src -I/Users/buildslave/jenkins/libcxx_libcxxabi_trunk_testing/CI_ARCH/32/CI_EXCEPTIONS/OFF/CI_STD/c++2a/llvm-project/libcxx/src -I/Applications/Xcode.app/Contents/Developer/Platforms/MacOSX.platform/Developer/SDKs/MacOSX10.13.sdk/usr/include/libxml2 -Iinclude -I/Users/buildslave/jenkins/libcxx_libcxxabi_trunk_testing/CI_ARCH/32/CI_EXCEPTIONS/OFF/CI_STD/c++2a/llvm-project/llvm/include -Iprojects/libcxx/include/c++build -I/Users/buildslave/jenkins/libcxx_libcxxabi_trunk_testing/CI_ARCH/32/CI_EXCEPTIONS/OFF/CI_STD/c++2a/llvm-project/libcxx/include -fPIC -fvisibility-inlines-hidden -Werror=date-time -Werror=unguarded-availability-new -std=c++14 -Wall -Wextra -Wno-unused-parameter -Wwrite-strings -Wcast-qual -Wmissing-field-initializers  -Wno-long-long -Wimplicit-fallthrough -Wcovered-switch-default -Wno-noexcept-type -Wnon-virtual-dtor -Wdelete-non-virtual-dtor -Wstring-conversion -fdiagnostics-color -Os  -arch i386 -arch x86_64 -isysroot /Applications/Xcode.app/Contents/Developer/Platforms/MacOSX.platform/Developer/SDKs/MacOSX10.13.sdk   -UNDEBUG -DLIBCXX_BUILDING_LIBCXXABI -std=c++11 -nostdinc++ -fvisibility-inlines-hidden -fvisibility=hidden -Wall -Wextra -W -Wwrite-strings -Wno-unused-parameter -Wno-long-long -Werror=return-type -Wextra-semi -Wno-user-defined-literals -Wno-covered-switch-default -Wno-ignored-attributes -Wno-error -include/var/folders/9t/lrs73ptj6lv644zvh1fk2_gc0000gn/T/tmp.V8lXPf4b/llvm-build/projects/libcxx/__config_site -fno-exceptions -MD -MT projects/libcxx/src/CMakeFiles/cxx_shared.dir/random.cpp.o -MF projects/libcxx/src/CMakeFiles/cxx_shared.dir/random.cpp.o.d -o projects/libcxx/src/CMakeFiles/cxx_shared.dir/random.cpp.o -c /Users/buildslave/jenkins/libcxx_libcxxabi_trunk_testing/CI_ARCH/32/CI_EXCEPTIONS/OFF/CI_STD/c++2a/llvm-project/libcxx/src/random.cpp
[236/257] /Users/buildslave/jenkins/libcxx_libcxxabi_trunk_testing/CI_ARCH/32/CI_EXCEPTIONS/OFF/CI_STD/c++2a/host-compiler/bin/clang++  -D_DEBUG -D_LIBCPP_BUILDING_LIBRARY -D_LIBCPP_DEBUG=0 -D_LIBCPP_DISABLE_NEW_DELETE_DEFINITIONS -D_LIBCPP_HAS_COMMENT_LIB_PRAGMA -D_LIBCPP_HAS_NO_PRAGMA_SYSTEM_HEADER -D_LIBCPP_NO_EXCEPTIONS -D__STDC_CONSTANT_MACROS -D__STDC_FORMAT_MACROS -D__STDC_LIMIT_MACROS -Iprojects/libcxx/src -I/Users/buildslave/jenkins/libcxx_libcxxabi_trunk_testing/CI_ARCH/32/CI_EXCEPTIONS/OFF/CI_STD/c++2a/llvm-project/libcxx/src -I/Applications/Xcode.app/Contents/Developer/Platforms/MacOSX.platform/Developer/SDKs/MacOSX10.13.sdk/usr/include/libxml2 -Iinclude -I/Users/buildslave/jenkins/libcxx_libcxxabi_trunk_testing/CI_ARCH/32/CI_EXCEPTIONS/OFF/CI_STD/c++2a/llvm-project/llvm/include -Iprojects/libcxx/include/c++build -I/Users/buildslave/jenkins/libcxx_libcxxabi_trunk_testing/CI_ARCH/32/CI_EXCEPTIONS/OFF/CI_STD/c++2a/llvm-project/libcxx/include -fPIC -fvisibility-inlines-hidden -Werror=date-time -Werror=unguarded-availability-new -std=c++14 -Wall -Wextra -Wno-unused-parameter -Wwrite-strings -Wcast-qual -Wmissing-field-initializers  -Wno-long-long -Wimplicit-fallthrough -Wcovered-switch-default -Wno-noexcept-type -Wnon-virtual-dtor -Wdelete-non-virtual-dtor -Wstring-conversion -fdiagnostics-color -Os  -arch i386 -arch x86_64 -isysroot /Applications/Xcode.app/Contents/Developer/Platforms/MacOSX.platform/Developer/SDKs/MacOSX10.13.sdk   -UNDEBUG -DLIBCXX_BUILDING_LIBCXXABI -std=c++11 -nostdinc++ -fvisibility-inlines-hidden -fvisibility=hidden -Wall -Wextra -W -Wwrite-strings -Wno-unused-parameter -Wno-long-long -Werror=return-type -Wextra-semi -Wno-user-defined-literals -Wno-covered-switch-default -Wno-ignored-attributes -Wno-error -include/var/folders/9t/lrs73ptj6lv644zvh1fk2_gc0000gn/T/tmp.V8lXPf4b/llvm-build/projects/libcxx/__config_site -fno-exceptions -MD -MT projects/libcxx/src/CMakeFiles/cxx_shared.dir/regex.cpp.o -MF projects/libcxx/src/CMakeFiles/cxx_shared.dir/regex.cpp.o.d -o projects/libcxx/src/CMakeFiles/cxx_shared.dir/regex.cpp.o -c /Users/buildslave/jenkins/libcxx_libcxxabi_trunk_testing/CI_ARCH/32/CI_EXCEPTIONS/OFF/CI_STD/c++2a/llvm-project/libcxx/src/regex.cpp
[237/257] /Users/buildslave/jenkins/libcxx_libcxxabi_trunk_testing/CI_ARCH/32/CI_EXCEPTIONS/OFF/CI_STD/c++2a/host-compiler/bin/clang++  -D_LIBCPP_DISABLE_EXTERN_TEMPLATE -D_LIBCPP_ENABLE_CXX17_REMOVED_UNEXPECTED_FUNCTIONS -D_LIBCXXABI_BUILDING_LIBRARY -D__STDC_CONSTANT_MACROS -D__STDC_FORMAT_MACROS -D__STDC_LIMIT_MACROS -Iprojects/libcxxabi/src -I/Users/buildslave/jenkins/libcxx_libcxxabi_trunk_testing/CI_ARCH/32/CI_EXCEPTIONS/OFF/CI_STD/c++2a/llvm-project/libcxxabi/src -I/Applications/Xcode.app/Contents/Developer/Platforms/MacOSX.platform/Developer/SDKs/MacOSX10.13.sdk/usr/include/libxml2 -Iinclude -I/Users/buildslave/jenkins/libcxx_libcxxabi_trunk_testing/CI_ARCH/32/CI_EXCEPTIONS/OFF/CI_STD/c++2a/llvm-project/llvm/include -I/Users/buildslave/jenkins/libcxx_libcxxabi_trunk_testing/CI_ARCH/32/CI_EXCEPTIONS/OFF/CI_STD/c++2a/llvm-project/libcxxabi/include -I/Users/buildslave/jenkins/libcxx_libcxxabi_trunk_testing/CI_ARCH/32/CI_EXCEPTIONS/OFF/CI_STD/c++2a/llvm-project/libcxx/include -fPIC -fvisibility-inlines-hidden -Werror=date-time -Werror=unguarded-availability-new -std=c++14 -Wall -Wextra -Wno-unused-parameter -Wwrite-strings -Wcast-qual -Wmissing-field-initializers -pedantic -Wno-long-long -Wimplicit-fallthrough -Wcovered-switch-default -Wno-noexcept-type -Wnon-virtual-dtor -Wdelete-non-virtual-dtor -Wstring-conversion -fdiagnostics-color  -Os -DNDEBUG -arch i386 -arch x86_64 -isysroot /Applications/Xcode.app/Contents/Developer/Platforms/MacOSX.platform/Developer/SDKs/MacOSX10.13.sdk -fPIC   -nostdinc++ -Werror=return-type -W -Wall -Wchar-subscripts -Wconversion -Wmismatched-tags -Wmissing-braces -Wnewline-eof -Wunused-function -Wshadow -Wshorten-64-to-32 -Wsign-compare -Wsign-conversion -Wstrict-aliasing=2 -Wstrict-overflow=4 -Wunused-parameter -Wunused-variable -Wwrite-strings -Wundef -Wno-error -pedantic -fstrict-aliasing -funwind-tables -D_DEBUG -std=c++11 -MD -MT projects/libcxxabi/src/CMakeFiles/cxxabi_shared.dir/cxa_demangle.cpp.o -MF projects/libcxxabi/src/CMakeFiles/cxxabi_shared.dir/cxa_demangle.cpp.o.d -o projects/libcxxabi/src/CMakeFiles/cxxabi_shared.dir/cxa_demangle.cpp.o -c /Users/buildslave/jenkins/libcxx_libcxxabi_trunk_testing/CI_ARCH/32/CI_EXCEPTIONS/OFF/CI_STD/c++2a/llvm-project/libcxxabi/src/cxa_demangle.cpp
[238/257] /Users/buildslave/jenkins/libcxx_libcxxabi_trunk_testing/CI_ARCH/32/CI_EXCEPTIONS/OFF/CI_STD/c++2a/host-compiler/bin/clang++  -D_DEBUG -D_LIBCPP_BUILDING_LIBRARY -D_LIBCPP_DEBUG=0 -D_LIBCPP_DISABLE_NEW_DELETE_DEFINITIONS -D_LIBCPP_HAS_COMMENT_LIB_PRAGMA -D_LIBCPP_HAS_NO_PRAGMA_SYSTEM_HEADER -D_LIBCPP_NO_EXCEPTIONS -D__STDC_CONSTANT_MACROS -D__STDC_FORMAT_MACROS -D__STDC_LIMIT_MACROS -Iprojects/libcxx/src -I/Users/buildslave/jenkins/libcxx_libcxxabi_trunk_testing/CI_ARCH/32/CI_EXCEPTIONS/OFF/CI_STD/c++2a/llvm-project/libcxx/src -I/Applications/Xcode.app/Contents/Developer/Platforms/MacOSX.platform/Developer/SDKs/MacOSX10.13.sdk/usr/include/libxml2 -Iinclude -I/Users/buildslave/jenkins/libcxx_libcxxabi_trunk_testing/CI_ARCH/32/CI_EXCEPTIONS/OFF/CI_STD/c++2a/llvm-project/llvm/include -Iprojects/libcxx/include/c++build -I/Users/buildslave/jenkins/libcxx_libcxxabi_trunk_testing/CI_ARCH/32/CI_EXCEPTIONS/OFF/CI_STD/c++2a/llvm-project/libcxx/include -fPIC -fvisibility-inlines-hidden -Werror=date-time -Werror=unguarded-availability-new -std=c++14 -Wall -Wextra -Wno-unused-parameter -Wwrite-strings -Wcast-qual -Wmissing-field-initializers  -Wno-long-long -Wimplicit-fallthrough -Wcovered-switch-default -Wno-noexcept-type -Wnon-virtual-dtor -Wdelete-non-virtual-dtor -Wstring-conversion -fdiagnostics-color -Os  -arch i386 -arch x86_64 -isysroot /Applications/Xcode.app/Contents/Developer/Platforms/MacOSX.platform/Developer/SDKs/MacOSX10.13.sdk   -UNDEBUG -DLIBCXX_BUILDING_LIBCXXABI -std=c++11 -nostdinc++ -fvisibility-inlines-hidden -fvisibility=hidden -Wall -Wextra -W -Wwrite-strings -Wno-unused-parameter -Wno-long-long -Werror=return-type -Wextra-semi -Wno-user-defined-literals -Wno-covered-switch-default -Wno-ignored-attributes -Wno-error -include/var/folders/9t/lrs73ptj6lv644zvh1fk2_gc0000gn/T/tmp.V8lXPf4b/llvm-build/projects/libcxx/__config_site -fno-exceptions -MD -MT projects/libcxx/src/CMakeFiles/cxx_shared.dir/utility.cpp.o -MF projects/libcxx/src/CMakeFiles/cxx_shared.dir/utility.cpp.o.d -o projects/libcxx/src/CMakeFiles/cxx_shared.dir/utility.cpp.o -c /Users/buildslave/jenkins/libcxx_libcxxabi_trunk_testing/CI_ARCH/32/CI_EXCEPTIONS/OFF/CI_STD/c++2a/llvm-project/libcxx/src/utility.cpp
[239/257] : && /Users/buildslave/jenkins/libcxx_libcxxabi_trunk_testing/CI_ARCH/32/CI_EXCEPTIONS/OFF/CI_STD/c++2a/host-compiler/bin/clang++ -fPIC -fvisibility-inlines-hidden -Werror=date-time -Werror=unguarded-availability-new -std=c++14 -Wall -Wextra -Wno-unused-parameter -Wwrite-strings -Wcast-qual -Wmissing-field-initializers -pedantic -Wno-long-long -Wimplicit-fallthrough -Wcovered-switch-default -Wno-noexcept-type -Wnon-virtual-dtor -Wdelete-non-virtual-dtor -Wstring-conversion -fdiagnostics-color  -Os -DNDEBUG -arch i386 -arch x86_64 -isysroot /Applications/Xcode.app/Contents/Developer/Platforms/MacOSX.platform/Developer/SDKs/MacOSX10.13.sdk -dynamiclib -Wl,-headerpad_max_install_names -nodefaultlibs  -compatibility_version 1.0.0 -current_version 1.0.0 -o lib/libc++abi.1.0.dylib -install_name @rpath/libc++abi.1.dylib projects/libcxxabi/src/CMakeFiles/cxxabi_shared.dir/cxa_aux_runtime.cpp.o projects/libcxxabi/src/CMakeFiles/cxxabi_shared.dir/cxa_default_handlers.cpp.o projects/libcxxabi/src/CMakeFiles/cxxabi_shared.dir/cxa_demangle.cpp.o projects/libcxxabi/src/CMakeFiles/cxxabi_shared.dir/cxa_exception_storage.cpp.o projects/libcxxabi/src/CMakeFiles/cxxabi_shared.dir/cxa_guard.cpp.o projects/libcxxabi/src/CMakeFiles/cxxabi_shared.dir/cxa_handlers.cpp.o projects/libcxxabi/src/CMakeFiles/cxxabi_shared.dir/cxa_unexpected.cpp.o projects/libcxxabi/src/CMakeFiles/cxxabi_shared.dir/cxa_vector.cpp.o projects/libcxxabi/src/CMakeFiles/cxxabi_shared.dir/cxa_virtual.cpp.o projects/libcxxabi/src/CMakeFiles/cxxabi_shared.dir/stdlib_exception.cpp.o projects/libcxxabi/src/CMakeFiles/cxxabi_shared.dir/stdlib_stdexcept.cpp.o projects/libcxxabi/src/CMakeFiles/cxxabi_shared.dir/stdlib_typeinfo.cpp.o projects/libcxxabi/src/CMakeFiles/cxxabi_shared.dir/abort_message.cpp.o projects/libcxxabi/src/CMakeFiles/cxxabi_shared.dir/fallback_malloc.cpp.o projects/libcxxabi/src/CMakeFiles/cxxabi_shared.dir/private_typeinfo.cpp.o projects/libcxxabi/src/CMakeFiles/cxxabi_shared.dir/stdlib_new_delete.cpp.o projects/libcxxabi/src/CMakeFiles/cxxabi_shared.dir/cxa_exception.cpp.o projects/libcxxabi/src/CMakeFiles/cxxabi_shared.dir/cxa_personality.cpp.o  -Wl,-rpath,@loader_path/../lib -lSystem -Wl,-exported_symbols_list,/Users/buildslave/jenkins/libcxx_libcxxabi_trunk_testing/CI_ARCH/32/CI_EXCEPTIONS/OFF/CI_STD/c++2a/llvm-project/libcxxabi/src/../lib/itanium-base.exp -Wl,-exported_symbols_list,/Users/buildslave/jenkins/libcxx_libcxxabi_trunk_testing/CI_ARCH/32/CI_EXCEPTIONS/OFF/CI_STD/c++2a/llvm-project/libcxxabi/src/../lib/new-delete.exp -Wl,-exported_symbols_list,/Users/buildslave/jenkins/libcxx_libcxxabi_trunk_testing/CI_ARCH/32/CI_EXCEPTIONS/OFF/CI_STD/c++2a/llvm-project/libcxxabi/src/../lib/personality-v0.exp && :
[240/257] /usr/local/Cellar/cmake/3.13.1/bin/cmake -E cmake_symlink_library lib/libc++abi.1.0.dylib  lib/libc++abi.1.dylib lib/libc++abi.dylib && :
[241/257] /Users/buildslave/jenkins/libcxx_libcxxabi_trunk_testing/CI_ARCH/32/CI_EXCEPTIONS/OFF/CI_STD/c++2a/host-compiler/bin/clang++  -D_DEBUG -D_LIBCPP_BUILDING_LIBRARY -D_LIBCPP_DEBUG=0 -D_LIBCPP_DISABLE_NEW_DELETE_DEFINITIONS -D_LIBCPP_HAS_COMMENT_LIB_PRAGMA -D_LIBCPP_HAS_NO_PRAGMA_SYSTEM_HEADER -D_LIBCPP_NO_EXCEPTIONS -D__STDC_CONSTANT_MACROS -D__STDC_FORMAT_MACROS -D__STDC_LIMIT_MACROS -Iprojects/libcxx/src -I/Users/buildslave/jenkins/libcxx_libcxxabi_trunk_testing/CI_ARCH/32/CI_EXCEPTIONS/OFF/CI_STD/c++2a/llvm-project/libcxx/src -I/Applications/Xcode.app/Contents/Developer/Platforms/MacOSX.platform/Developer/SDKs/MacOSX10.13.sdk/usr/include/libxml2 -Iinclude -I/Users/buildslave/jenkins/libcxx_libcxxabi_trunk_testing/CI_ARCH/32/CI_EXCEPTIONS/OFF/CI_STD/c++2a/llvm-project/llvm/include -Iprojects/libcxx/include/c++build -I/Users/buildslave/jenkins/libcxx_libcxxabi_trunk_testing/CI_ARCH/32/CI_EXCEPTIONS/OFF/CI_STD/c++2a/llvm-project/libcxx/include -fPIC -fvisibility-inlines-hidden -Werror=date-time -Werror=unguarded-availability-new -std=c++14 -Wall -Wextra -Wno-unused-parameter -Wwrite-strings -Wcast-qual -Wmissing-field-initializers  -Wno-long-long -Wimplicit-fallthrough -Wcovered-switch-default -Wno-noexcept-type -Wnon-virtual-dtor -Wdelete-non-virtual-dtor -Wstring-conversion -fdiagnostics-color -Os  -arch i386 -arch x86_64 -isysroot /Applications/Xcode.app/Contents/Developer/Platforms/MacOSX.platform/Developer/SDKs/MacOSX10.13.sdk   -UNDEBUG -DLIBCXX_BUILDING_LIBCXXABI -std=c++11 -nostdinc++ -fvisibility-inlines-hidden -fvisibility=hidden -Wall -Wextra -W -Wwrite-strings -Wno-unused-parameter -Wno-long-long -Werror=return-type -Wextra-semi -Wno-user-defined-literals -Wno-covered-switch-default -Wno-ignored-attributes -Wno-error -include/var/folders/9t/lrs73ptj6lv644zvh1fk2_gc0000gn/T/tmp.V8lXPf4b/llvm-build/projects/libcxx/__config_site -fno-exceptions -MD -MT projects/libcxx/src/CMakeFiles/cxx_shared.dir/strstream.cpp.o -MF projects/libcxx/src/CMakeFiles/cxx_shared.dir/strstream.cpp.o.d -o projects/libcxx/src/CMakeFiles/cxx_shared.dir/strstream.cpp.o -c /Users/buildslave/jenkins/libcxx_libcxxabi_trunk_testing/CI_ARCH/32/CI_EXCEPTIONS/OFF/CI_STD/c++2a/llvm-project/libcxx/src/strstream.cpp
[242/257] /Users/buildslave/jenkins/libcxx_libcxxabi_trunk_testing/CI_ARCH/32/CI_EXCEPTIONS/OFF/CI_STD/c++2a/host-compiler/bin/clang++  -D_LIBCPP_DISABLE_EXTERN_TEMPLATE -D_LIBCPP_ENABLE_CXX17_REMOVED_UNEXPECTED_FUNCTIONS -D_LIBCXXABI_BUILDING_LIBRARY -D__STDC_CONSTANT_MACROS -D__STDC_FORMAT_MACROS -D__STDC_LIMIT_MACROS -Iprojects/libcxxabi/src -I/Users/buildslave/jenkins/libcxx_libcxxabi_trunk_testing/CI_ARCH/32/CI_EXCEPTIONS/OFF/CI_STD/c++2a/llvm-project/libcxxabi/src -I/Applications/Xcode.app/Contents/Developer/Platforms/MacOSX.platform/Developer/SDKs/MacOSX10.13.sdk/usr/include/libxml2 -Iinclude -I/Users/buildslave/jenkins/libcxx_libcxxabi_trunk_testing/CI_ARCH/32/CI_EXCEPTIONS/OFF/CI_STD/c++2a/llvm-project/llvm/include -I/Users/buildslave/jenkins/libcxx_libcxxabi_trunk_testing/CI_ARCH/32/CI_EXCEPTIONS/OFF/CI_STD/c++2a/llvm-project/libcxxabi/include -I/Users/buildslave/jenkins/libcxx_libcxxabi_trunk_testing/CI_ARCH/32/CI_EXCEPTIONS/OFF/CI_STD/c++2a/llvm-project/libcxx/include -fPIC -fvisibility-inlines-hidden -Werror=date-time -Werror=unguarded-availability-new -std=c++14 -Wall -Wextra -Wno-unused-parameter -Wwrite-strings -Wcast-qual -Wmissing-field-initializers -pedantic -Wno-long-long -Wimplicit-fallthrough -Wcovered-switch-default -Wno-noexcept-type -Wnon-virtual-dtor -Wdelete-non-virtual-dtor -Wstring-conversion -fdiagnostics-color  -Os -DNDEBUG -arch i386 -arch x86_64 -isysroot /Applications/Xcode.app/Contents/Developer/Platforms/MacOSX.platform/Developer/SDKs/MacOSX10.13.sdk -fPIC   -nostdinc++ -Werror=return-type -W -Wall -Wchar-subscripts -Wconversion -Wmismatched-tags -Wmissing-braces -Wnewline-eof -Wunused-function -Wshadow -Wshorten-64-to-32 -Wsign-compare -Wsign-conversion -Wstrict-aliasing=2 -Wstrict-overflow=4 -Wunused-parameter -Wunused-variable -Wwrite-strings -Wundef -Wno-error -pedantic -fstrict-aliasing -funwind-tables -D_DEBUG -std=c++11 -MD -MT projects/libcxxabi/src/CMakeFiles/cxxabi_static.dir/cxa_demangle.cpp.o -MF projects/libcxxabi/src/CMakeFiles/cxxabi_static.dir/cxa_demangle.cpp.o.d -o projects/libcxxabi/src/CMakeFiles/cxxabi_static.dir/cxa_demangle.cpp.o -c /Users/buildslave/jenkins/libcxx_libcxxabi_trunk_testing/CI_ARCH/32/CI_EXCEPTIONS/OFF/CI_STD/c++2a/llvm-project/libcxxabi/src/cxa_demangle.cpp
[243/257] /Users/buildslave/jenkins/libcxx_libcxxabi_trunk_testing/CI_ARCH/32/CI_EXCEPTIONS/OFF/CI_STD/c++2a/host-compiler/bin/clang++  -D_DEBUG -D_LIBCPP_BUILDING_LIBRARY -D_LIBCPP_DEBUG=0 -D_LIBCPP_DISABLE_NEW_DELETE_DEFINITIONS -D_LIBCPP_HAS_COMMENT_LIB_PRAGMA -D_LIBCPP_HAS_NO_PRAGMA_SYSTEM_HEADER -D_LIBCPP_NO_EXCEPTIONS -D__STDC_CONSTANT_MACROS -D__STDC_FORMAT_MACROS -D__STDC_LIMIT_MACROS -Iprojects/libcxx/src -I/Users/buildslave/jenkins/libcxx_libcxxabi_trunk_testing/CI_ARCH/32/CI_EXCEPTIONS/OFF/CI_STD/c++2a/llvm-project/libcxx/src -I/Applications/Xcode.app/Contents/Developer/Platforms/MacOSX.platform/Developer/SDKs/MacOSX10.13.sdk/usr/include/libxml2 -Iinclude -I/Users/buildslave/jenkins/libcxx_libcxxabi_trunk_testing/CI_ARCH/32/CI_EXCEPTIONS/OFF/CI_STD/c++2a/llvm-project/llvm/include -Iprojects/libcxx/include/c++build -I/Users/buildslave/jenkins/libcxx_libcxxabi_trunk_testing/CI_ARCH/32/CI_EXCEPTIONS/OFF/CI_STD/c++2a/llvm-project/libcxx/include -fPIC -fvisibility-inlines-hidden -Werror=date-time -Werror=unguarded-availability-new -std=c++14 -Wall -Wextra -Wno-unused-parameter -Wwrite-strings -Wcast-qual -Wmissing-field-initializers  -Wno-long-long -Wimplicit-fallthrough -Wcovered-switch-default -Wno-noexcept-type -Wnon-virtual-dtor -Wdelete-non-virtual-dtor -Wstring-conversion -fdiagnostics-color -Os  -arch i386 -arch x86_64 -isysroot /Applications/Xcode.app/Contents/Developer/Platforms/MacOSX.platform/Developer/SDKs/MacOSX10.13.sdk   -UNDEBUG -DLIBCXX_BUILDING_LIBCXXABI -std=c++11 -nostdinc++ -fvisibility-inlines-hidden -fvisibility=hidden -Wall -Wextra -W -Wwrite-strings -Wno-unused-parameter -Wno-long-long -Werror=return-type -Wextra-semi -Wno-user-defined-literals -Wno-covered-switch-default -Wno-ignored-attributes -Wno-error -include/var/folders/9t/lrs73ptj6lv644zvh1fk2_gc0000gn/T/tmp.V8lXPf4b/llvm-build/projects/libcxx/__config_site -fno-exceptions -MD -MT projects/libcxx/src/CMakeFiles/cxx_shared.dir/system_error.cpp.o -MF projects/libcxx/src/CMakeFiles/cxx_shared.dir/system_error.cpp.o.d -o projects/libcxx/src/CMakeFiles/cxx_shared.dir/system_error.cpp.o -c /Users/buildslave/jenkins/libcxx_libcxxabi_trunk_testing/CI_ARCH/32/CI_EXCEPTIONS/OFF/CI_STD/c++2a/llvm-project/libcxx/src/system_error.cpp
[244/257] : && "/Applications/Xcode.app/Contents/Developer/Toolchains/XcodeDefault.xctoolchain/usr/bin/libtool" -static -no_warning_for_no_symbols -o lib/libc++abi.a  projects/libcxxabi/src/CMakeFiles/cxxabi_static.dir/cxa_aux_runtime.cpp.o projects/libcxxabi/src/CMakeFiles/cxxabi_static.dir/cxa_default_handlers.cpp.o projects/libcxxabi/src/CMakeFiles/cxxabi_static.dir/cxa_demangle.cpp.o projects/libcxxabi/src/CMakeFiles/cxxabi_static.dir/cxa_exception_storage.cpp.o projects/libcxxabi/src/CMakeFiles/cxxabi_static.dir/cxa_guard.cpp.o projects/libcxxabi/src/CMakeFiles/cxxabi_static.dir/cxa_handlers.cpp.o projects/libcxxabi/src/CMakeFiles/cxxabi_static.dir/cxa_unexpected.cpp.o projects/libcxxabi/src/CMakeFiles/cxxabi_static.dir/cxa_vector.cpp.o projects/libcxxabi/src/CMakeFiles/cxxabi_static.dir/cxa_virtual.cpp.o projects/libcxxabi/src/CMakeFiles/cxxabi_static.dir/stdlib_exception.cpp.o projects/libcxxabi/src/CMakeFiles/cxxabi_static.dir/stdlib_stdexcept.cpp.o projects/libcxxabi/src/CMakeFiles/cxxabi_static.dir/stdlib_typeinfo.cpp.o projects/libcxxabi/src/CMakeFiles/cxxabi_static.dir/abort_message.cpp.o projects/libcxxabi/src/CMakeFiles/cxxabi_static.dir/fallback_malloc.cpp.o projects/libcxxabi/src/CMakeFiles/cxxabi_static.dir/private_typeinfo.cpp.o projects/libcxxabi/src/CMakeFiles/cxxabi_static.dir/stdlib_new_delete.cpp.o projects/libcxxabi/src/CMakeFiles/cxxabi_static.dir/cxa_exception.cpp.o projects/libcxxabi/src/CMakeFiles/cxxabi_static.dir/cxa_personality.cpp.o && :
[245/257] cd /var/folders/9t/lrs73ptj6lv644zvh1fk2_gc0000gn/T/tmp.V8lXPf4b/llvm-build/projects/libcxxabi/src && /usr/local/Cellar/cmake/3.13.1/bin/cmake -DCMAKE_INSTALL_COMPONENT=cxxabi -P /var/folders/9t/lrs73ptj6lv644zvh1fk2_gc0000gn/T/tmp.V8lXPf4b/llvm-build/projects/libcxxabi/cmake_install.cmake
-- Install configuration: "MinSizeRel"
-- Installing: /var/folders/9t/lrs73ptj6lv644zvh1fk2_gc0000gn/T/tmp.V8lXPf4b/llvm-install/lib/libc++abi.1.0.dylib
-- Installing: /var/folders/9t/lrs73ptj6lv644zvh1fk2_gc0000gn/T/tmp.V8lXPf4b/llvm-install/lib/libc++abi.1.dylib
-- Installing: /var/folders/9t/lrs73ptj6lv644zvh1fk2_gc0000gn/T/tmp.V8lXPf4b/llvm-install/lib/libc++abi.dylib
-- Installing: /var/folders/9t/lrs73ptj6lv644zvh1fk2_gc0000gn/T/tmp.V8lXPf4b/llvm-install/lib/libc++abi.a
/Applications/Xcode.app/Contents/Developer/Toolchains/XcodeDefault.xctoolchain/usr/bin/ranlib: for architecture: i386 file: /var/folders/9t/lrs73ptj6lv644zvh1fk2_gc0000gn/T/tmp.V8lXPf4b/llvm-install/lib/libc++abi.a(cxa_unexpected.cpp.o) has no symbols
/Applications/Xcode.app/Contents/Developer/Toolchains/XcodeDefault.xctoolchain/usr/bin/ranlib: for architecture: x86_64 file: /var/folders/9t/lrs73ptj6lv644zvh1fk2_gc0000gn/T/tmp.V8lXPf4b/llvm-install/lib/libc++abi.a(cxa_unexpected.cpp.o) has no symbols
[246/257] /Users/buildslave/jenkins/libcxx_libcxxabi_trunk_testing/CI_ARCH/32/CI_EXCEPTIONS/OFF/CI_STD/c++2a/host-compiler/bin/clang++  -D_DEBUG -D_LIBCPP_BUILDING_LIBRARY -D_LIBCPP_DEBUG=0 -D_LIBCPP_DISABLE_NEW_DELETE_DEFINITIONS -D_LIBCPP_HAS_COMMENT_LIB_PRAGMA -D_LIBCPP_HAS_NO_PRAGMA_SYSTEM_HEADER -D_LIBCPP_NO_EXCEPTIONS -D__STDC_CONSTANT_MACROS -D__STDC_FORMAT_MACROS -D__STDC_LIMIT_MACROS -Iprojects/libcxx/src -I/Users/buildslave/jenkins/libcxx_libcxxabi_trunk_testing/CI_ARCH/32/CI_EXCEPTIONS/OFF/CI_STD/c++2a/llvm-project/libcxx/src -I/Applications/Xcode.app/Contents/Developer/Platforms/MacOSX.platform/Developer/SDKs/MacOSX10.13.sdk/usr/include/libxml2 -Iinclude -I/Users/buildslave/jenkins/libcxx_libcxxabi_trunk_testing/CI_ARCH/32/CI_EXCEPTIONS/OFF/CI_STD/c++2a/llvm-project/llvm/include -Iprojects/libcxx/include/c++build -I/Users/buildslave/jenkins/libcxx_libcxxabi_trunk_testing/CI_ARCH/32/CI_EXCEPTIONS/OFF/CI_STD/c++2a/llvm-project/libcxx/include -fPIC -fvisibility-inlines-hidden -Werror=date-time -Werror=unguarded-availability-new -std=c++14 -Wall -Wextra -Wno-unused-parameter -Wwrite-strings -Wcast-qual -Wmissing-field-initializers  -Wno-long-long -Wimplicit-fallthrough -Wcovered-switch-default -Wno-noexcept-type -Wnon-virtual-dtor -Wdelete-non-virtual-dtor -Wstring-conversion -fdiagnostics-color -Os  -arch i386 -arch x86_64 -isysroot /Applications/Xcode.app/Contents/Developer/Platforms/MacOSX.platform/Developer/SDKs/MacOSX10.13.sdk   -UNDEBUG -DLIBCXX_BUILDING_LIBCXXABI -std=c++11 -nostdinc++ -fvisibility-inlines-hidden -fvisibility=hidden -Wall -Wextra -W -Wwrite-strings -Wno-unused-parameter -Wno-long-long -Werror=return-type -Wextra-semi -Wno-user-defined-literals -Wno-covered-switch-default -Wno-ignored-attributes -Wno-error -include/var/folders/9t/lrs73ptj6lv644zvh1fk2_gc0000gn/T/tmp.V8lXPf4b/llvm-build/projects/libcxx/__config_site -fno-exceptions -MD -MT projects/libcxx/src/CMakeFiles/cxx_shared.dir/variant.cpp.o -MF projects/libcxx/src/CMakeFiles/cxx_shared.dir/variant.cpp.o.d -o projects/libcxx/src/CMakeFiles/cxx_shared.dir/variant.cpp.o -c /Users/buildslave/jenkins/libcxx_libcxxabi_trunk_testing/CI_ARCH/32/CI_EXCEPTIONS/OFF/CI_STD/c++2a/llvm-project/libcxx/src/variant.cpp
[247/257] /Users/buildslave/jenkins/libcxx_libcxxabi_trunk_testing/CI_ARCH/32/CI_EXCEPTIONS/OFF/CI_STD/c++2a/host-compiler/bin/clang++  -D_DEBUG -D_LIBCPP_BUILDING_LIBRARY -D_LIBCPP_DEBUG=0 -D_LIBCPP_DISABLE_NEW_DELETE_DEFINITIONS -D_LIBCPP_HAS_COMMENT_LIB_PRAGMA -D_LIBCPP_HAS_NO_PRAGMA_SYSTEM_HEADER -D_LIBCPP_NO_EXCEPTIONS -D__STDC_CONSTANT_MACROS -D__STDC_FORMAT_MACROS -D__STDC_LIMIT_MACROS -Iprojects/libcxx/src -I/Users/buildslave/jenkins/libcxx_libcxxabi_trunk_testing/CI_ARCH/32/CI_EXCEPTIONS/OFF/CI_STD/c++2a/llvm-project/libcxx/src -I/Applications/Xcode.app/Contents/Developer/Platforms/MacOSX.platform/Developer/SDKs/MacOSX10.13.sdk/usr/include/libxml2 -Iinclude -I/Users/buildslave/jenkins/libcxx_libcxxabi_trunk_testing/CI_ARCH/32/CI_EXCEPTIONS/OFF/CI_STD/c++2a/llvm-project/llvm/include -Iprojects/libcxx/include/c++build -I/Users/buildslave/jenkins/libcxx_libcxxabi_trunk_testing/CI_ARCH/32/CI_EXCEPTIONS/OFF/CI_STD/c++2a/llvm-project/libcxx/include -fPIC -fvisibility-inlines-hidden -Werror=date-time -Werror=unguarded-availability-new -std=c++14 -Wall -Wextra -Wno-unused-parameter -Wwrite-strings -Wcast-qual -Wmissing-field-initializers  -Wno-long-long -Wimplicit-fallthrough -Wcovered-switch-default -Wno-noexcept-type -Wnon-virtual-dtor -Wdelete-non-virtual-dtor -Wstring-conversion -fdiagnostics-color -Os  -arch i386 -arch x86_64 -isysroot /Applications/Xcode.app/Contents/Developer/Platforms/MacOSX.platform/Developer/SDKs/MacOSX10.13.sdk   -UNDEBUG -DLIBCXX_BUILDING_LIBCXXABI -std=c++11 -nostdinc++ -fvisibility-inlines-hidden -fvisibility=hidden -Wall -Wextra -W -Wwrite-strings -Wno-unused-parameter -Wno-long-long -Werror=return-type -Wextra-semi -Wno-user-defined-literals -Wno-covered-switch-default -Wno-ignored-attributes -Wno-error -include/var/folders/9t/lrs73ptj6lv644zvh1fk2_gc0000gn/T/tmp.V8lXPf4b/llvm-build/projects/libcxx/__config_site -fno-exceptions -MD -MT projects/libcxx/src/CMakeFiles/cxx_shared.dir/vector.cpp.o -MF projects/libcxx/src/CMakeFiles/cxx_shared.dir/vector.cpp.o.d -o projects/libcxx/src/CMakeFiles/cxx_shared.dir/vector.cpp.o -c /Users/buildslave/jenkins/libcxx_libcxxabi_trunk_testing/CI_ARCH/32/CI_EXCEPTIONS/OFF/CI_STD/c++2a/llvm-project/libcxx/src/vector.cpp
[248/257] /Users/buildslave/jenkins/libcxx_libcxxabi_trunk_testing/CI_ARCH/32/CI_EXCEPTIONS/OFF/CI_STD/c++2a/host-compiler/bin/clang++  -D_DEBUG -D_LIBCPP_BUILDING_LIBRARY -D_LIBCPP_DEBUG=0 -D_LIBCPP_DISABLE_NEW_DELETE_DEFINITIONS -D_LIBCPP_HAS_COMMENT_LIB_PRAGMA -D_LIBCPP_HAS_NO_PRAGMA_SYSTEM_HEADER -D_LIBCPP_NO_EXCEPTIONS -D__STDC_CONSTANT_MACROS -D__STDC_FORMAT_MACROS -D__STDC_LIMIT_MACROS -Iprojects/libcxx/src -I/Users/buildslave/jenkins/libcxx_libcxxabi_trunk_testing/CI_ARCH/32/CI_EXCEPTIONS/OFF/CI_STD/c++2a/llvm-project/libcxx/src -I/Applications/Xcode.app/Contents/Developer/Platforms/MacOSX.platform/Developer/SDKs/MacOSX10.13.sdk/usr/include/libxml2 -Iinclude -I/Users/buildslave/jenkins/libcxx_libcxxabi_trunk_testing/CI_ARCH/32/CI_EXCEPTIONS/OFF/CI_STD/c++2a/llvm-project/llvm/include -Iprojects/libcxx/include/c++build -I/Users/buildslave/jenkins/libcxx_libcxxabi_trunk_testing/CI_ARCH/32/CI_EXCEPTIONS/OFF/CI_STD/c++2a/llvm-project/libcxx/include -fPIC -fvisibility-inlines-hidden -Werror=date-time -Werror=unguarded-availability-new -std=c++14 -Wall -Wextra -Wno-unused-parameter -Wwrite-strings -Wcast-qual -Wmissing-field-initializers  -Wno-long-long -Wimplicit-fallthrough -Wcovered-switch-default -Wno-noexcept-type -Wnon-virtual-dtor -Wdelete-non-virtual-dtor -Wstring-conversion -fdiagnostics-color -Os  -arch i386 -arch x86_64 -isysroot /Applications/Xcode.app/Contents/Developer/Platforms/MacOSX.platform/Developer/SDKs/MacOSX10.13.sdk   -UNDEBUG -DLIBCXX_BUILDING_LIBCXXABI -std=c++11 -nostdinc++ -fvisibility-inlines-hidden -fvisibility=hidden -Wall -Wextra -W -Wwrite-strings -Wno-unused-parameter -Wno-long-long -Werror=return-type -Wextra-semi -Wno-user-defined-literals -Wno-covered-switch-default -Wno-ignored-attributes -Wno-error -include/var/folders/9t/lrs73ptj6lv644zvh1fk2_gc0000gn/T/tmp.V8lXPf4b/llvm-build/projects/libcxx/__config_site -fno-exceptions -MD -MT projects/libcxx/src/CMakeFiles/cxx_shared.dir/valarray.cpp.o -MF projects/libcxx/src/CMakeFiles/cxx_shared.dir/valarray.cpp.o.d -o projects/libcxx/src/CMakeFiles/cxx_shared.dir/valarray.cpp.o -c /Users/buildslave/jenkins/libcxx_libcxxabi_trunk_testing/CI_ARCH/32/CI_EXCEPTIONS/OFF/CI_STD/c++2a/llvm-project/libcxx/src/valarray.cpp
[249/257] /Users/buildslave/jenkins/libcxx_libcxxabi_trunk_testing/CI_ARCH/32/CI_EXCEPTIONS/OFF/CI_STD/c++2a/host-compiler/bin/clang++  -D_DEBUG -D_LIBCPP_BUILDING_LIBRARY -D_LIBCPP_DEBUG=0 -D_LIBCPP_DISABLE_NEW_DELETE_DEFINITIONS -D_LIBCPP_HAS_COMMENT_LIB_PRAGMA -D_LIBCPP_HAS_NO_PRAGMA_SYSTEM_HEADER -D_LIBCPP_NO_EXCEPTIONS -D__STDC_CONSTANT_MACROS -D__STDC_FORMAT_MACROS -D__STDC_LIMIT_MACROS -Iprojects/libcxx/src -I/Users/buildslave/jenkins/libcxx_libcxxabi_trunk_testing/CI_ARCH/32/CI_EXCEPTIONS/OFF/CI_STD/c++2a/llvm-project/libcxx/src -I/Applications/Xcode.app/Contents/Developer/Platforms/MacOSX.platform/Developer/SDKs/MacOSX10.13.sdk/usr/include/libxml2 -Iinclude -I/Users/buildslave/jenkins/libcxx_libcxxabi_trunk_testing/CI_ARCH/32/CI_EXCEPTIONS/OFF/CI_STD/c++2a/llvm-project/llvm/include -Iprojects/libcxx/include/c++build -I/Users/buildslave/jenkins/libcxx_libcxxabi_trunk_testing/CI_ARCH/32/CI_EXCEPTIONS/OFF/CI_STD/c++2a/llvm-project/libcxx/include -fPIC -fvisibility-inlines-hidden -Werror=date-time -Werror=unguarded-availability-new -std=c++14 -Wall -Wextra -Wno-unused-parameter -Wwrite-strings -Wcast-qual -Wmissing-field-initializers  -Wno-long-long -Wimplicit-fallthrough -Wcovered-switch-default -Wno-noexcept-type -Wnon-virtual-dtor -Wdelete-non-virtual-dtor -Wstring-conversion -fdiagnostics-color -Os  -arch i386 -arch x86_64 -isysroot /Applications/Xcode.app/Contents/Developer/Platforms/MacOSX.platform/Developer/SDKs/MacOSX10.13.sdk   -UNDEBUG -DLIBCXX_BUILDING_LIBCXXABI -std=c++11 -nostdinc++ -fvisibility-inlines-hidden -fvisibility=hidden -Wall -Wextra -W -Wwrite-strings -Wno-unused-parameter -Wno-long-long -Werror=return-type -Wextra-semi -Wno-user-defined-literals -Wno-covered-switch-default -Wno-ignored-attributes -Wno-error -include/var/folders/9t/lrs73ptj6lv644zvh1fk2_gc0000gn/T/tmp.V8lXPf4b/llvm-build/projects/libcxx/__config_site -fno-exceptions -MD -MT projects/libcxx/src/CMakeFiles/cxx_shared.dir/ios.cpp.o -MF projects/libcxx/src/CMakeFiles/cxx_shared.dir/ios.cpp.o.d -o projects/libcxx/src/CMakeFiles/cxx_shared.dir/ios.cpp.o -c /Users/buildslave/jenkins/libcxx_libcxxabi_trunk_testing/CI_ARCH/32/CI_EXCEPTIONS/OFF/CI_STD/c++2a/llvm-project/libcxx/src/ios.cpp
[250/257] /Users/buildslave/jenkins/libcxx_libcxxabi_trunk_testing/CI_ARCH/32/CI_EXCEPTIONS/OFF/CI_STD/c++2a/host-compiler/bin/clang++  -D_DEBUG -D_LIBCPP_BUILDING_LIBRARY -D_LIBCPP_DEBUG=0 -D_LIBCPP_DISABLE_NEW_DELETE_DEFINITIONS -D_LIBCPP_HAS_COMMENT_LIB_PRAGMA -D_LIBCPP_HAS_NO_PRAGMA_SYSTEM_HEADER -D_LIBCPP_NO_EXCEPTIONS -D__STDC_CONSTANT_MACROS -D__STDC_FORMAT_MACROS -D__STDC_LIMIT_MACROS -Iprojects/libcxx/src -I/Users/buildslave/jenkins/libcxx_libcxxabi_trunk_testing/CI_ARCH/32/CI_EXCEPTIONS/OFF/CI_STD/c++2a/llvm-project/libcxx/src -I/Applications/Xcode.app/Contents/Developer/Platforms/MacOSX.platform/Developer/SDKs/MacOSX10.13.sdk/usr/include/libxml2 -Iinclude -I/Users/buildslave/jenkins/libcxx_libcxxabi_trunk_testing/CI_ARCH/32/CI_EXCEPTIONS/OFF/CI_STD/c++2a/llvm-project/llvm/include -Iprojects/libcxx/include/c++build -I/Users/buildslave/jenkins/libcxx_libcxxabi_trunk_testing/CI_ARCH/32/CI_EXCEPTIONS/OFF/CI_STD/c++2a/llvm-project/libcxx/include -fPIC -fvisibility-inlines-hidden -Werror=date-time -Werror=unguarded-availability-new -std=c++14 -Wall -Wextra -Wno-unused-parameter -Wwrite-strings -Wcast-qual -Wmissing-field-initializers  -Wno-long-long -Wimplicit-fallthrough -Wcovered-switch-default -Wno-noexcept-type -Wnon-virtual-dtor -Wdelete-non-virtual-dtor -Wstring-conversion -fdiagnostics-color -Os  -arch i386 -arch x86_64 -isysroot /Applications/Xcode.app/Contents/Developer/Platforms/MacOSX.platform/Developer/SDKs/MacOSX10.13.sdk   -UNDEBUG -DLIBCXX_BUILDING_LIBCXXABI -std=c++11 -nostdinc++ -fvisibility-inlines-hidden -fvisibility=hidden -Wall -Wextra -W -Wwrite-strings -Wno-unused-parameter -Wno-long-long -Werror=return-type -Wextra-semi -Wno-user-defined-literals -Wno-covered-switch-default -Wno-ignored-attributes -Wno-error -include/var/folders/9t/lrs73ptj6lv644zvh1fk2_gc0000gn/T/tmp.V8lXPf4b/llvm-build/projects/libcxx/__config_site -fno-exceptions -MD -MT projects/libcxx/src/CMakeFiles/cxx_shared.dir/thread.cpp.o -MF projects/libcxx/src/CMakeFiles/cxx_shared.dir/thread.cpp.o.d -o projects/libcxx/src/CMakeFiles/cxx_shared.dir/thread.cpp.o -c /Users/buildslave/jenkins/libcxx_libcxxabi_trunk_testing/CI_ARCH/32/CI_EXCEPTIONS/OFF/CI_STD/c++2a/llvm-project/libcxx/src/thread.cpp
[251/257] /Users/buildslave/jenkins/libcxx_libcxxabi_trunk_testing/CI_ARCH/32/CI_EXCEPTIONS/OFF/CI_STD/c++2a/host-compiler/bin/clang++  -D_DEBUG -D_LIBCPP_BUILDING_LIBRARY -D_LIBCPP_DEBUG=0 -D_LIBCPP_DISABLE_NEW_DELETE_DEFINITIONS -D_LIBCPP_HAS_COMMENT_LIB_PRAGMA -D_LIBCPP_HAS_NO_PRAGMA_SYSTEM_HEADER -D_LIBCPP_NO_EXCEPTIONS -D__STDC_CONSTANT_MACROS -D__STDC_FORMAT_MACROS -D__STDC_LIMIT_MACROS -Iprojects/libcxx/src -I/Users/buildslave/jenkins/libcxx_libcxxabi_trunk_testing/CI_ARCH/32/CI_EXCEPTIONS/OFF/CI_STD/c++2a/llvm-project/libcxx/src -I/Applications/Xcode.app/Contents/Developer/Platforms/MacOSX.platform/Developer/SDKs/MacOSX10.13.sdk/usr/include/libxml2 -Iinclude -I/Users/buildslave/jenkins/libcxx_libcxxabi_trunk_testing/CI_ARCH/32/CI_EXCEPTIONS/OFF/CI_STD/c++2a/llvm-project/llvm/include -Iprojects/libcxx/include/c++build -I/Users/buildslave/jenkins/libcxx_libcxxabi_trunk_testing/CI_ARCH/32/CI_EXCEPTIONS/OFF/CI_STD/c++2a/llvm-project/libcxx/include -fPIC -fvisibility-inlines-hidden -Werror=date-time -Werror=unguarded-availability-new -std=c++14 -Wall -Wextra -Wno-unused-parameter -Wwrite-strings -Wcast-qual -Wmissing-field-initializers  -Wno-long-long -Wimplicit-fallthrough -Wcovered-switch-default -Wno-noexcept-type -Wnon-virtual-dtor -Wdelete-non-virtual-dtor -Wstring-conversion -fdiagnostics-color -Os  -arch i386 -arch x86_64 -isysroot /Applications/Xcode.app/Contents/Developer/Platforms/MacOSX.platform/Developer/SDKs/MacOSX10.13.sdk   -UNDEBUG -DLIBCXX_BUILDING_LIBCXXABI -std=c++11 -nostdinc++ -fvisibility-inlines-hidden -fvisibility=hidden -Wall -Wextra -W -Wwrite-strings -Wno-unused-parameter -Wno-long-long -Werror=return-type -Wextra-semi -Wno-user-defined-literals -Wno-covered-switch-default -Wno-ignored-attributes -Wno-error -include/var/folders/9t/lrs73ptj6lv644zvh1fk2_gc0000gn/T/tmp.V8lXPf4b/llvm-build/projects/libcxx/__config_site -fno-exceptions -MD -MT projects/libcxx/src/CMakeFiles/cxx_shared.dir/string.cpp.o -MF projects/libcxx/src/CMakeFiles/cxx_shared.dir/string.cpp.o.d -o projects/libcxx/src/CMakeFiles/cxx_shared.dir/string.cpp.o -c /Users/buildslave/jenkins/libcxx_libcxxabi_trunk_testing/CI_ARCH/32/CI_EXCEPTIONS/OFF/CI_STD/c++2a/llvm-project/libcxx/src/string.cpp
[252/257] /Users/buildslave/jenkins/libcxx_libcxxabi_trunk_testing/CI_ARCH/32/CI_EXCEPTIONS/OFF/CI_STD/c++2a/host-compiler/bin/clang++  -D_DEBUG -D_LIBCPP_BUILDING_LIBRARY -D_LIBCPP_DEBUG=0 -D_LIBCPP_DISABLE_NEW_DELETE_DEFINITIONS -D_LIBCPP_HAS_COMMENT_LIB_PRAGMA -D_LIBCPP_HAS_NO_PRAGMA_SYSTEM_HEADER -D_LIBCPP_NO_EXCEPTIONS -D__STDC_CONSTANT_MACROS -D__STDC_FORMAT_MACROS -D__STDC_LIMIT_MACROS -Iprojects/libcxx/src -I/Users/buildslave/jenkins/libcxx_libcxxabi_trunk_testing/CI_ARCH/32/CI_EXCEPTIONS/OFF/CI_STD/c++2a/llvm-project/libcxx/src -I/Applications/Xcode.app/Contents/Developer/Platforms/MacOSX.platform/Developer/SDKs/MacOSX10.13.sdk/usr/include/libxml2 -Iinclude -I/Users/buildslave/jenkins/libcxx_libcxxabi_trunk_testing/CI_ARCH/32/CI_EXCEPTIONS/OFF/CI_STD/c++2a/llvm-project/llvm/include -Iprojects/libcxx/include/c++build -I/Users/buildslave/jenkins/libcxx_libcxxabi_trunk_testing/CI_ARCH/32/CI_EXCEPTIONS/OFF/CI_STD/c++2a/llvm-project/libcxx/include -fPIC -fvisibility-inlines-hidden -Werror=date-time -Werror=unguarded-availability-new -std=c++14 -Wall -Wextra -Wno-unused-parameter -Wwrite-strings -Wcast-qual -Wmissing-field-initializers  -Wno-long-long -Wimplicit-fallthrough -Wcovered-switch-default -Wno-noexcept-type -Wnon-virtual-dtor -Wdelete-non-virtual-dtor -Wstring-conversion -fdiagnostics-color -Os  -arch i386 -arch x86_64 -isysroot /Applications/Xcode.app/Contents/Developer/Platforms/MacOSX.platform/Developer/SDKs/MacOSX10.13.sdk   -UNDEBUG -DLIBCXX_BUILDING_LIBCXXABI -std=c++11 -nostdinc++ -fvisibility-inlines-hidden -fvisibility=hidden -Wall -Wextra -W -Wwrite-strings -Wno-unused-parameter -Wno-long-long -Werror=return-type -Wextra-semi -Wno-user-defined-literals -Wno-covered-switch-default -Wno-ignored-attributes -Wno-error -include/var/folders/9t/lrs73ptj6lv644zvh1fk2_gc0000gn/T/tmp.V8lXPf4b/llvm-build/projects/libcxx/__config_site -fno-exceptions -MD -MT projects/libcxx/src/CMakeFiles/cxx_shared.dir/filesystem/directory_iterator.cpp.o -MF projects/libcxx/src/CMakeFiles/cxx_shared.dir/filesystem/directory_iterator.cpp.o.d -o projects/libcxx/src/CMakeFiles/cxx_shared.dir/filesystem/directory_iterator.cpp.o -c /Users/buildslave/jenkins/libcxx_libcxxabi_trunk_testing/CI_ARCH/32/CI_EXCEPTIONS/OFF/CI_STD/c++2a/llvm-project/libcxx/src/filesystem/directory_iterator.cpp
[253/257] /Users/buildslave/jenkins/libcxx_libcxxabi_trunk_testing/CI_ARCH/32/CI_EXCEPTIONS/OFF/CI_STD/c++2a/host-compiler/bin/clang++  -D_DEBUG -D_LIBCPP_BUILDING_LIBRARY -D_LIBCPP_DEBUG=0 -D_LIBCPP_DISABLE_NEW_DELETE_DEFINITIONS -D_LIBCPP_HAS_COMMENT_LIB_PRAGMA -D_LIBCPP_HAS_NO_PRAGMA_SYSTEM_HEADER -D_LIBCPP_NO_EXCEPTIONS -D__STDC_CONSTANT_MACROS -D__STDC_FORMAT_MACROS -D__STDC_LIMIT_MACROS -Iprojects/libcxx/src -I/Users/buildslave/jenkins/libcxx_libcxxabi_trunk_testing/CI_ARCH/32/CI_EXCEPTIONS/OFF/CI_STD/c++2a/llvm-project/libcxx/src -I/Applications/Xcode.app/Contents/Developer/Platforms/MacOSX.platform/Developer/SDKs/MacOSX10.13.sdk/usr/include/libxml2 -Iinclude -I/Users/buildslave/jenkins/libcxx_libcxxabi_trunk_testing/CI_ARCH/32/CI_EXCEPTIONS/OFF/CI_STD/c++2a/llvm-project/llvm/include -Iprojects/libcxx/include/c++build -I/Users/buildslave/jenkins/libcxx_libcxxabi_trunk_testing/CI_ARCH/32/CI_EXCEPTIONS/OFF/CI_STD/c++2a/llvm-project/libcxx/include -fPIC -fvisibility-inlines-hidden -Werror=date-time -Werror=unguarded-availability-new -std=c++14 -Wall -Wextra -Wno-unused-parameter -Wwrite-strings -Wcast-qual -Wmissing-field-initializers  -Wno-long-long -Wimplicit-fallthrough -Wcovered-switch-default -Wno-noexcept-type -Wnon-virtual-dtor -Wdelete-non-virtual-dtor -Wstring-conversion -fdiagnostics-color -Os  -arch i386 -arch x86_64 -isysroot /Applications/Xcode.app/Contents/Developer/Platforms/MacOSX.platform/Developer/SDKs/MacOSX10.13.sdk   -UNDEBUG -DLIBCXX_BUILDING_LIBCXXABI -std=c++11 -nostdinc++ -fvisibility-inlines-hidden -fvisibility=hidden -Wall -Wextra -W -Wwrite-strings -Wno-unused-parameter -Wno-long-long -Werror=return-type -Wextra-semi -Wno-user-defined-literals -Wno-covered-switch-default -Wno-ignored-attributes -Wno-error -include/var/folders/9t/lrs73ptj6lv644zvh1fk2_gc0000gn/T/tmp.V8lXPf4b/llvm-build/projects/libcxx/__config_site -fno-exceptions -MD -MT projects/libcxx/src/CMakeFiles/cxx_shared.dir/filesystem/operations.cpp.o -MF projects/libcxx/src/CMakeFiles/cxx_shared.dir/filesystem/operations.cpp.o.d -o projects/libcxx/src/CMakeFiles/cxx_shared.dir/filesystem/operations.cpp.o -c /Users/buildslave/jenkins/libcxx_libcxxabi_trunk_testing/CI_ARCH/32/CI_EXCEPTIONS/OFF/CI_STD/c++2a/llvm-project/libcxx/src/filesystem/operations.cpp
[254/257] /Users/buildslave/jenkins/libcxx_libcxxabi_trunk_testing/CI_ARCH/32/CI_EXCEPTIONS/OFF/CI_STD/c++2a/host-compiler/bin/clang++  -D_DEBUG -D_LIBCPP_BUILDING_LIBRARY -D_LIBCPP_DEBUG=0 -D_LIBCPP_DISABLE_NEW_DELETE_DEFINITIONS -D_LIBCPP_HAS_COMMENT_LIB_PRAGMA -D_LIBCPP_HAS_NO_PRAGMA_SYSTEM_HEADER -D_LIBCPP_NO_EXCEPTIONS -D__STDC_CONSTANT_MACROS -D__STDC_FORMAT_MACROS -D__STDC_LIMIT_MACROS -Iprojects/libcxx/src -I/Users/buildslave/jenkins/libcxx_libcxxabi_trunk_testing/CI_ARCH/32/CI_EXCEPTIONS/OFF/CI_STD/c++2a/llvm-project/libcxx/src -I/Applications/Xcode.app/Contents/Developer/Platforms/MacOSX.platform/Developer/SDKs/MacOSX10.13.sdk/usr/include/libxml2 -Iinclude -I/Users/buildslave/jenkins/libcxx_libcxxabi_trunk_testing/CI_ARCH/32/CI_EXCEPTIONS/OFF/CI_STD/c++2a/llvm-project/llvm/include -Iprojects/libcxx/include/c++build -I/Users/buildslave/jenkins/libcxx_libcxxabi_trunk_testing/CI_ARCH/32/CI_EXCEPTIONS/OFF/CI_STD/c++2a/llvm-project/libcxx/include -fPIC -fvisibility-inlines-hidden -Werror=date-time -Werror=unguarded-availability-new -std=c++14 -Wall -Wextra -Wno-unused-parameter -Wwrite-strings -Wcast-qual -Wmissing-field-initializers  -Wno-long-long -Wimplicit-fallthrough -Wcovered-switch-default -Wno-noexcept-type -Wnon-virtual-dtor -Wdelete-non-virtual-dtor -Wstring-conversion -fdiagnostics-color -Os  -arch i386 -arch x86_64 -isysroot /Applications/Xcode.app/Contents/Developer/Platforms/MacOSX.platform/Developer/SDKs/MacOSX10.13.sdk   -UNDEBUG -DLIBCXX_BUILDING_LIBCXXABI -std=c++11 -nostdinc++ -fvisibility-inlines-hidden -fvisibility=hidden -Wall -Wextra -W -Wwrite-strings -Wno-unused-parameter -Wno-long-long -Werror=return-type -Wextra-semi -Wno-user-defined-literals -Wno-covered-switch-default -Wno-ignored-attributes -Wno-error -include/var/folders/9t/lrs73ptj6lv644zvh1fk2_gc0000gn/T/tmp.V8lXPf4b/llvm-build/projects/libcxx/__config_site -fno-exceptions -MD -MT projects/libcxx/src/CMakeFiles/cxx_shared.dir/locale.cpp.o -MF projects/libcxx/src/CMakeFiles/cxx_shared.dir/locale.cpp.o.d -o projects/libcxx/src/CMakeFiles/cxx_shared.dir/locale.cpp.o -c /Users/buildslave/jenkins/libcxx_libcxxabi_trunk_testing/CI_ARCH/32/CI_EXCEPTIONS/OFF/CI_STD/c++2a/llvm-project/libcxx/src/locale.cpp
[255/257] : && /Users/buildslave/jenkins/libcxx_libcxxabi_trunk_testing/CI_ARCH/32/CI_EXCEPTIONS/OFF/CI_STD/c++2a/host-compiler/bin/clang++ -fPIC -fvisibility-inlines-hidden -Werror=date-time -Werror=unguarded-availability-new -std=c++14 -Wall -Wextra -Wno-unused-parameter -Wwrite-strings -Wcast-qual -Wmissing-field-initializers  -Wno-long-long -Wimplicit-fallthrough -Wcovered-switch-default -Wno-noexcept-type -Wnon-virtual-dtor -Wdelete-non-virtual-dtor -Wstring-conversion -fdiagnostics-color -Os -arch i386 -arch x86_64 -isysroot /Applications/Xcode.app/Contents/Developer/Platforms/MacOSX.platform/Developer/SDKs/MacOSX10.13.sdk -dynamiclib -Wl,-headerpad_max_install_names -compatibility_version 1.0.0 -current_version 1.0.0 -o lib/libc++.1.0.dylib -install_name @rpath/libc++.1.dylib projects/libcxx/src/CMakeFiles/cxx_shared.dir/algorithm.cpp.o projects/libcxx/src/CMakeFiles/cxx_shared.dir/any.cpp.o projects/libcxx/src/CMakeFiles/cxx_shared.dir/bind.cpp.o projects/libcxx/src/CMakeFiles/cxx_shared.dir/charconv.cpp.o projects/libcxx/src/CMakeFiles/cxx_shared.dir/chrono.cpp.o projects/libcxx/src/CMakeFiles/cxx_shared.dir/condition_variable.cpp.o projects/libcxx/src/CMakeFiles/cxx_shared.dir/condition_variable_destructor.cpp.o projects/libcxx/src/CMakeFiles/cxx_shared.dir/debug.cpp.o projects/libcxx/src/CMakeFiles/cxx_shared.dir/exception.cpp.o projects/libcxx/src/CMakeFiles/cxx_shared.dir/functional.cpp.o projects/libcxx/src/CMakeFiles/cxx_shared.dir/future.cpp.o projects/libcxx/src/CMakeFiles/cxx_shared.dir/hash.cpp.o projects/libcxx/src/CMakeFiles/cxx_shared.dir/ios.cpp.o projects/libcxx/src/CMakeFiles/cxx_shared.dir/iostream.cpp.o projects/libcxx/src/CMakeFiles/cxx_shared.dir/locale.cpp.o projects/libcxx/src/CMakeFiles/cxx_shared.dir/memory.cpp.o projects/libcxx/src/CMakeFiles/cxx_shared.dir/mutex.cpp.o projects/libcxx/src/CMakeFiles/cxx_shared.dir/mutex_destructor.cpp.o projects/libcxx/src/CMakeFiles/cxx_shared.dir/new.cpp.o projects/libcxx/src/CMakeFiles/cxx_shared.dir/optional.cpp.o projects/libcxx/src/CMakeFiles/cxx_shared.dir/random.cpp.o projects/libcxx/src/CMakeFiles/cxx_shared.dir/regex.cpp.o projects/libcxx/src/CMakeFiles/cxx_shared.dir/shared_mutex.cpp.o projects/libcxx/src/CMakeFiles/cxx_shared.dir/stdexcept.cpp.o projects/libcxx/src/CMakeFiles/cxx_shared.dir/string.cpp.o projects/libcxx/src/CMakeFiles/cxx_shared.dir/strstream.cpp.o projects/libcxx/src/CMakeFiles/cxx_shared.dir/system_error.cpp.o projects/libcxx/src/CMakeFiles/cxx_shared.dir/thread.cpp.o projects/libcxx/src/CMakeFiles/cxx_shared.dir/typeinfo.cpp.o projects/libcxx/src/CMakeFiles/cxx_shared.dir/utility.cpp.o projects/libcxx/src/CMakeFiles/cxx_shared.dir/valarray.cpp.o projects/libcxx/src/CMakeFiles/cxx_shared.dir/variant.cpp.o projects/libcxx/src/CMakeFiles/cxx_shared.dir/vector.cpp.o projects/libcxx/src/CMakeFiles/cxx_shared.dir/filesystem/operations.cpp.o projects/libcxx/src/CMakeFiles/cxx_shared.dir/filesystem/directory_iterator.cpp.o  -Wl,-rpath,@loader_path/../lib -nodefaultlibs -lSystem -lc lib/libc++abi.1.0.dylib -Wl,-unexported_symbols_list,/Users/buildslave/jenkins/libcxx_libcxxabi_trunk_testing/CI_ARCH/32/CI_EXCEPTIONS/OFF/CI_STD/c++2a/llvm-project/libcxx/src/../lib/libc++unexp.exp -Wl,-reexported_symbols_list,/Users/buildslave/jenkins/libcxx_libcxxabi_trunk_testing/CI_ARCH/32/CI_EXCEPTIONS/OFF/CI_STD/c++2a/llvm-project/libcxx/src/../lib/libc++abi.v2.exp -Wl,-force_symbols_not_weak_list,/Users/buildslave/jenkins/libcxx_libcxxabi_trunk_testing/CI_ARCH/32/CI_EXCEPTIONS/OFF/CI_STD/c++2a/llvm-project/libcxx/src/../lib/notweak.exp -Wl,-force_symbols_weak_list,/Users/buildslave/jenkins/libcxx_libcxxabi_trunk_testing/CI_ARCH/32/CI_EXCEPTIONS/OFF/CI_STD/c++2a/llvm-project/libcxx/src/../lib/weak.exp -Wl,-reexported_symbols_list,/Users/buildslave/jenkins/libcxx_libcxxabi_trunk_testing/CI_ARCH/32/CI_EXCEPTIONS/OFF/CI_STD/c++2a/llvm-project/libcxx/src/../lib/libc++abi-new-delete.exp && :
[256/257] /usr/local/Cellar/cmake/3.13.1/bin/cmake -E cmake_symlink_library lib/libc++.1.0.dylib  lib/libc++.1.dylib lib/libc++.dylib && :
[257/257] cd /var/folders/9t/lrs73ptj6lv644zvh1fk2_gc0000gn/T/tmp.V8lXPf4b/llvm-build/projects/libcxx/src && /usr/local/Cellar/cmake/3.13.1/bin/cmake -DCMAKE_INSTALL_COMPONENT=cxx -P /var/folders/9t/lrs73ptj6lv644zvh1fk2_gc0000gn/T/tmp.V8lXPf4b/llvm-build/projects/libcxx/cmake_install.cmake
-- Install configuration: "MinSizeRel"
-- Installing: /var/folders/9t/lrs73ptj6lv644zvh1fk2_gc0000gn/T/tmp.V8lXPf4b/llvm-install/lib/libc++.1.0.dylib
-- Installing: /var/folders/9t/lrs73ptj6lv644zvh1fk2_gc0000gn/T/tmp.V8lXPf4b/llvm-install/lib/libc++.1.dylib
-- Installing: /var/folders/9t/lrs73ptj6lv644zvh1fk2_gc0000gn/T/tmp.V8lXPf4b/llvm-install/lib/libc++.dylib
+ echo @@@@@@
@@@@@@
+ echo '@@@ Running tests for libc++ @@@'
Running tests for libc++

Hide Details

@@@ Running tests for libc++ @@@ + ninja -C /var/folders/9t/lrs73ptj6lv644zvh1fk2_gc0000gn/T/tmp.V8lXPf4b/llvm-build check-cxx ninja: Entering directory `/var/folders/9t/lrs73ptj6lv644zvh1fk2_gc0000gn/T/tmp.V8lXPf4b/llvm-build' [0/1] Running libcxx tests llvm-lit: /Users/buildslave/jenkins/libcxx_libcxxabi_trunk_testing/CI_ARCH/32/CI_EXCEPTIONS/OFF/CI_STD/c++2a/llvm-project/libcxx/test/lit.cfg:45: note: Using configuration variant: libcxx llvm-lit: /Users/buildslave/jenkins/libcxx_libcxxabi_trunk_testing/CI_ARCH/32/CI_EXCEPTIONS/OFF/CI_STD/c++2a/llvm-project/libcxx/utils/libcxx/test/config.py:319: note: inferred use_system_cxx_lib as: None llvm-lit: /Users/buildslave/jenkins/libcxx_libcxxabi_trunk_testing/CI_ARCH/32/CI_EXCEPTIONS/OFF/CI_STD/c++2a/llvm-project/libcxx/utils/libcxx/test/config.py:1163: note: inferred arch as: 'x86_64' llvm-lit: /Users/buildslave/jenkins/libcxx_libcxxabi_trunk_testing/CI_ARCH/32/CI_EXCEPTIONS/OFF/CI_STD/c++2a/llvm-project/libcxx/utils/libcxx/test/config.py:1167: note: inferred platform as: 'macosx10.13' llvm-lit: /Users/buildslave/jenkins/libcxx_libcxxabi_trunk_testing/CI_ARCH/32/CI_EXCEPTIONS/OFF/CI_STD/c++2a/llvm-project/libcxx/utils/libcxx/test/config.py:1173: note: computed target_triple as: 'x86_64-apple-macosx10.13' llvm-lit: /Users/buildslave/jenkins/libcxx_libcxxabi_trunk_testing/CI_ARCH/32/CI_EXCEPTIONS/OFF/CI_STD/c++2a/llvm-project/libcxx/utils/libcxx/test/config.py:346: note: inferred use_clang_verify as: True llvm-lit: /Users/buildslave/jenkins/libcxx_libcxxabi_trunk_testing/CI_ARCH/32/CI_EXCEPTIONS/OFF/CI_STD/c++2a/llvm-project/libcxx/utils/libcxx/test/config.py:356: note: enabling thread-safety annotations llvm-lit: /Users/buildslave/jenkins/libcxx_libcxxabi_trunk_testing/CI_ARCH/32/CI_EXCEPTIONS/OFF/CI_STD/c++2a/llvm-project/libcxx/utils/libcxx/test/config.py:651: note: Using __config_site header /var/folders/9t/lrs73ptj6lv644zvh1fk2_gc0000gn/T/tmp.V8lXPf4b/llvm-build/projects/libcxx/__config_site with macros: {'_LIBCPP_HAS_MERGED_TYPEINFO_NAMES_DEFAULT': '0', '_LIBCPP_HIDE_FROM_ABI_PER_TU_BY_DEFAULT': ''} llvm-lit: /Users/buildslave/jenkins/libcxx_libcxxabi_trunk_testing/CI_ARCH/32/CI_EXCEPTIONS/OFF/CI_STD/c++2a/llvm-project/libcxx/utils/libcxx/test/target_info.py:136: note: using SDKROOT: '/Applications/Xcode.app/Contents/Developer/Platforms/MacOSX.platform/Developer/SDKs/MacOSX10.13.sdk' llvm-lit: /Users/buildslave/jenkins/libcxx_libcxxabi_trunk_testing/CI_ARCH/32/CI_EXCEPTIONS/OFF/CI_STD/c++2a/llvm-project/libcxx/utils/libcxx/test/config.py:435: note: inferred long_tests as: True llvm-lit: /Users/buildslave/jenkins/libcxx_libcxxabi_trunk_testing/CI_ARCH/32/CI_EXCEPTIONS/OFF/CI_STD/c++2a/llvm-project/libcxx/utils/libcxx/test/config.py:159: note: Using compiler: /Users/buildslave/jenkins/libcxx_libcxxabi_trunk_testing/CI_ARCH/32/CI_EXCEPTIONS/OFF/CI_STD/c++2a/host-compiler/bin/clang++ llvm-lit: /Users/buildslave/jenkins/libcxx_libcxxabi_trunk_testing/CI_ARCH/32/CI_EXCEPTIONS/OFF/CI_STD/c++2a/llvm-project/libcxx/utils/libcxx/test/config.py:160: note: Using flags: ['-D_LIBCPP_DISABLE_AVAILABILITY', '-m32', '-v', '-arch', 'x86_64', '-mmacosx-version-min=10.13', '-ftemplate-depth=270'] llvm-lit: /Users/buildslave/jenkins/libcxx_libcxxabi_trunk_testing/CI_ARCH/32/CI_EXCEPTIONS/OFF/CI_STD/c++2a/llvm-project/libcxx/utils/libcxx/test/config.py:165: note: Using compile flags: ['-Werror=thread-safety', '-std=c++2a', '-Wno-macro-redefined', '-include', '/var/folders/9t/lrs73ptj6lv644zvh1fk2_gc0000gn/T/tmp.V8lXPf4b/llvm-build/projects/libcxx/__config_site', '-include', '/Users/buildslave/jenkins/libcxx_libcxxabi_trunk_testing/CI_ARCH/32/CI_EXCEPTIONS/OFF/CI_STD/c++2a/llvm-project/libcxx/test/support/nasty_macros.h', '-nostdinc++', '-I/Users/buildslave/jenkins/libcxx_libcxxabi_trunk_testing/CI_ARCH/32/CI_EXCEPTIONS/OFF/CI_STD/c++2a/llvm-project/libcxx/include', '-I/var/folders/9t/lrs73ptj6lv644zvh1fk2_gc0000gn/T/tmp.V8lXPf4b/llvm-build/projects/libcxx/include/c++build', '-isysroot', '/Applications/Xcode.app/Contents/Developer/Platforms/MacOSX.platform/Developer/SDKs/MacOSX10.13.sdk', '-fno-exceptions', '-I/Users/buildslave/jenkins/libcxx_libcxxabi_trunk_testing/CI_ARCH/32/CI_EXCEPTIONS/OFF/CI_STD/c++2a/llvm-project/libcxx/test/support', '-DLIBCXX_FILESYSTEM_STATIC_TEST_ROOT="/Users/buildslave/jenkins/libcxx_libcxxabi_trunk_testing/CI_ARCH/32/CI_EXCEPTIONS/OFF/CI_STD/c++2a/llvm-project/libcxx/test/std/input.output/filesystems/Inputs/static_test_env"', '-DLIBCXX_FILESYSTEM_DYNAMIC_TEST_ROOT="/private/var/folders/9t/lrs73ptj6lv644zvh1fk2_gc0000gn/T/tmp.V8lXPf4b/llvm-build/projects/libcxx/test/filesystem/Output/dynamic_env"', '-DLIBCXX_FILESYSTEM_DYNAMIC_TEST_HELPER="/usr/local/opt/python@2/bin/python2.7 /Users/buildslave/jenkins/libcxx_libcxxabi_trunk_testing/CI_ARCH/32/CI_EXCEPTIONS/OFF/CI_STD/c++2a/llvm-project/libcxx/test/support/filesystem_dynamic_test_helper.py"'] llvm-lit: /Users/buildslave/jenkins/libcxx_libcxxabi_trunk_testing/CI_ARCH/32/CI_EXCEPTIONS/OFF/CI_STD/c++2a/llvm-project/libcxx/utils/libcxx/test/config.py:167: note: Using warnings: ['-D_LIBCPP_HAS_NO_PRAGMA_SYSTEM_HEADER', '-Wall', '-Wextra', '-Werror', '-Wuser-defined-warnings', '-Wshadow', '-Wno-unused-command-line-argument', '-Wno-attributes', '-Wno-pessimizing-move', '-Wno-c++11-extensions', '-Wno-user-defined-literals', '-Wno-noexcept-type', '-Wsign-compare', '-Wunused-variable', '-Wunused-parameter', '-Wunreachable-code'] llvm-lit: /Users/buildslave/jenkins/libcxx_libcxxabi_trunk_testing/CI_ARCH/32/CI_EXCEPTIONS/OFF/CI_STD/c++2a/llvm-project/libcxx/utils/libcxx/test/config.py:168: note: Using link flags: ['-L/var/folders/9t/lrs73ptj6lv644zvh1fk2_gc0000gn/T/tmp.V8lXPf4b/llvm-build/./lib', '-Wl,-rpath,/var/folders/9t/lrs73ptj6lv644zvh1fk2_gc0000gn/T/tmp.V8lXPf4b/llvm-build/./lib', '-nodefaultlibs', '-lc++', '-lSystem'] llvm-lit: /Users/buildslave/jenkins/libcxx_libcxxabi_trunk_testing/CI_ARCH/32/CI_EXCEPTIONS/OFF/CI_STD/c++2a/llvm-project/libcxx/utils/libcxx/test/config.py:171: note: Using available_features: ['libc++', 'verify-support', '-fsized-deallocation', 'modules-support', 'locale.en_US.UTF-8', 'diagnose-if-support', 'availability', 'long_tests', 'libcpp-has-merged-typeinfo-names-default', 'availability=macosx', 'fdelayed-template-parsing', 'availability=macosx10.13', '-faligned-allocation', 'clang-10.0.0', 'c++2a', 'locale.fr_CA.ISO8859-1', 'objective-c++', 'clang-10', 'clang', 'locale.fr_FR.UTF-8', 'locale.ru_RU.UTF-8', 'libcpp-no-exceptions', 'locale.zh_CN.UTF-8', 'darwin', 'fcoroutines-ts', 'locale.cs_CZ.ISO8859-2', 'clang-10.0', 'apple-darwin', 'thread-safety', 'availability=x86_64-macosx'] llvm-lit: /Users/buildslave/jenkins/libcxx_libcxxabi_trunk_testing/CI_ARCH/32/CI_EXCEPTIONS/OFF/CI_STD/c++2a/llvm-project/libcxx/utils/libcxx/test/config.py:176: note: Adding environment variables: {'DYLD_LIBRARY_PATH': '/var/folders/9t/lrs73ptj6lv644zvh1fk2_gc0000gn/T/tmp.V8lXPf4b/llvm-build/./lib', 'LIBCXX_FILESYSTEM_DYNAMIC_TEST_ROOT': '/private/var/folders/9t/lrs73ptj6lv644zvh1fk2_gc0000gn/T/tmp.V8lXPf4b/llvm-build/projects/libcxx/test/filesystem/Output/dynamic_env'} -- Testing: 6365 tests, 8 workers -- Testing: 0.. 10.. 20.. 30.. 40.. 50.. 60.. 70.. 80. FAIL: libc++ :: std/utilities/meta/meta.rel/is_nothrow_invocable.pass.cpp (5527 of 6365) ******************** TEST 'libc++ :: std/utilities/meta/meta.rel/is_nothrow_invocable.pass.cpp' FAILED ******************** Command: ['/Users/buildslave/jenkins/libcxx_libcxxabi_trunk_testing/CI_ARCH/32/CI_EXCEPTIONS/OFF/CI_STD/c++2a/host-compiler/bin/clang++', '-o', '/private/var/folders/9t/lrs73ptj6lv644zvh1fk2_gc0000gn/T/tmp.V8lXPf4b/llvm-build/projects/libcxx/test/std/utilities/meta/meta.rel/Output/is_nothrow_invocable.pass.cpp.o', '-x', 'c++', '/Users/buildslave/jenkins/libcxx_libcxxabi_trunk_testing/CI_ARCH/32/CI_EXCEPTIONS/OFF/CI_STD/c++2a/llvm-project/libcxx/test/std/utilities/meta/meta.rel/is_nothrow_invocable.pass.cpp', '-c', '-D_LIBCPP_DISABLE_AVAILABILITY', '-m32', '-v', '-arch', 'x86_64', '-mmacosx-version-min=10.13', '-ftemplate-depth=270', '-Werror=thread-safety', '-std=c++2a', '-Wno-macro-redefined', '-include', '/var/folders/9t/lrs73ptj6lv644zvh1fk2_gc0000gn/T/tmp.V8lXPf4b/llvm-build/projects/libcxx/__config_site', '-include', '/Users/buildslave/jenkins/libcxx_libcxxabi_trunk_testing/CI_ARCH/32/CI_EXCEPTIONS/OFF/CI_STD/c++2a/llvm-project/libcxx/test/support/nasty_macros.h', '-nostdinc++', '-I/Users/buildslave/jenkins/libcxx_libcxxabi_trunk_testing/CI_ARCH/32/CI_EXCEPTIONS/OFF/CI_STD/c++2a/llvm-project/libcxx/include', '-I/var/folders/9t/lrs73ptj6lv644zvh1fk2_gc0000gn/T/tmp.V8lXPf4b/llvm-build/projects/libcxx/include/c++build', '-isysroot', '/Applications/Xcode.app/Contents/Developer/Platforms/MacOSX.platform/Developer/SDKs/MacOSX10.13.sdk', '-fno-exceptions', '-I/Users/buildslave/jenkins/libcxx_libcxxabi_trunk_testing/CI_ARCH/32/CI_EXCEPTIONS/OFF/CI_STD/c++2a/llvm-project/libcxx/test/support', '-DLIBCXX_FILESYSTEM_STATIC_TEST_ROOT="/Users/buildslave/jenkins/libcxx_libcxxabi_trunk_testing/CI_ARCH/32/CI_EXCEPTIONS/OFF/CI_STD/c++2a/llvm-project/libcxx/test/std/input.output/filesystems/Inputs/static_test_env"', '-DLIBCXX_FILESYSTEM_DYNAMIC_TEST_ROOT="/private/var/folders/9t/lrs73ptj6lv644zvh1fk2_gc0000gn/T/tmp.V8lXPf4b/llvm-build/projects/libcxx/test/filesystem/Output/dynamic_env"', '-DLIBCXX_FILESYSTEM_DYNAMIC_TEST_HELPER="/usr/local/opt/python@2/bin/python2.7 /Users/buildslave/jenkins/libcxx_libcxxabi_trunk_testing/CI_ARCH/32/CI_EXCEPTIONS/OFF/CI_STD/c++2a/llvm-project/libcxx/test/support/filesystem_dynamic_test_helper.py"', '-D_LIBCPP_HAS_NO_PRAGMA_SYSTEM_HEADER', '-Wall', '-Wextra', '-Werror', '-Wuser-defined-warnings', '-Wshadow', '-Wno-unused-command-line-argument', '-Wno-attributes', '-Wno-pessimizing-move', '-Wno-c++11-extensions', '-Wno-user-defined-literals', '-Wno-noexcept-type', '-Wsign-compare', '-Wunused-variable', '-Wunused-parameter', '-Wunreachable-code', '-c'] Exit Code: 1 Standard Error: -- clang version 10.0.0 (https://github.com/llvm/llvm-project.git c752f5bce4cc524c9b808272ed9c7da67db61938) Target: i386-apple-darwin17.5.0 Thread model: posix InstalledDir: /Users/buildslave/jenkins/libcxx_libcxxabi_trunk_testing/CI_ARCH/32/CI_EXCEPTIONS/OFF/CI_STD/c++2a/host-compiler/bin "/Users/buildslave/jenkins/libcxx_libcxxabi_trunk_testing/CI_ARCH/32/CI_EXCEPTIONS/OFF/CI_STD/c++2a/host-compiler/bin/clang-10" -cc1 -triple x86_64-apple-macosx10.13.0 -Wdeprecated-objc-isa-usage -Werror=deprecated-objc-isa-usage -emit-obj -mrelax-all -disable-free -main-file-name is_nothrow_invocable.pass.cpp -mrelocation-model pic -pic-level 2 -mthread-model posix -mframe-pointer=all -masm-verbose -munwind-tables -faligned-alloc-unavailable -target-cpu penryn -dwarf-column-info -debugger-tuning=lldb -target-linker-version 409.12 -v -nostdinc++ -resource-dir /Users/buildslave/jenkins/libcxx_libcxxabi_trunk_testing/CI_ARCH/32/CI_EXCEPTIONS/OFF/CI_STD/c++2a/host-compiler/lib/clang/10.0.0 -include /var/folders/9t/lrs73ptj6lv644zvh1fk2_gc0000gn/T/tmp.V8lXPf4b/llvm-build/projects/libcxx/__config_site -include /Users/buildslave/jenkins/libcxx_libcxxabi_trunk_testing/CI_ARCH/32/CI_EXCEPTIONS/OFF/CI_STD/c++2a/llvm-project/libcxx/test/support/nasty_macros.h -isysroot /Applications/Xcode.app/Contents/Developer/Platforms/MacOSX.platform/Developer/SDKs/MacOSX10.13.sdk -D _LIBCPP_DISABLE_AVAILABILITY -I /Users/buildslave/jenkins/libcxx_libcxxabi_trunk_testing/CI_ARCH/32/CI_EXCEPTIONS/OFF/CI_STD/c++2a/llvm-project/libcxx/include -I /var/folders/9t/lrs73ptj6lv644zvh1fk2_gc0000gn/T/tmp.V8lXPf4b/llvm-build/projects/libcxx/include/c++build -I /Users/buildslave/jenkins/libcxx_libcxxabi_trunk_testing/CI_ARCH/32/CI_EXCEPTIONS/OFF/CI_STD/c++2a/llvm-project/libcxx/test/support -D "LIBCXX_FILESYSTEM_STATIC_TEST_ROOT=\"/Users/buildslave/jenkins/libcxx_libcxxabi_trunk_testing/CI_ARCH/32/CI_EXCEPTIONS/OFF/CI_STD/c++2a/llvm-project/libcxx/test/std/input.output/filesystems/Inputs/static_test_env\"" -D "LIBCXX_FILESYSTEM_DYNAMIC_TEST_ROOT=\"/private/var/folders/9t/lrs73ptj6lv644zvh1fk2_gc0000gn/T/tmp.V8lXPf4b/llvm-build/projects/libcxx/test/filesystem/Output/dynamic_env\"" -D "LIBCXX_FILESYSTEM_DYNAMIC_TEST_HELPER=\"/usr/local/opt/python@2/bin/python2.7 /Users/buildslave/jenkins/libcxx_libcxxabi_trunk_testing/CI_ARCH/32/CI_EXCEPTIONS/OFF/CI_STD/c++2a/llvm-project/libcxx/test/support/filesystem_dynamic_test_helper.py\"" -D _LIBCPP_HAS_NO_PRAGMA_SYSTEM_HEADER -stdlib=libc++ -internal-isystem /Applications/Xcode.app/Contents/Developer/Platforms/MacOSX.platform/Developer/SDKs/MacOSX10.13.sdk/usr/local/include -internal-isystem /Users/buildslave/jenkins/libcxx_libcxxabi_trunk_testing/CI_ARCH/32/CI_EXCEPTIONS/OFF/CI_STD/c++2a/host-compiler/lib/clang/10.0.0/include -internal-externc-isystem /Applications/Xcode.app/Contents/Developer/Platforms/MacOSX.platform/Developer/SDKs/MacOSX10.13.sdk/usr/include -Werror=thread-safety -Wno-macro-redefined -Wall -Wextra -Werror -Wuser-defined-warnings -Wshadow -Wno-unused-command-line-argument -Wno-attributes -Wno-pessimizing-move -Wno-c++11-extensions -Wno-user-defined-literals -Wno-noexcept-type -Wsign-compare -Wunused-variable -Wunused-parameter -Wunreachable-code -std=c++2a -fdeprecated-macro -fdebug-compilation-dir /private/var/folders/9t/lrs73ptj6lv644zvh1fk2_gc0000gn/T/tmp.V8lXPf4b/llvm-build/projects/libcxx/test/std/utilities/meta/meta.rel -ftemplate-depth 270 -ferror-limit 19 -fmessage-length 0 -stack-protector 1 -fblocks -fencode-extended-block-signature -fregister-global-dtors-with-atexit -fno-implicit-modules -fobjc-runtime=macosx-10.13.0 -fmax-type-align=16 -fdiagnostics-show-option -o /private/var/folders/9t/lrs73ptj6lv644zvh1fk2_gc0000gn/T/tmp.V8lXPf4b/llvm-build/projects/libcxx/test/std/utilities/meta/meta.rel/Output/is_nothrow_invocable.pass.cpp.o -x c++ /Users/buildslave/jenkins/libcxx_libcxxabi_trunk_testing/CI_ARCH/32/CI_EXCEPTIONS/OFF/CI_STD/c++2a/llvm-project/libcxx/test/std/utilities/meta/meta.rel/is_nothrow_invocable.pass.cpp clang -cc1 version 10.0.0 based upon LLVM 10.0.0svn default target x86_64-apple-darwin17.5.0 ignoring nonexistent directory "/Applications/Xcode.app/Contents/Developer/Platforms/MacOSX.platform/Developer/SDKs/MacOSX10.13.sdk/usr/local/include" ignoring nonexistent directory "/Applications/Xcode.app/Contents/Developer/Platforms/MacOSX.platform/Developer/SDKs/MacOSX10.13.sdk/Library/Frameworks" #include "..." search starts here: #include <...> search starts here: /Users/buildslave/jenkins/libcxx_libcxxabi_trunk_testing/CI_ARCH/32/CI_EXCEPTIONS/OFF/CI_STD/c++2a/llvm-project/libcxx/include /var/folders/9t/lrs73ptj6lv644zvh1fk2_gc0000gn/T/tmp.V8lXPf4b/llvm-build/projects/libcxx/include/c++build /Users/buildslave/jenkins/libcxx_libcxxabi_trunk_testing/CI_ARCH/32/CI_EXCEPTIONS/OFF/CI_STD/c++2a/llvm-project/libcxx/test/support /Users/buildslave/jenkins/libcxx_libcxxabi_trunk_testing/CI_ARCH/32/CI_EXCEPTIONS/OFF/CI_STD/c++2a/host-compiler/lib/clang/10.0.0/include /Applications/Xcode.app/Contents/Developer/Platforms/MacOSX.platform/Developer/SDKs/MacOSX10.13.sdk/usr/include /Applications/Xcode.app/Contents/Developer/Platforms/MacOSX.platform/Developer/SDKs/MacOSX10.13.sdk/System/Library/Frameworks (framework directory) End of search list. In file included from /Users/buildslave/jenkins/libcxx_libcxxabi_trunk_testing/CI_ARCH/32/CI_EXCEPTIONS/OFF/CI_STD/c++2a/llvm-project/libcxx/test/std/utilities/meta/meta.rel/is_nothrow_invocable.pass.cpp:15: /Users/buildslave/jenkins/libcxx_libcxxabi_trunk_testing/CI_ARCH/32/CI_EXCEPTIONS/OFF/CI_STD/c++2a/llvm-project/libcxx/include/type_traits:1123:22: error: volatile-qualified return type 'volatile void' is deprecated [-Werror,-Wdeprecated-volatile] template <class _Tp> _Tp __declval(long); ^ /Users/buildslave/jenkins/libcxx_libcxxabi_trunk_testing/CI_ARCH/32/CI_EXCEPTIONS/OFF/CI_STD/c++2a/llvm-project/libcxx/include/type_traits:3599:13: note: in instantiation of template class 'std::__1::__invokable_r<void, volatile void>' requested here __invokable<_Fp, _Args...>::value, ^ /Users/buildslave/jenkins/libcxx_libcxxabi_trunk_testing/CI_ARCH/32/CI_EXCEPTIONS/OFF/CI_STD/c++2a/llvm-project/libcxx/include/type_traits:3658:31: note: in instantiation of template type alias '__nothrow_invokable' requested here : integral_constant<bool, __nothrow_invokable<_Fn, _Args...>::value> {}; ^ /Users/buildslave/jenkins/libcxx_libcxxabi_trunk_testing/CI_ARCH/32/CI_EXCEPTIONS/OFF/CI_STD/c++2a/llvm-project/libcxx/test/std/utilities/meta/meta.rel/is_nothrow_invocable.pass.cpp:89:25: note: in instantiation of template class 'std::__1::is_nothrow_invocable<volatile void>' requested here static_assert(!std::is_nothrow_invocable<volatile void>::value, ""); ^ In file included from /Users/buildslave/jenkins/libcxx_libcxxabi_trunk_testing/CI_ARCH/32/CI_EXCEPTIONS/OFF/CI_STD/c++2a/llvm-project/libcxx/test/std/utilities/meta/meta.rel/is_nothrow_invocable.pass.cpp:15: /Users/buildslave/jenkins/libcxx_libcxxabi_trunk_testing/CI_ARCH/32/CI_EXCEPTIONS/OFF/CI_STD/c++2a/llvm-project/libcxx/include/type_traits:1123:22: error: volatile-qualified return type 'const volatile void' is deprecated [-Werror,-Wdeprecated-volatile] template <class _Tp> _Tp __declval(long); ^ /Users/buildslave/jenkins/libcxx_libcxxabi_trunk_testing/CI_ARCH/32/CI_EXCEPTIONS/OFF/CI_STD/c++2a/llvm-project/libcxx/include/type_traits:3599:13: note: in instantiation of template class 'std::__1::__invokable_r<void, const volatile void>' requested here __invokable<_Fp, _Args...>::value, ^ /Users/buildslave/jenkins/libcxx_libcxxabi_trunk_testing/CI_ARCH/32/CI_EXCEPTIONS/OFF/CI_STD/c++2a/llvm-project/libcxx/include/type_traits:3658:31: note: in instantiation of template type alias '__nothrow_invokable' requested here : integral_constant<bool, __nothrow_invokable<_Fn, _Args...>::value> {}; ^ /Users/buildslave/jenkins/libcxx_libcxxabi_trunk_testing/CI_ARCH/32/CI_EXCEPTIONS/OFF/CI_STD/c++2a/llvm-project/libcxx/test/std/utilities/meta/meta.rel/is_nothrow_invocable.pass.cpp:90:25: note: in instantiation of template class 'std::__1::is_nothrow_invocable<const volatile void>' requested here static_assert(!std::is_nothrow_invocable<const volatile void>::value, ""); ^ 2 errors generated. --

Hide Details

Compilation failed unexpectedly! ******************** Testing: 0.. 10.. 20.. 30.. 40.. 50.. 60.. 70.. 80. FAIL: libc++ :: std/utilities/meta/meta.rel/is_invocable.pass.cpp (5530 of 6365) ******************** TEST 'libc++ :: std/utilities/meta/meta.rel/is_invocable.pass.cpp' FAILED ******************** Command: ['/Users/buildslave/jenkins/libcxx_libcxxabi_trunk_testing/CI_ARCH/32/CI_EXCEPTIONS/OFF/CI_STD/c++2a/host-compiler/bin/clang++', '-o', '/private/var/folders/9t/lrs73ptj6lv644zvh1fk2_gc0000gn/T/tmp.V8lXPf4b/llvm-build/projects/libcxx/test/std/utilities/meta/meta.rel/Output/is_invocable.pass.cpp.o', '-x', 'c++', '/Users/buildslave/jenkins/libcxx_libcxxabi_trunk_testing/CI_ARCH/32/CI_EXCEPTIONS/OFF/CI_STD/c++2a/llvm-project/libcxx/test/std/utilities/meta/meta.rel/is_invocable.pass.cpp', '-c', '-D_LIBCPP_DISABLE_AVAILABILITY', '-m32', '-v', '-arch', 'x86_64', '-mmacosx-version-min=10.13', '-ftemplate-depth=270', '-Werror=thread-safety', '-std=c++2a', '-Wno-macro-redefined', '-include', '/var/folders/9t/lrs73ptj6lv644zvh1fk2_gc0000gn/T/tmp.V8lXPf4b/llvm-build/projects/libcxx/__config_site', '-include', '/Users/buildslave/jenkins/libcxx_libcxxabi_trunk_testing/CI_ARCH/32/CI_EXCEPTIONS/OFF/CI_STD/c++2a/llvm-project/libcxx/test/support/nasty_macros.h', '-nostdinc++', '-I/Users/buildslave/jenkins/libcxx_libcxxabi_trunk_testing/CI_ARCH/32/CI_EXCEPTIONS/OFF/CI_STD/c++2a/llvm-project/libcxx/include', '-I/var/folders/9t/lrs73ptj6lv644zvh1fk2_gc0000gn/T/tmp.V8lXPf4b/llvm-build/projects/libcxx/include/c++build', '-isysroot', '/Applications/Xcode.app/Contents/Developer/Platforms/MacOSX.platform/Developer/SDKs/MacOSX10.13.sdk', '-fno-exceptions', '-I/Users/buildslave/jenkins/libcxx_libcxxabi_trunk_testing/CI_ARCH/32/CI_EXCEPTIONS/OFF/CI_STD/c++2a/llvm-project/libcxx/test/support', '-DLIBCXX_FILESYSTEM_STATIC_TEST_ROOT="/Users/buildslave/jenkins/libcxx_libcxxabi_trunk_testing/CI_ARCH/32/CI_EXCEPTIONS/OFF/CI_STD/c++2a/llvm-project/libcxx/test/std/input.output/filesystems/Inputs/static_test_env"', '-DLIBCXX_FILESYSTEM_DYNAMIC_TEST_ROOT="/private/var/folders/9t/lrs73ptj6lv644zvh1fk2_gc0000gn/T/tmp.V8lXPf4b/llvm-build/projects/libcxx/test/filesystem/Output/dynamic_env"', '-DLIBCXX_FILESYSTEM_DYNAMIC_TEST_HELPER="/usr/local/opt/python@2/bin/python2.7 /Users/buildslave/jenkins/libcxx_libcxxabi_trunk_testing/CI_ARCH/32/CI_EXCEPTIONS/OFF/CI_STD/c++2a/llvm-project/libcxx/test/support/filesystem_dynamic_test_helper.py"', '-D_LIBCPP_HAS_NO_PRAGMA_SYSTEM_HEADER', '-Wall', '-Wextra', '-Werror', '-Wuser-defined-warnings', '-Wshadow', '-Wno-unused-command-line-argument', '-Wno-attributes', '-Wno-pessimizing-move', '-Wno-c++11-extensions', '-Wno-user-defined-literals', '-Wno-noexcept-type', '-Wsign-compare', '-Wunused-variable', '-Wunused-parameter', '-Wunreachable-code', '-c'] Exit Code: 1 Standard Error: -- clang version 10.0.0 (https://github.com/llvm/llvm-project.git c752f5bce4cc524c9b808272ed9c7da67db61938) Target: i386-apple-darwin17.5.0 Thread model: posix InstalledDir: /Users/buildslave/jenkins/libcxx_libcxxabi_trunk_testing/CI_ARCH/32/CI_EXCEPTIONS/OFF/CI_STD/c++2a/host-compiler/bin "/Users/buildslave/jenkins/libcxx_libcxxabi_trunk_testing/CI_ARCH/32/CI_EXCEPTIONS/OFF/CI_STD/c++2a/host-compiler/bin/clang-10" -cc1 -triple x86_64-apple-macosx10.13.0 -Wdeprecated-objc-isa-usage -Werror=deprecated-objc-isa-usage -emit-obj -mrelax-all -disable-free -main-file-name is_invocable.pass.cpp -mrelocation-model pic -pic-level 2 -mthread-model posix -mframe-pointer=all -masm-verbose -munwind-tables -faligned-alloc-unavailable -target-cpu penryn -dwarf-column-info -debugger-tuning=lldb -target-linker-version 409.12 -v -nostdinc++ -resource-dir /Users/buildslave/jenkins/libcxx_libcxxabi_trunk_testing/CI_ARCH/32/CI_EXCEPTIONS/OFF/CI_STD/c++2a/host-compiler/lib/clang/10.0.0 -include /var/folders/9t/lrs73ptj6lv644zvh1fk2_gc0000gn/T/tmp.V8lXPf4b/llvm-build/projects/libcxx/__config_site -include /Users/buildslave/jenkins/libcxx_libcxxabi_trunk_testing/CI_ARCH/32/CI_EXCEPTIONS/OFF/CI_STD/c++2a/llvm-project/libcxx/test/support/nasty_macros.h -isysroot /Applications/Xcode.app/Contents/Developer/Platforms/MacOSX.platform/Developer/SDKs/MacOSX10.13.sdk -D _LIBCPP_DISABLE_AVAILABILITY -I /Users/buildslave/jenkins/libcxx_libcxxabi_trunk_testing/CI_ARCH/32/CI_EXCEPTIONS/OFF/CI_STD/c++2a/llvm-project/libcxx/include -I /var/folders/9t/lrs73ptj6lv644zvh1fk2_gc0000gn/T/tmp.V8lXPf4b/llvm-build/projects/libcxx/include/c++build -I /Users/buildslave/jenkins/libcxx_libcxxabi_trunk_testing/CI_ARCH/32/CI_EXCEPTIONS/OFF/CI_STD/c++2a/llvm-project/libcxx/test/support -D "LIBCXX_FILESYSTEM_STATIC_TEST_ROOT=\"/Users/buildslave/jenkins/libcxx_libcxxabi_trunk_testing/CI_ARCH/32/CI_EXCEPTIONS/OFF/CI_STD/c++2a/llvm-project/libcxx/test/std/input.output/filesystems/Inputs/static_test_env\"" -D "LIBCXX_FILESYSTEM_DYNAMIC_TEST_ROOT=\"/private/var/folders/9t/lrs73ptj6lv644zvh1fk2_gc0000gn/T/tmp.V8lXPf4b/llvm-build/projects/libcxx/test/filesystem/Output/dynamic_env\"" -D "LIBCXX_FILESYSTEM_DYNAMIC_TEST_HELPER=\"/usr/local/opt/python@2/bin/python2.7 /Users/buildslave/jenkins/libcxx_libcxxabi_trunk_testing/CI_ARCH/32/CI_EXCEPTIONS/OFF/CI_STD/c++2a/llvm-project/libcxx/test/support/filesystem_dynamic_test_helper.py\"" -D _LIBCPP_HAS_NO_PRAGMA_SYSTEM_HEADER -stdlib=libc++ -internal-isystem /Applications/Xcode.app/Contents/Developer/Platforms/MacOSX.platform/Developer/SDKs/MacOSX10.13.sdk/usr/local/include -internal-isystem /Users/buildslave/jenkins/libcxx_libcxxabi_trunk_testing/CI_ARCH/32/CI_EXCEPTIONS/OFF/CI_STD/c++2a/host-compiler/lib/clang/10.0.0/include -internal-externc-isystem /Applications/Xcode.app/Contents/Developer/Platforms/MacOSX.platform/Developer/SDKs/MacOSX10.13.sdk/usr/include -Werror=thread-safety -Wno-macro-redefined -Wall -Wextra -Werror -Wuser-defined-warnings -Wshadow -Wno-unused-command-line-argument -Wno-attributes -Wno-pessimizing-move -Wno-c++11-extensions -Wno-user-defined-literals -Wno-noexcept-type -Wsign-compare -Wunused-variable -Wunused-parameter -Wunreachable-code -std=c++2a -fdeprecated-macro -fdebug-compilation-dir /private/var/folders/9t/lrs73ptj6lv644zvh1fk2_gc0000gn/T/tmp.V8lXPf4b/llvm-build/projects/libcxx/test/std/utilities/meta/meta.rel -ftemplate-depth 270 -ferror-limit 19 -fmessage-length 0 -stack-protector 1 -fblocks -fencode-extended-block-signature -fregister-global-dtors-with-atexit -fno-implicit-modules -fobjc-runtime=macosx-10.13.0 -fmax-type-align=16 -fdiagnostics-show-option -o /private/var/folders/9t/lrs73ptj6lv644zvh1fk2_gc0000gn/T/tmp.V8lXPf4b/llvm-build/projects/libcxx/test/std/utilities/meta/meta.rel/Output/is_invocable.pass.cpp.o -x c++ /Users/buildslave/jenkins/libcxx_libcxxabi_trunk_testing/CI_ARCH/32/CI_EXCEPTIONS/OFF/CI_STD/c++2a/llvm-project/libcxx/test/std/utilities/meta/meta.rel/is_invocable.pass.cpp clang -cc1 version 10.0.0 based upon LLVM 10.0.0svn default target x86_64-apple-darwin17.5.0 ignoring nonexistent directory "/Applications/Xcode.app/Contents/Developer/Platforms/MacOSX.platform/Developer/SDKs/MacOSX10.13.sdk/usr/local/include" ignoring nonexistent directory "/Applications/Xcode.app/Contents/Developer/Platforms/MacOSX.platform/Developer/SDKs/MacOSX10.13.sdk/Library/Frameworks" #include "..." search starts here: #include <...> search starts here: /Users/buildslave/jenkins/libcxx_libcxxabi_trunk_testing/CI_ARCH/32/CI_EXCEPTIONS/OFF/CI_STD/c++2a/llvm-project/libcxx/include /var/folders/9t/lrs73ptj6lv644zvh1fk2_gc0000gn/T/tmp.V8lXPf4b/llvm-build/projects/libcxx/include/c++build /Users/buildslave/jenkins/libcxx_libcxxabi_trunk_testing/CI_ARCH/32/CI_EXCEPTIONS/OFF/CI_STD/c++2a/llvm-project/libcxx/test/support /Users/buildslave/jenkins/libcxx_libcxxabi_trunk_testing/CI_ARCH/32/CI_EXCEPTIONS/OFF/CI_STD/c++2a/host-compiler/lib/clang/10.0.0/include /Applications/Xcode.app/Contents/Developer/Platforms/MacOSX.platform/Developer/SDKs/MacOSX10.13.sdk/usr/include /Applications/Xcode.app/Contents/Developer/Platforms/MacOSX.platform/Developer/SDKs/MacOSX10.13.sdk/System/Library/Frameworks (framework directory) End of search list. In file included from /Users/buildslave/jenkins/libcxx_libcxxabi_trunk_testing/CI_ARCH/32/CI_EXCEPTIONS/OFF/CI_STD/c++2a/llvm-project/libcxx/test/std/utilities/meta/meta.rel/is_invocable.pass.cpp:21: /Users/buildslave/jenkins/libcxx_libcxxabi_trunk_testing/CI_ARCH/32/CI_EXCEPTIONS/OFF/CI_STD/c++2a/llvm-project/libcxx/include/type_traits:1123:22: error: volatile-qualified return type 'volatile void' is deprecated [-Werror,-Wdeprecated-volatile] template <class _Tp> _Tp __declval(long); ^ /Users/buildslave/jenkins/libcxx_libcxxabi_trunk_testing/CI_ARCH/32/CI_EXCEPTIONS/OFF/CI_STD/c++2a/llvm-project/libcxx/include/type_traits:3640:31: note: in instantiation of template class 'std::__1::__invokable_r<void, volatile void>' requested here : integral_constant<bool, __invokable<_Fn, _Args...>::value> {}; ^ /Users/buildslave/jenkins/libcxx_libcxxabi_trunk_testing/CI_ARCH/32/CI_EXCEPTIONS/OFF/CI_STD/c++2a/llvm-project/libcxx/test/std/utilities/meta/meta.rel/is_invocable.pass.cpp:56:25: note: in instantiation of template class 'std::__1::is_invocable<volatile void>' requested here static_assert(!std::is_invocable<volatile void>::value, ""); ^ In file included from /Users/buildslave/jenkins/libcxx_libcxxabi_trunk_testing/CI_ARCH/32/CI_EXCEPTIONS/OFF/CI_STD/c++2a/llvm-project/libcxx/test/std/utilities/meta/meta.rel/is_invocable.pass.cpp:21: /Users/buildslave/jenkins/libcxx_libcxxabi_trunk_testing/CI_ARCH/32/CI_EXCEPTIONS/OFF/CI_STD/c++2a/llvm-project/libcxx/include/type_traits:1123:22: error: volatile-qualified return type 'const volatile void' is deprecated [-Werror,-Wdeprecated-volatile] template <class _Tp> _Tp __declval(long); ^ /Users/buildslave/jenkins/libcxx_libcxxabi_trunk_testing/CI_ARCH/32/CI_EXCEPTIONS/OFF/CI_STD/c++2a/llvm-project/libcxx/include/type_traits:3640:31: note: in instantiation of template class 'std::__1::__invokable_r<void, const volatile void>' requested here : integral_constant<bool, __invokable<_Fn, _Args...>::value> {}; ^ /Users/buildslave/jenkins/libcxx_libcxxabi_trunk_testing/CI_ARCH/32/CI_EXCEPTIONS/OFF/CI_STD/c++2a/llvm-project/libcxx/test/std/utilities/meta/meta.rel/is_invocable.pass.cpp:57:25: note: in instantiation of template class 'std::__1::is_invocable<const volatile void>' requested here static_assert(!std::is_invocable<const volatile void>::value, ""); ^ 2 errors generated. --

Hide Details

Compilation failed unexpectedly! ******************** Testing: 0.. 10.. 20.. 30.. 40.. 50.. 60.. 70.. 80. FAIL: libc++ :: std/utilities/meta/meta.trans/meta.trans.other/result_of11.pass.cpp (5551 of 6365) ******************** TEST 'libc++ :: std/utilities/meta/meta.trans/meta.trans.other/result_of11.pass.cpp' FAILED ******************** Command: ['/Users/buildslave/jenkins/libcxx_libcxxabi_trunk_testing/CI_ARCH/32/CI_EXCEPTIONS/OFF/CI_STD/c++2a/host-compiler/bin/clang++', '-o', '/private/var/folders/9t/lrs73ptj6lv644zvh1fk2_gc0000gn/T/tmp.V8lXPf4b/llvm-build/projects/libcxx/test/std/utilities/meta/meta.trans/meta.trans.other/Output/result_of11.pass.cpp.o', '-x', 'c++', '/Users/buildslave/jenkins/libcxx_libcxxabi_trunk_testing/CI_ARCH/32/CI_EXCEPTIONS/OFF/CI_STD/c++2a/llvm-project/libcxx/test/std/utilities/meta/meta.trans/meta.trans.other/result_of11.pass.cpp', '-c', '-D_LIBCPP_DISABLE_AVAILABILITY', '-m32', '-v', '-arch', 'x86_64', '-mmacosx-version-min=10.13', '-ftemplate-depth=270', '-Werror=thread-safety', '-std=c++2a', '-Wno-macro-redefined', '-include', '/var/folders/9t/lrs73ptj6lv644zvh1fk2_gc0000gn/T/tmp.V8lXPf4b/llvm-build/projects/libcxx/__config_site', '-include', '/Users/buildslave/jenkins/libcxx_libcxxabi_trunk_testing/CI_ARCH/32/CI_EXCEPTIONS/OFF/CI_STD/c++2a/llvm-project/libcxx/test/support/nasty_macros.h', '-nostdinc++', '-I/Users/buildslave/jenkins/libcxx_libcxxabi_trunk_testing/CI_ARCH/32/CI_EXCEPTIONS/OFF/CI_STD/c++2a/llvm-project/libcxx/include', '-I/var/folders/9t/lrs73ptj6lv644zvh1fk2_gc0000gn/T/tmp.V8lXPf4b/llvm-build/projects/libcxx/include/c++build', '-isysroot', '/Applications/Xcode.app/Contents/Developer/Platforms/MacOSX.platform/Developer/SDKs/MacOSX10.13.sdk', '-fno-exceptions', '-I/Users/buildslave/jenkins/libcxx_libcxxabi_trunk_testing/CI_ARCH/32/CI_EXCEPTIONS/OFF/CI_STD/c++2a/llvm-project/libcxx/test/support', '-DLIBCXX_FILESYSTEM_STATIC_TEST_ROOT="/Users/buildslave/jenkins/libcxx_libcxxabi_trunk_testing/CI_ARCH/32/CI_EXCEPTIONS/OFF/CI_STD/c++2a/llvm-project/libcxx/test/std/input.output/filesystems/Inputs/static_test_env"', '-DLIBCXX_FILESYSTEM_DYNAMIC_TEST_ROOT="/private/var/folders/9t/lrs73ptj6lv644zvh1fk2_gc0000gn/T/tmp.V8lXPf4b/llvm-build/projects/libcxx/test/filesystem/Output/dynamic_env"', '-DLIBCXX_FILESYSTEM_DYNAMIC_TEST_HELPER="/usr/local/opt/python@2/bin/python2.7 /Users/buildslave/jenkins/libcxx_libcxxabi_trunk_testing/CI_ARCH/32/CI_EXCEPTIONS/OFF/CI_STD/c++2a/llvm-project/libcxx/test/support/filesystem_dynamic_test_helper.py"', '-D_LIBCPP_HAS_NO_PRAGMA_SYSTEM_HEADER', '-Wall', '-Wextra', '-Werror', '-Wuser-defined-warnings', '-Wshadow', '-Wno-unused-command-line-argument', '-Wno-attributes', '-Wno-pessimizing-move', '-Wno-c++11-extensions', '-Wno-user-defined-literals', '-Wno-noexcept-type', '-Wsign-compare', '-Wunused-variable', '-Wunused-parameter', '-Wunreachable-code', '-c'] Exit Code: 1 Standard Error: -- clang version 10.0.0 (https://github.com/llvm/llvm-project.git c752f5bce4cc524c9b808272ed9c7da67db61938) Target: i386-apple-darwin17.5.0 Thread model: posix InstalledDir: /Users/buildslave/jenkins/libcxx_libcxxabi_trunk_testing/CI_ARCH/32/CI_EXCEPTIONS/OFF/CI_STD/c++2a/host-compiler/bin "/Users/buildslave/jenkins/libcxx_libcxxabi_trunk_testing/CI_ARCH/32/CI_EXCEPTIONS/OFF/CI_STD/c++2a/host-compiler/bin/clang-10" -cc1 -triple x86_64-apple-macosx10.13.0 -Wdeprecated-objc-isa-usage -Werror=deprecated-objc-isa-usage -emit-obj -mrelax-all -disable-free -main-file-name result_of11.pass.cpp -mrelocation-model pic -pic-level 2 -mthread-model posix -mframe-pointer=all -masm-verbose -munwind-tables -faligned-alloc-unavailable -target-cpu penryn -dwarf-column-info -debugger-tuning=lldb -target-linker-version 409.12 -v -nostdinc++ -resource-dir /Users/buildslave/jenkins/libcxx_libcxxabi_trunk_testing/CI_ARCH/32/CI_EXCEPTIONS/OFF/CI_STD/c++2a/host-compiler/lib/clang/10.0.0 -include /var/folders/9t/lrs73ptj6lv644zvh1fk2_gc0000gn/T/tmp.V8lXPf4b/llvm-build/projects/libcxx/__config_site -include /Users/buildslave/jenkins/libcxx_libcxxabi_trunk_testing/CI_ARCH/32/CI_EXCEPTIONS/OFF/CI_STD/c++2a/llvm-project/libcxx/test/support/nasty_macros.h -isysroot /Applications/Xcode.app/Contents/Developer/Platforms/MacOSX.platform/Developer/SDKs/MacOSX10.13.sdk -D _LIBCPP_DISABLE_AVAILABILITY -I /Users/buildslave/jenkins/libcxx_libcxxabi_trunk_testing/CI_ARCH/32/CI_EXCEPTIONS/OFF/CI_STD/c++2a/llvm-project/libcxx/include -I /var/folders/9t/lrs73ptj6lv644zvh1fk2_gc0000gn/T/tmp.V8lXPf4b/llvm-build/projects/libcxx/include/c++build -I /Users/buildslave/jenkins/libcxx_libcxxabi_trunk_testing/CI_ARCH/32/CI_EXCEPTIONS/OFF/CI_STD/c++2a/llvm-project/libcxx/test/support -D "LIBCXX_FILESYSTEM_STATIC_TEST_ROOT=\"/Users/buildslave/jenkins/libcxx_libcxxabi_trunk_testing/CI_ARCH/32/CI_EXCEPTIONS/OFF/CI_STD/c++2a/llvm-project/libcxx/test/std/input.output/filesystems/Inputs/static_test_env\"" -D "LIBCXX_FILESYSTEM_DYNAMIC_TEST_ROOT=\"/private/var/folders/9t/lrs73ptj6lv644zvh1fk2_gc0000gn/T/tmp.V8lXPf4b/llvm-build/projects/libcxx/test/filesystem/Output/dynamic_env\"" -D "LIBCXX_FILESYSTEM_DYNAMIC_TEST_HELPER=\"/usr/local/opt/python@2/bin/python2.7 /Users/buildslave/jenkins/libcxx_libcxxabi_trunk_testing/CI_ARCH/32/CI_EXCEPTIONS/OFF/CI_STD/c++2a/llvm-project/libcxx/test/support/filesystem_dynamic_test_helper.py\"" -D _LIBCPP_HAS_NO_PRAGMA_SYSTEM_HEADER -stdlib=libc++ -internal-isystem /Applications/Xcode.app/Contents/Developer/Platforms/MacOSX.platform/Developer/SDKs/MacOSX10.13.sdk/usr/local/include -internal-isystem /Users/buildslave/jenkins/libcxx_libcxxabi_trunk_testing/CI_ARCH/32/CI_EXCEPTIONS/OFF/CI_STD/c++2a/host-compiler/lib/clang/10.0.0/include -internal-externc-isystem /Applications/Xcode.app/Contents/Developer/Platforms/MacOSX.platform/Developer/SDKs/MacOSX10.13.sdk/usr/include -Werror=thread-safety -Wno-macro-redefined -Wall -Wextra -Werror -Wuser-defined-warnings -Wshadow -Wno-unused-command-line-argument -Wno-attributes -Wno-pessimizing-move -Wno-c++11-extensions -Wno-user-defined-literals -Wno-noexcept-type -Wsign-compare -Wunused-variable -Wunused-parameter -Wunreachable-code -std=c++2a -fdeprecated-macro -fdebug-compilation-dir /private/var/folders/9t/lrs73ptj6lv644zvh1fk2_gc0000gn/T/tmp.V8lXPf4b/llvm-build/projects/libcxx/test/std/utilities/meta/meta.trans/meta.trans.other -ftemplate-depth 270 -ferror-limit 19 -fmessage-length 0 -stack-protector 1 -fblocks -fencode-extended-block-signature -fregister-global-dtors-with-atexit -fno-implicit-modules -fobjc-runtime=macosx-10.13.0 -fmax-type-align=16 -fdiagnostics-show-option -o /private/var/folders/9t/lrs73ptj6lv644zvh1fk2_gc0000gn/T/tmp.V8lXPf4b/llvm-build/projects/libcxx/test/std/utilities/meta/meta.trans/meta.trans.other/Output/result_of11.pass.cpp.o -x c++ /Users/buildslave/jenkins/libcxx_libcxxabi_trunk_testing/CI_ARCH/32/CI_EXCEPTIONS/OFF/CI_STD/c++2a/llvm-project/libcxx/test/std/utilities/meta/meta.trans/meta.trans.other/result_of11.pass.cpp clang -cc1 version 10.0.0 based upon LLVM 10.0.0svn default target x86_64-apple-darwin17.5.0 ignoring nonexistent directory "/Applications/Xcode.app/Contents/Developer/Platforms/MacOSX.platform/Developer/SDKs/MacOSX10.13.sdk/usr/local/include" ignoring nonexistent directory "/Applications/Xcode.app/Contents/Developer/Platforms/MacOSX.platform/Developer/SDKs/MacOSX10.13.sdk/Library/Frameworks" #include "..." search starts here: #include <...> search starts here: /Users/buildslave/jenkins/libcxx_libcxxabi_trunk_testing/CI_ARCH/32/CI_EXCEPTIONS/OFF/CI_STD/c++2a/llvm-project/libcxx/include /var/folders/9t/lrs73ptj6lv644zvh1fk2_gc0000gn/T/tmp.V8lXPf4b/llvm-build/projects/libcxx/include/c++build /Users/buildslave/jenkins/libcxx_libcxxabi_trunk_testing/CI_ARCH/32/CI_EXCEPTIONS/OFF/CI_STD/c++2a/llvm-project/libcxx/test/support /Users/buildslave/jenkins/libcxx_libcxxabi_trunk_testing/CI_ARCH/32/CI_EXCEPTIONS/OFF/CI_STD/c++2a/host-compiler/lib/clang/10.0.0/include /Applications/Xcode.app/Contents/Developer/Platforms/MacOSX.platform/Developer/SDKs/MacOSX10.13.sdk/usr/include /Applications/Xcode.app/Contents/Developer/Platforms/MacOSX.platform/Developer/SDKs/MacOSX10.13.sdk/System/Library/Frameworks (framework directory) End of search list. /Users/buildslave/jenkins/libcxx_libcxxabi_trunk_testing/CI_ARCH/32/CI_EXCEPTIONS/OFF/CI_STD/c++2a/llvm-project/libcxx/test/std/utilities/meta/meta.trans/meta.trans.other/result_of11.pass.cpp:74:45: error: volatile-qualified parameter type 'volatile F' is deprecated [-Werror,-Wdeprecated-volatile] test_result_of_imp<PMD(F volatile ), char &&>(); ^ /Users/buildslave/jenkins/libcxx_libcxxabi_trunk_testing/CI_ARCH/32/CI_EXCEPTIONS/OFF/CI_STD/c++2a/llvm-project/libcxx/test/std/utilities/meta/meta.trans/meta.trans.other/result_of11.pass.cpp:75:45: error: volatile-qualified parameter type 'const volatile F' is deprecated [-Werror,-Wdeprecated-volatile] test_result_of_imp<PMD(F const volatile ), char &&>(); ^ /Users/buildslave/jenkins/libcxx_libcxxabi_trunk_testing/CI_ARCH/32/CI_EXCEPTIONS/OFF/CI_STD/c++2a/llvm-project/libcxx/test/std/utilities/meta/meta.trans/meta.trans.other/result_of11.pass.cpp:89:46: error: volatile-qualified parameter type 'volatile FD' is deprecated [-Werror,-Wdeprecated-volatile] test_result_of_imp<PMD(FD volatile ), char &&>(); ^ /Users/buildslave/jenkins/libcxx_libcxxabi_trunk_testing/CI_ARCH/32/CI_EXCEPTIONS/OFF/CI_STD/c++2a/llvm-project/libcxx/test/std/utilities/meta/meta.trans/meta.trans.other/result_of11.pass.cpp:90:46: error: volatile-qualified parameter type 'const volatile FD' is deprecated [-Werror,-Wdeprecated-volatile] test_result_of_imp<PMD(FD const volatile ), char &&>(); ^ /Users/buildslave/jenkins/libcxx_libcxxabi_trunk_testing/CI_ARCH/32/CI_EXCEPTIONS/OFF/CI_STD/c++2a/llvm-project/libcxx/test/std/utilities/meta/meta.trans/meta.trans.other/result_of11.pass.cpp:129:46: error: volatile-qualified parameter type 'volatile F' is deprecated [-Werror,-Wdeprecated-volatile] test_result_of_imp<int (F::* (F volatile )) () volatile &&, int> (); ^ /Users/buildslave/jenkins/libcxx_libcxxabi_trunk_testing/CI_ARCH/32/CI_EXCEPTIONS/OFF/CI_STD/c++2a/llvm-project/libcxx/test/std/utilities/meta/meta.trans/meta.trans.other/result_of11.pass.cpp:130:46: error: volatile-qualified parameter type 'volatile F' is deprecated [-Werror,-Wdeprecated-volatile] test_result_of_imp<int (F::* (F volatile )) () const volatile &&, int> (); ^ /Users/buildslave/jenkins/libcxx_libcxxabi_trunk_testing/CI_ARCH/32/CI_EXCEPTIONS/OFF/CI_STD/c++2a/llvm-project/libcxx/test/std/utilities/meta/meta.trans/meta.trans.other/result_of11.pass.cpp:131:52: error: volatile-qualified parameter type 'const volatile F' is deprecated [-Werror,-Wdeprecated-volatile] test_result_of_imp<int (F::* (F const volatile )) () const volatile &&, int> (); ^ /Users/buildslave/jenkins/libcxx_libcxxabi_trunk_testing/CI_ARCH/32/CI_EXCEPTIONS/OFF/CI_STD/c++2a/llvm-project/libcxx/test/std/utilities/meta/meta.trans/meta.trans.other/result_of11.pass.cpp:160:47: error: volatile-qualified parameter type 'volatile FD' is deprecated [-Werror,-Wdeprecated-volatile] test_result_of_imp<int (F::* (FD volatile )) () volatile &&, int> (); ^ /Users/buildslave/jenkins/libcxx_libcxxabi_trunk_testing/CI_ARCH/32/CI_EXCEPTIONS/OFF/CI_STD/c++2a/llvm-project/libcxx/test/std/utilities/meta/meta.trans/meta.trans.other/result_of11.pass.cpp:161:47: error: volatile-qualified parameter type 'volatile FD' is deprecated [-Werror,-Wdeprecated-volatile] test_result_of_imp<int (F::* (FD volatile )) () const volatile &&, int> (); ^ /Users/buildslave/jenkins/libcxx_libcxxabi_trunk_testing/CI_ARCH/32/CI_EXCEPTIONS/OFF/CI_STD/c++2a/llvm-project/libcxx/test/std/utilities/meta/meta.trans/meta.trans.other/result_of11.pass.cpp:162:53: error: volatile-qualified parameter type 'const volatile FD' is deprecated [-Werror,-Wdeprecated-volatile] test_result_of_imp<int (F::* (FD const volatile )) () const volatile &&, int> (); ^ 10 errors generated. --

Hide Details

Compilation failed unexpectedly! ******************** Testing: 0.. 10.. 20.. 30.. 40.. 50.. 60.. 70.. 80.. 90.. Testing Time: 1847.27s ******************** Failing Tests (3): libc++ :: std/utilities/meta/meta.rel/is_invocable.pass.cpp libc++ :: std/utilities/meta/meta.rel/is_nothrow_invocable.pass.cpp libc++ :: std/utilities/meta/meta.trans/meta.trans.other/result_of11.pass.cpp

Hide Details

Expected Passes : 5931 Expected Failures : 43 Unsupported Tests : 388 Unexpected Failures: 3 FAILED: projects/libcxx/test/CMakeFiles/check-cxx cd /var/folders/9t/lrs73ptj6lv644zvh1fk2_gc0000gn/T/tmp.V8lXPf4b/llvm-build/projects/libcxx/test && /usr/local/bin/python /var/folders/9t/lrs73ptj6lv644zvh1fk2_gc0000gn/T/tmp.V8lXPf4b/llvm-build/./bin/llvm-lit -sv --param=std=c++2a --param=enable_32bit=true /var/folders/9t/lrs73ptj6lv644zvh1fk2_gc0000gn/T/tmp.V8lXPf4b/llvm-build/projects/libcxx/test ninja: build stopped: subcommand failed. + cleanup + [[ -z '' ]] + echo 'Removing temporary directory /var/folders/9t/lrs73ptj6lv644zvh1fk2_gc0000gn/T/tmp.V8lXPf4b' Removing temporary directory /var/folders/9t/lrs73ptj6lv644zvh1fk2_gc0000gn/T/tmp.V8lXPf4b + rm -rf /var/folders/9t/lrs73ptj6lv644zvh1fk2_gc0000gn/T/tmp.V8lXPf4b Build step 'Execute shell' marked build as failure New run name is '#320 std=c++2a arch=32 exceptions=OFF' [BFA] Scanning build for known causes... [BFA] Found failure cause(s): [BFA] Ninja target failed from category Compile [BFA] Compile Error from category Compile [BFA] Regression test failed from category Test [BFA] Done. 0s Finished: FAILURE