FailedConsole Output

Skipping 10,238 KB.. Full Log
td::__1::__fs::filesystem::path, void *> > >' is deprecated because it has a user-declared copy assignment operator [-Werror,-Wdeprecated-copy]
    __tree_node_destructor& operator=(const __tree_node_destructor&);
                            ^
/Users/buildslave/jenkins/libcxx_libcxxabi_trunk_testing/CI_ARCH/32/CI_EXCEPTIONS/OFF/CI_STD/c++2a/llvm-project/libcxx/include/memory:2198:9: note: in implicit copy constructor for 'std::__1::__tree_node_destructor<std::__1::allocator<std::__1::__tree_node<std::__1::__fs::filesystem::path, void *> > >' first required here
      : __value_(_VSTD::forward<_Up>(__u))
        ^
/Users/buildslave/jenkins/libcxx_libcxxabi_trunk_testing/CI_ARCH/32/CI_EXCEPTIONS/OFF/CI_STD/c++2a/llvm-project/libcxx/include/memory:2301:42: note: in instantiation of function template specialization 'std::__1::__compressed_pair_elem<std::__1::__tree_node_destructor<std::__1::allocator<std::__1::__tree_node<std::__1::__fs::filesystem::path, void *> > >, 1, false>::__compressed_pair_elem<std::__1::__tree_node_destructor<std::__1::allocator<std::__1::__tree_node<std::__1::__fs::filesystem::path, void *> > >, void>' requested here
      : _Base1(std::forward<_U1>(__t1)), _Base2(std::forward<_U2>(__t2)) {}
                                         ^
/Users/buildslave/jenkins/libcxx_libcxxabi_trunk_testing/CI_ARCH/32/CI_EXCEPTIONS/OFF/CI_STD/c++2a/llvm-project/libcxx/include/memory:2528:9: note: in instantiation of function template specialization 'std::__1::__compressed_pair<std::__1::__tree_node<std::__1::__fs::filesystem::path, void *> *, std::__1::__tree_node_destructor<std::__1::allocator<std::__1::__tree_node<std::__1::__fs::filesystem::path, void *> > > >::__compressed_pair<std::__1::__tree_node<std::__1::__fs::filesystem::path, void *> *&, std::__1::__tree_node_destructor<std::__1::allocator<std::__1::__tree_node<std::__1::__fs::filesystem::path, void *> > > >' requested here
      : __ptr_(__p, _VSTD::move(__d)) {
        ^
/Users/buildslave/jenkins/libcxx_libcxxabi_trunk_testing/CI_ARCH/32/CI_EXCEPTIONS/OFF/CI_STD/c++2a/llvm-project/libcxx/include/__tree:2190:19: note: in instantiation of function template specialization 'std::__1::unique_ptr<std::__1::__tree_node<std::__1::__fs::filesystem::path, void *>, std::__1::__tree_node_destructor<std::__1::allocator<std::__1::__tree_node<std::__1::__fs::filesystem::path, void *> > > >::unique_ptr<true, void>' requested here
    __node_holder __h(__node_traits::allocate(__na, 1), _Dp(__na));
                  ^
/Users/buildslave/jenkins/libcxx_libcxxabi_trunk_testing/CI_ARCH/32/CI_EXCEPTIONS/OFF/CI_STD/c++2a/llvm-project/libcxx/include/__tree:2169:29: note: in instantiation of function template specialization 'std::__1::__tree<std::__1::__fs::filesystem::path, std::__1::less<std::__1::__fs::filesystem::path>, std::__1::allocator<std::__1::__fs::filesystem::path> >::__construct_node<const std::__1::__fs::filesystem::path &>' requested here
        __node_holder __h = __construct_node(_VSTD::forward<_Args>(__args)...);
                            ^
/Users/buildslave/jenkins/libcxx_libcxxabi_trunk_testing/CI_ARCH/32/CI_EXCEPTIONS/OFF/CI_STD/c++2a/llvm-project/libcxx/include/__tree:1271:16: note: in instantiation of function template specialization 'std::__1::__tree<std::__1::__fs::filesystem::path, std::__1::less<std::__1::__fs::filesystem::path>, std::__1::allocator<std::__1::__fs::filesystem::path> >::__emplace_hint_unique_key_args<std::__1::__fs::filesystem::path, const std::__1::__fs::filesystem::path &>' requested here
        return __emplace_hint_unique_key_args(__p, _NodeTypes::__get_key(__v), __v);
               ^
/Users/buildslave/jenkins/libcxx_libcxxabi_trunk_testing/CI_ARCH/32/CI_EXCEPTIONS/OFF/CI_STD/c++2a/llvm-project/libcxx/include/set:667:25: note: in instantiation of member function 'std::__1::__tree<std::__1::__fs::filesystem::path, std::__1::less<std::__1::__fs::filesystem::path>, std::__1::allocator<std::__1::__fs::filesystem::path> >::__insert_unique' requested here
                __tree_.__insert_unique(__e, *__f);
                        ^
/Users/buildslave/jenkins/libcxx_libcxxabi_trunk_testing/CI_ARCH/32/CI_EXCEPTIONS/OFF/CI_STD/c++2a/llvm-project/libcxx/include/set:509:13: note: in instantiation of function template specialization 'std::__1::set<std::__1::__fs::filesystem::path, std::__1::less<std::__1::__fs::filesystem::path>, std::__1::allocator<std::__1::__fs::filesystem::path> >::insert<const std::__1::__fs::filesystem::path *>' requested here
            insert(__f, __l);
            ^
/Users/buildslave/jenkins/libcxx_libcxxabi_trunk_testing/CI_ARCH/32/CI_EXCEPTIONS/OFF/CI_STD/c++2a/llvm-project/libcxx/test/std/input.output/filesystems/class.rec.dir.itr/rec.dir.itr.members/recursion_pending.pass.cpp:134:20: note: in instantiation of function template specialization 'std::__1::set<std::__1::__fs::filesystem::path, std::__1::less<std::__1::__fs::filesystem::path>, std::__1::allocator<std::__1::__fs::filesystem::path> >::set<const std::__1::__fs::filesystem::path *>' requested here
    std::set<path> notSeenDepth0(std::begin(DE0), std::end(DE0));
                   ^
1 error generated.
--

Hide Details

Compilation failed unexpectedly! ******************** Testing: 0.. 10.. 20.. 30. FAIL: libc++ :: std/input.output/filesystems/class.rec.dir.itr/rec.dir.itr.nonmembers/begin_end.pass.cpp (2295 of 6368) ******************** TEST 'libc++ :: std/input.output/filesystems/class.rec.dir.itr/rec.dir.itr.nonmembers/begin_end.pass.cpp' FAILED ******************** Command: ['/Users/buildslave/jenkins/libcxx_libcxxabi_trunk_testing/CI_ARCH/32/CI_EXCEPTIONS/OFF/CI_STD/c++2a/host-compiler/bin/clang++', '-o', '/private/var/folders/9t/lrs73ptj6lv644zvh1fk2_gc0000gn/T/tmp.uRw6ClIN/llvm-build/projects/libcxx/test/std/input.output/filesystems/class.rec.dir.itr/rec.dir.itr.nonmembers/Output/begin_end.pass.cpp.o', '-x', 'c++', '/Users/buildslave/jenkins/libcxx_libcxxabi_trunk_testing/CI_ARCH/32/CI_EXCEPTIONS/OFF/CI_STD/c++2a/llvm-project/libcxx/test/std/input.output/filesystems/class.rec.dir.itr/rec.dir.itr.nonmembers/begin_end.pass.cpp', '-c', '-D_LIBCPP_DISABLE_AVAILABILITY', '-m32', '-v', '-arch', 'x86_64', '-mmacosx-version-min=10.13', '-ftemplate-depth=270', '-Werror=thread-safety', '-std=c++2a', '-Wno-macro-redefined', '-include', '/var/folders/9t/lrs73ptj6lv644zvh1fk2_gc0000gn/T/tmp.uRw6ClIN/llvm-build/projects/libcxx/__config_site', '-include', '/Users/buildslave/jenkins/libcxx_libcxxabi_trunk_testing/CI_ARCH/32/CI_EXCEPTIONS/OFF/CI_STD/c++2a/llvm-project/libcxx/test/support/nasty_macros.h', '-nostdinc++', '-I/Users/buildslave/jenkins/libcxx_libcxxabi_trunk_testing/CI_ARCH/32/CI_EXCEPTIONS/OFF/CI_STD/c++2a/llvm-project/libcxx/include', '-I/var/folders/9t/lrs73ptj6lv644zvh1fk2_gc0000gn/T/tmp.uRw6ClIN/llvm-build/projects/libcxx/include/c++build', '-isysroot', '/Applications/Xcode.app/Contents/Developer/Platforms/MacOSX.platform/Developer/SDKs/MacOSX10.13.sdk', '-fno-exceptions', '-I/Users/buildslave/jenkins/libcxx_libcxxabi_trunk_testing/CI_ARCH/32/CI_EXCEPTIONS/OFF/CI_STD/c++2a/llvm-project/libcxx/test/support', '-DLIBCXX_FILESYSTEM_STATIC_TEST_ROOT="/Users/buildslave/jenkins/libcxx_libcxxabi_trunk_testing/CI_ARCH/32/CI_EXCEPTIONS/OFF/CI_STD/c++2a/llvm-project/libcxx/test/std/input.output/filesystems/Inputs/static_test_env"', '-DLIBCXX_FILESYSTEM_DYNAMIC_TEST_ROOT="/private/var/folders/9t/lrs73ptj6lv644zvh1fk2_gc0000gn/T/tmp.uRw6ClIN/llvm-build/projects/libcxx/test/filesystem/Output/dynamic_env"', '-DLIBCXX_FILESYSTEM_DYNAMIC_TEST_HELPER="/usr/local/opt/python@2/bin/python2.7 /Users/buildslave/jenkins/libcxx_libcxxabi_trunk_testing/CI_ARCH/32/CI_EXCEPTIONS/OFF/CI_STD/c++2a/llvm-project/libcxx/test/support/filesystem_dynamic_test_helper.py"', '-D_LIBCPP_HAS_NO_PRAGMA_SYSTEM_HEADER', '-Wall', '-Wextra', '-Werror', '-Wuser-defined-warnings', '-Wshadow', '-Wno-unused-command-line-argument', '-Wno-attributes', '-Wno-constant-evaluated', '-Wno-pessimizing-move', '-Wno-c++11-extensions', '-Wno-user-defined-literals', '-Wno-noexcept-type', '-Wsign-compare', '-Wunused-variable', '-Wunused-parameter', '-Wunreachable-code', '-c'] Exit Code: 1 Standard Error: -- clang version 10.0.0 (https://github.com/llvm/llvm-project.git acc79aa0e747b9777077e0a337e99540a52b94b2) Target: i386-apple-darwin17.5.0 Thread model: posix InstalledDir: /Users/buildslave/jenkins/libcxx_libcxxabi_trunk_testing/CI_ARCH/32/CI_EXCEPTIONS/OFF/CI_STD/c++2a/host-compiler/bin "/Users/buildslave/jenkins/libcxx_libcxxabi_trunk_testing/CI_ARCH/32/CI_EXCEPTIONS/OFF/CI_STD/c++2a/host-compiler/bin/clang-10" -cc1 -triple x86_64-apple-macosx10.13.0 -Wdeprecated-objc-isa-usage -Werror=deprecated-objc-isa-usage -emit-obj -mrelax-all -disable-free -main-file-name begin_end.pass.cpp -mrelocation-model pic -pic-level 2 -mthread-model posix -mframe-pointer=all -masm-verbose -munwind-tables -faligned-alloc-unavailable -target-cpu penryn -dwarf-column-info -debugger-tuning=lldb -target-linker-version 409.12 -v -nostdinc++ -resource-dir /Users/buildslave/jenkins/libcxx_libcxxabi_trunk_testing/CI_ARCH/32/CI_EXCEPTIONS/OFF/CI_STD/c++2a/host-compiler/lib/clang/10.0.0 -include /var/folders/9t/lrs73ptj6lv644zvh1fk2_gc0000gn/T/tmp.uRw6ClIN/llvm-build/projects/libcxx/__config_site -include /Users/buildslave/jenkins/libcxx_libcxxabi_trunk_testing/CI_ARCH/32/CI_EXCEPTIONS/OFF/CI_STD/c++2a/llvm-project/libcxx/test/support/nasty_macros.h -isysroot /Applications/Xcode.app/Contents/Developer/Platforms/MacOSX.platform/Developer/SDKs/MacOSX10.13.sdk -D _LIBCPP_DISABLE_AVAILABILITY -I /Users/buildslave/jenkins/libcxx_libcxxabi_trunk_testing/CI_ARCH/32/CI_EXCEPTIONS/OFF/CI_STD/c++2a/llvm-project/libcxx/include -I /var/folders/9t/lrs73ptj6lv644zvh1fk2_gc0000gn/T/tmp.uRw6ClIN/llvm-build/projects/libcxx/include/c++build -I /Users/buildslave/jenkins/libcxx_libcxxabi_trunk_testing/CI_ARCH/32/CI_EXCEPTIONS/OFF/CI_STD/c++2a/llvm-project/libcxx/test/support -D "LIBCXX_FILESYSTEM_STATIC_TEST_ROOT=\"/Users/buildslave/jenkins/libcxx_libcxxabi_trunk_testing/CI_ARCH/32/CI_EXCEPTIONS/OFF/CI_STD/c++2a/llvm-project/libcxx/test/std/input.output/filesystems/Inputs/static_test_env\"" -D "LIBCXX_FILESYSTEM_DYNAMIC_TEST_ROOT=\"/private/var/folders/9t/lrs73ptj6lv644zvh1fk2_gc0000gn/T/tmp.uRw6ClIN/llvm-build/projects/libcxx/test/filesystem/Output/dynamic_env\"" -D "LIBCXX_FILESYSTEM_DYNAMIC_TEST_HELPER=\"/usr/local/opt/python@2/bin/python2.7 /Users/buildslave/jenkins/libcxx_libcxxabi_trunk_testing/CI_ARCH/32/CI_EXCEPTIONS/OFF/CI_STD/c++2a/llvm-project/libcxx/test/support/filesystem_dynamic_test_helper.py\"" -D _LIBCPP_HAS_NO_PRAGMA_SYSTEM_HEADER -stdlib=libc++ -internal-isystem /Applications/Xcode.app/Contents/Developer/Platforms/MacOSX.platform/Developer/SDKs/MacOSX10.13.sdk/usr/local/include -internal-isystem /Users/buildslave/jenkins/libcxx_libcxxabi_trunk_testing/CI_ARCH/32/CI_EXCEPTIONS/OFF/CI_STD/c++2a/host-compiler/lib/clang/10.0.0/include -internal-externc-isystem /Applications/Xcode.app/Contents/Developer/Platforms/MacOSX.platform/Developer/SDKs/MacOSX10.13.sdk/usr/include -Werror=thread-safety -Wno-macro-redefined -Wall -Wextra -Werror -Wuser-defined-warnings -Wshadow -Wno-unused-command-line-argument -Wno-attributes -Wno-constant-evaluated -Wno-pessimizing-move -Wno-c++11-extensions -Wno-user-defined-literals -Wno-noexcept-type -Wsign-compare -Wunused-variable -Wunused-parameter -Wunreachable-code -std=c++2a -fdeprecated-macro -fdebug-compilation-dir /private/var/folders/9t/lrs73ptj6lv644zvh1fk2_gc0000gn/T/tmp.uRw6ClIN/llvm-build/projects/libcxx/test/std/input.output/filesystems/class.rec.dir.itr/rec.dir.itr.nonmembers -ftemplate-depth 270 -ferror-limit 19 -fmessage-length 0 -stack-protector 1 -fblocks -fencode-extended-block-signature -fregister-global-dtors-with-atexit -fgnuc-version=4.2.1 -fno-implicit-modules -fobjc-runtime=macosx-10.13.0 -fmax-type-align=16 -fdiagnostics-show-option -o /private/var/folders/9t/lrs73ptj6lv644zvh1fk2_gc0000gn/T/tmp.uRw6ClIN/llvm-build/projects/libcxx/test/std/input.output/filesystems/class.rec.dir.itr/rec.dir.itr.nonmembers/Output/begin_end.pass.cpp.o -x c++ /Users/buildslave/jenkins/libcxx_libcxxabi_trunk_testing/CI_ARCH/32/CI_EXCEPTIONS/OFF/CI_STD/c++2a/llvm-project/libcxx/test/std/input.output/filesystems/class.rec.dir.itr/rec.dir.itr.nonmembers/begin_end.pass.cpp clang -cc1 version 10.0.0 based upon LLVM 10.0.0git default target x86_64-apple-darwin17.5.0 ignoring nonexistent directory "/Applications/Xcode.app/Contents/Developer/Platforms/MacOSX.platform/Developer/SDKs/MacOSX10.13.sdk/usr/local/include" ignoring nonexistent directory "/Applications/Xcode.app/Contents/Developer/Platforms/MacOSX.platform/Developer/SDKs/MacOSX10.13.sdk/Library/Frameworks" #include "..." search starts here: #include <...> search starts here: /Users/buildslave/jenkins/libcxx_libcxxabi_trunk_testing/CI_ARCH/32/CI_EXCEPTIONS/OFF/CI_STD/c++2a/llvm-project/libcxx/include /var/folders/9t/lrs73ptj6lv644zvh1fk2_gc0000gn/T/tmp.uRw6ClIN/llvm-build/projects/libcxx/include/c++build /Users/buildslave/jenkins/libcxx_libcxxabi_trunk_testing/CI_ARCH/32/CI_EXCEPTIONS/OFF/CI_STD/c++2a/llvm-project/libcxx/test/support /Users/buildslave/jenkins/libcxx_libcxxabi_trunk_testing/CI_ARCH/32/CI_EXCEPTIONS/OFF/CI_STD/c++2a/host-compiler/lib/clang/10.0.0/include /Applications/Xcode.app/Contents/Developer/Platforms/MacOSX.platform/Developer/SDKs/MacOSX10.13.sdk/usr/include /Applications/Xcode.app/Contents/Developer/Platforms/MacOSX.platform/Developer/SDKs/MacOSX10.13.sdk/System/Library/Frameworks (framework directory) End of search list. In file included from /Users/buildslave/jenkins/libcxx_libcxxabi_trunk_testing/CI_ARCH/32/CI_EXCEPTIONS/OFF/CI_STD/c++2a/llvm-project/libcxx/test/std/input.output/filesystems/class.rec.dir.itr/rec.dir.itr.nonmembers/begin_end.pass.cpp:20: In file included from /Users/buildslave/jenkins/libcxx_libcxxabi_trunk_testing/CI_ARCH/32/CI_EXCEPTIONS/OFF/CI_STD/c++2a/llvm-project/libcxx/include/set:427: /Users/buildslave/jenkins/libcxx_libcxxabi_trunk_testing/CI_ARCH/32/CI_EXCEPTIONS/OFF/CI_STD/c++2a/llvm-project/libcxx/include/__tree:778:29: error: definition of implicit copy constructor for '__tree_node_destructor<std::__1::allocator<std::__1::__tree_node<std::__1::__fs::filesystem::path, void *> > >' is deprecated because it has a user-declared copy assignment operator [-Werror,-Wdeprecated-copy] __tree_node_destructor& operator=(const __tree_node_destructor&); ^ /Users/buildslave/jenkins/libcxx_libcxxabi_trunk_testing/CI_ARCH/32/CI_EXCEPTIONS/OFF/CI_STD/c++2a/llvm-project/libcxx/include/memory:2198:9: note: in implicit copy constructor for 'std::__1::__tree_node_destructor<std::__1::allocator<std::__1::__tree_node<std::__1::__fs::filesystem::path, void *> > >' first required here : __value_(_VSTD::forward<_Up>(__u)) ^ /Users/buildslave/jenkins/libcxx_libcxxabi_trunk_testing/CI_ARCH/32/CI_EXCEPTIONS/OFF/CI_STD/c++2a/llvm-project/libcxx/include/memory:2301:42: note: in instantiation of function template specialization 'std::__1::__compressed_pair_elem<std::__1::__tree_node_destructor<std::__1::allocator<std::__1::__tree_node<std::__1::__fs::filesystem::path, void *> > >, 1, false>::__compressed_pair_elem<std::__1::__tree_node_destructor<std::__1::allocator<std::__1::__tree_node<std::__1::__fs::filesystem::path, void *> > >, void>' requested here : _Base1(std::forward<_U1>(__t1)), _Base2(std::forward<_U2>(__t2)) {} ^ /Users/buildslave/jenkins/libcxx_libcxxabi_trunk_testing/CI_ARCH/32/CI_EXCEPTIONS/OFF/CI_STD/c++2a/llvm-project/libcxx/include/memory:2528:9: note: in instantiation of function template specialization 'std::__1::__compressed_pair<std::__1::__tree_node<std::__1::__fs::filesystem::path, void *> *, std::__1::__tree_node_destructor<std::__1::allocator<std::__1::__tree_node<std::__1::__fs::filesystem::path, void *> > > >::__compressed_pair<std::__1::__tree_node<std::__1::__fs::filesystem::path, void *> *&, std::__1::__tree_node_destructor<std::__1::allocator<std::__1::__tree_node<std::__1::__fs::filesystem::path, void *> > > >' requested here : __ptr_(__p, _VSTD::move(__d)) { ^ /Users/buildslave/jenkins/libcxx_libcxxabi_trunk_testing/CI_ARCH/32/CI_EXCEPTIONS/OFF/CI_STD/c++2a/llvm-project/libcxx/include/__tree:2190:19: note: in instantiation of function template specialization 'std::__1::unique_ptr<std::__1::__tree_node<std::__1::__fs::filesystem::path, void *>, std::__1::__tree_node_destructor<std::__1::allocator<std::__1::__tree_node<std::__1::__fs::filesystem::path, void *> > > >::unique_ptr<true, void>' requested here __node_holder __h(__node_traits::allocate(__na, 1), _Dp(__na)); ^ /Users/buildslave/jenkins/libcxx_libcxxabi_trunk_testing/CI_ARCH/32/CI_EXCEPTIONS/OFF/CI_STD/c++2a/llvm-project/libcxx/include/__tree:2169:29: note: in instantiation of function template specialization 'std::__1::__tree<std::__1::__fs::filesystem::path, std::__1::less<std::__1::__fs::filesystem::path>, std::__1::allocator<std::__1::__fs::filesystem::path> >::__construct_node<const std::__1::__fs::filesystem::path &>' requested here __node_holder __h = __construct_node(_VSTD::forward<_Args>(__args)...); ^ /Users/buildslave/jenkins/libcxx_libcxxabi_trunk_testing/CI_ARCH/32/CI_EXCEPTIONS/OFF/CI_STD/c++2a/llvm-project/libcxx/include/__tree:1271:16: note: in instantiation of function template specialization 'std::__1::__tree<std::__1::__fs::filesystem::path, std::__1::less<std::__1::__fs::filesystem::path>, std::__1::allocator<std::__1::__fs::filesystem::path> >::__emplace_hint_unique_key_args<std::__1::__fs::filesystem::path, const std::__1::__fs::filesystem::path &>' requested here return __emplace_hint_unique_key_args(__p, _NodeTypes::__get_key(__v), __v); ^ /Users/buildslave/jenkins/libcxx_libcxxabi_trunk_testing/CI_ARCH/32/CI_EXCEPTIONS/OFF/CI_STD/c++2a/llvm-project/libcxx/include/set:667:25: note: in instantiation of member function 'std::__1::__tree<std::__1::__fs::filesystem::path, std::__1::less<std::__1::__fs::filesystem::path>, std::__1::allocator<std::__1::__fs::filesystem::path> >::__insert_unique' requested here __tree_.__insert_unique(__e, *__f); ^ /Users/buildslave/jenkins/libcxx_libcxxabi_trunk_testing/CI_ARCH/32/CI_EXCEPTIONS/OFF/CI_STD/c++2a/llvm-project/libcxx/include/set:509:13: note: in instantiation of function template specialization 'std::__1::set<std::__1::__fs::filesystem::path, std::__1::less<std::__1::__fs::filesystem::path>, std::__1::allocator<std::__1::__fs::filesystem::path> >::insert<const std::__1::__fs::filesystem::path *>' requested here insert(__f, __l); ^ /Users/buildslave/jenkins/libcxx_libcxxabi_trunk_testing/CI_ARCH/32/CI_EXCEPTIONS/OFF/CI_STD/c++2a/llvm-project/libcxx/test/std/input.output/filesystems/class.rec.dir.itr/rec.dir.itr.nonmembers/begin_end.pass.cpp:46:20: note: in instantiation of function template specialization 'std::__1::set<std::__1::__fs::filesystem::path, std::__1::less<std::__1::__fs::filesystem::path>, std::__1::allocator<std::__1::__fs::filesystem::path> >::set<const std::__1::__fs::filesystem::path *>' requested here std::set<path> dir_contents(std::begin(StaticEnv::RecDirIterationList), ^ 1 error generated. --

Hide Details

Compilation failed unexpectedly! ******************** Testing: 0.. 10.. 20.. 30.. 40.. 50.. 60 FAIL: libc++ :: std/numerics/rand/rand.dis/rand.dist.samp/rand.dist.samp.pconst/copy.pass.cpp (4065 of 6368) ******************** TEST 'libc++ :: std/numerics/rand/rand.dis/rand.dist.samp/rand.dist.samp.pconst/copy.pass.cpp' FAILED ******************** Command: ['/Users/buildslave/jenkins/libcxx_libcxxabi_trunk_testing/CI_ARCH/32/CI_EXCEPTIONS/OFF/CI_STD/c++2a/host-compiler/bin/clang++', '-o', '/private/var/folders/9t/lrs73ptj6lv644zvh1fk2_gc0000gn/T/tmp.uRw6ClIN/llvm-build/projects/libcxx/test/std/numerics/rand/rand.dis/rand.dist.samp/rand.dist.samp.pconst/Output/copy.pass.cpp.o', '-x', 'c++', '/Users/buildslave/jenkins/libcxx_libcxxabi_trunk_testing/CI_ARCH/32/CI_EXCEPTIONS/OFF/CI_STD/c++2a/llvm-project/libcxx/test/std/numerics/rand/rand.dis/rand.dist.samp/rand.dist.samp.pconst/copy.pass.cpp', '-c', '-D_LIBCPP_DISABLE_AVAILABILITY', '-m32', '-v', '-arch', 'x86_64', '-mmacosx-version-min=10.13', '-ftemplate-depth=270', '-Werror=thread-safety', '-std=c++2a', '-Wno-macro-redefined', '-include', '/var/folders/9t/lrs73ptj6lv644zvh1fk2_gc0000gn/T/tmp.uRw6ClIN/llvm-build/projects/libcxx/__config_site', '-include', '/Users/buildslave/jenkins/libcxx_libcxxabi_trunk_testing/CI_ARCH/32/CI_EXCEPTIONS/OFF/CI_STD/c++2a/llvm-project/libcxx/test/support/nasty_macros.h', '-nostdinc++', '-I/Users/buildslave/jenkins/libcxx_libcxxabi_trunk_testing/CI_ARCH/32/CI_EXCEPTIONS/OFF/CI_STD/c++2a/llvm-project/libcxx/include', '-I/var/folders/9t/lrs73ptj6lv644zvh1fk2_gc0000gn/T/tmp.uRw6ClIN/llvm-build/projects/libcxx/include/c++build', '-isysroot', '/Applications/Xcode.app/Contents/Developer/Platforms/MacOSX.platform/Developer/SDKs/MacOSX10.13.sdk', '-fno-exceptions', '-I/Users/buildslave/jenkins/libcxx_libcxxabi_trunk_testing/CI_ARCH/32/CI_EXCEPTIONS/OFF/CI_STD/c++2a/llvm-project/libcxx/test/support', '-DLIBCXX_FILESYSTEM_STATIC_TEST_ROOT="/Users/buildslave/jenkins/libcxx_libcxxabi_trunk_testing/CI_ARCH/32/CI_EXCEPTIONS/OFF/CI_STD/c++2a/llvm-project/libcxx/test/std/input.output/filesystems/Inputs/static_test_env"', '-DLIBCXX_FILESYSTEM_DYNAMIC_TEST_ROOT="/private/var/folders/9t/lrs73ptj6lv644zvh1fk2_gc0000gn/T/tmp.uRw6ClIN/llvm-build/projects/libcxx/test/filesystem/Output/dynamic_env"', '-DLIBCXX_FILESYSTEM_DYNAMIC_TEST_HELPER="/usr/local/opt/python@2/bin/python2.7 /Users/buildslave/jenkins/libcxx_libcxxabi_trunk_testing/CI_ARCH/32/CI_EXCEPTIONS/OFF/CI_STD/c++2a/llvm-project/libcxx/test/support/filesystem_dynamic_test_helper.py"', '-D_LIBCPP_HAS_NO_PRAGMA_SYSTEM_HEADER', '-Wall', '-Wextra', '-Werror', '-Wuser-defined-warnings', '-Wshadow', '-Wno-unused-command-line-argument', '-Wno-attributes', '-Wno-constant-evaluated', '-Wno-pessimizing-move', '-Wno-c++11-extensions', '-Wno-user-defined-literals', '-Wno-noexcept-type', '-Wsign-compare', '-Wunused-variable', '-Wunused-parameter', '-Wunreachable-code', '-c'] Exit Code: 1 Standard Error: -- clang version 10.0.0 (https://github.com/llvm/llvm-project.git acc79aa0e747b9777077e0a337e99540a52b94b2) Target: i386-apple-darwin17.5.0 Thread model: posix InstalledDir: /Users/buildslave/jenkins/libcxx_libcxxabi_trunk_testing/CI_ARCH/32/CI_EXCEPTIONS/OFF/CI_STD/c++2a/host-compiler/bin "/Users/buildslave/jenkins/libcxx_libcxxabi_trunk_testing/CI_ARCH/32/CI_EXCEPTIONS/OFF/CI_STD/c++2a/host-compiler/bin/clang-10" -cc1 -triple x86_64-apple-macosx10.13.0 -Wdeprecated-objc-isa-usage -Werror=deprecated-objc-isa-usage -emit-obj -mrelax-all -disable-free -main-file-name copy.pass.cpp -mrelocation-model pic -pic-level 2 -mthread-model posix -mframe-pointer=all -masm-verbose -munwind-tables -faligned-alloc-unavailable -target-cpu penryn -dwarf-column-info -debugger-tuning=lldb -target-linker-version 409.12 -v -nostdinc++ -resource-dir /Users/buildslave/jenkins/libcxx_libcxxabi_trunk_testing/CI_ARCH/32/CI_EXCEPTIONS/OFF/CI_STD/c++2a/host-compiler/lib/clang/10.0.0 -include /var/folders/9t/lrs73ptj6lv644zvh1fk2_gc0000gn/T/tmp.uRw6ClIN/llvm-build/projects/libcxx/__config_site -include /Users/buildslave/jenkins/libcxx_libcxxabi_trunk_testing/CI_ARCH/32/CI_EXCEPTIONS/OFF/CI_STD/c++2a/llvm-project/libcxx/test/support/nasty_macros.h -isysroot /Applications/Xcode.app/Contents/Developer/Platforms/MacOSX.platform/Developer/SDKs/MacOSX10.13.sdk -D _LIBCPP_DISABLE_AVAILABILITY -I /Users/buildslave/jenkins/libcxx_libcxxabi_trunk_testing/CI_ARCH/32/CI_EXCEPTIONS/OFF/CI_STD/c++2a/llvm-project/libcxx/include -I /var/folders/9t/lrs73ptj6lv644zvh1fk2_gc0000gn/T/tmp.uRw6ClIN/llvm-build/projects/libcxx/include/c++build -I /Users/buildslave/jenkins/libcxx_libcxxabi_trunk_testing/CI_ARCH/32/CI_EXCEPTIONS/OFF/CI_STD/c++2a/llvm-project/libcxx/test/support -D "LIBCXX_FILESYSTEM_STATIC_TEST_ROOT=\"/Users/buildslave/jenkins/libcxx_libcxxabi_trunk_testing/CI_ARCH/32/CI_EXCEPTIONS/OFF/CI_STD/c++2a/llvm-project/libcxx/test/std/input.output/filesystems/Inputs/static_test_env\"" -D "LIBCXX_FILESYSTEM_DYNAMIC_TEST_ROOT=\"/private/var/folders/9t/lrs73ptj6lv644zvh1fk2_gc0000gn/T/tmp.uRw6ClIN/llvm-build/projects/libcxx/test/filesystem/Output/dynamic_env\"" -D "LIBCXX_FILESYSTEM_DYNAMIC_TEST_HELPER=\"/usr/local/opt/python@2/bin/python2.7 /Users/buildslave/jenkins/libcxx_libcxxabi_trunk_testing/CI_ARCH/32/CI_EXCEPTIONS/OFF/CI_STD/c++2a/llvm-project/libcxx/test/support/filesystem_dynamic_test_helper.py\"" -D _LIBCPP_HAS_NO_PRAGMA_SYSTEM_HEADER -stdlib=libc++ -internal-isystem /Applications/Xcode.app/Contents/Developer/Platforms/MacOSX.platform/Developer/SDKs/MacOSX10.13.sdk/usr/local/include -internal-isystem /Users/buildslave/jenkins/libcxx_libcxxabi_trunk_testing/CI_ARCH/32/CI_EXCEPTIONS/OFF/CI_STD/c++2a/host-compiler/lib/clang/10.0.0/include -internal-externc-isystem /Applications/Xcode.app/Contents/Developer/Platforms/MacOSX.platform/Developer/SDKs/MacOSX10.13.sdk/usr/include -Werror=thread-safety -Wno-macro-redefined -Wall -Wextra -Werror -Wuser-defined-warnings -Wshadow -Wno-unused-command-line-argument -Wno-attributes -Wno-constant-evaluated -Wno-pessimizing-move -Wno-c++11-extensions -Wno-user-defined-literals -Wno-noexcept-type -Wsign-compare -Wunused-variable -Wunused-parameter -Wunreachable-code -std=c++2a -fdeprecated-macro -fdebug-compilation-dir /private/var/folders/9t/lrs73ptj6lv644zvh1fk2_gc0000gn/T/tmp.uRw6ClIN/llvm-build/projects/libcxx/test/std/numerics/rand/rand.dis/rand.dist.samp/rand.dist.samp.pconst -ftemplate-depth 270 -ferror-limit 19 -fmessage-length 0 -stack-protector 1 -fblocks -fencode-extended-block-signature -fregister-global-dtors-with-atexit -fgnuc-version=4.2.1 -fno-implicit-modules -fobjc-runtime=macosx-10.13.0 -fmax-type-align=16 -fdiagnostics-show-option -o /private/var/folders/9t/lrs73ptj6lv644zvh1fk2_gc0000gn/T/tmp.uRw6ClIN/llvm-build/projects/libcxx/test/std/numerics/rand/rand.dis/rand.dist.samp/rand.dist.samp.pconst/Output/copy.pass.cpp.o -x c++ /Users/buildslave/jenkins/libcxx_libcxxabi_trunk_testing/CI_ARCH/32/CI_EXCEPTIONS/OFF/CI_STD/c++2a/llvm-project/libcxx/test/std/numerics/rand/rand.dis/rand.dist.samp/rand.dist.samp.pconst/copy.pass.cpp clang -cc1 version 10.0.0 based upon LLVM 10.0.0git default target x86_64-apple-darwin17.5.0 ignoring nonexistent directory "/Applications/Xcode.app/Contents/Developer/Platforms/MacOSX.platform/Developer/SDKs/MacOSX10.13.sdk/usr/local/include" ignoring nonexistent directory "/Applications/Xcode.app/Contents/Developer/Platforms/MacOSX.platform/Developer/SDKs/MacOSX10.13.sdk/Library/Frameworks" #include "..." search starts here: #include <...> search starts here: /Users/buildslave/jenkins/libcxx_libcxxabi_trunk_testing/CI_ARCH/32/CI_EXCEPTIONS/OFF/CI_STD/c++2a/llvm-project/libcxx/include /var/folders/9t/lrs73ptj6lv644zvh1fk2_gc0000gn/T/tmp.uRw6ClIN/llvm-build/projects/libcxx/include/c++build /Users/buildslave/jenkins/libcxx_libcxxabi_trunk_testing/CI_ARCH/32/CI_EXCEPTIONS/OFF/CI_STD/c++2a/llvm-project/libcxx/test/support /Users/buildslave/jenkins/libcxx_libcxxabi_trunk_testing/CI_ARCH/32/CI_EXCEPTIONS/OFF/CI_STD/c++2a/host-compiler/lib/clang/10.0.0/include /Applications/Xcode.app/Contents/Developer/Platforms/MacOSX.platform/Developer/SDKs/MacOSX10.13.sdk/usr/include /Applications/Xcode.app/Contents/Developer/Platforms/MacOSX.platform/Developer/SDKs/MacOSX10.13.sdk/System/Library/Frameworks (framework directory) End of search list. In file included from /Users/buildslave/jenkins/libcxx_libcxxabi_trunk_testing/CI_ARCH/32/CI_EXCEPTIONS/OFF/CI_STD/c++2a/llvm-project/libcxx/test/std/numerics/rand/rand.dis/rand.dist.samp/rand.dist.samp.pconst/copy.pass.cpp:16: /Users/buildslave/jenkins/libcxx_libcxxabi_trunk_testing/CI_ARCH/32/CI_EXCEPTIONS/OFF/CI_STD/c++2a/llvm-project/libcxx/include/random:6108:22: error: definition of implicit copy constructor for 'param_type' is deprecated because it has a user-declared copy assignment operator [-Werror,-Wdeprecated-copy] param_type & operator=(const param_type& __rhs); ^ /Users/buildslave/jenkins/libcxx_libcxxabi_trunk_testing/CI_ARCH/32/CI_EXCEPTIONS/OFF/CI_STD/c++2a/llvm-project/libcxx/include/random:6083:28: note: in implicit copy constructor for 'std::__1::piecewise_constant_distribution<double>::param_type' first required here class _LIBCPP_TEMPLATE_VIS piecewise_constant_distribution ^ /Users/buildslave/jenkins/libcxx_libcxxabi_trunk_testing/CI_ARCH/32/CI_EXCEPTIONS/OFF/CI_STD/c++2a/llvm-project/libcxx/test/std/numerics/rand/rand.dis/rand.dist.samp/rand.dist.samp.pconst/copy.pass.cpp:28:12: note: in implicit copy constructor for 'std::__1::piecewise_constant_distribution<double>' first required here D d2 = d1; ^ 1 error generated. --

Hide Details

Compilation failed unexpectedly! ******************** Testing: 0.. 10.. 20.. 30.. 40.. 50.. 60 FAIL: libc++ :: std/numerics/rand/rand.dis/rand.dist.samp/rand.dist.samp.pconst/ctor_param.pass.cpp (4071 of 6368) ******************** TEST 'libc++ :: std/numerics/rand/rand.dis/rand.dist.samp/rand.dist.samp.pconst/ctor_param.pass.cpp' FAILED ******************** Command: ['/Users/buildslave/jenkins/libcxx_libcxxabi_trunk_testing/CI_ARCH/32/CI_EXCEPTIONS/OFF/CI_STD/c++2a/host-compiler/bin/clang++', '-o', '/private/var/folders/9t/lrs73ptj6lv644zvh1fk2_gc0000gn/T/tmp.uRw6ClIN/llvm-build/projects/libcxx/test/std/numerics/rand/rand.dis/rand.dist.samp/rand.dist.samp.pconst/Output/ctor_param.pass.cpp.o', '-x', 'c++', '/Users/buildslave/jenkins/libcxx_libcxxabi_trunk_testing/CI_ARCH/32/CI_EXCEPTIONS/OFF/CI_STD/c++2a/llvm-project/libcxx/test/std/numerics/rand/rand.dis/rand.dist.samp/rand.dist.samp.pconst/ctor_param.pass.cpp', '-c', '-D_LIBCPP_DISABLE_AVAILABILITY', '-m32', '-v', '-arch', 'x86_64', '-mmacosx-version-min=10.13', '-ftemplate-depth=270', '-Werror=thread-safety', '-std=c++2a', '-Wno-macro-redefined', '-include', '/var/folders/9t/lrs73ptj6lv644zvh1fk2_gc0000gn/T/tmp.uRw6ClIN/llvm-build/projects/libcxx/__config_site', '-include', '/Users/buildslave/jenkins/libcxx_libcxxabi_trunk_testing/CI_ARCH/32/CI_EXCEPTIONS/OFF/CI_STD/c++2a/llvm-project/libcxx/test/support/nasty_macros.h', '-nostdinc++', '-I/Users/buildslave/jenkins/libcxx_libcxxabi_trunk_testing/CI_ARCH/32/CI_EXCEPTIONS/OFF/CI_STD/c++2a/llvm-project/libcxx/include', '-I/var/folders/9t/lrs73ptj6lv644zvh1fk2_gc0000gn/T/tmp.uRw6ClIN/llvm-build/projects/libcxx/include/c++build', '-isysroot', '/Applications/Xcode.app/Contents/Developer/Platforms/MacOSX.platform/Developer/SDKs/MacOSX10.13.sdk', '-fno-exceptions', '-I/Users/buildslave/jenkins/libcxx_libcxxabi_trunk_testing/CI_ARCH/32/CI_EXCEPTIONS/OFF/CI_STD/c++2a/llvm-project/libcxx/test/support', '-DLIBCXX_FILESYSTEM_STATIC_TEST_ROOT="/Users/buildslave/jenkins/libcxx_libcxxabi_trunk_testing/CI_ARCH/32/CI_EXCEPTIONS/OFF/CI_STD/c++2a/llvm-project/libcxx/test/std/input.output/filesystems/Inputs/static_test_env"', '-DLIBCXX_FILESYSTEM_DYNAMIC_TEST_ROOT="/private/var/folders/9t/lrs73ptj6lv644zvh1fk2_gc0000gn/T/tmp.uRw6ClIN/llvm-build/projects/libcxx/test/filesystem/Output/dynamic_env"', '-DLIBCXX_FILESYSTEM_DYNAMIC_TEST_HELPER="/usr/local/opt/python@2/bin/python2.7 /Users/buildslave/jenkins/libcxx_libcxxabi_trunk_testing/CI_ARCH/32/CI_EXCEPTIONS/OFF/CI_STD/c++2a/llvm-project/libcxx/test/support/filesystem_dynamic_test_helper.py"', '-D_LIBCPP_HAS_NO_PRAGMA_SYSTEM_HEADER', '-Wall', '-Wextra', '-Werror', '-Wuser-defined-warnings', '-Wshadow', '-Wno-unused-command-line-argument', '-Wno-attributes', '-Wno-constant-evaluated', '-Wno-pessimizing-move', '-Wno-c++11-extensions', '-Wno-user-defined-literals', '-Wno-noexcept-type', '-Wsign-compare', '-Wunused-variable', '-Wunused-parameter', '-Wunreachable-code', '-c'] Exit Code: 1 Standard Error: -- clang version 10.0.0 (https://github.com/llvm/llvm-project.git acc79aa0e747b9777077e0a337e99540a52b94b2) Target: i386-apple-darwin17.5.0 Thread model: posix InstalledDir: /Users/buildslave/jenkins/libcxx_libcxxabi_trunk_testing/CI_ARCH/32/CI_EXCEPTIONS/OFF/CI_STD/c++2a/host-compiler/bin "/Users/buildslave/jenkins/libcxx_libcxxabi_trunk_testing/CI_ARCH/32/CI_EXCEPTIONS/OFF/CI_STD/c++2a/host-compiler/bin/clang-10" -cc1 -triple x86_64-apple-macosx10.13.0 -Wdeprecated-objc-isa-usage -Werror=deprecated-objc-isa-usage -emit-obj -mrelax-all -disable-free -main-file-name ctor_param.pass.cpp -mrelocation-model pic -pic-level 2 -mthread-model posix -mframe-pointer=all -masm-verbose -munwind-tables -faligned-alloc-unavailable -target-cpu penryn -dwarf-column-info -debugger-tuning=lldb -target-linker-version 409.12 -v -nostdinc++ -resource-dir /Users/buildslave/jenkins/libcxx_libcxxabi_trunk_testing/CI_ARCH/32/CI_EXCEPTIONS/OFF/CI_STD/c++2a/host-compiler/lib/clang/10.0.0 -include /var/folders/9t/lrs73ptj6lv644zvh1fk2_gc0000gn/T/tmp.uRw6ClIN/llvm-build/projects/libcxx/__config_site -include /Users/buildslave/jenkins/libcxx_libcxxabi_trunk_testing/CI_ARCH/32/CI_EXCEPTIONS/OFF/CI_STD/c++2a/llvm-project/libcxx/test/support/nasty_macros.h -isysroot /Applications/Xcode.app/Contents/Developer/Platforms/MacOSX.platform/Developer/SDKs/MacOSX10.13.sdk -D _LIBCPP_DISABLE_AVAILABILITY -I /Users/buildslave/jenkins/libcxx_libcxxabi_trunk_testing/CI_ARCH/32/CI_EXCEPTIONS/OFF/CI_STD/c++2a/llvm-project/libcxx/include -I /var/folders/9t/lrs73ptj6lv644zvh1fk2_gc0000gn/T/tmp.uRw6ClIN/llvm-build/projects/libcxx/include/c++build -I /Users/buildslave/jenkins/libcxx_libcxxabi_trunk_testing/CI_ARCH/32/CI_EXCEPTIONS/OFF/CI_STD/c++2a/llvm-project/libcxx/test/support -D "LIBCXX_FILESYSTEM_STATIC_TEST_ROOT=\"/Users/buildslave/jenkins/libcxx_libcxxabi_trunk_testing/CI_ARCH/32/CI_EXCEPTIONS/OFF/CI_STD/c++2a/llvm-project/libcxx/test/std/input.output/filesystems/Inputs/static_test_env\"" -D "LIBCXX_FILESYSTEM_DYNAMIC_TEST_ROOT=\"/private/var/folders/9t/lrs73ptj6lv644zvh1fk2_gc0000gn/T/tmp.uRw6ClIN/llvm-build/projects/libcxx/test/filesystem/Output/dynamic_env\"" -D "LIBCXX_FILESYSTEM_DYNAMIC_TEST_HELPER=\"/usr/local/opt/python@2/bin/python2.7 /Users/buildslave/jenkins/libcxx_libcxxabi_trunk_testing/CI_ARCH/32/CI_EXCEPTIONS/OFF/CI_STD/c++2a/llvm-project/libcxx/test/support/filesystem_dynamic_test_helper.py\"" -D _LIBCPP_HAS_NO_PRAGMA_SYSTEM_HEADER -stdlib=libc++ -internal-isystem /Applications/Xcode.app/Contents/Developer/Platforms/MacOSX.platform/Developer/SDKs/MacOSX10.13.sdk/usr/local/include -internal-isystem /Users/buildslave/jenkins/libcxx_libcxxabi_trunk_testing/CI_ARCH/32/CI_EXCEPTIONS/OFF/CI_STD/c++2a/host-compiler/lib/clang/10.0.0/include -internal-externc-isystem /Applications/Xcode.app/Contents/Developer/Platforms/MacOSX.platform/Developer/SDKs/MacOSX10.13.sdk/usr/include -Werror=thread-safety -Wno-macro-redefined -Wall -Wextra -Werror -Wuser-defined-warnings -Wshadow -Wno-unused-command-line-argument -Wno-attributes -Wno-constant-evaluated -Wno-pessimizing-move -Wno-c++11-extensions -Wno-user-defined-literals -Wno-noexcept-type -Wsign-compare -Wunused-variable -Wunused-parameter -Wunreachable-code -std=c++2a -fdeprecated-macro -fdebug-compilation-dir /private/var/folders/9t/lrs73ptj6lv644zvh1fk2_gc0000gn/T/tmp.uRw6ClIN/llvm-build/projects/libcxx/test/std/numerics/rand/rand.dis/rand.dist.samp/rand.dist.samp.pconst -ftemplate-depth 270 -ferror-limit 19 -fmessage-length 0 -stack-protector 1 -fblocks -fencode-extended-block-signature -fregister-global-dtors-with-atexit -fgnuc-version=4.2.1 -fno-implicit-modules -fobjc-runtime=macosx-10.13.0 -fmax-type-align=16 -fdiagnostics-show-option -o /private/var/folders/9t/lrs73ptj6lv644zvh1fk2_gc0000gn/T/tmp.uRw6ClIN/llvm-build/projects/libcxx/test/std/numerics/rand/rand.dis/rand.dist.samp/rand.dist.samp.pconst/Output/ctor_param.pass.cpp.o -x c++ /Users/buildslave/jenkins/libcxx_libcxxabi_trunk_testing/CI_ARCH/32/CI_EXCEPTIONS/OFF/CI_STD/c++2a/llvm-project/libcxx/test/std/numerics/rand/rand.dis/rand.dist.samp/rand.dist.samp.pconst/ctor_param.pass.cpp clang -cc1 version 10.0.0 based upon LLVM 10.0.0git default target x86_64-apple-darwin17.5.0 ignoring nonexistent directory "/Applications/Xcode.app/Contents/Developer/Platforms/MacOSX.platform/Developer/SDKs/MacOSX10.13.sdk/usr/local/include" ignoring nonexistent directory "/Applications/Xcode.app/Contents/Developer/Platforms/MacOSX.platform/Developer/SDKs/MacOSX10.13.sdk/Library/Frameworks" #include "..." search starts here: #include <...> search starts here: /Users/buildslave/jenkins/libcxx_libcxxabi_trunk_testing/CI_ARCH/32/CI_EXCEPTIONS/OFF/CI_STD/c++2a/llvm-project/libcxx/include /var/folders/9t/lrs73ptj6lv644zvh1fk2_gc0000gn/T/tmp.uRw6ClIN/llvm-build/projects/libcxx/include/c++build /Users/buildslave/jenkins/libcxx_libcxxabi_trunk_testing/CI_ARCH/32/CI_EXCEPTIONS/OFF/CI_STD/c++2a/llvm-project/libcxx/test/support /Users/buildslave/jenkins/libcxx_libcxxabi_trunk_testing/CI_ARCH/32/CI_EXCEPTIONS/OFF/CI_STD/c++2a/host-compiler/lib/clang/10.0.0/include /Applications/Xcode.app/Contents/Developer/Platforms/MacOSX.platform/Developer/SDKs/MacOSX10.13.sdk/usr/include /Applications/Xcode.app/Contents/Developer/Platforms/MacOSX.platform/Developer/SDKs/MacOSX10.13.sdk/System/Library/Frameworks (framework directory) End of search list. In file included from /Users/buildslave/jenkins/libcxx_libcxxabi_trunk_testing/CI_ARCH/32/CI_EXCEPTIONS/OFF/CI_STD/c++2a/llvm-project/libcxx/test/std/numerics/rand/rand.dis/rand.dist.samp/rand.dist.samp.pconst/ctor_param.pass.cpp:16: /Users/buildslave/jenkins/libcxx_libcxxabi_trunk_testing/CI_ARCH/32/CI_EXCEPTIONS/OFF/CI_STD/c++2a/llvm-project/libcxx/include/random:6108:22: error: definition of implicit copy constructor for 'param_type' is deprecated because it has a user-declared copy assignment operator [-Werror,-Wdeprecated-copy] param_type & operator=(const param_type& __rhs); ^ /Users/buildslave/jenkins/libcxx_libcxxabi_trunk_testing/CI_ARCH/32/CI_EXCEPTIONS/OFF/CI_STD/c++2a/llvm-project/libcxx/include/random:6170:11: note: in implicit copy constructor for 'std::__1::piecewise_constant_distribution<double>::param_type' first required here : __p_(__p) {} ^ /Users/buildslave/jenkins/libcxx_libcxxabi_trunk_testing/CI_ARCH/32/CI_EXCEPTIONS/OFF/CI_STD/c++2a/llvm-project/libcxx/test/std/numerics/rand/rand.dis/rand.dist.samp/rand.dist.samp.pconst/ctor_param.pass.cpp:29:11: note: in instantiation of member function 'std::__1::piecewise_constant_distribution<double>::piecewise_constant_distribution' requested here D d(pa); ^ 1 error generated. --

Hide Details

Compilation failed unexpectedly! ******************** Testing: 0.. 10.. 20.. 30.. 40.. 50.. 60 FAIL: libc++ :: std/numerics/rand/rand.dis/rand.dist.samp/rand.dist.samp.pconst/get_param.pass.cpp (4073 of 6368) ******************** TEST 'libc++ :: std/numerics/rand/rand.dis/rand.dist.samp/rand.dist.samp.pconst/get_param.pass.cpp' FAILED ******************** Command: ['/Users/buildslave/jenkins/libcxx_libcxxabi_trunk_testing/CI_ARCH/32/CI_EXCEPTIONS/OFF/CI_STD/c++2a/host-compiler/bin/clang++', '-o', '/private/var/folders/9t/lrs73ptj6lv644zvh1fk2_gc0000gn/T/tmp.uRw6ClIN/llvm-build/projects/libcxx/test/std/numerics/rand/rand.dis/rand.dist.samp/rand.dist.samp.pconst/Output/get_param.pass.cpp.o', '-x', 'c++', '/Users/buildslave/jenkins/libcxx_libcxxabi_trunk_testing/CI_ARCH/32/CI_EXCEPTIONS/OFF/CI_STD/c++2a/llvm-project/libcxx/test/std/numerics/rand/rand.dis/rand.dist.samp/rand.dist.samp.pconst/get_param.pass.cpp', '-c', '-D_LIBCPP_DISABLE_AVAILABILITY', '-m32', '-v', '-arch', 'x86_64', '-mmacosx-version-min=10.13', '-ftemplate-depth=270', '-Werror=thread-safety', '-std=c++2a', '-Wno-macro-redefined', '-include', '/var/folders/9t/lrs73ptj6lv644zvh1fk2_gc0000gn/T/tmp.uRw6ClIN/llvm-build/projects/libcxx/__config_site', '-include', '/Users/buildslave/jenkins/libcxx_libcxxabi_trunk_testing/CI_ARCH/32/CI_EXCEPTIONS/OFF/CI_STD/c++2a/llvm-project/libcxx/test/support/nasty_macros.h', '-nostdinc++', '-I/Users/buildslave/jenkins/libcxx_libcxxabi_trunk_testing/CI_ARCH/32/CI_EXCEPTIONS/OFF/CI_STD/c++2a/llvm-project/libcxx/include', '-I/var/folders/9t/lrs73ptj6lv644zvh1fk2_gc0000gn/T/tmp.uRw6ClIN/llvm-build/projects/libcxx/include/c++build', '-isysroot', '/Applications/Xcode.app/Contents/Developer/Platforms/MacOSX.platform/Developer/SDKs/MacOSX10.13.sdk', '-fno-exceptions', '-I/Users/buildslave/jenkins/libcxx_libcxxabi_trunk_testing/CI_ARCH/32/CI_EXCEPTIONS/OFF/CI_STD/c++2a/llvm-project/libcxx/test/support', '-DLIBCXX_FILESYSTEM_STATIC_TEST_ROOT="/Users/buildslave/jenkins/libcxx_libcxxabi_trunk_testing/CI_ARCH/32/CI_EXCEPTIONS/OFF/CI_STD/c++2a/llvm-project/libcxx/test/std/input.output/filesystems/Inputs/static_test_env"', '-DLIBCXX_FILESYSTEM_DYNAMIC_TEST_ROOT="/private/var/folders/9t/lrs73ptj6lv644zvh1fk2_gc0000gn/T/tmp.uRw6ClIN/llvm-build/projects/libcxx/test/filesystem/Output/dynamic_env"', '-DLIBCXX_FILESYSTEM_DYNAMIC_TEST_HELPER="/usr/local/opt/python@2/bin/python2.7 /Users/buildslave/jenkins/libcxx_libcxxabi_trunk_testing/CI_ARCH/32/CI_EXCEPTIONS/OFF/CI_STD/c++2a/llvm-project/libcxx/test/support/filesystem_dynamic_test_helper.py"', '-D_LIBCPP_HAS_NO_PRAGMA_SYSTEM_HEADER', '-Wall', '-Wextra', '-Werror', '-Wuser-defined-warnings', '-Wshadow', '-Wno-unused-command-line-argument', '-Wno-attributes', '-Wno-constant-evaluated', '-Wno-pessimizing-move', '-Wno-c++11-extensions', '-Wno-user-defined-literals', '-Wno-noexcept-type', '-Wsign-compare', '-Wunused-variable', '-Wunused-parameter', '-Wunreachable-code', '-c'] Exit Code: 1 Standard Error: -- clang version 10.0.0 (https://github.com/llvm/llvm-project.git acc79aa0e747b9777077e0a337e99540a52b94b2) Target: i386-apple-darwin17.5.0 Thread model: posix InstalledDir: /Users/buildslave/jenkins/libcxx_libcxxabi_trunk_testing/CI_ARCH/32/CI_EXCEPTIONS/OFF/CI_STD/c++2a/host-compiler/bin "/Users/buildslave/jenkins/libcxx_libcxxabi_trunk_testing/CI_ARCH/32/CI_EXCEPTIONS/OFF/CI_STD/c++2a/host-compiler/bin/clang-10" -cc1 -triple x86_64-apple-macosx10.13.0 -Wdeprecated-objc-isa-usage -Werror=deprecated-objc-isa-usage -emit-obj -mrelax-all -disable-free -main-file-name get_param.pass.cpp -mrelocation-model pic -pic-level 2 -mthread-model posix -mframe-pointer=all -masm-verbose -munwind-tables -faligned-alloc-unavailable -target-cpu penryn -dwarf-column-info -debugger-tuning=lldb -target-linker-version 409.12 -v -nostdinc++ -resource-dir /Users/buildslave/jenkins/libcxx_libcxxabi_trunk_testing/CI_ARCH/32/CI_EXCEPTIONS/OFF/CI_STD/c++2a/host-compiler/lib/clang/10.0.0 -include /var/folders/9t/lrs73ptj6lv644zvh1fk2_gc0000gn/T/tmp.uRw6ClIN/llvm-build/projects/libcxx/__config_site -include /Users/buildslave/jenkins/libcxx_libcxxabi_trunk_testing/CI_ARCH/32/CI_EXCEPTIONS/OFF/CI_STD/c++2a/llvm-project/libcxx/test/support/nasty_macros.h -isysroot /Applications/Xcode.app/Contents/Developer/Platforms/MacOSX.platform/Developer/SDKs/MacOSX10.13.sdk -D _LIBCPP_DISABLE_AVAILABILITY -I /Users/buildslave/jenkins/libcxx_libcxxabi_trunk_testing/CI_ARCH/32/CI_EXCEPTIONS/OFF/CI_STD/c++2a/llvm-project/libcxx/include -I /var/folders/9t/lrs73ptj6lv644zvh1fk2_gc0000gn/T/tmp.uRw6ClIN/llvm-build/projects/libcxx/include/c++build -I /Users/buildslave/jenkins/libcxx_libcxxabi_trunk_testing/CI_ARCH/32/CI_EXCEPTIONS/OFF/CI_STD/c++2a/llvm-project/libcxx/test/support -D "LIBCXX_FILESYSTEM_STATIC_TEST_ROOT=\"/Users/buildslave/jenkins/libcxx_libcxxabi_trunk_testing/CI_ARCH/32/CI_EXCEPTIONS/OFF/CI_STD/c++2a/llvm-project/libcxx/test/std/input.output/filesystems/Inputs/static_test_env\"" -D "LIBCXX_FILESYSTEM_DYNAMIC_TEST_ROOT=\"/private/var/folders/9t/lrs73ptj6lv644zvh1fk2_gc0000gn/T/tmp.uRw6ClIN/llvm-build/projects/libcxx/test/filesystem/Output/dynamic_env\"" -D "LIBCXX_FILESYSTEM_DYNAMIC_TEST_HELPER=\"/usr/local/opt/python@2/bin/python2.7 /Users/buildslave/jenkins/libcxx_libcxxabi_trunk_testing/CI_ARCH/32/CI_EXCEPTIONS/OFF/CI_STD/c++2a/llvm-project/libcxx/test/support/filesystem_dynamic_test_helper.py\"" -D _LIBCPP_HAS_NO_PRAGMA_SYSTEM_HEADER -stdlib=libc++ -internal-isystem /Applications/Xcode.app/Contents/Developer/Platforms/MacOSX.platform/Developer/SDKs/MacOSX10.13.sdk/usr/local/include -internal-isystem /Users/buildslave/jenkins/libcxx_libcxxabi_trunk_testing/CI_ARCH/32/CI_EXCEPTIONS/OFF/CI_STD/c++2a/host-compiler/lib/clang/10.0.0/include -internal-externc-isystem /Applications/Xcode.app/Contents/Developer/Platforms/MacOSX.platform/Developer/SDKs/MacOSX10.13.sdk/usr/include -Werror=thread-safety -Wno-macro-redefined -Wall -Wextra -Werror -Wuser-defined-warnings -Wshadow -Wno-unused-command-line-argument -Wno-attributes -Wno-constant-evaluated -Wno-pessimizing-move -Wno-c++11-extensions -Wno-user-defined-literals -Wno-noexcept-type -Wsign-compare -Wunused-variable -Wunused-parameter -Wunreachable-code -std=c++2a -fdeprecated-macro -fdebug-compilation-dir /private/var/folders/9t/lrs73ptj6lv644zvh1fk2_gc0000gn/T/tmp.uRw6ClIN/llvm-build/projects/libcxx/test/std/numerics/rand/rand.dis/rand.dist.samp/rand.dist.samp.pconst -ftemplate-depth 270 -ferror-limit 19 -fmessage-length 0 -stack-protector 1 -fblocks -fencode-extended-block-signature -fregister-global-dtors-with-atexit -fgnuc-version=4.2.1 -fno-implicit-modules -fobjc-runtime=macosx-10.13.0 -fmax-type-align=16 -fdiagnostics-show-option -o /private/var/folders/9t/lrs73ptj6lv644zvh1fk2_gc0000gn/T/tmp.uRw6ClIN/llvm-build/projects/libcxx/test/std/numerics/rand/rand.dis/rand.dist.samp/rand.dist.samp.pconst/Output/get_param.pass.cpp.o -x c++ /Users/buildslave/jenkins/libcxx_libcxxabi_trunk_testing/CI_ARCH/32/CI_EXCEPTIONS/OFF/CI_STD/c++2a/llvm-project/libcxx/test/std/numerics/rand/rand.dis/rand.dist.samp/rand.dist.samp.pconst/get_param.pass.cpp clang -cc1 version 10.0.0 based upon LLVM 10.0.0git default target x86_64-apple-darwin17.5.0 ignoring nonexistent directory "/Applications/Xcode.app/Contents/Developer/Platforms/MacOSX.platform/Developer/SDKs/MacOSX10.13.sdk/usr/local/include" ignoring nonexistent directory "/Applications/Xcode.app/Contents/Developer/Platforms/MacOSX.platform/Developer/SDKs/MacOSX10.13.sdk/Library/Frameworks" #include "..." search starts here: #include <...> search starts here: /Users/buildslave/jenkins/libcxx_libcxxabi_trunk_testing/CI_ARCH/32/CI_EXCEPTIONS/OFF/CI_STD/c++2a/llvm-project/libcxx/include /var/folders/9t/lrs73ptj6lv644zvh1fk2_gc0000gn/T/tmp.uRw6ClIN/llvm-build/projects/libcxx/include/c++build /Users/buildslave/jenkins/libcxx_libcxxabi_trunk_testing/CI_ARCH/32/CI_EXCEPTIONS/OFF/CI_STD/c++2a/llvm-project/libcxx/test/support /Users/buildslave/jenkins/libcxx_libcxxabi_trunk_testing/CI_ARCH/32/CI_EXCEPTIONS/OFF/CI_STD/c++2a/host-compiler/lib/clang/10.0.0/include /Applications/Xcode.app/Contents/Developer/Platforms/MacOSX.platform/Developer/SDKs/MacOSX10.13.sdk/usr/include /Applications/Xcode.app/Contents/Developer/Platforms/MacOSX.platform/Developer/SDKs/MacOSX10.13.sdk/System/Library/Frameworks (framework directory) End of search list. In file included from /Users/buildslave/jenkins/libcxx_libcxxabi_trunk_testing/CI_ARCH/32/CI_EXCEPTIONS/OFF/CI_STD/c++2a/llvm-project/libcxx/test/std/numerics/rand/rand.dis/rand.dist.samp/rand.dist.samp.pconst/get_param.pass.cpp:16: /Users/buildslave/jenkins/libcxx_libcxxabi_trunk_testing/CI_ARCH/32/CI_EXCEPTIONS/OFF/CI_STD/c++2a/llvm-project/libcxx/include/random:6108:22: error: definition of implicit copy constructor for 'param_type' is deprecated because it has a user-declared copy assignment operator [-Werror,-Wdeprecated-copy] param_type & operator=(const param_type& __rhs); ^ /Users/buildslave/jenkins/libcxx_libcxxabi_trunk_testing/CI_ARCH/32/CI_EXCEPTIONS/OFF/CI_STD/c++2a/llvm-project/libcxx/include/random:6170:11: note: in implicit copy constructor for 'std::__1::piecewise_constant_distribution<double>::param_type' first required here : __p_(__p) {} ^ /Users/buildslave/jenkins/libcxx_libcxxabi_trunk_testing/CI_ARCH/32/CI_EXCEPTIONS/OFF/CI_STD/c++2a/llvm-project/libcxx/test/std/numerics/rand/rand.dis/rand.dist.samp/rand.dist.samp.pconst/get_param.pass.cpp:30:11: note: in instantiation of member function 'std::__1::piecewise_constant_distribution<double>::piecewise_constant_distribution' requested here D d(pa); ^ 1 error generated. --

Hide Details

Compilation failed unexpectedly! ******************** Testing: 0.. 10.. 20.. 30.. 40.. 50.. 60 FAIL: libc++ :: std/numerics/rand/rand.dis/rand.dist.samp/rand.dist.samp.pconst/param_copy.pass.cpp (4079 of 6368) ******************** TEST 'libc++ :: std/numerics/rand/rand.dis/rand.dist.samp/rand.dist.samp.pconst/param_copy.pass.cpp' FAILED ******************** Command: ['/Users/buildslave/jenkins/libcxx_libcxxabi_trunk_testing/CI_ARCH/32/CI_EXCEPTIONS/OFF/CI_STD/c++2a/host-compiler/bin/clang++', '-o', '/private/var/folders/9t/lrs73ptj6lv644zvh1fk2_gc0000gn/T/tmp.uRw6ClIN/llvm-build/projects/libcxx/test/std/numerics/rand/rand.dis/rand.dist.samp/rand.dist.samp.pconst/Output/param_copy.pass.cpp.o', '-x', 'c++', '/Users/buildslave/jenkins/libcxx_libcxxabi_trunk_testing/CI_ARCH/32/CI_EXCEPTIONS/OFF/CI_STD/c++2a/llvm-project/libcxx/test/std/numerics/rand/rand.dis/rand.dist.samp/rand.dist.samp.pconst/param_copy.pass.cpp', '-c', '-D_LIBCPP_DISABLE_AVAILABILITY', '-m32', '-v', '-arch', 'x86_64', '-mmacosx-version-min=10.13', '-ftemplate-depth=270', '-Werror=thread-safety', '-std=c++2a', '-Wno-macro-redefined', '-include', '/var/folders/9t/lrs73ptj6lv644zvh1fk2_gc0000gn/T/tmp.uRw6ClIN/llvm-build/projects/libcxx/__config_site', '-include', '/Users/buildslave/jenkins/libcxx_libcxxabi_trunk_testing/CI_ARCH/32/CI_EXCEPTIONS/OFF/CI_STD/c++2a/llvm-project/libcxx/test/support/nasty_macros.h', '-nostdinc++', '-I/Users/buildslave/jenkins/libcxx_libcxxabi_trunk_testing/CI_ARCH/32/CI_EXCEPTIONS/OFF/CI_STD/c++2a/llvm-project/libcxx/include', '-I/var/folders/9t/lrs73ptj6lv644zvh1fk2_gc0000gn/T/tmp.uRw6ClIN/llvm-build/projects/libcxx/include/c++build', '-isysroot', '/Applications/Xcode.app/Contents/Developer/Platforms/MacOSX.platform/Developer/SDKs/MacOSX10.13.sdk', '-fno-exceptions', '-I/Users/buildslave/jenkins/libcxx_libcxxabi_trunk_testing/CI_ARCH/32/CI_EXCEPTIONS/OFF/CI_STD/c++2a/llvm-project/libcxx/test/support', '-DLIBCXX_FILESYSTEM_STATIC_TEST_ROOT="/Users/buildslave/jenkins/libcxx_libcxxabi_trunk_testing/CI_ARCH/32/CI_EXCEPTIONS/OFF/CI_STD/c++2a/llvm-project/libcxx/test/std/input.output/filesystems/Inputs/static_test_env"', '-DLIBCXX_FILESYSTEM_DYNAMIC_TEST_ROOT="/private/var/folders/9t/lrs73ptj6lv644zvh1fk2_gc0000gn/T/tmp.uRw6ClIN/llvm-build/projects/libcxx/test/filesystem/Output/dynamic_env"', '-DLIBCXX_FILESYSTEM_DYNAMIC_TEST_HELPER="/usr/local/opt/python@2/bin/python2.7 /Users/buildslave/jenkins/libcxx_libcxxabi_trunk_testing/CI_ARCH/32/CI_EXCEPTIONS/OFF/CI_STD/c++2a/llvm-project/libcxx/test/support/filesystem_dynamic_test_helper.py"', '-D_LIBCPP_HAS_NO_PRAGMA_SYSTEM_HEADER', '-Wall', '-Wextra', '-Werror', '-Wuser-defined-warnings', '-Wshadow', '-Wno-unused-command-line-argument', '-Wno-attributes', '-Wno-constant-evaluated', '-Wno-pessimizing-move', '-Wno-c++11-extensions', '-Wno-user-defined-literals', '-Wno-noexcept-type', '-Wsign-compare', '-Wunused-variable', '-Wunused-parameter', '-Wunreachable-code', '-c'] Exit Code: 1 Standard Error: -- clang version 10.0.0 (https://github.com/llvm/llvm-project.git acc79aa0e747b9777077e0a337e99540a52b94b2) Target: i386-apple-darwin17.5.0 Thread model: posix InstalledDir: /Users/buildslave/jenkins/libcxx_libcxxabi_trunk_testing/CI_ARCH/32/CI_EXCEPTIONS/OFF/CI_STD/c++2a/host-compiler/bin "/Users/buildslave/jenkins/libcxx_libcxxabi_trunk_testing/CI_ARCH/32/CI_EXCEPTIONS/OFF/CI_STD/c++2a/host-compiler/bin/clang-10" -cc1 -triple x86_64-apple-macosx10.13.0 -Wdeprecated-objc-isa-usage -Werror=deprecated-objc-isa-usage -emit-obj -mrelax-all -disable-free -main-file-name param_copy.pass.cpp -mrelocation-model pic -pic-level 2 -mthread-model posix -mframe-pointer=all -masm-verbose -munwind-tables -faligned-alloc-unavailable -target-cpu penryn -dwarf-column-info -debugger-tuning=lldb -target-linker-version 409.12 -v -nostdinc++ -resource-dir /Users/buildslave/jenkins/libcxx_libcxxabi_trunk_testing/CI_ARCH/32/CI_EXCEPTIONS/OFF/CI_STD/c++2a/host-compiler/lib/clang/10.0.0 -include /var/folders/9t/lrs73ptj6lv644zvh1fk2_gc0000gn/T/tmp.uRw6ClIN/llvm-build/projects/libcxx/__config_site -include /Users/buildslave/jenkins/libcxx_libcxxabi_trunk_testing/CI_ARCH/32/CI_EXCEPTIONS/OFF/CI_STD/c++2a/llvm-project/libcxx/test/support/nasty_macros.h -isysroot /Applications/Xcode.app/Contents/Developer/Platforms/MacOSX.platform/Developer/SDKs/MacOSX10.13.sdk -D _LIBCPP_DISABLE_AVAILABILITY -I /Users/buildslave/jenkins/libcxx_libcxxabi_trunk_testing/CI_ARCH/32/CI_EXCEPTIONS/OFF/CI_STD/c++2a/llvm-project/libcxx/include -I /var/folders/9t/lrs73ptj6lv644zvh1fk2_gc0000gn/T/tmp.uRw6ClIN/llvm-build/projects/libcxx/include/c++build -I /Users/buildslave/jenkins/libcxx_libcxxabi_trunk_testing/CI_ARCH/32/CI_EXCEPTIONS/OFF/CI_STD/c++2a/llvm-project/libcxx/test/support -D "LIBCXX_FILESYSTEM_STATIC_TEST_ROOT=\"/Users/buildslave/jenkins/libcxx_libcxxabi_trunk_testing/CI_ARCH/32/CI_EXCEPTIONS/OFF/CI_STD/c++2a/llvm-project/libcxx/test/std/input.output/filesystems/Inputs/static_test_env\"" -D "LIBCXX_FILESYSTEM_DYNAMIC_TEST_ROOT=\"/private/var/folders/9t/lrs73ptj6lv644zvh1fk2_gc0000gn/T/tmp.uRw6ClIN/llvm-build/projects/libcxx/test/filesystem/Output/dynamic_env\"" -D "LIBCXX_FILESYSTEM_DYNAMIC_TEST_HELPER=\"/usr/local/opt/python@2/bin/python2.7 /Users/buildslave/jenkins/libcxx_libcxxabi_trunk_testing/CI_ARCH/32/CI_EXCEPTIONS/OFF/CI_STD/c++2a/llvm-project/libcxx/test/support/filesystem_dynamic_test_helper.py\"" -D _LIBCPP_HAS_NO_PRAGMA_SYSTEM_HEADER -stdlib=libc++ -internal-isystem /Applications/Xcode.app/Contents/Developer/Platforms/MacOSX.platform/Developer/SDKs/MacOSX10.13.sdk/usr/local/include -internal-isystem /Users/buildslave/jenkins/libcxx_libcxxabi_trunk_testing/CI_ARCH/32/CI_EXCEPTIONS/OFF/CI_STD/c++2a/host-compiler/lib/clang/10.0.0/include -internal-externc-isystem /Applications/Xcode.app/Contents/Developer/Platforms/MacOSX.platform/Developer/SDKs/MacOSX10.13.sdk/usr/include -Werror=thread-safety -Wno-macro-redefined -Wall -Wextra -Werror -Wuser-defined-warnings -Wshadow -Wno-unused-command-line-argument -Wno-attributes -Wno-constant-evaluated -Wno-pessimizing-move -Wno-c++11-extensions -Wno-user-defined-literals -Wno-noexcept-type -Wsign-compare -Wunused-variable -Wunused-parameter -Wunreachable-code -std=c++2a -fdeprecated-macro -fdebug-compilation-dir /private/var/folders/9t/lrs73ptj6lv644zvh1fk2_gc0000gn/T/tmp.uRw6ClIN/llvm-build/projects/libcxx/test/std/numerics/rand/rand.dis/rand.dist.samp/rand.dist.samp.pconst -ftemplate-depth 270 -ferror-limit 19 -fmessage-length 0 -stack-protector 1 -fblocks -fencode-extended-block-signature -fregister-global-dtors-with-atexit -fgnuc-version=4.2.1 -fno-implicit-modules -fobjc-runtime=macosx-10.13.0 -fmax-type-align=16 -fdiagnostics-show-option -o /private/var/folders/9t/lrs73ptj6lv644zvh1fk2_gc0000gn/T/tmp.uRw6ClIN/llvm-build/projects/libcxx/test/std/numerics/rand/rand.dis/rand.dist.samp/rand.dist.samp.pconst/Output/param_copy.pass.cpp.o -x c++ /Users/buildslave/jenkins/libcxx_libcxxabi_trunk_testing/CI_ARCH/32/CI_EXCEPTIONS/OFF/CI_STD/c++2a/llvm-project/libcxx/test/std/numerics/rand/rand.dis/rand.dist.samp/rand.dist.samp.pconst/param_copy.pass.cpp clang -cc1 version 10.0.0 based upon LLVM 10.0.0git default target x86_64-apple-darwin17.5.0 ignoring nonexistent directory "/Applications/Xcode.app/Contents/Developer/Platforms/MacOSX.platform/Developer/SDKs/MacOSX10.13.sdk/usr/local/include" ignoring nonexistent directory "/Applications/Xcode.app/Contents/Developer/Platforms/MacOSX.platform/Developer/SDKs/MacOSX10.13.sdk/Library/Frameworks" #include "..." search starts here: #include <...> search starts here: /Users/buildslave/jenkins/libcxx_libcxxabi_trunk_testing/CI_ARCH/32/CI_EXCEPTIONS/OFF/CI_STD/c++2a/llvm-project/libcxx/include /var/folders/9t/lrs73ptj6lv644zvh1fk2_gc0000gn/T/tmp.uRw6ClIN/llvm-build/projects/libcxx/include/c++build /Users/buildslave/jenkins/libcxx_libcxxabi_trunk_testing/CI_ARCH/32/CI_EXCEPTIONS/OFF/CI_STD/c++2a/llvm-project/libcxx/test/support /Users/buildslave/jenkins/libcxx_libcxxabi_trunk_testing/CI_ARCH/32/CI_EXCEPTIONS/OFF/CI_STD/c++2a/host-compiler/lib/clang/10.0.0/include /Applications/Xcode.app/Contents/Developer/Platforms/MacOSX.platform/Developer/SDKs/MacOSX10.13.sdk/usr/include /Applications/Xcode.app/Contents/Developer/Platforms/MacOSX.platform/Developer/SDKs/MacOSX10.13.sdk/System/Library/Frameworks (framework directory) End of search list. In file included from /Users/buildslave/jenkins/libcxx_libcxxabi_trunk_testing/CI_ARCH/32/CI_EXCEPTIONS/OFF/CI_STD/c++2a/llvm-project/libcxx/test/std/numerics/rand/rand.dis/rand.dist.samp/rand.dist.samp.pconst/param_copy.pass.cpp:16: /Users/buildslave/jenkins/libcxx_libcxxabi_trunk_testing/CI_ARCH/32/CI_EXCEPTIONS/OFF/CI_STD/c++2a/llvm-project/libcxx/include/random:6108:22: error: definition of implicit copy constructor for 'param_type' is deprecated because it has a user-declared copy assignment operator [-Werror,-Wdeprecated-copy] param_type & operator=(const param_type& __rhs); ^ /Users/buildslave/jenkins/libcxx_libcxxabi_trunk_testing/CI_ARCH/32/CI_EXCEPTIONS/OFF/CI_STD/c++2a/llvm-project/libcxx/test/std/numerics/rand/rand.dis/rand.dist.samp/rand.dist.samp.pconst/param_copy.pass.cpp:31:16: note: in implicit copy constructor for 'std::__1::piecewise_constant_distribution<double>::param_type' first required here P p1 = p0; ^ 1 error generated. --

Hide Details

Compilation failed unexpectedly! ******************** Testing: 0.. 10.. 20.. 30.. 40.. 50.. 60 FAIL: libc++ :: std/numerics/rand/rand.dis/rand.dist.samp/rand.dist.samp.pconst/set_param.pass.cpp (4086 of 6368) ******************** TEST 'libc++ :: std/numerics/rand/rand.dis/rand.dist.samp/rand.dist.samp.pconst/set_param.pass.cpp' FAILED ******************** Command: ['/Users/buildslave/jenkins/libcxx_libcxxabi_trunk_testing/CI_ARCH/32/CI_EXCEPTIONS/OFF/CI_STD/c++2a/host-compiler/bin/clang++', '-o', '/private/var/folders/9t/lrs73ptj6lv644zvh1fk2_gc0000gn/T/tmp.uRw6ClIN/llvm-build/projects/libcxx/test/std/numerics/rand/rand.dis/rand.dist.samp/rand.dist.samp.pconst/Output/set_param.pass.cpp.o', '-x', 'c++', '/Users/buildslave/jenkins/libcxx_libcxxabi_trunk_testing/CI_ARCH/32/CI_EXCEPTIONS/OFF/CI_STD/c++2a/llvm-project/libcxx/test/std/numerics/rand/rand.dis/rand.dist.samp/rand.dist.samp.pconst/set_param.pass.cpp', '-c', '-D_LIBCPP_DISABLE_AVAILABILITY', '-m32', '-v', '-arch', 'x86_64', '-mmacosx-version-min=10.13', '-ftemplate-depth=270', '-Werror=thread-safety', '-std=c++2a', '-Wno-macro-redefined', '-include', '/var/folders/9t/lrs73ptj6lv644zvh1fk2_gc0000gn/T/tmp.uRw6ClIN/llvm-build/projects/libcxx/__config_site', '-include', '/Users/buildslave/jenkins/libcxx_libcxxabi_trunk_testing/CI_ARCH/32/CI_EXCEPTIONS/OFF/CI_STD/c++2a/llvm-project/libcxx/test/support/nasty_macros.h', '-nostdinc++', '-I/Users/buildslave/jenkins/libcxx_libcxxabi_trunk_testing/CI_ARCH/32/CI_EXCEPTIONS/OFF/CI_STD/c++2a/llvm-project/libcxx/include', '-I/var/folders/9t/lrs73ptj6lv644zvh1fk2_gc0000gn/T/tmp.uRw6ClIN/llvm-build/projects/libcxx/include/c++build', '-isysroot', '/Applications/Xcode.app/Contents/Developer/Platforms/MacOSX.platform/Developer/SDKs/MacOSX10.13.sdk', '-fno-exceptions', '-I/Users/buildslave/jenkins/libcxx_libcxxabi_trunk_testing/CI_ARCH/32/CI_EXCEPTIONS/OFF/CI_STD/c++2a/llvm-project/libcxx/test/support', '-DLIBCXX_FILESYSTEM_STATIC_TEST_ROOT="/Users/buildslave/jenkins/libcxx_libcxxabi_trunk_testing/CI_ARCH/32/CI_EXCEPTIONS/OFF/CI_STD/c++2a/llvm-project/libcxx/test/std/input.output/filesystems/Inputs/static_test_env"', '-DLIBCXX_FILESYSTEM_DYNAMIC_TEST_ROOT="/private/var/folders/9t/lrs73ptj6lv644zvh1fk2_gc0000gn/T/tmp.uRw6ClIN/llvm-build/projects/libcxx/test/filesystem/Output/dynamic_env"', '-DLIBCXX_FILESYSTEM_DYNAMIC_TEST_HELPER="/usr/local/opt/python@2/bin/python2.7 /Users/buildslave/jenkins/libcxx_libcxxabi_trunk_testing/CI_ARCH/32/CI_EXCEPTIONS/OFF/CI_STD/c++2a/llvm-project/libcxx/test/support/filesystem_dynamic_test_helper.py"', '-D_LIBCPP_HAS_NO_PRAGMA_SYSTEM_HEADER', '-Wall', '-Wextra', '-Werror', '-Wuser-defined-warnings', '-Wshadow', '-Wno-unused-command-line-argument', '-Wno-attributes', '-Wno-constant-evaluated', '-Wno-pessimizing-move', '-Wno-c++11-extensions', '-Wno-user-defined-literals', '-Wno-noexcept-type', '-Wsign-compare', '-Wunused-variable', '-Wunused-parameter', '-Wunreachable-code', '-c'] Exit Code: 1 Standard Error: -- clang version 10.0.0 (https://github.com/llvm/llvm-project.git acc79aa0e747b9777077e0a337e99540a52b94b2) Target: i386-apple-darwin17.5.0 Thread model: posix InstalledDir: /Users/buildslave/jenkins/libcxx_libcxxabi_trunk_testing/CI_ARCH/32/CI_EXCEPTIONS/OFF/CI_STD/c++2a/host-compiler/bin "/Users/buildslave/jenkins/libcxx_libcxxabi_trunk_testing/CI_ARCH/32/CI_EXCEPTIONS/OFF/CI_STD/c++2a/host-compiler/bin/clang-10" -cc1 -triple x86_64-apple-macosx10.13.0 -Wdeprecated-objc-isa-usage -Werror=deprecated-objc-isa-usage -emit-obj -mrelax-all -disable-free -main-file-name set_param.pass.cpp -mrelocation-model pic -pic-level 2 -mthread-model posix -mframe-pointer=all -masm-verbose -munwind-tables -faligned-alloc-unavailable -target-cpu penryn -dwarf-column-info -debugger-tuning=lldb -target-linker-version 409.12 -v -nostdinc++ -resource-dir /Users/buildslave/jenkins/libcxx_libcxxabi_trunk_testing/CI_ARCH/32/CI_EXCEPTIONS/OFF/CI_STD/c++2a/host-compiler/lib/clang/10.0.0 -include /var/folders/9t/lrs73ptj6lv644zvh1fk2_gc0000gn/T/tmp.uRw6ClIN/llvm-build/projects/libcxx/__config_site -include /Users/buildslave/jenkins/libcxx_libcxxabi_trunk_testing/CI_ARCH/32/CI_EXCEPTIONS/OFF/CI_STD/c++2a/llvm-project/libcxx/test/support/nasty_macros.h -isysroot /Applications/Xcode.app/Contents/Developer/Platforms/MacOSX.platform/Developer/SDKs/MacOSX10.13.sdk -D _LIBCPP_DISABLE_AVAILABILITY -I /Users/buildslave/jenkins/libcxx_libcxxabi_trunk_testing/CI_ARCH/32/CI_EXCEPTIONS/OFF/CI_STD/c++2a/llvm-project/libcxx/include -I /var/folders/9t/lrs73ptj6lv644zvh1fk2_gc0000gn/T/tmp.uRw6ClIN/llvm-build/projects/libcxx/include/c++build -I /Users/buildslave/jenkins/libcxx_libcxxabi_trunk_testing/CI_ARCH/32/CI_EXCEPTIONS/OFF/CI_STD/c++2a/llvm-project/libcxx/test/support -D "LIBCXX_FILESYSTEM_STATIC_TEST_ROOT=\"/Users/buildslave/jenkins/libcxx_libcxxabi_trunk_testing/CI_ARCH/32/CI_EXCEPTIONS/OFF/CI_STD/c++2a/llvm-project/libcxx/test/std/input.output/filesystems/Inputs/static_test_env\"" -D "LIBCXX_FILESYSTEM_DYNAMIC_TEST_ROOT=\"/private/var/folders/9t/lrs73ptj6lv644zvh1fk2_gc0000gn/T/tmp.uRw6ClIN/llvm-build/projects/libcxx/test/filesystem/Output/dynamic_env\"" -D "LIBCXX_FILESYSTEM_DYNAMIC_TEST_HELPER=\"/usr/local/opt/python@2/bin/python2.7 /Users/buildslave/jenkins/libcxx_libcxxabi_trunk_testing/CI_ARCH/32/CI_EXCEPTIONS/OFF/CI_STD/c++2a/llvm-project/libcxx/test/support/filesystem_dynamic_test_helper.py\"" -D _LIBCPP_HAS_NO_PRAGMA_SYSTEM_HEADER -stdlib=libc++ -internal-isystem /Applications/Xcode.app/Contents/Developer/Platforms/MacOSX.platform/Developer/SDKs/MacOSX10.13.sdk/usr/local/include -internal-isystem /Users/buildslave/jenkins/libcxx_libcxxabi_trunk_testing/CI_ARCH/32/CI_EXCEPTIONS/OFF/CI_STD/c++2a/host-compiler/lib/clang/10.0.0/include -internal-externc-isystem /Applications/Xcode.app/Contents/Developer/Platforms/MacOSX.platform/Developer/SDKs/MacOSX10.13.sdk/usr/include -Werror=thread-safety -Wno-macro-redefined -Wall -Wextra -Werror -Wuser-defined-warnings -Wshadow -Wno-unused-command-line-argument -Wno-attributes -Wno-constant-evaluated -Wno-pessimizing-move -Wno-c++11-extensions -Wno-user-defined-literals -Wno-noexcept-type -Wsign-compare -Wunused-variable -Wunused-parameter -Wunreachable-code -std=c++2a -fdeprecated-macro -fdebug-compilation-dir /private/var/folders/9t/lrs73ptj6lv644zvh1fk2_gc0000gn/T/tmp.uRw6ClIN/llvm-build/projects/libcxx/test/std/numerics/rand/rand.dis/rand.dist.samp/rand.dist.samp.pconst -ftemplate-depth 270 -ferror-limit 19 -fmessage-length 0 -stack-protector 1 -fblocks -fencode-extended-block-signature -fregister-global-dtors-with-atexit -fgnuc-version=4.2.1 -fno-implicit-modules -fobjc-runtime=macosx-10.13.0 -fmax-type-align=16 -fdiagnostics-show-option -o /private/var/folders/9t/lrs73ptj6lv644zvh1fk2_gc0000gn/T/tmp.uRw6ClIN/llvm-build/projects/libcxx/test/std/numerics/rand/rand.dis/rand.dist.samp/rand.dist.samp.pconst/Output/set_param.pass.cpp.o -x c++ /Users/buildslave/jenkins/libcxx_libcxxabi_trunk_testing/CI_ARCH/32/CI_EXCEPTIONS/OFF/CI_STD/c++2a/llvm-project/libcxx/test/std/numerics/rand/rand.dis/rand.dist.samp/rand.dist.samp.pconst/set_param.pass.cpp clang -cc1 version 10.0.0 based upon LLVM 10.0.0git default target x86_64-apple-darwin17.5.0 ignoring nonexistent directory "/Applications/Xcode.app/Contents/Developer/Platforms/MacOSX.platform/Developer/SDKs/MacOSX10.13.sdk/usr/local/include" ignoring nonexistent directory "/Applications/Xcode.app/Contents/Developer/Platforms/MacOSX.platform/Developer/SDKs/MacOSX10.13.sdk/Library/Frameworks" #include "..." search starts here: #include <...> search starts here: /Users/buildslave/jenkins/libcxx_libcxxabi_trunk_testing/CI_ARCH/32/CI_EXCEPTIONS/OFF/CI_STD/c++2a/llvm-project/libcxx/include /var/folders/9t/lrs73ptj6lv644zvh1fk2_gc0000gn/T/tmp.uRw6ClIN/llvm-build/projects/libcxx/include/c++build /Users/buildslave/jenkins/libcxx_libcxxabi_trunk_testing/CI_ARCH/32/CI_EXCEPTIONS/OFF/CI_STD/c++2a/llvm-project/libcxx/test/support /Users/buildslave/jenkins/libcxx_libcxxabi_trunk_testing/CI_ARCH/32/CI_EXCEPTIONS/OFF/CI_STD/c++2a/host-compiler/lib/clang/10.0.0/include /Applications/Xcode.app/Contents/Developer/Platforms/MacOSX.platform/Developer/SDKs/MacOSX10.13.sdk/usr/include /Applications/Xcode.app/Contents/Developer/Platforms/MacOSX.platform/Developer/SDKs/MacOSX10.13.sdk/System/Library/Frameworks (framework directory) End of search list. In file included from /Users/buildslave/jenkins/libcxx_libcxxabi_trunk_testing/CI_ARCH/32/CI_EXCEPTIONS/OFF/CI_STD/c++2a/llvm-project/libcxx/test/std/numerics/rand/rand.dis/rand.dist.samp/rand.dist.samp.pconst/set_param.pass.cpp:16: /Users/buildslave/jenkins/libcxx_libcxxabi_trunk_testing/CI_ARCH/32/CI_EXCEPTIONS/OFF/CI_STD/c++2a/llvm-project/libcxx/include/random:6108:22: error: definition of implicit copy constructor for 'param_type' is deprecated because it has a user-declared copy assignment operator [-Werror,-Wdeprecated-copy] param_type & operator=(const param_type& __rhs); ^ /Users/buildslave/jenkins/libcxx_libcxxabi_trunk_testing/CI_ARCH/32/CI_EXCEPTIONS/OFF/CI_STD/c++2a/llvm-project/libcxx/include/random:6189:38: note: in implicit copy constructor for 'std::__1::piecewise_constant_distribution<double>::param_type' first required here param_type param() const {return __p_;} ^ /Users/buildslave/jenkins/libcxx_libcxxabi_trunk_testing/CI_ARCH/32/CI_EXCEPTIONS/OFF/CI_STD/c++2a/llvm-project/libcxx/test/std/numerics/rand/rand.dis/rand.dist.samp/rand.dist.samp.pconst/set_param.pass.cpp:31:18: note: in instantiation of member function 'std::__1::piecewise_constant_distribution<double>::param' requested here assert(d.param() == pa); ^ 1 error generated. --

Hide Details

Compilation failed unexpectedly! ******************** Testing: 0.. 10.. 20.. 30.. 40.. 50.. 60 FAIL: libc++ :: std/numerics/rand/rand.dis/rand.dist.samp/rand.dist.samp.plinear/copy.pass.cpp (4090 of 6368) ******************** TEST 'libc++ :: std/numerics/rand/rand.dis/rand.dist.samp/rand.dist.samp.plinear/copy.pass.cpp' FAILED ******************** Command: ['/Users/buildslave/jenkins/libcxx_libcxxabi_trunk_testing/CI_ARCH/32/CI_EXCEPTIONS/OFF/CI_STD/c++2a/host-compiler/bin/clang++', '-o', '/private/var/folders/9t/lrs73ptj6lv644zvh1fk2_gc0000gn/T/tmp.uRw6ClIN/llvm-build/projects/libcxx/test/std/numerics/rand/rand.dis/rand.dist.samp/rand.dist.samp.plinear/Output/copy.pass.cpp.o', '-x', 'c++', '/Users/buildslave/jenkins/libcxx_libcxxabi_trunk_testing/CI_ARCH/32/CI_EXCEPTIONS/OFF/CI_STD/c++2a/llvm-project/libcxx/test/std/numerics/rand/rand.dis/rand.dist.samp/rand.dist.samp.plinear/copy.pass.cpp', '-c', '-D_LIBCPP_DISABLE_AVAILABILITY', '-m32', '-v', '-arch', 'x86_64', '-mmacosx-version-min=10.13', '-ftemplate-depth=270', '-Werror=thread-safety', '-std=c++2a', '-Wno-macro-redefined', '-include', '/var/folders/9t/lrs73ptj6lv644zvh1fk2_gc0000gn/T/tmp.uRw6ClIN/llvm-build/projects/libcxx/__config_site', '-include', '/Users/buildslave/jenkins/libcxx_libcxxabi_trunk_testing/CI_ARCH/32/CI_EXCEPTIONS/OFF/CI_STD/c++2a/llvm-project/libcxx/test/support/nasty_macros.h', '-nostdinc++', '-I/Users/buildslave/jenkins/libcxx_libcxxabi_trunk_testing/CI_ARCH/32/CI_EXCEPTIONS/OFF/CI_STD/c++2a/llvm-project/libcxx/include', '-I/var/folders/9t/lrs73ptj6lv644zvh1fk2_gc0000gn/T/tmp.uRw6ClIN/llvm-build/projects/libcxx/include/c++build', '-isysroot', '/Applications/Xcode.app/Contents/Developer/Platforms/MacOSX.platform/Developer/SDKs/MacOSX10.13.sdk', '-fno-exceptions', '-I/Users/buildslave/jenkins/libcxx_libcxxabi_trunk_testing/CI_ARCH/32/CI_EXCEPTIONS/OFF/CI_STD/c++2a/llvm-project/libcxx/test/support', '-DLIBCXX_FILESYSTEM_STATIC_TEST_ROOT="/Users/buildslave/jenkins/libcxx_libcxxabi_trunk_testing/CI_ARCH/32/CI_EXCEPTIONS/OFF/CI_STD/c++2a/llvm-project/libcxx/test/std/input.output/filesystems/Inputs/static_test_env"', '-DLIBCXX_FILESYSTEM_DYNAMIC_TEST_ROOT="/private/var/folders/9t/lrs73ptj6lv644zvh1fk2_gc0000gn/T/tmp.uRw6ClIN/llvm-build/projects/libcxx/test/filesystem/Output/dynamic_env"', '-DLIBCXX_FILESYSTEM_DYNAMIC_TEST_HELPER="/usr/local/opt/python@2/bin/python2.7 /Users/buildslave/jenkins/libcxx_libcxxabi_trunk_testing/CI_ARCH/32/CI_EXCEPTIONS/OFF/CI_STD/c++2a/llvm-project/libcxx/test/support/filesystem_dynamic_test_helper.py"', '-D_LIBCPP_HAS_NO_PRAGMA_SYSTEM_HEADER', '-Wall', '-Wextra', '-Werror', '-Wuser-defined-warnings', '-Wshadow', '-Wno-unused-command-line-argument', '-Wno-attributes', '-Wno-constant-evaluated', '-Wno-pessimizing-move', '-Wno-c++11-extensions', '-Wno-user-defined-literals', '-Wno-noexcept-type', '-Wsign-compare', '-Wunused-variable', '-Wunused-parameter', '-Wunreachable-code', '-c'] Exit Code: 1 Standard Error: -- clang version 10.0.0 (https://github.com/llvm/llvm-project.git acc79aa0e747b9777077e0a337e99540a52b94b2) Target: i386-apple-darwin17.5.0 Thread model: posix InstalledDir: /Users/buildslave/jenkins/libcxx_libcxxabi_trunk_testing/CI_ARCH/32/CI_EXCEPTIONS/OFF/CI_STD/c++2a/host-compiler/bin "/Users/buildslave/jenkins/libcxx_libcxxabi_trunk_testing/CI_ARCH/32/CI_EXCEPTIONS/OFF/CI_STD/c++2a/host-compiler/bin/clang-10" -cc1 -triple x86_64-apple-macosx10.13.0 -Wdeprecated-objc-isa-usage -Werror=deprecated-objc-isa-usage -emit-obj -mrelax-all -disable-free -main-file-name copy.pass.cpp -mrelocation-model pic -pic-level 2 -mthread-model posix -mframe-pointer=all -masm-verbose -munwind-tables -faligned-alloc-unavailable -target-cpu penryn -dwarf-column-info -debugger-tuning=lldb -target-linker-version 409.12 -v -nostdinc++ -resource-dir /Users/buildslave/jenkins/libcxx_libcxxabi_trunk_testing/CI_ARCH/32/CI_EXCEPTIONS/OFF/CI_STD/c++2a/host-compiler/lib/clang/10.0.0 -include /var/folders/9t/lrs73ptj6lv644zvh1fk2_gc0000gn/T/tmp.uRw6ClIN/llvm-build/projects/libcxx/__config_site -include /Users/buildslave/jenkins/libcxx_libcxxabi_trunk_testing/CI_ARCH/32/CI_EXCEPTIONS/OFF/CI_STD/c++2a/llvm-project/libcxx/test/support/nasty_macros.h -isysroot /Applications/Xcode.app/Contents/Developer/Platforms/MacOSX.platform/Developer/SDKs/MacOSX10.13.sdk -D _LIBCPP_DISABLE_AVAILABILITY -I /Users/buildslave/jenkins/libcxx_libcxxabi_trunk_testing/CI_ARCH/32/CI_EXCEPTIONS/OFF/CI_STD/c++2a/llvm-project/libcxx/include -I /var/folders/9t/lrs73ptj6lv644zvh1fk2_gc0000gn/T/tmp.uRw6ClIN/llvm-build/projects/libcxx/include/c++build -I /Users/buildslave/jenkins/libcxx_libcxxabi_trunk_testing/CI_ARCH/32/CI_EXCEPTIONS/OFF/CI_STD/c++2a/llvm-project/libcxx/test/support -D "LIBCXX_FILESYSTEM_STATIC_TEST_ROOT=\"/Users/buildslave/jenkins/libcxx_libcxxabi_trunk_testing/CI_ARCH/32/CI_EXCEPTIONS/OFF/CI_STD/c++2a/llvm-project/libcxx/test/std/input.output/filesystems/Inputs/static_test_env\"" -D "LIBCXX_FILESYSTEM_DYNAMIC_TEST_ROOT=\"/private/var/folders/9t/lrs73ptj6lv644zvh1fk2_gc0000gn/T/tmp.uRw6ClIN/llvm-build/projects/libcxx/test/filesystem/Output/dynamic_env\"" -D "LIBCXX_FILESYSTEM_DYNAMIC_TEST_HELPER=\"/usr/local/opt/python@2/bin/python2.7 /Users/buildslave/jenkins/libcxx_libcxxabi_trunk_testing/CI_ARCH/32/CI_EXCEPTIONS/OFF/CI_STD/c++2a/llvm-project/libcxx/test/support/filesystem_dynamic_test_helper.py\"" -D _LIBCPP_HAS_NO_PRAGMA_SYSTEM_HEADER -stdlib=libc++ -internal-isystem /Applications/Xcode.app/Contents/Developer/Platforms/MacOSX.platform/Developer/SDKs/MacOSX10.13.sdk/usr/local/include -internal-isystem /Users/buildslave/jenkins/libcxx_libcxxabi_trunk_testing/CI_ARCH/32/CI_EXCEPTIONS/OFF/CI_STD/c++2a/host-compiler/lib/clang/10.0.0/include -internal-externc-isystem /Applications/Xcode.app/Contents/Developer/Platforms/MacOSX.platform/Developer/SDKs/MacOSX10.13.sdk/usr/include -Werror=thread-safety -Wno-macro-redefined -Wall -Wextra -Werror -Wuser-defined-warnings -Wshadow -Wno-unused-command-line-argument -Wno-attributes -Wno-constant-evaluated -Wno-pessimizing-move -Wno-c++11-extensions -Wno-user-defined-literals -Wno-noexcept-type -Wsign-compare -Wunused-variable -Wunused-parameter -Wunreachable-code -std=c++2a -fdeprecated-macro -fdebug-compilation-dir /private/var/folders/9t/lrs73ptj6lv644zvh1fk2_gc0000gn/T/tmp.uRw6ClIN/llvm-build/projects/libcxx/test/std/numerics/rand/rand.dis/rand.dist.samp/rand.dist.samp.plinear -ftemplate-depth 270 -ferror-limit 19 -fmessage-length 0 -stack-protector 1 -fblocks -fencode-extended-block-signature -fregister-global-dtors-with-atexit -fgnuc-version=4.2.1 -fno-implicit-modules -fobjc-runtime=macosx-10.13.0 -fmax-type-align=16 -fdiagnostics-show-option -o /private/var/folders/9t/lrs73ptj6lv644zvh1fk2_gc0000gn/T/tmp.uRw6ClIN/llvm-build/projects/libcxx/test/std/numerics/rand/rand.dis/rand.dist.samp/rand.dist.samp.plinear/Output/copy.pass.cpp.o -x c++ /Users/buildslave/jenkins/libcxx_libcxxabi_trunk_testing/CI_ARCH/32/CI_EXCEPTIONS/OFF/CI_STD/c++2a/llvm-project/libcxx/test/std/numerics/rand/rand.dis/rand.dist.samp/rand.dist.samp.plinear/copy.pass.cpp clang -cc1 version 10.0.0 based upon LLVM 10.0.0git default target x86_64-apple-darwin17.5.0 ignoring nonexistent directory "/Applications/Xcode.app/Contents/Developer/Platforms/MacOSX.platform/Developer/SDKs/MacOSX10.13.sdk/usr/local/include" ignoring nonexistent directory "/Applications/Xcode.app/Contents/Developer/Platforms/MacOSX.platform/Developer/SDKs/MacOSX10.13.sdk/Library/Frameworks" #include "..." search starts here: #include <...> search starts here: /Users/buildslave/jenkins/libcxx_libcxxabi_trunk_testing/CI_ARCH/32/CI_EXCEPTIONS/OFF/CI_STD/c++2a/llvm-project/libcxx/include /var/folders/9t/lrs73ptj6lv644zvh1fk2_gc0000gn/T/tmp.uRw6ClIN/llvm-build/projects/libcxx/include/c++build /Users/buildslave/jenkins/libcxx_libcxxabi_trunk_testing/CI_ARCH/32/CI_EXCEPTIONS/OFF/CI_STD/c++2a/llvm-project/libcxx/test/support /Users/buildslave/jenkins/libcxx_libcxxabi_trunk_testing/CI_ARCH/32/CI_EXCEPTIONS/OFF/CI_STD/c++2a/host-compiler/lib/clang/10.0.0/include /Applications/Xcode.app/Contents/Developer/Platforms/MacOSX.platform/Developer/SDKs/MacOSX10.13.sdk/usr/include /Applications/Xcode.app/Contents/Developer/Platforms/MacOSX.platform/Developer/SDKs/MacOSX10.13.sdk/System/Library/Frameworks (framework directory) End of search list. In file included from /Users/buildslave/jenkins/libcxx_libcxxabi_trunk_testing/CI_ARCH/32/CI_EXCEPTIONS/OFF/CI_STD/c++2a/llvm-project/libcxx/test/std/numerics/rand/rand.dis/rand.dist.samp/rand.dist.samp.plinear/copy.pass.cpp:16: /Users/buildslave/jenkins/libcxx_libcxxabi_trunk_testing/CI_ARCH/32/CI_EXCEPTIONS/OFF/CI_STD/c++2a/llvm-project/libcxx/include/random:6431:22: error: definition of implicit copy constructor for 'param_type' is deprecated because it has a user-declared copy assignment operator [-Werror,-Wdeprecated-copy] param_type & operator=(const param_type& __rhs); ^ /Users/buildslave/jenkins/libcxx_libcxxabi_trunk_testing/CI_ARCH/32/CI_EXCEPTIONS/OFF/CI_STD/c++2a/llvm-project/libcxx/include/random:6406:28: note: in implicit copy constructor for 'std::__1::piecewise_linear_distribution<double>::param_type' first required here class _LIBCPP_TEMPLATE_VIS piecewise_linear_distribution ^ /Users/buildslave/jenkins/libcxx_libcxxabi_trunk_testing/CI_ARCH/32/CI_EXCEPTIONS/OFF/CI_STD/c++2a/llvm-project/libcxx/test/std/numerics/rand/rand.dis/rand.dist.samp/rand.dist.samp.plinear/copy.pass.cpp:28:12: note: in implicit copy constructor for 'std::__1::piecewise_linear_distribution<double>' first required here D d2 = d1; ^ 1 error generated. --

Hide Details

Compilation failed unexpectedly! ******************** Testing: 0.. 10.. 20.. 30.. 40.. 50.. 60 FAIL: libc++ :: std/numerics/rand/rand.dis/rand.dist.samp/rand.dist.samp.plinear/ctor_param.pass.cpp (4094 of 6368) ******************** TEST 'libc++ :: std/numerics/rand/rand.dis/rand.dist.samp/rand.dist.samp.plinear/ctor_param.pass.cpp' FAILED ******************** Command: ['/Users/buildslave/jenkins/libcxx_libcxxabi_trunk_testing/CI_ARCH/32/CI_EXCEPTIONS/OFF/CI_STD/c++2a/host-compiler/bin/clang++', '-o', '/private/var/folders/9t/lrs73ptj6lv644zvh1fk2_gc0000gn/T/tmp.uRw6ClIN/llvm-build/projects/libcxx/test/std/numerics/rand/rand.dis/rand.dist.samp/rand.dist.samp.plinear/Output/ctor_param.pass.cpp.o', '-x', 'c++', '/Users/buildslave/jenkins/libcxx_libcxxabi_trunk_testing/CI_ARCH/32/CI_EXCEPTIONS/OFF/CI_STD/c++2a/llvm-project/libcxx/test/std/numerics/rand/rand.dis/rand.dist.samp/rand.dist.samp.plinear/ctor_param.pass.cpp', '-c', '-D_LIBCPP_DISABLE_AVAILABILITY', '-m32', '-v', '-arch', 'x86_64', '-mmacosx-version-min=10.13', '-ftemplate-depth=270', '-Werror=thread-safety', '-std=c++2a', '-Wno-macro-redefined', '-include', '/var/folders/9t/lrs73ptj6lv644zvh1fk2_gc0000gn/T/tmp.uRw6ClIN/llvm-build/projects/libcxx/__config_site', '-include', '/Users/buildslave/jenkins/libcxx_libcxxabi_trunk_testing/CI_ARCH/32/CI_EXCEPTIONS/OFF/CI_STD/c++2a/llvm-project/libcxx/test/support/nasty_macros.h', '-nostdinc++', '-I/Users/buildslave/jenkins/libcxx_libcxxabi_trunk_testing/CI_ARCH/32/CI_EXCEPTIONS/OFF/CI_STD/c++2a/llvm-project/libcxx/include', '-I/var/folders/9t/lrs73ptj6lv644zvh1fk2_gc0000gn/T/tmp.uRw6ClIN/llvm-build/projects/libcxx/include/c++build', '-isysroot', '/Applications/Xcode.app/Contents/Developer/Platforms/MacOSX.platform/Developer/SDKs/MacOSX10.13.sdk', '-fno-exceptions', '-I/Users/buildslave/jenkins/libcxx_libcxxabi_trunk_testing/CI_ARCH/32/CI_EXCEPTIONS/OFF/CI_STD/c++2a/llvm-project/libcxx/test/support', '-DLIBCXX_FILESYSTEM_STATIC_TEST_ROOT="/Users/buildslave/jenkins/libcxx_libcxxabi_trunk_testing/CI_ARCH/32/CI_EXCEPTIONS/OFF/CI_STD/c++2a/llvm-project/libcxx/test/std/input.output/filesystems/Inputs/static_test_env"', '-DLIBCXX_FILESYSTEM_DYNAMIC_TEST_ROOT="/private/var/folders/9t/lrs73ptj6lv644zvh1fk2_gc0000gn/T/tmp.uRw6ClIN/llvm-build/projects/libcxx/test/filesystem/Output/dynamic_env"', '-DLIBCXX_FILESYSTEM_DYNAMIC_TEST_HELPER="/usr/local/opt/python@2/bin/python2.7 /Users/buildslave/jenkins/libcxx_libcxxabi_trunk_testing/CI_ARCH/32/CI_EXCEPTIONS/OFF/CI_STD/c++2a/llvm-project/libcxx/test/support/filesystem_dynamic_test_helper.py"', '-D_LIBCPP_HAS_NO_PRAGMA_SYSTEM_HEADER', '-Wall', '-Wextra', '-Werror', '-Wuser-defined-warnings', '-Wshadow', '-Wno-unused-command-line-argument', '-Wno-attributes', '-Wno-constant-evaluated', '-Wno-pessimizing-move', '-Wno-c++11-extensions', '-Wno-user-defined-literals', '-Wno-noexcept-type', '-Wsign-compare', '-Wunused-variable', '-Wunused-parameter', '-Wunreachable-code', '-c'] Exit Code: 1 Standard Error: -- clang version 10.0.0 (https://github.com/llvm/llvm-project.git acc79aa0e747b9777077e0a337e99540a52b94b2) Target: i386-apple-darwin17.5.0 Thread model: posix InstalledDir: /Users/buildslave/jenkins/libcxx_libcxxabi_trunk_testing/CI_ARCH/32/CI_EXCEPTIONS/OFF/CI_STD/c++2a/host-compiler/bin "/Users/buildslave/jenkins/libcxx_libcxxabi_trunk_testing/CI_ARCH/32/CI_EXCEPTIONS/OFF/CI_STD/c++2a/host-compiler/bin/clang-10" -cc1 -triple x86_64-apple-macosx10.13.0 -Wdeprecated-objc-isa-usage -Werror=deprecated-objc-isa-usage -emit-obj -mrelax-all -disable-free -main-file-name ctor_param.pass.cpp -mrelocation-model pic -pic-level 2 -mthread-model posix -mframe-pointer=all -masm-verbose -munwind-tables -faligned-alloc-unavailable -target-cpu penryn -dwarf-column-info -debugger-tuning=lldb -target-linker-version 409.12 -v -nostdinc++ -resource-dir /Users/buildslave/jenkins/libcxx_libcxxabi_trunk_testing/CI_ARCH/32/CI_EXCEPTIONS/OFF/CI_STD/c++2a/host-compiler/lib/clang/10.0.0 -include /var/folders/9t/lrs73ptj6lv644zvh1fk2_gc0000gn/T/tmp.uRw6ClIN/llvm-build/projects/libcxx/__config_site -include /Users/buildslave/jenkins/libcxx_libcxxabi_trunk_testing/CI_ARCH/32/CI_EXCEPTIONS/OFF/CI_STD/c++2a/llvm-project/libcxx/test/support/nasty_macros.h -isysroot /Applications/Xcode.app/Contents/Developer/Platforms/MacOSX.platform/Developer/SDKs/MacOSX10.13.sdk -D _LIBCPP_DISABLE_AVAILABILITY -I /Users/buildslave/jenkins/libcxx_libcxxabi_trunk_testing/CI_ARCH/32/CI_EXCEPTIONS/OFF/CI_STD/c++2a/llvm-project/libcxx/include -I /var/folders/9t/lrs73ptj6lv644zvh1fk2_gc0000gn/T/tmp.uRw6ClIN/llvm-build/projects/libcxx/include/c++build -I /Users/buildslave/jenkins/libcxx_libcxxabi_trunk_testing/CI_ARCH/32/CI_EXCEPTIONS/OFF/CI_STD/c++2a/llvm-project/libcxx/test/support -D "LIBCXX_FILESYSTEM_STATIC_TEST_ROOT=\"/Users/buildslave/jenkins/libcxx_libcxxabi_trunk_testing/CI_ARCH/32/CI_EXCEPTIONS/OFF/CI_STD/c++2a/llvm-project/libcxx/test/std/input.output/filesystems/Inputs/static_test_env\"" -D "LIBCXX_FILESYSTEM_DYNAMIC_TEST_ROOT=\"/private/var/folders/9t/lrs73ptj6lv644zvh1fk2_gc0000gn/T/tmp.uRw6ClIN/llvm-build/projects/libcxx/test/filesystem/Output/dynamic_env\"" -D "LIBCXX_FILESYSTEM_DYNAMIC_TEST_HELPER=\"/usr/local/opt/python@2/bin/python2.7 /Users/buildslave/jenkins/libcxx_libcxxabi_trunk_testing/CI_ARCH/32/CI_EXCEPTIONS/OFF/CI_STD/c++2a/llvm-project/libcxx/test/support/filesystem_dynamic_test_helper.py\"" -D _LIBCPP_HAS_NO_PRAGMA_SYSTEM_HEADER -stdlib=libc++ -internal-isystem /Applications/Xcode.app/Contents/Developer/Platforms/MacOSX.platform/Developer/SDKs/MacOSX10.13.sdk/usr/local/include -internal-isystem /Users/buildslave/jenkins/libcxx_libcxxabi_trunk_testing/CI_ARCH/32/CI_EXCEPTIONS/OFF/CI_STD/c++2a/host-compiler/lib/clang/10.0.0/include -internal-externc-isystem /Applications/Xcode.app/Contents/Developer/Platforms/MacOSX.platform/Developer/SDKs/MacOSX10.13.sdk/usr/include -Werror=thread-safety -Wno-macro-redefined -Wall -Wextra -Werror -Wuser-defined-warnings -Wshadow -Wno-unused-command-line-argument -Wno-attributes -Wno-constant-evaluated -Wno-pessimizing-move -Wno-c++11-extensions -Wno-user-defined-literals -Wno-noexcept-type -Wsign-compare -Wunused-variable -Wunused-parameter -Wunreachable-code -std=c++2a -fdeprecated-macro -fdebug-compilation-dir /private/var/folders/9t/lrs73ptj6lv644zvh1fk2_gc0000gn/T/tmp.uRw6ClIN/llvm-build/projects/libcxx/test/std/numerics/rand/rand.dis/rand.dist.samp/rand.dist.samp.plinear -ftemplate-depth 270 -ferror-limit 19 -fmessage-length 0 -stack-protector 1 -fblocks -fencode-extended-block-signature -fregister-global-dtors-with-atexit -fgnuc-version=4.2.1 -fno-implicit-modules -fobjc-runtime=macosx-10.13.0 -fmax-type-align=16 -fdiagnostics-show-option -o /private/var/folders/9t/lrs73ptj6lv644zvh1fk2_gc0000gn/T/tmp.uRw6ClIN/llvm-build/projects/libcxx/test/std/numerics/rand/rand.dis/rand.dist.samp/rand.dist.samp.plinear/Output/ctor_param.pass.cpp.o -x c++ /Users/buildslave/jenkins/libcxx_libcxxabi_trunk_testing/CI_ARCH/32/CI_EXCEPTIONS/OFF/CI_STD/c++2a/llvm-project/libcxx/test/std/numerics/rand/rand.dis/rand.dist.samp/rand.dist.samp.plinear/ctor_param.pass.cpp clang -cc1 version 10.0.0 based upon LLVM 10.0.0git default target x86_64-apple-darwin17.5.0 ignoring nonexistent directory "/Applications/Xcode.app/Contents/Developer/Platforms/MacOSX.platform/Developer/SDKs/MacOSX10.13.sdk/usr/local/include" ignoring nonexistent directory "/Applications/Xcode.app/Contents/Developer/Platforms/MacOSX.platform/Developer/SDKs/MacOSX10.13.sdk/Library/Frameworks" #include "..." search starts here: #include <...> search starts here: /Users/buildslave/jenkins/libcxx_libcxxabi_trunk_testing/CI_ARCH/32/CI_EXCEPTIONS/OFF/CI_STD/c++2a/llvm-project/libcxx/include /var/folders/9t/lrs73ptj6lv644zvh1fk2_gc0000gn/T/tmp.uRw6ClIN/llvm-build/projects/libcxx/include/c++build /Users/buildslave/jenkins/libcxx_libcxxabi_trunk_testing/CI_ARCH/32/CI_EXCEPTIONS/OFF/CI_STD/c++2a/llvm-project/libcxx/test/support /Users/buildslave/jenkins/libcxx_libcxxabi_trunk_testing/CI_ARCH/32/CI_EXCEPTIONS/OFF/CI_STD/c++2a/host-compiler/lib/clang/10.0.0/include /Applications/Xcode.app/Contents/Developer/Platforms/MacOSX.platform/Developer/SDKs/MacOSX10.13.sdk/usr/include /Applications/Xcode.app/Contents/Developer/Platforms/MacOSX.platform/Developer/SDKs/MacOSX10.13.sdk/System/Library/Frameworks (framework directory) End of search list. In file included from /Users/buildslave/jenkins/libcxx_libcxxabi_trunk_testing/CI_ARCH/32/CI_EXCEPTIONS/OFF/CI_STD/c++2a/llvm-project/libcxx/test/std/numerics/rand/rand.dis/rand.dist.samp/rand.dist.samp.plinear/ctor_param.pass.cpp:16: /Users/buildslave/jenkins/libcxx_libcxxabi_trunk_testing/CI_ARCH/32/CI_EXCEPTIONS/OFF/CI_STD/c++2a/llvm-project/libcxx/include/random:6431:22: error: definition of implicit copy constructor for 'param_type' is deprecated because it has a user-declared copy assignment operator [-Werror,-Wdeprecated-copy] param_type & operator=(const param_type& __rhs); ^ /Users/buildslave/jenkins/libcxx_libcxxabi_trunk_testing/CI_ARCH/32/CI_EXCEPTIONS/OFF/CI_STD/c++2a/llvm-project/libcxx/include/random:6493:11: note: in implicit copy constructor for 'std::__1::piecewise_linear_distribution<double>::param_type' first required here : __p_(__p) {} ^ /Users/buildslave/jenkins/libcxx_libcxxabi_trunk_testing/CI_ARCH/32/CI_EXCEPTIONS/OFF/CI_STD/c++2a/llvm-project/libcxx/test/std/numerics/rand/rand.dis/rand.dist.samp/rand.dist.samp.plinear/ctor_param.pass.cpp:29:11: note: in instantiation of member function 'std::__1::piecewise_linear_distribution<double>::piecewise_linear_distribution' requested here D d(pa); ^ 1 error generated. --

Hide Details

Compilation failed unexpectedly! ******************** Testing: 0.. 10.. 20.. 30.. 40.. 50.. 60 FAIL: libc++ :: std/numerics/rand/rand.dis/rand.dist.samp/rand.dist.samp.plinear/get_param.pass.cpp (4097 of 6368) ******************** TEST 'libc++ :: std/numerics/rand/rand.dis/rand.dist.samp/rand.dist.samp.plinear/get_param.pass.cpp' FAILED ******************** Command: ['/Users/buildslave/jenkins/libcxx_libcxxabi_trunk_testing/CI_ARCH/32/CI_EXCEPTIONS/OFF/CI_STD/c++2a/host-compiler/bin/clang++', '-o', '/private/var/folders/9t/lrs73ptj6lv644zvh1fk2_gc0000gn/T/tmp.uRw6ClIN/llvm-build/projects/libcxx/test/std/numerics/rand/rand.dis/rand.dist.samp/rand.dist.samp.plinear/Output/get_param.pass.cpp.o', '-x', 'c++', '/Users/buildslave/jenkins/libcxx_libcxxabi_trunk_testing/CI_ARCH/32/CI_EXCEPTIONS/OFF/CI_STD/c++2a/llvm-project/libcxx/test/std/numerics/rand/rand.dis/rand.dist.samp/rand.dist.samp.plinear/get_param.pass.cpp', '-c', '-D_LIBCPP_DISABLE_AVAILABILITY', '-m32', '-v', '-arch', 'x86_64', '-mmacosx-version-min=10.13', '-ftemplate-depth=270', '-Werror=thread-safety', '-std=c++2a', '-Wno-macro-redefined', '-include', '/var/folders/9t/lrs73ptj6lv644zvh1fk2_gc0000gn/T/tmp.uRw6ClIN/llvm-build/projects/libcxx/__config_site', '-include', '/Users/buildslave/jenkins/libcxx_libcxxabi_trunk_testing/CI_ARCH/32/CI_EXCEPTIONS/OFF/CI_STD/c++2a/llvm-project/libcxx/test/support/nasty_macros.h', '-nostdinc++', '-I/Users/buildslave/jenkins/libcxx_libcxxabi_trunk_testing/CI_ARCH/32/CI_EXCEPTIONS/OFF/CI_STD/c++2a/llvm-project/libcxx/include', '-I/var/folders/9t/lrs73ptj6lv644zvh1fk2_gc0000gn/T/tmp.uRw6ClIN/llvm-build/projects/libcxx/include/c++build', '-isysroot', '/Applications/Xcode.app/Contents/Developer/Platforms/MacOSX.platform/Developer/SDKs/MacOSX10.13.sdk', '-fno-exceptions', '-I/Users/buildslave/jenkins/libcxx_libcxxabi_trunk_testing/CI_ARCH/32/CI_EXCEPTIONS/OFF/CI_STD/c++2a/llvm-project/libcxx/test/support', '-DLIBCXX_FILESYSTEM_STATIC_TEST_ROOT="/Users/buildslave/jenkins/libcxx_libcxxabi_trunk_testing/CI_ARCH/32/CI_EXCEPTIONS/OFF/CI_STD/c++2a/llvm-project/libcxx/test/std/input.output/filesystems/Inputs/static_test_env"', '-DLIBCXX_FILESYSTEM_DYNAMIC_TEST_ROOT="/private/var/folders/9t/lrs73ptj6lv644zvh1fk2_gc0000gn/T/tmp.uRw6ClIN/llvm-build/projects/libcxx/test/filesystem/Output/dynamic_env"', '-DLIBCXX_FILESYSTEM_DYNAMIC_TEST_HELPER="/usr/local/opt/python@2/bin/python2.7 /Users/buildslave/jenkins/libcxx_libcxxabi_trunk_testing/CI_ARCH/32/CI_EXCEPTIONS/OFF/CI_STD/c++2a/llvm-project/libcxx/test/support/filesystem_dynamic_test_helper.py"', '-D_LIBCPP_HAS_NO_PRAGMA_SYSTEM_HEADER', '-Wall', '-Wextra', '-Werror', '-Wuser-defined-warnings', '-Wshadow', '-Wno-unused-command-line-argument', '-Wno-attributes', '-Wno-constant-evaluated', '-Wno-pessimizing-move', '-Wno-c++11-extensions', '-Wno-user-defined-literals', '-Wno-noexcept-type', '-Wsign-compare', '-Wunused-variable', '-Wunused-parameter', '-Wunreachable-code', '-c'] Exit Code: 1 Standard Error: -- clang version 10.0.0 (https://github.com/llvm/llvm-project.git acc79aa0e747b9777077e0a337e99540a52b94b2) Target: i386-apple-darwin17.5.0 Thread model: posix InstalledDir: /Users/buildslave/jenkins/libcxx_libcxxabi_trunk_testing/CI_ARCH/32/CI_EXCEPTIONS/OFF/CI_STD/c++2a/host-compiler/bin "/Users/buildslave/jenkins/libcxx_libcxxabi_trunk_testing/CI_ARCH/32/CI_EXCEPTIONS/OFF/CI_STD/c++2a/host-compiler/bin/clang-10" -cc1 -triple x86_64-apple-macosx10.13.0 -Wdeprecated-objc-isa-usage -Werror=deprecated-objc-isa-usage -emit-obj -mrelax-all -disable-free -main-file-name get_param.pass.cpp -mrelocation-model pic -pic-level 2 -mthread-model posix -mframe-pointer=all -masm-verbose -munwind-tables -faligned-alloc-unavailable -target-cpu penryn -dwarf-column-info -debugger-tuning=lldb -target-linker-version 409.12 -v -nostdinc++ -resource-dir /Users/buildslave/jenkins/libcxx_libcxxabi_trunk_testing/CI_ARCH/32/CI_EXCEPTIONS/OFF/CI_STD/c++2a/host-compiler/lib/clang/10.0.0 -include /var/folders/9t/lrs73ptj6lv644zvh1fk2_gc0000gn/T/tmp.uRw6ClIN/llvm-build/projects/libcxx/__config_site -include /Users/buildslave/jenkins/libcxx_libcxxabi_trunk_testing/CI_ARCH/32/CI_EXCEPTIONS/OFF/CI_STD/c++2a/llvm-project/libcxx/test/support/nasty_macros.h -isysroot /Applications/Xcode.app/Contents/Developer/Platforms/MacOSX.platform/Developer/SDKs/MacOSX10.13.sdk -D _LIBCPP_DISABLE_AVAILABILITY -I /Users/buildslave/jenkins/libcxx_libcxxabi_trunk_testing/CI_ARCH/32/CI_EXCEPTIONS/OFF/CI_STD/c++2a/llvm-project/libcxx/include -I /var/folders/9t/lrs73ptj6lv644zvh1fk2_gc0000gn/T/tmp.uRw6ClIN/llvm-build/projects/libcxx/include/c++build -I /Users/buildslave/jenkins/libcxx_libcxxabi_trunk_testing/CI_ARCH/32/CI_EXCEPTIONS/OFF/CI_STD/c++2a/llvm-project/libcxx/test/support -D "LIBCXX_FILESYSTEM_STATIC_TEST_ROOT=\"/Users/buildslave/jenkins/libcxx_libcxxabi_trunk_testing/CI_ARCH/32/CI_EXCEPTIONS/OFF/CI_STD/c++2a/llvm-project/libcxx/test/std/input.output/filesystems/Inputs/static_test_env\"" -D "LIBCXX_FILESYSTEM_DYNAMIC_TEST_ROOT=\"/private/var/folders/9t/lrs73ptj6lv644zvh1fk2_gc0000gn/T/tmp.uRw6ClIN/llvm-build/projects/libcxx/test/filesystem/Output/dynamic_env\"" -D "LIBCXX_FILESYSTEM_DYNAMIC_TEST_HELPER=\"/usr/local/opt/python@2/bin/python2.7 /Users/buildslave/jenkins/libcxx_libcxxabi_trunk_testing/CI_ARCH/32/CI_EXCEPTIONS/OFF/CI_STD/c++2a/llvm-project/libcxx/test/support/filesystem_dynamic_test_helper.py\"" -D _LIBCPP_HAS_NO_PRAGMA_SYSTEM_HEADER -stdlib=libc++ -internal-isystem /Applications/Xcode.app/Contents/Developer/Platforms/MacOSX.platform/Developer/SDKs/MacOSX10.13.sdk/usr/local/include -internal-isystem /Users/buildslave/jenkins/libcxx_libcxxabi_trunk_testing/CI_ARCH/32/CI_EXCEPTIONS/OFF/CI_STD/c++2a/host-compiler/lib/clang/10.0.0/include -internal-externc-isystem /Applications/Xcode.app/Contents/Developer/Platforms/MacOSX.platform/Developer/SDKs/MacOSX10.13.sdk/usr/include -Werror=thread-safety -Wno-macro-redefined -Wall -Wextra -Werror -Wuser-defined-warnings -Wshadow -Wno-unused-command-line-argument -Wno-attributes -Wno-constant-evaluated -Wno-pessimizing-move -Wno-c++11-extensions -Wno-user-defined-literals -Wno-noexcept-type -Wsign-compare -Wunused-variable -Wunused-parameter -Wunreachable-code -std=c++2a -fdeprecated-macro -fdebug-compilation-dir /private/var/folders/9t/lrs73ptj6lv644zvh1fk2_gc0000gn/T/tmp.uRw6ClIN/llvm-build/projects/libcxx/test/std/numerics/rand/rand.dis/rand.dist.samp/rand.dist.samp.plinear -ftemplate-depth 270 -ferror-limit 19 -fmessage-length 0 -stack-protector 1 -fblocks -fencode-extended-block-signature -fregister-global-dtors-with-atexit -fgnuc-version=4.2.1 -fno-implicit-modules -fobjc-runtime=macosx-10.13.0 -fmax-type-align=16 -fdiagnostics-show-option -o /private/var/folders/9t/lrs73ptj6lv644zvh1fk2_gc0000gn/T/tmp.uRw6ClIN/llvm-build/projects/libcxx/test/std/numerics/rand/rand.dis/rand.dist.samp/rand.dist.samp.plinear/Output/get_param.pass.cpp.o -x c++ /Users/buildslave/jenkins/libcxx_libcxxabi_trunk_testing/CI_ARCH/32/CI_EXCEPTIONS/OFF/CI_STD/c++2a/llvm-project/libcxx/test/std/numerics/rand/rand.dis/rand.dist.samp/rand.dist.samp.plinear/get_param.pass.cpp clang -cc1 version 10.0.0 based upon LLVM 10.0.0git default target x86_64-apple-darwin17.5.0 ignoring nonexistent directory "/Applications/Xcode.app/Contents/Developer/Platforms/MacOSX.platform/Developer/SDKs/MacOSX10.13.sdk/usr/local/include" ignoring nonexistent directory "/Applications/Xcode.app/Contents/Developer/Platforms/MacOSX.platform/Developer/SDKs/MacOSX10.13.sdk/Library/Frameworks" #include "..." search starts here: #include <...> search starts here: /Users/buildslave/jenkins/libcxx_libcxxabi_trunk_testing/CI_ARCH/32/CI_EXCEPTIONS/OFF/CI_STD/c++2a/llvm-project/libcxx/include /var/folders/9t/lrs73ptj6lv644zvh1fk2_gc0000gn/T/tmp.uRw6ClIN/llvm-build/projects/libcxx/include/c++build /Users/buildslave/jenkins/libcxx_libcxxabi_trunk_testing/CI_ARCH/32/CI_EXCEPTIONS/OFF/CI_STD/c++2a/llvm-project/libcxx/test/support /Users/buildslave/jenkins/libcxx_libcxxabi_trunk_testing/CI_ARCH/32/CI_EXCEPTIONS/OFF/CI_STD/c++2a/host-compiler/lib/clang/10.0.0/include /Applications/Xcode.app/Contents/Developer/Platforms/MacOSX.platform/Developer/SDKs/MacOSX10.13.sdk/usr/include /Applications/Xcode.app/Contents/Developer/Platforms/MacOSX.platform/Developer/SDKs/MacOSX10.13.sdk/System/Library/Frameworks (framework directory) End of search list. In file included from /Users/buildslave/jenkins/libcxx_libcxxabi_trunk_testing/CI_ARCH/32/CI_EXCEPTIONS/OFF/CI_STD/c++2a/llvm-project/libcxx/test/std/numerics/rand/rand.dis/rand.dist.samp/rand.dist.samp.plinear/get_param.pass.cpp:16: /Users/buildslave/jenkins/libcxx_libcxxabi_trunk_testing/CI_ARCH/32/CI_EXCEPTIONS/OFF/CI_STD/c++2a/llvm-project/libcxx/include/random:6431:22: error: definition of implicit copy constructor for 'param_type' is deprecated because it has a user-declared copy assignment operator [-Werror,-Wdeprecated-copy] param_type & operator=(const param_type& __rhs); ^ /Users/buildslave/jenkins/libcxx_libcxxabi_trunk_testing/CI_ARCH/32/CI_EXCEPTIONS/OFF/CI_STD/c++2a/llvm-project/libcxx/include/random:6493:11: note: in implicit copy constructor for 'std::__1::piecewise_linear_distribution<double>::param_type' first required here : __p_(__p) {} ^ /Users/buildslave/jenkins/libcxx_libcxxabi_trunk_testing/CI_ARCH/32/CI_EXCEPTIONS/OFF/CI_STD/c++2a/llvm-project/libcxx/test/std/numerics/rand/rand.dis/rand.dist.samp/rand.dist.samp.plinear/get_param.pass.cpp:30:11: note: in instantiation of member function 'std::__1::piecewise_linear_distribution<double>::piecewise_linear_distribution' requested here D d(pa); ^ 1 error generated. --

Hide Details

Compilation failed unexpectedly! ******************** Testing: 0.. 10.. 20.. 30.. 40.. 50.. 60 FAIL: libc++ :: std/numerics/rand/rand.dis/rand.dist.samp/rand.dist.samp.plinear/param_copy.pass.cpp (4103 of 6368) ******************** TEST 'libc++ :: std/numerics/rand/rand.dis/rand.dist.samp/rand.dist.samp.plinear/param_copy.pass.cpp' FAILED ******************** Command: ['/Users/buildslave/jenkins/libcxx_libcxxabi_trunk_testing/CI_ARCH/32/CI_EXCEPTIONS/OFF/CI_STD/c++2a/host-compiler/bin/clang++', '-o', '/private/var/folders/9t/lrs73ptj6lv644zvh1fk2_gc0000gn/T/tmp.uRw6ClIN/llvm-build/projects/libcxx/test/std/numerics/rand/rand.dis/rand.dist.samp/rand.dist.samp.plinear/Output/param_copy.pass.cpp.o', '-x', 'c++', '/Users/buildslave/jenkins/libcxx_libcxxabi_trunk_testing/CI_ARCH/32/CI_EXCEPTIONS/OFF/CI_STD/c++2a/llvm-project/libcxx/test/std/numerics/rand/rand.dis/rand.dist.samp/rand.dist.samp.plinear/param_copy.pass.cpp', '-c', '-D_LIBCPP_DISABLE_AVAILABILITY', '-m32', '-v', '-arch', 'x86_64', '-mmacosx-version-min=10.13', '-ftemplate-depth=270', '-Werror=thread-safety', '-std=c++2a', '-Wno-macro-redefined', '-include', '/var/folders/9t/lrs73ptj6lv644zvh1fk2_gc0000gn/T/tmp.uRw6ClIN/llvm-build/projects/libcxx/__config_site', '-include', '/Users/buildslave/jenkins/libcxx_libcxxabi_trunk_testing/CI_ARCH/32/CI_EXCEPTIONS/OFF/CI_STD/c++2a/llvm-project/libcxx/test/support/nasty_macros.h', '-nostdinc++', '-I/Users/buildslave/jenkins/libcxx_libcxxabi_trunk_testing/CI_ARCH/32/CI_EXCEPTIONS/OFF/CI_STD/c++2a/llvm-project/libcxx/include', '-I/var/folders/9t/lrs73ptj6lv644zvh1fk2_gc0000gn/T/tmp.uRw6ClIN/llvm-build/projects/libcxx/include/c++build', '-isysroot', '/Applications/Xcode.app/Contents/Developer/Platforms/MacOSX.platform/Developer/SDKs/MacOSX10.13.sdk', '-fno-exceptions', '-I/Users/buildslave/jenkins/libcxx_libcxxabi_trunk_testing/CI_ARCH/32/CI_EXCEPTIONS/OFF/CI_STD/c++2a/llvm-project/libcxx/test/support', '-DLIBCXX_FILESYSTEM_STATIC_TEST_ROOT="/Users/buildslave/jenkins/libcxx_libcxxabi_trunk_testing/CI_ARCH/32/CI_EXCEPTIONS/OFF/CI_STD/c++2a/llvm-project/libcxx/test/std/input.output/filesystems/Inputs/static_test_env"', '-DLIBCXX_FILESYSTEM_DYNAMIC_TEST_ROOT="/private/var/folders/9t/lrs73ptj6lv644zvh1fk2_gc0000gn/T/tmp.uRw6ClIN/llvm-build/projects/libcxx/test/filesystem/Output/dynamic_env"', '-DLIBCXX_FILESYSTEM_DYNAMIC_TEST_HELPER="/usr/local/opt/python@2/bin/python2.7 /Users/buildslave/jenkins/libcxx_libcxxabi_trunk_testing/CI_ARCH/32/CI_EXCEPTIONS/OFF/CI_STD/c++2a/llvm-project/libcxx/test/support/filesystem_dynamic_test_helper.py"', '-D_LIBCPP_HAS_NO_PRAGMA_SYSTEM_HEADER', '-Wall', '-Wextra', '-Werror', '-Wuser-defined-warnings', '-Wshadow', '-Wno-unused-command-line-argument', '-Wno-attributes', '-Wno-constant-evaluated', '-Wno-pessimizing-move', '-Wno-c++11-extensions', '-Wno-user-defined-literals', '-Wno-noexcept-type', '-Wsign-compare', '-Wunused-variable', '-Wunused-parameter', '-Wunreachable-code', '-c'] Exit Code: 1 Standard Error: -- clang version 10.0.0 (https://github.com/llvm/llvm-project.git acc79aa0e747b9777077e0a337e99540a52b94b2) Target: i386-apple-darwin17.5.0 Thread model: posix InstalledDir: /Users/buildslave/jenkins/libcxx_libcxxabi_trunk_testing/CI_ARCH/32/CI_EXCEPTIONS/OFF/CI_STD/c++2a/host-compiler/bin "/Users/buildslave/jenkins/libcxx_libcxxabi_trunk_testing/CI_ARCH/32/CI_EXCEPTIONS/OFF/CI_STD/c++2a/host-compiler/bin/clang-10" -cc1 -triple x86_64-apple-macosx10.13.0 -Wdeprecated-objc-isa-usage -Werror=deprecated-objc-isa-usage -emit-obj -mrelax-all -disable-free -main-file-name param_copy.pass.cpp -mrelocation-model pic -pic-level 2 -mthread-model posix -mframe-pointer=all -masm-verbose -munwind-tables -faligned-alloc-unavailable -target-cpu penryn -dwarf-column-info -debugger-tuning=lldb -target-linker-version 409.12 -v -nostdinc++ -resource-dir /Users/buildslave/jenkins/libcxx_libcxxabi_trunk_testing/CI_ARCH/32/CI_EXCEPTIONS/OFF/CI_STD/c++2a/host-compiler/lib/clang/10.0.0 -include /var/folders/9t/lrs73ptj6lv644zvh1fk2_gc0000gn/T/tmp.uRw6ClIN/llvm-build/projects/libcxx/__config_site -include /Users/buildslave/jenkins/libcxx_libcxxabi_trunk_testing/CI_ARCH/32/CI_EXCEPTIONS/OFF/CI_STD/c++2a/llvm-project/libcxx/test/support/nasty_macros.h -isysroot /Applications/Xcode.app/Contents/Developer/Platforms/MacOSX.platform/Developer/SDKs/MacOSX10.13.sdk -D _LIBCPP_DISABLE_AVAILABILITY -I /Users/buildslave/jenkins/libcxx_libcxxabi_trunk_testing/CI_ARCH/32/CI_EXCEPTIONS/OFF/CI_STD/c++2a/llvm-project/libcxx/include -I /var/folders/9t/lrs73ptj6lv644zvh1fk2_gc0000gn/T/tmp.uRw6ClIN/llvm-build/projects/libcxx/include/c++build -I /Users/buildslave/jenkins/libcxx_libcxxabi_trunk_testing/CI_ARCH/32/CI_EXCEPTIONS/OFF/CI_STD/c++2a/llvm-project/libcxx/test/support -D "LIBCXX_FILESYSTEM_STATIC_TEST_ROOT=\"/Users/buildslave/jenkins/libcxx_libcxxabi_trunk_testing/CI_ARCH/32/CI_EXCEPTIONS/OFF/CI_STD/c++2a/llvm-project/libcxx/test/std/input.output/filesystems/Inputs/static_test_env\"" -D "LIBCXX_FILESYSTEM_DYNAMIC_TEST_ROOT=\"/private/var/folders/9t/lrs73ptj6lv644zvh1fk2_gc0000gn/T/tmp.uRw6ClIN/llvm-build/projects/libcxx/test/filesystem/Output/dynamic_env\"" -D "LIBCXX_FILESYSTEM_DYNAMIC_TEST_HELPER=\"/usr/local/opt/python@2/bin/python2.7 /Users/buildslave/jenkins/libcxx_libcxxabi_trunk_testing/CI_ARCH/32/CI_EXCEPTIONS/OFF/CI_STD/c++2a/llvm-project/libcxx/test/support/filesystem_dynamic_test_helper.py\"" -D _LIBCPP_HAS_NO_PRAGMA_SYSTEM_HEADER -stdlib=libc++ -internal-isystem /Applications/Xcode.app/Contents/Developer/Platforms/MacOSX.platform/Developer/SDKs/MacOSX10.13.sdk/usr/local/include -internal-isystem /Users/buildslave/jenkins/libcxx_libcxxabi_trunk_testing/CI_ARCH/32/CI_EXCEPTIONS/OFF/CI_STD/c++2a/host-compiler/lib/clang/10.0.0/include -internal-externc-isystem /Applications/Xcode.app/Contents/Developer/Platforms/MacOSX.platform/Developer/SDKs/MacOSX10.13.sdk/usr/include -Werror=thread-safety -Wno-macro-redefined -Wall -Wextra -Werror -Wuser-defined-warnings -Wshadow -Wno-unused-command-line-argument -Wno-attributes -Wno-constant-evaluated -Wno-pessimizing-move -Wno-c++11-extensions -Wno-user-defined-literals -Wno-noexcept-type -Wsign-compare -Wunused-variable -Wunused-parameter -Wunreachable-code -std=c++2a -fdeprecated-macro -fdebug-compilation-dir /private/var/folders/9t/lrs73ptj6lv644zvh1fk2_gc0000gn/T/tmp.uRw6ClIN/llvm-build/projects/libcxx/test/std/numerics/rand/rand.dis/rand.dist.samp/rand.dist.samp.plinear -ftemplate-depth 270 -ferror-limit 19 -fmessage-length 0 -stack-protector 1 -fblocks -fencode-extended-block-signature -fregister-global-dtors-with-atexit -fgnuc-version=4.2.1 -fno-implicit-modules -fobjc-runtime=macosx-10.13.0 -fmax-type-align=16 -fdiagnostics-show-option -o /private/var/folders/9t/lrs73ptj6lv644zvh1fk2_gc0000gn/T/tmp.uRw6ClIN/llvm-build/projects/libcxx/test/std/numerics/rand/rand.dis/rand.dist.samp/rand.dist.samp.plinear/Output/param_copy.pass.cpp.o -x c++ /Users/buildslave/jenkins/libcxx_libcxxabi_trunk_testing/CI_ARCH/32/CI_EXCEPTIONS/OFF/CI_STD/c++2a/llvm-project/libcxx/test/std/numerics/rand/rand.dis/rand.dist.samp/rand.dist.samp.plinear/param_copy.pass.cpp clang -cc1 version 10.0.0 based upon LLVM 10.0.0git default target x86_64-apple-darwin17.5.0 ignoring nonexistent directory "/Applications/Xcode.app/Contents/Developer/Platforms/MacOSX.platform/Developer/SDKs/MacOSX10.13.sdk/usr/local/include" ignoring nonexistent directory "/Applications/Xcode.app/Contents/Developer/Platforms/MacOSX.platform/Developer/SDKs/MacOSX10.13.sdk/Library/Frameworks" #include "..." search starts here: #include <...> search starts here: /Users/buildslave/jenkins/libcxx_libcxxabi_trunk_testing/CI_ARCH/32/CI_EXCEPTIONS/OFF/CI_STD/c++2a/llvm-project/libcxx/include /var/folders/9t/lrs73ptj6lv644zvh1fk2_gc0000gn/T/tmp.uRw6ClIN/llvm-build/projects/libcxx/include/c++build /Users/buildslave/jenkins/libcxx_libcxxabi_trunk_testing/CI_ARCH/32/CI_EXCEPTIONS/OFF/CI_STD/c++2a/llvm-project/libcxx/test/support /Users/buildslave/jenkins/libcxx_libcxxabi_trunk_testing/CI_ARCH/32/CI_EXCEPTIONS/OFF/CI_STD/c++2a/host-compiler/lib/clang/10.0.0/include /Applications/Xcode.app/Contents/Developer/Platforms/MacOSX.platform/Developer/SDKs/MacOSX10.13.sdk/usr/include /Applications/Xcode.app/Contents/Developer/Platforms/MacOSX.platform/Developer/SDKs/MacOSX10.13.sdk/System/Library/Frameworks (framework directory) End of search list. In file included from /Users/buildslave/jenkins/libcxx_libcxxabi_trunk_testing/CI_ARCH/32/CI_EXCEPTIONS/OFF/CI_STD/c++2a/llvm-project/libcxx/test/std/numerics/rand/rand.dis/rand.dist.samp/rand.dist.samp.plinear/param_copy.pass.cpp:16: /Users/buildslave/jenkins/libcxx_libcxxabi_trunk_testing/CI_ARCH/32/CI_EXCEPTIONS/OFF/CI_STD/c++2a/llvm-project/libcxx/include/random:6431:22: error: definition of implicit copy constructor for 'param_type' is deprecated because it has a user-declared copy assignment operator [-Werror,-Wdeprecated-copy] param_type & operator=(const param_type& __rhs); ^ /Users/buildslave/jenkins/libcxx_libcxxabi_trunk_testing/CI_ARCH/32/CI_EXCEPTIONS/OFF/CI_STD/c++2a/llvm-project/libcxx/test/std/numerics/rand/rand.dis/rand.dist.samp/rand.dist.samp.plinear/param_copy.pass.cpp:31:16: note: in implicit copy constructor for 'std::__1::piecewise_linear_distribution<double>::param_type' first required here P p1 = p0; ^ 1 error generated. --

Hide Details

Compilation failed unexpectedly! ******************** Testing: 0.. 10.. 20.. 30.. 40.. 50.. 60 FAIL: libc++ :: std/numerics/rand/rand.dis/rand.dist.samp/rand.dist.samp.plinear/set_param.pass.cpp (4112 of 6368) ******************** TEST 'libc++ :: std/numerics/rand/rand.dis/rand.dist.samp/rand.dist.samp.plinear/set_param.pass.cpp' FAILED ******************** Command: ['/Users/buildslave/jenkins/libcxx_libcxxabi_trunk_testing/CI_ARCH/32/CI_EXCEPTIONS/OFF/CI_STD/c++2a/host-compiler/bin/clang++', '-o', '/private/var/folders/9t/lrs73ptj6lv644zvh1fk2_gc0000gn/T/tmp.uRw6ClIN/llvm-build/projects/libcxx/test/std/numerics/rand/rand.dis/rand.dist.samp/rand.dist.samp.plinear/Output/set_param.pass.cpp.o', '-x', 'c++', '/Users/buildslave/jenkins/libcxx_libcxxabi_trunk_testing/CI_ARCH/32/CI_EXCEPTIONS/OFF/CI_STD/c++2a/llvm-project/libcxx/test/std/numerics/rand/rand.dis/rand.dist.samp/rand.dist.samp.plinear/set_param.pass.cpp', '-c', '-D_LIBCPP_DISABLE_AVAILABILITY', '-m32', '-v', '-arch', 'x86_64', '-mmacosx-version-min=10.13', '-ftemplate-depth=270', '-Werror=thread-safety', '-std=c++2a', '-Wno-macro-redefined', '-include', '/var/folders/9t/lrs73ptj6lv644zvh1fk2_gc0000gn/T/tmp.uRw6ClIN/llvm-build/projects/libcxx/__config_site', '-include', '/Users/buildslave/jenkins/libcxx_libcxxabi_trunk_testing/CI_ARCH/32/CI_EXCEPTIONS/OFF/CI_STD/c++2a/llvm-project/libcxx/test/support/nasty_macros.h', '-nostdinc++', '-I/Users/buildslave/jenkins/libcxx_libcxxabi_trunk_testing/CI_ARCH/32/CI_EXCEPTIONS/OFF/CI_STD/c++2a/llvm-project/libcxx/include', '-I/var/folders/9t/lrs73ptj6lv644zvh1fk2_gc0000gn/T/tmp.uRw6ClIN/llvm-build/projects/libcxx/include/c++build', '-isysroot', '/Applications/Xcode.app/Contents/Developer/Platforms/MacOSX.platform/Developer/SDKs/MacOSX10.13.sdk', '-fno-exceptions', '-I/Users/buildslave/jenkins/libcxx_libcxxabi_trunk_testing/CI_ARCH/32/CI_EXCEPTIONS/OFF/CI_STD/c++2a/llvm-project/libcxx/test/support', '-DLIBCXX_FILESYSTEM_STATIC_TEST_ROOT="/Users/buildslave/jenkins/libcxx_libcxxabi_trunk_testing/CI_ARCH/32/CI_EXCEPTIONS/OFF/CI_STD/c++2a/llvm-project/libcxx/test/std/input.output/filesystems/Inputs/static_test_env"', '-DLIBCXX_FILESYSTEM_DYNAMIC_TEST_ROOT="/private/var/folders/9t/lrs73ptj6lv644zvh1fk2_gc0000gn/T/tmp.uRw6ClIN/llvm-build/projects/libcxx/test/filesystem/Output/dynamic_env"', '-DLIBCXX_FILESYSTEM_DYNAMIC_TEST_HELPER="/usr/local/opt/python@2/bin/python2.7 /Users/buildslave/jenkins/libcxx_libcxxabi_trunk_testing/CI_ARCH/32/CI_EXCEPTIONS/OFF/CI_STD/c++2a/llvm-project/libcxx/test/support/filesystem_dynamic_test_helper.py"', '-D_LIBCPP_HAS_NO_PRAGMA_SYSTEM_HEADER', '-Wall', '-Wextra', '-Werror', '-Wuser-defined-warnings', '-Wshadow', '-Wno-unused-command-line-argument', '-Wno-attributes', '-Wno-constant-evaluated', '-Wno-pessimizing-move', '-Wno-c++11-extensions', '-Wno-user-defined-literals', '-Wno-noexcept-type', '-Wsign-compare', '-Wunused-variable', '-Wunused-parameter', '-Wunreachable-code', '-c'] Exit Code: 1 Standard Error: -- clang version 10.0.0 (https://github.com/llvm/llvm-project.git acc79aa0e747b9777077e0a337e99540a52b94b2) Target: i386-apple-darwin17.5.0 Thread model: posix InstalledDir: /Users/buildslave/jenkins/libcxx_libcxxabi_trunk_testing/CI_ARCH/32/CI_EXCEPTIONS/OFF/CI_STD/c++2a/host-compiler/bin "/Users/buildslave/jenkins/libcxx_libcxxabi_trunk_testing/CI_ARCH/32/CI_EXCEPTIONS/OFF/CI_STD/c++2a/host-compiler/bin/clang-10" -cc1 -triple x86_64-apple-macosx10.13.0 -Wdeprecated-objc-isa-usage -Werror=deprecated-objc-isa-usage -emit-obj -mrelax-all -disable-free -main-file-name set_param.pass.cpp -mrelocation-model pic -pic-level 2 -mthread-model posix -mframe-pointer=all -masm-verbose -munwind-tables -faligned-alloc-unavailable -target-cpu penryn -dwarf-column-info -debugger-tuning=lldb -target-linker-version 409.12 -v -nostdinc++ -resource-dir /Users/buildslave/jenkins/libcxx_libcxxabi_trunk_testing/CI_ARCH/32/CI_EXCEPTIONS/OFF/CI_STD/c++2a/host-compiler/lib/clang/10.0.0 -include /var/folders/9t/lrs73ptj6lv644zvh1fk2_gc0000gn/T/tmp.uRw6ClIN/llvm-build/projects/libcxx/__config_site -include /Users/buildslave/jenkins/libcxx_libcxxabi_trunk_testing/CI_ARCH/32/CI_EXCEPTIONS/OFF/CI_STD/c++2a/llvm-project/libcxx/test/support/nasty_macros.h -isysroot /Applications/Xcode.app/Contents/Developer/Platforms/MacOSX.platform/Developer/SDKs/MacOSX10.13.sdk -D _LIBCPP_DISABLE_AVAILABILITY -I /Users/buildslave/jenkins/libcxx_libcxxabi_trunk_testing/CI_ARCH/32/CI_EXCEPTIONS/OFF/CI_STD/c++2a/llvm-project/libcxx/include -I /var/folders/9t/lrs73ptj6lv644zvh1fk2_gc0000gn/T/tmp.uRw6ClIN/llvm-build/projects/libcxx/include/c++build -I /Users/buildslave/jenkins/libcxx_libcxxabi_trunk_testing/CI_ARCH/32/CI_EXCEPTIONS/OFF/CI_STD/c++2a/llvm-project/libcxx/test/support -D "LIBCXX_FILESYSTEM_STATIC_TEST_ROOT=\"/Users/buildslave/jenkins/libcxx_libcxxabi_trunk_testing/CI_ARCH/32/CI_EXCEPTIONS/OFF/CI_STD/c++2a/llvm-project/libcxx/test/std/input.output/filesystems/Inputs/static_test_env\"" -D "LIBCXX_FILESYSTEM_DYNAMIC_TEST_ROOT=\"/private/var/folders/9t/lrs73ptj6lv644zvh1fk2_gc0000gn/T/tmp.uRw6ClIN/llvm-build/projects/libcxx/test/filesystem/Output/dynamic_env\"" -D "LIBCXX_FILESYSTEM_DYNAMIC_TEST_HELPER=\"/usr/local/opt/python@2/bin/python2.7 /Users/buildslave/jenkins/libcxx_libcxxabi_trunk_testing/CI_ARCH/32/CI_EXCEPTIONS/OFF/CI_STD/c++2a/llvm-project/libcxx/test/support/filesystem_dynamic_test_helper.py\"" -D _LIBCPP_HAS_NO_PRAGMA_SYSTEM_HEADER -stdlib=libc++ -internal-isystem /Applications/Xcode.app/Contents/Developer/Platforms/MacOSX.platform/Developer/SDKs/MacOSX10.13.sdk/usr/local/include -internal-isystem /Users/buildslave/jenkins/libcxx_libcxxabi_trunk_testing/CI_ARCH/32/CI_EXCEPTIONS/OFF/CI_STD/c++2a/host-compiler/lib/clang/10.0.0/include -internal-externc-isystem /Applications/Xcode.app/Contents/Developer/Platforms/MacOSX.platform/Developer/SDKs/MacOSX10.13.sdk/usr/include -Werror=thread-safety -Wno-macro-redefined -Wall -Wextra -Werror -Wuser-defined-warnings -Wshadow -Wno-unused-command-line-argument -Wno-attributes -Wno-constant-evaluated -Wno-pessimizing-move -Wno-c++11-extensions -Wno-user-defined-literals -Wno-noexcept-type -Wsign-compare -Wunused-variable -Wunused-parameter -Wunreachable-code -std=c++2a -fdeprecated-macro -fdebug-compilation-dir /private/var/folders/9t/lrs73ptj6lv644zvh1fk2_gc0000gn/T/tmp.uRw6ClIN/llvm-build/projects/libcxx/test/std/numerics/rand/rand.dis/rand.dist.samp/rand.dist.samp.plinear -ftemplate-depth 270 -ferror-limit 19 -fmessage-length 0 -stack-protector 1 -fblocks -fencode-extended-block-signature -fregister-global-dtors-with-atexit -fgnuc-version=4.2.1 -fno-implicit-modules -fobjc-runtime=macosx-10.13.0 -fmax-type-align=16 -fdiagnostics-show-option -o /private/var/folders/9t/lrs73ptj6lv644zvh1fk2_gc0000gn/T/tmp.uRw6ClIN/llvm-build/projects/libcxx/test/std/numerics/rand/rand.dis/rand.dist.samp/rand.dist.samp.plinear/Output/set_param.pass.cpp.o -x c++ /Users/buildslave/jenkins/libcxx_libcxxabi_trunk_testing/CI_ARCH/32/CI_EXCEPTIONS/OFF/CI_STD/c++2a/llvm-project/libcxx/test/std/numerics/rand/rand.dis/rand.dist.samp/rand.dist.samp.plinear/set_param.pass.cpp clang -cc1 version 10.0.0 based upon LLVM 10.0.0git default target x86_64-apple-darwin17.5.0 ignoring nonexistent directory "/Applications/Xcode.app/Contents/Developer/Platforms/MacOSX.platform/Developer/SDKs/MacOSX10.13.sdk/usr/local/include" ignoring nonexistent directory "/Applications/Xcode.app/Contents/Developer/Platforms/MacOSX.platform/Developer/SDKs/MacOSX10.13.sdk/Library/Frameworks" #include "..." search starts here: #include <...> search starts here: /Users/buildslave/jenkins/libcxx_libcxxabi_trunk_testing/CI_ARCH/32/CI_EXCEPTIONS/OFF/CI_STD/c++2a/llvm-project/libcxx/include /var/folders/9t/lrs73ptj6lv644zvh1fk2_gc0000gn/T/tmp.uRw6ClIN/llvm-build/projects/libcxx/include/c++build /Users/buildslave/jenkins/libcxx_libcxxabi_trunk_testing/CI_ARCH/32/CI_EXCEPTIONS/OFF/CI_STD/c++2a/llvm-project/libcxx/test/support /Users/buildslave/jenkins/libcxx_libcxxabi_trunk_testing/CI_ARCH/32/CI_EXCEPTIONS/OFF/CI_STD/c++2a/host-compiler/lib/clang/10.0.0/include /Applications/Xcode.app/Contents/Developer/Platforms/MacOSX.platform/Developer/SDKs/MacOSX10.13.sdk/usr/include /Applications/Xcode.app/Contents/Developer/Platforms/MacOSX.platform/Developer/SDKs/MacOSX10.13.sdk/System/Library/Frameworks (framework directory) End of search list. In file included from /Users/buildslave/jenkins/libcxx_libcxxabi_trunk_testing/CI_ARCH/32/CI_EXCEPTIONS/OFF/CI_STD/c++2a/llvm-project/libcxx/test/std/numerics/rand/rand.dis/rand.dist.samp/rand.dist.samp.plinear/set_param.pass.cpp:16: /Users/buildslave/jenkins/libcxx_libcxxabi_trunk_testing/CI_ARCH/32/CI_EXCEPTIONS/OFF/CI_STD/c++2a/llvm-project/libcxx/include/random:6431:22: error: definition of implicit copy constructor for 'param_type' is deprecated because it has a user-declared copy assignment operator [-Werror,-Wdeprecated-copy] param_type & operator=(const param_type& __rhs); ^ /Users/buildslave/jenkins/libcxx_libcxxabi_trunk_testing/CI_ARCH/32/CI_EXCEPTIONS/OFF/CI_STD/c++2a/llvm-project/libcxx/include/random:6512:38: note: in implicit copy constructor for 'std::__1::piecewise_linear_distribution<double>::param_type' first required here param_type param() const {return __p_;} ^ /Users/buildslave/jenkins/libcxx_libcxxabi_trunk_testing/CI_ARCH/32/CI_EXCEPTIONS/OFF/CI_STD/c++2a/llvm-project/libcxx/test/std/numerics/rand/rand.dis/rand.dist.samp/rand.dist.samp.plinear/set_param.pass.cpp:31:18: note: in instantiation of member function 'std::__1::piecewise_linear_distribution<double>::param' requested here assert(d.param() == pa); ^ 1 error generated. --

Hide Details

Compilation failed unexpectedly! ******************** Testing: 0.. 10.. 20.. 30.. 40.. 50.. 60.. 70.. 80.. 90..

Hide Details

Testing Time: 1913.34s ******************** Failing Tests (456): libc++ :: libcxx/containers/gnu_cxx/hash_map_name_lookup.pass.cpp libc++ :: libcxx/containers/gnu_cxx/hash_set_name_lookup.pass.cpp libc++ :: libcxx/containers/unord/next_pow2.pass.cpp libc++ :: libcxx/debug/containers/db_associative_container_tests.pass.cpp libc++ :: libcxx/debug/containers/db_sequence_container_iterators.pass.cpp libc++ :: libcxx/debug/containers/db_unord_container_tests.pass.cpp libc++ :: std/containers/associative/map/compare.pass.cpp libc++ :: std/containers/associative/map/contains.pass.cpp libc++ :: std/containers/associative/map/map.access/at.pass.cpp libc++ :: std/containers/associative/map/map.access/empty.pass.cpp libc++ :: std/containers/associative/map/map.access/index_key.pass.cpp libc++ :: std/containers/associative/map/map.access/index_rv_key.pass.cpp libc++ :: std/containers/associative/map/map.access/index_tuple.pass.cpp libc++ :: std/containers/associative/map/map.access/iterator.pass.cpp libc++ :: std/containers/associative/map/map.access/size.pass.cpp libc++ :: std/containers/associative/map/map.cons/assign_initializer_list.pass.cpp libc++ :: std/containers/associative/map/map.cons/copy.pass.cpp libc++ :: std/containers/associative/map/map.cons/copy_alloc.pass.cpp libc++ :: std/containers/associative/map/map.cons/copy_assign.pass.cpp libc++ :: std/containers/associative/map/map.cons/deduct.pass.cpp libc++ :: std/containers/associative/map/map.cons/deduct_const.pass.cpp libc++ :: std/containers/associative/map/map.cons/initializer_list.pass.cpp libc++ :: std/containers/associative/map/map.cons/initializer_list_compare.pass.cpp libc++ :: std/containers/associative/map/map.cons/initializer_list_compare_alloc.pass.cpp libc++ :: std/containers/associative/map/map.cons/iter_iter.pass.cpp libc++ :: std/containers/associative/map/map.cons/iter_iter_comp.pass.cpp libc++ :: std/containers/associative/map/map.cons/iter_iter_comp_alloc.pass.cpp libc++ :: std/containers/associative/map/map.cons/move.pass.cpp libc++ :: std/containers/associative/map/map.cons/move_alloc.pass.cpp libc++ :: std/containers/associative/map/map.cons/move_assign.pass.cpp libc++ :: std/containers/associative/map/map.erasure/erase_if.pass.cpp libc++ :: std/containers/associative/map/map.modifiers/clear.pass.cpp libc++ :: std/containers/associative/map/map.modifiers/emplace.pass.cpp libc++ :: std/containers/associative/map/map.modifiers/emplace_hint.pass.cpp libc++ :: std/containers/associative/map/map.modifiers/erase_iter.pass.cpp libc++ :: std/containers/associative/map/map.modifiers/erase_iter_iter.pass.cpp libc++ :: std/containers/associative/map/map.modifiers/erase_key.pass.cpp libc++ :: std/containers/associative/map/map.modifiers/extract_iterator.pass.cpp libc++ :: std/containers/associative/map/map.modifiers/extract_key.pass.cpp libc++ :: std/containers/associative/map/map.modifiers/insert_and_emplace_allocator_requirements.pass.cpp libc++ :: std/containers/associative/map/map.modifiers/insert_cv.pass.cpp libc++ :: std/containers/associative/map/map.modifiers/insert_initializer_list.pass.cpp libc++ :: std/containers/associative/map/map.modifiers/insert_iter_cv.pass.cpp libc++ :: std/containers/associative/map/map.modifiers/insert_iter_iter.pass.cpp libc++ :: std/containers/associative/map/map.modifiers/insert_iter_rv.pass.cpp libc++ :: std/containers/associative/map/map.modifiers/insert_node_type.pass.cpp libc++ :: std/containers/associative/map/map.modifiers/insert_node_type_hint.pass.cpp libc++ :: std/containers/associative/map/map.modifiers/insert_or_assign.pass.cpp libc++ :: std/containers/associative/map/map.modifiers/insert_rv.pass.cpp libc++ :: std/containers/associative/map/map.modifiers/merge.pass.cpp libc++ :: std/containers/associative/map/map.modifiers/try.emplace.pass.cpp libc++ :: std/containers/associative/map/map.ops/count.pass.cpp libc++ :: std/containers/associative/map/map.ops/count_transparent.pass.cpp libc++ :: std/containers/associative/map/map.ops/equal_range.pass.cpp libc++ :: std/containers/associative/map/map.ops/equal_range_transparent.pass.cpp libc++ :: std/containers/associative/map/map.ops/find.pass.cpp libc++ :: std/containers/associative/map/map.ops/lower_bound.pass.cpp libc++ :: std/containers/associative/map/map.ops/upper_bound.pass.cpp libc++ :: std/containers/associative/map/map.special/member_swap.pass.cpp libc++ :: std/containers/associative/map/map.special/non_member_swap.pass.cpp libc++ :: std/containers/associative/multimap/empty.pass.cpp libc++ :: std/containers/associative/multimap/iterator.pass.cpp libc++ :: std/containers/associative/multimap/multimap.cons/assign_initializer_list.pass.cpp libc++ :: std/containers/associative/multimap/multimap.cons/copy.pass.cpp libc++ :: std/containers/associative/multimap/multimap.cons/copy_alloc.pass.cpp libc++ :: std/containers/associative/multimap/multimap.cons/copy_assign.pass.cpp libc++ :: std/containers/associative/multimap/multimap.cons/deduct.pass.cpp libc++ :: std/containers/associative/multimap/multimap.cons/deduct_const.pass.cpp libc++ :: std/containers/associative/multimap/multimap.cons/initializer_list.pass.cpp libc++ :: std/containers/associative/multimap/multimap.cons/initializer_list_compare.pass.cpp libc++ :: std/containers/associative/multimap/multimap.cons/initializer_list_compare_alloc.pass.cpp libc++ :: std/containers/associative/multimap/multimap.cons/iter_iter.pass.cpp libc++ :: std/containers/associative/multimap/multimap.cons/iter_iter_comp.pass.cpp libc++ :: std/containers/associative/multimap/multimap.cons/iter_iter_comp_alloc.pass.cpp libc++ :: std/containers/associative/multimap/multimap.cons/move.pass.cpp libc++ :: std/containers/associative/multimap/multimap.cons/move_alloc.pass.cpp libc++ :: std/containers/associative/multimap/multimap.cons/move_assign.pass.cpp libc++ :: std/containers/associative/multimap/multimap.erasure/erase_if.pass.cpp libc++ :: std/containers/associative/multimap/multimap.modifiers/clear.pass.cpp libc++ :: std/containers/associative/multimap/multimap.modifiers/emplace.pass.cpp libc++ :: std/containers/associative/multimap/multimap.modifiers/emplace_hint.pass.cpp libc++ :: std/containers/associative/multimap/multimap.modifiers/erase_iter.pass.cpp libc++ :: std/containers/associative/multimap/multimap.modifiers/erase_iter_iter.pass.cpp libc++ :: std/containers/associative/multimap/multimap.modifiers/erase_key.pass.cpp libc++ :: std/containers/associative/multimap/multimap.modifiers/extract_iterator.pass.cpp libc++ :: std/containers/associative/multimap/multimap.modifiers/extract_key.pass.cpp libc++ :: std/containers/associative/multimap/multimap.modifiers/insert_allocator_requirements.pass.cpp libc++ :: std/containers/associative/multimap/multimap.modifiers/insert_cv.pass.cpp libc++ :: std/containers/associative/multimap/multimap.modifiers/insert_initializer_list.pass.cpp libc++ :: std/containers/associative/multimap/multimap.modifiers/insert_iter_cv.pass.cpp libc++ :: std/containers/associative/multimap/multimap.modifiers/insert_iter_iter.pass.cpp libc++ :: std/containers/associative/multimap/multimap.modifiers/insert_iter_rv.pass.cpp libc++ :: std/containers/associative/multimap/multimap.modifiers/insert_node_type.pass.cpp libc++ :: std/containers/associative/multimap/multimap.modifiers/insert_node_type_hint.pass.cpp libc++ :: std/containers/associative/multimap/multimap.modifiers/insert_rv.pass.cpp libc++ :: std/containers/associative/multimap/multimap.modifiers/merge.pass.cpp libc++ :: std/containers/associative/multimap/multimap.ops/count.pass.cpp libc++ :: std/containers/associative/multimap/multimap.ops/count_transparent.pass.cpp libc++ :: std/containers/associative/multimap/multimap.ops/equal_range.pass.cpp libc++ :: std/containers/associative/multimap/multimap.ops/equal_range_transparent.pass.cpp libc++ :: std/containers/associative/multimap/multimap.ops/find.pass.cpp libc++ :: std/containers/associative/multimap/multimap.ops/lower_bound.pass.cpp libc++ :: std/containers/associative/multimap/multimap.ops/upper_bound.pass.cpp libc++ :: std/containers/associative/multimap/multimap.special/member_swap.pass.cpp libc++ :: std/containers/associative/multimap/multimap.special/non_member_swap.pass.cpp libc++ :: std/containers/associative/multimap/size.pass.cpp libc++ :: std/containers/associative/multiset/clear.pass.cpp libc++ :: std/containers/associative/multiset/count.pass.cpp libc++ :: std/containers/associative/multiset/count_transparent.pass.cpp libc++ :: std/containers/associative/multiset/emplace.pass.cpp libc++ :: std/containers/associative/multiset/emplace_hint.pass.cpp libc++ :: std/containers/associative/multiset/empty.pass.cpp libc++ :: std/containers/associative/multiset/equal_range.pass.cpp libc++ :: std/containers/associative/multiset/equal_range_transparent.pass.cpp libc++ :: std/containers/associative/multiset/erase_iter.pass.cpp libc++ :: std/containers/associative/multiset/erase_iter_iter.pass.cpp libc++ :: std/containers/associative/multiset/erase_key.pass.cpp libc++ :: std/containers/associative/multiset/extract_iterator.pass.cpp libc++ :: std/containers/associative/multiset/extract_key.pass.cpp libc++ :: std/containers/associative/multiset/find.pass.cpp libc++ :: std/containers/associative/multiset/insert_cv.pass.cpp libc++ :: std/containers/associative/multiset/insert_emplace_allocator_requirements.pass.cpp libc++ :: std/containers/associative/multiset/insert_initializer_list.pass.cpp libc++ :: std/containers/associative/multiset/insert_iter_cv.pass.cpp libc++ :: std/containers/associative/multiset/insert_iter_iter.pass.cpp libc++ :: std/containers/associative/multiset/insert_iter_rv.pass.cpp libc++ :: std/containers/associative/multiset/insert_node_type.pass.cpp libc++ :: std/containers/associative/multiset/insert_node_type_hint.pass.cpp libc++ :: std/containers/associative/multiset/insert_rv.pass.cpp libc++ :: std/containers/associative/multiset/iterator.pass.cpp libc++ :: std/containers/associative/multiset/lower_bound.pass.cpp libc++ :: std/containers/associative/multiset/merge.pass.cpp libc++ :: std/containers/associative/multiset/multiset.cons/assign_initializer_list.pass.cpp libc++ :: std/containers/associative/multiset/multiset.cons/copy.pass.cpp libc++ :: std/containers/associative/multiset/multiset.cons/copy_alloc.pass.cpp libc++ :: std/containers/associative/multiset/multiset.cons/copy_assign.pass.cpp libc++ :: std/containers/associative/multiset/multiset.cons/deduct.pass.cpp libc++ :: std/containers/associative/multiset/multiset.cons/initializer_list.pass.cpp libc++ :: std/containers/associative/multiset/multiset.cons/initializer_list_compare.pass.cpp libc++ :: std/containers/associative/multiset/multiset.cons/initializer_list_compare_alloc.pass.cpp libc++ :: std/containers/associative/multiset/multiset.cons/iter_iter.pass.cpp libc++ :: std/containers/associative/multiset/multiset.cons/iter_iter_alloc.pass.cpp libc++ :: std/containers/associative/multiset/multiset.cons/iter_iter_comp.pass.cpp libc++ :: std/containers/associative/multiset/multiset.cons/move.pass.cpp libc++ :: std/containers/associative/multiset/multiset.cons/move_alloc.pass.cpp libc++ :: std/containers/associative/multiset/multiset.cons/move_assign.pass.cpp libc++ :: std/containers/associative/multiset/multiset.erasure/erase_if.pass.cpp libc++ :: std/containers/associative/multiset/multiset.special/member_swap.pass.cpp libc++ :: std/containers/associative/multiset/multiset.special/non_member_swap.pass.cpp libc++ :: std/containers/associative/multiset/size.pass.cpp libc++ :: std/containers/associative/multiset/upper_bound.pass.cpp libc++ :: std/containers/associative/set/clear.pass.cpp libc++ :: std/containers/associative/set/contains.pass.cpp libc++ :: std/containers/associative/set/count.pass.cpp libc++ :: std/containers/associative/set/count_transparent.pass.cpp libc++ :: std/containers/associative/set/emplace.pass.cpp libc++ :: std/containers/associative/set/emplace_hint.pass.cpp libc++ :: std/containers/associative/set/empty.pass.cpp libc++ :: std/containers/associative/set/equal_range.pass.cpp libc++ :: std/containers/associative/set/equal_range_transparent.pass.cpp libc++ :: std/containers/associative/set/erase_iter.pass.cpp libc++ :: std/containers/associative/set/erase_iter_iter.pass.cpp libc++ :: std/containers/associative/set/erase_key.pass.cpp libc++ :: std/containers/associative/set/extract_iterator.pass.cpp libc++ :: std/containers/associative/set/extract_key.pass.cpp libc++ :: std/containers/associative/set/find.pass.cpp libc++ :: std/containers/associative/set/insert_and_emplace_allocator_requirements.pass.cpp libc++ :: std/containers/associative/set/insert_cv.pass.cpp libc++ :: std/containers/associative/set/insert_initializer_list.pass.cpp libc++ :: std/containers/associative/set/insert_iter_cv.pass.cpp libc++ :: std/containers/associative/set/insert_iter_iter.pass.cpp libc++ :: std/containers/associative/set/insert_iter_rv.pass.cpp libc++ :: std/containers/associative/set/insert_node_type.pass.cpp libc++ :: std/containers/associative/set/insert_node_type_hint.pass.cpp libc++ :: std/containers/associative/set/insert_rv.pass.cpp libc++ :: std/containers/associative/set/iterator.pass.cpp libc++ :: std/containers/associative/set/lower_bound.pass.cpp libc++ :: std/containers/associative/set/merge.pass.cpp libc++ :: std/containers/associative/set/set.cons/assign_initializer_list.pass.cpp libc++ :: std/containers/associative/set/set.cons/copy.pass.cpp libc++ :: std/containers/associative/set/set.cons/copy_alloc.pass.cpp libc++ :: std/containers/associative/set/set.cons/copy_assign.pass.cpp libc++ :: std/containers/associative/set/set.cons/deduct.pass.cpp libc++ :: std/containers/associative/set/set.cons/initializer_list.pass.cpp libc++ :: std/containers/associative/set/set.cons/initializer_list_compare.pass.cpp libc++ :: std/containers/associative/set/set.cons/initializer_list_compare_alloc.pass.cpp libc++ :: std/containers/associative/set/set.cons/iter_iter.pass.cpp libc++ :: std/containers/associative/set/set.cons/iter_iter_alloc.pass.cpp libc++ :: std/containers/associative/set/set.cons/iter_iter_comp.pass.cpp libc++ :: std/containers/associative/set/set.cons/move.pass.cpp libc++ :: std/containers/associative/set/set.cons/move_alloc.pass.cpp libc++ :: std/containers/associative/set/set.cons/move_assign.pass.cpp libc++ :: std/containers/associative/set/set.erasure/erase_if.pass.cpp libc++ :: std/containers/associative/set/set.special/member_swap.pass.cpp libc++ :: std/containers/associative/set/set.special/non_member_swap.pass.cpp libc++ :: std/containers/associative/set/size.pass.cpp libc++ :: std/containers/associative/set/upper_bound.pass.cpp libc++ :: std/containers/container.node/node_handle.pass.cpp libc++ :: std/containers/sequences/vector.bool/emplace.pass.cpp libc++ :: std/containers/sequences/vector.bool/erase_iter.pass.cpp libc++ :: std/containers/sequences/vector.bool/insert_iter_initializer_list.pass.cpp libc++ :: std/containers/sequences/vector.bool/insert_iter_iter_iter.pass.cpp libc++ :: std/containers/sequences/vector.bool/insert_iter_size_value.pass.cpp libc++ :: std/containers/sequences/vector.bool/insert_iter_value.pass.cpp libc++ :: std/containers/sequences/vector.bool/reference.swap.pass.cpp libc++ :: std/containers/sequences/vector.bool/resize_size.pass.cpp libc++ :: std/containers/sequences/vector.bool/resize_size_value.pass.cpp libc++ :: std/containers/sequences/vector.bool/swap.pass.cpp libc++ :: std/containers/unord/unord.map/bucket.pass.cpp libc++ :: std/containers/unord/unord.map/bucket_count.pass.cpp libc++ :: std/containers/unord/unord.map/bucket_size.pass.cpp libc++ :: std/containers/unord/unord.map/compare.pass.cpp libc++ :: std/containers/unord/unord.map/contains.pass.cpp libc++ :: std/containers/unord/unord.map/count.pass.cpp libc++ :: std/containers/unord/unord.map/empty.pass.cpp libc++ :: std/containers/unord/unord.map/eq.pass.cpp libc++ :: std/containers/unord/unord.map/equal_range_const.pass.cpp libc++ :: std/containers/unord/unord.map/equal_range_non_const.pass.cpp libc++ :: std/containers/unord/unord.map/erase_if.pass.cpp libc++ :: std/containers/unord/unord.map/find_const.pass.cpp libc++ :: std/containers/unord/unord.map/find_non_const.pass.cpp libc++ :: std/containers/unord/unord.map/iterators.pass.cpp libc++ :: std/containers/unord/unord.map/load_factor.pass.cpp libc++ :: std/containers/unord/unord.map/local_iterators.pass.cpp libc++ :: std/containers/unord/unord.map/rehash.pass.cpp libc++ :: std/containers/unord/unord.map/reserve.pass.cpp libc++ :: std/containers/unord/unord.map/size.pass.cpp libc++ :: std/containers/unord/unord.map/swap_member.pass.cpp libc++ :: std/containers/unord/unord.map/unord.map.cnstr/assign_copy.pass.cpp libc++ :: std/containers/unord/unord.map/unord.map.cnstr/assign_init.pass.cpp libc++ :: std/containers/unord/unord.map/unord.map.cnstr/assign_move.pass.cpp libc++ :: std/containers/unord/unord.map/unord.map.cnstr/copy.pass.cpp libc++ :: std/containers/unord/unord.map/unord.map.cnstr/copy_alloc.pass.cpp libc++ :: std/containers/unord/unord.map/unord.map.cnstr/deduct.pass.cpp libc++ :: std/containers/unord/unord.map/unord.map.cnstr/deduct_const.pass.cpp libc++ :: std/containers/unord/unord.map/unord.map.cnstr/init.pass.cpp libc++ :: std/containers/unord/unord.map/unord.map.cnstr/init_size.pass.cpp libc++ :: std/containers/unord/unord.map/unord.map.cnstr/init_size_hash.pass.cpp libc++ :: std/containers/unord/unord.map/unord.map.cnstr/init_size_hash_equal.pass.cpp libc++ :: std/containers/unord/unord.map/unord.map.cnstr/init_size_hash_equal_allocator.pass.cpp libc++ :: std/containers/unord/unord.map/unord.map.cnstr/move.pass.cpp libc++ :: std/containers/unord/unord.map/unord.map.cnstr/move_alloc.pass.cpp libc++ :: std/containers/unord/unord.map/unord.map.cnstr/range.pass.cpp libc++ :: std/containers/unord/unord.map/unord.map.cnstr/range_size.pass.cpp libc++ :: std/containers/unord/unord.map/unord.map.cnstr/range_size_hash.pass.cpp libc++ :: std/containers/unord/unord.map/unord.map.cnstr/range_size_hash_equal.pass.cpp libc++ :: std/containers/unord/unord.map/unord.map.cnstr/range_size_hash_equal_allocator.pass.cpp libc++ :: std/containers/unord/unord.map/unord.map.elem/at.pass.cpp libc++ :: std/containers/unord/unord.map/unord.map.elem/index.pass.cpp libc++ :: std/containers/unord/unord.map/unord.map.elem/index_tuple.pass.cpp libc++ :: std/containers/unord/unord.map/unord.map.modifiers/clear.pass.cpp libc++ :: std/containers/unord/unord.map/unord.map.modifiers/emplace.pass.cpp libc++ :: std/containers/unord/unord.map/unord.map.modifiers/emplace_hint.pass.cpp libc++ :: std/containers/unord/unord.map/unord.map.modifiers/erase_const_iter.pass.cpp libc++ :: std/containers/unord/unord.map/unord.map.modifiers/erase_key.pass.cpp libc++ :: std/containers/unord/unord.map/unord.map.modifiers/erase_range.pass.cpp libc++ :: std/containers/unord/unord.map/unord.map.modifiers/extract_iterator.pass.cpp libc++ :: std/containers/unord/unord.map/unord.map.modifiers/extract_key.pass.cpp libc++ :: std/containers/unord/unord.map/unord.map.modifiers/insert_and_emplace_allocator_requirements.pass.cpp libc++ :: std/containers/unord/unord.map/unord.map.modifiers/insert_const_lvalue.pass.cpp libc++ :: std/containers/unord/unord.map/unord.map.modifiers/insert_hint_const_lvalue.pass.cpp libc++ :: std/containers/unord/unord.map/unord.map.modifiers/insert_hint_rvalue.pass.cpp libc++ :: std/containers/unord/unord.map/unord.map.modifiers/insert_init.pass.cpp libc++ :: std/containers/unord/unord.map/unord.map.modifiers/insert_node_type.pass.cpp libc++ :: std/containers/unord/unord.map/unord.map.modifiers/insert_node_type_hint.pass.cpp libc++ :: std/containers/unord/unord.map/unord.map.modifiers/insert_or_assign.pass.cpp libc++ :: std/containers/unord/unord.map/unord.map.modifiers/insert_range.pass.cpp libc++ :: std/containers/unord/unord.map/unord.map.modifiers/insert_rvalue.pass.cpp libc++ :: std/containers/unord/unord.map/unord.map.modifiers/merge.pass.cpp libc++ :: std/containers/unord/unord.map/unord.map.modifiers/try.emplace.pass.cpp libc++ :: std/containers/unord/unord.map/unord.map.swap/swap_non_member.pass.cpp libc++ :: std/containers/unord/unord.multimap/bucket.pass.cpp libc++ :: std/containers/unord/unord.multimap/bucket_count.pass.cpp libc++ :: std/containers/unord/unord.multimap/bucket_size.pass.cpp libc++ :: std/containers/unord/unord.multimap/count.pass.cpp libc++ :: std/containers/unord/unord.multimap/empty.pass.cpp libc++ :: std/containers/unord/unord.multimap/eq.pass.cpp libc++ :: std/containers/unord/unord.multimap/equal_range_const.pass.cpp libc++ :: std/containers/unord/unord.multimap/equal_range_non_const.pass.cpp libc++ :: std/containers/unord/unord.multimap/erase_if.pass.cpp libc++ :: std/containers/unord/unord.multimap/find_const.pass.cpp libc++ :: std/containers/unord/unord.multimap/find_non_const.pass.cpp libc++ :: std/containers/unord/unord.multimap/iterators.pass.cpp libc++ :: std/containers/unord/unord.multimap/load_factor.pass.cpp libc++ :: std/containers/unord/unord.multimap/local_iterators.pass.cpp libc++ :: std/containers/unord/unord.multimap/rehash.pass.cpp libc++ :: std/containers/unord/unord.multimap/reserve.pass.cpp libc++ :: std/containers/unord/unord.multimap/size.pass.cpp libc++ :: std/containers/unord/unord.multimap/swap_member.pass.cpp libc++ :: std/containers/unord/unord.multimap/unord.multimap.cnstr/assign_copy.pass.cpp libc++ :: std/containers/unord/unord.multimap/unord.multimap.cnstr/assign_init.pass.cpp libc++ :: std/containers/unord/unord.multimap/unord.multimap.cnstr/assign_move.pass.cpp libc++ :: std/containers/unord/unord.multimap/unord.multimap.cnstr/copy.pass.cpp libc++ :: std/containers/unord/unord.multimap/unord.multimap.cnstr/copy_alloc.pass.cpp libc++ :: std/containers/unord/unord.multimap/unord.multimap.cnstr/deduct.pass.cpp libc++ :: std/containers/unord/unord.multimap/unord.multimap.cnstr/deduct_const.pass.cpp libc++ :: std/containers/unord/unord.multimap/unord.multimap.cnstr/init.pass.cpp libc++ :: std/containers/unord/unord.multimap/unord.multimap.cnstr/init_size.pass.cpp libc++ :: std/containers/unord/unord.multimap/unord.multimap.cnstr/init_size_hash.pass.cpp libc++ :: std/containers/unord/unord.multimap/unord.multimap.cnstr/init_size_hash_equal.pass.cpp libc++ :: std/containers/unord/unord.multimap/unord.multimap.cnstr/init_size_hash_equal_allocator.pass.cpp libc++ :: std/containers/unord/unord.multimap/unord.multimap.cnstr/move.pass.cpp libc++ :: std/containers/unord/unord.multimap/unord.multimap.cnstr/move_alloc.pass.cpp libc++ :: std/containers/unord/unord.multimap/unord.multimap.cnstr/range.pass.cpp libc++ :: std/containers/unord/unord.multimap/unord.multimap.cnstr/range_size.pass.cpp libc++ :: std/containers/unord/unord.multimap/unord.multimap.cnstr/range_size_hash.pass.cpp libc++ :: std/containers/unord/unord.multimap/unord.multimap.cnstr/range_size_hash_equal.pass.cpp libc++ :: std/containers/unord/unord.multimap/unord.multimap.cnstr/range_size_hash_equal_allocator.pass.cpp libc++ :: std/containers/unord/unord.multimap/unord.multimap.modifiers/clear.pass.cpp libc++ :: std/containers/unord/unord.multimap/unord.multimap.modifiers/emplace.pass.cpp libc++ :: std/containers/unord/unord.multimap/unord.multimap.modifiers/emplace_hint.pass.cpp libc++ :: std/containers/unord/unord.multimap/unord.multimap.modifiers/erase_const_iter.pass.cpp libc++ :: std/containers/unord/unord.multimap/unord.multimap.modifiers/erase_key.pass.cpp libc++ :: std/containers/unord/unord.multimap/unord.multimap.modifiers/erase_range.pass.cpp libc++ :: std/containers/unord/unord.multimap/unord.multimap.modifiers/extract_iterator.pass.cpp libc++ :: std/containers/unord/unord.multimap/unord.multimap.modifiers/extract_key.pass.cpp libc++ :: std/containers/unord/unord.multimap/unord.multimap.modifiers/insert_allocator_requirements.pass.cpp libc++ :: std/containers/unord/unord.multimap/unord.multimap.modifiers/insert_const_lvalue.pass.cpp libc++ :: std/containers/unord/unord.multimap/unord.multimap.modifiers/insert_hint_const_lvalue.pass.cpp libc++ :: std/containers/unord/unord.multimap/unord.multimap.modifiers/insert_hint_rvalue.pass.cpp libc++ :: std/containers/unord/unord.multimap/unord.multimap.modifiers/insert_init.pass.cpp libc++ :: std/containers/unord/unord.multimap/unord.multimap.modifiers/insert_node_type.pass.cpp libc++ :: std/containers/unord/unord.multimap/unord.multimap.modifiers/insert_node_type_hint.pass.cpp libc++ :: std/containers/unord/unord.multimap/unord.multimap.modifiers/insert_range.pass.cpp libc++ :: std/containers/unord/unord.multimap/unord.multimap.modifiers/insert_rvalue.pass.cpp libc++ :: std/containers/unord/unord.multimap/unord.multimap.modifiers/merge.pass.cpp libc++ :: std/containers/unord/unord.multimap/unord.multimap.swap/swap_non_member.pass.cpp libc++ :: std/containers/unord/unord.multiset/bucket.pass.cpp libc++ :: std/containers/unord/unord.multiset/bucket_count.pass.cpp libc++ :: std/containers/unord/unord.multiset/bucket_size.pass.cpp libc++ :: std/containers/unord/unord.multiset/clear.pass.cpp libc++ :: std/containers/unord/unord.multiset/count.pass.cpp libc++ :: std/containers/unord/unord.multiset/emplace.pass.cpp libc++ :: std/containers/unord/unord.multiset/emplace_hint.pass.cpp libc++ :: std/containers/unord/unord.multiset/empty.pass.cpp libc++ :: std/containers/unord/unord.multiset/eq.pass.cpp libc++ :: std/containers/unord/unord.multiset/equal_range_const.pass.cpp libc++ :: std/containers/unord/unord.multiset/equal_range_non_const.pass.cpp libc++ :: std/containers/unord/unord.multiset/erase_const_iter.pass.cpp libc++ :: std/containers/unord/unord.multiset/erase_if.pass.cpp libc++ :: std/containers/unord/unord.multiset/erase_key.pass.cpp libc++ :: std/containers/unord/unord.multiset/erase_range.pass.cpp libc++ :: std/containers/unord/unord.multiset/extract_iterator.pass.cpp libc++ :: std/containers/unord/unord.multiset/extract_key.pass.cpp libc++ :: std/containers/unord/unord.multiset/find_const.pass.cpp libc++ :: std/containers/unord/unord.multiset/find_non_const.pass.cpp libc++ :: std/containers/unord/unord.multiset/insert_const_lvalue.pass.cpp libc++ :: std/containers/unord/unord.multiset/insert_emplace_allocator_requirements.pass.cpp libc++ :: std/containers/unord/unord.multiset/insert_hint_const_lvalue.pass.cpp libc++ :: std/containers/unord/unord.multiset/insert_hint_rvalue.pass.cpp libc++ :: std/containers/unord/unord.multiset/insert_init.pass.cpp libc++ :: std/containers/unord/unord.multiset/insert_node_type.pass.cpp libc++ :: std/containers/unord/unord.multiset/insert_node_type_hint.pass.cpp libc++ :: std/containers/unord/unord.multiset/insert_range.pass.cpp libc++ :: std/containers/unord/unord.multiset/insert_rvalue.pass.cpp libc++ :: std/containers/unord/unord.multiset/iterators.pass.cpp libc++ :: std/containers/unord/unord.multiset/load_factor.pass.cpp libc++ :: std/containers/unord/unord.multiset/local_iterators.pass.cpp libc++ :: std/containers/unord/unord.multiset/merge.pass.cpp libc++ :: std/containers/unord/unord.multiset/rehash.pass.cpp libc++ :: std/containers/unord/unord.multiset/reserve.pass.cpp libc++ :: std/containers/unord/unord.multiset/size.pass.cpp libc++ :: std/containers/unord/unord.multiset/swap_member.pass.cpp libc++ :: std/containers/unord/unord.multiset/unord.multiset.cnstr/assign_copy.pass.cpp libc++ :: std/containers/unord/unord.multiset/unord.multiset.cnstr/assign_init.pass.cpp libc++ :: std/containers/unord/unord.multiset/unord.multiset.cnstr/assign_move.pass.cpp libc++ :: std/containers/unord/unord.multiset/unord.multiset.cnstr/copy.pass.cpp libc++ :: std/containers/unord/unord.multiset/unord.multiset.cnstr/copy_alloc.pass.cpp libc++ :: std/containers/unord/unord.multiset/unord.multiset.cnstr/deduct.pass.cpp libc++ :: std/containers/unord/unord.multiset/unord.multiset.cnstr/init.pass.cpp libc++ :: std/containers/unord/unord.multiset/unord.multiset.cnstr/init_size.pass.cpp libc++ :: std/containers/unord/unord.multiset/unord.multiset.cnstr/init_size_hash.pass.cpp libc++ :: std/containers/unord/unord.multiset/unord.multiset.cnstr/init_size_hash_equal.pass.cpp libc++ :: std/containers/unord/unord.multiset/unord.multiset.cnstr/init_size_hash_equal_allocator.pass.cpp libc++ :: std/containers/unord/unord.multiset/unord.multiset.cnstr/move.pass.cpp libc++ :: std/containers/unord/unord.multiset/unord.multiset.cnstr/move_alloc.pass.cpp libc++ :: std/containers/unord/unord.multiset/unord.multiset.cnstr/range.pass.cpp libc++ :: std/containers/unord/unord.multiset/unord.multiset.cnstr/range_size.pass.cpp libc++ :: std/containers/unord/unord.multiset/unord.multiset.cnstr/range_size_hash.pass.cpp libc++ :: std/containers/unord/unord.multiset/unord.multiset.cnstr/range_size_hash_equal.pass.cpp libc++ :: std/containers/unord/unord.multiset/unord.multiset.cnstr/range_size_hash_equal_allocator.pass.cpp libc++ :: std/containers/unord/unord.multiset/unord.multiset.swap/swap_non_member.pass.cpp libc++ :: std/containers/unord/unord.set/bucket.pass.cpp libc++ :: std/containers/unord/unord.set/bucket_count.pass.cpp libc++ :: std/containers/unord/unord.set/bucket_size.pass.cpp libc++ :: std/containers/unord/unord.set/clear.pass.cpp libc++ :: std/containers/unord/unord.set/contains.pass.cpp libc++ :: std/containers/unord/unord.set/count.pass.cpp libc++ :: std/containers/unord/unord.set/emplace.pass.cpp libc++ :: std/containers/unord/unord.set/emplace_hint.pass.cpp libc++ :: std/containers/unord/unord.set/empty.pass.cpp libc++ :: std/containers/unord/unord.set/eq.pass.cpp libc++ :: std/containers/unord/unord.set/equal_range_const.pass.cpp libc++ :: std/containers/unord/unord.set/equal_range_non_const.pass.cpp libc++ :: std/containers/unord/unord.set/erase_const_iter.pass.cpp libc++ :: std/containers/unord/unord.set/erase_if.pass.cpp libc++ :: std/containers/unord/unord.set/erase_key.pass.cpp libc++ :: std/containers/unord/unord.set/erase_range.pass.cpp libc++ :: std/containers/unord/unord.set/extract_iterator.pass.cpp libc++ :: std/containers/unord/unord.set/extract_key.pass.cpp libc++ :: std/containers/unord/unord.set/find_const.pass.cpp libc++ :: std/containers/unord/unord.set/find_non_const.pass.cpp libc++ :: std/containers/unord/unord.set/insert_and_emplace_allocator_requirements.pass.cpp libc++ :: std/containers/unord/unord.set/insert_const_lvalue.pass.cpp libc++ :: std/containers/unord/unord.set/insert_hint_const_lvalue.pass.cpp libc++ :: std/containers/unord/unord.set/insert_hint_rvalue.pass.cpp libc++ :: std/containers/unord/unord.set/insert_init.pass.cpp libc++ :: std/containers/unord/unord.set/insert_node_type.pass.cpp libc++ :: std/containers/unord/unord.set/insert_node_type_hint.pass.cpp libc++ :: std/containers/unord/unord.set/insert_range.pass.cpp libc++ :: std/containers/unord/unord.set/insert_rvalue.pass.cpp libc++ :: std/containers/unord/unord.set/iterators.pass.cpp libc++ :: std/containers/unord/unord.set/load_factor.pass.cpp libc++ :: std/containers/unord/unord.set/local_iterators.pass.cpp libc++ :: std/containers/unord/unord.set/merge.pass.cpp libc++ :: std/containers/unord/unord.set/rehash.pass.cpp libc++ :: std/containers/unord/unord.set/reserve.pass.cpp libc++ :: std/containers/unord/unord.set/size.pass.cpp libc++ :: std/containers/unord/unord.set/swap_member.pass.cpp libc++ :: std/containers/unord/unord.set/unord.set.cnstr/assign_copy.pass.cpp libc++ :: std/containers/unord/unord.set/unord.set.cnstr/assign_init.pass.cpp libc++ :: std/containers/unord/unord.set/unord.set.cnstr/assign_move.pass.cpp libc++ :: std/containers/unord/unord.set/unord.set.cnstr/copy.pass.cpp libc++ :: std/containers/unord/unord.set/unord.set.cnstr/copy_alloc.pass.cpp libc++ :: std/containers/unord/unord.set/unord.set.cnstr/deduct.pass.cpp libc++ :: std/containers/unord/unord.set/unord.set.cnstr/init.pass.cpp libc++ :: std/containers/unord/unord.set/unord.set.cnstr/init_size.pass.cpp libc++ :: std/containers/unord/unord.set/unord.set.cnstr/init_size_hash.pass.cpp libc++ :: std/containers/unord/unord.set/unord.set.cnstr/init_size_hash_equal.pass.cpp libc++ :: std/containers/unord/unord.set/unord.set.cnstr/init_size_hash_equal_allocator.pass.cpp libc++ :: std/containers/unord/unord.set/unord.set.cnstr/move.pass.cpp libc++ :: std/containers/unord/unord.set/unord.set.cnstr/move_alloc.pass.cpp libc++ :: std/containers/unord/unord.set/unord.set.cnstr/range.pass.cpp libc++ :: std/containers/unord/unord.set/unord.set.cnstr/range_size.pass.cpp libc++ :: std/containers/unord/unord.set/unord.set.cnstr/range_size_hash.pass.cpp libc++ :: std/containers/unord/unord.set/unord.set.cnstr/range_size_hash_equal.pass.cpp libc++ :: std/containers/unord/unord.set/unord.set.cnstr/range_size_hash_equal_allocator.pass.cpp libc++ :: std/containers/unord/unord.set/unord.set.swap/swap_non_member.pass.cpp libc++ :: std/input.output/filesystems/class.directory_iterator/directory_iterator.members/ctor.pass.cpp libc++ :: std/input.output/filesystems/class.directory_iterator/directory_iterator.members/increment.pass.cpp libc++ :: std/input.output/filesystems/class.directory_iterator/directory_iterator.nonmembers/begin_end.pass.cpp libc++ :: std/input.output/filesystems/class.rec.dir.itr/rec.dir.itr.members/ctor.pass.cpp libc++ :: std/input.output/filesystems/class.rec.dir.itr/rec.dir.itr.members/increment.pass.cpp libc++ :: std/input.output/filesystems/class.rec.dir.itr/rec.dir.itr.members/pop.pass.cpp libc++ :: std/input.output/filesystems/class.rec.dir.itr/rec.dir.itr.members/recursion_pending.pass.cpp libc++ :: std/input.output/filesystems/class.rec.dir.itr/rec.dir.itr.nonmembers/begin_end.pass.cpp libc++ :: std/numerics/rand/rand.dis/rand.dist.samp/rand.dist.samp.pconst/copy.pass.cpp libc++ :: std/numerics/rand/rand.dis/rand.dist.samp/rand.dist.samp.pconst/ctor_param.pass.cpp libc++ :: std/numerics/rand/rand.dis/rand.dist.samp/rand.dist.samp.pconst/get_param.pass.cpp libc++ :: std/numerics/rand/rand.dis/rand.dist.samp/rand.dist.samp.pconst/param_copy.pass.cpp libc++ :: std/numerics/rand/rand.dis/rand.dist.samp/rand.dist.samp.pconst/set_param.pass.cpp libc++ :: std/numerics/rand/rand.dis/rand.dist.samp/rand.dist.samp.plinear/copy.pass.cpp libc++ :: std/numerics/rand/rand.dis/rand.dist.samp/rand.dist.samp.plinear/ctor_param.pass.cpp libc++ :: std/numerics/rand/rand.dis/rand.dist.samp/rand.dist.samp.plinear/get_param.pass.cpp libc++ :: std/numerics/rand/rand.dis/rand.dist.samp/rand.dist.samp.plinear/param_copy.pass.cpp libc++ :: std/numerics/rand/rand.dis/rand.dist.samp/rand.dist.samp.plinear/set_param.pass.cpp

Hide Details

Expected Passes : 5481 Expected Failures : 43 Unsupported Tests : 388 Unexpected Failures: 456 FAILED: projects/libcxx/test/CMakeFiles/check-cxx cd /var/folders/9t/lrs73ptj6lv644zvh1fk2_gc0000gn/T/tmp.uRw6ClIN/llvm-build/projects/libcxx/test && /usr/local/bin/python /var/folders/9t/lrs73ptj6lv644zvh1fk2_gc0000gn/T/tmp.uRw6ClIN/llvm-build/./bin/llvm-lit -sv --param=std=c++2a --param=enable_32bit=true /var/folders/9t/lrs73ptj6lv644zvh1fk2_gc0000gn/T/tmp.uRw6ClIN/llvm-build/projects/libcxx/test ninja: build stopped: subcommand failed. + cleanup + [[ -z '' ]] + echo 'Removing temporary directory /var/folders/9t/lrs73ptj6lv644zvh1fk2_gc0000gn/T/tmp.uRw6ClIN' Removing temporary directory /var/folders/9t/lrs73ptj6lv644zvh1fk2_gc0000gn/T/tmp.uRw6ClIN + rm -rf /var/folders/9t/lrs73ptj6lv644zvh1fk2_gc0000gn/T/tmp.uRw6ClIN Build step 'Execute shell' marked build as failure New run name is '#366 std=c++2a arch=32 exceptions=OFF' [BFA] Scanning build for known causes... [BFA] Found failure cause(s): [BFA] Ninja target failed from category Compile [BFA] Regression test failed from category Test [BFA] Compile Error from category Compile [BFA] Done. 2s Finished: FAILURE