UnstableConsole Output

Skipping 28,859 KB.. Full Log
ilityTests/BinaryStreamTest.PutULEB128One (319 of 1736)
PASS: lldb-Suite :: lang/cpp/class-template-parameter-pack/TestClassTemplateParameterPack.py (320 of 1736)
PASS: LLDB :: Modules/ELF/section-addresses.yaml (321 of 1736)
PASS: lldb-Suite :: functionalities/fat_archives/TestFatArchives.py (322 of 1736)
PASS: lldb-Unit :: Host/./HostTests/NativeProcessProtocolTest.ReadCStringFromMemory (323 of 1736)
PASS: lldb-Suite :: functionalities/data-formatter/data-formatter-objc/TestDataFormatterObjCKVO.py (324 of 1736)
PASS: lldb-Suite :: commands/expression/call-restarts/TestCallThatRestarts.py (325 of 1736)
PASS: lldb-Unit :: Utility/./UtilityTests/EnvironmentTest.EnvpConstruction (326 of 1736)
PASS: lldb-Suite :: commands/watchpoints/variable_out_of_scope/TestWatchedVarHitWhenInScope.py (327 of 1736)
PASS: lldb-Unit :: Utility/./UtilityTests/StreamTest.ShiftOperatorUInts (328 of 1736)
PASS: lldb-Suite :: macosx/find-dsym/deep-bundle/TestDeepBundle.py (329 of 1736)
PASS: lldb-Suite :: python_api/symbol-context/TestSymbolContext.py (330 of 1736)
PASS: lldb-Unit :: Core/./LLDBCoreTests/MangledTest.ResultForValidName (331 of 1736)
PASS: lldb-Unit :: Utility/./UtilityTests/TimerTest.CategoryTimesNested (332 of 1736)
PASS: lldb-Suite :: commands/command/script/import/rdar-12586188/TestRdar12586188.py (333 of 1736)
PASS: lldb-Unit :: UnwindAssembly/x86/./UnwindAssemblyx86Tests/Testx86AssemblyInspectionEngine.TestPushECX (334 of 1736)
PASS: lldb-Suite :: commands/disassemble/basic/TestDisassembleBreakpoint.py (335 of 1736)
PASS: lldb-Suite :: functionalities/type_lookup/TestTypeLookup.py (336 of 1736)
PASS: lldb-Unit :: Utility/./UtilityTests/UriParserTest.MinimalPortPath (337 of 1736)
PASS: lldb-Suite :: functionalities/breakpoint/address_breakpoints/TestBadAddressBreakpoints.py (338 of 1736)
PASS: lldb-Unit :: SymbolFile/DWARF/./SymbolFileDWARFTests/SymbolFileDWARFTests.TestAbilitiesForDWARF (339 of 1736)
PASS: lldb-Suite :: commands/expression/xvalue/TestXValuePrinting.py (340 of 1736)
PASS: lldb-Unit :: SymbolFile/DWARF/./SymbolFileDWARFTests/SymbolFileDWARFTests.TestAbbrevMissingTerminator (341 of 1736)
PASS: lldb-Suite :: commands/command/script_alias/TestCommandScriptAlias.py (342 of 1736)
PASS: lldb-Suite :: lang/c/stepping/TestThreadStepping.py (343 of 1736)
PASS: lldb-Unit :: ScriptInterpreter/Python/./ScriptInterpreterPythonTests/PythonDataObjectsTest.TestGlobalNameResolutionWithDot (344 of 1736)
PASS: LLDB :: Modules/PECOFF/sections-names.yaml (345 of 1736)
PASS: lldb-Suite :: lang/objc/objc-static-method-stripped/TestObjCStaticMethodStripped.py (346 of 1736)
PASS: lldb-Suite :: functionalities/thread/concurrent_events/TestConcurrentTwoWatchpointsOneBreakpoint.py (347 of 1736)
PASS: lldb-Unit :: debugserver/./debugserverTests/RNBSocket.LoopBackListenIPv4 (348 of 1736)
PASS: lldb-Unit :: Utility/./UtilityTests/BinaryStreamTest.PutULEB128NineBytes (349 of 1736)
PASS: lldb-Suite :: commands/expression/fixits/TestFixIts.py (350 of 1736)
PASS: lldb-Suite :: tools/lldb-server/commandline/TestStubSetSID.py (351 of 1736)
PASS: lldb-Suite :: commands/process/attach-resume/TestAttachResume.py (352 of 1736)
PASS: lldb-Unit :: Utility/./UtilityTests/RangeTest.Constructor (353 of 1736)
XFAIL: LLDB :: Unwind/prefer-debug-over-eh-frame.test (354 of 1736)
PASS: lldb-Unit :: Utility/./UtilityTests/StateTest.Formatv (355 of 1736)
PASS: lldb-Unit :: Utility/./UtilityTests/StreamTest.ShiftOperatorStrings (356 of 1736)
PASS: lldb-Suite :: commands/settings/quoting/TestQuoting.py (357 of 1736)
PASS: lldb-Unit :: Host/./HostTests/FileSystemTest.GetByteSize (358 of 1736)
UNSUPPORTED: LLDB :: SymbolFile/PDB/function-level-linking.test (359 of 1736)
PASS: lldb-Unit :: Utility/./UtilityTests/StringExtractorTest.GetHexU8_Exact (360 of 1736)
PASS: lldb-Unit :: Utility/./UtilityTests/StreamTeeTest.GetStreamAtIndexOutOfBounds (361 of 1736)
PASS: lldb-Unit :: ScriptInterpreter/Python/./ScriptInterpreterPythonTests/PythonDataObjectsTest.TestInstanceNameResolutionNoDot (362 of 1736)
PASS: LLDB :: Driver/TestRepl.test (363 of 1736)
PASS: lldb-Unit :: Utility/./UtilityTests/StringListTest.LongestCommonPrefixEmpty (364 of 1736)
PASS: lldb-Unit :: Utility/./UtilityTests/StringListTest.LongestCommonPrefixNoPrefix (365 of 1736)
PASS: lldb-Unit :: Process/gdb-remote/./ProcessGdbRemoteTests/GDBRemoteCommunicationClientTest.ReadRegister (366 of 1736)
PASS: lldb-Suite :: functionalities/data-formatter/data-formatter-stl/libcxx/unordered/TestDataFormatterUnordered.py (367 of 1736)
PASS: lldb-Suite :: functionalities/thread/concurrent_events/TestConcurrentWatchBreakDelay.py (368 of 1736)
PASS: lldb-Suite :: python_api/type/TestTypeList.py (369 of 1736)
PASS: lldb-Suite :: lang/cpp/global_variables/TestCPPGlobalVariables.py (370 of 1736)
PASS: lldb-Suite :: commands/expression/two-files/TestObjCTypeQueryFromOtherCompileUnit.py (371 of 1736)
PASS: lldb-Suite :: commands/expression/completion-crash-incomplete-record/TestCompletionCrashIncompleteRecord.py (372 of 1736)
PASS: lldb-Suite :: commands/expression/import-std-module/shared_ptr/TestSharedPtr.py (373 of 1736)
PASS: lldb-Unit :: Utility/./UtilityTests/ArchSpecTest.OperatorBool (374 of 1736)
PASS: lldb-Unit :: Expression/./ExpressionTests/DiagnosticManagerTest.GetStringMultiline (375 of 1736)
PASS: lldb-Suite :: commands/watchpoints/watchpoint_size/TestWatchpointSizes.py (376 of 1736)
PASS: lldb-Suite :: commands/expression/test/TestExprs.py (377 of 1736)
PASS: lldb-Unit :: Editline/./EditlineTests/EditlineTestFixture.EditlineReceivesSingleLineText (378 of 1736)
PASS: lldb-Suite :: lang/cpp/virtual/TestVirtual.py (379 of 1736)
PASS: lldb-Suite :: functionalities/asan/TestMemoryHistory.py (380 of 1736)
PASS: lldb-Suite :: python_api/watchpoint/TestWatchpointIgnoreCount.py (381 of 1736)
PASS: lldb-Suite :: commands/expression/import-std-module/vector-bool/TestBoolVector.py (382 of 1736)
PASS: lldb-Suite :: functionalities/postmortem/wow64_minidump/TestWow64MiniDump.py (383 of 1736)
PASS: lldb-Unit :: Host/./HostTests/SocketTest.DomainListenConnectAccept (384 of 1736)
PASS: lldb-Unit :: Utility/./UtilityTests/OptionsWithRawTest.LeadingSpaceArgs (385 of 1736)
PASS: LLDB :: ExecControl/StopHook/stop-hook.test (386 of 1736)
PASS: lldb-Suite :: macosx/load-kext/TestLoadKext.py (387 of 1736)
PASS: lldb-Unit :: ObjectFile/ELF/./ObjectFileELFTests/ObjectFileELFTest.GetModuleSpecifications_EarlySectionHeaders (388 of 1736)
PASS: lldb-Suite :: commands/expression/dont_allow_jit/TestAllowJIT.py (389 of 1736)
PASS: lldb-Unit :: Interpreter/./InterpreterTests/OptionArgParserTest.toBoolean (390 of 1736)
PASS: lldb-Suite :: functionalities/gdb_remote_client/TestThreadSelectionBug.py (391 of 1736)
PASS: lldb-Suite :: functionalities/breakpoint/hardware_breakpoints/hardware_breakpoint_on_multiple_threads/TestHWBreakMultiThread.py (392 of 1736)
PASS: lldb-Unit :: Expression/./ExpressionTests/DiagnosticManagerTest.FixedExpression (393 of 1736)
PASS: lldb-Unit :: Core/./LLDBCoreTests/StreamCallbackTest.Callback (394 of 1736)
PASS: lldb-Unit :: Utility/./UtilityTests/UriParserTest.BadPort2 (395 of 1736)
PASS: lldb-Unit :: ScriptInterpreter/Python/./ScriptInterpreterPythonTests/PythonDataObjectsTest.TestObjectAttributes (396 of 1736)
PASS: lldb-Unit :: Utility/./UtilityTests/RangeTest.ContainsEndInclusive (397 of 1736)
UNSUPPORTED: LLDB :: SymbolFile/DWARF/array-sizes.s (398 of 1736)
PASS: lldb-Suite :: python_api/sbstructureddata/TestStructuredDataAPI.py (399 of 1736)
UNSUPPORTED: LLDB :: Register/x86-zmm-write.test (400 of 1736)
PASS: lldb-Unit :: Utility/./UtilityTests/AnsiTerminal.Basic (401 of 1736)
PASS: lldb-Suite :: lang/cpp/rvalue-references/TestRvalueReferences.py (402 of 1736)
PASS: LLDB :: SymbolFile/DWARF/debug-types-dwarf5.s (403 of 1736)
PASS: lldb-Unit :: Utility/./UtilityTests/BinaryStreamTest.PutSLEB128FourBytes (404 of 1736)
PASS: lldb-Unit :: Utility/./UtilityTests/StringListTest.SplitIntoLinesSingleTrailingCR (405 of 1736)
PASS: lldb-Suite :: macosx/function-starts/TestFunctionStarts.py (406 of 1736)
PASS: lldb-Unit :: Target/./TargetTests/PathMappingListTest.RemapRoot (407 of 1736)
PASS: lldb-Unit :: Utility/./UtilityTests/BinaryStreamTest.PutSLEB128SevenBytes (408 of 1736)
PASS: lldb-Suite :: functionalities/data-formatter/hexcaps/TestDataFormatterHexCaps.py (409 of 1736)
PASS: lldb-Unit :: Host/./HostTests/SocketTest.TCPGetConnectURI (410 of 1736)
PASS: LLDB :: SymbolFile/DWARF/find-method-local-struct.cpp (411 of 1736)
PASS: lldb-Suite :: functionalities/thread/concurrent_events/TestConcurrentManyCrash.py (412 of 1736)
PASS: lldb-Unit :: Utility/./UtilityTests/StringExtractorTest.GetHexBytesAvail (413 of 1736)
PASS: lldb-Suite :: functionalities/data-formatter/data-formatter-enum-format/TestDataFormatterEnumFormat.py (414 of 1736)
PASS: lldb-Suite :: commands/expression/import-std-module/unique_ptr/TestUniquePtr.py (415 of 1736)
PASS: lldb-Unit :: Core/./LLDBCoreTests/MangledTest.EmptyForInvalidName (416 of 1736)
PASS: lldb-Unit :: Expression/./ExpressionTests/DiagnosticManagerTest.HasFixits (417 of 1736)
PASS: lldb-Unit :: Utility/./UtilityTests/DeserializerTest.HasData (418 of 1736)
PASS: lldb-Suite :: functionalities/thread/thread_specific_break_plus_condition/TestThreadSpecificBpPlusCondition.py (419 of 1736)
PASS: lldb-Suite :: python_api/hello_world/TestHelloWorld.py (420 of 1736)
PASS: lldb-Unit :: Utility/./UtilityTests/LogTest.Unregister (421 of 1736)
PASS: lldb-Unit :: Utility/./UtilityTests/FileSpecTest.CopyByAppendingPathComponent (422 of 1736)
PASS: LLDB :: Quit/TestQuitExitCodeTooManyArgs.test (423 of 1736)
PASS: lldb-Unit :: Utility/./UtilityTests/StringListTest.AppendStringMove (424 of 1736)
PASS: LLDB :: Settings/TestStopCommandSourceOnError.test (425 of 1736)
UNSUPPORTED: LLDB :: SymbolFile/NativePDB/source-list.cpp (426 of 1736)
PASS: lldb-Unit :: Utility/./UtilityTests/TildeExpressionResolver.ResolveFullPath (427 of 1736)
PASS: lldb-Unit :: Host/./HostTests/ConnectionFileDescriptorTest.TCPGetURIv6 (428 of 1736)
PASS: lldb-Suite :: functionalities/data-formatter/type_summary_list_script/TestTypeSummaryListScript.py (429 of 1736)
PASS: lldb-Unit :: Utility/./UtilityTests/StreamTest.PutHex32ByteOrderLittle (430 of 1736)
PASS: lldb-Unit :: Utility/./UtilityTests/StreamTest.PutRawBytesToBigEndian (431 of 1736)
PASS: lldb-Unit :: Utility/./UtilityTests/StringExtractorTest.GetU32LittleEndian (432 of 1736)
PASS: LLDB :: SymbolFile/Breakpad/line-table-mixed-path-styles.test (433 of 1736)
PASS: lldb-Suite :: functionalities/unwind/ehframe/TestEhFrameUnwind.py (434 of 1736)
PASS: lldb-Suite :: lang/c/set_values/TestSetValues.py (435 of 1736)
PASS: lldb-Unit :: Interpreter/./InterpreterTests/CompletionTest.DirCompletionAbsolute (436 of 1736)
PASS: lldb-Unit :: Utility/./UtilityTests/UriParserTest.TypicalPortPath (437 of 1736)
PASS: lldb-Suite :: functionalities/thread/concurrent_events/TestConcurrentWatchpointDelayWatchpointOneBreakpoint.py (438 of 1736)
PASS: lldb-Unit :: Utility/./UtilityTests/ArgsTest.ReplaceArgumentAtIndexLonger (439 of 1736)
PASS: lldb-Suite :: macosx/find-app-in-bundle/TestFindAppInBundle.py (440 of 1736)
PASS: lldb-Unit :: ScriptInterpreter/Python/./ScriptInterpreterPythonTests/PythonDataObjectsTest.TestGlobalNameResolutionNoDot (441 of 1736)
PASS: lldb-Unit :: UnwindAssembly/x86/./UnwindAssemblyx86Tests/Testx86AssemblyInspectionEngine.TestSimple64bitFrameFunction (442 of 1736)
PASS: LLDB :: Settings/TestDisassemblyFormat.test (443 of 1736)
PASS: lldb-Suite :: functionalities/data-formatter/data-formatter-objc/TestDataFormatterObjCNSError.py (444 of 1736)
PASS: lldb-Suite :: lang/cpp/llvm-style/TestLLVMStyle.py (445 of 1736)
PASS: lldb-Suite :: functionalities/signal/raise/TestRaise.py (446 of 1736)
PASS: lldb-Unit :: SymbolFile/NativePDB/./SymbolFileNativePDBTests/PDBFPOProgramToDWARFExpressionTests.InvalidAssignmentSingle (447 of 1736)
PASS: LLDB :: SymbolFile/DWARF/parallel-indexing-stress.s (448 of 1736)
PASS: lldb-Unit :: Process/gdb-remote/./ProcessGdbRemoteTests/GDBRemoteCommunicationClientTest.GetMemoryRegionInfo (449 of 1736)
PASS: lldb-Unit :: UnwindAssembly/x86/./UnwindAssemblyx86Tests/Testx86AssemblyInspectionEngine.TestPopRBX (450 of 1736)
PASS: lldb-Unit :: Process/gdb-remote/./ProcessGdbRemoteTests/GDBRemoteCommunicationClientTest.SendGetMetaDataPacket (451 of 1736)
PASS: lldb-Unit :: Utility/./UtilityTests/StreamTest.PutMaxHex64ByteOrderLittle (452 of 1736)
PASS: lldb-Unit :: Utility/./UtilityTests/StreamTest.PutRawBytesToMixedEndian (453 of 1736)
PASS: lldb-Unit :: ScriptInterpreter/Python/./ScriptInterpreterPythonTests/PythonDataObjectsTest.TestPythonDictionaryValueEquality (454 of 1736)
PASS: lldb-Unit :: ScriptInterpreter/Python/./ScriptInterpreterPythonTests/PythonDataObjectsTest.TestTypeNameResolutionNoDot (455 of 1736)
PASS: LLDB :: Quit/TestQuitExitCodeHex0.test (456 of 1736)
PASS: LLDB :: Commands/command-backtrace.test (457 of 1736)
UNSUPPORTED: LLDB :: SymbolFile/NativePDB/bitfields.cpp (458 of 1736)
PASS: lldb-Suite :: tools/lldb-server/libraries-svr4/TestGdbRemoteLibrariesSvr4Support.py (459 of 1736)
PASS: lldb-Suite :: lang/objc/objc-class-method/TestObjCClassMethod.py (460 of 1736)
PASS: lldb-Unit :: Utility/./UtilityTests/OptionsWithRawTest.TerminatedQuote (461 of 1736)
PASS: lldb-Suite :: commands/target/create-deps/TestTargetCreateDeps.py (462 of 1736)
PASS: lldb-Suite :: tools/lldb-vscode/stackTrace/TestVSCode_stackTrace.py (463 of 1736)
PASS: lldb-Suite :: python_api/lldbutil/iter/TestLLDBIterator.py (464 of 1736)
PASS: lldb-Unit :: Utility/./UtilityTests/StreamTest.PutPtr (465 of 1736)
UNSUPPORTED: LLDB :: SymbolFile/NativePDB/break-by-function.cpp (466 of 1736)
PASS: lldb-Unit :: Utility/./UtilityTests/AnsiTerminal.KnownPrefix (467 of 1736)
PASS: lldb-Unit :: Utility/./UtilityTests/StreamTeeTest.Flush (468 of 1736)
PASS: lldb-Unit :: Process/minidump/./LLDBMinidumpTests/MinidumpParserTest.GetThreadsAndGetThreadContext (469 of 1736)
PASS: lldb-Unit :: Expression/./ExpressionTests/DiagnosticManagerTest.PutString (470 of 1736)
PASS: lldb-Unit :: Utility/./UtilityTests/StreamTest.PutHex64ByteOrderBig (471 of 1736)
PASS: lldb-Unit :: Utility/./UtilityTests/StringExtractorTest.GetHexU8_Underflow_NoEof (472 of 1736)
PASS: lldb-Unit :: Utility/./UtilityTests/StringListTest.InsertStringAtIndexEnd (473 of 1736)
PASS: lldb-Suite :: functionalities/thread/concurrent_events/TestConcurrentBreakpointOneDelayBreakpointThreads.py (474 of 1736)
PASS: lldb-Unit :: ObjectFile/ELF/./ObjectFileELFTests/ObjectFileELFTest.SectionsResolveConsistently (475 of 1736)
PASS: lldb-Unit :: Utility/./UtilityTests/UriParserTest.BracketedHostnamePort (476 of 1736)
PASS: lldb-Suite :: commands/expression/namespace_local_var_same_name_cpp_and_c/TestNamespaceLocalVarSameNameCppAndC.py (477 of 1736)
PASS: lldb-Suite :: functionalities/data-formatter/data-formatter-objc/TestDataFormatterObjNSException.py (478 of 1736)
PASS: lldb-Suite :: commands/watchpoints/watchpoint_commands/command/TestWatchpointCommandPython.py (479 of 1736)
PASS: lldb-Unit :: Utility/./UtilityTests/OptionsWithRawTest.SingleWhitespaceInput (480 of 1736)
UNSUPPORTED: LLDB :: Register/x86-gp-read.test (481 of 1736)
PASS: LLDB :: SymbolFile/Breakpad/line-table.test (482 of 1736)
PASS: lldb-Unit :: Utility/./UtilityTests/StreamTeeTest.DefaultConstructor (483 of 1736)
PASS: lldb-Suite :: lang/objc/hidden-ivars/TestHiddenIvars.py (484 of 1736)
PASS: lldb-Suite :: functionalities/gdb_remote_client/TestTargetXMLArch.py (485 of 1736)
PASS: lldb-Unit :: Utility/./UtilityTests/VMRange.Clear (486 of 1736)
PASS: lldb-Unit :: Utility/./UtilityTests/LogTest.LLDB_LOG_nullptr (487 of 1736)
UNSUPPORTED: LLDB :: SymbolFile/PDB/typedefs.test (488 of 1736)
PASS: lldb-Suite :: lang/cpp/chained-calls/TestCppChainedCalls.py (489 of 1736)
PASS: lldb-Suite :: commands/command/nested_alias/TestNestedAlias.py (490 of 1736)
PASS: lldb-Unit :: Utility/./UtilityTests/ScalarTest.ExtractBitfield (491 of 1736)
PASS: lldb-Suite :: benchmarks/libcxxmap/TestBenchmarkLibcxxMap.py (492 of 1736)
PASS: lldb-Suite :: tools/lldb-vscode/breakpoint/TestVSCode_setExceptionBreakpoints.py (493 of 1736)
PASS: lldb-Suite :: functionalities/gdb_remote_client/TestGDBRemoteClient.py (494 of 1736)
PASS: lldb-Unit :: Utility/./UtilityTests/TimerTest.CategoryTimes (495 of 1736)
PASS: lldb-Unit :: Utility/./UtilityTests/StreamTeeTest.GetStreamAtIndexOutOfBoundsEmpty (496 of 1736)
PASS: lldb-Unit :: Process/gdb-remote/./ProcessGdbRemoteTests/GDBRemoteCommunicationClientTest.SyncThreadState (497 of 1736)
PASS: lldb-Suite :: lang/objc/objc-new-syntax/TestObjCNewSyntaxDictionary.py (498 of 1736)
PASS: lldb-Suite :: commands/process/launch-with-shellexpand/TestLaunchWithShellExpand.py (499 of 1736)
UNSUPPORTED: LLDB :: SymbolFile/DWARF/debug-names-compressed.cpp (500 of 1736)
PASS: lldb-Suite :: python_api/value/change_values/TestChangeValueAPI.py (501 of 1736)
PASS: lldb-Unit :: Utility/./UtilityTests/StreamTest.PutBytesAsRawHex8ToMixedEndian (502 of 1736)
PASS: lldb-Suite :: python_api/sbdata/TestSBData.py (503 of 1736)
PASS: lldb-Suite :: lang/objc/foundation/TestConstStrings.py (504 of 1736)
PASS: lldb-Unit :: Utility/./UtilityTests/OptionsWithRawTest.ArgsButNoDelimiter (505 of 1736)
PASS: lldb-Unit :: ScriptInterpreter/Python/./ScriptInterpreterPythonTests/PythonDataObjectsTest.TestPythonStringToStructuredString (506 of 1736)
PASS: lldb-Unit :: Utility/./UtilityTests/VMRange.SetEndAddress (507 of 1736)
UNSUPPORTED: LLDB :: SymbolFile/DWARF/debug_ranges_and_rnglists.test (508 of 1736)
PASS: lldb-Unit :: ScriptInterpreter/Python/./ScriptInterpreterPythonTests/PythonExceptionStateTest.TestAcquisitionSemantics (509 of 1736)
PASS: lldb-Unit :: SymbolFile/NativePDB/./SymbolFileNativePDBTests/PDBFPOProgramToDWARFExpressionTests.InvalidOpBinary (510 of 1736)
PASS: lldb-Unit :: UnwindAssembly/x86/./UnwindAssemblyx86Tests/Testx86AssemblyInspectionEngine.TestStackRealignMSVC_i386 (511 of 1736)
PASS: LLDB :: Modules/MachO/lc_version_min.yaml (512 of 1736)
PASS: lldb-Suite :: lang/cpp/template-function/TestTemplateFunctions.py (513 of 1736)
PASS: lldb-Suite :: functionalities/data-formatter/data-formatter-stl/libcxx/string/TestDataFormatterLibcxxString.py (514 of 1736)
PASS: lldb-Unit :: Utility/./UtilityTests/StringListTest.InsertStringAtIndexStart (515 of 1736)
PASS: lldb-Suite :: macosx/macabi/TestMacABImacOSFramework.py (516 of 1736)
PASS: lldb-Suite :: lang/cpp/static_members/TestCPPStaticMembers.py (517 of 1736)
PASS: lldb-Unit :: ScriptInterpreter/Python/./ScriptInterpreterPythonTests/PythonDataObjectsTest.TestPythonDictionaryManipulation (518 of 1736)
PASS: lldb-Unit :: Utility/./UtilityTests/ArgsTest.TestMultipleArgs (519 of 1736)
PASS: LLDB :: Modules/Breakpad/sections-trailing-func.test (520 of 1736)
PASS: lldb-Unit :: Utility/./UtilityTests/StreamTest.PutCString (521 of 1736)
PASS: lldb-Unit :: Host/./HostTests/SocketTest.UDPConnect (522 of 1736)
PASS: lldb-Suite :: functionalities/data-formatter/data-formatter-stl/libcxx/function/TestLibCxxFunction.py (523 of 1736)
PASS: lldb-Suite :: commands/frame/diagnose/dereference-argument/TestDiagnoseDereferenceArgument.py (524 of 1736)
PASS: lldb-Suite :: lang/c/shared_lib_stripped_symbols/TestSharedLibStrippedSymbols.py (525 of 1736)
PASS: lldb-Suite :: functionalities/data-formatter/data-formatter-stl/libcxx/multiset/TestDataFormatterLibcxxMultiSet.py (526 of 1736)
PASS: lldb-Suite :: commands/expression/vector_of_enums/TestVectorOfEnums.py (527 of 1736)
PASS: lldb-Suite :: functionalities/source-map/TestTargetSourceMap.py (528 of 1736)
PASS: lldb-Unit :: Language/Highlighting/./HighlighterTests/HighlighterTest.ClangCursorPos (529 of 1736)
PASS: lldb-Suite :: lang/cpp/thread_local/TestThreadLocal.py (530 of 1736)
PASS: lldb-Unit :: Utility/./UtilityTests/ScalarTest.GetBytes (531 of 1736)
PASS: lldb-Suite :: lang/c/const_variables/TestConstVariables.py (532 of 1736)
PASS: lldb-Suite :: python_api/watchpoint/condition/TestWatchpointConditionAPI.py (533 of 1736)
PASS: lldb-Suite :: functionalities/thread/concurrent_events/TestConcurrentCrashWithBreak.py (534 of 1736)
PASS: lldb-Unit :: Host/./HostTests/SocketTest.TCPListen0GetPort (535 of 1736)
PASS: lldb-Suite :: functionalities/data-formatter/data-formatter-objc/TestDataFormatterObjCNSContainer.py (536 of 1736)
PASS: lldb-Unit :: UnwindAssembly/x86/./UnwindAssemblyx86Tests/Testx86AssemblyInspectionEngine.TestSubESP (537 of 1736)
PASS: lldb-Unit :: UnwindAssembly/x86/./UnwindAssemblyx86Tests/Testx86AssemblyInspectionEngine.TestPopEDI (538 of 1736)
PASS: lldb-Suite :: lang/cpp/stl/TestStdCXXDisassembly.py (539 of 1736)
PASS: lldb-Unit :: SymbolFile/NativePDB/./SymbolFileNativePDBTests/PDBFPOProgramToDWARFExpressionTests.DependencyChain (540 of 1736)
PASS: lldb-Suite :: functionalities/unwind/noreturn/TestNoreturnUnwind.py (541 of 1736)
PASS: lldb-Suite :: functionalities/ubsan/basic/TestUbsanBasic.py (542 of 1736)
PASS: LLDB :: Modules/ELF/duplicate-section.yaml (543 of 1736)
PASS: lldb-Unit :: Symbol/./SymbolTests/TestClangASTContext.TestUnifyAccessSpecifiers (544 of 1736)
PASS: lldb-Unit :: Utility/./UtilityTests/StringListTest.JoinMultiCharSeparator (545 of 1736)
PASS: lldb-Unit :: Host/./HostTests/FileSystemTest.MakeAbsolute (546 of 1736)
UNSUPPORTED: LLDB :: SymbolFile/PDB/compilands.test (547 of 1736)
PASS: lldb-Suite :: functionalities/tsan/global_location/TestTsanGlobalLocation.py (548 of 1736)
PASS: lldb-Suite :: arm/breakpoint-it/TestBreakpointIt.py (549 of 1736)
PASS: lldb-Unit :: Symbol/./SymbolTests/TestClangASTContext.TestConvertAccessTypeToAccessSpecifier (550 of 1736)
FAIL: lldb-Suite :: functionalities/thread/concurrent_events/TestConcurrentTwoBreakpointsOneDelaySignal.py (551 of 1736)
******************** TEST 'lldb-Suite :: functionalities/thread/concurrent_events/TestConcurrentTwoBreakpointsOneDelaySignal.py' FAILED ********************
lldb version 10.0.99 (http://labmaster3.local/git/llvm-project.git revision b646dd92c2385d31104057e8ff6f651b28c931b6)
  clang revision 01213407c4114f5b587b29eae11f0a417666f965
  llvm revision 01213407c4114f5b587b29eae11f0a417666f965
LLDB library dir: /Users/buildslave/jenkins/workspace/lldb-cmake-matrix/lldb-build/bin
LLDB import library dir: /Users/buildslave/jenkins/workspace/lldb-cmake-matrix/lldb-build/bin
libstdcxx tests will not be run because: Don't know how to build with libstdcxx on macosx
Skipping following debug info categories: ['dwo']

Hide Details

Session logs for test failures/errors/unexpected successes will go into directory '/Users/buildslave/jenkins/workspace/lldb-cmake-matrix/test/logs' Command invoked: /Users/buildslave/jenkins/workspace/lldb-cmake-matrix/llvm-project/lldb/test/dotest.py --arch=x86_64 -s /Users/buildslave/jenkins/workspace/lldb-cmake-matrix/lldb-build/lldb-test-traces -S nm -u CXXFLAGS -u CFLAGS --executable /Users/buildslave/jenkins/workspace/lldb-cmake-matrix/lldb-build/./bin/lldb --dsymutil /Users/buildslave/jenkins/workspace/lldb-cmake-matrix/lldb-build/./bin/dsymutil --filecheck /Users/buildslave/jenkins/workspace/lldb-cmake-matrix/lldb-build/./bin/FileCheck -C /Users/buildslave/jenkins/workspace/lldb-cmake-matrix/clang_701_build/bin/clang --codesign-identity lldb_codesign --server /Users/buildslave/jenkins/workspace/lldb-cmake-matrix/lldb-build/./bin/debugserver --arch x86_64 --build-dir /Users/buildslave/jenkins/workspace/lldb-cmake-matrix/lldb-build/lldb-test-build.noindex -s=/Users/buildslave/jenkins/workspace/lldb-cmake-matrix/test/logs -t --env TERM=vt100 --skip-category gmodules --skip-category watchpoint --arch=x86_64 --env LLVM_LIBS_DIR=/Users/buildslave/jenkins/workspace/lldb-cmake-matrix/lldb-build/./lib --build-dir /Users/buildslave/jenkins/workspace/lldb-cmake-matrix/lldb-build/tools/lldb/lldb-test-build.noindex --module-cache-dir /Users/buildslave/jenkins/workspace/lldb-cmake-matrix/lldb-build/tools/lldb/lldb-test-build.noindex/module-cache-lldb /Users/buildslave/jenkins/workspace/lldb-cmake-matrix/llvm-project/lldb/packages/Python/lldbsuite/test/functionalities/thread/concurrent_events -p TestConcurrentTwoBreakpointsOneDelaySignal.py Change dir to: /Users/buildslave/jenkins/workspace/lldb-cmake-matrix/llvm-project/lldb/packages/Python/lldbsuite/test/functionalities/thread/concurrent_events runCmd: settings set symbols.enable-external-lookup false output:

Hide Details

runCmd: settings set plugin.process.gdb-remote.packet-timeout 60 output:

Hide Details

runCmd: settings set symbols.clang-modules-cache-path "/Users/buildslave/jenkins/workspace/lldb-cmake-matrix/lldb-build/tools/lldb/lldb-test-build.noindex/module-cache-lldb" output:

Hide Details

runCmd: settings set use-color false output:

Hide Details

runCmd: file /Users/buildslave/jenkins/workspace/lldb-cmake-matrix/lldb-build/tools/lldb/lldb-test-build.noindex/functionalities/thread/concurrent_events/TestConcurrentTwoBreakpointsOneDelaySignal.test/a.out output: Current executable set to '/Users/buildslave/jenkins/workspace/lldb-cmake-matrix/lldb-build/tools/lldb/lldb-test-build.noindex/functionalities/thread/concurrent_events/TestConcurrentTwoBreakpointsOneDelaySignal.test/a.out' (x86_64).

Hide Details

Hide Details

runCmd: breakpoint set -f "main.cpp" -l 138 output: Breakpoint 1: where = a.out`dotest() + 101 at main.cpp:138:5, address = 0x0000000100001b05

Hide Details

Hide Details

Expecting pattern: ^Breakpoint (?P<bpno>[0-9]+): (?P<num_locations>[0-9]+) locations\.$ Not matched

Hide Details

Expecting pattern: ^Breakpoint (?P<bpno>[0-9]+): (?P<num_locations>no) locations \(pending\)\. Not matched

Hide Details

Expecting pattern: ^Breakpoint (?P<bpno>[0-9]+): where = (?P<module>.*)`(?P<symbol>[+\-]{0,1}[^+]+)( \+ (?P<offset>[0-9]+)){0,1}( \[inlined\] (?P<inline_symbol>.*)){0,1} at (?P<file>[^:]+):(?P<line_no>[0-9]+)(?P<column>(:[0-9]+)?), address = (?P<address>0x[0-9a-fA-F]+)$ Matched

Hide Details

runCmd: breakpoint set -f "main.cpp" -l 184 output: Breakpoint 2: where = a.out`main + 22 at main.cpp:184:5, address = 0x00000001000039b6

Hide Details

Hide Details

Expecting pattern: ^Breakpoint (?P<bpno>[0-9]+): (?P<num_locations>[0-9]+) locations\.$ Not matched

Hide Details

Expecting pattern: ^Breakpoint (?P<bpno>[0-9]+): (?P<num_locations>no) locations \(pending\)\. Not matched

Hide Details

Expecting pattern: ^Breakpoint (?P<bpno>[0-9]+): where = (?P<module>.*)`(?P<symbol>[+\-]{0,1}[^+]+)( \+ (?P<offset>[0-9]+)){0,1}( \[inlined\] (?P<inline_symbol>.*)){0,1} at (?P<file>[^:]+):(?P<line_no>[0-9]+)(?P<column>(:[0-9]+)?), address = (?P<address>0x[0-9a-fA-F]+)$ Matched

Hide Details

runCmd: breakpoint set -f "main.cpp" -l 53 output: Breakpoint 3: where = a.out`breakpoint_func(void*) + 343 at main.cpp:53:17, address = 0x0000000100001147

Hide Details

Hide Details

Expecting pattern: ^Breakpoint (?P<bpno>[0-9]+): (?P<num_locations>[0-9]+) locations\.$ Not matched

Hide Details

Expecting pattern: ^Breakpoint (?P<bpno>[0-9]+): (?P<num_locations>no) locations \(pending\)\. Not matched

Hide Details

Expecting pattern: ^Breakpoint (?P<bpno>[0-9]+): where = (?P<module>.*)`(?P<symbol>[+\-]{0,1}[^+]+)( \+ (?P<offset>[0-9]+)){0,1}( \[inlined\] (?P<inline_symbol>.*)){0,1} at (?P<file>[^:]+):(?P<line_no>[0-9]+)(?P<column>(:[0-9]+)?), address = (?P<address>0x[0-9a-fA-F]+)$ Matched

Hide Details

runCmd: breakpoint list -f output: Current breakpoints: 1: file = 'main.cpp', line = 138, exact_match = 0, locations = 1 1.1: where = a.out`dotest() + 101 at main.cpp:138:5, address = a.out[0x0000000100001b05], unresolved, hit count = 0

Hide Details

2: file = 'main.cpp', line = 184, exact_match = 0, locations = 1 2.1: where = a.out`main + 22 at main.cpp:184:5, address = a.out[0x00000001000039b6], unresolved, hit count = 0

Hide Details

3: file = 'main.cpp', line = 53, exact_match = 0, locations = 1 3.1: where = a.out`breakpoint_func(void*) + 343 at main.cpp:53:17, address = a.out[0x0000000100001147], unresolved, hit count = 0

Hide Details

Hide Details

Hide Details

Expecting sub string: : file = 'main.cpp', line = 184 Matched

Hide Details

Expecting sub string: : file = 'main.cpp', line = 184 Matched

Hide Details

Expecting sub string: : file = 'main.cpp', line = 184 Matched

Hide Details

runCmd: run output: Process 6322 stopped * thread #1, queue = 'com.apple.main-thread', stop reason = breakpoint 1.1 frame #0: 0x0000000100001b05 a.out`dotest() at main.cpp:138:5 135 unsigned num_delay_signal_threads = 0; 136 unsigned num_delay_crash_threads = 0; 137 -> 138 register_signal_handler(SIGUSR1, sigusr1_handler); // Break here and adjust num_[breakpoint|watchpoint|signal|crash]_threads ^ 139 140 unsigned total_threads = num_breakpoint_threads 141 + num_watchpoint_threads Process 6322 launched: '/Users/buildslave/jenkins/workspace/lldb-cmake-matrix/lldb-build/tools/lldb/lldb-test-build.noindex/functionalities/thread/concurrent_events/TestConcurrentTwoBreakpointsOneDelaySignal.test/a.out' (x86_64)

Hide Details

Hide Details

runCmd: thread backtrace output: * thread #1, queue = 'com.apple.main-thread', stop reason = breakpoint 1.1 * frame #0: 0x0000000100001b05 a.out`dotest() at main.cpp:138:5 frame #1: 0x00000001000039b4 a.out`main at main.cpp:183:5 frame #2: 0x00007fff7dd72085 libdyld.dylib`start + 1 frame #3: 0x00007fff7dd72085 libdyld.dylib`start + 1

Hide Details

Hide Details

Expecting sub string: stop reason = breakpoint 1. Matched

Hide Details

runCmd: expr num_breakpoint_threads=2 output: (unsigned int) $0 = 2

Hide Details

Hide Details

runCmd: expr num_crash_threads=0 output: (unsigned int) $1 = 0

Hide Details

Hide Details

runCmd: expr num_signal_threads=0 output: (unsigned int) $2 = 0

Hide Details

Hide Details

runCmd: expr num_watchpoint_threads=0 output: (unsigned int) $3 = 0

Hide Details

Hide Details

runCmd: expr num_delay_breakpoint_threads=0 output: (unsigned int) $4 = 0

Hide Details

Hide Details

runCmd: expr num_delay_crash_threads=0 output: (unsigned int) $5 = 0

Hide Details

Hide Details

runCmd: expr num_delay_signal_threads=1 output: (unsigned int) $6 = 1

Hide Details

Hide Details

runCmd: expr num_delay_watchpoint_threads=0 output: (unsigned int) $7 = 0

Hide Details

Hide Details

runCmd: continue output: Process 6322 resuming Process 6322 stopped * thread #2, stop reason = breakpoint 3.1 frame #0: 0x0000000100001147 a.out`breakpoint_func(input=0x0000000000000000) at main.cpp:53:17 50 do_action_args(input); 51 52 // Do something -> 53 g_breakpoint++; // Set breakpoint here ^ 54 return 0; 55 } 56 thread #3, stop reason = breakpoint 3.1 frame #0: 0x0000000100001147 a.out`breakpoint_func(input=0x0000000000000000) at main.cpp:53:17 50 do_action_args(input); 51 52 // Do something -> 53 g_breakpoint++; // Set breakpoint here ^ 54 return 0; 55 } 56

Hide Details

Hide Details

Hide Details

runCmd: thread backtrace all output: thread #1, queue = 'com.apple.main-thread' frame #0: 0x00007fff7dead36a libsystem_kernel.dylib`__ulock_wait + 10 frame #1: 0x00007fff7df6870b libsystem_pthread.dylib`_pthread_join + 356 frame #2: 0x0000000100003886 a.out`dotest() at main.cpp:176:9 frame #3: 0x00000001000039b4 a.out`main at main.cpp:183:5 frame #4: 0x00007fff7dd72085 libdyld.dylib`start + 1 frame #5: 0x00007fff7dd72085 libdyld.dylib`start + 1 * thread #2, stop reason = breakpoint 3.1 * frame #0: 0x0000000100001147 a.out`breakpoint_func(input=0x0000000000000000) at main.cpp:53:17 frame #1: 0x00007fff7df6433d libsystem_pthread.dylib`_pthread_body + 126 frame #2: 0x00007fff7df672a7 libsystem_pthread.dylib`_pthread_start + 70 frame #3: 0x00007fff7df63425 libsystem_pthread.dylib`thread_start + 13 thread #3, stop reason = breakpoint 3.1 frame #0: 0x0000000100001147 a.out`breakpoint_func(input=0x0000000000000000) at main.cpp:53:17 frame #1: 0x00007fff7df6433d libsystem_pthread.dylib`_pthread_body + 126 frame #2: 0x00007fff7df672a7 libsystem_pthread.dylib`_pthread_start + 70 frame #3: 0x00007fff7df63425 libsystem_pthread.dylib`thread_start + 13 thread #4 frame #0: 0x00007fff7deae876 libsystem_kernel.dylib`__semwait_signal + 10 frame #1: 0x00007fff7de39830 libsystem_c.dylib`nanosleep + 199 frame #2: 0x00007fff7de39692 libsystem_c.dylib`sleep + 41 frame #3: 0x0000000100000fda a.out`do_action_args(input=0x00007ffeefbfe600) at main.cpp:41:7 frame #4: 0x00000001000012c5 a.out`signal_func(input=0x00007ffeefbfe600) at main.cpp:61:5 frame #5: 0x00007fff7df6433d libsystem_pthread.dylib`_pthread_body + 126 frame #6: 0x00007fff7df672a7 libsystem_pthread.dylib`_pthread_start + 70 frame #7: 0x00007fff7df63425 libsystem_pthread.dylib`thread_start + 13

Hide Details

Hide Details

runCmd: continue output: Process 6322 resuming Process 6322 stopped * thread #4, stop reason = signal SIGUSR1 frame #0: 0x00007fff7deb0b86 libsystem_kernel.dylib`__pthread_kill + 10 libsystem_kernel.dylib`__pthread_kill: -> 0x7fff7deb0b86 <+10>: jae 0x7fff7deb0b90 ; <+20> 0x7fff7deb0b88 <+12>: movq %rax, %rdi 0x7fff7deb0b8b <+15>: jmp 0x7fff7deaae67 ; cerror_nocancel 0x7fff7deb0b90 <+20>: retq

Hide Details

Hide Details

Hide Details

runCmd: thread backtrace all output: thread #1, queue = 'com.apple.main-thread' frame #0: 0x00007fff7dead36a libsystem_kernel.dylib`__ulock_wait + 10 frame #1: 0x00007fff7df6870b libsystem_pthread.dylib`_pthread_join + 356 frame #2: 0x0000000100003886 a.out`dotest() at main.cpp:176:9 frame #3: 0x00000001000039b4 a.out`main at main.cpp:183:5 frame #4: 0x00007fff7dd72085 libdyld.dylib`start + 1 frame #5: 0x00007fff7dd72085 libdyld.dylib`start + 1 * thread #4, stop reason = signal SIGUSR1 * frame #0: 0x00007fff7deb0b86 libsystem_kernel.dylib`__pthread_kill + 10 frame #1: 0x00007fff7df66c50 libsystem_pthread.dylib`pthread_kill + 285 frame #2: 0x00000001000012d7 a.out`signal_func(input=0x00007ffeefbfe600) at main.cpp:66:5 frame #3: 0x00007fff7df6433d libsystem_pthread.dylib`_pthread_body + 126 frame #4: 0x00007fff7df672a7 libsystem_pthread.dylib`_pthread_start + 70 frame #5: 0x00007fff7df63425 libsystem_pthread.dylib`thread_start + 13

Hide Details

Hide Details

runCmd: continue output: Process 6322 resuming Process 6322 stopped * thread #1, queue = 'com.apple.main-thread', stop reason = breakpoint 2.1 frame #0: 0x00000001000039b6 a.out`main at main.cpp:184:5 181 int main () 182 { 183 dotest(); -> 184 return 0; // Break here and verify one thread is active. ^ 185 } 186 187

Hide Details

Hide Details

Hide Details

FAIL: LLDB (/Users/buildslave/jenkins/workspace/lldb-cmake-matrix/clang_701_build/bin/clang-7-x86_64) :: test (TestConcurrentTwoBreakpointsOneDelaySignal.ConcurrentTwoBreakpointsOneDelaySignal) <bound method SBProcess.Kill of <lldb.SBProcess; proxy of <Swig Object of type 'lldb::SBProcess *' at 0x10c33ded0> >>: success

Hide Details

Restore dir to: /Users/buildslave/jenkins/workspace/lldb-cmake-matrix/lldb-build/tools/lldb/lit ====================================================================== FAIL: test (TestConcurrentTwoBreakpointsOneDelaySignal.ConcurrentTwoBreakpointsOneDelaySignal) Test two threads that trigger a breakpoint and one (1 second delay) signal thread. ---------------------------------------------------------------------- Traceback (most recent call last): File "/Users/buildslave/jenkins/workspace/lldb-cmake-matrix/llvm-project/lldb/packages/Python/lldbsuite/test/decorators.py", line 141, in wrapper func(*args, **kwargs) File "/Users/buildslave/jenkins/workspace/lldb-cmake-matrix/llvm-project/lldb/packages/Python/lldbsuite/test/decorators.py", line 111, in wrapper func(*args, **kwargs) File "/Users/buildslave/jenkins/workspace/lldb-cmake-matrix/llvm-project/lldb/packages/Python/lldbsuite/test/functionalities/thread/concurrent_events/TestConcurrentTwoBreakpointsOneDelaySignal.py", line 24, in test num_delay_signal_threads=1) File "/Users/buildslave/jenkins/workspace/lldb-cmake-matrix/llvm-project/lldb/packages/Python/lldbsuite/test/concurrent_base.py", line 245, in do_thread_actions self.describe_threads()))) AssertionError: 1 != 2 : Expecting 1 thread but seeing 2. Details:thread 1 running due to SBBreakpoint: id = 2, file = 'main.cpp', line = 184, exact_match = 0, locations = 1 hit 1 times at frame #0: 0x00000001000039b6 a.out`main at main.cpp:184:5 frame #1: 0x00007fff7dd72085 libdyld.dylib`start + 1 frame #2: 0x00007fff7dd72085 libdyld.dylib`start + 1

Hide Details

thread 4 running due to none at frame #0: 0x00007fff7dead382 libsystem_kernel.dylib`__ulock_wake + 10 frame #1: 0x00007fff7df66805 libsystem_pthread.dylib`_pthread_joiner_wake + 28 frame #2: 0x00007fff7df64919 libsystem_pthread.dylib`_pthread_terminate + 474 frame #3: 0x00007fff7df6473f libsystem_pthread.dylib`_pthread_terminate_invoke + 9 frame #4: 0x00007fff7df676da libsystem_pthread.dylib`_pthread_exit + 111 frame #5: 0x00007fff7df64348 libsystem_pthread.dylib`_pthread_body + 137 frame #6: 0x00007fff7df672a7 libsystem_pthread.dylib`_pthread_start + 70 frame #7: 0x00007fff7df63425 libsystem_pthread.dylib`thread_start + 13

Hide Details

Config=x86_64-/Users/buildslave/jenkins/workspace/lldb-cmake-matrix/clang_701_build/bin/clang-7 ---------------------------------------------------------------------- Ran 1 test in 3.478s

Hide Details

RESULT: FAILED (0 passes, 1 failures, 0 errors, 0 skipped, 0 expected failures, 0 unexpected successes)

Hide Details

******************** PASS: lldb-Suite :: commands/frame/recognizer/TestFrameRecognizer.py (552 of 1736) PASS: LLDB :: SymbolFile/DWARF/gnu-style-compression.cpp (553 of 1736) PASS: lldb-Suite :: commands/expression/import-std-module/forward_list-dbg-info-content/TestDbgInfoContentForwardList.py (554 of 1736) PASS: lldb-Suite :: lang/cpp/incomplete-types/TestCppIncompleteTypes.py (555 of 1736) PASS: lldb-Suite :: commands/expression/issue_11588/Test11588.py (556 of 1736) PASS: lldb-Unit :: Utility/./UtilityTests/StringListTest.RemoveBlankLines (557 of 1736) PASS: lldb-Unit :: Utility/./UtilityTests/ArgsTest.TestQuotedUnknownEscape (558 of 1736) PASS: lldb-Unit :: Utility/./UtilityTests/Flags.AllClear (559 of 1736) PASS: lldb-Suite :: benchmarks/expression/TestRepeatedExprs.py (560 of 1736) PASS: lldb-Unit :: ScriptInterpreter/Python/./ScriptInterpreterPythonTests/PythonDataObjectsTest.TestPythonCallableCheck (561 of 1736) PASS: lldb-Suite :: lang/cpp/namespace/TestNamespaceLookup.py (562 of 1736) PASS: lldb-Suite :: functionalities/data-formatter/boolreference/TestFormattersBoolRefPtr.py (563 of 1736) PASS: lldb-Unit :: Process/gdb-remote/./ProcessGdbRemoteTests/GDBRemoteCommunicationServerTest.SendErrorResponse_ErrorList (564 of 1736) PASS: lldb-Suite :: functionalities/tsan/thread_leak/TestTsanThreadLeak.py (565 of 1736) PASS: lldb-Suite :: functionalities/memory/cache/TestMemoryCache.py (566 of 1736) PASS: lldb-Suite :: lang/cpp/limit-debug-info/TestWithLimitDebugInfo.py (567 of 1736) PASS: LLDB :: Modules/PECOFF/basic-info.yaml (568 of 1736) PASS: lldb-Unit :: Utility/./UtilityTests/ReproducerTest.SetCapture (569 of 1736) PASS: lldb-Unit :: Utility/./UtilityTests/BinaryStreamTest.PutSLEB128ThreeBytes (570 of 1736) PASS: lldb-Unit :: Utility/./UtilityTests/SerializationRountripTest.SerializeDeserializeObjectReference (571 of 1736) PASS: lldb-Suite :: commands/expression/save_jit_objects/TestSaveJITObjects.py (572 of 1736) PASS: lldb-Suite :: lang/objc/objc-new-syntax/TestObjCNewSyntaxLiteral.py (573 of 1736) PASS: lldb-Suite :: functionalities/step_scripted/TestStepScripted.py (574 of 1736) PASS: lldb-Suite :: lang/cpp/call-function/TestCallCPPFunction.py (575 of 1736) PASS: lldb-Unit :: Symbol/./SymbolTests/TestClangASTContext.TestGetBasicTypeFromEnum (576 of 1736) PASS: lldb-Unit :: SymbolFile/DWARF/./SymbolFileDWARFTests/SymbolFileDWARFTests.TestAbbrevValidAttrNullForm (577 of 1736) PASS: lldb-Unit :: Utility/./UtilityTests/ArgsTest.GetArgumentArrayRef (578 of 1736) PASS: lldb-Suite :: lang/cpp/nsimport/TestCppNsImport.py (579 of 1736) PASS: lldb-Unit :: Utility/./UtilityTests/ScalarTest.Scalar_512 (580 of 1736) PASS: lldb-Suite :: linux/sepdebugsymlink/TestTargetSymbolsSepDebugSymlink.py (581 of 1736) PASS: lldb-Unit :: ScriptInterpreter/Python/./ScriptInterpreterPythonTests/PythonDataObjectsTest.TestPythonIntegerToStr (582 of 1736) PASS: lldb-Unit :: Process/minidump/./LLDBMinidumpTests/RegisterContextMinidump.ConvertMinidumpContext_x86_64 (583 of 1736) UNSUPPORTED: LLDB :: SymbolFile/DWARF/find-variable-file.cpp (584 of 1736) PASS: LLDB :: Settings/TestFrameFormatNoColor.test (585 of 1736) PASS: lldb-Unit :: Utility/./UtilityTests/ArgsTest.ReplaceArgumentAtIndexEqual (586 of 1736) PASS: lldb-Unit :: SymbolFile/NativePDB/./SymbolFileNativePDBTests/PDBFPOProgramToDWARFExpressionTests.InvalidAssignmentMultiple (587 of 1736) PASS: lldb-Suite :: commands/expression/persist_objc_pointeetype/TestPersistObjCPointeeType.py (588 of 1736) PASS: lldb-Unit :: Host/./HostTests/FileActionTest.Open (589 of 1736) PASS: lldb-Unit :: Utility/./UtilityTests/VASprintfTest.NoBufferResize (590 of 1736) PASS: LLDB :: SymbolFile/Breakpad/unwind-via-stack-cfi.test (591 of 1736) PASS: lldb-Suite :: python_api/target/TestTargetAPI.py (592 of 1736) PASS: lldb-Unit :: debugserver/./debugserverTests/RNBSocket.LoopBackConnectIPv6 (593 of 1736) PASS: LLDB :: SymbolFile/DWARF/debug_aranges-empty-section.s (594 of 1736) PASS: lldb-Suite :: commands/expression/rdar42038760/TestScalarURem.py (595 of 1736) PASS: lldb-Unit :: Symbol/./SymbolTests/LineEntryTest.GetSameLineContiguousAddressRangeNestedInline (596 of 1736) PASS: lldb-Suite :: functionalities/tsan/thread_numbers/TestTsanThreadNumbers.py (597 of 1736) PASS: lldb-Unit :: SymbolFile/NativePDB/./SymbolFileNativePDBTests/PDBFPOProgramToDWARFExpressionTests.UnsupportedRASearch (598 of 1736) PASS: lldb-Unit :: Language/Highlighting/./HighlighterTests/HighlighterTest.ClangBraces (599 of 1736) PASS: lldb-Unit :: Host/./HostTests/FileSystemTest.Exists (600 of 1736) PASS: lldb-Suite :: lang/objc/rdar-12408181/TestRdar12408181.py (601 of 1736) PASS: lldb-Unit :: Utility/./UtilityTests/UriParserTest.Minimal (602 of 1736) PASS: lldb-Unit :: Utility/./UtilityTests/RangeTest.DefaultConstructor (603 of 1736) PASS: lldb-Suite :: functionalities/inferior-crashing/recursive-inferior/TestRecursiveInferiorStep.py (604 of 1736) PASS: lldb-Suite :: commands/expression/persistent_variables/TestPersistentVariables.py (605 of 1736) PASS: lldb-Suite :: lang/objc/foundation/TestObjCMethodsNSError.py (606 of 1736) PASS: lldb-Unit :: Utility/./UtilityTests/LogChannelEnabledTest.LogGetLogThread (607 of 1736) PASS: lldb-Unit :: Utility/./UtilityTests/CompletionRequest.DuplicateFilteringWithComments (608 of 1736) PASS: lldb-Unit :: Utility/./UtilityTests/StringListTest.JoinSingle (609 of 1736) PASS: lldb-Unit :: Utility/./UtilityTests/StringListTest.ShiftStdString (610 of 1736) PASS: lldb-Unit :: Language/Highlighting/./HighlighterTests/HighlighterTest.ClangStringLiterals (611 of 1736) PASS: lldb-Suite :: commands/frame/var/TestFrameVar.py (612 of 1736) PASS: lldb-Unit :: Platform/./LLDBPlatformTests/PlatformDarwinTest.TestParseVersionBuildDir (613 of 1736) PASS: lldb-Suite :: commands/apropos/basic/TestApropos.py (614 of 1736) PASS: lldb-Unit :: Utility/./UtilityTests/FileSpecTest.FileAndDirectoryComponents (615 of 1736) PASS: lldb-Suite :: functionalities/darwin_log/filter/regex/message/TestDarwinLogFilterRegexMessage.py (616 of 1736) PASS: LLDB :: Settings/TestSettingsSet.test (617 of 1736) PASS: lldb-Unit :: Core/./LLDBCoreTests/RichManglingContextTest.IPDRealloc (618 of 1736) PASS: lldb-Suite :: functionalities/data-formatter/data-formatter-objc/TestDataFormatterObjCNSURL.py (619 of 1736) PASS: lldb-Suite :: functionalities/data-formatter/varscript_formatting/TestDataFormatterVarScriptFormatting.py (620 of 1736) PASS: LLDB :: Heap/heap-cstr.test (621 of 1736) PASS: lldb-Unit :: ScriptInterpreter/Python/./ScriptInterpreterPythonTests/PythonDataObjectsTest.TestPythonListManipulation (622 of 1736) PASS: lldb-Suite :: functionalities/data-formatter/vector-types/TestVectorTypesFormatting.py (623 of 1736) PASS: lldb-Suite :: commands/command/history/TestCommandHistory.py (624 of 1736) PASS: lldb-Unit :: Process/gdb-remote/./ProcessGdbRemoteTests/GDBRemoteCommunicationClientTest.GetMemoryRegionInfoInvalidResponse (625 of 1736) PASS: lldb-Suite :: commands/expression/cast_int_to_anonymous_enum/TestCastIntToAnonymousEnum.py (626 of 1736) PASS: lldb-Suite :: functionalities/gdb_remote_client/TestWriteMemory.py (627 of 1736) PASS: lldb-Unit :: UnwindAssembly/PPC64/./PPC64InstEmulationTests/TestPPC64InstEmulation.TestMediumFunction (628 of 1736) PASS: lldb-Suite :: lang/cpp/dynamic-value/TestCppValueCast.py (629 of 1736) PASS: lldb-Suite :: lang/cpp/operators/TestCppOperators.py (630 of 1736) PASS: lldb-Suite :: commands/expression/import-std-module/list-dbg-info-content/TestDbgInfoContentList.py (631 of 1736) PASS: lldb-Suite :: functionalities/signal/TestSendSignal.py (632 of 1736) PASS: lldb-Suite :: lang/cpp/lambdas/TestLambdas.py (633 of 1736) PASS: lldb-Unit :: Utility/./UtilityTests/ArgsTest.GetQuotedCommandString (634 of 1736) PASS: lldb-Unit :: Symbol/./SymbolTests/PostfixExpression.ToDWARF (635 of 1736) PASS: lldb-Suite :: functionalities/thread/concurrent_events/TestConcurrentSignalDelayWatch.py (636 of 1736) PASS: LLDB :: Modules/ELF/netbsd-exec-8.99.30-amd64.yaml (637 of 1736) PASS: lldb-Unit :: ScriptInterpreter/Python/./ScriptInterpreterPythonTests/PythonDataObjectsTest.TestPythonDictionaryToStructuredDictionary (638 of 1736) PASS: lldb-Unit :: Utility/./UtilityTests/OptionsWithRawTest.EmptyInput (639 of 1736) PASS: lldb-Unit :: Utility/./UtilityTests/StringExtractorTest.GetHexBytes_FullString (640 of 1736) PASS: lldb-Unit :: UnwindAssembly/x86/./UnwindAssemblyx86Tests/Testx86AssemblyInspectionEngine.TestPopRBPWithREX (641 of 1736) PASS: LLDB :: Reproducer/TestSynchronous.test (642 of 1736) PASS: lldb-Unit :: Utility/./UtilityTests/FileSpecTest.EqualDotsWindows (643 of 1736) PASS: lldb-Unit :: Utility/./UtilityTests/StringListTest.InsertStringAtIndexOutOfBounds (644 of 1736) PASS: lldb-Unit :: Utility/./UtilityTests/OptionsWithRawTest.EmptyArgsOnlySuffix (645 of 1736) PASS: lldb-Suite :: types/TestIntegerTypesExpr.py (646 of 1736) PASS: lldb-Suite :: functionalities/memory-region/TestMemoryRegion.py (647 of 1736) PASS: lldb-Suite :: lang/cpp/function-template-parameter-pack/TestFunctionTemplateParameterPack.py (648 of 1736) PASS: lldb-Suite :: functionalities/var_path/TestVarPath.py (649 of 1736) PASS: lldb-Suite :: types/TestRecursiveTypes.py (650 of 1736) PASS: lldb-Suite :: commands/expression/import-std-module/deque-basic/TestBasicDeque.py (651 of 1736) PASS: lldb-Unit :: Utility/./UtilityTests/ScalarTest.CastOperations (652 of 1736) PASS: lldb-Suite :: commands/frame/diagnose/array/TestArray.py (653 of 1736) PASS: LLDB :: Reproducer/Functionalities/TestDataFormatter.test (654 of 1736) PASS: lldb-Unit :: Utility/./UtilityTests/GeneratorTest.GetOrCreate (655 of 1736) PASS: lldb-Suite :: lang/c/stepping/TestStepAndBreakpoints.py (656 of 1736) PASS: LLDB :: Modules/Breakpad/uuid-matching-mac.test (657 of 1736) PASS: lldb-Unit :: ScriptInterpreter/Python/./ScriptInterpreterPythonTests/PythonDataObjectsTest.TestBorrowedReferences (658 of 1736) PASS: lldb-Unit :: Utility/./UtilityTests/RegisterValueTest.GetSet8 (659 of 1736) PASS: lldb-Suite :: lang/c/global_variables/TestGlobalVariables.py (660 of 1736) PASS: lldb-Unit :: UnwindAssembly/x86/./UnwindAssemblyx86Tests/Testx86AssemblyInspectionEngine.Test64bitFramelessSmallStackFrame (661 of 1736) UNSUPPORTED: LLDB :: SymbolFile/PDB/udt-layout.test (662 of 1736) PASS: lldb-Unit :: UnwindAssembly/x86/./UnwindAssemblyx86Tests/Testx86AssemblyInspectionEngine.TestSimplei386ugmented (663 of 1736) PASS: lldb-Suite :: functionalities/conditional_break/TestConditionalBreak.py (664 of 1736) PASS: LLDB :: Modules/PECOFF/subsections.yaml (665 of 1736) PASS: lldb-Suite :: functionalities/thread/concurrent_events/TestConcurrentTwoBreakpointsOneSignal.py (666 of 1736) PASS: lldb-Unit :: Utility/./UtilityTests/OptionsWithRawTest.ArgsButNoLeadingDash (667 of 1736) PASS: lldb-Unit :: Utility/./UtilityTests/ArgsTest.ReplaceArgumentAtIndexFarOutOfRange (668 of 1736) PASS: lldb-Unit :: Utility/./UtilityTests/CompletionRequest.TestCompletionOwnership (669 of 1736) PASS: lldb-Suite :: lang/cpp/breakpoint_in_member_func_w_non_primitive_params/TestBreakpointInMemberFuncWNonPrimitiveParams.py (670 of 1736) PASS: lldb-Suite :: functionalities/process_save_core/TestProcessSaveCore.py (671 of 1736) PASS: lldb-Suite :: functionalities/data-formatter/summary-string-onfail/Test-rdar-9974002.py (672 of 1736) PASS: lldb-Suite :: tools/lldb-server/TestGdbRemote_qThreadStopInfo.py (673 of 1736) PASS: lldb-Unit :: Utility/./UtilityTests/BinaryStreamTest.PutULEB128EightBytes (674 of 1736) PASS: lldb-Suite :: lang/cpp/bool/TestCPPBool.py (675 of 1736) PASS: lldb-Suite :: functionalities/plugins/python_os_plugin/TestPythonOSPlugin.py (676 of 1736) PASS: lldb-Suite :: lang/cpp/breakpoint-commands/TestCPPBreakpointCommands.py (677 of 1736) UNSUPPORTED: LLDB :: Process/Windows/exception_access_violation.cpp (678 of 1736) PASS: lldb-Suite :: functionalities/data-formatter/nsarraysynth/TestNSArraySynthetic.py (679 of 1736) PASS: lldb-Suite :: functionalities/thread/concurrent_events/TestConcurrentTwoWatchpointThreads.py (680 of 1736) UNSUPPORTED: LLDB :: SymbolFile/NativePDB/ast-functions.cpp (681 of 1736) PASS: lldb-Unit :: UnwindAssembly/x86/./UnwindAssemblyx86Tests/Testx86AssemblyInspectionEngine.TestPushR14 (682 of 1736) PASS: lldb-Unit :: Utility/./UtilityTests/StringListTest.InsertStringAtIndexMove (683 of 1736) PASS: lldb-Unit :: Utility/./UtilityTests/StreamTeeTest.SetStreamAtIndexOverwrite (684 of 1736) PASS: lldb-Suite :: functionalities/thread/concurrent_events/TestConcurrentCrashWithWatchpoint.py (685 of 1736) PASS: LLDB :: Modules/ELF/section-overlap.yaml (686 of 1736) PASS: lldb-Unit :: Utility/./UtilityTests/StringListTest.ShiftMove (687 of 1736) PASS: lldb-Suite :: commands/expression/ir-interpreter-phi-nodes/TestIRInterpreterPHINodes.py (688 of 1736) UNSUPPORTED: LLDB :: SymbolFile/DWARF/debug-types-expressions.test (689 of 1736) PASS: lldb-Suite :: lang/cpp/std-function-step-into-callable/TestStdFunctionStepIntoCallable.py (690 of 1736) PASS: lldb-Suite :: lang/objc/exceptions/TestObjCExceptions.py (691 of 1736) PASS: lldb-Suite :: functionalities/breakpoint/global_constructor/TestBreakpointInGlobalConstructor.py (692 of 1736) PASS: lldb-Unit :: Utility/./UtilityTests/StringListTest.AppendStringCString (693 of 1736) PASS: lldb-Unit :: Host/./HostTests/SocketTest.UDPGetConnectURI (694 of 1736) UNSUPPORTED: LLDB :: SymbolFile/NativePDB/global-classes.cpp (695 of 1736) XFAIL: LLDB :: Register/x86-64-write.test (696 of 1736) PASS: lldb-Unit :: Utility/./UtilityTests/ArgsTest.StringListConstructor (697 of 1736) PASS: lldb-Suite :: lang/objc/radar-9691614/TestObjCMethodReturningBOOL.py (698 of 1736) PASS: lldb-Suite :: functionalities/breakpoint/debugbreak/TestDebugBreak.py (699 of 1736) PASS: LLDB :: Modules/ELF/base-address.yaml (700 of 1736) PASS: lldb-Unit :: Process/gdb-remote/./ProcessGdbRemoteTests/GDBRemoteCommunicationClientTest.SaveRestoreRegistersNoSuffix (701 of 1736) UNSUPPORTED: LLDB :: SymbolFile/NativePDB/nested-types.cpp (702 of 1736) PASS: lldb-Unit :: Host/./HostTests/NativeProcessProtocolTest.SetBreakpointFailRead (703 of 1736) PASS: lldb-Suite :: python_api/name_lookup/TestNameLookup.py (704 of 1736) PASS: lldb-Unit :: Expression/./ExpressionTests/DiagnosticManagerTest.AppendMessageSubsequentDiags (705 of 1736) PASS: lldb-Unit :: Process/gdb-remote/./ProcessGdbRemoteTests/GDBRemoteCommunicationServerTest.SendErrorResponse_Status (706 of 1736) PASS: lldb-Suite :: functionalities/thread/backtrace_all/TestBacktraceAll.py (707 of 1736) PASS: lldb-Unit :: Utility/./UtilityTests/RangeTest.ContainsRangeStartingFromZero (708 of 1736) UNSUPPORTED: LLDB :: SymbolFile/PDB/expressions.test (709 of 1736) PASS: lldb-Unit :: Utility/./UtilityTests/StringListTest.LongestCommonPrefixDuplicateElement (710 of 1736) PASS: lldb-Unit :: Utility/./UtilityTests/FileSpecTest.IsRelative (711 of 1736) PASS: LLDB :: SymbolFile/sizeless-symbol.test (712 of 1736) PASS: lldb-Unit :: Process/gdb-remote/./ProcessGdbRemoteTests/GDBRemoteClientBaseTest.SendPacketAndReceiveResponseWithOutputSupport (713 of 1736) PASS: lldb-Suite :: commands/expression/radar_8638051/Test8638051.py (714 of 1736) PASS: lldb-Suite :: functionalities/breakpoint/comp_dir_symlink/TestCompDirSymLink.py (715 of 1736) PASS: lldb-Unit :: Utility/./UtilityTests/DataExtractorTest.GetMaxU64_unchecked (716 of 1736) PASS: lldb-Unit :: Utility/./UtilityTests/StringExtractorTest.GetNameColonValueNoSemicolon (717 of 1736) PASS: lldb-Suite :: functionalities/tsan/basic/TestTsanBasic.py (718 of 1736) PASS: lldb-Unit :: Host/./HostTests/NativeProcessProtocolTest.SetBreakpointFailVerify (719 of 1736) PASS: lldb-Unit :: ScriptInterpreter/Python/./ScriptInterpreterPythonTests/PythonDataObjectsTest.TestPythonStringToStr (720 of 1736) PASS: lldb-Suite :: lang/cpp/inlines/TestInlines.py (721 of 1736) PASS: lldb-Unit :: Process/minidump/./LLDBMinidumpTests/MinidumpParserTest.GetThreadContext_x86_32_wow64 (722 of 1736) PASS: lldb-Suite :: python_api/breakpoint/TestBreakpointAPI.py (723 of 1736) PASS: LLDB :: Quit/TestQuitExitCodeNonInt.test (724 of 1736) UNSUPPORTED: LLDB :: SymbolFile/DWARF/dir-separator-no-comp-dir.s (725 of 1736) PASS: lldb-Suite :: commands/frame/diagnose/inheritance/TestDiagnoseInheritance.py (726 of 1736) PASS: lldb-Suite :: lang/objc/forward-decl/TestForwardDecl.py (727 of 1736) PASS: lldb-Unit :: Utility/./UtilityTests/StringListTest.ForRangeEmpty (728 of 1736) PASS: lldb-Unit :: UnwindAssembly/x86/./UnwindAssemblyx86Tests/Testx86AssemblyInspectionEngine.TestMovRSPtoRBP (729 of 1736) UNSUPPORTED: LLDB :: SymbolFile/DWARF/find-method.cpp (730 of 1736) PASS: lldb-Suite :: python_api/findvalue_duplist/TestSBFrameFindValue.py (731 of 1736) PASS: lldb-Suite :: lang/cpp/overloaded-functions/TestOverloadedFunctions.py (732 of 1736) UNSUPPORTED: LLDB :: SymbolFile/DWARF/debug-types-signature-loop.s (733 of 1736) PASS: lldb-Suite :: functionalities/show_location/TestShowLocationDwarf5.py (734 of 1736) PASS: lldb-Unit :: Process/gdb-remote/./ProcessGdbRemoteTests/GDBRemoteClientBaseTest.InterruptNoResponse (735 of 1736) UNSUPPORTED: LLDB :: Breakpoint/case-insensitive.test (736 of 1736) PASS: lldb-Unit :: Language/Highlighting/./HighlighterTests/HighlighterTest.ClangCursorPosInOtherToken (737 of 1736) PASS: lldb-Unit :: Target/./TargetTests/ExecutionContextTest.GetByteOrderTarget (738 of 1736) PASS: lldb-Unit :: Process/gdb-remote/./ProcessGdbRemoteTests/GDBRemoteCommunicationServerTest.SendErrorResponse_ErrorNumber (739 of 1736) PASS: lldb-Suite :: source-manager/TestSourceManager.py (740 of 1736) PASS: lldb-Suite :: functionalities/thread/exit_during_break/TestExitDuringBreak.py (741 of 1736) PASS: lldb-Suite :: functionalities/breakpoint/address_breakpoints/TestAddressBreakpoints.py (742 of 1736) PASS: lldb-Unit :: Utility/./UtilityTests/StreamTest.PutCStringWithStringRef (743 of 1736) PASS: lldb-Suite :: functionalities/thread/concurrent_events/TestConcurrentDelayedCrashWithBreakpointSignal.py (744 of 1736) PASS: lldb-Suite :: lang/objc/objc-dynamic-value/TestObjCDynamicValue.py (745 of 1736) PASS: lldb-Unit :: Utility/./UtilityTests/ProcessInstanceInfo.Dump (746 of 1736) PASS: lldb-Suite :: commands/expression/expr-in-syscall/TestExpressionInSyscall.py (747 of 1736) PASS: lldb-Unit :: ScriptInterpreter/Python/./ScriptInterpreterPythonTests/PythonDataObjectsTest.TestPythonString (748 of 1736) PASS: lldb-Unit :: Utility/./UtilityTests/ProcessInstanceInfo.DumpTable_invalidUID (749 of 1736) PASS: lldb-Suite :: python_api/value/linked_list/TestValueAPILinkedList.py (750 of 1736) PASS: lldb-Suite :: tools/lldb-server/TestLldbGdbServer.py (751 of 1736) PASS: lldb-Suite :: functionalities/tail_call_frames/ambiguous_tail_call_seq1/TestAmbiguousTailCallSeq1.py (752 of 1736) PASS: LLDB :: Quit/TestQuitExitCode0.test (753 of 1736) PASS: lldb-Suite :: lang/c/find_struct_type/TestFindStructTypes.py (754 of 1736) PASS: lldb-Suite :: commands/log/basic/TestLogging.py (755 of 1736) PASS: lldb-Suite :: lang/objc/real-definition/TestRealDefinition.py (756 of 1736) PASS: lldb-Suite :: tools/lldb-server/TestGdbRemoteProcessInfo.py (757 of 1736) PASS: lldb-Suite :: functionalities/data-formatter/data-formatter-stl/libstdcpp/unique_ptr/TestDataFormatterStdUniquePtr.py (758 of 1736) PASS: lldb-Unit :: Utility/./UtilityTests/StringListTest.AppendStringStdString (759 of 1736) PASS: lldb-Unit :: Expression/./ExpressionTests/DiagnosticManagerTest.GetStringPreserveOrder (760 of 1736) PASS: LLDB :: SymbolFile/Breakpad/unwind-via-stack-win.test (761 of 1736) PASS: LLDB :: Breakpoint/ppc64-localentry.test (762 of 1736) PASS: lldb-Suite :: lang/objc/rdar-11355592/TestRdar11355592.py (763 of 1736) PASS: lldb-Unit :: Utility/./UtilityTests/RegularExpression.Invalid (764 of 1736) PASS: lldb-Suite :: functionalities/data-formatter/data-formatter-objc/TestDataFormatterObjCExpr.py (765 of 1736) PASS: lldb-Unit :: Utility/./UtilityTests/StreamTest.PutChar (766 of 1736) PASS: lldb-Unit :: Utility/./UtilityTests/LogChannelTest.Disable (767 of 1736) UNSUPPORTED: LLDB :: Unwind/eh-frame-small-fde.test (768 of 1736) PASS: lldb-Suite :: commands/watchpoints/step_over_watchpoint/TestStepOverWatchpoint.py (769 of 1736) PASS: lldb-Suite :: functionalities/breakpoint/breakpoint_language/TestBreakpointLanguage.py (770 of 1736) PASS: lldb-Suite :: commands/help/TestHelp.py (771 of 1736) PASS: lldb-Unit :: Utility/./UtilityTests/StringExtractorTest.GetHexU8_Extra_NoEof (772 of 1736) PASS: lldb-Suite :: lang/objc/objc-baseclass-sbtype/TestObjCBaseClassSBType.py (773 of 1736) PASS: lldb-Suite :: lang/cpp/char8_t/TestCxxChar8_t.py (774 of 1736) PASS: lldb-Suite :: commands/expression/import-std-module/no-std-module/TestMissingStdModule.py (775 of 1736) UNSUPPORTED: LLDB :: Modules/PECOFF/uuid.yaml (776 of 1736) PASS: lldb-Suite :: commands/expression/call-function/TestCallStdStringFunction.py (777 of 1736) PASS: lldb-Suite :: lang/c/inlines/TestRedefinitionsInInlines.py (778 of 1736) PASS: lldb-Suite :: functionalities/testid/TestTestId.py (779 of 1736) PASS: lldb-Unit :: SymbolFile/NativePDB/./SymbolFileNativePDBTests/PDBFPOProgramToDWARFExpressionTests.MultipleIndependentAssignments (780 of 1736) PASS: lldb-Unit :: Utility/./UtilityTests/LogChannelEnabledTest.LLDB_LOG_ERROR (781 of 1736) PASS: lldb-Unit :: Utility/./UtilityTests/OptionsWithRawTest.UnterminatedQuote (782 of 1736) PASS: lldb-Unit :: Host/./HostTests/FileSystemTest.Readable (783 of 1736) PASS: lldb-Suite :: functionalities/recursion/TestValueObjectRecursion.py (784 of 1736) PASS: lldb-Unit :: Utility/./UtilityTests/StringListTest.GetSize (785 of 1736) PASS: LLDB :: Modules/ELF/PT_LOAD-overlap-section.yaml (786 of 1736) PASS: LLDB :: SymbolFile/DWARF/debug_loc.s (787 of 1736) UNSUPPORTED: LLDB :: Register/x86-gp-write.test (788 of 1736) PASS: lldb-Suite :: python_api/sblaunchinfo/TestSBLaunchInfo.py (789 of 1736) PASS: lldb-Unit :: Utility/./UtilityTests/Predicate.WaitForValueNotEqualTo (790 of 1736) PASS: LLDB :: SymbolFile/DWARF/compilercontext.ll (791 of 1736) PASS: lldb-Suite :: lang/objc/objc-stepping/TestObjCStepping.py (792 of 1736) PASS: lldb-Unit :: Utility/./UtilityTests/StreamTest.PutULEB128 (793 of 1736) PASS: lldb-Suite :: functionalities/set-data/TestSetData.py (794 of 1736) PASS: lldb-Unit :: Utility/./UtilityTests/StringListTest.JoinNonSpace (795 of 1736) PASS: LLDB :: Quit/TestQuitExitCode30.test (796 of 1736) PASS: lldb-Unit :: Utility/./UtilityTests/SerializationRountripTest.SerializeDeserializePod (797 of 1736) PASS: lldb-Unit :: Utility/./UtilityTests/StringListTest.CopyList (798 of 1736) PASS: lldb-Suite :: python_api/sbvalue_persist/TestSBValuePersist.py (799 of 1736) UNSUPPORTED: LLDB :: SymbolFile/PDB/type-quals.test (800 of 1736) PASS: lldb-Unit :: Utility/./UtilityTests/StringExtractorTest.GetHexBytesAvail_Underflow (801 of 1736) PASS: lldb-Suite :: functionalities/gdb_remote_client/TestStopPCs.py (802 of 1736) PASS: lldb-Unit :: Utility/./UtilityTests/BinaryStreamTest.PutSLEB128Zero (803 of 1736) PASS: lldb-Unit :: Utility/./UtilityTests/RegularExpression.Empty (804 of 1736) UNSUPPORTED: LLDB :: SymbolFile/NativePDB/function-types-calling-conv.cpp (805 of 1736) PASS: lldb-Suite :: functionalities/gdb_remote_client/TestRecognizeBreakpoint.py (806 of 1736) PASS: lldb-Unit :: Utility/./UtilityTests/StringLexerTest.AdvanceIf (807 of 1736) PASS: lldb-Suite :: commands/expression/macros/TestMacros.py (808 of 1736) PASS: lldb-Unit :: Utility/./UtilityTests/UriParserTest.BracketedHostnameWithColon (809 of 1736) PASS: lldb-Unit :: Process/minidump/./LLDBMinidumpTests/MinidumpParserTest.GetPidWindows (810 of 1736) PASS: lldb-Unit :: Utility/./UtilityTests/UUIDTest.RelationalOperators (811 of 1736) PASS: lldb-Unit :: Utility/./UtilityTests/ArgsTest.TestInsertArg (812 of 1736) PASS: lldb-Suite :: functionalities/breakpoint/breakpoint_command/TestBreakpointCommandsFromPython.py (813 of 1736) PASS: lldb-Suite :: functionalities/data-formatter/data-formatter-synth/TestDataFormatterSynth.py (814 of 1736) PASS: lldb-Suite :: functionalities/data-formatter/data-formatter-stl/libcxx/list/loop/TestDataFormatterLibcxxListLoop.py (815 of 1736) PASS: lldb-Suite :: functionalities/gdb_remote_client/TestArmRegisterDefinition.py (816 of 1736) PASS: lldb-Unit :: Process/gdb-remote/./ProcessGdbRemoteTests/GDBRemoteCommunicationClientTest.GetModulesInfoInvalidResponse (817 of 1736) PASS: lldb-Unit :: ScriptInterpreter/Python/./ScriptInterpreterPythonTests/PythonDataObjectsTest.TestOwnedReferences (818 of 1736) PASS: lldb-Unit :: Utility/./UtilityTests/StringListTest.Assignment (819 of 1736) PASS: lldb-Suite :: functionalities/breakpoint/breakpoint_locations/TestBreakpointLocations.py (820 of 1736) PASS: lldb-Unit :: Utility/./UtilityTests/StringExtractorTest.GetHexBytesAvail_OddPair (821 of 1736) PASS: lldb-Suite :: functionalities/thread/concurrent_events/TestConcurrentDelaySignalWatch.py (822 of 1736) PASS: lldb-Unit :: Utility/./UtilityTests/IndexToObjectTest.ObjectForIndex (823 of 1736) PASS: LLDB :: Commands/CommandScriptImmediateOutput/CommandScriptImmediateOutputFile.test (824 of 1736) PASS: lldb-Suite :: commands/register/register/intel_xtended_registers/mpx_bound_violation/TestBoundViolation.py (825 of 1736) PASS: lldb-Unit :: Expression/./ExpressionTests/ClangHostTest.ComputeClangResourceDirectory (826 of 1736) PASS: lldb-Suite :: lang/objc/objc-struct-return/TestObjCStructReturn.py (827 of 1736) PASS: lldb-Suite :: functionalities/thread/concurrent_events/TestConcurrentDelaySignalBreak.py (828 of 1736) PASS: lldb-Suite :: lang/cpp/member-and-local-vars-with-same-name/TestMembersAndLocalsWithSameName.py (829 of 1736) PASS: lldb-Unit :: Utility/./UtilityTests/StringListTest.GetMaxStringLengthDecreasingSize (830 of 1736) PASS: lldb-Suite :: functionalities/data-formatter/data-formatter-cpp/TestDataFormatterCpp.py (831 of 1736) PASS: lldb-Suite :: python_api/watchpoint/watchlocation/TestSetWatchlocation.py (832 of 1736) PASS: lldb-Suite :: python_api/objc_type/TestObjCType.py (833 of 1736) UNSUPPORTED: LLDB :: SymbolFile/PDB/variables.test (834 of 1736) PASS: lldb-Unit :: Utility/./UtilityTests/NameMatchesTest.Ignore (835 of 1736) PASS: lldb-Suite :: functionalities/value_md5_crash/TestValueMD5Crash.py (836 of 1736) PASS: lldb-Unit :: Utility/./UtilityTests/UserIDResolver.GetUserName (837 of 1736) UNSUPPORTED: LLDB :: Register/x86-64-ymm16-read.test (838 of 1736) PASS: lldb-Suite :: macosx/add-dsym/TestAddDsymMidExecutionCommand.py (839 of 1736) PASS: lldb-Unit :: Host/./HostTests/NativeProcessProtocolTest.ReadMemoryWithoutTrap (840 of 1736) PASS: LLDB :: Minidump/dump-all.test (841 of 1736) PASS: lldb-Suite :: commands/disassemble/basic/TestFrameDisassemble.py (842 of 1736) PASS: lldb-Unit :: Utility/./UtilityTests/EventTest.DumpEventDataBytes (843 of 1736) PASS: lldb-Unit :: Host/./HostTests/SocketAddressTest.Set (844 of 1736) UNSUPPORTED: LLDB :: SymbolFile/NativePDB/s_constant.cpp (845 of 1736) PASS: lldb-Suite :: macosx/safe-to-func-call/TestSafeFuncCalls.py (846 of 1736) PASS: lldb-Suite :: commands/watchpoints/watchpoint_events/TestWatchpointEvents.py (847 of 1736) PASS: lldb-Suite :: commands/frame/diagnose/complicated-expression/TestComplicatedExpression.py (848 of 1736) PASS: lldb-Unit :: Utility/./UtilityTests/ScalarTest.APIntConstructor (849 of 1736) PASS: lldb-Suite :: functionalities/thread/concurrent_events/TestConcurrentWatchpointWithDelayWatchpointThreads.py (850 of 1736) PASS: lldb-Unit :: ScriptInterpreter/Python/./ScriptInterpreterPythonTests/PythonDataObjectsTest.TestPythonTupleInitializerList (851 of 1736) PASS: LLDB :: Driver/TestNoUseColor.test (852 of 1736) PASS: lldb-Unit :: Utility/./UtilityTests/StringExtractorTest.GetHexBytes_OddPair2 (853 of 1736) PASS: lldb-Unit :: UnwindAssembly/x86/./UnwindAssemblyx86Tests/Testx86AssemblyInspectionEngine.TestDisassemblyJunkBytes (854 of 1736) PASS: lldb-Suite :: lang/objcxx/class-name-clash/TestNameClash.py (855 of 1736) PASS: lldb-Suite :: functionalities/postmortem/elf-core/gcore/TestGCore.py (856 of 1736) PASS: lldb-Unit :: Expression/./ExpressionTests/DiagnosticManagerTest.GetStringSeverityLabels (857 of 1736) PASS: lldb-Unit :: Utility/./UtilityTests/BinaryStreamTest.PutULEB128TwoBytes (858 of 1736) PASS: lldb-Unit :: Disassembler/./DisassemblerTests/TestArmv7Disassembly.TestCortexFPDisass (859 of 1736) PASS: lldb-Suite :: commands/target/create-no-such-arch/TestNoSuchArch.py (860 of 1736) PASS: lldb-Unit :: Utility/./UtilityTests/ArgsTest.TestUnknownEscape (861 of 1736) PASS: LLDB :: Modules/ELF/PT_LOAD-overlap.yaml (862 of 1736) PASS: lldb-Unit :: Core/./LLDBCoreTests/UniqueCStringMap.NoDefaultConstructor (863 of 1736) PASS: lldb-Unit :: Process/minidump/./LLDBMinidumpTests/MinidumpParserTest.GetThreadContext_x86_64 (864 of 1736) PASS: lldb-Unit :: UnwindAssembly/x86/./UnwindAssemblyx86Tests/Testx86AssemblyInspectionEngine.TestPushESI (865 of 1736) PASS: lldb-Unit :: Utility/./UtilityTests/ConstStringTest.MangledCounterpart (866 of 1736) PASS: lldb-Unit :: Expression/./ExpressionTests/DWARFExpression.DW_OP_convert (867 of 1736) PASS: lldb-Unit :: Process/minidump/./LLDBMinidumpTests/MinidumpParserTest.GetMiscInfo_no_stream (868 of 1736) PASS: lldb-Unit :: Host/./HostTests/NativeProcessProtocolTest.SetBreakpointFailWrite (869 of 1736) PASS: lldb-Suite :: lang/c/conflicting-symbol/TestConflictingSymbol.py (870 of 1736) PASS: lldb-Suite :: functionalities/breakpoint/scripted_bkpt/TestScriptedResolver.py (871 of 1736) UNSUPPORTED: LLDB :: SymbolFile/DWARF/find-basic-type.cpp (872 of 1736) PASS: lldb-Suite :: functionalities/process_group/TestChangeProcessGroup.py (873 of 1736) PASS: lldb-Suite :: commands/expression/radar_9531204/TestPrintfAfterUp.py (874 of 1736) PASS: lldb-Unit :: Symbol/./SymbolTests/TestClangASTContext.TestGetBasicTypeFromName (875 of 1736) PASS: lldb-Unit :: Utility/./UtilityTests/StringListTest.CopyListEmpty (876 of 1736) PASS: lldb-Unit :: Utility/./UtilityTests/StringLexerTest.Next (877 of 1736) PASS: lldb-Unit :: Utility/./UtilityTests/VMRange.ContainsAddr (878 of 1736) PASS: lldb-Suite :: lang/c/typedef/Testtypedef.py (879 of 1736) PASS: lldb-Unit :: Utility/./UtilityTests/StringExtractorTest.DecodeHexU8_Exact (880 of 1736) UNSUPPORTED: LLDB :: ExecControl/StopHook/stop-hook-threads.test (881 of 1736) PASS: lldb-Suite :: commands/expression/call-throws/TestCallThatThrows.py (882 of 1736) PASS: lldb-Unit :: Language/Highlighting/./HighlighterTests/HighlighterTest.DefaultHighlighterWithCursor (883 of 1736) UNSUPPORTED: LLDB :: Register/x86-64-xmm16-read.test (884 of 1736) PASS: lldb-Suite :: functionalities/data-formatter/data-formatter-stl/libstdcpp/tuple/TestDataFormatterStdTuple.py (885 of 1736) UNSUPPORTED: LLDB :: SymbolFile/NativePDB/ast-types.cpp (886 of 1736) PASS: lldb-Suite :: lang/objc/objc-runtime-ivars/TestRuntimeIvars.py (887 of 1736) PASS: lldb-Unit :: UnwindAssembly/x86/./UnwindAssemblyx86Tests/Testx86AssemblyInspectionEngine.TestPopEBP (888 of 1736) PASS: lldb-Unit :: Expression/./ExpressionTests/DiagnosticManagerTest.GetStringBasic (889 of 1736) PASS: lldb-Unit :: Utility/./UtilityTests/StreamTest.PutHex16ByteOrderLittle (890 of 1736) PASS: LLDB :: Modules/Breakpad/sections.test (891 of 1736) PASS: lldb-Suite :: arm/breakpoint-thumb-codesection/TestBreakpointThumbCodesection.py (892 of 1736) PASS: lldb-Unit :: Utility/./UtilityTests/RecordReplayTest.InstrumentedFoo (893 of 1736) PASS: LLDB :: Settings/TestFrameFormatColor.test (894 of 1736) UNSUPPORTED: LLDB :: Register/x86-ymm-write.test (895 of 1736) PASS: lldb-Suite :: tools/lldb-server/thread-name/TestGdbRemoteThreadName.py (896 of 1736) PASS: lldb-Unit :: Language/Highlighting/./HighlighterTests/HighlighterTest.ClangCursorPosAfterOtherToken (897 of 1736) PASS: lldb-Unit :: tools/lldb-server/tests/./LLDBServerTests/TestBase.LaunchModePreservesEnvironment (898 of 1736) PASS: lldb-Suite :: lang/cpp/dynamic-value/TestDynamicValue.py (899 of 1736) UNSUPPORTED: LLDB :: SymbolFile/NativePDB/tag-types.cpp (900 of 1736) PASS: lldb-Suite :: functionalities/data-formatter/data-formatter-ptr-to-array/TestPtrToArrayFormatting.py (901 of 1736) PASS: lldb-Unit :: Symbol/./SymbolTests/Type.CompilerContextPattern (902 of 1736) PASS: LLDB :: Modules/ELF/PT_LOAD-overlap-PT_INTERP.yaml (903 of 1736) PASS: lldb-Suite :: functionalities/data-formatter/refpointer-recursion/TestDataFormatterRefPtrRecursion.py (904 of 1736) PASS: lldb-Suite :: functionalities/data-formatter/data-formatter-objc/nsstring/TestDataFormatterNSString.py (905 of 1736) PASS: lldb-Suite :: functionalities/data-formatter/data-formatter-globals/TestDataFormatterGlobals.py (906 of 1736) PASS: lldb-Suite :: api/listeners/TestListener.py (907 of 1736) PASS: lldb-Unit :: SymbolFile/NativePDB/./SymbolFileNativePDBTests/PDBFPOProgramToDWARFExpressionTests.MissingTargetRegister (908 of 1736) PASS: lldb-Suite :: lang/objc/foundation/TestObjectDescriptionAPI.py (909 of 1736) PASS: LLDB :: SymbolFile/DWARF/deterministic-build.cpp (910 of 1736) PASS: lldb-Unit :: Utility/./UtilityTests/RangeTest.SetRangeBase (911 of 1736) PASS: LLDB :: Driver/TestProcessAttach.test (912 of 1736) PASS: lldb-Suite :: functionalities/breakpoint/breakpoint_options/TestBreakpointOptions.py (913 of 1736) PASS: lldb-Suite :: lang/cpp/auto/TestCPPAuto.py (914 of 1736) PASS: lldb-Unit :: Utility/./UtilityTests/RangeDataVector.FindEntryThatContains_Overlap (915 of 1736) PASS: lldb-Suite :: commands/expression/po_verbosity/TestPoVerbosity.py (916 of 1736) PASS: lldb-Unit :: Utility/./UtilityTests/CompletionRequest.Constructor (917 of 1736) PASS: lldb-Unit :: Utility/./UtilityTests/StringListTest.LongestCommonPrefix (918 of 1736) PASS: lldb-Unit :: ScriptInterpreter/Python/./ScriptInterpreterPythonTests/PythonDataObjectsTest.TestPythonListValueEquality (919 of 1736) PASS: lldb-Unit :: Utility/./UtilityTests/VASprintfTest.BufferResize (920 of 1736) PASS: LLDB :: Reproducer/TestReuseDirectory.test (921 of 1736) PASS: lldb-Unit :: Utility/./UtilityTests/VMRange.CollectionContains (922 of 1736) PASS: lldb-Suite :: commands/expression/pr35310/TestExprsBug35310.py (923 of 1736) PASS: lldb-Suite :: functionalities/data-formatter/data-formatter-stl/libcxx/forward_list/TestDataFormatterLibcxxForwardList.py (924 of 1736) PASS: lldb-Suite :: lang/cpp/trivial_abi/TestTrivialABI.py (925 of 1736) PASS: lldb-Unit :: ScriptInterpreter/Python/./ScriptInterpreterPythonTests/PythonDataObjectsTest.TestPythonCallableInvoke (926 of 1736) PASS: lldb-Unit :: Utility/./UtilityTests/Predicate.WaitForValueEqualTo (927 of 1736) PASS: LLDB :: Driver/TestConvenienceVariables.test (928 of 1736) PASS: lldb-Unit :: Symbol/./SymbolTests/PostfixExpression.ParseFPOProgram (929 of 1736) PASS: lldb-Suite :: commands/add-dsym/uuid/TestAddDsymCommand.py (930 of 1736) PASS: lldb-Suite :: functionalities/breakpoint/breakpoint_ignore_count/TestBreakpointIgnoreCount.py (931 of 1736) PASS: lldb-Unit :: Utility/./UtilityTests/StringExtractorTest.GetHexBytes_OddPair (932 of 1736) PASS: lldb-Unit :: Utility/./UtilityTests/FileSpecTest.EqualSeparator (933 of 1736) PASS: lldb-Suite :: commands/expression/import-std-module/unique_ptr-dbg-info-content/TestUniquePtrDbgInfoContent.py (934 of 1736) PASS: lldb-Suite :: functionalities/postmortem/netbsd-core/TestNetBSDCore.py (935 of 1736) PASS: lldb-Unit :: Utility/./UtilityTests/StreamTest.QuotedCString (936 of 1736) PASS: lldb-Unit :: Language/CPlusPlus/./LanguageCPlusPlusTests/CPlusPlusLanguage.MethodNameParsing (937 of 1736) PASS: lldb-Unit :: Utility/./UtilityTests/SerializationRountripTest.SerializeDeserializePodReferences (938 of 1736) PASS: lldb-Unit :: ScriptInterpreter/Python/./ScriptInterpreterPythonTests/PythonDataObjectsTest.TestPythonListToStructuredList (939 of 1736) PASS: lldb-Suite :: python_api/event/TestEvents.py (940 of 1736) PASS: lldb-Suite :: functionalities/return-value/TestReturnValue.py (941 of 1736) PASS: lldb-Suite :: python_api/process/io/TestProcessIO.py (942 of 1736) UNSUPPORTED: LLDB :: Modules/PECOFF/export-dllfunc.yaml (943 of 1736) PASS: lldb-Unit :: Process/gdb-remote/./ProcessGdbRemoteTests/GDBRemoteClientBaseTest.SendContinueAndInterrupt2PacketBug (944 of 1736) PASS: lldb-Unit :: Utility/./UtilityTests/BinaryStreamTest.PutSLEB128SixBytes (945 of 1736) PASS: lldb-Unit :: Utility/./UtilityTests/FileSpecTest.EqualDotsPosix (946 of 1736) PASS: lldb-Suite :: functionalities/data-formatter/nssetsynth/TestNSSetSynthetic.py (947 of 1736) PASS: LLDB :: Minidump/fb-dump.test (948 of 1736) PASS: lldb-Unit :: UnwindAssembly/x86/./UnwindAssemblyx86Tests/Testx86AssemblyInspectionEngine.TestPushRBP (949 of 1736) PASS: lldb-Suite :: macosx/universal/TestUniversal.py (950 of 1736) PASS: lldb-Suite :: lang/objc/blocks/TestObjCIvarsInBlocks.py (951 of 1736) PASS: lldb-Unit :: Language/Highlighting/./HighlighterTests/HighlighterTest.DefaultHighlighterWithCursorOutOfBounds (952 of 1736) PASS: lldb-Unit :: UnwindAssembly/x86/./UnwindAssemblyx86Tests/Testx86AssemblyInspectionEngine.TestStackRealign32BitDisp_x86_64 (953 of 1736) PASS: lldb-Suite :: commands/expression/import-std-module/stack/TestStack.py (954 of 1736) PASS: lldb-Unit :: Utility/./UtilityTests/ScalarTest.Equality (955 of 1736) PASS: lldb-Suite :: functionalities/darwin_log/filter/regex/category/TestDarwinLogFilterRegexCategory.py (956 of 1736) PASS: lldb-Suite :: lang/c/vla/TestVLA.py (957 of 1736) PASS: lldb-Unit :: Host/./HostTests/MainLoopTest.ReadObject (958 of 1736) PASS: lldb-Unit :: Utility/./UtilityTests/RangeTest.DoesIntersect (959 of 1736) PASS: lldb-Unit :: Process/minidump/./LLDBMinidumpTests/MinidumpParserTest.GetMemory (960 of 1736) PASS: lldb-Suite :: lang/objc/modules-auto-import/TestModulesAutoImport.py (961 of 1736) PASS: LLDB :: SymbolFile/Breakpad/line-table-edgecases.test (962 of 1736) UNSUPPORTED: LLDB :: SymbolFile/DWARF/dir-separator-windows.s (963 of 1736) PASS: lldb-Suite :: functionalities/data-formatter/dump_dynamic/TestDumpDynamic.py (964 of 1736) PASS: lldb-Unit :: Utility/./UtilityTests/UriParserTest.SchemeHostSeparator2 (965 of 1736) PASS: lldb-Unit :: Process/gdb-remote/./ProcessGdbRemoteTests/GDBRemoteClientBaseTest.SendContinueDelegateStructuredDataReceipt (966 of 1736) UNSUPPORTED: LLDB :: SymbolFile/NativePDB/globals-bss.cpp (967 of 1736) PASS: lldb-Suite :: functionalities/tail_call_frames/disambiguate_tail_call_seq/TestDisambiguateTailCallSeq.py (968 of 1736) PASS: lldb-Unit :: Utility/./UtilityTests/LogChannelTest.Enable (969 of 1736) PASS: lldb-Suite :: python_api/lldbutil/process/TestPrintStackTraces.py (970 of 1736) PASS: lldb-Unit :: UnwindAssembly/x86/./UnwindAssemblyx86Tests/Testx86AssemblyInspectionEngine.Test32BitOnlyInstruction (971 of 1736) PASS: lldb-Suite :: commands/expression/context-object/TestContextObject.py (972 of 1736) PASS: lldb-Suite :: functionalities/darwin_log/filter/exact_match/message/TestDarwinLogFilterMatchMessage.py (973 of 1736) PASS: lldb-Unit :: Process/minidump/./LLDBMinidumpTests/MinidumpParserTest.FindMemoryRange (974 of 1736) PASS: lldb-Suite :: functionalities/data-formatter/data-formatter-stl/libcxx/vector/TestDataFormatterLibcxxVector.py (975 of 1736) PASS: lldb-Suite :: commands/expression/import-std-module/weak_ptr/TestWeakPtr.py (976 of 1736) PASS: lldb-Unit :: Process/minidump/./LLDBMinidumpTests/MinidumpParserTest.GetThreadContext_x86_32 (977 of 1736) PASS: LLDB :: BuildScript/modes.test (978 of 1736) PASS: lldb-Unit :: ScriptInterpreter/Python/./ScriptInterpreterPythonTests/PythonDataObjectsTest.TestPythonIntegerToStructuredInteger (979 of 1736) UNSUPPORTED: LLDB :: Register/x86-64-zmm-write.test (980 of 1736) PASS: lldb-Unit :: Host/./HostTests/MainLoopTest.TerminatesImmediately (981 of 1736) PASS: lldb-Unit :: Utility/./UtilityTests/StreamTest.PutBytesAsRawHex8ToLittleEndian (982 of 1736) PASS: lldb-Suite :: lang/objc/foundation/TestObjCMethodsString.py (983 of 1736) UNSUPPORTED: LLDB :: SymbolFile/NativePDB/function-types-builtins.cpp (984 of 1736) PASS: lldb-Suite :: functionalities/ubsan/user-expression/TestUbsanUserExpression.py (985 of 1736) PASS: lldb-Suite :: functionalities/data-formatter/stringprinter/TestStringPrinter.py (986 of 1736) PASS: lldb-Unit :: Utility/./UtilityTests/ConstStringTest.format_provider (987 of 1736) PASS: lldb-Unit :: Language/Highlighting/./HighlighterTests/HighlighterTest.HighlighterSelectionPath (988 of 1736) PASS: lldb-Suite :: functionalities/tail_call_frames/thread_step_out_or_return/TestSteppingOutWithArtificialFrames.py (989 of 1736) PASS: lldb-Suite :: functionalities/breakpoint/breakpoint_command/TestRegexpBreakCommand.py (990 of 1736) PASS: lldb-Suite :: functionalities/data-formatter/data-formatter-named-summaries/TestDataFormatterNamedSummaries.py (991 of 1736) PASS: lldb-Suite :: functionalities/darwin_log/source/debug/TestDarwinLogSourceDebug.py (992 of 1736) PASS: lldb-Unit :: Utility/./UtilityTests/UriParserTest.MinimalPort (993 of 1736) PASS: lldb-Suite :: functionalities/data-formatter/data-formatter-stl/libcxx/optional/TestDataFormatterLibcxxOptional.py (994 of 1736) PASS: lldb-Suite :: functionalities/data-formatter/language_category_updates/TestDataFormatterLanguageCategoryUpdates.py (995 of 1736) PASS: lldb-Suite :: functionalities/rerun/TestRerun.py (996 of 1736) PASS: lldb-Unit :: Process/minidump/./LLDBMinidumpTests/MinidumpParserTest.GetExceptionStream (997 of 1736) PASS: LLDB :: Reproducer/TestFileRepro.test (998 of 1736) PASS: lldb-Suite :: lang/cpp/unique-types/TestUniqueTypes.py (999 of 1736) PASS: lldb-Unit :: Process/minidump/./LLDBMinidumpTests/MinidumpParserTest.GetMemoryRegionInfo (1000 of 1736) PASS: lldb-Suite :: api/log/TestAPILog.py (1001 of 1736) PASS: lldb-Suite :: benchmarks/frame_variable/TestFrameVariableResponse.py (1002 of 1736) UNSUPPORTED: LLDB :: SymbolFile/PDB/vbases.test (1003 of 1736) PASS: lldb-Suite :: tools/lldb-server/inferior-crash/TestGdbRemoteSegFault.py (1004 of 1736) PASS: lldb-Suite :: lang/objc/foundation/TestObjCMethods.py (1005 of 1736) UNSUPPORTED: LLDB :: Modules/PECOFF/dep-modules.yaml (1006 of 1736) PASS: lldb-Suite :: lang/cpp/gmodules-templates/TestGModules.py (1007 of 1736) PASS: lldb-Suite :: functionalities/backticks/TestBackticksWithoutATarget.py (1008 of 1736) PASS: lldb-Suite :: functionalities/ptr_refs/TestPtrRefs.py (1009 of 1736) PASS: lldb-Unit :: Utility/./UtilityTests/ArgsTest.TestSingleArg (1010 of 1736) PASS: lldb-Suite :: macosx/indirect_symbol/TestIndirectSymbols.py (1011 of 1736) PASS: LLDB :: Driver/TestTarget.test (1012 of 1736) PASS: lldb-Unit :: Process/gdb-remote/./ProcessGdbRemoteTests/GDBRemoteClientBaseTest.SendContinueAndLateInterrupt (1013 of 1736) PASS: lldb-Suite :: functionalities/data-formatter/typedef_array/TestTypedefArray.py (1014 of 1736) PASS: lldb-Suite :: functionalities/thread/create_during_step/TestCreateDuringStep.py (1015 of 1736) PASS: lldb-Suite :: functionalities/data-formatter/data-formatter-objc/TestDataFormatterObjCCF.py (1016 of 1736) PASS: lldb-Unit :: Utility/./UtilityTests/BinaryStreamTest.PutSLEB128MaxValue (1017 of 1736) PASS: lldb-Unit :: UnwindAssembly/x86/./UnwindAssemblyx86Tests/Testx86AssemblyInspectionEngine.TestPopR13 (1018 of 1736) PASS: LLDB :: Reproducer/TestDriverOptions.test (1019 of 1736) PASS: LLDB :: Commands/CommandScriptImmediateOutput/CommandScriptImmediateOutputConsole.test (1020 of 1736) PASS: lldb-Suite :: commands/watchpoints/hello_watchlocation/TestWatchLocation.py (1021 of 1736) PASS: lldb-Suite :: tools/lldb-server/TestGdbRemoteThreadsInStopReply.py (1022 of 1736) PASS: lldb-Unit :: Utility/./UtilityTests/BinaryStreamTest.PutULEB128FiveBytes (1023 of 1736) PASS: LLDB :: Register/x86-64-read.test (1024 of 1736) PASS: lldb-Suite :: lang/c/struct_types/TestStructTypes.py (1025 of 1736) PASS: lldb-Unit :: Utility/./UtilityTests/RangeTest.DoesAdjoinOrIntersect (1026 of 1736) PASS: lldb-Suite :: lang/cpp/stl/TestSTL.py (1027 of 1736) PASS: lldb-Suite :: lang/objc/objc-checker/TestObjCCheckers.py (1028 of 1736) PASS: lldb-Suite :: functionalities/data-formatter/data-formatter-stl/libcxx/map/TestDataFormatterLibccMap.py (1029 of 1736) PASS: lldb-Unit :: Utility/./UtilityTests/FileSpecTest.GetNormalizedPath (1030 of 1736) PASS: lldb-Unit :: UnwindAssembly/x86/./UnwindAssemblyx86Tests/Testx86AssemblyInspectionEngine.TestSimplex86_64Augmented (1031 of 1736) PASS: lldb-Suite :: lang/c/register_variables/TestRegisterVariables.py (1032 of 1736) UNSUPPORTED: LLDB :: SymbolFile/DWARF/find-variable-dwo.cpp (1033 of 1736) PASS: lldb-Suite :: commands/frame/diagnose/local-variable/TestLocalVariable.py (1034 of 1736) PASS: lldb-Suite :: commands/expression/call-function/TestCallBuiltinFunction.py (1035 of 1736) PASS: lldb-Unit :: Utility/./UtilityTests/UriParserTest.PortOverflow (1036 of 1736) PASS: lldb-Unit :: Utility/./UtilityTests/StringListTest.GetMaxStringLengthEmpty (1037 of 1736) PASS: lldb-Suite :: functionalities/breakpoint/breakpoint_in_delayslot/TestAvoidBreakpointInDelaySlot.py (1038 of 1736) PASS: lldb-Suite :: functionalities/data-formatter/user-format-vs-summary/TestUserFormatVsSummary.py (1039 of 1736) PASS: lldb-Suite :: commands/frame/diagnose/bad-reference/TestBadReference.py (1040 of 1736) PASS: lldb-Suite :: functionalities/inferior-assert/TestInferiorAssert.py (1041 of 1736) PASS: lldb-Suite :: lang/objc/objc-static-method/TestObjCStaticMethod.py (1042 of 1736) PASS: lldb-Unit :: Expression/./ExpressionTests/DiagnosticManagerTest.PutStringSeverities (1043 of 1736) UNSUPPORTED: LLDB :: SymbolFile/target-symbols-add-unwind.test (1044 of 1736) PASS: lldb-Unit :: Disassembler/./DisassemblerTests/TestArm64Disassembly.TestArmv81Instruction (1045 of 1736) PASS: lldb-Unit :: Utility/./UtilityTests/ArchSpecTest.Compatibility (1046 of 1736) PASS: lldb-Suite :: lang/objcxx/objcxx-ivar-vector/TestIvarVector.py (1047 of 1736) PASS: lldb-Unit :: Interpreter/./InterpreterTests/OptionArgParserTest.toScriptLanguage (1048 of 1736) PASS: lldb-Unit :: Process/minidump/./LLDBMinidumpTests/MinidumpParserTest.MinidumpDuplicateModuleMinAddress (1049 of 1736) PASS: lldb-Suite :: commands/watchpoints/watchpoint_disable/TestWatchpointDisable.py (1050 of 1736) PASS: LLDB :: BuildScript/compiler-full-path.test (1051 of 1736) PASS: lldb-Suite :: lang/cpp/dynamic-value-same-basename/TestDynamicValueSameBase.py (1052 of 1736) PASS: lldb-Unit :: Utility/./UtilityTests/AnsiTerminal.Twice (1053 of 1736) PASS: lldb-Unit :: Utility/./UtilityTests/BroadcasterTest.EventTypeHasListeners (1054 of 1736) PASS: lldb-Suite :: functionalities/data-formatter/data-formatter-stl/libstdcpp/string/TestDataFormatterStdString.py (1055 of 1736) PASS: lldb-Suite :: functionalities/dynamic_value_child_count/TestDynamicValueChildCount.py (1056 of 1736) PASS: lldb-Unit :: Expression/./ExpressionTests/DiagnosticManagerTest.AppendMessageNoDiag (1057 of 1736) PASS: lldb-Unit :: Utility/./UtilityTests/StreamTest.PutBytesAsRawHex8ToBigEndian (1058 of 1736) PASS: lldb-Suite :: lang/c/blocks/TestBlocks.py (1059 of 1736) PASS: lldb-Suite :: functionalities/thread/jump/TestThreadJump.py (1060 of 1736) PASS: lldb-Unit :: Utility/./UtilityTests/BinaryStreamTest.PutULEB128SevenBytes (1061 of 1736) PASS: lldb-Suite :: functionalities/unwind/sigtramp/TestSigtrampUnwind.py (1062 of 1736) PASS: lldb-Suite :: functionalities/data-formatter/data-formatter-disabling/TestDataFormatterDisabling.py (1063 of 1736) PASS: lldb-Unit :: Utility/./UtilityTests/ArchSpecTest.TestParseMachCPUDashSubtypeTripleSimple (1064 of 1736) PASS: lldb-Unit :: Process/gdb-remote/./ProcessGdbRemoteTests/GDBRemoteCommunicationClientTest.SendStopTracePacket (1065 of 1736) PASS: lldb-Unit :: Language/Highlighting/./HighlighterTests/HighlighterTest.ClangCommas (1066 of 1736) PASS: lldb-Suite :: commands/expression/multiline-completion/TestMultilineCompletion.py (1067 of 1736) PASS: lldb-Unit :: Utility/./UtilityTests/StreamTest.PutHex64ByteOrderLittle (1068 of 1736) PASS: lldb-Unit :: Process/minidump/./LLDBMinidumpTests/MinidumpParserTest.GetArchitecture (1069 of 1736) PASS: LLDB :: SymbolFile/DWARF/childless-compile-unit.s (1070 of 1736) UNSUPPORTED: LLDB :: SymbolFile/DWARF/dir-separator-no-comp-dir-relative-name.s (1071 of 1736) PASS: lldb-Suite :: functionalities/darwin_log/filter/regex/activity/TestDarwinLogFilterRegexActivity.py (1072 of 1736) PASS: lldb-Unit :: Utility/./UtilityTests/RegularExpression.Valid (1073 of 1736) UNSUPPORTED: LLDB :: SymbolFile/DWARF/debug-types-address-ranges.s (1074 of 1736) PASS: lldb-Suite :: commands/gui/basic/TestGuiBasic.py (1075 of 1736) PASS: lldb-Suite :: functionalities/darwin_log/filter/regex/subsystem/TestDarwinLogFilterRegexSubsystem.py (1076 of 1736) PASS: lldb-Suite :: functionalities/data-formatter/setvaluefromcstring/TestSetValueFromCString.py (1077 of 1736) PASS: lldb-Suite :: android/platform/TestDefaultCacheLineSize.py (1078 of 1736) PASS: lldb-Suite :: functionalities/breakpoint/auto_continue/TestBreakpointAutoContinue.py (1079 of 1736) PASS: lldb-Suite :: functionalities/data-formatter/var-in-aggregate-misuse/TestVarInAggregateMisuse.py (1080 of 1736) PASS: lldb-Unit :: UnwindAssembly/x86/./UnwindAssemblyx86Tests/Testx86AssemblyInspectionEngine.Test32bitFramelessSmallStackFrame (1081 of 1736) PASS: lldb-Suite :: functionalities/data-formatter/frameformat_smallstruct/TestFrameFormatSmallStruct.py (1082 of 1736) PASS: lldb-Unit :: Utility/./UtilityTests/VASprintfTest.EncodingError (1083 of 1736) PASS: lldb-Unit :: Utility/./UtilityTests/ArchSpecTest.TestParseMachCPUDashSubtypeTripleExtra (1084 of 1736) PASS: LLDB :: SymbolFile/Breakpad/symtab-macho.test (1085 of 1736) PASS: lldb-Unit :: Symbol/./SymbolTests/DWARFCallFrameInfoTest.Basic_dwarf4 (1086 of 1736) PASS: lldb-Suite :: lang/objc/bitfield_ivars/TestBitfieldIvars.py (1087 of 1736) PASS: lldb-Unit :: Utility/./UtilityTests/ScalarTest.SetValueFromCString (1088 of 1736) PASS: lldb-Suite :: python_api/interpreter/TestCommandInterpreterAPI.py (1089 of 1736) UNSUPPORTED: LLDB :: Register/x86-ymm-read.test (1090 of 1736) PASS: lldb-Unit :: Utility/./UtilityTests/StringListTest.Clear (1091 of 1736) PASS: lldb-Unit :: Utility/./UtilityTests/ArgsTest.DoubleQuotedItem (1092 of 1736) PASS: lldb-Suite :: commands/process/launch/TestProcessLaunch.py (1093 of 1736) PASS: lldb-Suite :: functionalities/data-formatter/data-formatter-proper-plurals/TestFormattersOneIsSingular.py (1094 of 1736) PASS: lldb-Unit :: Utility/./UtilityTests/RangeTest.Equal (1095 of 1736) PASS: lldb-Suite :: functionalities/unwind/standard/TestStandardUnwind.py (1096 of 1736) PASS: lldb-Unit :: Utility/./UtilityTests/ArgsTest.AppendArguments (1097 of 1736) PASS: lldb-Suite :: functionalities/thread/concurrent_events/TestConcurrentNWatchNBreak.py (1098 of 1736) PASS: lldb-Unit :: Host/./HostTests/FileSystemTest.GetPermissions (1099 of 1736) PASS: lldb-Suite :: lang/cpp/template/TestTemplateArgs.py (1100 of 1736) PASS: lldb-Unit :: Utility/./UtilityTests/ArgsTest.ReplaceArgumentAtIndexShort (1101 of 1736) PASS: lldb-Unit :: ObjectFile/Breakpad/./ObjectFileBreakpadTests/FuncRecord.parse (1102 of 1736) PASS: lldb-Unit :: Process/gdb-remote/./ProcessGdbRemoteTests/GDBRemoteCommunicationClientTest.TestPacketSpeedJSON (1103 of 1736) PASS: lldb-Suite :: commands/expression/scoped_enums/TestScopedEnumType.py (1104 of 1736) PASS: lldb-Suite :: lang/objc/objc-ivar-stripped/TestObjCIvarStripped.py (1105 of 1736) PASS: lldb-Suite :: lang/cpp/offsetof/TestOffsetofCpp.py (1106 of 1736) PASS: LLDB :: Modules/ELF/compressed-sections.yaml (1107 of 1736) PASS: lldb-Unit :: Process/gdb-remote/./ProcessGdbRemoteTests/GDBRemoteCommunicationClientTest.SendStartTracePacket (1108 of 1736) PASS: lldb-Suite :: functionalities/data-formatter/data-formatter-stl/libcxx/variant/TestDataFormatterLibcxxVariant.py (1109 of 1736) PASS: lldb-Unit :: Utility/./UtilityTests/StringExtractorTest.GetHexU8_InvalidHex (1110 of 1736) PASS: lldb-Suite :: python_api/watchpoint/watchlocation/TestTargetWatchAddress.py (1111 of 1736) PASS: lldb-Unit :: Utility/./UtilityTests/AnsiTerminal.Incomplete (1112 of 1736) PASS: lldb-Unit :: Symbol/./SymbolTests/TestClangASTContext.TestRecordHasFields (1113 of 1736) PASS: lldb-Unit :: Utility/./UtilityTests/JSONTest.Newlines (1114 of 1736) PASS: lldb-Suite :: functionalities/postmortem/minidump/TestMiniDump.py (1115 of 1736) PASS: lldb-Suite :: functionalities/data-formatter/ptr_ref_typedef/TestPtrRef2Typedef.py (1116 of 1736) UNSUPPORTED: LLDB :: SymbolFile/DWARF/debug-line-basic.s (1117 of 1736) PASS: lldb-Unit :: Language/CPlusPlus/./LanguageCPlusPlusTests/CPlusPlusLanguage.FindAlternateFunctionManglings (1118 of 1736) PASS: LLDB :: Reproducer/TestGDBRemoteRepro.test (1119 of 1736) PASS: lldb-Suite :: commands/expression/weak_symbols/TestWeakSymbols.py (1120 of 1736) PASS: lldb-Suite :: lang/objc/foundation/TestRuntimeTypes.py (1121 of 1736) PASS: lldb-Suite :: commands/expression/import-std-module/deque-dbg-info-content/TestDbgInfoContentDeque.py (1122 of 1736) PASS: lldb-Unit :: Utility/./UtilityTests/ScalarTest.Comparison (1123 of 1736) PASS: lldb-Unit :: Utility/./UtilityTests/StringLexerTest.NextIfList (1124 of 1736) PASS: LLDB :: Expr/TestIRMemoryMap.test (1125 of 1736) PASS: lldb-Unit :: Utility/./UtilityTests/StructuredDataTest.ParseJSONFromFile (1126 of 1736) PASS: lldb-Unit :: Utility/./UtilityTests/StreamTest.PutHex8 (1127 of 1736) PASS: lldb-Suite :: lang/c/modules/TestCModules.py (1128 of 1736) PASS: lldb-Suite :: tools/lldb-server/TestGdbRemoteSingleStep.py (1129 of 1736) PASS: lldb-Suite :: lang/cpp/this/TestCPPThis.py (1130 of 1736) PASS: lldb-Unit :: UnwindAssembly/x86/./UnwindAssemblyx86Tests/Testx86AssemblyInspectionEngine.TestAddRSP (1131 of 1736) PASS: lldb-Unit :: ScriptInterpreter/Python/./ScriptInterpreterPythonTests/PythonDataObjectsTest.TestPythonTupleValues (1132 of 1736) PASS: lldb-Unit :: Symbol/./SymbolTests/SymbolsTest.LocateExecutableSymbolFileForUnknownExecutableAndMissingSymbolFile (1133 of 1736) PASS: lldb-Unit :: Utility/./UtilityTests/ScalarTest.RightShiftOperator (1134 of 1736) PASS: lldb-Suite :: commands/expression/persistent_types/TestPersistentTypes.py (1135 of 1736) PASS: lldb-Unit :: Utility/./UtilityTests/FileSpecTest.PrependPathComponent (1136 of 1736) PASS: LLDB :: Settings/TestSettingsWrite.test (1137 of 1736) PASS: lldb-Suite :: lang/cpp/const_this/TestConstThis.py (1138 of 1736) PASS: LLDB :: Modules/ELF/PT_LOAD-empty.yaml (1139 of 1736) PASS: LLDB :: Minidump/breakpad-symbols.test (1140 of 1736) PASS: lldb-Suite :: functionalities/postmortem/elf-core/TestLinuxCore.py (1141 of 1736) PASS: lldb-Unit :: Utility/./UtilityTests/StringListTest.SetSize (1142 of 1736) PASS: lldb-Suite :: functionalities/data-formatter/data-formatter-stl/libcxx/vbool/TestDataFormatterLibcxxVBool.py (1143 of 1736) PASS: lldb-Suite :: benchmarks/continue/TestBenchmarkContinue.py (1144 of 1736) PASS: lldb-Unit :: Expression/./ExpressionTests/DWARFExpression.DW_OP_pick (1145 of 1736) PASS: lldb-Unit :: Utility/./UtilityTests/BinaryStreamTest.PutSLEB128OneByte (1146 of 1736) PASS: lldb-Unit :: Utility/./UtilityTests/ArgsTest.ReplaceArgumentAtIndexOutOfRange (1147 of 1736) PASS: lldb-Suite :: lang/objc/variadic_methods/TestVariadicMethods.py (1148 of 1736) PASS: LLDB :: Modules/ELF/gnu-debuglink.yaml (1149 of 1736) PASS: lldb-Suite :: functionalities/data-formatter/data-formatter-stl/libcxx/set/TestDataFormatterLibcxxSet.py (1150 of 1736) PASS: LLDB :: Modules/ELF/aarch64-relocations.yaml (1151 of 1736) PASS: lldb-Suite :: functionalities/tail_call_frames/ambiguous_tail_call_seq2/TestAmbiguousTailCallSeq2.py (1152 of 1736) PASS: lldb-Suite :: tools/lldb-server/TestGdbRemote_vCont.py (1153 of 1736) PASS: lldb-Suite :: lang/objc/objc-foundation-dictionary-empty/TestNSDictionary0.py (1154 of 1736) PASS: lldb-Unit :: Utility/./UtilityTests/RecordReplayTest.InstrumentedBarPtr (1155 of 1736) PASS: lldb-Suite :: functionalities/thread/concurrent_events/TestConcurrentCrashWithSignal.py (1156 of 1736) PASS: lldb-Unit :: Utility/./UtilityTests/ArgsTest.TestTrailingBackslash (1157 of 1736) PASS: lldb-Unit :: Utility/./UtilityTests/ListenerTest.GetEventImmediate (1158 of 1736) PASS: lldb-Suite :: lang/objc/objc-optimized/TestObjcOptimized.py (1159 of 1736) PASS: lldb-Unit :: Utility/./UtilityTests/StringExtractorTest.GetHexU8_InvalidHex_NoEof (1160 of 1736) PASS: lldb-Suite :: functionalities/data-formatter/data-formatter-stl/libcxx/multimap/TestDataFormatterLibccMultiMap.py (1161 of 1736) PASS: lldb-Suite :: lang/objc/foundation/TestObjCMethodsNSArray.py (1162 of 1736) UNSUPPORTED: LLDB :: Register/x86-64-gp-write.test (1163 of 1736) PASS: LLDB :: Driver/TestCommands.test (1164 of 1736) XFAIL: LLDB :: Register/x86-64-ymm-write.test (1165 of 1736) PASS: lldb-Unit :: Utility/./UtilityTests/StringListTest.GetMaxStringLengthIncreasingSize (1166 of 1736) PASS: lldb-Suite :: commands/expression/inline-namespace/TestInlineNamespace.py (1167 of 1736) PASS: lldb-Unit :: Utility/./UtilityTests/StringExtractorTest.GetHexBytes_Underflow (1168 of 1736) PASS: lldb-Unit :: Utility/./UtilityTests/GeneratorTest.Get (1169 of 1736) PASS: lldb-Suite :: functionalities/postmortem/mach-core/TestMachCore.py (1170 of 1736) PASS: lldb-Suite :: lang/objc/single-entry-dictionary/TestObjCSingleEntryDictionary.py (1171 of 1736) PASS: lldb-Unit :: Utility/./UtilityTests/StringListTest.AppendList (1172 of 1736) PASS: lldb-Suite :: commands/expression/unicode-in-variable/TestUnicodeInVariable.py (1173 of 1736) PASS: lldb-Suite :: macosx/queues/TestQueues.py (1174 of 1736) PASS: lldb-Unit :: ScriptInterpreter/Python/./ScriptInterpreterPythonTests/PythonDataObjectsTest.TestPythonBytes (1175 of 1736) PASS: lldb-Suite :: functionalities/data-formatter/data-formatter-smart-array/TestDataFormatterSmartArray.py (1176 of 1736) PASS: lldb-Suite :: commands/gui/invalid-args/TestInvalidArgsGui.py (1177 of 1736) PASS: lldb-Suite :: lang/objc/modules/TestObjCModules.py (1178 of 1736) PASS: lldb-Suite :: linux/thread/create_during_instruction_step/TestCreateDuringInstructionStep.py (1179 of 1736) PASS: lldb-Suite :: functionalities/breakpoint/cpp_exception/TestCPPExceptionBreakpoint.py (1180 of 1736) PASS: lldb-Suite :: functionalities/data-formatter/pyobjsynthprovider/TestPyObjSynthProvider.py (1181 of 1736) PASS: lldb-Suite :: commands/expression/radar_9673664/TestExprHelpExamples.py (1182 of 1736) PASS: LLDB :: Python/crashlog.test (1183 of 1736) PASS: lldb-Unit :: Utility/./UtilityTests/UUIDTest.StringConverion (1184 of 1736) PASS: lldb-Unit :: debugserver/./debugserverTests/RNBSocket.LoopBackConnectIPv4 (1185 of 1736) PASS: lldb-Suite :: functionalities/data-formatter/data-formatter-stl/libstdcpp/vbool/TestDataFormatterStdVBool.py (1186 of 1736) PASS: lldb-Suite :: tools/lldb-server/register-reading/TestGdbRemoteGPacket.py (1187 of 1736) PASS: lldb-Suite :: functionalities/asan/TestReportData.py (1188 of 1736) PASS: lldb-Suite :: lang/objc/foundation/TestSymbolTable.py (1189 of 1736) PASS: lldb-Suite :: functionalities/exec/TestExec.py (1190 of 1736) PASS: lldb-Suite :: functionalities/breakpoint/breakpoint_command/TestBreakpointCommand.py (1191 of 1736) PASS: lldb-Suite :: commands/expression/import-std-module/vector-dbg-info-content/TestDbgInfoContentVector.py (1192 of 1736) PASS: lldb-Suite :: python_api/disassemble-raw-data/TestDisassemble_VST1_64.py (1193 of 1736) PASS: lldb-Unit :: Utility/./UtilityTests/SerializationRountripTest.SerializeDeserializePodPointers (1194 of 1736) PASS: lldb-Unit :: Utility/./UtilityTests/StreamTeeTest.CopyConstructor (1195 of 1736) PASS: lldb-Unit :: Process/minidump/./LLDBMinidumpTests/MinidumpParserTest.GetPid (1196 of 1736) PASS: lldb-Unit :: Utility/./UtilityTests/ArgsTest.EscapeLLDBCommandArgument (1197 of 1736) PASS: lldb-Unit :: Utility/./UtilityTests/ScalarTest.Promotion (1198 of 1736) PASS: lldb-Unit :: Language/Highlighting/./HighlighterTests/HighlighterTest.Colons (1199 of 1736) PASS: LLDB :: Commands/command-source.test (1200 of 1736) PASS: LLDB :: Minidump/Windows/find-module.test (1201 of 1736) PASS: lldb-Unit :: ScriptInterpreter/Python/./ScriptInterpreterPythonTests/PythonDataObjectsTest.TestPythonTupleToStructuredList (1202 of 1736) PASS: LLDB :: SymbolFile/DWARF/split-dwarf-multiple-cu.ll (1203 of 1736) PASS: lldb-Unit :: Utility/./UtilityTests/ArchSpecTest.TestSetTriple (1204 of 1736) UNSUPPORTED: LLDB :: SymbolFile/DWARF/debug-types-basic.test (1205 of 1736) PASS: lldb-Suite :: functionalities/data-formatter/data-formatter-stl/libcxx/list/TestDataFormatterLibcxxList.py (1206 of 1736) PASS: lldb-Suite :: commands/expression/context-object-objc/TestContextObjectObjc.py (1207 of 1736) PASS: lldb-Unit :: Symbol/./SymbolTests/TestClangASTContext.TemplateArguments (1208 of 1736) UNSUPPORTED: LLDB :: Register/x86-zmm-read.test (1209 of 1736) PASS: LLDB :: Breakpoint/implicit_const_form_support.test (1210 of 1736) PASS: lldb-Suite :: functionalities/breakpoint/breakpoint_hit_count/TestBreakpointHitCount.py (1211 of 1736) PASS: LLDB :: Settings/TestEchoCommands.test (1212 of 1736) PASS: LLDB :: Modules/ELF/many-sections.s (1213 of 1736) PASS: lldb-Unit :: Utility/./UtilityTests/RangeTest.Slide (1214 of 1736) PASS: lldb-Unit :: SymbolFile/DWARF/./SymbolFileDWARFTests/SymbolFileDWARFTests.TestAbbrevInvalidNULLTag (1215 of 1736) PASS: lldb-Suite :: python_api/signals/TestSignalsAPI.py (1216 of 1736) PASS: lldb-Unit :: Signals/./SignalsTests/UnixSignalsTest.VersionChange (1217 of 1736) PASS: lldb-Unit :: Utility/./UtilityTests/ArchSpecTest.TripleComponentsWereSpecified (1218 of 1736) PASS: lldb-Unit :: Host/./HostTests/SocketTest.TCPGetAddress (1219 of 1736) PASS: lldb-Unit :: Signals/./SignalsTests/UnixSignalsTest.Iteration (1220 of 1736) PASS: lldb-Suite :: python_api/frame/inlines/TestInlinedFrame.py (1221 of 1736) PASS: lldb-Suite :: functionalities/thread/concurrent_events/TestConcurrentTwoWatchpointsOneSignal.py (1222 of 1736) PASS: lldb-Unit :: Process/gdb-remote/./ProcessGdbRemoteTests/GDBRemoteClientBaseTest.SendContinueDelegateInterface (1223 of 1736) PASS: lldb-Suite :: functionalities/postmortem/minidump-new/TestMiniDumpNew.py (1224 of 1736) PASS: lldb-Unit :: Utility/./UtilityTests/LogChannelTest.EnableOptions (1225 of 1736) PASS: lldb-Unit :: Utility/./UtilityTests/CompletionRequest.DuplicateFiltering (1226 of 1736) PASS: lldb-Unit :: Utility/./UtilityTests/ProcessInfoTest.Constructor (1227 of 1736) UNSUPPORTED: LLDB :: SymbolFile/NativePDB/break-by-line.cpp (1228 of 1736) PASS: lldb-Suite :: functionalities/breakpoint/cpp/TestCPPBreakpointLocations.py (1229 of 1736) UNSUPPORTED: LLDB :: SymbolFile/DWARF/debug-types-dwo-cross-reference.cpp (1230 of 1736) PASS: lldb-Unit :: Utility/./UtilityTests/StreamTest.PutNHex8 (1231 of 1736) PASS: lldb-Unit :: ObjectFile/Breakpad/./ObjectFileBreakpadTests/PublicRecord.parse (1232 of 1736) PASS: lldb-Suite :: lang/cpp/namespace/TestNamespace.py (1233 of 1736) PASS: lldb-Suite :: commands/statistics/basic/TestStats.py (1234 of 1736) PASS: lldb-Unit :: Utility/./UtilityTests/ProcessInstanceInfo.DumpTable (1235 of 1736) PASS: lldb-Unit :: Target/./TargetTests/PathMappingListTest.RelativeTests (1236 of 1736) UNSUPPORTED: LLDB :: SymbolFile/DWARF/find-type-in-function.cpp (1237 of 1736) PASS: lldb-Unit :: UnwindAssembly/x86/./UnwindAssemblyx86Tests/Testx86AssemblyInspectionEngine.Test32bitFramelessBigStackFrame (1238 of 1736) PASS: lldb-Unit :: Utility/./UtilityTests/StatusTest.ErrorConstructor (1239 of 1736) PASS: lldb-Unit :: Utility/./UtilityTests/ArgsTest.TestAppendArg (1240 of 1736) UNSUPPORTED: LLDB :: SymbolFile/NativePDB/disassembly.cpp (1241 of 1736) PASS: lldb-Suite :: commands/expression/char/TestExprsChar.py (1242 of 1736) PASS: lldb-Suite :: functionalities/darwin_log/basic/TestDarwinLogBasic.py (1243 of 1736) PASS: lldb-Suite :: commands/settings/TestSettings.py (1244 of 1736) PASS: lldb-Suite :: functionalities/thread/crash_during_step/TestCrashDuringStep.py (1245 of 1736) PASS: lldb-Suite :: lang/c/unicode/TestUnicodeSymbols.py (1246 of 1736) PASS: lldb-Suite :: functionalities/breakpoint/consecutive_breakpoints/TestConsecutiveBreakpoints.py (1247 of 1736) PASS: lldb-Unit :: Process/gdb-remote/./ProcessGdbRemoteTests/GDBRemoteClientBaseTest.SendContinueAndAsyncSignal (1248 of 1736) PASS: lldb-Suite :: functionalities/breakpoint/move_nearest/TestMoveNearest.py (1249 of 1736) PASS: lldb-Suite :: macosx/thread-names/TestInterruptThreadNames.py (1250 of 1736) PASS: lldb-Unit :: Utility/./UtilityTests/StreamTest.PutMaxHex64ByteOrderBig (1251 of 1736) PASS: lldb-Unit :: Expression/./ExpressionTests/DiagnosticManagerTest.GetStringMultipleDiags (1252 of 1736) PASS: lldb-Unit :: Process/minidump/./LLDBMinidumpTests/MinidumpParserTest.FindMemoryRangeWithFullMemoryMinidump (1253 of 1736) PASS: lldb-Suite :: types/TestFloatTypesExpr.py (1254 of 1736) PASS: lldb-Unit :: Host/./HostTests/SocketAddressTest.GetAddressInfo (1255 of 1736) PASS: LLDB :: Modules/MachO/subsections.yaml (1256 of 1736) PASS: lldb-Suite :: functionalities/float-display/TestFloatDisplay.py (1257 of 1736) PASS: lldb-Unit :: Utility/./UtilityTests/Flags.Test (1258 of 1736) PASS: lldb-Unit :: Process/gdb-remote/./ProcessGdbRemoteTests/GDBRemoteCommunicationServerTest.SendErrorResponse_UnimplementedError (1259 of 1736) PASS: lldb-Unit :: Utility/./UtilityTests/ArgsTest.TestArgv (1260 of 1736) PASS: lldb-Unit :: Core/./LLDBCoreTests/RichManglingContextTest.FromCxxMethodName (1261 of 1736) PASS: lldb-Suite :: lang/objcxx/cxx-bridged-po/TestObjCXXBridgedPO.py (1262 of 1736) PASS: lldb-Unit :: Utility/./UtilityTests/GeneratorTest.Create (1263 of 1736) PASS: lldb-Unit :: Symbol/./SymbolTests/TestClangASTContext.TestIsClangType (1264 of 1736) PASS: lldb-Suite :: lang/objc/modules-cache/TestClangModulesCache.py (1265 of 1736) PASS: lldb-Suite :: functionalities/thread/num_threads/TestNumThreads.py (1266 of 1736) PASS: lldb-Unit :: Host/./HostTests/FileSystemTest.Resolve (1267 of 1736) PASS: lldb-Unit :: ScriptInterpreter/Python/./ScriptInterpreterPythonTests/PythonDataObjectsTest.TestPythonTupleSize (1268 of 1736) PASS: lldb-Unit :: Expression/./ExpressionTests/DiagnosticManagerTest.PutStringMultiple (1269 of 1736) PASS: lldb-Unit :: Utility/./UtilityTests/StringExtractorTest.GetHexBytes_Partial (1270 of 1736) PASS: lldb-Suite :: commands/expression/completion-in-lambda-and-unnnamed-class/TestCompletionInLambdaAndUnnamedClass.py (1271 of 1736) PASS: LLDB :: Unwind/eh-frame-dwarf-unwind.test (1272 of 1736) PASS: lldb-Unit :: Utility/./UtilityTests/RangeTest.NotEqualInvalid (1273 of 1736) PASS: lldb-Suite :: python_api/sbvalue_const_addrof/TestSBValueConstAddrOf.py (1274 of 1736) PASS: lldb-Unit :: ScriptInterpreter/Python/./ScriptInterpreterPythonTests/PythonDataObjectsTest.TestExtractingUInt64ThroughStructuredData (1275 of 1736) PASS: lldb-Unit :: UnwindAssembly/ARM64/./Arm64InstEmulationTests/TestArm64InstEmulation.TestMediumDarwinFunction (1276 of 1736) PASS: lldb-Unit :: ScriptInterpreter/Python/./ScriptInterpreterPythonTests/PythonDataObjectsTest.TestPythonByteArray (1277 of 1736) UNSUPPORTED: LLDB :: Register/x86-64-zmm-read.test (1278 of 1736) PASS: lldb-Unit :: UnwindAssembly/x86/./UnwindAssemblyx86Tests/Testx86AssemblyInspectionEngine.TestPush0 (1279 of 1736) PASS: lldb-Unit :: Host/./HostTests/MainLoopTest.UnmonitoredSignal (1280 of 1736) PASS: lldb-Unit :: Utility/./UtilityTests/TimeoutTest.Format (1281 of 1736) PASS: lldb-Unit :: Utility/./UtilityTests/EnvironmentTest.EnvpConversion (1282 of 1736) PASS: lldb-Unit :: Process/gdb-remote/./ProcessGdbRemoteTests/GDBRemoteClientBaseTest.SendContinueAndWait (1283 of 1736) PASS: lldb-Suite :: functionalities/data-formatter/data-formatter-stl/libcxx/initializerlist/TestInitializerList.py (1284 of 1736) PASS: lldb-Suite :: commands/expression/call-function/TestCallUserDefinedFunction.py (1285 of 1736) PASS: LLDB :: Breakpoint/debug_rnglist_rlestartend.test (1286 of 1736) PASS: lldb-Suite :: lang/objc/conflicting-definition/TestConflictingDefinition.py (1287 of 1736) PASS: lldb-Unit :: Utility/./UtilityTests/BinaryStreamTest.PutULEB128FourBytes (1288 of 1736) PASS: lldb-Suite :: functionalities/longjmp/TestLongjmp.py (1289 of 1736) PASS: lldb-Suite :: functionalities/tsan/multiple/TestTsanMultiple.py (1290 of 1736) PASS: lldb-Unit :: Interpreter/./InterpreterTests/CompletionTest.DirCompletionUsername (1291 of 1736) PASS: lldb-Suite :: functionalities/breakpoint/breakpoint_by_line_and_column/TestBreakpointByLineAndColumn.py (1292 of 1736) PASS: lldb-Suite :: functionalities/data-formatter/data-formatter-script/TestDataFormatterScript.py (1293 of 1736) PASS: lldb-Unit :: UnwindAssembly/x86/./UnwindAssemblyx86Tests/Testx86AssemblyInspectionEngine.TestSubRSP (1294 of 1736) PASS: lldb-Suite :: commands/expression/anonymous-struct/TestCallUserAnonTypedef.py (1295 of 1736) PASS: lldb-Suite :: functionalities/data-formatter/data-formatter-python-synth/TestDataFormatterPythonSynth.py (1296 of 1736) PASS: lldb-Unit :: Process/gdb-remote/./ProcessGdbRemoteTests/GDBRemoteCommunicationClientTest.WriteRegisterNoSuffix (1297 of 1736) PASS: lldb-Unit :: ScriptInterpreter/Python/./ScriptInterpreterPythonTests/PythonDataObjectsTest.TestPythonFile (1298 of 1736) PASS: lldb-Unit :: UnwindAssembly/x86/./UnwindAssemblyx86Tests/Testx86AssemblyInspectionEngine.TestPushEDX (1299 of 1736) PASS: lldb-Suite :: lang/objc/global_ptrs/TestGlobalObjects.py (1300 of 1736) PASS: lldb-Unit :: Utility/./UtilityTests/LogChannelTest.List (1301 of 1736) PASS: lldb-Unit :: Utility/./UtilityTests/ArgsTest.BareSingleQuote (1302 of 1736) PASS: lldb-Unit :: Utility/./UtilityTests/StringExtractorTest.DecodeHexU8_InvalidHex (1303 of 1736) PASS: lldb-Suite :: functionalities/data-formatter/poarray/TestPrintObjectArray.py (1304 of 1736) PASS: lldb-Suite :: lang/objc/objc-property/TestObjCProperty.py (1305 of 1736) PASS: lldb-Unit :: Utility/./UtilityTests/StructuredDataTest.StringDump (1306 of 1736) PASS: lldb-Suite :: functionalities/inferior-changed/TestInferiorChanged.py (1307 of 1736) PASS: lldb-Suite :: functionalities/object-file/TestImageListMultiArchitecture.py (1308 of 1736) PASS: lldb-Unit :: Utility/./UtilityTests/OptionsWithRawTest.SingleWordSuffix (1309 of 1736) PASS: lldb-Suite :: macosx/find-dsym/bundle-with-dot-in-filename/TestBundleWithDotInFilename.py (1310 of 1736) PASS: lldb-Unit :: UnwindAssembly/x86/./UnwindAssemblyx86Tests/Testx86AssemblyInspectionEngine.TestPopESI (1311 of 1736) PASS: lldb-Unit :: UnwindAssembly/x86/./UnwindAssemblyx86Tests/Testx86AssemblyInspectionEngine.TestSpillRegToStackViaMOVx86_64 (1312 of 1736) PASS: lldb-Unit :: Utility/./UtilityTests/JSONTest.Dictionary (1313 of 1736) UNSUPPORTED: LLDB :: SymbolFile/PDB/calling-conventions.test (1314 of 1736) PASS: lldb-Unit :: Process/minidump/./LLDBMinidumpTests/MinidumpParserTest.GetMemoryRegionInfoLinuxMaps (1315 of 1736) PASS: LLDB :: Modules/Breakpad/discontiguous-sections.test (1316 of 1736) PASS: lldb-Suite :: tools/lldb-vscode/launch/TestVSCode_launch.py (1317 of 1736) PASS: lldb-Suite :: lang/cpp/symbols/TestSymbols.py (1318 of 1736) PASS: lldb-Suite :: python_api/frame/get-variables/TestGetVariables.py (1319 of 1736) PASS: lldb-Unit :: Utility/./UtilityTests/NameMatchesTest.Contains (1320 of 1736) PASS: lldb-Unit :: UnwindAssembly/x86/./UnwindAssemblyx86Tests/Testx86AssemblyInspectionEngine.TestPopR15 (1321 of 1736) PASS: lldb-Suite :: lang/c/array_types/TestArrayTypes.py (1322 of 1736) PASS: lldb-Unit :: Utility/./UtilityTests/BinaryStreamTest.PutULEB128SixBytes (1323 of 1736) XFAIL: LLDB :: Register/x86-mm-xmm-write.test (1324 of 1736) PASS: lldb-Suite :: functionalities/memory/find/TestMemoryFind.py (1325 of 1736) PASS: lldb-Suite :: tools/lldb-vscode/variables/TestVSCode_variables.py (1326 of 1736) PASS: lldb-Unit :: ScriptInterpreter/Python/./ScriptInterpreterPythonTests/PythonExceptionStateTest.TestAutoRestoreChanged (1327 of 1736) PASS: lldb-Unit :: Utility/./UtilityTests/StringExtractorTest.GetHexU8_Underflow2 (1328 of 1736) PASS: lldb-Suite :: functionalities/thread/concurrent_events/TestConcurrentManySignals.py (1329 of 1736) PASS: lldb-Unit :: Utility/./UtilityTests/StreamTest.PutCharWhitespace (1330 of 1736) PASS: LLDB :: Breakpoint/debug_rnglist_offset_pair.test (1331 of 1736) PASS: lldb-Suite :: functionalities/avoids-fd-leak/TestFdLeak.py (1332 of 1736) UNSUPPORTED: LLDB :: SymbolFile/PDB/function-nested-block.test (1333 of 1736) PASS: lldb-Unit :: Host/./HostTests/TaskPoolTest.TaskMap (1334 of 1736) PASS: lldb-Unit :: UnwindAssembly/x86/./UnwindAssemblyx86Tests/Testx86AssemblyInspectionEngine.TestPushEAX (1335 of 1736) PASS: lldb-Unit :: Process/gdb-remote/./ProcessGdbRemoteTests/GDBRemoteCommunicationClientTest.SendSignalsToIgnore (1336 of 1736) PASS: lldb-Unit :: Utility/./UtilityTests/RegularExpression.CopyAssignment (1337 of 1736) PASS: lldb-Suite :: functionalities/thread/create_after_attach/TestCreateAfterAttach.py (1338 of 1736) PASS: LLDB :: BuildScript/script-args.test (1339 of 1736) PASS: lldb-Suite :: functionalities/type_completion/TestTypeCompletion.py (1340 of 1736) PASS: lldb-Unit :: Target/./TargetTests/MemoryRegionInfoTest.Formatv (1341 of 1736) PASS: lldb-Suite :: lang/objc/objc-struct-argument/TestObjCStructArgument.py (1342 of 1736) PASS: lldb-Unit :: Language/Highlighting/./HighlighterTests/HighlighterTest.ClangComments (1343 of 1736) PASS: lldb-Unit :: Utility/./UtilityTests/StreamTeeTest.SetStreamAtIndexOutOfBounds (1344 of 1736) PASS: lldb-Suite :: commands/command/delete/TestCommandDelete.py (1345 of 1736) PASS: lldb-Unit :: Host/./HostTests/SocketTest.DecodeHostAndPort (1346 of 1736) PASS: lldb-Suite :: commands/watchpoints/watchpoint_commands/condition/TestWatchpointConditionCmd.py (1347 of 1736) PASS: lldb-Unit :: ScriptInterpreter/Python/./ScriptInterpreterPythonTests/PythonDataObjectsTest.TestResetting (1348 of 1736) PASS: LLDB :: Watchpoint/SetErrorCases.test (1349 of 1736) PASS: lldb-Suite :: commands/version/TestVersion.py (1350 of 1736) PASS: lldb-Unit :: ScriptInterpreter/Python/./ScriptInterpreterPythonTests/PythonDataObjectsTest.TestModuleNameResolutionNoDot (1351 of 1736) PASS: lldb-Unit :: Host/./HostTests/Host.GetEnvironment (1352 of 1736) PASS: lldb-Unit :: Language/Highlighting/./HighlighterTests/HighlighterTest.ClangScalarLiterals (1353 of 1736) PASS: lldb-Unit :: Host/./HostTests/Host.WaitStatusFormat (1354 of 1736) PASS: lldb-Unit :: Language/CPlusPlus/./LanguageCPlusPlusTests/CPlusPlusLanguage.CPlusPlusNameParser (1355 of 1736) PASS: lldb-Unit :: ScriptInterpreter/Python/./ScriptInterpreterPythonTests/PythonExceptionStateTest.TestManualRestoreSemantics (1356 of 1736) PASS: LLDB :: SymbolFile/DWARF/split-dwarf-inlining.cpp (1357 of 1736) PASS: lldb-Suite :: commands/expression/dollar-in-variable/TestDollarInVariable.py (1358 of 1736) PASS: lldb-Unit :: Utility/./UtilityTests/StringExtractorTest.GetHexU8_Exact_NoEof (1359 of 1736) PASS: lldb-Suite :: commands/quit/TestQuit.py (1360 of 1736) PASS: lldb-Suite :: functionalities/inferior-crashing/TestInferiorCrashing.py (1361 of 1736) PASS: lldb-Suite :: python_api/process/read-mem-cstring/TestReadMemCString.py (1362 of 1736) PASS: lldb-Suite :: tools/lldb-server/TestGdbRemoteExpeditedRegisters.py (1363 of 1736) PASS: lldb-Suite :: commands/expression/call-function/TestCallStopAndContinue.py (1364 of 1736) PASS: lldb-Suite :: types/TestFloatTypes.py (1365 of 1736) PASS: lldb-Suite :: functionalities/thread/concurrent_events/TestConcurrentBreakpointDelayBreakpointOneSignal.py (1366 of 1736) PASS: lldb-Unit :: Utility/./UtilityTests/StringExtractorTest.GetHexU8_Underflow (1367 of 1736) PASS: lldb-Suite :: functionalities/data-formatter/data-formatter-stl/libstdcpp/smart_ptr/TestDataFormatterStdSmartPtr.py (1368 of 1736) PASS: lldb-Suite :: functionalities/thread/multi_break/TestMultipleBreakpoints.py (1369 of 1736) PASS: lldb-Suite :: lang/cpp/signed_types/TestSignedTypes.py (1370 of 1736) PASS: lldb-Unit :: ScriptInterpreter/Python/./ScriptInterpreterPythonTests/PythonDataObjectsTest.TestDictionaryResolutionWithDot (1371 of 1736) PASS: lldb-Unit :: Host/./HostTests/FileSystemTest.FileAndDirectoryComponents (1372 of 1736) PASS: lldb-Suite :: lang/objc/objc-ivar-offsets/TestObjCIvarOffsets.py (1373 of 1736) PASS: lldb-Unit :: Target/./TargetTests/ModuleCacheTest.GetAndPutStrangeHostname (1374 of 1736) PASS: lldb-Suite :: macosx/order/TestOrderFile.py (1375 of 1736) PASS: lldb-Suite :: functionalities/data-formatter/data-formatter-stl/libcxx/bitset/TestDataFormatterLibcxxBitset.py (1376 of 1736) PASS: lldb-Unit :: UnwindAssembly/x86/./UnwindAssemblyx86Tests/Testx86AssemblyInspectionEngine.TestSimple32bitFrameFunction (1377 of 1736) PASS: lldb-Unit :: Utility/./UtilityTests/Flags.Reset (1378 of 1736) PASS: lldb-Unit :: ObjectFile/Breakpad/./ObjectFileBreakpadTests/InfoRecord.parse (1379 of 1736) PASS: lldb-Unit :: Language/Highlighting/./HighlighterTests/HighlighterTest.ClangIdentifiers (1380 of 1736) PASS: lldb-Unit :: Utility/./UtilityTests/StringLexerTest.NextIf (1381 of 1736) PASS: lldb-Suite :: lang/c/local_variables/TestLocalVariables.py (1382 of 1736) PASS: lldb-Suite :: functionalities/data-formatter/nsdictionarysynth/TestNSDictionarySynthetic.py (1383 of 1736) PASS: lldb-Suite :: functionalities/target_var/TestTargetVar.py (1384 of 1736) PASS: lldb-Unit :: Utility/./UtilityTests/ArgsTest.TestSingleQuotedArgWithSpace (1385 of 1736) PASS: lldb-Unit :: Utility/./UtilityTests/StringListTest.LongestCommonPrefixSingleElement (1386 of 1736) PASS: lldb-Unit :: Utility/./UtilityTests/StringExtractorTest.GetHexBytes (1387 of 1736) PASS: lldb-Unit :: Utility/./UtilityTests/StatusTest.ErrorConversion (1388 of 1736) PASS: lldb-Unit :: Utility/./UtilityTests/DataExtractorTest.GetMaxS64 (1389 of 1736) PASS: lldb-Suite :: functionalities/thread/concurrent_events/TestConcurrentSignalDelayBreak.py (1390 of 1736) PASS: lldb-Unit :: SymbolFile/DWARF/./SymbolFileDWARFTests/SymbolFileDWARFTests.TestAbbrevNullAttrValidForm (1391 of 1736) PASS: LLDB :: Quit/TestQuitExitCode-30.test (1392 of 1736) PASS: lldb-Unit :: Utility/./UtilityTests/BinaryStreamTest.PutSLEB128FiveBytes (1393 of 1736) PASS: lldb-Unit :: Language/Highlighting/./HighlighterTests/HighlighterTest.ClangUnterminatedString (1394 of 1736) PASS: LLDB :: Reproducer/Modules/TestModuleCXX.test (1395 of 1736) PASS: lldb-Unit :: ObjectFile/Breakpad/./ObjectFileBreakpadTests/StackCFIRecord.parse (1396 of 1736) PASS: lldb-Suite :: commands/expression/diagnostics/TestExprDiagnostics.py (1397 of 1736) PASS: lldb-Suite :: functionalities/tail_call_frames/inlining_and_tail_calls/TestInliningAndTailCalls.py (1398 of 1736) PASS: lldb-Unit :: UnwindAssembly/x86/./UnwindAssemblyx86Tests/Testx86AssemblyInspectionEngine.TestPopR14 (1399 of 1736) PASS: lldb-Unit :: Utility/./UtilityTests/RangeTest.Copy (1400 of 1736) PASS: lldb-Suite :: python_api/function_symbol/TestSymbolAPI.py (1401 of 1736) PASS: lldb-Suite :: python_api/watchpoint/TestSetWatchpoint.py (1402 of 1736) UNSUPPORTED: LLDB :: Expr/TestIRMemoryMapWindows.test (1403 of 1736) PASS: lldb-Unit :: Symbol/./SymbolTests/SymbolsTest.TerminateLocateExecutableSymbolFileForUnknownExecutableAndUnknownSymbolFile (1404 of 1736) PASS: lldb-Unit :: Language/Highlighting/./HighlighterTests/HighlighterTest.HighlighterSelectionType (1405 of 1736) PASS: lldb-Suite :: functionalities/tail_call_frames/sbapi_support/TestTailCallFrameSBAPI.py (1406 of 1736) PASS: LLDB :: Settings/TestModuleCacheSanity.test (1407 of 1736) PASS: lldb-Unit :: Host/./HostTests/NativeProcessProtocolTest.ReadCStringFromMemory_MaxSize (1408 of 1736) PASS: lldb-Suite :: functionalities/deleted-executable/TestDeletedExecutable.py (1409 of 1736) PASS: lldb-Suite :: lang/c/unions/TestUnionMembers.py (1410 of 1736) PASS: lldb-Unit :: Utility/./UtilityTests/ScalarTest.GetValue (1411 of 1736) PASS: lldb-Suite :: lang/cpp/class_static/TestStaticVariables.py (1412 of 1736) PASS: lldb-Suite :: commands/watchpoints/watchpoint_commands/TestWatchpointCommands.py (1413 of 1736) PASS: LLDB :: Breakpoint/jitbp_elf.test (1414 of 1736) PASS: LLDB :: Expr/TestTypeOfDeclTypeExpr.test (1415 of 1736) PASS: lldb-Unit :: Host/./HostTests/ProcessLaunchInfoTest.Constructor (1416 of 1736) PASS: lldb-Suite :: tools/lldb-vscode/breakpoint/TestVSCode_setBreakpoints.py (1417 of 1736) UNSUPPORTED: LLDB :: SymbolFile/NativePDB/stack_unwinding01.cpp (1418 of 1736) PASS: lldb-Suite :: functionalities/gdb_remote_client/TestGDBRemoteLoad.py (1419 of 1736) PASS: lldb-Suite :: functionalities/completion/TestCompletion.py (1420 of 1736) PASS: lldb-Suite :: benchmarks/turnaround/TestCompileRunToBreakpointTurnaround.py (1421 of 1736) PASS: lldb-Suite :: functionalities/postmortem/elf-core/thread_crash/TestLinuxCoreThreads.py (1422 of 1736) PASS: lldb-Suite :: functionalities/dead-strip/TestDeadStrip.py (1423 of 1736) PASS: lldb-Unit :: Host/./HostTests/SocketTest.DomainGetConnectURI (1424 of 1736) PASS: lldb-Suite :: sample_test/TestSampleTest.py (1425 of 1736) PASS: lldb-Suite :: functionalities/non-overlapping-index-variable-i/TestIndexVariable.py (1426 of 1736) PASS: lldb-Suite :: functionalities/data-formatter/parray/TestPrintArray.py (1427 of 1736) PASS: lldb-Unit :: Utility/./UtilityTests/NameMatchesTest.StartsWith (1428 of 1736) PASS: lldb-Suite :: commands/expression/import-std-module/sysroot/TestStdModuleSysroot.py (1429 of 1736) PASS: lldb-Suite :: tools/lldb-server/commandline/TestStubReverseConnect.py (1430 of 1736) PASS: lldb-Suite :: functionalities/darwin_log/filter/regex/activity-chain/TestDarwinLogFilterRegexActivityChain.py (1431 of 1736) PASS: lldb-Suite :: python_api/lldbutil/TestSwigVersion.py (1432 of 1736) PASS: lldb-Suite :: commands/expression/namespace_local_var_same_name_obj_c/TestNamespaceLocalVarSameNameObjC.py (1433 of 1736) PASS: lldb-Suite :: functionalities/data-formatter/data-formatter-stl/libstdcpp/list/TestDataFormatterStdList.py (1434 of 1736) UNSUPPORTED: LLDB :: SymbolFile/DWARF/dwarf5_locations.s (1435 of 1736) PASS: LLDB :: Modules/ELF/PT_TLS-overlap-PT_LOAD.yaml (1436 of 1736) PASS: lldb-Suite :: functionalities/thread/step_until/TestStepUntil.py (1437 of 1736) PASS: lldb-Suite :: macosx/duplicate-archive-members/TestDuplicateMembers.py (1438 of 1736) PASS: LLDB :: Modules/ELF/PT_LOAD.yaml (1439 of 1736) PASS: lldb-Suite :: functionalities/signal/handle-segv/TestHandleSegv.py (1440 of 1736) PASS: lldb-Suite :: functionalities/data-formatter/data-formatter-stl/libcxx/queue/TestDataFormatterLibcxxQueue.py (1441 of 1736) PASS: lldb-Unit :: Process/minidump/./LLDBMinidumpTests/MinidumpParserTest.GetMemoryRegionInfoFromMemory64List (1442 of 1736) PASS: lldb-Unit :: Utility/./UtilityTests/TimeoutTest.Construction (1443 of 1736) PASS: lldb-Unit :: Utility/./UtilityTests/OptionsWithRawTest.MultiWordSuffix (1444 of 1736) PASS: lldb-Suite :: functionalities/thread/concurrent_events/TestConcurrentWatchBreak.py (1445 of 1736) UNSUPPORTED: LLDB :: Unwind/unwind-plan-dwarf-dump.test (1446 of 1736) PASS: lldb-Suite :: functionalities/inline-stepping/TestInlineStepping.py (1447 of 1736) PASS: lldb-Suite :: lang/cpp/class_types/TestClassTypesDisassembly.py (1448 of 1736) PASS: lldb-Unit :: Utility/./UtilityTests/StringListTest.DefaultConstructor (1449 of 1736) PASS: lldb-Unit :: UnwindAssembly/x86/./UnwindAssemblyx86Tests/Testx86AssemblyInspectionEngine.TestAddESP (1450 of 1736) PASS: lldb-Suite :: lang/cpp/enum_types/TestCPP11EnumTypes.py (1451 of 1736) PASS: lldb-Suite :: commands/frame/diagnose/dereference-this/TestDiagnoseDereferenceThis.py (1452 of 1736) PASS: lldb-Suite :: commands/watchpoints/multiple_hits/TestMultipleHits.py (1453 of 1736) PASS: lldb-Suite :: functionalities/thread/concurrent_events/TestConcurrentBreakpointsDelayedBreakpointOneWatchpoint.py (1454 of 1736) PASS: LLDB :: Driver/TestFile.test (1455 of 1736) PASS: LLDB :: Breakpoint/split-dwarf5-debug-stroffsets.test (1456 of 1736) PASS: lldb-Unit :: Host/./HostTests/HostInfoTest.GetHostname (1457 of 1736) PASS: lldb-Unit :: Utility/./UtilityTests/DataExtractorTest.GetMaxU64 (1458 of 1736) PASS: lldb-Unit :: Process/minidump/./LLDBMinidumpTests/MinidumpParserTest.InvalidMinidump (1459 of 1736) PASS: lldb-Unit :: Symbol/./SymbolTests/Type.GetTypeScopeAndBasename (1460 of 1736) PASS: lldb-Suite :: python_api/value_var_update/TestValueVarUpdate.py (1461 of 1736) PASS: lldb-Suite :: lang/objc/print-obj/TestPrintObj.py (1462 of 1736) PASS: lldb-Unit :: Utility/./UtilityTests/UriParserTest.BracketedHostname (1463 of 1736) PASS: lldb-Unit :: UnwindAssembly/x86/./UnwindAssemblyx86Tests/Testx86AssemblyInspectionEngine.TestPushExtended (1464 of 1736) PASS: LLDB :: SymbolFile/Breakpad/line-table-discontinuous-file-ids.test (1465 of 1736) PASS: lldb-Suite :: functionalities/thread/concurrent_events/TestConcurrentSignalNWatchNBreak.py (1466 of 1736) PASS: lldb-Suite :: api/multiple-debuggers/TestMultipleDebuggers.py (1467 of 1736) PASS: lldb-Unit :: Utility/./UtilityTests/RangeTest.NotEqual (1468 of 1736) PASS: lldb-Unit :: Host/./HostTests/HostInfoTest.GetAugmentedArchSpec (1469 of 1736) PASS: lldb-Suite :: commands/process/attach/attach_denied/TestAttachDenied.py (1470 of 1736) PASS: lldb-Unit :: Utility/./UtilityTests/Flags.AllSet (1471 of 1736) PASS: lldb-Suite :: functionalities/data-formatter/data-formatter-objc/TestDataFormatterObjCNSBundle.py (1472 of 1736) PASS: lldb-Suite :: lang/cpp/char1632_t/TestChar1632T.py (1473 of 1736) PASS: lldb-Unit :: Utility/./UtilityTests/ReproducerTest.SetReplay (1474 of 1736) PASS: lldb-Unit :: debugserver/./debugserverTests/RNBSocket.LoopBackListenIPv6 (1475 of 1736) PASS: lldb-Suite :: types/TestIntegerTypes.py (1476 of 1736) PASS: lldb-Unit :: Utility/./UtilityTests/StreamTest.PutSLEB128 (1477 of 1736) PASS: lldb-Unit :: Utility/./UtilityTests/RecordReplayTest.InstrumentedBar (1478 of 1736) PASS: lldb-Suite :: commands/expression/import-std-module/weak_ptr-dbg-info-content/TestDbgInfoContentWeakPtr.py (1479 of 1736) PASS: lldb-Suite :: lang/objc/modules-incomplete/TestIncompleteModules.py (1480 of 1736) PASS: lldb-Unit :: Utility/./UtilityTests/UriParserTest.BadPort (1481 of 1736) PASS: lldb-Suite :: macosx/nslog/TestDarwinNSLogOutput.py (1482 of 1736) PASS: lldb-Unit :: UnwindAssembly/x86/./UnwindAssemblyx86Tests/Testx86AssemblyInspectionEngine.TestPushEDI (1483 of 1736) UNSUPPORTED: LLDB :: SymbolFile/DWARF/find-inline-method.s (1484 of 1736) PASS: lldb-Unit :: UnwindAssembly/x86/./UnwindAssemblyx86Tests/Testx86AssemblyInspectionEngine.Testi386IgnoredRegisters (1485 of 1736) PASS: lldb-Unit :: SymbolFile/NativePDB/./SymbolFileNativePDBTests/PDBFPOProgramToDWARFExpressionTests.UnresolvedDependentCyclicRegisterAssignmentReference (1486 of 1736) PASS: lldb-Unit :: Interpreter/./InterpreterTests/OptionArgParserTest.toChar (1487 of 1736) PASS: lldb-Unit :: Utility/./UtilityTests/StreamTest.PutCharNull (1488 of 1736) PASS: lldb-Unit :: Utility/./UtilityTests/RecordReplayTest.InstrumentedBarRef (1489 of 1736) PASS: lldb-Suite :: tools/lldb-server/TestGdbRemoteAttach.py (1490 of 1736) PASS: lldb-Suite :: functionalities/data-formatter/synthupdate/TestSyntheticFilterRecompute.py (1491 of 1736) PASS: lldb-Suite :: tools/lldb-vscode/attach/TestVSCode_attach.py (1492 of 1736) PASS: lldb-Suite :: commands/expression/no-deadlock/TestExprDoesntBlock.py (1493 of 1736) PASS: lldb-Suite :: commands/expression/calculator_mode/TestCalculatorMode.py (1494 of 1736) PASS: lldb-Suite :: functionalities/data-formatter/data-formatter-categories/TestDataFormatterCategories.py (1495 of 1736) PASS: LLDB :: Modules/ELF/section-types.yaml (1496 of 1736) PASS: lldb-Unit :: Utility/./UtilityTests/StringListTest.AppendListCStringArray (1497 of 1736) PASS: lldb-Suite :: lang/c/enum_types/TestEnumTypes.py (1498 of 1736) PASS: lldb-Suite :: functionalities/thread/exit_during_step/TestExitDuringStep.py (1499 of 1736) PASS: lldb-Unit :: Utility/./UtilityTests/StringExtractorTest.GetHexBytesAvail_FullString (1500 of 1736) UNSUPPORTED: LLDB :: SymbolFile/PDB/ast-restore.test (1501 of 1736) PASS: lldb-Suite :: python_api/interpreter/TestRunCommandInterpreterAPI.py (1502 of 1736) PASS: lldb-Unit :: ObjectFile/Breakpad/./ObjectFileBreakpadTests/StackWinRecord.parse (1503 of 1736) PASS: lldb-Unit :: Utility/./UtilityTests/StreamTest.PutStringAsRawHex8 (1504 of 1736) PASS: lldb-Suite :: lang/c/shared_lib/TestSharedLib.py (1505 of 1736) PASS: lldb-Suite :: benchmarks/expression/TestExpressionCmd.py (1506 of 1736) PASS: lldb-Suite :: functionalities/data-formatter/data-formatter-objc/TestDataFormatterObjCNSDate.py (1507 of 1736) PASS: lldb-Unit :: SymbolFile/NativePDB/./SymbolFileNativePDBTests/PDBFPOProgramToDWARFExpressionTests.UnresolvedCyclicRegisterAssignmentReference (1508 of 1736) PASS: lldb-Unit :: Utility/./UtilityTests/BinaryStreamTest.PutSLEB128NineBytes (1509 of 1736) PASS: lldb-Suite :: arm/emulation/TestEmulations.py (1510 of 1736) PASS: lldb-Suite :: python_api/thread/TestThreadAPI.py (1511 of 1736) PASS: lldb-Unit :: Utility/./UtilityTests/OptionsWithRawTest.EmptySuffix (1512 of 1736) PASS: lldb-Suite :: functionalities/stats_api/TestStatisticsAPI.py (1513 of 1736) PASS: lldb-Suite :: functionalities/memory/read/TestMemoryRead.py (1514 of 1736) PASS: lldb-Suite :: lang/cpp/class_types/TestClassTypes.py (1515 of 1736) PASS: lldb-Suite :: lang/cpp/namespace_definitions/TestNamespaceDefinitions.py (1516 of 1736) PASS: lldb-Unit :: Utility/./UtilityTests/StringLexerTest.HasAtLeast (1517 of 1736) PASS: lldb-Suite :: functionalities/breakpoint/objc/TestObjCBreakpoints.py (1518 of 1736) PASS: lldb-Suite :: functionalities/breakpoint/require_hw_breakpoints/TestRequireHWBreakpoints.py (1519 of 1736) PASS: lldb-Unit :: Core/./LLDBCoreTests/RichManglingContextTest.Basic (1520 of 1736) PASS: lldb-Unit :: UnwindAssembly/x86/./UnwindAssemblyx86Tests/Testx86AssemblyInspectionEngine.TestPushEBP (1521 of 1736) PASS: lldb-Unit :: Utility/./UtilityTests/ConstStringTest.UpdateMangledCounterpart (1522 of 1736) PASS: lldb-Unit :: ScriptInterpreter/Python/./ScriptInterpreterPythonTests/PythonExceptionStateTest.TestResetSemantics (1523 of 1736) PASS: lldb-Unit :: Utility/./UtilityTests/ConstStringTest.CompareConstString (1524 of 1736) PASS: lldb-Suite :: functionalities/breakpoint/source_regexp/TestSourceRegexBreakpoints.py (1525 of 1736) PASS: lldb-Suite :: python_api/class_members/TestSBTypeClassMembers.py (1526 of 1736) PASS: lldb-Suite :: lang/objc/ivar-IMP/TestObjCiVarIMP.py (1527 of 1736) PASS: lldb-Suite :: linux/mix-dwo-and-regular-objects/TestMixedDwarfBinary.py (1528 of 1736) PASS: lldb-Unit :: ObjectFile/Breakpad/./ObjectFileBreakpadTests/Record.classify (1529 of 1736) PASS: lldb-Unit :: Utility/./UtilityTests/BinaryStreamTest.PutULEB128ThreeBytes (1530 of 1736) PASS: lldb-Suite :: lang/objc/modules-inline-functions/TestModulesInlineFunctions.py (1531 of 1736) PASS: lldb-Unit :: Utility/./UtilityTests/StreamTeeTest.Write (1532 of 1736) PASS: lldb-Suite :: functionalities/tail_call_frames/disambiguate_call_site/TestDisambiguateCallSite.py (1533 of 1736) UNSUPPORTED: LLDB :: SymbolFile/PDB/variables-locations.test (1534 of 1736) PASS: lldb-Suite :: lang/c/function_types/TestFunctionTypes.py (1535 of 1736) PASS: lldb-Suite :: commands/apropos/with-process/TestAproposWithProcess.py (1536 of 1736) PASS: lldb-Unit :: Language/Highlighting/./HighlighterTests/HighlighterTest.DefaultHighlighter (1537 of 1736) PASS: lldb-Unit :: Utility/./UtilityTests/StringListTest.InsertStringAtIndexStdString (1538 of 1736) PASS: lldb-Unit :: UnwindAssembly/PPC64/./PPC64InstEmulationTests/TestPPC64InstEmulation.TestSimpleFunction (1539 of 1736) PASS: lldb-Unit :: SymbolFile/DWARF/./SymbolFileDWARFTests/SymbolFileDWARFTests.TestAbbrevOrder1Start1 (1540 of 1736) PASS: lldb-Unit :: Utility/./UtilityTests/StringExtractorTest.GetNameColonValueNoColon (1541 of 1736) PASS: lldb-Suite :: functionalities/plugins/command_plugin/TestPluginCommands.py (1542 of 1736) PASS: LLDB :: SymbolFile/DWARF/debug_ranges.s (1543 of 1736) PASS: lldb-Unit :: Symbol/./SymbolTests/DWARFCallFrameInfoTest.Basic_dwarf3 (1544 of 1736) PASS: lldb-Suite :: lang/objc/objc-builtin-types/TestObjCBuiltinTypes.py (1545 of 1736) PASS: LLDB :: SymbolFile/DWARF/forward-declarations.s (1546 of 1736) PASS: lldb-Suite :: python_api/symbol-context/two-files/TestSymbolContextTwoFiles.py (1547 of 1736) PASS: lldb-Suite :: tools/lldb-server/TestAppleSimulatorOSType.py (1548 of 1736) PASS: lldb-Unit :: Utility/./UtilityTests/StringExtractorTest.GetU32BigEndian (1549 of 1736) PASS: lldb-Unit :: Utility/./UtilityTests/StringListTest.Join (1550 of 1736) PASS: LLDB :: Modules/MachO/lc_build_version_notools.yaml (1551 of 1736) PASS: LLDB :: Driver/TestSingleQuote.test (1552 of 1736) PASS: lldb-Unit :: Process/minidump/./LLDBMinidumpTests/MinidumpParserTest.GetMiscInfoWindows (1553 of 1736) PASS: lldb-Suite :: functionalities/breakpoint/serialize/TestBreakpointSerialization.py (1554 of 1736) PASS: lldb-Suite :: lang/cpp/global_operators/TestCppGlobalOperators.py (1555 of 1736) PASS: lldb-Suite :: lang/c/strings/TestCStrings.py (1556 of 1736) PASS: lldb-Unit :: ScriptInterpreter/Python/./ScriptInterpreterPythonTests/PythonDataObjectsTest.TestPythonTupleInitializerList2 (1557 of 1736) PASS: lldb-Unit :: SymbolFile/DWARF/./SymbolFileDWARFTests/SymbolFileDWARFTests.TestAbbrevOutOfOrder (1558 of 1736) PASS: lldb-Unit :: Process/minidump/./LLDBMinidumpTests/MinidumpParserTest.GetMemoryRegionInfoFromMemoryList (1559 of 1736) PASS: lldb-Unit :: Language/Highlighting/./HighlighterTests/HighlighterTest.ClangCursorPosBeforeOtherToken (1560 of 1736) PASS: lldb-Unit :: Utility/./UtilityTests/LogChannelEnabledTest.LogVerboseThread (1561 of 1736) PASS: lldb-Suite :: lang/cpp/exceptions/TestCPPExceptionBreakpoints.py (1562 of 1736) PASS: lldb-Suite :: commands/expression/import-std-module/shared_ptr-dbg-info-content/TestSharedPtrDbgInfoContent.py (1563 of 1736) PASS: lldb-Suite :: lang/objc/foundation/TestObjCMethods2.py (1564 of 1736) PASS: lldb-Suite :: driver/batch_mode/TestBatchMode.py (1565 of 1736) PASS: lldb-Suite :: functionalities/thread/thread_exit/TestThreadExit.py (1566 of 1736) PASS: lldb-Unit :: Language/CPlusPlus/./LanguageCPlusPlusTests/CPlusPlusLanguage.ExtractContextAndIdentifier (1567 of 1736) PASS: lldb-Unit :: Utility/./UtilityTests/OptionsWithRawTest.EmptySuffixSingleWhitespace (1568 of 1736) PASS: lldb-Unit :: Target/./TargetTests/ModuleCacheTest.GetAndPutUuidExists (1569 of 1736) PASS: lldb-Unit :: UnwindAssembly/x86/./UnwindAssemblyx86Tests/Testx86AssemblyInspectionEngine.TestPushImm (1570 of 1736) PASS: lldb-Unit :: debugserver/./debugserverTests/RNBSocket.AnyListen (1571 of 1736) PASS: lldb-Suite :: functionalities/data-formatter/data-formatter-stl/libcxx/iterator/TestDataFormatterLibccIterator.py (1572 of 1736) PASS: lldb-Suite :: functionalities/thread/concurrent_events/TestConcurrentTwoWatchpointsOneDelayBreakpoint.py (1573 of 1736) PASS: lldb-Suite :: tools/lldb-server/TestGdbRemoteRegisterState.py (1574 of 1736) PASS: lldb-Suite :: functionalities/darwin_log/filter/exact_match/subsystem/TestDarwinLogFilterMatchSubsystem.py (1575 of 1736) PASS: lldb-Suite :: functionalities/breakpoint/breakpoint_set_restart/TestBreakpointSetRestart.py (1576 of 1736) PASS: lldb-Unit :: Utility/./UtilityTests/TimerTest.CategoryTimesStats (1577 of 1736) PASS: lldb-Suite :: lang/objc/orderedset/TestOrderedSet.py (1578 of 1736) PASS: lldb-Suite :: functionalities/thread/concurrent_events/TestConcurrentTwoBreakpointThreads.py (1579 of 1736) PASS: lldb-Suite :: functionalities/multidebugger_commands/TestMultipleDebuggersCommands.py (1580 of 1736) PASS: lldb-Unit :: Utility/./UtilityTests/LogTest.Register (1581 of 1736) PASS: lldb-Unit :: Utility/./UtilityTests/DataExtractorTest.PeekData (1582 of 1736) PASS: lldb-Suite :: lang/c/step-target/TestStepTarget.py (1583 of 1736) PASS: lldb-Unit :: Utility/./UtilityTests/BinaryStreamTest.PutSLEB128EightBytes (1584 of 1736) PASS: lldb-Unit :: Utility/./UtilityTests/RangeTest.Clear (1585 of 1736) PASS: LLDB :: Reproducer/Functionalities/TestStepping.test (1586 of 1736) PASS: lldb-Suite :: lang/cpp/function_refs/TestFunctionRefs.py (1587 of 1736) PASS: lldb-Suite :: python_api/section/TestSectionAPI.py (1588 of 1736) PASS: lldb-Unit :: Utility/./UtilityTests/StringListTest.JoinThree (1589 of 1736) PASS: lldb-Suite :: lang/cpp/unsigned_types/TestUnsignedTypes.py (1590 of 1736) PASS: lldb-Unit :: SymbolFile/NativePDB/./SymbolFileNativePDBTests/PDBFPOProgramToDWARFExpressionTests.MultipleDependentAssignments (1591 of 1736) PASS: lldb-Unit :: Utility/./UtilityTests/Flags.IsClear (1592 of 1736) PASS: lldb-Unit :: Utility/./UtilityTests/StringListTest.SplitIntoLines (1593 of 1736) PASS: lldb-Unit :: Utility/./UtilityTests/StringListTest.ShiftCString (1594 of 1736) PASS: lldb-Suite :: lang/cpp/type_lookup/TestCppTypeLookup.py (1595 of 1736) PASS: LLDB :: Breakpoint/single-file-split-dwarf.test (1596 of 1736) PASS: lldb-Unit :: Utility/./UtilityTests/StringExtractorTest.InitEmpty (1597 of 1736) PASS: lldb-Unit :: Utility/./UtilityTests/ListenerTest.GetEventWait (1598 of 1736) PASS: lldb-Suite :: lang/cpp/namespace_conflicts/TestNamespaceConflicts.py (1599 of 1736) PASS: lldb-Unit :: Language/Highlighting/./HighlighterTests/HighlighterTest.ClangEmptyInput (1600 of 1736) UNSUPPORTED: LLDB :: SymbolFile/NativePDB/ast-functions-msvc.cpp (1601 of 1736) PASS: lldb-Unit :: Utility/./UtilityTests/BinaryStreamTest.PutSLEB128One (1602 of 1736) PASS: lldb-Suite :: functionalities/archives/TestBSDArchives.py (1603 of 1736) PASS: lldb-Suite :: functionalities/data-formatter/data-formatter-synthval/TestDataFormatterSynthVal.py (1604 of 1736) PASS: lldb-Suite :: functionalities/abbreviation/TestAbbreviations.py (1605 of 1736) UNSUPPORTED: LLDB :: SymbolFile/DWARF/find-basic-function.cpp (1606 of 1736) PASS: lldb-Unit :: Host/./HostTests/TaskPoolTest.AddTask (1607 of 1736) PASS: lldb-Unit :: Utility/./UtilityTests/StringExtractorTest.GetHexBytesAvail_Partial (1608 of 1736) PASS: lldb-Suite :: functionalities/thread/concurrent_events/TestConcurrentSignalBreak.py (1609 of 1736) PASS: lldb-Suite :: tools/lldb-server/TestGdbRemoteAuxvSupport.py (1610 of 1736) PASS: lldb-Unit :: UnwindAssembly/x86/./UnwindAssemblyx86Tests/Testx86AssemblyInspectionEngine.TestPushR15 (1611 of 1736) PASS: LLDB :: SymbolFile/DWARF/debug-types-missing-signature.test (1612 of 1736) PASS: lldb-Suite :: lang/cpp/printf/TestPrintf.py (1613 of 1736) PASS: lldb-Unit :: ObjectFile/Breakpad/./ObjectFileBreakpadTests/LineRecord.parse (1614 of 1736) PASS: lldb-Suite :: python_api/value/empty_class/TestValueAPIEmptyClass.py (1615 of 1736) PASS: lldb-Suite :: functionalities/gdb_remote_client/TestRestartBug.py (1616 of 1736) PASS: lldb-Unit :: ScriptInterpreter/Python/./ScriptInterpreterPythonTests/PythonDataObjectsTest.TestPythonInteger (1617 of 1736) PASS: lldb-Suite :: functionalities/history/TestHistoryRecall.py (1618 of 1736) PASS: lldb-Suite :: functionalities/thread/break_after_join/TestBreakAfterJoin.py (1619 of 1736) PASS: lldb-Suite :: tools/lldb-server/inferior-crash/TestGdbRemoteAbort.py (1620 of 1736) PASS: lldb-Suite :: commands/expression/options/TestExprOptions.py (1621 of 1736) PASS: lldb-Unit :: Process/gdb-remote/./ProcessGdbRemoteTests/GDBRemoteCommunicationServerTest.SendErrorResponse_StringError (1622 of 1736) PASS: lldb-Suite :: python_api/lldbutil/iter/TestRegistersIterator.py (1623 of 1736) PASS: lldb-Unit :: Utility/./UtilityTests/RangeTest.ContainsRange (1624 of 1736) PASS: lldb-Unit :: UnwindAssembly/x86/./UnwindAssemblyx86Tests/Testx86AssemblyInspectionEngine.TestCALLNextInsn (1625 of 1736) PASS: lldb-Unit :: Utility/./UtilityTests/StreamTest.ShiftOperatorChars (1626 of 1736) PASS: lldb-Suite :: commands/target/stop-hooks/TestStopHooks.py (1627 of 1736) PASS: lldb-Unit :: Utility/./UtilityTests/SerializationRountripTest.SerializeDeserializeCString (1628 of 1736) UNSUPPORTED: LLDB :: SymbolFile/PDB/pointers.test (1629 of 1736) PASS: lldb-Unit :: Process/minidump/./LLDBMinidumpTests/MinidumpParserTest.MinidumpModuleOrder (1630 of 1736) PASS: lldb-Unit :: Process/gdb-remote/./ProcessGdbRemoteTests/GDBRemoteClientBaseTest.SendContinueAndInterrupt (1631 of 1736) PASS: lldb-Unit :: Language/Highlighting/./HighlighterTests/HighlighterTest.ClangPPDirectives (1632 of 1736) PASS: lldb-Suite :: commands/watchpoints/watchpoint_set_command/TestWatchLocationWithWatchSet.py (1633 of 1736) PASS: lldb-Suite :: benchmarks/stepping/TestSteppingSpeed.py (1634 of 1736) PASS: lldb-Unit :: Host/./HostTests/FileSystemTest.EnumerateDirectory (1635 of 1736) PASS: LLDB :: SymbolFile/DWARF/debug_ranges-missing-section.s (1636 of 1736) PASS: lldb-Unit :: tools/lldb-server/tests/./LLDBServerTests/TestBase.DebugserverEnv (1637 of 1736) PASS: lldb-Unit :: Target/./TargetTests/PathMappingListTest.AbsoluteTests (1638 of 1736) PASS: lldb-Suite :: commands/expression/import-std-module/vector-of-vectors/TestVectorOfVectors.py (1639 of 1736) PASS: lldb-Unit :: Utility/./UtilityTests/StringExtractorTest.GetU64LittleEndian (1640 of 1736) PASS: lldb-Unit :: Utility/./UtilityTests/StreamTeeTest.AppendStream (1641 of 1736) PASS: lldb-Suite :: functionalities/thread/concurrent_events/TestConcurrentDelayWatchBreak.py (1642 of 1736) PASS: lldb-Unit :: Language/Highlighting/./HighlighterTests/HighlighterTest.FallbackHighlighter (1643 of 1736) PASS: lldb-Unit :: Interpreter/./InterpreterTests/CompletionTest.FileCompletionAbsolute (1644 of 1736) PASS: lldb-Suite :: functionalities/data-formatter/compactvectors/TestCompactVectors.py (1645 of 1736) PASS: lldb-Suite :: functionalities/thread/state/TestThreadStates.py (1646 of 1736) PASS: lldb-Unit :: Utility/./UtilityTests/BinaryStreamTest.PutULEB128MaxValue (1647 of 1736) PASS: lldb-Unit :: Signals/./SignalsTests/UnixSignalsTest.GetInfo (1648 of 1736) PASS: lldb-Suite :: lang/c/bitfields/TestBitfields.py (1649 of 1736) PASS: lldb-Suite :: functionalities/data-formatter/data-formatter-synthtype/TestDataFormatterSynthType.py (1650 of 1736) PASS: lldb-Suite :: functionalities/jitloader_gdb/TestJITLoaderGDB.py (1651 of 1736) PASS: lldb-Suite :: lang/objc/objc-super/TestObjCSuper.py (1652 of 1736) PASS: LLDB :: Commands/command-script-import.test (1653 of 1736) UNSUPPORTED: LLDB :: Modules/ELF/basic-info.yaml (1654 of 1736) PASS: lldb-Suite :: commands/expression/call-overridden-method/TestCallOverriddenMethod.py (1655 of 1736) PASS: LLDB :: Modules/ELF/section-types-edgecases.yaml (1656 of 1736) PASS: lldb-Unit :: Process/gdb-remote/./ProcessGdbRemoteTests/GDBRemoteCommunicationClientTest.GetModulesInfo (1657 of 1736) PASS: lldb-Suite :: python_api/watchpoint/TestWatchpointIter.py (1658 of 1736) PASS: lldb-Suite :: lang/c/anonymous/TestAnonymous.py (1659 of 1736) PASS: lldb-Unit :: Host/./HostTests/MainLoopTest.DetectsEOF (1660 of 1736) PASS: lldb-Suite :: lang/cpp/modules-import/TestCXXModulesImport.py (1661 of 1736) PASS: lldb-Unit :: ScriptInterpreter/Python/./ScriptInterpreterPythonTests/PythonExceptionStateTest.TestDiscardSemantics (1662 of 1736) PASS: lldb-Suite :: functionalities/thread/concurrent_events/TestConcurrentTwoBreakpointsOneWatchpoint.py (1663 of 1736) PASS: lldb-Suite :: lang/objc/objc-ivar-protocols/TestIvarProtocols.py (1664 of 1736) PASS: lldb-Unit :: UnwindAssembly/x86/./UnwindAssemblyx86Tests/Testx86AssemblyInspectionEngine.TestPushEBX (1665 of 1736) PASS: lldb-Suite :: linux/add-symbols/TestTargetSymbolsAddCommand.py (1666 of 1736) PASS: lldb-Suite :: functionalities/load_unload/TestLoadUnload.py (1667 of 1736) PASS: lldb-Suite :: lang/cpp/scope/TestCppScope.py (1668 of 1736) UNSUPPORTED: LLDB :: SymbolFile/DWARF/find-basic-namespace.cpp (1669 of 1736) PASS: lldb-Suite :: functionalities/darwin_log/format/TestDarwinLogMessageFormat.py (1670 of 1736) PASS: lldb-Unit :: Utility/./UtilityTests/StringExtractorTest.GetHexBytesAvail_OddPair2 (1671 of 1736) PASS: LLDB :: SymbolFile/Breakpad/line-table-missing-file.test (1672 of 1736) PASS: lldb-Suite :: tools/lldb-server/TestGdbRemoteKill.py (1673 of 1736) PASS: lldb-Unit :: Utility/./UtilityTests/NameMatchesTest.EndsWith (1674 of 1736) PASS: lldb-Unit :: UnwindAssembly/x86/./UnwindAssemblyx86Tests/Testx86AssemblyInspectionEngine.TestDisassemblyMidFunctionEpilogues (1675 of 1736) PASS: lldb-Unit :: Utility/./UtilityTests/StreamTest.ChangingByteOrder (1676 of 1736) PASS: lldb-Suite :: commands/frame/diagnose/dereference-function-return/TestDiagnoseDereferenceFunctionReturn.py (1677 of 1736) PASS: lldb-Suite :: functionalities/pre_run_dylibs/TestPreRunDylibs.py (1678 of 1736) PASS: lldb-Unit :: Utility/./UtilityTests/VMRange.Comparison (1679 of 1736) PASS: lldb-Suite :: functionalities/data-formatter/format-propagation/TestFormatPropagation.py (1680 of 1736) PASS: lldb-Suite :: commands/watchpoints/hello_watchpoint/TestMyFirstWatchpoint.py (1681 of 1736) PASS: lldb-Suite :: tools/lldb-vscode/step/TestVSCode_step.py (1682 of 1736) PASS: lldb-Suite :: lang/c/local_types/TestUseClosestType.py (1683 of 1736) PASS: lldb-Suite :: functionalities/tty/TestTerminal.py (1684 of 1736) PASS: lldb-Suite :: macosx/lc-note/kern-ver-str/TestKernVerStrLCNOTE.py (1685 of 1736) PASS: lldb-Suite :: functionalities/breakpoint/breakpoint_conditions/TestBreakpointConditions.py (1686 of 1736) PASS: lldb-Unit :: UnwindAssembly/ARM64/./Arm64InstEmulationTests/TestArm64InstEmulation.TestRegisterSavedTwice (1687 of 1736) PASS: lldb-Suite :: commands/expression/entry-bp/TestExprEntryBP.py (1688 of 1736) PASS: lldb-Unit :: UnwindAssembly/ARM64/./Arm64InstEmulationTests/TestArm64InstEmulation.TestRegisterDoubleSpills (1689 of 1736) PASS: lldb-Unit :: Utility/./UtilityTests/RangeTest.ContainsAddrInvalid (1690 of 1736) PASS: lldb-Unit :: Utility/./UtilityTests/StringLexerTest.Peek (1691 of 1736) PASS: lldb-Suite :: lang/objcxx/hide-runtime-values/TestObjCXXHideRuntimeValues.py (1692 of 1736) PASS: LLDB :: BuildScript/toolchain-clang.test (1693 of 1736) PASS: lldb-Unit :: Core/./LLDBCoreTests/RichManglingContextTest.SwitchProvider (1694 of 1736) PASS: LLDB :: Unwind/trap_frame_sym_ctx.test (1695 of 1736) PASS: LLDB :: Modules/ELF/PT_LOAD-overlap-PT_TLS.yaml (1696 of 1736) PASS: lldb-Suite :: python_api/formatters/TestFormattersSBAPI.py (1697 of 1736) PASS: lldb-Suite :: api/multiple-targets/TestMultipleTargets.py (1698 of 1736) PASS: lldb-Unit :: UnwindAssembly/x86/./UnwindAssemblyx86Tests/Testx86AssemblyInspectionEngine.Test64bitFramelessBigStackFrame (1699 of 1736) PASS: lldb-Unit :: Utility/./UtilityTests/RegularExpression.Match (1700 of 1736) PASS: LLDB :: Modules/Breakpad/breakpad-identification.test (1701 of 1736) PASS: lldb-Unit :: Utility/./UtilityTests/StreamTest.ShiftOperatorInts (1702 of 1736) PASS: lldb-Unit :: Language/Highlighting/./HighlighterTests/HighlighterTest.ClangOperators (1703 of 1736) PASS: lldb-Unit :: Utility/./UtilityTests/AnsiTerminal.Unknown (1704 of 1736) PASS: lldb-Unit :: Utility/./UtilityTests/VMRange.ContainsRange (1705 of 1736) PASS: lldb-Suite :: commands/expression/persistent_ptr_update/TestPersistentPtrUpdate.py (1706 of 1736) PASS: lldb-Suite :: functionalities/load_using_paths/TestLoadUsingPaths.py (1707 of 1736) PASS: lldb-Unit :: Host/./HostTests/NativeProcessProtocolTest.ReadCStringFromMemory_CrossPageBoundary (1708 of 1736) PASS: lldb-Unit :: Utility/./UtilityTests/UriParserTest.Empty (1709 of 1736) PASS: lldb-Unit :: Utility/./UtilityTests/ArchSpecTest.MergeFrom (1710 of 1736) UNSUPPORTED: LLDB :: SymbolFile/DWARF/dir-separator-posix.s (1711 of 1736) PASS: lldb-Unit :: Utility/./UtilityTests/AnsiTerminal.AtEnd (1712 of 1736) PASS: lldb-Unit :: Symbol/./SymbolTests/TestClangASTContext.TestBuiltinTypeForEncodingAndBitSize (1713 of 1736) PASS: lldb-Unit :: Utility/./UtilityTests/Flags.AnySet (1714 of 1736) PASS: lldb-Unit :: Process/minidump/./LLDBMinidumpTests/MinidumpParserTest.GetLinuxProcStatus (1715 of 1736) PASS: lldb-Unit :: Utility/./UtilityTests/RangeTest.Union (1716 of 1736) PASS: lldb-Unit :: Utility/./UtilityTests/ScalarTest.ComparisonFloat (1717 of 1736) UNSUPPORTED: LLDB :: SymbolFile/PDB/class-layout.test (1718 of 1736) PASS: LLDB :: Modules/ELF/section-permissions.yaml (1719 of 1736) XFAIL: LLDB :: Register/x86-mm-xmm-read.test (1720 of 1736) PASS: lldb-Unit :: SymbolFile/DWARF/./SymbolFileDWARFTests/SymbolFileDWARFTests.TestAbbrevOrder1Start5 (1721 of 1736) PASS: lldb-Unit :: Utility/./UtilityTests/StringExtractorTest.GetNameColonValueContainsColon (1722 of 1736) PASS: lldb-Suite :: commands/register/register/register_command/TestRegisters.py (1723 of 1736) PASS: lldb-Suite :: lang/cpp/wchar_t/TestCxxWCharT.py (1724 of 1736) PASS: lldb-Suite :: functionalities/breakpoint/dummy_target_breakpoints/TestBreakpointsWithNoTargets.py (1725 of 1736) PASS: LLDB :: Reproducer/Functionalities/TestImageList.test (1726 of 1736) PASS: lldb-Suite :: types/TestDoubleTypesExpr.py (1727 of 1736) PASS: lldb-Suite :: sample_test/TestSampleInlineTest.py (1728 of 1736) PASS: lldb-Suite :: functionalities/data-formatter/ostypeformatting/TestFormattersOsType.py (1729 of 1736) PASS: lldb-Suite :: api/multithreaded/TestMultithreaded.py (1730 of 1736) PASS: lldb-Suite :: commands/expression/test/TestExprs2.py (1731 of 1736) PASS: lldb-Suite :: functionalities/thread/step_out/TestThreadStepOut.py (1732 of 1736) PASS: lldb-Suite :: functionalities/data-formatter/data-formatter-objc/TestDataFormatterObjCNSData.py (1733 of 1736) PASS: lldb-Suite :: python_api/module_section/TestModuleAndSection.py (1734 of 1736) PASS: lldb-Suite :: lang/objc/objc-new-syntax/TestObjCNewSyntaxArray.py (1735 of 1736) PASS: lldb-Suite :: lang/objc/foundation/TestFoundationDisassembly.py (1736 of 1736) Testing Time: 277.68s ******************** Failing Tests (1): lldb-Suite :: functionalities/thread/concurrent_events/TestConcurrentTwoBreakpointsOneDelaySignal.py

Hide Details

Hide Details

Slowest Tests: -------------------------------------------------------------------------- 17.18s: lldb-Suite :: python_api/lldbutil/iter/TestLLDBIterator.py 19.16s: lldb-Suite :: commands/settings/TestSettings.py 19.25s: lldb-Suite :: commands/register/register/register_command/TestRegisters.py 19.82s: lldb-Suite :: lang/objc/forward-decl/TestForwardDecl.py 22.81s: lldb-Suite :: functionalities/load_unload/TestLoadUnload.py 25.42s: lldb-Suite :: lang/objc/foundation/TestObjCMethodsString.py 25.64s: lldb-Suite :: lang/objc/foundation/TestObjCMethodsNSError.py 26.26s: lldb-Suite :: lang/objc/objc-new-syntax/TestObjCNewSyntaxDictionary.py 26.51s: lldb-Suite :: functionalities/recursion/TestValueObjectRecursion.py 32.27s: lldb-Suite :: lang/objc/real-definition/TestRealDefinition.py 33.78s: lldb-Suite :: lang/cpp/namespace/TestNamespaceLookup.py 34.48s: lldb-Suite :: lang/objc/exceptions/TestObjCExceptions.py 35.69s: lldb-Suite :: lang/objc/objc-new-syntax/TestObjCNewSyntaxLiteral.py 48.73s: lldb-Suite :: lang/objc/foundation/TestObjCMethods.py 54.24s: lldb-Suite :: lang/objc/hidden-ivars/TestHiddenIvars.py 55.01s: lldb-Suite :: api/multithreaded/TestMultithreaded.py 59.30s: lldb-Suite :: types/TestIntegerTypes.py 78.17s: lldb-Suite :: tools/lldb-server/TestLldbGdbServer.py 79.59s: lldb-Suite :: types/TestIntegerTypesExpr.py 126.33s: lldb-Suite :: lang/objc/foundation/TestFoundationDisassembly.py

Hide Details

Tests Times: -------------------------------------------------------------------------- [ Range ] :: [ Percentage ] :: [ Count ] -------------------------------------------------------------------------- [ 0s, 10s) :: [************************************** ] :: [1652/1736] [ 10s, 20s) :: [* ] :: [ 67/1736] [ 20s, 30s) :: [ ] :: [ 6/1736] [ 30s, 40s) :: [ ] :: [ 4/1736] [ 40s, 50s) :: [ ] :: [ 0/1736] [ 50s, 60s) :: [ ] :: [ 3/1736] [ 60s, 70s) :: [ ] :: [ 1/1736] [ 70s, 80s) :: [ ] :: [ 0/1736] [ 80s, 90s) :: [ ] :: [ 2/1736] [ 90s,100s) :: [ ] :: [ 0/1736] [100s,110s) :: [ ] :: [ 0/1736] [110s,120s) :: [ ] :: [ 0/1736] [120s,130s) :: [ ] :: [ 1/1736] Expected Passes : 1641 Expected Failures : 5 Unsupported Tests : 89 Unexpected Failures: 1 FAILED: tools/lldb/lit/CMakeFiles/check-lldb-lit cd /Users/buildslave/jenkins/workspace/lldb-cmake-matrix/lldb-build/tools/lldb/lit && /usr/bin/python /Users/buildslave/jenkins/workspace/lldb-cmake-matrix/lldb-build/./bin/llvm-lit -v --time-tests --shuffle --xunit-xml-output=/Users/buildslave/jenkins/workspace/lldb-cmake-matrix/test/results.xml -v /Users/buildslave/jenkins/workspace/lldb-cmake-matrix/lldb-build/tools/lldb/lit ninja: build stopped: subcommand failed. Command failed Command: ['/usr/bin/env', 'TERM=vt100', '/usr/local/bin/ninja', '-v', 'check-lldb'] + set -e [Pipeline] } [Pipeline] // timeout [Pipeline] junit Recording test results [Pipeline] } [Pipeline] // stage [Pipeline] } [Pipeline] // withEnv [Pipeline] } sh: line 1: 85017 Terminated: 15 sleep 3 [Pipeline] // node [Pipeline] End of Pipeline [BFA] Scanning build for known causes... [BFA] Found failure cause(s): [BFA] Compile Error from category Compile [BFA] Regression test failed from category Test [BFA] Ninja target failed from category Compile [BFA] Done. 13s Finished: UNSTABLE