SuccessConsole Output

Skipping 20,524 KB.. Full Log
wo']

Session logs for test failures/errors/unexpected successes will go into directory '/Users/buildslave/jenkins/workspace/lldb-cmake-matrix/test/logs'
Command invoked: /Users/buildslave/jenkins/workspace/lldb-cmake-matrix/llvm-project/lldb/test/dotest.py --arch=x86_64 -s /Users/buildslave/jenkins/workspace/lldb-cmake-matrix/lldb-build/lldb-test-traces -S nm -u CXXFLAGS -u CFLAGS --executable /Users/buildslave/jenkins/workspace/lldb-cmake-matrix/lldb-build/./bin/lldb --dsymutil /Users/buildslave/jenkins/workspace/lldb-cmake-matrix/lldb-build/./bin/dsymutil --filecheck /Users/buildslave/jenkins/workspace/lldb-cmake-matrix/lldb-build/./bin/FileCheck -C /Users/buildslave/jenkins/workspace/lldb-cmake-matrix/clang_701_build/bin/clang --codesign-identity lldb_codesign --server /Users/buildslave/jenkins/workspace/lldb-cmake-matrix/lldb-build/./bin/debugserver --arch x86_64 --build-dir /Users/buildslave/jenkins/workspace/lldb-cmake-matrix/lldb-build/lldb-test-build.noindex -s=/Users/buildslave/jenkins/workspace/lldb-cmake-matrix/test/logs -t --env TERM=vt100 --skip-category gmodules --skip-category watchpoint --arch=x86_64 --dwarf-version=5 --env LLVM_LIBS_DIR=/Users/buildslave/jenkins/workspace/lldb-cmake-matrix/lldb-build/./lib --build-dir /Users/buildslave/jenkins/workspace/lldb-cmake-matrix/lldb-build/tools/lldb/lldb-test-build.noindex --module-cache-dir /Users/buildslave/jenkins/workspace/lldb-cmake-matrix/lldb-build/tools/lldb/lldb-test-build.noindex/module-cache-lldb /Users/buildslave/jenkins/workspace/lldb-cmake-matrix/llvm-project/lldb/packages/Python/lldbsuite/test/commands/expression/xvalue -p TestXValuePrinting.py
Change dir to: /Users/buildslave/jenkins/workspace/lldb-cmake-matrix/llvm-project/lldb/packages/Python/lldbsuite/test/commands/expression/xvalue
runCmd: settings set symbols.enable-external-lookup false
output: 

runCmd: settings set plugin.process.gdb-remote.packet-timeout 60
output: 

runCmd: settings set symbols.clang-modules-cache-path "/Users/buildslave/jenkins/workspace/lldb-cmake-matrix/lldb-build/tools/lldb/lldb-test-build.noindex/module-cache-lldb"
output: 

runCmd: settings set use-color false
output: 

warning: (x86_64) /Users/buildslave/jenkins/workspace/lldb-cmake-matrix/lldb-build/tools/lldb/lldb-test-build.noindex/commands/expression/xvalue/TestXValuePrinting.test_dsym/a.out empty dSYM file detected, dSYM was created with an executable with no debug info.
FAIL: LLDB (/Users/buildslave/jenkins/workspace/lldb-cmake-matrix/clang_701_build/bin/clang-7-x86_64) :: test_dsym (TestXValuePrinting.ExprXValuePrintingTestCase)
runCmd: settings set symbols.enable-external-lookup false
output: 

runCmd: settings set plugin.process.gdb-remote.packet-timeout 60
output: 

runCmd: settings set symbols.clang-modules-cache-path "/Users/buildslave/jenkins/workspace/lldb-cmake-matrix/lldb-build/tools/lldb/lldb-test-build.noindex/module-cache-lldb"
output: 

runCmd: settings set use-color false
output: 

FAIL: LLDB (/Users/buildslave/jenkins/workspace/lldb-cmake-matrix/clang_701_build/bin/clang-7-x86_64) :: test_dwarf (TestXValuePrinting.ExprXValuePrintingTestCase)
UNSUPPORTED: LLDB (/Users/buildslave/jenkins/workspace/lldb-cmake-matrix/clang_701_build/bin/clang-7-x86_64) :: test_dwo (TestXValuePrinting.ExprXValuePrintingTestCase) (test case does not fall in any category of interest for this run) 
UNSUPPORTED: LLDB (/Users/buildslave/jenkins/workspace/lldb-cmake-matrix/clang_701_build/bin/clang-7-x86_64) :: test_gmodules (TestXValuePrinting.ExprXValuePrintingTestCase) (test case does not fall in any category of interest for this run) 
Restore dir to: /Users/buildslave/jenkins/workspace/lldb-cmake-matrix/lldb-build/tools/lldb/lit
======================================================================
FAIL: test_dsym (TestXValuePrinting.ExprXValuePrintingTestCase)
----------------------------------------------------------------------
Traceback (most recent call last):
  File "/Users/buildslave/jenkins/workspace/lldb-cmake-matrix/llvm-project/lldb/packages/Python/lldbsuite/test/lldbtest.py", line 1748, in test_method
    return attrvalue(self)
  File "/Users/buildslave/jenkins/workspace/lldb-cmake-matrix/llvm-project/lldb/packages/Python/lldbsuite/test/decorators.py", line 111, in wrapper
    func(*args, **kwargs)
  File "/Users/buildslave/jenkins/workspace/lldb-cmake-matrix/llvm-project/lldb/packages/Python/lldbsuite/test/commands/expression/xvalue/TestXValuePrinting.py", line 36, in test
    self.do_test()
  File "/Users/buildslave/jenkins/workspace/lldb-cmake-matrix/llvm-project/lldb/packages/Python/lldbsuite/test/commands/expression/xvalue/TestXValuePrinting.py", line 26, in do_test
    '// Break here', self.main_source_spec)
  File "/Users/buildslave/jenkins/workspace/lldb-cmake-matrix/llvm-project/lldb/packages/Python/lldbsuite/test/lldbutil.py", line 837, in run_to_source_breakpoint
    %(bkpt_pattern, source_spec.GetFilename(), source_spec.GetDirectory()))
AssertionError: False is not True : No locations found for source breakpoint: "// Break here", file: "main.cpp", dir: "/Users/buildslave/jenkins/workspace/lldb-cmake-matrix/llvm-project/lldb/packages/Python/lldbsuite/test/commands/expression/xvalue"
Config=x86_64-/Users/buildslave/jenkins/workspace/lldb-cmake-matrix/clang_701_build/bin/clang-7
======================================================================
FAIL: test_dwarf (TestXValuePrinting.ExprXValuePrintingTestCase)
----------------------------------------------------------------------
Traceback (most recent call last):
  File "/Users/buildslave/jenkins/workspace/lldb-cmake-matrix/llvm-project/lldb/packages/Python/lldbsuite/test/lldbtest.py", line 1748, in test_method
    return attrvalue(self)
  File "/Users/buildslave/jenkins/workspace/lldb-cmake-matrix/llvm-project/lldb/packages/Python/lldbsuite/test/decorators.py", line 111, in wrapper
    func(*args, **kwargs)
  File "/Users/buildslave/jenkins/workspace/lldb-cmake-matrix/llvm-project/lldb/packages/Python/lldbsuite/test/commands/expression/xvalue/TestXValuePrinting.py", line 36, in test
    self.do_test()
  File "/Users/buildslave/jenkins/workspace/lldb-cmake-matrix/llvm-project/lldb/packages/Python/lldbsuite/test/commands/expression/xvalue/TestXValuePrinting.py", line 26, in do_test
    '// Break here', self.main_source_spec)
  File "/Users/buildslave/jenkins/workspace/lldb-cmake-matrix/llvm-project/lldb/packages/Python/lldbsuite/test/lldbutil.py", line 837, in run_to_source_breakpoint
    %(bkpt_pattern, source_spec.GetFilename(), source_spec.GetDirectory()))
AssertionError: False is not True : No locations found for source breakpoint: "// Break here", file: "main.cpp", dir: "/Users/buildslave/jenkins/workspace/lldb-cmake-matrix/llvm-project/lldb/packages/Python/lldbsuite/test/commands/expression/xvalue"
Config=x86_64-/Users/buildslave/jenkins/workspace/lldb-cmake-matrix/clang_701_build/bin/clang-7
----------------------------------------------------------------------
Ran 4 tests in 0.889s

RESULT: FAILED (0 passes, 2 failures, 0 errors, 2 skipped, 0 expected failures, 0 unexpected successes)

********************
PASS: lldb-Unit :: Process/gdb-remote/./ProcessGdbRemoteTests/GDBRemoteCommunicationServerTest.SendErrorResponse_UnimplementedError (1718 of 1736)
PASS: LLDB :: Minidump/Windows/find-module.test (1719 of 1736)
FAIL: lldb-Suite :: functionalities/data-formatter/summary-string-onfail/Test-rdar-9974002.py (1720 of 1736)
******************** TEST 'lldb-Suite :: functionalities/data-formatter/summary-string-onfail/Test-rdar-9974002.py' FAILED ********************
lldb version 10.0.99 (http://labmaster3.local/git/llvm-project.git revision 08f938bd1ae356544923042423ea3f30cd730bf8)
  clang revision 621c93ec1fd804f736cbcb58282ef037fa1a9c48
  llvm revision 621c93ec1fd804f736cbcb58282ef037fa1a9c48
LLDB library dir: /Users/buildslave/jenkins/workspace/lldb-cmake-matrix/lldb-build/bin
LLDB import library dir: /Users/buildslave/jenkins/workspace/lldb-cmake-matrix/lldb-build/bin
libstdcxx tests will not be run because: Don't know how to build with libstdcxx on macosx
Skipping following debug info categories: ['dwo']

Session logs for test failures/errors/unexpected successes will go into directory '/Users/buildslave/jenkins/workspace/lldb-cmake-matrix/test/logs'
Command invoked: /Users/buildslave/jenkins/workspace/lldb-cmake-matrix/llvm-project/lldb/test/dotest.py --arch=x86_64 -s /Users/buildslave/jenkins/workspace/lldb-cmake-matrix/lldb-build/lldb-test-traces -S nm -u CXXFLAGS -u CFLAGS --executable /Users/buildslave/jenkins/workspace/lldb-cmake-matrix/lldb-build/./bin/lldb --dsymutil /Users/buildslave/jenkins/workspace/lldb-cmake-matrix/lldb-build/./bin/dsymutil --filecheck /Users/buildslave/jenkins/workspace/lldb-cmake-matrix/lldb-build/./bin/FileCheck -C /Users/buildslave/jenkins/workspace/lldb-cmake-matrix/clang_701_build/bin/clang --codesign-identity lldb_codesign --server /Users/buildslave/jenkins/workspace/lldb-cmake-matrix/lldb-build/./bin/debugserver --arch x86_64 --build-dir /Users/buildslave/jenkins/workspace/lldb-cmake-matrix/lldb-build/lldb-test-build.noindex -s=/Users/buildslave/jenkins/workspace/lldb-cmake-matrix/test/logs -t --env TERM=vt100 --skip-category gmodules --skip-category watchpoint --arch=x86_64 --dwarf-version=5 --env LLVM_LIBS_DIR=/Users/buildslave/jenkins/workspace/lldb-cmake-matrix/lldb-build/./lib --build-dir /Users/buildslave/jenkins/workspace/lldb-cmake-matrix/lldb-build/tools/lldb/lldb-test-build.noindex --module-cache-dir /Users/buildslave/jenkins/workspace/lldb-cmake-matrix/lldb-build/tools/lldb/lldb-test-build.noindex/module-cache-lldb /Users/buildslave/jenkins/workspace/lldb-cmake-matrix/llvm-project/lldb/packages/Python/lldbsuite/test/functionalities/data-formatter/summary-string-onfail -p Test-rdar-9974002.py
Change dir to: /Users/buildslave/jenkins/workspace/lldb-cmake-matrix/llvm-project/lldb/packages/Python/lldbsuite/test/functionalities/data-formatter/summary-string-onfail
runCmd: settings set symbols.enable-external-lookup false
output: 

runCmd: settings set plugin.process.gdb-remote.packet-timeout 60
output: 

runCmd: settings set symbols.clang-modules-cache-path "/Users/buildslave/jenkins/workspace/lldb-cmake-matrix/lldb-build/tools/lldb/lldb-test-build.noindex/module-cache-lldb"
output: 

runCmd: settings set use-color false
output: 

warning: (x86_64) /Users/buildslave/jenkins/workspace/lldb-cmake-matrix/lldb-build/tools/lldb/lldb-test-build.noindex/functionalities/data-formatter/summary-string-onfail/Test-rdar-9974002.test_with_run_command_dsym/a.out empty dSYM file detected, dSYM was created with an executable with no debug info.
runCmd: file /Users/buildslave/jenkins/workspace/lldb-cmake-matrix/lldb-build/tools/lldb/lldb-test-build.noindex/functionalities/data-formatter/summary-string-onfail/Test-rdar-9974002.test_with_run_command_dsym/a.out
output: Current executable set to '/Users/buildslave/jenkins/workspace/lldb-cmake-matrix/lldb-build/tools/lldb/lldb-test-build.noindex/functionalities/data-formatter/summary-string-onfail/Test-rdar-9974002.test_with_run_command_dsym/a.out' (x86_64).


runCmd: breakpoint set -f "main.cpp" -l 26
output: Breakpoint 1: no locations (pending).
WARNING:  Unable to resolve breakpoint to any actual locations.


Expecting pattern: ^Breakpoint (?P<bpno>[0-9]+): (?P<num_locations>[0-9]+) locations\.$
Not matched

Expecting pattern: ^Breakpoint (?P<bpno>[0-9]+): (?P<num_locations>no) locations \(pending\)\.
Matched

FAIL: LLDB (/Users/buildslave/jenkins/workspace/lldb-cmake-matrix/clang_701_build/bin/clang-7-x86_64) :: test_with_run_command_dsym (Test-rdar-9974002.Radar9974002DataFormatterTestCase)
runCmd: settings set symbols.enable-external-lookup false
output: 

runCmd: settings set plugin.process.gdb-remote.packet-timeout 60
output: 

runCmd: settings set symbols.clang-modules-cache-path "/Users/buildslave/jenkins/workspace/lldb-cmake-matrix/lldb-build/tools/lldb/lldb-test-build.noindex/module-cache-lldb"
output: 

runCmd: settings set use-color false
output: 

runCmd: file /Users/buildslave/jenkins/workspace/lldb-cmake-matrix/lldb-build/tools/lldb/lldb-test-build.noindex/functionalities/data-formatter/summary-string-onfail/Test-rdar-9974002.test_with_run_command_dwarf/a.out
output: Current executable set to '/Users/buildslave/jenkins/workspace/lldb-cmake-matrix/lldb-build/tools/lldb/lldb-test-build.noindex/functionalities/data-formatter/summary-string-onfail/Test-rdar-9974002.test_with_run_command_dwarf/a.out' (x86_64).


runCmd: breakpoint set -f "main.cpp" -l 26
output: Breakpoint 1: no locations (pending).
WARNING:  Unable to resolve breakpoint to any actual locations.


Expecting pattern: ^Breakpoint (?P<bpno>[0-9]+): (?P<num_locations>[0-9]+) locations\.$
Not matched

Expecting pattern: ^Breakpoint (?P<bpno>[0-9]+): (?P<num_locations>no) locations \(pending\)\.
Matched

FAIL: LLDB (/Users/buildslave/jenkins/workspace/lldb-cmake-matrix/clang_701_build/bin/clang-7-x86_64) :: test_with_run_command_dwarf (Test-rdar-9974002.Radar9974002DataFormatterTestCase)
UNSUPPORTED: LLDB (/Users/buildslave/jenkins/workspace/lldb-cmake-matrix/clang_701_build/bin/clang-7-x86_64) :: test_with_run_command_dwo (Test-rdar-9974002.Radar9974002DataFormatterTestCase) (test case does not fall in any category of interest for this run) 
UNSUPPORTED: LLDB (/Users/buildslave/jenkins/workspace/lldb-cmake-matrix/clang_701_build/bin/clang-7-x86_64) :: test_with_run_command_gmodules (Test-rdar-9974002.Radar9974002DataFormatterTestCase) (test case does not fall in any category of interest for this run) 
Restore dir to: /Users/buildslave/jenkins/workspace/lldb-cmake-matrix/lldb-build/tools/lldb/lit
======================================================================
FAIL: test_with_run_command_dsym (Test-rdar-9974002.Radar9974002DataFormatterTestCase)
   Test that that file and class static variables display correctly.
----------------------------------------------------------------------
Traceback (most recent call last):
  File "/Users/buildslave/jenkins/workspace/lldb-cmake-matrix/llvm-project/lldb/packages/Python/lldbsuite/test/lldbtest.py", line 1748, in test_method
    return attrvalue(self)
  File "/Users/buildslave/jenkins/workspace/lldb-cmake-matrix/llvm-project/lldb/packages/Python/lldbsuite/test/functionalities/data-formatter/summary-string-onfail/Test-rdar-9974002.py", line 34, in test_with_run_command
    self, "main.cpp", self.line, num_expected_locations=1, loc_exact=True)
  File "/Users/buildslave/jenkins/workspace/lldb-cmake-matrix/llvm-project/lldb/packages/Python/lldbsuite/test/lldbutil.py", line 383, in run_break_set_by_file_and_line
    module_name=module_name)
  File "/Users/buildslave/jenkins/workspace/lldb-cmake-matrix/llvm-project/lldb/packages/Python/lldbsuite/test/lldbutil.py", line 584, in check_breakpoint_result
    out_num_locations))
AssertionError: False is not True : Expecting 1 locations, got 0.
Config=x86_64-/Users/buildslave/jenkins/workspace/lldb-cmake-matrix/clang_701_build/bin/clang-7
======================================================================
FAIL: test_with_run_command_dwarf (Test-rdar-9974002.Radar9974002DataFormatterTestCase)
   Test that that file and class static variables display correctly.
----------------------------------------------------------------------
Traceback (most recent call last):
  File "/Users/buildslave/jenkins/workspace/lldb-cmake-matrix/llvm-project/lldb/packages/Python/lldbsuite/test/lldbtest.py", line 1748, in test_method
    return attrvalue(self)
  File "/Users/buildslave/jenkins/workspace/lldb-cmake-matrix/llvm-project/lldb/packages/Python/lldbsuite/test/functionalities/data-formatter/summary-string-onfail/Test-rdar-9974002.py", line 34, in test_with_run_command
    self, "main.cpp", self.line, num_expected_locations=1, loc_exact=True)
  File "/Users/buildslave/jenkins/workspace/lldb-cmake-matrix/llvm-project/lldb/packages/Python/lldbsuite/test/lldbutil.py", line 383, in run_break_set_by_file_and_line
    module_name=module_name)
  File "/Users/buildslave/jenkins/workspace/lldb-cmake-matrix/llvm-project/lldb/packages/Python/lldbsuite/test/lldbutil.py", line 584, in check_breakpoint_result
    out_num_locations))
AssertionError: False is not True : Expecting 1 locations, got 0.
Config=x86_64-/Users/buildslave/jenkins/workspace/lldb-cmake-matrix/clang_701_build/bin/clang-7
----------------------------------------------------------------------
Ran 4 tests in 1.067s

RESULT: FAILED (0 passes, 2 failures, 0 errors, 2 skipped, 0 expected failures, 0 unexpected successes)

********************
PASS: lldb-Unit :: Utility/./UtilityTests/StringListTest.PopBack (1721 of 1736)
FAIL: lldb-Suite :: python_api/value_var_update/TestValueVarUpdate.py (1722 of 1736)
******************** TEST 'lldb-Suite :: python_api/value_var_update/TestValueVarUpdate.py' FAILED ********************
lldb version 10.0.99 (http://labmaster3.local/git/llvm-project.git revision 08f938bd1ae356544923042423ea3f30cd730bf8)
  clang revision 621c93ec1fd804f736cbcb58282ef037fa1a9c48
  llvm revision 621c93ec1fd804f736cbcb58282ef037fa1a9c48
LLDB library dir: /Users/buildslave/jenkins/workspace/lldb-cmake-matrix/lldb-build/bin
LLDB import library dir: /Users/buildslave/jenkins/workspace/lldb-cmake-matrix/lldb-build/bin
libstdcxx tests will not be run because: Don't know how to build with libstdcxx on macosx
Skipping following debug info categories: ['dwo']

Session logs for test failures/errors/unexpected successes will go into directory '/Users/buildslave/jenkins/workspace/lldb-cmake-matrix/test/logs'
Command invoked: /Users/buildslave/jenkins/workspace/lldb-cmake-matrix/llvm-project/lldb/test/dotest.py --arch=x86_64 -s /Users/buildslave/jenkins/workspace/lldb-cmake-matrix/lldb-build/lldb-test-traces -S nm -u CXXFLAGS -u CFLAGS --executable /Users/buildslave/jenkins/workspace/lldb-cmake-matrix/lldb-build/./bin/lldb --dsymutil /Users/buildslave/jenkins/workspace/lldb-cmake-matrix/lldb-build/./bin/dsymutil --filecheck /Users/buildslave/jenkins/workspace/lldb-cmake-matrix/lldb-build/./bin/FileCheck -C /Users/buildslave/jenkins/workspace/lldb-cmake-matrix/clang_701_build/bin/clang --codesign-identity lldb_codesign --server /Users/buildslave/jenkins/workspace/lldb-cmake-matrix/lldb-build/./bin/debugserver --arch x86_64 --build-dir /Users/buildslave/jenkins/workspace/lldb-cmake-matrix/lldb-build/lldb-test-build.noindex -s=/Users/buildslave/jenkins/workspace/lldb-cmake-matrix/test/logs -t --env TERM=vt100 --skip-category gmodules --skip-category watchpoint --arch=x86_64 --dwarf-version=5 --env LLVM_LIBS_DIR=/Users/buildslave/jenkins/workspace/lldb-cmake-matrix/lldb-build/./lib --build-dir /Users/buildslave/jenkins/workspace/lldb-cmake-matrix/lldb-build/tools/lldb/lldb-test-build.noindex --module-cache-dir /Users/buildslave/jenkins/workspace/lldb-cmake-matrix/lldb-build/tools/lldb/lldb-test-build.noindex/module-cache-lldb /Users/buildslave/jenkins/workspace/lldb-cmake-matrix/llvm-project/lldb/packages/Python/lldbsuite/test/python_api/value_var_update -p TestValueVarUpdate.py
Change dir to: /Users/buildslave/jenkins/workspace/lldb-cmake-matrix/llvm-project/lldb/packages/Python/lldbsuite/test/python_api/value_var_update
runCmd: settings set symbols.enable-external-lookup false
output: 

runCmd: settings set plugin.process.gdb-remote.packet-timeout 60
output: 

runCmd: settings set symbols.clang-modules-cache-path "/Users/buildslave/jenkins/workspace/lldb-cmake-matrix/lldb-build/tools/lldb/lldb-test-build.noindex/module-cache-lldb"
output: 

runCmd: settings set use-color false
output: 

warning: (x86_64) /Users/buildslave/jenkins/workspace/lldb-cmake-matrix/lldb-build/tools/lldb/lldb-test-build.noindex/python_api/value_var_update/TestValueVarUpdate.test_with_process_launch_api_dsym/test_with_process_launch_api_dsym empty dSYM file detected, dSYM was created with an executable with no debug info.
runCmd: run
output: Process 73127 exited with status = 170 (0x000000aa) 

Process 73127 launched: '/Users/buildslave/jenkins/workspace/lldb-cmake-matrix/lldb-build/tools/lldb/lldb-test-build.noindex/python_api/value_var_update/TestValueVarUpdate.test_with_process_launch_api_dsym/test_with_process_launch_api_dsym' (x86_64)


runCmd: thread list
runCmd failed!
error: Process must be launched.


FAIL: LLDB (/Users/buildslave/jenkins/workspace/lldb-cmake-matrix/clang_701_build/bin/clang-7-x86_64) :: test_with_process_launch_api_dsym (TestValueVarUpdate.ValueVarUpdateTestCase)
<bound method SBProcess.Kill of <lldb.SBProcess; proxy of <Swig Object of type 'lldb::SBProcess *' at 0x10b822c90> >>: success

runCmd: settings set symbols.enable-external-lookup false
output: 

runCmd: settings set plugin.process.gdb-remote.packet-timeout 60
output: 

runCmd: settings set symbols.clang-modules-cache-path "/Users/buildslave/jenkins/workspace/lldb-cmake-matrix/lldb-build/tools/lldb/lldb-test-build.noindex/module-cache-lldb"
output: 

runCmd: settings set use-color false
output: 

runCmd: run
output: Process 73670 exited with status = 170 (0x000000aa) 

Process 73670 launched: '/Users/buildslave/jenkins/workspace/lldb-cmake-matrix/lldb-build/tools/lldb/lldb-test-build.noindex/python_api/value_var_update/TestValueVarUpdate.test_with_process_launch_api_dwarf/test_with_process_launch_api_dwarf' (x86_64)


runCmd: thread list
runCmd failed!
error: Process must be launched.


FAIL: LLDB (/Users/buildslave/jenkins/workspace/lldb-cmake-matrix/clang_701_build/bin/clang-7-x86_64) :: test_with_process_launch_api_dwarf (TestValueVarUpdate.ValueVarUpdateTestCase)
<bound method SBProcess.Kill of <lldb.SBProcess; proxy of <Swig Object of type 'lldb::SBProcess *' at 0x10b822c30> >>: success

UNSUPPORTED: LLDB (/Users/buildslave/jenkins/workspace/lldb-cmake-matrix/clang_701_build/bin/clang-7-x86_64) :: test_with_process_launch_api_dwo (TestValueVarUpdate.ValueVarUpdateTestCase) (test case does not fall in any category of interest for this run) 
UNSUPPORTED: LLDB (/Users/buildslave/jenkins/workspace/lldb-cmake-matrix/clang_701_build/bin/clang-7-x86_64) :: test_with_process_launch_api_gmodules (TestValueVarUpdate.ValueVarUpdateTestCase) (test case does not fall in any category of interest for this run) 
Restore dir to: /Users/buildslave/jenkins/workspace/lldb-cmake-matrix/lldb-build/tools/lldb/lit
======================================================================
FAIL: test_with_process_launch_api_dsym (TestValueVarUpdate.ValueVarUpdateTestCase)
   Test SBValue::GetValueDidChange
----------------------------------------------------------------------
Traceback (most recent call last):
  File "/Users/buildslave/jenkins/workspace/lldb-cmake-matrix/llvm-project/lldb/packages/Python/lldbsuite/test/lldbtest.py", line 1748, in test_method
    return attrvalue(self)
  File "/Users/buildslave/jenkins/workspace/lldb-cmake-matrix/llvm-project/lldb/packages/Python/lldbsuite/test/python_api/value_var_update/TestValueVarUpdate.py", line 38, in test_with_process_launch_api
    'stop reason = breakpoint'])
  File "/Users/buildslave/jenkins/workspace/lldb-cmake-matrix/llvm-project/lldb/packages/Python/lldbsuite/test/lldbtest.py", line 2309, in expect
    inHistory=inHistory)
  File "/Users/buildslave/jenkins/workspace/lldb-cmake-matrix/llvm-project/lldb/packages/Python/lldbsuite/test/lldbtest.py", line 2068, in runCmd
    msg if (msg) else CMD_MSG(cmd))
AssertionError: False is not True : Process should be stopped due to breakpoint
Error output:
error: Process must be launched.

Config=x86_64-/Users/buildslave/jenkins/workspace/lldb-cmake-matrix/clang_701_build/bin/clang-7
======================================================================
FAIL: test_with_process_launch_api_dwarf (TestValueVarUpdate.ValueVarUpdateTestCase)
   Test SBValue::GetValueDidChange
----------------------------------------------------------------------
Traceback (most recent call last):
  File "/Users/buildslave/jenkins/workspace/lldb-cmake-matrix/llvm-project/lldb/packages/Python/lldbsuite/test/lldbtest.py", line 1748, in test_method
    return attrvalue(self)
  File "/Users/buildslave/jenkins/workspace/lldb-cmake-matrix/llvm-project/lldb/packages/Python/lldbsuite/test/python_api/value_var_update/TestValueVarUpdate.py", line 38, in test_with_process_launch_api
    'stop reason = breakpoint'])
  File "/Users/buildslave/jenkins/workspace/lldb-cmake-matrix/llvm-project/lldb/packages/Python/lldbsuite/test/lldbtest.py", line 2309, in expect
    inHistory=inHistory)
  File "/Users/buildslave/jenkins/workspace/lldb-cmake-matrix/llvm-project/lldb/packages/Python/lldbsuite/test/lldbtest.py", line 2068, in runCmd
    msg if (msg) else CMD_MSG(cmd))
AssertionError: False is not True : Process should be stopped due to breakpoint
Error output:
error: Process must be launched.

Config=x86_64-/Users/buildslave/jenkins/workspace/lldb-cmake-matrix/clang_701_build/bin/clang-7
----------------------------------------------------------------------
Ran 4 tests in 1.660s

RESULT: FAILED (0 passes, 2 failures, 0 errors, 2 skipped, 0 expected failures, 0 unexpected successes)

********************
PASS: lldb-Suite :: lang/c/typedef/Testtypedef.py (1723 of 1736)
FAIL: lldb-Suite :: commands/frame/diagnose/dereference-this/TestDiagnoseDereferenceThis.py (1724 of 1736)
******************** TEST 'lldb-Suite :: commands/frame/diagnose/dereference-this/TestDiagnoseDereferenceThis.py' FAILED ********************
lldb version 10.0.99 (http://labmaster3.local/git/llvm-project.git revision 08f938bd1ae356544923042423ea3f30cd730bf8)
  clang revision 621c93ec1fd804f736cbcb58282ef037fa1a9c48
  llvm revision 621c93ec1fd804f736cbcb58282ef037fa1a9c48
LLDB library dir: /Users/buildslave/jenkins/workspace/lldb-cmake-matrix/lldb-build/bin
LLDB import library dir: /Users/buildslave/jenkins/workspace/lldb-cmake-matrix/lldb-build/bin
libstdcxx tests will not be run because: Don't know how to build with libstdcxx on macosx
Skipping following debug info categories: ['dwo']

Session logs for test failures/errors/unexpected successes will go into directory '/Users/buildslave/jenkins/workspace/lldb-cmake-matrix/test/logs'
Command invoked: /Users/buildslave/jenkins/workspace/lldb-cmake-matrix/llvm-project/lldb/test/dotest.py --arch=x86_64 -s /Users/buildslave/jenkins/workspace/lldb-cmake-matrix/lldb-build/lldb-test-traces -S nm -u CXXFLAGS -u CFLAGS --executable /Users/buildslave/jenkins/workspace/lldb-cmake-matrix/lldb-build/./bin/lldb --dsymutil /Users/buildslave/jenkins/workspace/lldb-cmake-matrix/lldb-build/./bin/dsymutil --filecheck /Users/buildslave/jenkins/workspace/lldb-cmake-matrix/lldb-build/./bin/FileCheck -C /Users/buildslave/jenkins/workspace/lldb-cmake-matrix/clang_701_build/bin/clang --codesign-identity lldb_codesign --server /Users/buildslave/jenkins/workspace/lldb-cmake-matrix/lldb-build/./bin/debugserver --arch x86_64 --build-dir /Users/buildslave/jenkins/workspace/lldb-cmake-matrix/lldb-build/lldb-test-build.noindex -s=/Users/buildslave/jenkins/workspace/lldb-cmake-matrix/test/logs -t --env TERM=vt100 --skip-category gmodules --skip-category watchpoint --arch=x86_64 --dwarf-version=5 --env LLVM_LIBS_DIR=/Users/buildslave/jenkins/workspace/lldb-cmake-matrix/lldb-build/./lib --build-dir /Users/buildslave/jenkins/workspace/lldb-cmake-matrix/lldb-build/tools/lldb/lldb-test-build.noindex --module-cache-dir /Users/buildslave/jenkins/workspace/lldb-cmake-matrix/lldb-build/tools/lldb/lldb-test-build.noindex/module-cache-lldb /Users/buildslave/jenkins/workspace/lldb-cmake-matrix/llvm-project/lldb/packages/Python/lldbsuite/test/commands/frame/diagnose/dereference-this -p TestDiagnoseDereferenceThis.py
Change dir to: /Users/buildslave/jenkins/workspace/lldb-cmake-matrix/llvm-project/lldb/packages/Python/lldbsuite/test/commands/frame/diagnose/dereference-this
runCmd: settings set symbols.enable-external-lookup false
output: 

runCmd: settings set plugin.process.gdb-remote.packet-timeout 60
output: 

runCmd: settings set symbols.clang-modules-cache-path "/Users/buildslave/jenkins/workspace/lldb-cmake-matrix/lldb-build/tools/lldb/lldb-test-build.noindex/module-cache-lldb"
output: 

runCmd: settings set use-color false
output: 

runCmd: settings set symbols.enable-external-lookup false
output: 

runCmd: settings set plugin.process.gdb-remote.packet-timeout 60
output: 

runCmd: settings set symbols.clang-modules-cache-path "/Users/buildslave/jenkins/workspace/lldb-cmake-matrix/lldb-build/tools/lldb/lldb-test-build.noindex/module-cache-lldb"
output: 

runCmd: settings set use-color false
output: 

warning: (x86_64) /Users/buildslave/jenkins/workspace/lldb-cmake-matrix/lldb-build/tools/lldb/lldb-test-build.noindex/commands/frame/diagnose/dereference-this/TestDiagnoseDereferenceThis.test_diagnose_dereference_this_dsym/a.out empty dSYM file detected, dSYM was created with an executable with no debug info.
runCmd: file /Users/buildslave/jenkins/workspace/lldb-cmake-matrix/lldb-build/tools/lldb/lldb-test-build.noindex/commands/frame/diagnose/dereference-this/TestDiagnoseDereferenceThis.test_diagnose_dereference_this_dsym/a.out
output: Current executable set to '/Users/buildslave/jenkins/workspace/lldb-cmake-matrix/lldb-build/tools/lldb/lldb-test-build.noindex/commands/frame/diagnose/dereference-this/TestDiagnoseDereferenceThis.test_diagnose_dereference_this_dsym/a.out' (x86_64).


runCmd: run
output: Process 73189 stopped
* thread #1, queue = 'com.apple.main-thread', stop reason = EXC_BAD_ACCESS (code=1, address=0x0)
    frame #0: 0x0000000100000f8c a.out`Foo::Sum() + 12
a.out`Foo::Sum:
->  0x100000f8c <+12>: movl   (%rdi), %eax
    0x100000f8e <+14>: addl   0x4(%rdi), %eax
    0x100000f91 <+17>: popq   %rbp
    0x100000f92 <+18>: retq   

Process 73189 launched: '/Users/buildslave/jenkins/workspace/lldb-cmake-matrix/lldb-build/tools/lldb/lldb-test-build.noindex/commands/frame/diagnose/dereference-this/TestDiagnoseDereferenceThis.test_diagnose_dereference_this_dsym/a.out' (x86_64)


runCmd: thread list
output: Process 73189 stopped
* thread #1: tid = 0x14c01f9, 0x0000000100000f8c a.out`Foo::Sum() + 12, queue = 'com.apple.main-thread', stop reason = EXC_BAD_ACCESS (code=1, address=0x0)


Expecting sub string: stopped
Matched

runCmd: frame diagnose
runCmd failed!
error: No diagnosis available.


FAIL: LLDB (/Users/buildslave/jenkins/workspace/lldb-cmake-matrix/clang_701_build/bin/clang-7-x86_64) :: test_diagnose_dereference_this_dsym (TestDiagnoseDereferenceThis.TestDiagnoseDereferenceThis)
<bound method SBProcess.Kill of <lldb.SBProcess; proxy of <Swig Object of type 'lldb::SBProcess *' at 0x10ca5ecf0> >>: success

runCmd: settings set symbols.enable-external-lookup false
output: 

runCmd: settings set plugin.process.gdb-remote.packet-timeout 60
output: 

runCmd: settings set symbols.clang-modules-cache-path "/Users/buildslave/jenkins/workspace/lldb-cmake-matrix/lldb-build/tools/lldb/lldb-test-build.noindex/module-cache-lldb"
output: 

runCmd: settings set use-color false
output: 

runCmd: settings set symbols.enable-external-lookup false
output: 

runCmd: settings set plugin.process.gdb-remote.packet-timeout 60
output: 

runCmd: settings set symbols.clang-modules-cache-path "/Users/buildslave/jenkins/workspace/lldb-cmake-matrix/lldb-build/tools/lldb/lldb-test-build.noindex/module-cache-lldb"
output: 

runCmd: settings set use-color false
output: 

runCmd: file /Users/buildslave/jenkins/workspace/lldb-cmake-matrix/lldb-build/tools/lldb/lldb-test-build.noindex/commands/frame/diagnose/dereference-this/TestDiagnoseDereferenceThis.test_diagnose_dereference_this_dwarf/a.out
output: Current executable set to '/Users/buildslave/jenkins/workspace/lldb-cmake-matrix/lldb-build/tools/lldb/lldb-test-build.noindex/commands/frame/diagnose/dereference-this/TestDiagnoseDereferenceThis.test_diagnose_dereference_this_dwarf/a.out' (x86_64).


runCmd: run
output: Process 73775 stopped
* thread #1, queue = 'com.apple.main-thread', stop reason = EXC_BAD_ACCESS (code=1, address=0x0)
    frame #0: 0x0000000100000f8c a.out`Foo::Sum() + 12
a.out`Foo::Sum:
->  0x100000f8c <+12>: movl   (%rdi), %eax
    0x100000f8e <+14>: addl   0x4(%rdi), %eax
    0x100000f91 <+17>: popq   %rbp
    0x100000f92 <+18>: retq   

Process 73775 launched: '/Users/buildslave/jenkins/workspace/lldb-cmake-matrix/lldb-build/tools/lldb/lldb-test-build.noindex/commands/frame/diagnose/dereference-this/TestDiagnoseDereferenceThis.test_diagnose_dereference_this_dwarf/a.out' (x86_64)


runCmd: thread list
output: Process 73775 stopped
* thread #1: tid = 0x14c0522, 0x0000000100000f8c a.out`Foo::Sum() + 12, queue = 'com.apple.main-thread', stop reason = EXC_BAD_ACCESS (code=1, address=0x0)


Expecting sub string: stopped
Matched

runCmd: frame diagnose
runCmd failed!
error: No diagnosis available.


FAIL: LLDB (/Users/buildslave/jenkins/workspace/lldb-cmake-matrix/clang_701_build/bin/clang-7-x86_64) :: test_diagnose_dereference_this_dwarf (TestDiagnoseDereferenceThis.TestDiagnoseDereferenceThis)
<bound method SBProcess.Kill of <lldb.SBProcess; proxy of <Swig Object of type 'lldb::SBProcess *' at 0x10ca5ecc0> >>: success

UNSUPPORTED: LLDB (/Users/buildslave/jenkins/workspace/lldb-cmake-matrix/clang_701_build/bin/clang-7-x86_64) :: test_diagnose_dereference_this_dwo (TestDiagnoseDereferenceThis.TestDiagnoseDereferenceThis) (test case does not fall in any category of interest for this run) 
UNSUPPORTED: LLDB (/Users/buildslave/jenkins/workspace/lldb-cmake-matrix/clang_701_build/bin/clang-7-x86_64) :: test_diagnose_dereference_this_gmodules (TestDiagnoseDereferenceThis.TestDiagnoseDereferenceThis) (test case does not fall in any category of interest for this run) 
Restore dir to: /Users/buildslave/jenkins/workspace/lldb-cmake-matrix/lldb-build/tools/lldb/lit
======================================================================
FAIL: test_diagnose_dereference_this_dsym (TestDiagnoseDereferenceThis.TestDiagnoseDereferenceThis)
----------------------------------------------------------------------
Traceback (most recent call last):
  File "/Users/buildslave/jenkins/workspace/lldb-cmake-matrix/llvm-project/lldb/packages/Python/lldbsuite/test/lldbtest.py", line 1748, in test_method
    return attrvalue(self)
  File "/Users/buildslave/jenkins/workspace/lldb-cmake-matrix/llvm-project/lldb/packages/Python/lldbsuite/test/commands/frame/diagnose/dereference-this/TestDiagnoseDereferenceThis.py", line 29, in test_diagnose_dereference_this
    "this->a")
  File "/Users/buildslave/jenkins/workspace/lldb-cmake-matrix/llvm-project/lldb/packages/Python/lldbsuite/test/lldbtest.py", line 2309, in expect
    inHistory=inHistory)
  File "/Users/buildslave/jenkins/workspace/lldb-cmake-matrix/llvm-project/lldb/packages/Python/lldbsuite/test/lldbtest.py", line 2068, in runCmd
    msg if (msg) else CMD_MSG(cmd))
AssertionError: False is not True : Crash diagnosis was accurate
Error output:
error: No diagnosis available.

Config=x86_64-/Users/buildslave/jenkins/workspace/lldb-cmake-matrix/clang_701_build/bin/clang-7
======================================================================
FAIL: test_diagnose_dereference_this_dwarf (TestDiagnoseDereferenceThis.TestDiagnoseDereferenceThis)
----------------------------------------------------------------------
Traceback (most recent call last):
  File "/Users/buildslave/jenkins/workspace/lldb-cmake-matrix/llvm-project/lldb/packages/Python/lldbsuite/test/lldbtest.py", line 1748, in test_method
    return attrvalue(self)
  File "/Users/buildslave/jenkins/workspace/lldb-cmake-matrix/llvm-project/lldb/packages/Python/lldbsuite/test/commands/frame/diagnose/dereference-this/TestDiagnoseDereferenceThis.py", line 29, in test_diagnose_dereference_this
    "this->a")
  File "/Users/buildslave/jenkins/workspace/lldb-cmake-matrix/llvm-project/lldb/packages/Python/lldbsuite/test/lldbtest.py", line 2309, in expect
    inHistory=inHistory)
  File "/Users/buildslave/jenkins/workspace/lldb-cmake-matrix/llvm-project/lldb/packages/Python/lldbsuite/test/lldbtest.py", line 2068, in runCmd
    msg if (msg) else CMD_MSG(cmd))
AssertionError: False is not True : Crash diagnosis was accurate
Error output:
error: No diagnosis available.

Config=x86_64-/Users/buildslave/jenkins/workspace/lldb-cmake-matrix/clang_701_build/bin/clang-7
----------------------------------------------------------------------
Ran 4 tests in 1.693s

RESULT: FAILED (0 passes, 2 failures, 0 errors, 2 skipped, 0 expected failures, 0 unexpected successes)

********************
FAIL: lldb-Suite :: python_api/sbvalue_const_addrof/TestSBValueConstAddrOf.py (1725 of 1736)
******************** TEST 'lldb-Suite :: python_api/sbvalue_const_addrof/TestSBValueConstAddrOf.py' FAILED ********************
lldb version 10.0.99 (http://labmaster3.local/git/llvm-project.git revision 08f938bd1ae356544923042423ea3f30cd730bf8)
  clang revision 621c93ec1fd804f736cbcb58282ef037fa1a9c48
  llvm revision 621c93ec1fd804f736cbcb58282ef037fa1a9c48
LLDB library dir: /Users/buildslave/jenkins/workspace/lldb-cmake-matrix/lldb-build/bin
LLDB import library dir: /Users/buildslave/jenkins/workspace/lldb-cmake-matrix/lldb-build/bin
libstdcxx tests will not be run because: Don't know how to build with libstdcxx on macosx
Skipping following debug info categories: ['dwo']

Session logs for test failures/errors/unexpected successes will go into directory '/Users/buildslave/jenkins/workspace/lldb-cmake-matrix/test/logs'
Command invoked: /Users/buildslave/jenkins/workspace/lldb-cmake-matrix/llvm-project/lldb/test/dotest.py --arch=x86_64 -s /Users/buildslave/jenkins/workspace/lldb-cmake-matrix/lldb-build/lldb-test-traces -S nm -u CXXFLAGS -u CFLAGS --executable /Users/buildslave/jenkins/workspace/lldb-cmake-matrix/lldb-build/./bin/lldb --dsymutil /Users/buildslave/jenkins/workspace/lldb-cmake-matrix/lldb-build/./bin/dsymutil --filecheck /Users/buildslave/jenkins/workspace/lldb-cmake-matrix/lldb-build/./bin/FileCheck -C /Users/buildslave/jenkins/workspace/lldb-cmake-matrix/clang_701_build/bin/clang --codesign-identity lldb_codesign --server /Users/buildslave/jenkins/workspace/lldb-cmake-matrix/lldb-build/./bin/debugserver --arch x86_64 --build-dir /Users/buildslave/jenkins/workspace/lldb-cmake-matrix/lldb-build/lldb-test-build.noindex -s=/Users/buildslave/jenkins/workspace/lldb-cmake-matrix/test/logs -t --env TERM=vt100 --skip-category gmodules --skip-category watchpoint --arch=x86_64 --dwarf-version=5 --env LLVM_LIBS_DIR=/Users/buildslave/jenkins/workspace/lldb-cmake-matrix/lldb-build/./lib --build-dir /Users/buildslave/jenkins/workspace/lldb-cmake-matrix/lldb-build/tools/lldb/lldb-test-build.noindex --module-cache-dir /Users/buildslave/jenkins/workspace/lldb-cmake-matrix/lldb-build/tools/lldb/lldb-test-build.noindex/module-cache-lldb /Users/buildslave/jenkins/workspace/lldb-cmake-matrix/llvm-project/lldb/packages/Python/lldbsuite/test/python_api/sbvalue_const_addrof -p TestSBValueConstAddrOf.py
Change dir to: /Users/buildslave/jenkins/workspace/lldb-cmake-matrix/llvm-project/lldb/packages/Python/lldbsuite/test/python_api/sbvalue_const_addrof
runCmd: settings set symbols.enable-external-lookup false
output: 

runCmd: settings set plugin.process.gdb-remote.packet-timeout 60
output: 

runCmd: settings set symbols.clang-modules-cache-path "/Users/buildslave/jenkins/workspace/lldb-cmake-matrix/lldb-build/tools/lldb/lldb-test-build.noindex/module-cache-lldb"
output: 

runCmd: settings set use-color false
output: 

warning: (x86_64) /Users/buildslave/jenkins/workspace/lldb-cmake-matrix/lldb-build/tools/lldb/lldb-test-build.noindex/python_api/sbvalue_const_addrof/lldbsuite.test.lldbtest.test_dsym/a.out empty dSYM file detected, dSYM was created with an executable with no debug info.
FAIL: LLDB (/Users/buildslave/jenkins/workspace/lldb-cmake-matrix/clang_701_build/bin/clang-7-x86_64) :: test_dsym (lldbsuite.test.lldbtest.TestSBValueConstAddrOf)
<bound method SBProcess.Kill of <lldb.SBProcess; proxy of <Swig Object of type 'lldb::SBProcess *' at 0x100c54270> >>: success

runCmd: settings set symbols.enable-external-lookup false
output: 

runCmd: settings set plugin.process.gdb-remote.packet-timeout 60
output: 

runCmd: settings set symbols.clang-modules-cache-path "/Users/buildslave/jenkins/workspace/lldb-cmake-matrix/lldb-build/tools/lldb/lldb-test-build.noindex/module-cache-lldb"
output: 

runCmd: settings set use-color false
output: 

FAIL: LLDB (/Users/buildslave/jenkins/workspace/lldb-cmake-matrix/clang_701_build/bin/clang-7-x86_64) :: test_dwarf (lldbsuite.test.lldbtest.TestSBValueConstAddrOf)
<bound method SBProcess.Kill of <lldb.SBProcess; proxy of <Swig Object of type 'lldb::SBProcess *' at 0x100c43540> >>: success

UNSUPPORTED: LLDB (/Users/buildslave/jenkins/workspace/lldb-cmake-matrix/clang_701_build/bin/clang-7-x86_64) :: test_dwo (lldbsuite.test.lldbtest.TestSBValueConstAddrOf) (test case does not fall in any category of interest for this run) 
UNSUPPORTED: LLDB (/Users/buildslave/jenkins/workspace/lldb-cmake-matrix/clang_701_build/bin/clang-7-x86_64) :: test_gmodules (lldbsuite.test.lldbtest.TestSBValueConstAddrOf) (test case does not fall in any category of interest for this run) 
Restore dir to: /Users/buildslave/jenkins/workspace/lldb-cmake-matrix/lldb-build/tools/lldb/lit
======================================================================
FAIL: test_dsym (lldbsuite.test.lldbtest.TestSBValueConstAddrOf)
----------------------------------------------------------------------
Traceback (most recent call last):
  File "/Users/buildslave/jenkins/workspace/lldb-cmake-matrix/llvm-project/lldb/packages/Python/lldbsuite/test/lldbtest.py", line 1748, in test_method
    return attrvalue(self)
  File "/Users/buildslave/jenkins/workspace/lldb-cmake-matrix/llvm-project/lldb/packages/Python/lldbsuite/test/lldbinline.py", line 124, in _test
    self.do_test()
  File "/Users/buildslave/jenkins/workspace/lldb-cmake-matrix/llvm-project/lldb/packages/Python/lldbsuite/test/lldbinline.py", line 151, in do_test
    "inline test did not hit a single breakpoint")
AssertionError: False is not True : inline test did not hit a single breakpoint
Config=x86_64-/Users/buildslave/jenkins/workspace/lldb-cmake-matrix/clang_701_build/bin/clang-7
======================================================================
FAIL: test_dwarf (lldbsuite.test.lldbtest.TestSBValueConstAddrOf)
----------------------------------------------------------------------
Traceback (most recent call last):
  File "/Users/buildslave/jenkins/workspace/lldb-cmake-matrix/llvm-project/lldb/packages/Python/lldbsuite/test/lldbtest.py", line 1748, in test_method
    return attrvalue(self)
  File "/Users/buildslave/jenkins/workspace/lldb-cmake-matrix/llvm-project/lldb/packages/Python/lldbsuite/test/lldbinline.py", line 124, in _test
    self.do_test()
  File "/Users/buildslave/jenkins/workspace/lldb-cmake-matrix/llvm-project/lldb/packages/Python/lldbsuite/test/lldbinline.py", line 151, in do_test
    "inline test did not hit a single breakpoint")
AssertionError: False is not True : inline test did not hit a single breakpoint
Config=x86_64-/Users/buildslave/jenkins/workspace/lldb-cmake-matrix/clang_701_build/bin/clang-7
----------------------------------------------------------------------
Ran 4 tests in 1.734s

RESULT: FAILED (0 passes, 2 failures, 0 errors, 2 skipped, 0 expected failures, 0 unexpected successes)

********************
FAIL: lldb-Suite :: functionalities/data-formatter/data-formatter-objc/TestDataFormatterObjCCF.py (1726 of 1736)
******************** TEST 'lldb-Suite :: functionalities/data-formatter/data-formatter-objc/TestDataFormatterObjCCF.py' FAILED ********************
lldb version 10.0.99 (http://labmaster3.local/git/llvm-project.git revision 08f938bd1ae356544923042423ea3f30cd730bf8)
  clang revision 621c93ec1fd804f736cbcb58282ef037fa1a9c48
  llvm revision 621c93ec1fd804f736cbcb58282ef037fa1a9c48
LLDB library dir: /Users/buildslave/jenkins/workspace/lldb-cmake-matrix/lldb-build/bin
LLDB import library dir: /Users/buildslave/jenkins/workspace/lldb-cmake-matrix/lldb-build/bin
libstdcxx tests will not be run because: Don't know how to build with libstdcxx on macosx
Skipping following debug info categories: ['dwo']

Session logs for test failures/errors/unexpected successes will go into directory '/Users/buildslave/jenkins/workspace/lldb-cmake-matrix/test/logs'
Command invoked: /Users/buildslave/jenkins/workspace/lldb-cmake-matrix/llvm-project/lldb/test/dotest.py --arch=x86_64 -s /Users/buildslave/jenkins/workspace/lldb-cmake-matrix/lldb-build/lldb-test-traces -S nm -u CXXFLAGS -u CFLAGS --executable /Users/buildslave/jenkins/workspace/lldb-cmake-matrix/lldb-build/./bin/lldb --dsymutil /Users/buildslave/jenkins/workspace/lldb-cmake-matrix/lldb-build/./bin/dsymutil --filecheck /Users/buildslave/jenkins/workspace/lldb-cmake-matrix/lldb-build/./bin/FileCheck -C /Users/buildslave/jenkins/workspace/lldb-cmake-matrix/clang_701_build/bin/clang --codesign-identity lldb_codesign --server /Users/buildslave/jenkins/workspace/lldb-cmake-matrix/lldb-build/./bin/debugserver --arch x86_64 --build-dir /Users/buildslave/jenkins/workspace/lldb-cmake-matrix/lldb-build/lldb-test-build.noindex -s=/Users/buildslave/jenkins/workspace/lldb-cmake-matrix/test/logs -t --env TERM=vt100 --skip-category gmodules --skip-category watchpoint --arch=x86_64 --dwarf-version=5 --env LLVM_LIBS_DIR=/Users/buildslave/jenkins/workspace/lldb-cmake-matrix/lldb-build/./lib --build-dir /Users/buildslave/jenkins/workspace/lldb-cmake-matrix/lldb-build/tools/lldb/lldb-test-build.noindex --module-cache-dir /Users/buildslave/jenkins/workspace/lldb-cmake-matrix/lldb-build/tools/lldb/lldb-test-build.noindex/module-cache-lldb /Users/buildslave/jenkins/workspace/lldb-cmake-matrix/llvm-project/lldb/packages/Python/lldbsuite/test/functionalities/data-formatter/data-formatter-objc -p TestDataFormatterObjCCF.py
Change dir to: /Users/buildslave/jenkins/workspace/lldb-cmake-matrix/llvm-project/lldb/packages/Python/lldbsuite/test/functionalities/data-formatter/data-formatter-objc
runCmd: settings set symbols.enable-external-lookup false
output: 

runCmd: settings set plugin.process.gdb-remote.packet-timeout 60
output: 

runCmd: settings set symbols.clang-modules-cache-path "/Users/buildslave/jenkins/workspace/lldb-cmake-matrix/lldb-build/tools/lldb/lldb-test-build.noindex/module-cache-lldb"
output: 

runCmd: settings set use-color false
output: 

warning: (x86_64) /Users/buildslave/jenkins/workspace/lldb-cmake-matrix/lldb-build/tools/lldb/lldb-test-build.noindex/functionalities/data-formatter/data-formatter-objc/TestDataFormatterObjCCF.test_coreframeworks_and_run_command_dsym/a.out empty dSYM file detected, dSYM was created with an executable with no debug info.
FAIL: LLDB (/Users/buildslave/jenkins/workspace/lldb-cmake-matrix/clang_701_build/bin/clang-7-x86_64) :: test_coreframeworks_and_run_command_dsym (TestDataFormatterObjCCF.ObjCDataFormatterCF)
runCmd: settings set symbols.enable-external-lookup false
output: 

runCmd: settings set plugin.process.gdb-remote.packet-timeout 60
output: 

runCmd: settings set symbols.clang-modules-cache-path "/Users/buildslave/jenkins/workspace/lldb-cmake-matrix/lldb-build/tools/lldb/lldb-test-build.noindex/module-cache-lldb"
output: 

runCmd: settings set use-color false
output: 

FAIL: LLDB (/Users/buildslave/jenkins/workspace/lldb-cmake-matrix/clang_701_build/bin/clang-7-x86_64) :: test_coreframeworks_and_run_command_dwarf (TestDataFormatterObjCCF.ObjCDataFormatterCF)
UNSUPPORTED: LLDB (/Users/buildslave/jenkins/workspace/lldb-cmake-matrix/clang_701_build/bin/clang-7-x86_64) :: test_coreframeworks_and_run_command_dwo (TestDataFormatterObjCCF.ObjCDataFormatterCF) (test case does not fall in any category of interest for this run) 
UNSUPPORTED: LLDB (/Users/buildslave/jenkins/workspace/lldb-cmake-matrix/clang_701_build/bin/clang-7-x86_64) :: test_coreframeworks_and_run_command_gmodules (TestDataFormatterObjCCF.ObjCDataFormatterCF) (test case does not fall in any category of interest for this run) 
Restore dir to: /Users/buildslave/jenkins/workspace/lldb-cmake-matrix/lldb-build/tools/lldb/lit
======================================================================
FAIL: test_coreframeworks_and_run_command_dsym (TestDataFormatterObjCCF.ObjCDataFormatterCF)
   Test formatters for Core OSX frameworks.
----------------------------------------------------------------------
Traceback (most recent call last):
  File "/Users/buildslave/jenkins/workspace/lldb-cmake-matrix/llvm-project/lldb/packages/Python/lldbsuite/test/lldbtest.py", line 1748, in test_method
    return attrvalue(self)
  File "/Users/buildslave/jenkins/workspace/lldb-cmake-matrix/llvm-project/lldb/packages/Python/lldbsuite/test/functionalities/data-formatter/data-formatter-objc/TestDataFormatterObjCCF.py", line 24, in test_coreframeworks_and_run_command
    lldb.SBFileSpec('main.m', False))
  File "/Users/buildslave/jenkins/workspace/lldb-cmake-matrix/llvm-project/lldb/packages/Python/lldbsuite/test/lldbutil.py", line 837, in run_to_source_breakpoint
    %(bkpt_pattern, source_spec.GetFilename(), source_spec.GetDirectory()))
AssertionError: False is not True : No locations found for source breakpoint: "// Set break point at this line.", file: "main.m", dir: "None"
Config=x86_64-/Users/buildslave/jenkins/workspace/lldb-cmake-matrix/clang_701_build/bin/clang-7
======================================================================
FAIL: test_coreframeworks_and_run_command_dwarf (TestDataFormatterObjCCF.ObjCDataFormatterCF)
   Test formatters for Core OSX frameworks.
----------------------------------------------------------------------
Traceback (most recent call last):
  File "/Users/buildslave/jenkins/workspace/lldb-cmake-matrix/llvm-project/lldb/packages/Python/lldbsuite/test/lldbtest.py", line 1748, in test_method
    return attrvalue(self)
  File "/Users/buildslave/jenkins/workspace/lldb-cmake-matrix/llvm-project/lldb/packages/Python/lldbsuite/test/functionalities/data-formatter/data-formatter-objc/TestDataFormatterObjCCF.py", line 24, in test_coreframeworks_and_run_command
    lldb.SBFileSpec('main.m', False))
  File "/Users/buildslave/jenkins/workspace/lldb-cmake-matrix/llvm-project/lldb/packages/Python/lldbsuite/test/lldbutil.py", line 837, in run_to_source_breakpoint
    %(bkpt_pattern, source_spec.GetFilename(), source_spec.GetDirectory()))
AssertionError: False is not True : No locations found for source breakpoint: "// Set break point at this line.", file: "main.m", dir: "None"
Config=x86_64-/Users/buildslave/jenkins/workspace/lldb-cmake-matrix/clang_701_build/bin/clang-7
----------------------------------------------------------------------
Ran 4 tests in 6.415s

RESULT: FAILED (0 passes, 2 failures, 0 errors, 2 skipped, 0 expected failures, 0 unexpected successes)

********************
FAIL: lldb-Suite :: lang/cpp/this/TestCPPThis.py (1727 of 1736)
******************** TEST 'lldb-Suite :: lang/cpp/this/TestCPPThis.py' FAILED ********************
lldb version 10.0.99 (http://labmaster3.local/git/llvm-project.git revision 08f938bd1ae356544923042423ea3f30cd730bf8)
  clang revision 621c93ec1fd804f736cbcb58282ef037fa1a9c48
  llvm revision 621c93ec1fd804f736cbcb58282ef037fa1a9c48
LLDB library dir: /Users/buildslave/jenkins/workspace/lldb-cmake-matrix/lldb-build/bin
LLDB import library dir: /Users/buildslave/jenkins/workspace/lldb-cmake-matrix/lldb-build/bin
libstdcxx tests will not be run because: Don't know how to build with libstdcxx on macosx
Skipping following debug info categories: ['dwo']

Session logs for test failures/errors/unexpected successes will go into directory '/Users/buildslave/jenkins/workspace/lldb-cmake-matrix/test/logs'
Command invoked: /Users/buildslave/jenkins/workspace/lldb-cmake-matrix/llvm-project/lldb/test/dotest.py --arch=x86_64 -s /Users/buildslave/jenkins/workspace/lldb-cmake-matrix/lldb-build/lldb-test-traces -S nm -u CXXFLAGS -u CFLAGS --executable /Users/buildslave/jenkins/workspace/lldb-cmake-matrix/lldb-build/./bin/lldb --dsymutil /Users/buildslave/jenkins/workspace/lldb-cmake-matrix/lldb-build/./bin/dsymutil --filecheck /Users/buildslave/jenkins/workspace/lldb-cmake-matrix/lldb-build/./bin/FileCheck -C /Users/buildslave/jenkins/workspace/lldb-cmake-matrix/clang_701_build/bin/clang --codesign-identity lldb_codesign --server /Users/buildslave/jenkins/workspace/lldb-cmake-matrix/lldb-build/./bin/debugserver --arch x86_64 --build-dir /Users/buildslave/jenkins/workspace/lldb-cmake-matrix/lldb-build/lldb-test-build.noindex -s=/Users/buildslave/jenkins/workspace/lldb-cmake-matrix/test/logs -t --env TERM=vt100 --skip-category gmodules --skip-category watchpoint --arch=x86_64 --dwarf-version=5 --env LLVM_LIBS_DIR=/Users/buildslave/jenkins/workspace/lldb-cmake-matrix/lldb-build/./lib --build-dir /Users/buildslave/jenkins/workspace/lldb-cmake-matrix/lldb-build/tools/lldb/lldb-test-build.noindex --module-cache-dir /Users/buildslave/jenkins/workspace/lldb-cmake-matrix/lldb-build/tools/lldb/lldb-test-build.noindex/module-cache-lldb /Users/buildslave/jenkins/workspace/lldb-cmake-matrix/llvm-project/lldb/packages/Python/lldbsuite/test/lang/cpp/this -p TestCPPThis.py
Change dir to: /Users/buildslave/jenkins/workspace/lldb-cmake-matrix/llvm-project/lldb/packages/Python/lldbsuite/test/lang/cpp/this
runCmd: settings set symbols.enable-external-lookup false
output: 

runCmd: settings set plugin.process.gdb-remote.packet-timeout 60
output: 

runCmd: settings set symbols.clang-modules-cache-path "/Users/buildslave/jenkins/workspace/lldb-cmake-matrix/lldb-build/tools/lldb/lldb-test-build.noindex/module-cache-lldb"
output: 

runCmd: settings set use-color false
output: 

warning: (x86_64) /Users/buildslave/jenkins/workspace/lldb-cmake-matrix/lldb-build/tools/lldb/lldb-test-build.noindex/lang/cpp/this/TestCPPThis.test_with_run_command_dsym/a.out empty dSYM file detected, dSYM was created with an executable with no debug info.
runCmd: file /Users/buildslave/jenkins/workspace/lldb-cmake-matrix/lldb-build/tools/lldb/lldb-test-build.noindex/lang/cpp/this/TestCPPThis.test_with_run_command_dsym/a.out
output: Current executable set to '/Users/buildslave/jenkins/workspace/lldb-cmake-matrix/lldb-build/tools/lldb/lldb-test-build.noindex/lang/cpp/this/TestCPPThis.test_with_run_command_dsym/a.out' (x86_64).


runCmd: breakpoint set -f "main.cpp" -l 31
output: Breakpoint 1: no locations (pending).
WARNING:  Unable to resolve breakpoint to any actual locations.


Expecting pattern: ^Breakpoint (?P<bpno>[0-9]+): (?P<num_locations>[0-9]+) locations\.$
Not matched

Expecting pattern: ^Breakpoint (?P<bpno>[0-9]+): (?P<num_locations>no) locations \(pending\)\.
Matched

FAIL: LLDB (/Users/buildslave/jenkins/workspace/lldb-cmake-matrix/clang_701_build/bin/clang-7-x86_64) :: test_with_run_command_dsym (TestCPPThis.CPPThisTestCase)
runCmd: settings set symbols.enable-external-lookup false
output: 

runCmd: settings set plugin.process.gdb-remote.packet-timeout 60
output: 

runCmd: settings set symbols.clang-modules-cache-path "/Users/buildslave/jenkins/workspace/lldb-cmake-matrix/lldb-build/tools/lldb/lldb-test-build.noindex/module-cache-lldb"
output: 

runCmd: settings set use-color false
output: 

runCmd: file /Users/buildslave/jenkins/workspace/lldb-cmake-matrix/lldb-build/tools/lldb/lldb-test-build.noindex/lang/cpp/this/TestCPPThis.test_with_run_command_dwarf/a.out
output: Current executable set to '/Users/buildslave/jenkins/workspace/lldb-cmake-matrix/lldb-build/tools/lldb/lldb-test-build.noindex/lang/cpp/this/TestCPPThis.test_with_run_command_dwarf/a.out' (x86_64).


runCmd: breakpoint set -f "main.cpp" -l 31
output: Breakpoint 1: no locations (pending).
WARNING:  Unable to resolve breakpoint to any actual locations.


Expecting pattern: ^Breakpoint (?P<bpno>[0-9]+): (?P<num_locations>[0-9]+) locations\.$
Not matched

Expecting pattern: ^Breakpoint (?P<bpno>[0-9]+): (?P<num_locations>no) locations \(pending\)\.
Matched

FAIL: LLDB (/Users/buildslave/jenkins/workspace/lldb-cmake-matrix/clang_701_build/bin/clang-7-x86_64) :: test_with_run_command_dwarf (TestCPPThis.CPPThisTestCase)
UNSUPPORTED: LLDB (/Users/buildslave/jenkins/workspace/lldb-cmake-matrix/clang_701_build/bin/clang-7-x86_64) :: test_with_run_command_dwo (TestCPPThis.CPPThisTestCase) (test case does not fall in any category of interest for this run) 
UNSUPPORTED: LLDB (/Users/buildslave/jenkins/workspace/lldb-cmake-matrix/clang_701_build/bin/clang-7-x86_64) :: test_with_run_command_gmodules (TestCPPThis.CPPThisTestCase) (test case does not fall in any category of interest for this run) 
Restore dir to: /Users/buildslave/jenkins/workspace/lldb-cmake-matrix/lldb-build/tools/lldb/lit
======================================================================
FAIL: test_with_run_command_dsym (TestCPPThis.CPPThisTestCase)
   Test that the appropriate member variables are available when stopped in C++ static, inline, and const methods
----------------------------------------------------------------------
Traceback (most recent call last):
  File "/Users/buildslave/jenkins/workspace/lldb-cmake-matrix/llvm-project/lldb/packages/Python/lldbsuite/test/lldbtest.py", line 1748, in test_method
    return attrvalue(self)
  File "/Users/buildslave/jenkins/workspace/lldb-cmake-matrix/llvm-project/lldb/packages/Python/lldbsuite/test/decorators.py", line 111, in wrapper
    func(*args, **kwargs)
  File "/Users/buildslave/jenkins/workspace/lldb-cmake-matrix/llvm-project/lldb/packages/Python/lldbsuite/test/decorators.py", line 111, in wrapper
    func(*args, **kwargs)
  File "/Users/buildslave/jenkins/workspace/lldb-cmake-matrix/llvm-project/lldb/packages/Python/lldbsuite/test/decorators.py", line 111, in wrapper
    func(*args, **kwargs)
  File "/Users/buildslave/jenkins/workspace/lldb-cmake-matrix/llvm-project/lldb/packages/Python/lldbsuite/test/decorators.py", line 111, in wrapper
    func(*args, **kwargs)
  File "/Users/buildslave/jenkins/workspace/lldb-cmake-matrix/llvm-project/lldb/packages/Python/lldbsuite/test/lang/cpp/this/TestCPPThis.py", line 30, in test_with_run_command
    self.set_breakpoint(line_number('main.cpp', '// breakpoint 1'))
  File "/Users/buildslave/jenkins/workspace/lldb-cmake-matrix/llvm-project/lldb/packages/Python/lldbsuite/test/lang/cpp/this/TestCPPThis.py", line 61, in set_breakpoint
    self, "main.cpp", line, num_expected_locations=1, loc_exact=False)
  File "/Users/buildslave/jenkins/workspace/lldb-cmake-matrix/llvm-project/lldb/packages/Python/lldbsuite/test/lldbutil.py", line 388, in run_break_set_by_file_and_line
    num_locations=num_expected_locations)
  File "/Users/buildslave/jenkins/workspace/lldb-cmake-matrix/llvm-project/lldb/packages/Python/lldbsuite/test/lldbutil.py", line 584, in check_breakpoint_result
    out_num_locations))
AssertionError: False is not True : Expecting 1 locations, got 0.
Config=x86_64-/Users/buildslave/jenkins/workspace/lldb-cmake-matrix/clang_701_build/bin/clang-7
======================================================================
FAIL: test_with_run_command_dwarf (TestCPPThis.CPPThisTestCase)
   Test that the appropriate member variables are available when stopped in C++ static, inline, and const methods
----------------------------------------------------------------------
Traceback (most recent call last):
  File "/Users/buildslave/jenkins/workspace/lldb-cmake-matrix/llvm-project/lldb/packages/Python/lldbsuite/test/lldbtest.py", line 1748, in test_method
    return attrvalue(self)
  File "/Users/buildslave/jenkins/workspace/lldb-cmake-matrix/llvm-project/lldb/packages/Python/lldbsuite/test/decorators.py", line 111, in wrapper
    func(*args, **kwargs)
  File "/Users/buildslave/jenkins/workspace/lldb-cmake-matrix/llvm-project/lldb/packages/Python/lldbsuite/test/decorators.py", line 111, in wrapper
    func(*args, **kwargs)
  File "/Users/buildslave/jenkins/workspace/lldb-cmake-matrix/llvm-project/lldb/packages/Python/lldbsuite/test/decorators.py", line 111, in wrapper
    func(*args, **kwargs)
  File "/Users/buildslave/jenkins/workspace/lldb-cmake-matrix/llvm-project/lldb/packages/Python/lldbsuite/test/decorators.py", line 111, in wrapper
    func(*args, **kwargs)
  File "/Users/buildslave/jenkins/workspace/lldb-cmake-matrix/llvm-project/lldb/packages/Python/lldbsuite/test/lang/cpp/this/TestCPPThis.py", line 30, in test_with_run_command
    self.set_breakpoint(line_number('main.cpp', '// breakpoint 1'))
  File "/Users/buildslave/jenkins/workspace/lldb-cmake-matrix/llvm-project/lldb/packages/Python/lldbsuite/test/lang/cpp/this/TestCPPThis.py", line 61, in set_breakpoint
    self, "main.cpp", line, num_expected_locations=1, loc_exact=False)
  File "/Users/buildslave/jenkins/workspace/lldb-cmake-matrix/llvm-project/lldb/packages/Python/lldbsuite/test/lldbutil.py", line 388, in run_break_set_by_file_and_line
    num_locations=num_expected_locations)
  File "/Users/buildslave/jenkins/workspace/lldb-cmake-matrix/llvm-project/lldb/packages/Python/lldbsuite/test/lldbutil.py", line 584, in check_breakpoint_result
    out_num_locations))
AssertionError: False is not True : Expecting 1 locations, got 0.
Config=x86_64-/Users/buildslave/jenkins/workspace/lldb-cmake-matrix/clang_701_build/bin/clang-7
----------------------------------------------------------------------
Ran 4 tests in 0.810s

RESULT: FAILED (0 passes, 2 failures, 0 errors, 2 skipped, 0 expected failures, 0 unexpected successes)

********************
FAIL: lldb-Suite :: lang/cpp/dynamic-value/TestDynamicValue.py (1728 of 1736)
******************** TEST 'lldb-Suite :: lang/cpp/dynamic-value/TestDynamicValue.py' FAILED ********************
lldb version 10.0.99 (http://labmaster3.local/git/llvm-project.git revision 08f938bd1ae356544923042423ea3f30cd730bf8)
  clang revision 621c93ec1fd804f736cbcb58282ef037fa1a9c48
  llvm revision 621c93ec1fd804f736cbcb58282ef037fa1a9c48
LLDB library dir: /Users/buildslave/jenkins/workspace/lldb-cmake-matrix/lldb-build/bin
LLDB import library dir: /Users/buildslave/jenkins/workspace/lldb-cmake-matrix/lldb-build/bin
libstdcxx tests will not be run because: Don't know how to build with libstdcxx on macosx
Skipping following debug info categories: ['dwo']

Session logs for test failures/errors/unexpected successes will go into directory '/Users/buildslave/jenkins/workspace/lldb-cmake-matrix/test/logs'
Command invoked: /Users/buildslave/jenkins/workspace/lldb-cmake-matrix/llvm-project/lldb/test/dotest.py --arch=x86_64 -s /Users/buildslave/jenkins/workspace/lldb-cmake-matrix/lldb-build/lldb-test-traces -S nm -u CXXFLAGS -u CFLAGS --executable /Users/buildslave/jenkins/workspace/lldb-cmake-matrix/lldb-build/./bin/lldb --dsymutil /Users/buildslave/jenkins/workspace/lldb-cmake-matrix/lldb-build/./bin/dsymutil --filecheck /Users/buildslave/jenkins/workspace/lldb-cmake-matrix/lldb-build/./bin/FileCheck -C /Users/buildslave/jenkins/workspace/lldb-cmake-matrix/clang_701_build/bin/clang --codesign-identity lldb_codesign --server /Users/buildslave/jenkins/workspace/lldb-cmake-matrix/lldb-build/./bin/debugserver --arch x86_64 --build-dir /Users/buildslave/jenkins/workspace/lldb-cmake-matrix/lldb-build/lldb-test-build.noindex -s=/Users/buildslave/jenkins/workspace/lldb-cmake-matrix/test/logs -t --env TERM=vt100 --skip-category gmodules --skip-category watchpoint --arch=x86_64 --dwarf-version=5 --env LLVM_LIBS_DIR=/Users/buildslave/jenkins/workspace/lldb-cmake-matrix/lldb-build/./lib --build-dir /Users/buildslave/jenkins/workspace/lldb-cmake-matrix/lldb-build/tools/lldb/lldb-test-build.noindex --module-cache-dir /Users/buildslave/jenkins/workspace/lldb-cmake-matrix/lldb-build/tools/lldb/lldb-test-build.noindex/module-cache-lldb /Users/buildslave/jenkins/workspace/lldb-cmake-matrix/llvm-project/lldb/packages/Python/lldbsuite/test/lang/cpp/dynamic-value -p TestDynamicValue.py
Change dir to: /Users/buildslave/jenkins/workspace/lldb-cmake-matrix/llvm-project/lldb/packages/Python/lldbsuite/test/lang/cpp/dynamic-value
runCmd: settings set symbols.enable-external-lookup false
output: 

runCmd: settings set plugin.process.gdb-remote.packet-timeout 60
output: 

runCmd: settings set symbols.clang-modules-cache-path "/Users/buildslave/jenkins/workspace/lldb-cmake-matrix/lldb-build/tools/lldb/lldb-test-build.noindex/module-cache-lldb"
output: 

runCmd: settings set use-color false
output: 

warning: (x86_64) /Users/buildslave/jenkins/workspace/lldb-cmake-matrix/lldb-build/tools/lldb/lldb-test-build.noindex/lang/cpp/dynamic-value/TestDynamicValue.test_get_dynamic_vals_dsym/a.out empty dSYM file detected, dSYM was created with an executable with no debug info.
FAIL: LLDB (/Users/buildslave/jenkins/workspace/lldb-cmake-matrix/clang_701_build/bin/clang-7-x86_64) :: test_get_dynamic_vals_dsym (TestDynamicValue.DynamicValueTestCase)
<bound method SBProcess.Kill of <lldb.SBProcess; proxy of <Swig Object of type 'lldb::SBProcess *' at 0x107ed4f60> >>: success

runCmd: settings set symbols.enable-external-lookup false
output: 

runCmd: settings set plugin.process.gdb-remote.packet-timeout 60
output: 

runCmd: settings set symbols.clang-modules-cache-path "/Users/buildslave/jenkins/workspace/lldb-cmake-matrix/lldb-build/tools/lldb/lldb-test-build.noindex/module-cache-lldb"
output: 

runCmd: settings set use-color false
output: 

FAIL: LLDB (/Users/buildslave/jenkins/workspace/lldb-cmake-matrix/clang_701_build/bin/clang-7-x86_64) :: test_get_dynamic_vals_dwarf (TestDynamicValue.DynamicValueTestCase)
<bound method SBProcess.Kill of <lldb.SBProcess; proxy of <Swig Object of type 'lldb::SBProcess *' at 0x107ed4e10> >>: success

UNSUPPORTED: LLDB (/Users/buildslave/jenkins/workspace/lldb-cmake-matrix/clang_701_build/bin/clang-7-x86_64) :: test_get_dynamic_vals_dwo (TestDynamicValue.DynamicValueTestCase) (test case does not fall in any category of interest for this run) 
UNSUPPORTED: LLDB (/Users/buildslave/jenkins/workspace/lldb-cmake-matrix/clang_701_build/bin/clang-7-x86_64) :: test_get_dynamic_vals_gmodules (TestDynamicValue.DynamicValueTestCase) (test case does not fall in any category of interest for this run) 
Restore dir to: /Users/buildslave/jenkins/workspace/lldb-cmake-matrix/lldb-build/tools/lldb/lit
======================================================================
FAIL: test_get_dynamic_vals_dsym (TestDynamicValue.DynamicValueTestCase)
   Test fetching C++ dynamic values from pointers & references.
----------------------------------------------------------------------
Traceback (most recent call last):
  File "/Users/buildslave/jenkins/workspace/lldb-cmake-matrix/llvm-project/lldb/packages/Python/lldbsuite/test/lldbtest.py", line 1748, in test_method
    return attrvalue(self)
  File "/Users/buildslave/jenkins/workspace/lldb-cmake-matrix/llvm-project/lldb/packages/Python/lldbsuite/test/decorators.py", line 111, in wrapper
    func(*args, **kwargs)
  File "/Users/buildslave/jenkins/workspace/lldb-cmake-matrix/llvm-project/lldb/packages/Python/lldbsuite/test/lang/cpp/dynamic-value/TestDynamicValue.py", line 66, in test_get_dynamic_vals
    PROCESS_STOPPED)
AssertionError: False is not True : Process status should be stopped
Config=x86_64-/Users/buildslave/jenkins/workspace/lldb-cmake-matrix/clang_701_build/bin/clang-7
======================================================================
FAIL: test_get_dynamic_vals_dwarf (TestDynamicValue.DynamicValueTestCase)
   Test fetching C++ dynamic values from pointers & references.
----------------------------------------------------------------------
Traceback (most recent call last):
  File "/Users/buildslave/jenkins/workspace/lldb-cmake-matrix/llvm-project/lldb/packages/Python/lldbsuite/test/lldbtest.py", line 1748, in test_method
    return attrvalue(self)
  File "/Users/buildslave/jenkins/workspace/lldb-cmake-matrix/llvm-project/lldb/packages/Python/lldbsuite/test/decorators.py", line 111, in wrapper
    func(*args, **kwargs)
  File "/Users/buildslave/jenkins/workspace/lldb-cmake-matrix/llvm-project/lldb/packages/Python/lldbsuite/test/lang/cpp/dynamic-value/TestDynamicValue.py", line 66, in test_get_dynamic_vals
    PROCESS_STOPPED)
AssertionError: False is not True : Process status should be stopped
Config=x86_64-/Users/buildslave/jenkins/workspace/lldb-cmake-matrix/clang_701_build/bin/clang-7
----------------------------------------------------------------------
Ran 4 tests in 2.168s

RESULT: FAILED (0 passes, 2 failures, 0 errors, 2 skipped, 0 expected failures, 0 unexpected successes)

********************
FAIL: lldb-Suite :: functionalities/data-formatter/compactvectors/TestCompactVectors.py (1729 of 1736)
******************** TEST 'lldb-Suite :: functionalities/data-formatter/compactvectors/TestCompactVectors.py' FAILED ********************
lldb version 10.0.99 (http://labmaster3.local/git/llvm-project.git revision 08f938bd1ae356544923042423ea3f30cd730bf8)
  clang revision 621c93ec1fd804f736cbcb58282ef037fa1a9c48
  llvm revision 621c93ec1fd804f736cbcb58282ef037fa1a9c48
LLDB library dir: /Users/buildslave/jenkins/workspace/lldb-cmake-matrix/lldb-build/bin
LLDB import library dir: /Users/buildslave/jenkins/workspace/lldb-cmake-matrix/lldb-build/bin
libstdcxx tests will not be run because: Don't know how to build with libstdcxx on macosx
Skipping following debug info categories: ['dwo']

Session logs for test failures/errors/unexpected successes will go into directory '/Users/buildslave/jenkins/workspace/lldb-cmake-matrix/test/logs'
Command invoked: /Users/buildslave/jenkins/workspace/lldb-cmake-matrix/llvm-project/lldb/test/dotest.py --arch=x86_64 -s /Users/buildslave/jenkins/workspace/lldb-cmake-matrix/lldb-build/lldb-test-traces -S nm -u CXXFLAGS -u CFLAGS --executable /Users/buildslave/jenkins/workspace/lldb-cmake-matrix/lldb-build/./bin/lldb --dsymutil /Users/buildslave/jenkins/workspace/lldb-cmake-matrix/lldb-build/./bin/dsymutil --filecheck /Users/buildslave/jenkins/workspace/lldb-cmake-matrix/lldb-build/./bin/FileCheck -C /Users/buildslave/jenkins/workspace/lldb-cmake-matrix/clang_701_build/bin/clang --codesign-identity lldb_codesign --server /Users/buildslave/jenkins/workspace/lldb-cmake-matrix/lldb-build/./bin/debugserver --arch x86_64 --build-dir /Users/buildslave/jenkins/workspace/lldb-cmake-matrix/lldb-build/lldb-test-build.noindex -s=/Users/buildslave/jenkins/workspace/lldb-cmake-matrix/test/logs -t --env TERM=vt100 --skip-category gmodules --skip-category watchpoint --arch=x86_64 --dwarf-version=5 --env LLVM_LIBS_DIR=/Users/buildslave/jenkins/workspace/lldb-cmake-matrix/lldb-build/./lib --build-dir /Users/buildslave/jenkins/workspace/lldb-cmake-matrix/lldb-build/tools/lldb/lldb-test-build.noindex --module-cache-dir /Users/buildslave/jenkins/workspace/lldb-cmake-matrix/lldb-build/tools/lldb/lldb-test-build.noindex/module-cache-lldb /Users/buildslave/jenkins/workspace/lldb-cmake-matrix/llvm-project/lldb/packages/Python/lldbsuite/test/functionalities/data-formatter/compactvectors -p TestCompactVectors.py
Change dir to: /Users/buildslave/jenkins/workspace/lldb-cmake-matrix/llvm-project/lldb/packages/Python/lldbsuite/test/functionalities/data-formatter/compactvectors
runCmd: settings set symbols.enable-external-lookup false
output: 

runCmd: settings set plugin.process.gdb-remote.packet-timeout 60
output: 

runCmd: settings set symbols.clang-modules-cache-path "/Users/buildslave/jenkins/workspace/lldb-cmake-matrix/lldb-build/tools/lldb/lldb-test-build.noindex/module-cache-lldb"
output: 

runCmd: settings set use-color false
output: 

warning: (x86_64) /Users/buildslave/jenkins/workspace/lldb-cmake-matrix/lldb-build/tools/lldb/lldb-test-build.noindex/functionalities/data-formatter/compactvectors/TestCompactVectors.test_with_run_command_dsym/a.out empty dSYM file detected, dSYM was created with an executable with no debug info.
runCmd: file /Users/buildslave/jenkins/workspace/lldb-cmake-matrix/lldb-build/tools/lldb/lldb-test-build.noindex/functionalities/data-formatter/compactvectors/TestCompactVectors.test_with_run_command_dsym/a.out
output: Current executable set to '/Users/buildslave/jenkins/workspace/lldb-cmake-matrix/lldb-build/tools/lldb/lldb-test-build.noindex/functionalities/data-formatter/compactvectors/TestCompactVectors.test_with_run_command_dsym/a.out' (x86_64).


runCmd: breakpoint set -f "main.cpp" -l 24
output: Breakpoint 1: no locations (pending).
WARNING:  Unable to resolve breakpoint to any actual locations.


Expecting pattern: ^Breakpoint (?P<bpno>[0-9]+): (?P<num_locations>[0-9]+) locations\.$
Not matched

Expecting pattern: ^Breakpoint (?P<bpno>[0-9]+): (?P<num_locations>no) locations \(pending\)\.
Matched

FAIL: LLDB (/Users/buildslave/jenkins/workspace/lldb-cmake-matrix/clang_701_build/bin/clang-7-x86_64) :: test_with_run_command_dsym (TestCompactVectors.CompactVectorsFormattingTestCase)
runCmd: settings set symbols.enable-external-lookup false
output: 

runCmd: settings set plugin.process.gdb-remote.packet-timeout 60
output: 

runCmd: settings set symbols.clang-modules-cache-path "/Users/buildslave/jenkins/workspace/lldb-cmake-matrix/lldb-build/tools/lldb/lldb-test-build.noindex/module-cache-lldb"
output: 

runCmd: settings set use-color false
output: 

runCmd: file /Users/buildslave/jenkins/workspace/lldb-cmake-matrix/lldb-build/tools/lldb/lldb-test-build.noindex/functionalities/data-formatter/compactvectors/TestCompactVectors.test_with_run_command_dwarf/a.out
output: Current executable set to '/Users/buildslave/jenkins/workspace/lldb-cmake-matrix/lldb-build/tools/lldb/lldb-test-build.noindex/functionalities/data-formatter/compactvectors/TestCompactVectors.test_with_run_command_dwarf/a.out' (x86_64).


runCmd: breakpoint set -f "main.cpp" -l 24
output: Breakpoint 1: no locations (pending).
WARNING:  Unable to resolve breakpoint to any actual locations.


Expecting pattern: ^Breakpoint (?P<bpno>[0-9]+): (?P<num_locations>[0-9]+) locations\.$
Not matched

Expecting pattern: ^Breakpoint (?P<bpno>[0-9]+): (?P<num_locations>no) locations \(pending\)\.
Matched

FAIL: LLDB (/Users/buildslave/jenkins/workspace/lldb-cmake-matrix/clang_701_build/bin/clang-7-x86_64) :: test_with_run_command_dwarf (TestCompactVectors.CompactVectorsFormattingTestCase)
UNSUPPORTED: LLDB (/Users/buildslave/jenkins/workspace/lldb-cmake-matrix/clang_701_build/bin/clang-7-x86_64) :: test_with_run_command_dwo (TestCompactVectors.CompactVectorsFormattingTestCase) (test case does not fall in any category of interest for this run) 
UNSUPPORTED: LLDB (/Users/buildslave/jenkins/workspace/lldb-cmake-matrix/clang_701_build/bin/clang-7-x86_64) :: test_with_run_command_gmodules (TestCompactVectors.CompactVectorsFormattingTestCase) (test case does not fall in any category of interest for this run) 
Restore dir to: /Users/buildslave/jenkins/workspace/lldb-cmake-matrix/lldb-build/tools/lldb/lit
======================================================================
FAIL: test_with_run_command_dsym (TestCompactVectors.CompactVectorsFormattingTestCase)
   Test that that file and class static variables display correctly.
----------------------------------------------------------------------
Traceback (most recent call last):
  File "/Users/buildslave/jenkins/workspace/lldb-cmake-matrix/llvm-project/lldb/packages/Python/lldbsuite/test/lldbtest.py", line 1748, in test_method
    return attrvalue(self)
  File "/Users/buildslave/jenkins/workspace/lldb-cmake-matrix/llvm-project/lldb/packages/Python/lldbsuite/test/functionalities/data-formatter/compactvectors/TestCompactVectors.py", line 31, in test_with_run_command
    self, "main.cpp", self.line, num_expected_locations=1, loc_exact=True)
  File "/Users/buildslave/jenkins/workspace/lldb-cmake-matrix/llvm-project/lldb/packages/Python/lldbsuite/test/lldbutil.py", line 383, in run_break_set_by_file_and_line
    module_name=module_name)
  File "/Users/buildslave/jenkins/workspace/lldb-cmake-matrix/llvm-project/lldb/packages/Python/lldbsuite/test/lldbutil.py", line 584, in check_breakpoint_result
    out_num_locations))
AssertionError: False is not True : Expecting 1 locations, got 0.
Config=x86_64-/Users/buildslave/jenkins/workspace/lldb-cmake-matrix/clang_701_build/bin/clang-7
======================================================================
FAIL: test_with_run_command_dwarf (TestCompactVectors.CompactVectorsFormattingTestCase)
   Test that that file and class static variables display correctly.
----------------------------------------------------------------------
Traceback (most recent call last):
  File "/Users/buildslave/jenkins/workspace/lldb-cmake-matrix/llvm-project/lldb/packages/Python/lldbsuite/test/lldbtest.py", line 1748, in test_method
    return attrvalue(self)
  File "/Users/buildslave/jenkins/workspace/lldb-cmake-matrix/llvm-project/lldb/packages/Python/lldbsuite/test/functionalities/data-formatter/compactvectors/TestCompactVectors.py", line 31, in test_with_run_command
    self, "main.cpp", self.line, num_expected_locations=1, loc_exact=True)
  File "/Users/buildslave/jenkins/workspace/lldb-cmake-matrix/llvm-project/lldb/packages/Python/lldbsuite/test/lldbutil.py", line 383, in run_break_set_by_file_and_line
    module_name=module_name)
  File "/Users/buildslave/jenkins/workspace/lldb-cmake-matrix/llvm-project/lldb/packages/Python/lldbsuite/test/lldbutil.py", line 584, in check_breakpoint_result
    out_num_locations))
AssertionError: False is not True : Expecting 1 locations, got 0.
Config=x86_64-/Users/buildslave/jenkins/workspace/lldb-cmake-matrix/clang_701_build/bin/clang-7
----------------------------------------------------------------------
Ran 4 tests in 9.259s

RESULT: FAILED (0 passes, 2 failures, 0 errors, 2 skipped, 0 expected failures, 0 unexpected successes)

********************
FAIL: lldb-Suite :: lang/cpp/namespace/TestNamespace.py (1730 of 1736)
******************** TEST 'lldb-Suite :: lang/cpp/namespace/TestNamespace.py' FAILED ********************
lldb version 10.0.99 (http://labmaster3.local/git/llvm-project.git revision 08f938bd1ae356544923042423ea3f30cd730bf8)
  clang revision 621c93ec1fd804f736cbcb58282ef037fa1a9c48
  llvm revision 621c93ec1fd804f736cbcb58282ef037fa1a9c48
LLDB library dir: /Users/buildslave/jenkins/workspace/lldb-cmake-matrix/lldb-build/bin
LLDB import library dir: /Users/buildslave/jenkins/workspace/lldb-cmake-matrix/lldb-build/bin
libstdcxx tests will not be run because: Don't know how to build with libstdcxx on macosx
Skipping following debug info categories: ['dwo']

Session logs for test failures/errors/unexpected successes will go into directory '/Users/buildslave/jenkins/workspace/lldb-cmake-matrix/test/logs'
Command invoked: /Users/buildslave/jenkins/workspace/lldb-cmake-matrix/llvm-project/lldb/test/dotest.py --arch=x86_64 -s /Users/buildslave/jenkins/workspace/lldb-cmake-matrix/lldb-build/lldb-test-traces -S nm -u CXXFLAGS -u CFLAGS --executable /Users/buildslave/jenkins/workspace/lldb-cmake-matrix/lldb-build/./bin/lldb --dsymutil /Users/buildslave/jenkins/workspace/lldb-cmake-matrix/lldb-build/./bin/dsymutil --filecheck /Users/buildslave/jenkins/workspace/lldb-cmake-matrix/lldb-build/./bin/FileCheck -C /Users/buildslave/jenkins/workspace/lldb-cmake-matrix/clang_701_build/bin/clang --codesign-identity lldb_codesign --server /Users/buildslave/jenkins/workspace/lldb-cmake-matrix/lldb-build/./bin/debugserver --arch x86_64 --build-dir /Users/buildslave/jenkins/workspace/lldb-cmake-matrix/lldb-build/lldb-test-build.noindex -s=/Users/buildslave/jenkins/workspace/lldb-cmake-matrix/test/logs -t --env TERM=vt100 --skip-category gmodules --skip-category watchpoint --arch=x86_64 --dwarf-version=5 --env LLVM_LIBS_DIR=/Users/buildslave/jenkins/workspace/lldb-cmake-matrix/lldb-build/./lib --build-dir /Users/buildslave/jenkins/workspace/lldb-cmake-matrix/lldb-build/tools/lldb/lldb-test-build.noindex --module-cache-dir /Users/buildslave/jenkins/workspace/lldb-cmake-matrix/lldb-build/tools/lldb/lldb-test-build.noindex/module-cache-lldb /Users/buildslave/jenkins/workspace/lldb-cmake-matrix/llvm-project/lldb/packages/Python/lldbsuite/test/lang/cpp/namespace -p TestNamespace.py
Change dir to: /Users/buildslave/jenkins/workspace/lldb-cmake-matrix/llvm-project/lldb/packages/Python/lldbsuite/test/lang/cpp/namespace
runCmd: settings set symbols.enable-external-lookup false
output: 

runCmd: settings set plugin.process.gdb-remote.packet-timeout 60
output: 

runCmd: settings set symbols.clang-modules-cache-path "/Users/buildslave/jenkins/workspace/lldb-cmake-matrix/lldb-build/tools/lldb/lldb-test-build.noindex/module-cache-lldb"
output: 

runCmd: settings set use-color false
output: 

warning: (x86_64) /Users/buildslave/jenkins/workspace/lldb-cmake-matrix/lldb-build/tools/lldb/lldb-test-build.noindex/lang/cpp/namespace/TestNamespace.test_breakpoints_a_func_full_dsym/a.out empty dSYM file detected, dSYM was created with an executable with no debug info.
PASS: LLDB (/Users/buildslave/jenkins/workspace/lldb-cmake-matrix/clang_701_build/bin/clang-7-x86_64) :: test_breakpoints_a_func_full_dsym (TestNamespace.NamespaceBreakpointTestCase)
runCmd: settings set symbols.enable-external-lookup false
output: 

runCmd: settings set plugin.process.gdb-remote.packet-timeout 60
output: 

runCmd: settings set symbols.clang-modules-cache-path "/Users/buildslave/jenkins/workspace/lldb-cmake-matrix/lldb-build/tools/lldb/lldb-test-build.noindex/module-cache-lldb"
output: 

runCmd: settings set use-color false
output: 

PASS: LLDB (/Users/buildslave/jenkins/workspace/lldb-cmake-matrix/clang_701_build/bin/clang-7-x86_64) :: test_breakpoints_a_func_full_dwarf (TestNamespace.NamespaceBreakpointTestCase)
UNSUPPORTED: LLDB (/Users/buildslave/jenkins/workspace/lldb-cmake-matrix/clang_701_build/bin/clang-7-x86_64) :: test_breakpoints_a_func_full_dwo (TestNamespace.NamespaceBreakpointTestCase) (test case does not fall in any category of interest for this run) 
UNSUPPORTED: LLDB (/Users/buildslave/jenkins/workspace/lldb-cmake-matrix/clang_701_build/bin/clang-7-x86_64) :: test_breakpoints_a_func_full_gmodules (TestNamespace.NamespaceBreakpointTestCase) (test case does not fall in any category of interest for this run) 
runCmd: settings set symbols.enable-external-lookup false
output: 

runCmd: settings set plugin.process.gdb-remote.packet-timeout 60
output: 

runCmd: settings set symbols.clang-modules-cache-path "/Users/buildslave/jenkins/workspace/lldb-cmake-matrix/lldb-build/tools/lldb/lldb-test-build.noindex/module-cache-lldb"
output: 

runCmd: settings set use-color false
output: 

warning: (x86_64) /Users/buildslave/jenkins/workspace/lldb-cmake-matrix/lldb-build/tools/lldb/lldb-test-build.noindex/lang/cpp/namespace/TestNamespace.test_breakpoints_func_auto_dsym/a.out empty dSYM file detected, dSYM was created with an executable with no debug info.
FAIL: LLDB (/Users/buildslave/jenkins/workspace/lldb-cmake-matrix/clang_701_build/bin/clang-7-x86_64) :: test_breakpoints_func_auto_dsym (TestNamespace.NamespaceBreakpointTestCase)
runCmd: settings set symbols.enable-external-lookup false
output: 

runCmd: settings set plugin.process.gdb-remote.packet-timeout 60
output: 

runCmd: settings set symbols.clang-modules-cache-path "/Users/buildslave/jenkins/workspace/lldb-cmake-matrix/lldb-build/tools/lldb/lldb-test-build.noindex/module-cache-lldb"
output: 

runCmd: settings set use-color false
output: 

FAIL: LLDB (/Users/buildslave/jenkins/workspace/lldb-cmake-matrix/clang_701_build/bin/clang-7-x86_64) :: test_breakpoints_func_auto_dwarf (TestNamespace.NamespaceBreakpointTestCase)
UNSUPPORTED: LLDB (/Users/buildslave/jenkins/workspace/lldb-cmake-matrix/clang_701_build/bin/clang-7-x86_64) :: test_breakpoints_func_auto_dwo (TestNamespace.NamespaceBreakpointTestCase) (test case does not fall in any category of interest for this run) 
UNSUPPORTED: LLDB (/Users/buildslave/jenkins/workspace/lldb-cmake-matrix/clang_701_build/bin/clang-7-x86_64) :: test_breakpoints_func_auto_gmodules (TestNamespace.NamespaceBreakpointTestCase) (test case does not fall in any category of interest for this run) 
runCmd: settings set symbols.enable-external-lookup false
output: 

runCmd: settings set plugin.process.gdb-remote.packet-timeout 60
output: 

runCmd: settings set symbols.clang-modules-cache-path "/Users/buildslave/jenkins/workspace/lldb-cmake-matrix/lldb-build/tools/lldb/lldb-test-build.noindex/module-cache-lldb"
output: 

runCmd: settings set use-color false
output: 

warning: (x86_64) /Users/buildslave/jenkins/workspace/lldb-cmake-matrix/lldb-build/tools/lldb/lldb-test-build.noindex/lang/cpp/namespace/TestNamespace.test_breakpoints_func_full_dsym/a.out empty dSYM file detected, dSYM was created with an executable with no debug info.
FAIL: LLDB (/Users/buildslave/jenkins/workspace/lldb-cmake-matrix/clang_701_build/bin/clang-7-x86_64) :: test_breakpoints_func_full_dsym (TestNamespace.NamespaceBreakpointTestCase)
runCmd: settings set symbols.enable-external-lookup false
output: 

runCmd: settings set plugin.process.gdb-remote.packet-timeout 60
output: 

runCmd: settings set symbols.clang-modules-cache-path "/Users/buildslave/jenkins/workspace/lldb-cmake-matrix/lldb-build/tools/lldb/lldb-test-build.noindex/module-cache-lldb"
output: 

runCmd: settings set use-color false
output: 

FAIL: LLDB (/Users/buildslave/jenkins/workspace/lldb-cmake-matrix/clang_701_build/bin/clang-7-x86_64) :: test_breakpoints_func_full_dwarf (TestNamespace.NamespaceBreakpointTestCase)
UNSUPPORTED: LLDB (/Users/buildslave/jenkins/workspace/lldb-cmake-matrix/clang_701_build/bin/clang-7-x86_64) :: test_breakpoints_func_full_dwo (TestNamespace.NamespaceBreakpointTestCase) (test case does not fall in any category of interest for this run) 
UNSUPPORTED: LLDB (/Users/buildslave/jenkins/workspace/lldb-cmake-matrix/clang_701_build/bin/clang-7-x86_64) :: test_breakpoints_func_full_gmodules (TestNamespace.NamespaceBreakpointTestCase) (test case does not fall in any category of interest for this run) 
Restore dir to: /Users/buildslave/jenkins/workspace/lldb-cmake-matrix/lldb-build/tools/lldb/lit
Change dir to: /Users/buildslave/jenkins/workspace/lldb-cmake-matrix/llvm-project/lldb/packages/Python/lldbsuite/test/lang/cpp/namespace
runCmd: settings set symbols.enable-external-lookup false
output: 

runCmd: settings set plugin.process.gdb-remote.packet-timeout 60
output: 

runCmd: settings set symbols.clang-modules-cache-path "/Users/buildslave/jenkins/workspace/lldb-cmake-matrix/lldb-build/tools/lldb/lldb-test-build.noindex/module-cache-lldb"
output: 

runCmd: settings set use-color false
output: 

warning: (x86_64) /Users/buildslave/jenkins/workspace/lldb-cmake-matrix/lldb-build/tools/lldb/lldb-test-build.noindex/lang/cpp/namespace/TestNamespace.test_with_run_command_dsym/a.out empty dSYM file detected, dSYM was created with an executable with no debug info.
runCmd: file /Users/buildslave/jenkins/workspace/lldb-cmake-matrix/lldb-build/tools/lldb/lldb-test-build.noindex/lang/cpp/namespace/TestNamespace.test_with_run_command_dsym/a.out
output: Current executable set to '/Users/buildslave/jenkins/workspace/lldb-cmake-matrix/lldb-build/tools/lldb/lldb-test-build.noindex/lang/cpp/namespace/TestNamespace.test_with_run_command_dsym/a.out' (x86_64).


runCmd: breakpoint set -f "main.cpp" -l 87
output: Breakpoint 1: no locations (pending).
WARNING:  Unable to resolve breakpoint to any actual locations.


Expecting pattern: ^Breakpoint (?P<bpno>[0-9]+): (?P<num_locations>[0-9]+) locations\.$
Not matched

Expecting pattern: ^Breakpoint (?P<bpno>[0-9]+): (?P<num_locations>no) locations \(pending\)\.
Matched

FAIL: LLDB (/Users/buildslave/jenkins/workspace/lldb-cmake-matrix/clang_701_build/bin/clang-7-x86_64) :: test_with_run_command_dsym (TestNamespace.NamespaceTestCase)
runCmd: settings set symbols.enable-external-lookup false
output: 

runCmd: settings set plugin.process.gdb-remote.packet-timeout 60
output: 

runCmd: settings set symbols.clang-modules-cache-path "/Users/buildslave/jenkins/workspace/lldb-cmake-matrix/lldb-build/tools/lldb/lldb-test-build.noindex/module-cache-lldb"
output: 

runCmd: settings set use-color false
output: 

runCmd: file /Users/buildslave/jenkins/workspace/lldb-cmake-matrix/lldb-build/tools/lldb/lldb-test-build.noindex/lang/cpp/namespace/TestNamespace.test_with_run_command_dwarf/a.out
output: Current executable set to '/Users/buildslave/jenkins/workspace/lldb-cmake-matrix/lldb-build/tools/lldb/lldb-test-build.noindex/lang/cpp/namespace/TestNamespace.test_with_run_command_dwarf/a.out' (x86_64).


runCmd: breakpoint set -f "main.cpp" -l 87
output: Breakpoint 1: no locations (pending).
WARNING:  Unable to resolve breakpoint to any actual locations.


Expecting pattern: ^Breakpoint (?P<bpno>[0-9]+): (?P<num_locations>[0-9]+) locations\.$
Not matched

Expecting pattern: ^Breakpoint (?P<bpno>[0-9]+): (?P<num_locations>no) locations \(pending\)\.
Matched

FAIL: LLDB (/Users/buildslave/jenkins/workspace/lldb-cmake-matrix/clang_701_build/bin/clang-7-x86_64) :: test_with_run_command_dwarf (TestNamespace.NamespaceTestCase)
UNSUPPORTED: LLDB (/Users/buildslave/jenkins/workspace/lldb-cmake-matrix/clang_701_build/bin/clang-7-x86_64) :: test_with_run_command_dwo (TestNamespace.NamespaceTestCase) (test case does not fall in any category of interest for this run) 
UNSUPPORTED: LLDB (/Users/buildslave/jenkins/workspace/lldb-cmake-matrix/clang_701_build/bin/clang-7-x86_64) :: test_with_run_command_gmodules (TestNamespace.NamespaceTestCase) (test case does not fall in any category of interest for this run) 
Restore dir to: /Users/buildslave/jenkins/workspace/lldb-cmake-matrix/lldb-build/tools/lldb/lit
======================================================================
FAIL: test_breakpoints_func_auto_dsym (TestNamespace.NamespaceBreakpointTestCase)
    Test that we can set breakpoints correctly by basename to find all functions whose basename is "func".
----------------------------------------------------------------------
Traceback (most recent call last):
  File "/Users/buildslave/jenkins/workspace/lldb-cmake-matrix/llvm-project/lldb/packages/Python/lldbsuite/test/lldbtest.py", line 1748, in test_method
    return attrvalue(self)
  File "/Users/buildslave/jenkins/workspace/lldb-cmake-matrix/llvm-project/lldb/packages/Python/lldbsuite/test/decorators.py", line 111, in wrapper
    func(*args, **kwargs)
  File "/Users/buildslave/jenkins/workspace/lldb-cmake-matrix/llvm-project/lldb/packages/Python/lldbsuite/test/decorators.py", line 111, in wrapper
    func(*args, **kwargs)
  File "/Users/buildslave/jenkins/workspace/lldb-cmake-matrix/llvm-project/lldb/packages/Python/lldbsuite/test/lang/cpp/namespace/TestNamespace.py", line 46, in test_breakpoints_func_auto
    "make sure breakpoint locations are correct for 'func' with eFunctionNameTypeAuto")
AssertionError: False is not True : make sure breakpoint locations are correct for 'func' with eFunctionNameTypeAuto
Config=x86_64-/Users/buildslave/jenkins/workspace/lldb-cmake-matrix/clang_701_build/bin/clang-7
======================================================================
FAIL: test_breakpoints_func_auto_dwarf (TestNamespace.NamespaceBreakpointTestCase)
    Test that we can set breakpoints correctly by basename to find all functions whose basename is "func".
----------------------------------------------------------------------
Traceback (most recent call last):
  File "/Users/buildslave/jenkins/workspace/lldb-cmake-matrix/llvm-project/lldb/packages/Python/lldbsuite/test/lldbtest.py", line 1748, in test_method
    return attrvalue(self)
  File "/Users/buildslave/jenkins/workspace/lldb-cmake-matrix/llvm-project/lldb/packages/Python/lldbsuite/test/decorators.py", line 111, in wrapper
    func(*args, **kwargs)
  File "/Users/buildslave/jenkins/workspace/lldb-cmake-matrix/llvm-project/lldb/packages/Python/lldbsuite/test/decorators.py", line 111, in wrapper
    func(*args, **kwargs)
  File "/Users/buildslave/jenkins/workspace/lldb-cmake-matrix/llvm-project/lldb/packages/Python/lldbsuite/test/lang/cpp/namespace/TestNamespace.py", line 46, in test_breakpoints_func_auto
    "make sure breakpoint locations are correct for 'func' with eFunctionNameTypeAuto")
AssertionError: False is not True : make sure breakpoint locations are correct for 'func' with eFunctionNameTypeAuto
Config=x86_64-/Users/buildslave/jenkins/workspace/lldb-cmake-matrix/clang_701_build/bin/clang-7
======================================================================
FAIL: test_breakpoints_func_full_dsym (TestNamespace.NamespaceBreakpointTestCase)
    Test that we can set breakpoints correctly by fullname to find all functions whose fully qualified name is "func"
----------------------------------------------------------------------
Traceback (most recent call last):
  File "/Users/buildslave/jenkins/workspace/lldb-cmake-matrix/llvm-project/lldb/packages/Python/lldbsuite/test/lldbtest.py", line 1748, in test_method
    return attrvalue(self)
  File "/Users/buildslave/jenkins/workspace/lldb-cmake-matrix/llvm-project/lldb/packages/Python/lldbsuite/test/decorators.py", line 111, in wrapper
    func(*args, **kwargs)
  File "/Users/buildslave/jenkins/workspace/lldb-cmake-matrix/llvm-project/lldb/packages/Python/lldbsuite/test/decorators.py", line 111, in wrapper
    func(*args, **kwargs)
  File "/Users/buildslave/jenkins/workspace/lldb-cmake-matrix/llvm-project/lldb/packages/Python/lldbsuite/test/lang/cpp/namespace/TestNamespace.py", line 74, in test_breakpoints_func_full
    "make sure breakpoint locations are correct for 'func' with eFunctionNameTypeFull")
AssertionError: False is not True : make sure breakpoint locations are correct for 'func' with eFunctionNameTypeFull
Config=x86_64-/Users/buildslave/jenkins/workspace/lldb-cmake-matrix/clang_701_build/bin/clang-7
======================================================================
FAIL: test_breakpoints_func_full_dwarf (TestNamespace.NamespaceBreakpointTestCase)
    Test that we can set breakpoints correctly by fullname to find all functions whose fully qualified name is "func"
----------------------------------------------------------------------
Traceback (most recent call last):
  File "/Users/buildslave/jenkins/workspace/lldb-cmake-matrix/llvm-project/lldb/packages/Python/lldbsuite/test/lldbtest.py", line 1748, in test_method
    return attrvalue(self)
  File "/Users/buildslave/jenkins/workspace/lldb-cmake-matrix/llvm-project/lldb/packages/Python/lldbsuite/test/decorators.py", line 111, in wrapper
    func(*args, **kwargs)
  File "/Users/buildslave/jenkins/workspace/lldb-cmake-matrix/llvm-project/lldb/packages/Python/lldbsuite/test/decorators.py", line 111, in wrapper
    func(*args, **kwargs)
  File "/Users/buildslave/jenkins/workspace/lldb-cmake-matrix/llvm-project/lldb/packages/Python/lldbsuite/test/lang/cpp/namespace/TestNamespace.py", line 74, in test_breakpoints_func_full
    "make sure breakpoint locations are correct for 'func' with eFunctionNameTypeFull")
AssertionError: False is not True : make sure breakpoint locations are correct for 'func' with eFunctionNameTypeFull
Config=x86_64-/Users/buildslave/jenkins/workspace/lldb-cmake-matrix/clang_701_build/bin/clang-7
======================================================================
FAIL: test_with_run_command_dsym (TestNamespace.NamespaceTestCase)
    Test that anonymous and named namespace variables display correctly.
----------------------------------------------------------------------
Traceback (most recent call last):
  File "/Users/buildslave/jenkins/workspace/lldb-cmake-matrix/llvm-project/lldb/packages/Python/lldbsuite/test/lldbtest.py", line 1748, in test_method
    return attrvalue(self)
  File "/Users/buildslave/jenkins/workspace/lldb-cmake-matrix/llvm-project/lldb/packages/Python/lldbsuite/test/decorators.py", line 111, in wrapper
    func(*args, **kwargs)
  File "/Users/buildslave/jenkins/workspace/lldb-cmake-matrix/llvm-project/lldb/packages/Python/lldbsuite/test/lang/cpp/namespace/TestNamespace.py", line 141, in test_with_run_command
    loc_exact=True)
  File "/Users/buildslave/jenkins/workspace/lldb-cmake-matrix/llvm-project/lldb/packages/Python/lldbsuite/test/lldbutil.py", line 383, in run_break_set_by_file_and_line
    module_name=module_name)
  File "/Users/buildslave/jenkins/workspace/lldb-cmake-matrix/llvm-project/lldb/packages/Python/lldbsuite/test/lldbutil.py", line 584, in check_breakpoint_result
    out_num_locations))
AssertionError: False is not True : Expecting 1 locations, got 0.
Config=x86_64-/Users/buildslave/jenkins/workspace/lldb-cmake-matrix/clang_701_build/bin/clang-7
======================================================================
FAIL: test_with_run_command_dwarf (TestNamespace.NamespaceTestCase)
    Test that anonymous and named namespace variables display correctly.
----------------------------------------------------------------------
Traceback (most recent call last):
  File "/Users/buildslave/jenkins/workspace/lldb-cmake-matrix/llvm-project/lldb/packages/Python/lldbsuite/test/lldbtest.py", line 1748, in test_method
    return attrvalue(self)
  File "/Users/buildslave/jenkins/workspace/lldb-cmake-matrix/llvm-project/lldb/packages/Python/lldbsuite/test/decorators.py", line 111, in wrapper
    func(*args, **kwargs)
  File "/Users/buildslave/jenkins/workspace/lldb-cmake-matrix/llvm-project/lldb/packages/Python/lldbsuite/test/lang/cpp/namespace/TestNamespace.py", line 141, in test_with_run_command
    loc_exact=True)
  File "/Users/buildslave/jenkins/workspace/lldb-cmake-matrix/llvm-project/lldb/packages/Python/lldbsuite/test/lldbutil.py", line 383, in run_break_set_by_file_and_line
    module_name=module_name)
  File "/Users/buildslave/jenkins/workspace/lldb-cmake-matrix/llvm-project/lldb/packages/Python/lldbsuite/test/lldbutil.py", line 584, in check_breakpoint_result
    out_num_locations))
AssertionError: False is not True : Expecting 1 locations, got 0.
Config=x86_64-/Users/buildslave/jenkins/workspace/lldb-cmake-matrix/clang_701_build/bin/clang-7
----------------------------------------------------------------------
Ran 16 tests in 7.553s

RESULT: FAILED (2 passes, 6 failures, 0 errors, 8 skipped, 0 expected failures, 0 unexpected successes)

********************
FAIL: lldb-Suite :: functionalities/data-formatter/data-formatter-objc/TestDataFormatterObjCNSDate.py (1731 of 1736)
******************** TEST 'lldb-Suite :: functionalities/data-formatter/data-formatter-objc/TestDataFormatterObjCNSDate.py' FAILED ********************
lldb version 10.0.99 (http://labmaster3.local/git/llvm-project.git revision 08f938bd1ae356544923042423ea3f30cd730bf8)
  clang revision 621c93ec1fd804f736cbcb58282ef037fa1a9c48
  llvm revision 621c93ec1fd804f736cbcb58282ef037fa1a9c48
LLDB library dir: /Users/buildslave/jenkins/workspace/lldb-cmake-matrix/lldb-build/bin
LLDB import library dir: /Users/buildslave/jenkins/workspace/lldb-cmake-matrix/lldb-build/bin
libstdcxx tests will not be run because: Don't know how to build with libstdcxx on macosx
Skipping following debug info categories: ['dwo']

Session logs for test failures/errors/unexpected successes will go into directory '/Users/buildslave/jenkins/workspace/lldb-cmake-matrix/test/logs'
Command invoked: /Users/buildslave/jenkins/workspace/lldb-cmake-matrix/llvm-project/lldb/test/dotest.py --arch=x86_64 -s /Users/buildslave/jenkins/workspace/lldb-cmake-matrix/lldb-build/lldb-test-traces -S nm -u CXXFLAGS -u CFLAGS --executable /Users/buildslave/jenkins/workspace/lldb-cmake-matrix/lldb-build/./bin/lldb --dsymutil /Users/buildslave/jenkins/workspace/lldb-cmake-matrix/lldb-build/./bin/dsymutil --filecheck /Users/buildslave/jenkins/workspace/lldb-cmake-matrix/lldb-build/./bin/FileCheck -C /Users/buildslave/jenkins/workspace/lldb-cmake-matrix/clang_701_build/bin/clang --codesign-identity lldb_codesign --server /Users/buildslave/jenkins/workspace/lldb-cmake-matrix/lldb-build/./bin/debugserver --arch x86_64 --build-dir /Users/buildslave/jenkins/workspace/lldb-cmake-matrix/lldb-build/lldb-test-build.noindex -s=/Users/buildslave/jenkins/workspace/lldb-cmake-matrix/test/logs -t --env TERM=vt100 --skip-category gmodules --skip-category watchpoint --arch=x86_64 --dwarf-version=5 --env LLVM_LIBS_DIR=/Users/buildslave/jenkins/workspace/lldb-cmake-matrix/lldb-build/./lib --build-dir /Users/buildslave/jenkins/workspace/lldb-cmake-matrix/lldb-build/tools/lldb/lldb-test-build.noindex --module-cache-dir /Users/buildslave/jenkins/workspace/lldb-cmake-matrix/lldb-build/tools/lldb/lldb-test-build.noindex/module-cache-lldb /Users/buildslave/jenkins/workspace/lldb-cmake-matrix/llvm-project/lldb/packages/Python/lldbsuite/test/functionalities/data-formatter/data-formatter-objc -p TestDataFormatterObjCNSDate.py
Change dir to: /Users/buildslave/jenkins/workspace/lldb-cmake-matrix/llvm-project/lldb/packages/Python/lldbsuite/test/functionalities/data-formatter/data-formatter-objc
runCmd: settings set symbols.enable-external-lookup false
output: 

runCmd: settings set plugin.process.gdb-remote.packet-timeout 60
output: 

runCmd: settings set symbols.clang-modules-cache-path "/Users/buildslave/jenkins/workspace/lldb-cmake-matrix/lldb-build/tools/lldb/lldb-test-build.noindex/module-cache-lldb"
output: 

runCmd: settings set use-color false
output: 

warning: (x86_64) /Users/buildslave/jenkins/workspace/lldb-cmake-matrix/lldb-build/tools/lldb/lldb-test-build.noindex/functionalities/data-formatter/data-formatter-objc/TestDataFormatterObjCNSDate.test_nsdata_with_run_command_dsym/a.out empty dSYM file detected, dSYM was created with an executable with no debug info.
FAIL: LLDB (/Users/buildslave/jenkins/workspace/lldb-cmake-matrix/clang_701_build/bin/clang-7-x86_64) :: test_nsdata_with_run_command_dsym (TestDataFormatterObjCNSDate.ObjCDataFormatterNSDate)
runCmd: settings set symbols.enable-external-lookup false
output: 

runCmd: settings set plugin.process.gdb-remote.packet-timeout 60
output: 

runCmd: settings set symbols.clang-modules-cache-path "/Users/buildslave/jenkins/workspace/lldb-cmake-matrix/lldb-build/tools/lldb/lldb-test-build.noindex/module-cache-lldb"
output: 

runCmd: settings set use-color false
output: 

FAIL: LLDB (/Users/buildslave/jenkins/workspace/lldb-cmake-matrix/clang_701_build/bin/clang-7-x86_64) :: test_nsdata_with_run_command_dwarf (TestDataFormatterObjCNSDate.ObjCDataFormatterNSDate)
UNSUPPORTED: LLDB (/Users/buildslave/jenkins/workspace/lldb-cmake-matrix/clang_701_build/bin/clang-7-x86_64) :: test_nsdata_with_run_command_dwo (TestDataFormatterObjCNSDate.ObjCDataFormatterNSDate) (test case does not fall in any category of interest for this run) 
UNSUPPORTED: LLDB (/Users/buildslave/jenkins/workspace/lldb-cmake-matrix/clang_701_build/bin/clang-7-x86_64) :: test_nsdata_with_run_command_gmodules (TestDataFormatterObjCNSDate.ObjCDataFormatterNSDate) (test case does not fall in any category of interest for this run) 
Restore dir to: /Users/buildslave/jenkins/workspace/lldb-cmake-matrix/lldb-build/tools/lldb/lit
======================================================================
FAIL: test_nsdata_with_run_command_dsym (TestDataFormatterObjCNSDate.ObjCDataFormatterNSDate)
   Test formatters for  NSData.
----------------------------------------------------------------------
Traceback (most recent call last):
  File "/Users/buildslave/jenkins/workspace/lldb-cmake-matrix/llvm-project/lldb/packages/Python/lldbsuite/test/lldbtest.py", line 1748, in test_method
    return attrvalue(self)
  File "/Users/buildslave/jenkins/workspace/lldb-cmake-matrix/llvm-project/lldb/packages/Python/lldbsuite/test/functionalities/data-formatter/data-formatter-objc/TestDataFormatterObjCNSDate.py", line 21, in test_nsdata_with_run_command
    self.appkit_tester_impl(self.nsdata_data_formatter_commands)
  File "/Users/buildslave/jenkins/workspace/lldb-cmake-matrix/llvm-project/lldb/packages/Python/lldbsuite/test/functionalities/data-formatter/data-formatter-objc/ObjCDataFormatterTestCase.py", line 20, in appkit_tester_impl
    self.appkit_common_data_formatters_command()
  File "/Users/buildslave/jenkins/workspace/lldb-cmake-matrix/llvm-project/lldb/packages/Python/lldbsuite/test/functionalities/data-formatter/data-formatter-objc/ObjCDataFormatterTestCase.py", line 27, in appkit_common_data_formatters_command
    lldb.SBFileSpec('main.m', False))
  File "/Users/buildslave/jenkins/workspace/lldb-cmake-matrix/llvm-project/lldb/packages/Python/lldbsuite/test/lldbutil.py", line 837, in run_to_source_breakpoint
    %(bkpt_pattern, source_spec.GetFilename(), source_spec.GetDirectory()))
AssertionError: False is not True : No locations found for source breakpoint: "// Set break point at this line.", file: "main.m", dir: "None"
Config=x86_64-/Users/buildslave/jenkins/workspace/lldb-cmake-matrix/clang_701_build/bin/clang-7
======================================================================
FAIL: test_nsdata_with_run_command_dwarf (TestDataFormatterObjCNSDate.ObjCDataFormatterNSDate)
   Test formatters for  NSData.
----------------------------------------------------------------------
Traceback (most recent call last):
  File "/Users/buildslave/jenkins/workspace/lldb-cmake-matrix/llvm-project/lldb/packages/Python/lldbsuite/test/lldbtest.py", line 1748, in test_method
    return attrvalue(self)
  File "/Users/buildslave/jenkins/workspace/lldb-cmake-matrix/llvm-project/lldb/packages/Python/lldbsuite/test/functionalities/data-formatter/data-formatter-objc/TestDataFormatterObjCNSDate.py", line 21, in test_nsdata_with_run_command
    self.appkit_tester_impl(self.nsdata_data_formatter_commands)
  File "/Users/buildslave/jenkins/workspace/lldb-cmake-matrix/llvm-project/lldb/packages/Python/lldbsuite/test/functionalities/data-formatter/data-formatter-objc/ObjCDataFormatterTestCase.py", line 20, in appkit_tester_impl
    self.appkit_common_data_formatters_command()
  File "/Users/buildslave/jenkins/workspace/lldb-cmake-matrix/llvm-project/lldb/packages/Python/lldbsuite/test/functionalities/data-formatter/data-formatter-objc/ObjCDataFormatterTestCase.py", line 27, in appkit_common_data_formatters_command
    lldb.SBFileSpec('main.m', False))
  File "/Users/buildslave/jenkins/workspace/lldb-cmake-matrix/llvm-project/lldb/packages/Python/lldbsuite/test/lldbutil.py", line 837, in run_to_source_breakpoint
    %(bkpt_pattern, source_spec.GetFilename(), source_spec.GetDirectory()))
AssertionError: False is not True : No locations found for source breakpoint: "// Set break point at this line.", file: "main.m", dir: "None"
Config=x86_64-/Users/buildslave/jenkins/workspace/lldb-cmake-matrix/clang_701_build/bin/clang-7
----------------------------------------------------------------------
Ran 4 tests in 4.946s

RESULT: FAILED (0 passes, 2 failures, 0 errors, 2 skipped, 0 expected failures, 0 unexpected successes)

********************
FAIL: lldb-Suite :: commands/expression/two-files/TestObjCTypeQueryFromOtherCompileUnit.py (1732 of 1736)
******************** TEST 'lldb-Suite :: commands/expression/two-files/TestObjCTypeQueryFromOtherCompileUnit.py' FAILED ********************
lldb version 10.0.99 (http://labmaster3.local/git/llvm-project.git revision 08f938bd1ae356544923042423ea3f30cd730bf8)
  clang revision 621c93ec1fd804f736cbcb58282ef037fa1a9c48
  llvm revision 621c93ec1fd804f736cbcb58282ef037fa1a9c48
LLDB library dir: /Users/buildslave/jenkins/workspace/lldb-cmake-matrix/lldb-build/bin
LLDB import library dir: /Users/buildslave/jenkins/workspace/lldb-cmake-matrix/lldb-build/bin
libstdcxx tests will not be run because: Don't know how to build with libstdcxx on macosx
Skipping following debug info categories: ['dwo']

Session logs for test failures/errors/unexpected successes will go into directory '/Users/buildslave/jenkins/workspace/lldb-cmake-matrix/test/logs'
Command invoked: /Users/buildslave/jenkins/workspace/lldb-cmake-matrix/llvm-project/lldb/test/dotest.py --arch=x86_64 -s /Users/buildslave/jenkins/workspace/lldb-cmake-matrix/lldb-build/lldb-test-traces -S nm -u CXXFLAGS -u CFLAGS --executable /Users/buildslave/jenkins/workspace/lldb-cmake-matrix/lldb-build/./bin/lldb --dsymutil /Users/buildslave/jenkins/workspace/lldb-cmake-matrix/lldb-build/./bin/dsymutil --filecheck /Users/buildslave/jenkins/workspace/lldb-cmake-matrix/lldb-build/./bin/FileCheck -C /Users/buildslave/jenkins/workspace/lldb-cmake-matrix/clang_701_build/bin/clang --codesign-identity lldb_codesign --server /Users/buildslave/jenkins/workspace/lldb-cmake-matrix/lldb-build/./bin/debugserver --arch x86_64 --build-dir /Users/buildslave/jenkins/workspace/lldb-cmake-matrix/lldb-build/lldb-test-build.noindex -s=/Users/buildslave/jenkins/workspace/lldb-cmake-matrix/test/logs -t --env TERM=vt100 --skip-category gmodules --skip-category watchpoint --arch=x86_64 --dwarf-version=5 --env LLVM_LIBS_DIR=/Users/buildslave/jenkins/workspace/lldb-cmake-matrix/lldb-build/./lib --build-dir /Users/buildslave/jenkins/workspace/lldb-cmake-matrix/lldb-build/tools/lldb/lldb-test-build.noindex --module-cache-dir /Users/buildslave/jenkins/workspace/lldb-cmake-matrix/lldb-build/tools/lldb/lldb-test-build.noindex/module-cache-lldb /Users/buildslave/jenkins/workspace/lldb-cmake-matrix/llvm-project/lldb/packages/Python/lldbsuite/test/commands/expression/two-files -p TestObjCTypeQueryFromOtherCompileUnit.py
Change dir to: /Users/buildslave/jenkins/workspace/lldb-cmake-matrix/llvm-project/lldb/packages/Python/lldbsuite/test/commands/expression/two-files
runCmd: settings set symbols.enable-external-lookup false
output: 

runCmd: settings set plugin.process.gdb-remote.packet-timeout 60
output: 

runCmd: settings set symbols.clang-modules-cache-path "/Users/buildslave/jenkins/workspace/lldb-cmake-matrix/lldb-build/tools/lldb/lldb-test-build.noindex/module-cache-lldb"
output: 

runCmd: settings set use-color false
output: 

warning: (x86_64) /Users/buildslave/jenkins/workspace/lldb-cmake-matrix/lldb-build/tools/lldb/lldb-test-build.noindex/commands/expression/two-files/TestObjCTypeQueryFromOtherCompileUnit.test_dsym/a.out empty dSYM file detected, dSYM was created with an executable with no debug info.
runCmd: file /Users/buildslave/jenkins/workspace/lldb-cmake-matrix/lldb-build/tools/lldb/lldb-test-build.noindex/commands/expression/two-files/TestObjCTypeQueryFromOtherCompileUnit.test_dsym/a.out
output: Current executable set to '/Users/buildslave/jenkins/workspace/lldb-cmake-matrix/lldb-build/tools/lldb/lldb-test-build.noindex/commands/expression/two-files/TestObjCTypeQueryFromOtherCompileUnit.test_dsym/a.out' (x86_64).


runCmd: breakpoint set -f "main.m" -l 16
output: Breakpoint 1: no locations (pending).
WARNING:  Unable to resolve breakpoint to any actual locations.


Expecting pattern: ^Breakpoint (?P<bpno>[0-9]+): (?P<num_locations>[0-9]+) locations\.$
Not matched

Expecting pattern: ^Breakpoint (?P<bpno>[0-9]+): (?P<num_locations>no) locations \(pending\)\.
Matched

FAIL: LLDB (/Users/buildslave/jenkins/workspace/lldb-cmake-matrix/clang_701_build/bin/clang-7-x86_64) :: test_dsym (TestObjCTypeQueryFromOtherCompileUnit.ObjCTypeQueryTestCase)
runCmd: settings set symbols.enable-external-lookup false
output: 

runCmd: settings set plugin.process.gdb-remote.packet-timeout 60
output: 

runCmd: settings set symbols.clang-modules-cache-path "/Users/buildslave/jenkins/workspace/lldb-cmake-matrix/lldb-build/tools/lldb/lldb-test-build.noindex/module-cache-lldb"
output: 

runCmd: settings set use-color false
output: 

runCmd: file /Users/buildslave/jenkins/workspace/lldb-cmake-matrix/lldb-build/tools/lldb/lldb-test-build.noindex/commands/expression/two-files/TestObjCTypeQueryFromOtherCompileUnit.test_dwarf/a.out
output: Current executable set to '/Users/buildslave/jenkins/workspace/lldb-cmake-matrix/lldb-build/tools/lldb/lldb-test-build.noindex/commands/expression/two-files/TestObjCTypeQueryFromOtherCompileUnit.test_dwarf/a.out' (x86_64).


runCmd: breakpoint set -f "main.m" -l 16
output: Breakpoint 1: no locations (pending).
WARNING:  Unable to resolve breakpoint to any actual locations.


Expecting pattern: ^Breakpoint (?P<bpno>[0-9]+): (?P<num_locations>[0-9]+) locations\.$
Not matched

Expecting pattern: ^Breakpoint (?P<bpno>[0-9]+): (?P<num_locations>no) locations \(pending\)\.
Matched

FAIL: LLDB (/Users/buildslave/jenkins/workspace/lldb-cmake-matrix/clang_701_build/bin/clang-7-x86_64) :: test_dwarf (TestObjCTypeQueryFromOtherCompileUnit.ObjCTypeQueryTestCase)
UNSUPPORTED: LLDB (/Users/buildslave/jenkins/workspace/lldb-cmake-matrix/clang_701_build/bin/clang-7-x86_64) :: test_dwo (TestObjCTypeQueryFromOtherCompileUnit.ObjCTypeQueryTestCase) (test case does not fall in any category of interest for this run) 
UNSUPPORTED: LLDB (/Users/buildslave/jenkins/workspace/lldb-cmake-matrix/clang_701_build/bin/clang-7-x86_64) :: test_gmodules (TestObjCTypeQueryFromOtherCompileUnit.ObjCTypeQueryTestCase) (test case does not fall in any category of interest for this run) 
Restore dir to: /Users/buildslave/jenkins/workspace/lldb-cmake-matrix/lldb-build/tools/lldb/lit
======================================================================
FAIL: test_dsym (TestObjCTypeQueryFromOtherCompileUnit.ObjCTypeQueryTestCase)
   The expression parser's type search should be wider than the current compilation unit.
----------------------------------------------------------------------
Traceback (most recent call last):
  File "/Users/buildslave/jenkins/workspace/lldb-cmake-matrix/llvm-project/lldb/packages/Python/lldbsuite/test/lldbtest.py", line 1748, in test_method
    return attrvalue(self)
  File "/Users/buildslave/jenkins/workspace/lldb-cmake-matrix/llvm-project/lldb/packages/Python/lldbsuite/test/commands/expression/two-files/TestObjCTypeQueryFromOtherCompileUnit.py", line 34, in test
    self, "main.m", self.line, num_expected_locations=1, loc_exact=True)
  File "/Users/buildslave/jenkins/workspace/lldb-cmake-matrix/llvm-project/lldb/packages/Python/lldbsuite/test/lldbutil.py", line 383, in run_break_set_by_file_and_line
    module_name=module_name)
  File "/Users/buildslave/jenkins/workspace/lldb-cmake-matrix/llvm-project/lldb/packages/Python/lldbsuite/test/lldbutil.py", line 584, in check_breakpoint_result
    out_num_locations))
AssertionError: False is not True : Expecting 1 locations, got 0.
Config=x86_64-/Users/buildslave/jenkins/workspace/lldb-cmake-matrix/clang_701_build/bin/clang-7
======================================================================
FAIL: test_dwarf (TestObjCTypeQueryFromOtherCompileUnit.ObjCTypeQueryTestCase)
   The expression parser's type search should be wider than the current compilation unit.
----------------------------------------------------------------------
Traceback (most recent call last):
  File "/Users/buildslave/jenkins/workspace/lldb-cmake-matrix/llvm-project/lldb/packages/Python/lldbsuite/test/lldbtest.py", line 1748, in test_method
    return attrvalue(self)
  File "/Users/buildslave/jenkins/workspace/lldb-cmake-matrix/llvm-project/lldb/packages/Python/lldbsuite/test/commands/expression/two-files/TestObjCTypeQueryFromOtherCompileUnit.py", line 34, in test
    self, "main.m", self.line, num_expected_locations=1, loc_exact=True)
  File "/Users/buildslave/jenkins/workspace/lldb-cmake-matrix/llvm-project/lldb/packages/Python/lldbsuite/test/lldbutil.py", line 383, in run_break_set_by_file_and_line
    module_name=module_name)
  File "/Users/buildslave/jenkins/workspace/lldb-cmake-matrix/llvm-project/lldb/packages/Python/lldbsuite/test/lldbutil.py", line 584, in check_breakpoint_result
    out_num_locations))
AssertionError: False is not True : Expecting 1 locations, got 0.
Config=x86_64-/Users/buildslave/jenkins/workspace/lldb-cmake-matrix/clang_701_build/bin/clang-7
----------------------------------------------------------------------
Ran 4 tests in 7.435s

RESULT: FAILED (0 passes, 2 failures, 0 errors, 2 skipped, 0 expected failures, 0 unexpected successes)

********************
PASS: lldb-Suite :: tools/lldb-server/TestLldbGdbServer.py (1733 of 1736)
TIMEOUT: lldb-Suite :: python_api/lldbutil/iter/TestRegistersIterator.py (1734 of 1736)
******************** TEST 'lldb-Suite :: python_api/lldbutil/iter/TestRegistersIterator.py' FAILED ********************
Reached timeout of 600 seconds
********************
TIMEOUT: lldb-Suite :: lang/objc/foundation/TestObjCMethods.py (1735 of 1736)
******************** TEST 'lldb-Suite :: lang/objc/foundation/TestObjCMethods.py' FAILED ********************
Reached timeout of 600 seconds
********************
TIMEOUT: lldb-Suite :: python_api/lldbutil/iter/TestLLDBIterator.py (1736 of 1736)
******************** TEST 'lldb-Suite :: python_api/lldbutil/iter/TestLLDBIterator.py' FAILED ********************
Reached timeout of 600 seconds
********************
Testing Time: 730.29s
********************
Failing Tests (437):
    lldb-Suite :: lang/c/anonymous/TestAnonymous.py
    lldb-Suite :: lang/objc/objc++/TestObjCXX.py
    lldb-Suite :: functionalities/breakpoint/breakpoint_command/TestBreakpointCommandsFromPython.py
    lldb-Suite :: lang/objc/foundation/TestObjCMethodsNSArray.py
    lldb-Suite :: python_api/sbtype_typeclass/TestSBTypeTypeClass.py
    lldb-Suite :: functionalities/data-formatter/data-formatter-stl/libcxx/variant/TestDataFormatterLibcxxVariant.py
    lldb-Suite :: lang/cpp/member-and-local-vars-with-same-name/TestMembersAndLocalsWithSameName.py
    lldb-Suite :: functionalities/thread/concurrent_events/TestConcurrentTwoBreakpointsOneDelaySignal.py
    lldb-Suite :: commands/expression/issue_11588/Test11588.py
    lldb-Suite :: functionalities/data-formatter/data-formatter-stl/libcxx/forward_list/TestDataFormatterLibcxxForwardList.py
    lldb-Suite :: functionalities/breakpoint/breakpoint_by_line_and_column/TestBreakpointByLineAndColumn.py
    lldb-Suite :: functionalities/plugins/python_os_plugin/TestPythonOSPlugin.py
    lldb-Suite :: functionalities/data-formatter/setvaluefromcstring/TestSetValueFromCString.py
    lldb-Suite :: python_api/formatters/TestFormattersSBAPI.py
    lldb-Suite :: functionalities/value_md5_crash/TestValueMD5Crash.py
    lldb-Suite :: functionalities/thread/exit_during_step/TestExitDuringStep.py
    lldb-Suite :: lang/objc/objc-static-method/TestObjCStaticMethod.py
    lldb-Suite :: lang/objc/self/TestObjCSelf.py
    lldb-Suite :: functionalities/breakpoint/require_hw_breakpoints/TestRequireHWBreakpoints.py
    lldb-Suite :: functionalities/breakpoint/address_breakpoints/TestBadAddressBreakpoints.py
    lldb-Suite :: commands/expression/no-deadlock/TestExprDoesntBlock.py
    lldb-Suite :: lang/cpp/lambdas/TestLambdas.py
    lldb-Suite :: functionalities/thread/thread_exit/TestThreadExit.py
    lldb-Suite :: functionalities/thread/backtrace_limit/TestBacktraceLimit.py
    lldb-Suite :: functionalities/inferior-crashing/recursive-inferior/TestRecursiveInferior.py
    lldb-Suite :: lang/c/global_variables/TestGlobalVariables.py
    lldb-Suite :: lang/cpp/breakpoint-commands/TestCPPBreakpointCommands.py
    lldb-Suite :: lang/objc/print-obj/TestPrintObj.py
    lldb-Suite :: macosx/duplicate-archive-members/TestDuplicateMembers.py
    lldb-Suite :: lang/objc/objc-dyn-sbtype/TestObjCDynamicSBType.py
    lldb-Suite :: lang/objc/rdar-10967107/TestRdar10967107.py
    lldb-Suite :: functionalities/data-formatter/data-formatter-objc/nsstring/TestDataFormatterNSString.py
    lldb-Suite :: lang/cpp/namespace/TestNamespaceLookup.py
    lldb-Suite :: lang/c/conflicting-symbol/TestConflictingSymbol.py
    lldb-Suite :: functionalities/thread/concurrent_events/TestConcurrentDelayedCrashWithBreakpointSignal.py
    lldb-Suite :: commands/frame/select/TestFrameSelect.py
    lldb-Suite :: functionalities/data-formatter/dump_dynamic/TestDumpDynamic.py
    lldb-Suite :: python_api/target/TestTargetAPI.py
    lldb-Suite :: lang/objc/objc-struct-argument/TestObjCStructArgument.py
    lldb-Suite :: python_api/sbvalue_persist/TestSBValuePersist.py
    lldb-Suite :: functionalities/data-formatter/data-formatter-synthval/TestDataFormatterSynthVal.py
    lldb-Suite :: functionalities/thread/concurrent_events/TestConcurrentManyCrash.py
    lldb-Suite :: lang/objc/orderedset/TestOrderedSet.py
    lldb-Suite :: lang/cpp/enum_types/TestCPP11EnumTypes.py
    lldb-Suite :: lang/c/step-target/TestStepTarget.py
    lldb-Suite :: commands/command/nested_alias/TestNestedAlias.py
    lldb-Suite :: lang/objc/objc-stepping/TestObjCStepping.py
    lldb-Suite :: lang/objc/rdar-11355592/TestRdar11355592.py
    lldb-Suite :: commands/expression/completion/TestExprCompletion.py
    lldb-Suite :: python_api/frame/TestFrames.py
    lldb-Suite :: lang/c/modules/TestCModules.py
    lldb-Suite :: lang/objc/global_ptrs/TestGlobalObjects.py
    lldb-Suite :: lang/cpp/nsimport/TestCppNsImport.py
    lldb-Suite :: commands/expression/call-overridden-method/TestCallOverriddenMethod.py
    lldb-Suite :: commands/expression/persistent_variables/TestPersistentVariables.py
    lldb-Suite :: python_api/process/TestProcessAPI.py
    lldb-Suite :: commands/expression/char/TestExprsChar.py
    lldb-Suite :: lang/cpp/chained-calls/TestCppChainedCalls.py
    lldb-Suite :: lang/c/set_values/TestSetValues.py
    lldb-Suite :: functionalities/thread/concurrent_events/TestConcurrentCrashWithBreak.py
    lldb-Suite :: lang/objc/objc-ivar-offsets/TestObjCIvarOffsets.py
    lldb-Suite :: lang/objcxx/class-name-clash/TestNameClash.py
    lldb-Suite :: commands/expression/unicode-in-variable/TestUnicodeInVariable.py
    lldb-Suite :: functionalities/breakpoint/scripted_bkpt/TestScriptedResolver.py
    lldb-Suite :: functionalities/data-formatter/data-formatter-objc/TestDataFormatterObjCNSData.py
    lldb-Suite :: functionalities/data-formatter/data-formatter-ptr-to-array/TestPtrToArrayFormatting.py
    lldb-Suite :: lang/objc/objc-runtime-ivars/TestRuntimeIvars.py
    lldb-Suite :: types/TestFloatTypes.py
    lldb-Suite :: commands/command/script/TestCommandScript.py
    lldb-Suite :: functionalities/data-formatter/data-formatter-objc/TestDataFormatterObjCNSURL.py
    lldb-Suite :: lang/cpp/rvalue-references/TestRvalueReferences.py
    lldb-Suite :: commands/process/attach-resume/TestAttachResume.py
    lldb-Suite :: lang/c/shared_lib_stripped_symbols/TestSharedLibStrippedSymbols.py
    lldb-Suite :: commands/expression/persistent_types/TestPersistentTypes.py
    lldb-Suite :: functionalities/breakpoint/inlined_breakpoints/TestInlinedBreakpoints.py
    lldb-Suite :: lang/cpp/frame-var-anon-unions/TestFrameVariableAnonymousUnions.py
    lldb-Suite :: functionalities/completion/TestCompletion.py
    lldb-Suite :: lang/cpp/unsigned_types/TestUnsignedTypes.py
    lldb-Suite :: functionalities/data-formatter/nsarraysynth/TestNSArraySynthetic.py
    lldb-Suite :: functionalities/breakpoint/breakpoint_conditions/TestBreakpointConditions.py
    lldb-Suite :: functionalities/thread/concurrent_events/TestConcurrentSignalDelayBreak.py
    lldb-Suite :: commands/expression/save_jit_objects/TestSaveJITObjects.py
    lldb-Suite :: lang/objc/objc-new-syntax/TestObjCNewSyntaxLiteral.py
    lldb-Suite :: python_api/frame/get-variables/TestGetVariables.py
    lldb-Suite :: lang/cpp/unique-types/TestUniqueTypes.py
    lldb-Suite :: functionalities/breakpoint/breakpoint_hit_count/TestBreakpointHitCount.py
    lldb-Suite :: functionalities/data-formatter/data-formatter-script/TestDataFormatterScript.py
    lldb-Suite :: commands/expression/unwind_expression/TestUnwindExpression.py
    lldb-Suite :: commands/frame/diagnose/virtual-method-call/TestDiagnoseDereferenceVirtualMethodCall.py
    lldb-Suite :: source-manager/TestSourceManager.py
    lldb-Suite :: functionalities/step-avoids-no-debug/TestStepNoDebug.py
    lldb-Suite :: lang/cpp/char8_t/TestCxxChar8_t.py
    lldb-Suite :: functionalities/dynamic_value_child_count/TestDynamicValueChildCount.py
    lldb-Suite :: functionalities/thread/concurrent_events/TestConcurrentBreakpointOneDelayBreakpointThreads.py
    lldb-Suite :: functionalities/data-formatter/nssetsynth/TestNSSetSynthetic.py
    lldb-Suite :: functionalities/inferior-changed/TestInferiorChanged.py
    lldb-Suite :: functionalities/data-formatter/data-formatter-cpp/TestDataFormatterCpp.py
    lldb-Suite :: commands/frame/diagnose/inheritance/TestDiagnoseInheritance.py
    lldb-Suite :: lang/objc/foundation/TestObjCMethodsString.py
    lldb-Suite :: lang/cpp/dynamic-value/TestCppValueCast.py
    lldb-Suite :: functionalities/memory/find/TestMemoryFind.py
    lldb-Suite :: commands/target/stop-hooks/TestStopHooks.py
    lldb-Suite :: functionalities/data-formatter/data-formatter-stl/libcxx/list/TestDataFormatterLibcxxList.py
    lldb-Suite :: commands/expression/scoped_enums/TestScopedEnumType.py
    lldb-Suite :: lang/objc/forward-decl/TestForwardDecl.py
    lldb-Suite :: commands/expression/vector_of_enums/TestVectorOfEnums.py
    lldb-Suite :: lang/c/unicode/TestUnicodeSymbols.py
    lldb-Suite :: commands/statistics/basic/TestStats.py
    lldb-Suite :: functionalities/breakpoint/breakpoint_language/TestBreakpointLanguage.py
    lldb-Suite :: lang/c/unions/TestUnionMembers.py
    lldb-Suite :: lang/objc/objc-new-syntax/TestObjCNewSyntaxDictionary.py
    lldb-Suite :: lang/cpp/global_operators/TestCppGlobalOperators.py
    lldb-Suite :: commands/expression/ir-interpreter-phi-nodes/TestIRInterpreterPHINodes.py
    lldb-Suite :: functionalities/set-data/TestSetData.py
    lldb-Suite :: functionalities/avoids-fd-leak/TestFdLeak.py
    lldb-Suite :: functionalities/data-formatter/data-formatter-objc/TestDataFormatterObjCNSBundle.py
    lldb-Suite :: api/check_public_api_headers/TestPublicAPIHeaders.py
    lldb-Suite :: lang/c/offsetof/TestOffsetof.py
    lldb-Suite :: functionalities/data-formatter/data-formatter-python-synth/TestDataFormatterPythonSynth.py
    lldb-Suite :: lang/cpp/diamond/TestDiamond.py
    lldb-Suite :: functionalities/breakpoint/address_breakpoints/TestAddressBreakpoints.py
    lldb-Suite :: lang/objc/blocks/TestObjCIvarsInBlocks.py
    lldb-Suite :: python_api/value/linked_list/TestValueAPILinkedList.py
    lldb-Suite :: lang/c/stepping/TestThreadStepping.py
    lldb-Suite :: python_api/value/empty_class/TestValueAPIEmptyClass.py
    lldb-Suite :: lang/cpp/auto/TestCPPAuto.py
    lldb-Suite :: functionalities/thread/jump/TestThreadJump.py
    lldb-Suite :: commands/expression/dollar-in-variable/TestDollarInVariable.py
    lldb-Suite :: lang/cpp/incomplete-types/TestCppIncompleteTypes.py
    lldb-Suite :: functionalities/thread/thread_specific_break/TestThreadSpecificBreakpoint.py
    lldb-Suite :: functionalities/thread/concurrent_events/TestConcurrentDelaySignalBreak.py
    lldb-Suite :: functionalities/float-display/TestFloatDisplay.py
    lldb-Suite :: python_api/rdar-12481949/Test-rdar-12481949.py
    lldb-Suite :: python_api/sbdata/TestSBData.py
    lldb-Suite :: functionalities/data-formatter/data-formatter-stl/libcxx/atomic/TestLibCxxAtomic.py
    lldb-Suite :: lang/cpp/template/TestTemplateArgs.py
    lldb-Suite :: functionalities/memory-region/TestMemoryRegion.py
    lldb-Suite :: commands/expression/multiline-completion/TestMultilineCompletion.py
    lldb-Suite :: lang/c/stepping/TestStepAndBreakpoints.py
    lldb-Suite :: lang/cpp/bool/TestCPPBool.py
    lldb-Suite :: lang/mixed/TestMixedLanguages.py
    lldb-Suite :: lang/cpp/namespace_definitions/TestNamespaceDefinitions.py
    lldb-Suite :: functionalities/breakpoint/auto_continue/TestBreakpointAutoContinue.py
    lldb-Suite :: python_api/lldbutil/frame/TestFrameUtils.py
    lldb-Suite :: commands/frame/diagnose/bad-reference/TestBadReference.py
    lldb-Suite :: functionalities/breakpoint/move_nearest/TestMoveNearest.py
    lldb-Suite :: functionalities/thread/concurrent_events/TestConcurrentBreakpointDelayBreakpointOneSignal.py
    lldb-Suite :: functionalities/data-formatter/data-formatter-stl/libcxx/multiset/TestDataFormatterLibcxxMultiSet.py
    lldb-Suite :: commands/disassemble/basic/TestFrameDisassemble.py
    lldb-Suite :: python_api/function_symbol/TestSymbolAPI.py
    lldb-Suite :: functionalities/breakpoint/global_constructor/TestBreakpointInGlobalConstructor.py
    lldb-Suite :: python_api/interpreter/TestCommandInterpreterAPI.py
    lldb-Suite :: functionalities/data-formatter/data-formatter-stl/libcxx/bitset/TestDataFormatterLibcxxBitset.py
    lldb-Suite :: commands/frame/var-scope/TestFrameVariableScope.py
    lldb-Suite :: functionalities/data-formatter/parray/TestPrintArray.py
    lldb-Suite :: functionalities/thread/concurrent_events/TestConcurrentCrashWithSignal.py
    lldb-Suite :: functionalities/data-formatter/synthcapping/TestSyntheticCapping.py
    lldb-Suite :: macosx/find-dsym/deep-bundle/TestDeepBundle.py
    lldb-Suite :: lang/objc/objc-class-method/TestObjCClassMethod.py
    lldb-Suite :: functionalities/thread/exit_during_break/TestExitDuringBreak.py
    lldb-Suite :: commands/expression/rdar44436068/Test128BitsInteger.py
    lldb-Suite :: functionalities/var_path/TestVarPath.py
    lldb-Suite :: lang/c/bitfields/TestBitfields.py
    lldb-Suite :: lang/cpp/extern_c/TestExternCSymbols.py
    lldb-Suite :: lang/objc/single-entry-dictionary/TestObjCSingleEntryDictionary.py
    lldb-Suite :: functionalities/type_lookup/TestTypeLookup.py
    lldb-Suite :: lang/objc/objc-static-method-stripped/TestObjCStaticMethodStripped.py
    lldb-Suite :: lang/objc/unicode-string/TestUnicodeString.py
    lldb-Suite :: functionalities/data-formatter/data-formatter-objc/TestDataFormatterObjCExpr.py
    lldb-Suite :: lang/objc/objc-builtin-types/TestObjCBuiltinTypes.py
    lldb-Suite :: commands/expression/radar_9673664/TestExprHelpExamples.py
    lldb-Suite :: python_api/symbol-context/TestSymbolContext.py
    lldb-Suite :: commands/gui/basic/TestGuiBasic.py
    lldb-Suite :: lang/objc/objc-foundation-dictionary-empty/TestNSDictionary0.py
    lldb-Suite :: lang/cpp/trivial_abi/TestTrivialABI.py
    lldb-Suite :: types/TestIntegerTypesExpr.py
    lldb-Suite :: functionalities/data-formatter/nsdictionarysynth/TestNSDictionarySynthetic.py
    lldb-Suite :: functionalities/data-formatter/vector-types/TestVectorTypesFormatting.py
    lldb-Suite :: functionalities/data-formatter/synthupdate/TestSyntheticFilterRecompute.py
    lldb-Suite :: lang/cpp/overloaded-functions/TestOverloadedFunctions.py
    lldb-Suite :: python_api/process/read-mem-cstring/TestReadMemCString.py
    lldb-Suite :: lang/cpp/const_this/TestConstThis.py
    lldb-Suite :: functionalities/rerun/TestRerun.py
    lldb-Suite :: lang/objc/radar-9691614/TestObjCMethodReturningBOOL.py
    lldb-Suite :: functionalities/data-formatter/boolreference/TestFormattersBoolRefPtr.py
    lldb-Suite :: functionalities/thread/crash_during_step/TestCrashDuringStep.py
    lldb-Suite :: macosx/add-dsym/TestAddDsymMidExecutionCommand.py
    lldb-Suite :: sample_test/TestSampleTest.py
    lldb-Suite :: python_api/thread/TestThreadAPI.py
    lldb-Suite :: functionalities/data-formatter/data-formatter-stl/libcxx/list/loop/TestDataFormatterLibcxxListLoop.py
    lldb-Suite :: functionalities/inferior-assert/TestInferiorAssert.py
    lldb-Suite :: commands/expression/class_template_specialization_empty_pack/TestClassTemplateSpecializationParametersHandling.py
    lldb-Suite :: lang/c/blocks/TestBlocks.py
    lldb-Suite :: commands/expression/timeout/TestCallWithTimeout.py
    lldb-Suite :: macosx/nslog/TestDarwinNSLogOutput.py
    lldb-Suite :: python_api/name_lookup/TestNameLookup.py
    lldb-Suite :: functionalities/load_using_paths/TestLoadUsingPaths.py
    lldb-Suite :: functionalities/thread/concurrent_events/TestConcurrentTwoBreakpointsOneSignal.py
    lldb-Suite :: lang/cpp/gmodules-templates/TestGModules.py
    lldb-Suite :: lang/c/local_variables/TestLocalVariables.py
    lldb-Suite :: functionalities/thread/concurrent_events/TestConcurrentManyBreakpoints.py
    lldb-Suite :: functionalities/data-formatter/data-formatter-stl/libcxx/multimap/TestDataFormatterLibccMultiMap.py
    lldb-Suite :: lang/cpp/llvm-style/TestLLVMStyle.py
    lldb-Suite :: lang/cpp/class_static/TestStaticVariables.py
    lldb-Suite :: python_api/symbol-context/two-files/TestSymbolContextTwoFiles.py
    lldb-Suite :: functionalities/type_completion/TestTypeCompletion.py
    lldb-Suite :: lang/objc/objc-struct-return/TestObjCStructReturn.py
    lldb-Suite :: functionalities/data-formatter/data-formatter-objc/nsindexpath/TestDataFormatterNSIndexPath.py
    lldb-Suite :: functionalities/breakpoint/breakpoint_command/TestRegexpBreakCommand.py
    lldb-Suite :: lang/cpp/class_types/TestClassTypes.py
    lldb-Suite :: commands/expression/expr-in-syscall/TestExpressionInSyscall.py
    lldb-Suite :: lang/cpp/global_variables/TestCPPGlobalVariables.py
    lldb-Suite :: lang/cpp/call-function/TestCallCPPFunction.py
    lldb-Suite :: functionalities/memory/read/TestMemoryRead.py
    lldb-Suite :: driver/batch_mode/TestBatchMode.py
    lldb-Suite :: lang/cpp/inlines/TestInlines.py
    lldb-Suite :: commands/expression/call-function/TestCallStdStringFunction.py
    lldb-Suite :: functionalities/data-formatter/data-formatter-stl/libcxx/set/TestDataFormatterLibcxxSet.py
    lldb-Suite :: python_api/objc_type/TestObjCType.py
    lldb-Suite :: lang/objc/foundation/TestRuntimeTypes.py
    lldb-Suite :: lang/objc/objc-optimized/TestObjcOptimized.py
    lldb-Suite :: functionalities/data-formatter/data-formatter-synthtype/TestDataFormatterSynthType.py
    lldb-Suite :: commands/expression/options/TestExprOptions.py
    lldb-Suite :: python_api/frame/inlines/TestInlinedFrame.py
    lldb-Suite :: functionalities/data-formatter/data-formatter-stl/libcxx/string/TestDataFormatterLibcxxString.py
    lldb-Suite :: lang/cpp/signed_types/TestSignedTypes.py
    lldb-Suite :: commands/expression/top-level/TestTopLevelExprs.py
    lldb-Suite :: commands/expression/po_verbosity/TestPoVerbosity.py
    lldb-Suite :: commands/expression/call-throws/TestCallThatThrows.py
    lldb-Suite :: functionalities/ptr_refs/TestPtrRefs.py
    lldb-Suite :: commands/expression/test/TestExprs.py
    lldb-Suite :: lang/objc/foundation/TestObjCMethods2.py
    lldb-Suite :: lang/cpp/operator-overload/TestOperatorOverload.py
    lldb-Suite :: commands/expression/call-function/TestCallUserDefinedFunction.py
    lldb-Suite :: functionalities/breakpoint/breakpoint_command/TestBreakpointCommand.py
    lldb-Suite :: lang/c/inlines/TestRedefinitionsInInlines.py
    lldb-Suite :: lang/objc/objc-property/TestObjCProperty.py
    lldb-Suite :: functionalities/data-formatter/data-formatter-skip-summary/TestDataFormatterSkipSummary.py
    lldb-Suite :: commands/expression/diagnostics/TestExprDiagnostics.py
    lldb-Suite :: lang/cpp/virtual/TestVirtual.py
    lldb-Suite :: lang/cpp/limit-debug-info/TestWithLimitDebugInfo.py
    lldb-Suite :: lang/cpp/thread_local/TestThreadLocal.py
    lldb-Suite :: functionalities/data-formatter/data-formatter-named-summaries/TestDataFormatterNamedSummaries.py
    lldb-Suite :: commands/settings/TestSettings.py
    lldb-Suite :: functionalities/data-formatter/data-formatter-objc/TestDataFormatterObjCPlain.py
    lldb-Suite :: functionalities/data-formatter/data-formatter-synth/TestDataFormatterSynth.py
    lldb-Suite :: lang/cpp/virtual-overload/TestVirtualOverload.py
    lldb-Suite :: functionalities/thread/concurrent_events/TestConcurrentTwoBreakpointThreads.py
    lldb-Suite :: functionalities/data-formatter/data-formatter-stl/libcxx/queue/TestDataFormatterLibcxxQueue.py
    lldb-Suite :: python_api/signals/TestSignalsAPI.py
    lldb-Suite :: functionalities/data-formatter/data-formatter-stl/libcxx/iterator/TestDataFormatterLibccIterator.py
    lldb-Suite :: lang/objc/exceptions/TestObjCExceptions.py
    lldb-Suite :: lang/objc/objc-checker/TestObjCCheckers.py
    lldb-Suite :: commands/process/launch/TestProcessLaunch.py
    lldb-Suite :: functionalities/data-formatter/data-formatter-stl/libcxx/tuple/TestDataFormatterLibcxxTuple.py
    lldb-Suite :: functionalities/data-formatter/data-formatter-objc/TestDataFormatterObjCNSError.py
    lldb-Suite :: lang/objc/modules-cache/TestClangModulesCache.py
    lldb-Suite :: functionalities/data-formatter/data-formatter-objc/TestDataFormatterObjCKVO.py
    lldb-Suite :: commands/frame/diagnose/dereference-function-return/TestDiagnoseDereferenceFunctionReturn.py
    lldb-Suite :: python_api/value/TestValueAPI.py
    lldb-Suite :: python_api/findvalue_duplist/TestSBFrameFindValue.py
    lldb-Suite :: functionalities/thread/backtrace_all/TestBacktraceAll.py
    lldb-Suite :: functionalities/process_group/TestChangeProcessGroup.py
    lldb-Suite :: lang/objc/objc-ivar-protocols/TestIvarProtocols.py
    lldb-Suite :: lang/objc/hidden-ivars/TestHiddenIvars.py
    lldb-Suite :: functionalities/data-formatter/data-formatter-objc/TestDataFormatterObjNSException.py
    lldb-Suite :: python_api/lldbutil/process/TestPrintStackTraces.py
    lldb-Suite :: functionalities/recursion/TestValueObjectRecursion.py
    lldb-Suite :: functionalities/data-formatter/data-formatter-proper-plurals/TestFormattersOneIsSingular.py
    lldb-Suite :: commands/frame/language/TestGuessLanguage.py
    lldb-Suite :: commands/expression/dont_allow_jit/TestAllowJIT.py
    lldb-Suite :: types/TestDoubleTypesExpr.py
    lldb-Suite :: lang/objc/objc-super/TestObjCSuper.py
    lldb-Suite :: lang/cpp/operators/TestCppOperators.py
    lldb-Suite :: functionalities/data-formatter/refpointer-recursion/TestDataFormatterRefPtrRecursion.py
    lldb-Suite :: functionalities/thread/step_out/TestThreadStepOut.py
    lldb-Suite :: types/TestFloatTypesExpr.py
    lldb-Suite :: python_api/function_symbol/TestDisasmAPI.py
    lldb-Suite :: commands/expression/entry-bp/TestExprEntryBP.py
    lldb-Suite :: commands/expression/function_template_specialization_temp_args/TestFunctionTemplateSpecializationTempArgs.py
    lldb-Suite :: functionalities/breakpoint/dummy_target_breakpoints/TestBreakpointsWithNoTargets.py
    lldb-Suite :: functionalities/data-formatter/stringprinter/TestStringPrinter.py
    lldb-Suite :: functionalities/data-formatter/var-in-aggregate-misuse/TestVarInAggregateMisuse.py
    lldb-Suite :: lang/objcxx/hide-runtime-values/TestObjCXXHideRuntimeValues.py
    lldb-Suite :: functionalities/breakpoint/debugbreak/TestDebugBreak.py
    lldb-Suite :: macosx/find-app-in-bundle/TestFindAppInBundle.py
    lldb-Suite :: functionalities/data-formatter/data-formatter-stl/libcxx/unordered/TestDataFormatterUnordered.py
    lldb-Suite :: commands/expression/cast_int_to_anonymous_enum/TestCastIntToAnonymousEnum.py
    lldb-Suite :: python_api/class_members/TestSBTypeClassMembers.py
    lldb-Suite :: lang/c/const_variables/TestConstVariables.py
    lldb-Suite :: lang/objc/foundation/TestConstStrings.py
    lldb-Suite :: functionalities/thread/step_until/TestStepUntil.py
    lldb-Suite :: functionalities/data-formatter/user-format-vs-summary/TestUserFormatVsSummary.py
    lldb-Suite :: macosx/indirect_symbol/TestIndirectSymbols.py
    lldb-Suite :: functionalities/data-formatter/language_category_updates/TestDataFormatterLanguageCategoryUpdates.py
    lldb-Suite :: functionalities/data-formatter/data-formatter-stl/libcxx/initializerlist/TestInitializerList.py
    lldb-Suite :: functionalities/breakpoint/breakpoint_options/TestBreakpointOptions.py
    lldb-Suite :: lang/c/find_struct_type/TestFindStructTypes.py
    lldb-Suite :: functionalities/data-formatter/data-formatter-stl/libcxx/map/TestDataFormatterLibccMap.py
    lldb-Suite :: lang/c/forward/TestForwardDeclaration.py
    lldb-Suite :: functionalities/inferior-crashing/TestInferiorCrashing.py
    lldb-Suite :: lang/c/register_variables/TestRegisterVariables.py
    lldb-Suite :: functionalities/breakpoint/cpp/TestCPPBreakpointLocations.py
    lldb-Suite :: functionalities/data-formatter/data-formatter-stl/libcxx/vector/TestDataFormatterLibcxxVector.py
    lldb-Suite :: commands/expression/inline-namespace/TestInlineNamespace.py
    lldb-Suite :: lang/cpp/class_types/TestClassTypesDisassembly.py
    lldb-Suite :: lang/objc/ivar-IMP/TestObjCiVarIMP.py
    lldb-Suite :: functionalities/load_unload/TestLoadUnload.py
    lldb-Suite :: lang/objc/modules/TestObjCModules.py
    lldb-Suite :: sample_test/TestSampleInlineTest.py
    lldb-Suite :: functionalities/data-formatter/data-formatter-objc/TestDataFormatterObjCNSContainer.py
    lldb-Suite :: functionalities/data-formatter/data-formatter-advanced/TestDataFormatterAdv.py
    lldb-Suite :: lang/cpp/template-function/TestTemplateFunctions.py
    lldb-Suite :: functionalities/data-formatter/frameformat_smallstruct/TestFrameFormatSmallStruct.py
    lldb-Suite :: functionalities/archives/TestBSDArchives.py
    lldb-Suite :: commands/process/launch-with-shellexpand/TestLaunchWithShellExpand.py
    lldb-Suite :: functionalities/data-formatter/data-formatter-stl/libstdcpp/unique_ptr/invalid/TestDataFormatterInvalidStdUniquePtr.py
    lldb-Suite :: commands/expression/weak_symbols/TestWeakSymbols.py
    lldb-Suite :: functionalities/data-formatter/data-formatter-stl/libcxx/vbool/TestDataFormatterLibcxxVBool.py
    lldb-Suite :: types/TestIntegerTypes.py
    lldb-Suite :: functionalities/unwind/sigtramp/TestSigtrampUnwind.py
    lldb-Suite :: lang/cpp/symbols/TestSymbols.py
    lldb-Suite :: commands/expression/anonymous-struct/TestCallUserAnonTypedef.py
    lldb-Suite :: types/TestDoubleTypes.py
    lldb-Suite :: lang/objc/ptr_refs/TestPtrRefsObjC.py
    lldb-Suite :: commands/frame/var/TestFrameVar.py
    lldb-Suite :: lang/cpp/dynamic-value-same-basename/TestDynamicValueSameBase.py
    lldb-Suite :: functionalities/non-overlapping-index-variable-i/TestIndexVariable.py
    lldb-Suite :: functionalities/data-formatter/varscript_formatting/TestDataFormatterVarScriptFormatting.py
    lldb-Suite :: lang/objc/objc-ivar-stripped/TestObjCIvarStripped.py
    lldb-Suite :: lang/cpp/offsetof/TestOffsetofCpp.py
    lldb-Suite :: functionalities/inferior-crashing/TestInferiorCrashingStep.py
    lldb-Suite :: functionalities/return-value/TestReturnValue.py
    lldb-Suite :: commands/expression/formatters/TestFormatters.py
    lldb-Suite :: functionalities/breakpoint/consecutive_breakpoints/TestConsecutiveBreakpoints.py
    lldb-Suite :: commands/apropos/with-process/TestAproposWithProcess.py
    lldb-Suite :: lang/objcxx/objcxx-ivar-vector/TestIvarVector.py
    lldb-Suite :: commands/expression/context-object-objc/TestContextObjectObjc.py
    lldb-Suite :: functionalities/breakpoint/source_regexp/TestSourceRegexBreakpoints.py
    lldb-Suite :: python_api/value/change_values/TestChangeValueAPI.py
    lldb-Suite :: functionalities/breakpoint/breakpoint_locations/TestBreakpointLocations.py
    lldb-Suite :: commands/frame/diagnose/local-variable/TestLocalVariable.py
    lldb-Suite :: functionalities/data-formatter/ptr_ref_typedef/TestPtrRef2Typedef.py
    lldb-Suite :: functionalities/signal/handle-abrt/TestHandleAbort.py
    lldb-Suite :: functionalities/data-formatter/data-formatter-disabling/TestDataFormatterDisabling.py
    lldb-Suite :: commands/expression/test/TestExprs2.py
    lldb-Suite :: commands/disassemble/basic/TestDisassembleBreakpoint.py
    lldb-Suite :: lang/objc/objc-new-syntax/TestObjCNewSyntaxArray.py
    lldb-Suite :: functionalities/breakpoint/breakpoint_ids/TestBreakpointIDs.py
    lldb-Suite :: lang/c/shared_lib/TestSharedLib.py
    lldb-Suite :: functionalities/conditional_break/TestConditionalBreak.py
    lldb-Suite :: commands/expression/context-object/TestContextObject.py
    lldb-Suite :: lang/objc/foundation/TestObjCMethodsNSError.py
    lldb-Suite :: functionalities/data-formatter/data-formatter-globals/TestDataFormatterGlobals.py
    lldb-Suite :: lang/c/strings/TestCStrings.py
    lldb-Suite :: lang/cpp/scope/TestCppScope.py
    lldb-Suite :: functionalities/data-formatter/type_summary_list_script/TestTypeSummaryListScript.py
    lldb-Suite :: functionalities/data-formatter/data-formatter-categories/TestDataFormatterCategories.py
    lldb-Suite :: lang/objc/modules-auto-import/TestModulesAutoImport.py
    lldb-Suite :: functionalities/breakpoint/breakpoint_ignore_count/TestBreakpointIgnoreCount.py
    lldb-Suite :: functionalities/inline-stepping/TestInlineStepping.py
    lldb-Suite :: commands/frame/diagnose/dereference-argument/TestDiagnoseDereferenceArgument.py
    lldb-Suite :: lang/objc/real-definition/TestRealDefinition.py
    lldb-Suite :: functionalities/thread/concurrent_events/TestConcurrentSignalBreak.py
    lldb-Suite :: linux/builtin_trap/TestBuiltinTrap.py
    lldb-Suite :: functionalities/exec/TestExec.py
    lldb-Suite :: commands/expression/call-function/TestCallBuiltinFunction.py
    lldb-Suite :: functionalities/thread/create_after_attach/TestCreateAfterAttach.py
    lldb-Suite :: lang/objc/conflicting-definition/TestConflictingDefinition.py
    lldb-Suite :: commands/expression/persist_objc_pointeetype/TestPersistObjCPointeeType.py
    lldb-Suite :: python_api/exprpath_synthetic/TestExprPathSynthetic.py
    lldb-Suite :: lang/cpp/class-template-parameter-pack/TestClassTemplateParameterPack.py
    lldb-Suite :: python_api/process/io/TestProcessIO.py
    lldb-Suite :: commands/expression/pr35310/TestExprsBug35310.py
    lldb-Suite :: functionalities/breakpoint/breakpoint_set_restart/TestBreakpointSetRestart.py
    lldb-Suite :: lang/cpp/static_methods/TestCPPStaticMethods.py
    lldb-Suite :: functionalities/data-formatter/format-propagation/TestFormatPropagation.py
    lldb-Suite :: functionalities/thread/num_threads/TestNumThreads.py
    lldb-Suite :: lang/objc/objc-baseclass-sbtype/TestObjCBaseClassSBType.py
    lldb-Suite :: lang/objc/modules-inline-functions/TestModulesInlineFunctions.py
    lldb-Suite :: lang/cpp/namespace_conflicts/TestNamespaceConflicts.py
    lldb-Suite :: functionalities/data-formatter/hexcaps/TestDataFormatterHexCaps.py
    lldb-Suite :: commands/expression/radar_9531204/TestPrintfAfterUp.py
    lldb-Suite :: functionalities/signal/TestSendSignal.py
    lldb-Suite :: macosx/find-dsym/bundle-with-dot-in-filename/TestBundleWithDotInFilename.py
    lldb-Suite :: commands/target/basic/TestTargetCommand.py
    lldb-Suite :: lang/objc/foundation/TestObjectDescriptionAPI.py
    lldb-Suite :: commands/source/info/TestSourceInfo.py
    lldb-Suite :: lang/cpp/std-function-step-into-callable/TestStdFunctionStepIntoCallable.py
    lldb-Suite :: commands/frame/diagnose/complicated-expression/TestComplicatedExpression.py
    lldb-Suite :: functionalities/data-formatter/poarray/TestPrintObjectArray.py
    lldb-Suite :: commands/expression/completion-in-lambda-and-unnnamed-class/TestCompletionInLambdaAndUnnamedClass.py
    lldb-Suite :: lang/cpp/modules-import/TestCXXModulesImport.py
    lldb-Suite :: commands/expression/argument_passing_restrictions/TestArgumentPassingRestrictions.py
    lldb-Suite :: functionalities/data-formatter/ostypeformatting/TestFormattersOsType.py
    lldb-Suite :: python_api/hello_world/TestHelloWorld.py
    lldb-Suite :: functionalities/data-formatter/data-formatter-stl/libcxx/optional/TestDataFormatterLibcxxOptional.py
    lldb-Suite :: lang/c/enum_types/TestEnumTypes.py
    lldb-Suite :: commands/expression/rdar42038760/TestScalarURem.py
    lldb-Suite :: lang/c/array_types/TestArrayTypes.py
    lldb-Suite :: functionalities/data-formatter/typedef_array/TestTypedefArray.py
    lldb-Suite :: lang/objc/variadic_methods/TestVariadicMethods.py
    lldb-Suite :: lang/cpp/function_refs/TestFunctionRefs.py
    lldb-Suite :: functionalities/data-formatter/data-formatter-enum-format/TestDataFormatterEnumFormat.py
    lldb-Suite :: functionalities/memory/cache/TestMemoryCache.py
    lldb-Suite :: lang/objcxx/cxx-bridged-po/TestObjCXXBridgedPO.py
    lldb-Suite :: functionalities/inferior-crashing/recursive-inferior/TestRecursiveInferiorStep.py
    lldb-Suite :: commands/frame/diagnose/array/TestArray.py
    lldb-Suite :: functionalities/breakpoint/comp_dir_symlink/TestCompDirSymLink.py
    lldb-Suite :: functionalities/breakpoint/step_over_breakpoint/TestStepOverBreakpoint.py
    lldb-Suite :: functionalities/data-formatter/pyobjsynthprovider/TestPyObjSynthProvider.py
    lldb-Suite :: lang/c/tls_globals/TestTlsGlobals.py
    lldb-Suite :: functionalities/step_scripted/TestStepScripted.py
    lldb-Suite :: functionalities/data-formatter/compactvectors/TestCompactVectors.py
    lldb-Suite :: lang/cpp/type_lookup/TestCppTypeLookup.py
    lldb-Suite :: python_api/type/TestTypeList.py
    lldb-Suite :: functionalities/data-formatter/data-formatter-smart-array/TestDataFormatterSmartArray.py
    lldb-Suite :: commands/expression/fixits/TestFixIts.py
    lldb-Suite :: lang/c/struct_types/TestStructTypes.py
    lldb-Suite :: lang/c/function_types/TestFunctionTypes.py
    lldb-Suite :: functionalities/data-formatter/data-formatter-objc/TestDataFormatterObjCCF.py
    lldb-Suite :: commands/expression/call-function/TestCallStopAndContinue.py
    lldb-Suite :: commands/expression/radar_8638051/Test8638051.py
    lldb-Suite :: lang/cpp/namespace/TestNamespace.py
    lldb-Suite :: functionalities/tail_call_frames/thread_step_out_or_return/TestSteppingOutWithArtificialFrames.py
    lldb-Suite :: types/TestRecursiveTypes.py
    lldb-Suite :: commands/expression/persistent_ptr_update/TestPersistentPtrUpdate.py
    lldb-Suite :: commands/expression/two-files/TestObjCTypeQueryFromOtherCompileUnit.py
    lldb-Suite :: commands/expression/ir-interpreter/TestIRInterpreter.py
    lldb-Suite :: python_api/value_var_update/TestValueVarUpdate.py
    lldb-Suite :: commands/expression/xvalue/TestXValuePrinting.py
    lldb-Suite :: commands/frame/diagnose/dereference-this/TestDiagnoseDereferenceThis.py
    lldb-Suite :: python_api/sbvalue_const_addrof/TestSBValueConstAddrOf.py
    lldb-Suite :: functionalities/data-formatter/summary-string-onfail/Test-rdar-9974002.py
    lldb-Suite :: functionalities/data-formatter/data-formatter-objc/TestDataFormatterObjCNSDate.py
    lldb-Suite :: lang/cpp/dynamic-value/TestDynamicValue.py
    lldb-Suite :: lang/cpp/this/TestCPPThis.py

********************
Timed Out Tests (3):
    lldb-Suite :: python_api/lldbutil/iter/TestRegistersIterator.py
    lldb-Suite :: lang/objc/foundation/TestObjCMethods.py
    lldb-Suite :: python_api/lldbutil/iter/TestLLDBIterator.py


Slowest Tests:
--------------------------------------------------------------------------
20.16s: lldb-Suite :: python_api/target/TestTargetAPI.py
20.98s: lldb-Suite :: python_api/module_section/TestModuleAndSection.py
21.05s: lldb-Suite :: lang/objc/objc-new-syntax/TestObjCNewSyntaxDictionary.py
21.34s: lldb-Suite :: lang/objc/foundation/TestObjCMethodsString.py
24.04s: lldb-Suite :: lang/objc/real-definition/TestRealDefinition.py
25.40s: lldb-Suite :: lang/objc/exceptions/TestObjCExceptions.py
27.33s: lldb-Suite :: lang/objc/objc-new-syntax/TestObjCNewSyntaxLiteral.py
31.52s: lldb-Suite :: commands/gui/basic/TestGuiBasic.py
35.98s: lldb-Suite :: types/TestIntegerTypesExpr.py
37.13s: lldb-Suite :: types/TestIntegerTypes.py
39.26s: lldb-Suite :: lang/objc/hidden-ivars/TestHiddenIvars.py
45.93s: lldb-Suite :: api/multithreaded/TestMultithreaded.py
62.21s: lldb-Suite :: commands/expression/multiline-completion/TestMultilineCompletion.py
67.01s: lldb-Suite :: tools/lldb-server/TestLldbGdbServer.py
68.24s: lldb-Suite :: macosx/nslog/TestDarwinNSLogOutput.py
94.31s: lldb-Suite :: driver/batch_mode/TestBatchMode.py
140.95s: lldb-Suite :: lang/objc/foundation/TestFoundationDisassembly.py
600.03s: lldb-Suite :: python_api/lldbutil/iter/TestLLDBIterator.py
600.04s: lldb-Suite :: python_api/lldbutil/iter/TestRegistersIterator.py
600.04s: lldb-Suite :: lang/objc/foundation/TestObjCMethods.py

Tests Times:
--------------------------------------------------------------------------
[   Range   ] :: [               Percentage               ] :: [  Count  ]
--------------------------------------------------------------------------
[  0s, 50s) :: [*************************************** ] :: [1728/1736]
[ 50s,100s) :: [                                        ] :: [   3/1736]
[100s,150s) :: [                                        ] :: [   1/1736]
[150s,200s) :: [                                        ] :: [   1/1736]
[200s,250s) :: [                                        ] :: [   0/1736]
[250s,300s) :: [                                        ] :: [   0/1736]
[300s,350s) :: [                                        ] :: [   0/1736]
[350s,400s) :: [                                        ] :: [   0/1736]
[400s,450s) :: [                                        ] :: [   0/1736]
[450s,500s) :: [                                        ] :: [   0/1736]
[500s,550s) :: [                                        ] :: [   0/1736]
[550s,600s) :: [                                        ] :: [   0/1736]
[600s,650s) :: [                                        ] :: [   3/1736]
  Expected Passes    : 1202
  Expected Failures  : 5
  Unsupported Tests  : 89
  Unexpected Failures: 437
  Individual Timeouts: 3
FAILED: tools/lldb/lit/CMakeFiles/check-lldb-lit 
cd /Users/buildslave/jenkins/workspace/lldb-cmake-matrix/lldb-build/tools/lldb/lit && /usr/bin/python /Users/buildslave/jenkins/workspace/lldb-cmake-matrix/lldb-build/./bin/llvm-lit -v --time-tests --shuffle --xunit-xml-output=/Users/buildslave/jenkins/workspace/lldb-cmake-matrix/test/results.xml -v /Users/buildslave/jenkins/workspace/lldb-cmake-matrix/lldb-build/tools/lldb/lit
ninja: build stopped: subcommand failed.
Command failed 
Command: ['/usr/bin/env', 'TERM=vt100', '/usr/local/bin/ninja', '-v', 'check-lldb']
+ set -e