AbortedConsole Output

Skipping 22,099 KB.. Full Log
n run_break_set_by_file_and_line
    num_locations=num_expected_locations)
  File "/Users/buildslave/jenkins/workspace/lldb-cmake-matrix/llvm-project/lldb/packages/Python/lldbsuite/test/lldbutil.py", line 578, in check_breakpoint_result
    "Expecting one or more locations, got none.")
AssertionError: False is not True : Expecting one or more locations, got none.
Config=x86_64-/Users/buildslave/jenkins/workspace/lldb-cmake-matrix/clang_900_build/bin/clang-9
======================================================================
FAIL: test_with_run_command_dwarf (TestDataFormatterLibccIterator.LibcxxIteratorDataFormatterTestCase)
   Test that libc++ iterators format properly.
----------------------------------------------------------------------
Traceback (most recent call last):
  File "/Users/buildslave/jenkins/workspace/lldb-cmake-matrix/llvm-project/lldb/packages/Python/lldbsuite/test/lldbtest.py", line 1748, in test_method
    return attrvalue(self)
  File "/Users/buildslave/jenkins/workspace/lldb-cmake-matrix/llvm-project/lldb/packages/Python/lldbsuite/test/functionalities/data-formatter/data-formatter-stl/libcxx/iterator/TestDataFormatterLibccIterator.py", line 33, in test_with_run_command
    self, "main.cpp", self.line, num_expected_locations=-1)
  File "/Users/buildslave/jenkins/workspace/lldb-cmake-matrix/llvm-project/lldb/packages/Python/lldbsuite/test/lldbutil.py", line 388, in run_break_set_by_file_and_line
    num_locations=num_expected_locations)
  File "/Users/buildslave/jenkins/workspace/lldb-cmake-matrix/llvm-project/lldb/packages/Python/lldbsuite/test/lldbutil.py", line 578, in check_breakpoint_result
    "Expecting one or more locations, got none.")
AssertionError: False is not True : Expecting one or more locations, got none.
Config=x86_64-/Users/buildslave/jenkins/workspace/lldb-cmake-matrix/clang_900_build/bin/clang-9
----------------------------------------------------------------------
Ran 4 tests in 4.108s

Hide Details

RESULT: FAILED (0 passes, 2 failures, 0 errors, 2 skipped, 0 expected failures, 0 unexpected successes)

Hide Details

******************** UNSUPPORTED: lldb-api :: lang/objc/bitfield_ivars/TestBitfieldIvars.py (1777 of 1788) PASS: lldb-api :: lang/cpp/unicode-literals/TestUnicodeLiterals.py (1778 of 1788) PASS: lldb-api :: api/multithreaded/TestMultithreaded.py (1779 of 1788) FAIL: lldb-api :: lang/objc/single-entry-dictionary/TestObjCSingleEntryDictionary.py (1780 of 1788) ******************** TEST 'lldb-api :: lang/objc/single-entry-dictionary/TestObjCSingleEntryDictionary.py' FAILED ******************** lldb version 10.0.99 (http://labmaster3.local/git/llvm-project.git revision bfaa1082e126d922efbf5364f469f23ea1598da8) clang revision 6bfdebb412d87890c9c727a5975aed9cda66bf33 llvm revision 6bfdebb412d87890c9c727a5975aed9cda66bf33 LLDB library dir: /Users/buildslave/jenkins/workspace/lldb-cmake-matrix/lldb-build/bin LLDB import library dir: /Users/buildslave/jenkins/workspace/lldb-cmake-matrix/lldb-build/bin libstdcxx tests will not be run because: Don't know how to build with libstdcxx on macosx Skipping following debug info categories: ['dwo']

Hide Details

Session logs for test failures/errors/unexpected successes will go into directory '/Users/buildslave/jenkins/workspace/lldb-cmake-matrix/test/logs' Command invoked: /Users/buildslave/jenkins/workspace/lldb-cmake-matrix/llvm-project/lldb/test/API/dotest.py --arch=x86_64 -s /Users/buildslave/jenkins/workspace/lldb-cmake-matrix/lldb-build/lldb-test-traces -S nm -u CXXFLAGS -u CFLAGS --executable /Users/buildslave/jenkins/workspace/lldb-cmake-matrix/lldb-build/./bin/lldb --dsymutil /Users/buildslave/jenkins/workspace/lldb-cmake-matrix/lldb-build/./bin/dsymutil --filecheck /Users/buildslave/jenkins/workspace/lldb-cmake-matrix/lldb-build/./bin/FileCheck -C /Users/buildslave/jenkins/workspace/lldb-cmake-matrix/clang_900_build/bin/clang --codesign-identity lldb_codesign --server /Users/buildslave/jenkins/workspace/lldb-cmake-matrix/lldb-build/./bin/debugserver --arch x86_64 --build-dir /Users/buildslave/jenkins/workspace/lldb-cmake-matrix/lldb-build/lldb-test-build.noindex -s=/Users/buildslave/jenkins/workspace/lldb-cmake-matrix/test/logs -t --env TERM=vt100 --skip-category gmodules --skip-category watchpoint --arch=x86_64 --dwarf-version=5 --env LLVM_LIBS_DIR=/Users/buildslave/jenkins/workspace/lldb-cmake-matrix/lldb-build/./lib --build-dir /Users/buildslave/jenkins/workspace/lldb-cmake-matrix/lldb-build/tools/lldb/lldb-test-build.noindex --lldb-module-cache-dir /Users/buildslave/jenkins/workspace/lldb-cmake-matrix/lldb-build/tools/lldb/lldb-test-build.noindex/module-cache-lldb/lldb-api --clang-module-cache-dir /Users/buildslave/jenkins/workspace/lldb-cmake-matrix/lldb-build/tools/lldb/lldb-test-build.noindex/module-cache-clang/lldb-api /Users/buildslave/jenkins/workspace/lldb-cmake-matrix/llvm-project/lldb/packages/Python/lldbsuite/test/lang/objc/single-entry-dictionary -p TestObjCSingleEntryDictionary.py Change dir to: /Users/buildslave/jenkins/workspace/lldb-cmake-matrix/llvm-project/lldb/packages/Python/lldbsuite/test/lang/objc/single-entry-dictionary runCmd: settings set symbols.enable-external-lookup false output:

Hide Details

runCmd: settings set plugin.process.gdb-remote.packet-timeout 60 output:

Hide Details

runCmd: settings set symbols.clang-modules-cache-path "/Users/buildslave/jenkins/workspace/lldb-cmake-matrix/lldb-build/tools/lldb/lldb-test-build.noindex/module-cache-lldb/lldb-api" output:

Hide Details

runCmd: settings set use-color false output:

Hide Details

warning: (x86_64) /Users/buildslave/jenkins/workspace/lldb-cmake-matrix/lldb-build/tools/lldb/lldb-test-build.noindex/lang/objc/single-entry-dictionary/TestObjCSingleEntryDictionary.test_single_entry_dict_dsym/a.out empty dSYM file detected, dSYM was created with an executable with no debug info. runCmd: file /Users/buildslave/jenkins/workspace/lldb-cmake-matrix/lldb-build/tools/lldb/lldb-test-build.noindex/lang/objc/single-entry-dictionary/TestObjCSingleEntryDictionary.test_single_entry_dict_dsym/a.out output: Current executable set to '/Users/buildslave/jenkins/workspace/lldb-cmake-matrix/lldb-build/tools/lldb/lldb-test-build.noindex/lang/objc/single-entry-dictionary/TestObjCSingleEntryDictionary.test_single_entry_dict_dsym/a.out' (x86_64).

Hide Details

Hide Details

runCmd: breakpoint set -f "main.m" -l 5 output: Breakpoint 1: no locations (pending). WARNING: Unable to resolve breakpoint to any actual locations.

Hide Details

Hide Details

Expecting pattern: ^Breakpoint (?P<bpno>[0-9]+): (?P<num_locations>[0-9]+) locations\.$ Not matched

Hide Details

Expecting pattern: ^Breakpoint (?P<bpno>[0-9]+): (?P<num_locations>no) locations \(pending\)\. Matched

Hide Details

FAIL: LLDB (/Users/buildslave/jenkins/workspace/lldb-cmake-matrix/clang_900_build/bin/clang-9-x86_64) :: test_single_entry_dict_dsym (TestObjCSingleEntryDictionary.ObjCSingleEntryDictionaryTestCase) runCmd: settings set symbols.enable-external-lookup false output:

Hide Details

runCmd: settings set plugin.process.gdb-remote.packet-timeout 60 output:

Hide Details

runCmd: settings set symbols.clang-modules-cache-path "/Users/buildslave/jenkins/workspace/lldb-cmake-matrix/lldb-build/tools/lldb/lldb-test-build.noindex/module-cache-lldb/lldb-api" output:

Hide Details

runCmd: settings set use-color false output:

Hide Details

runCmd: file /Users/buildslave/jenkins/workspace/lldb-cmake-matrix/lldb-build/tools/lldb/lldb-test-build.noindex/lang/objc/single-entry-dictionary/TestObjCSingleEntryDictionary.test_single_entry_dict_dwarf/a.out output: Current executable set to '/Users/buildslave/jenkins/workspace/lldb-cmake-matrix/lldb-build/tools/lldb/lldb-test-build.noindex/lang/objc/single-entry-dictionary/TestObjCSingleEntryDictionary.test_single_entry_dict_dwarf/a.out' (x86_64).

Hide Details

Hide Details

runCmd: breakpoint set -f "main.m" -l 5 output: Breakpoint 1: no locations (pending). WARNING: Unable to resolve breakpoint to any actual locations.

Hide Details

Hide Details

Expecting pattern: ^Breakpoint (?P<bpno>[0-9]+): (?P<num_locations>[0-9]+) locations\.$ Not matched

Hide Details

Expecting pattern: ^Breakpoint (?P<bpno>[0-9]+): (?P<num_locations>no) locations \(pending\)\. Matched

Hide Details

FAIL: LLDB (/Users/buildslave/jenkins/workspace/lldb-cmake-matrix/clang_900_build/bin/clang-9-x86_64) :: test_single_entry_dict_dwarf (TestObjCSingleEntryDictionary.ObjCSingleEntryDictionaryTestCase) UNSUPPORTED: LLDB (/Users/buildslave/jenkins/workspace/lldb-cmake-matrix/clang_900_build/bin/clang-9-x86_64) :: test_single_entry_dict_dwo (TestObjCSingleEntryDictionary.ObjCSingleEntryDictionaryTestCase) (test case does not fall in any category of interest for this run) UNSUPPORTED: LLDB (/Users/buildslave/jenkins/workspace/lldb-cmake-matrix/clang_900_build/bin/clang-9-x86_64) :: test_single_entry_dict_gmodules (TestObjCSingleEntryDictionary.ObjCSingleEntryDictionaryTestCase) (test case does not fall in any category of interest for this run) Restore dir to: /Users/buildslave/jenkins/workspace/lldb-cmake-matrix/lldb-build/tools/lldb/test ====================================================================== FAIL: test_single_entry_dict_dsym (TestObjCSingleEntryDictionary.ObjCSingleEntryDictionaryTestCase) ---------------------------------------------------------------------- Traceback (most recent call last): File "/Users/buildslave/jenkins/workspace/lldb-cmake-matrix/llvm-project/lldb/packages/Python/lldbsuite/test/lldbtest.py", line 1748, in test_method return attrvalue(self) File "/Users/buildslave/jenkins/workspace/lldb-cmake-matrix/llvm-project/lldb/packages/Python/lldbsuite/test/decorators.py", line 111, in wrapper func(*args, **kwargs) File "/Users/buildslave/jenkins/workspace/lldb-cmake-matrix/llvm-project/lldb/packages/Python/lldbsuite/test/lang/objc/single-entry-dictionary/TestObjCSingleEntryDictionary.py", line 34, in test_single_entry_dict self, "main.m", self.line, num_expected_locations=1, loc_exact=True) File "/Users/buildslave/jenkins/workspace/lldb-cmake-matrix/llvm-project/lldb/packages/Python/lldbsuite/test/lldbutil.py", line 383, in run_break_set_by_file_and_line module_name=module_name) File "/Users/buildslave/jenkins/workspace/lldb-cmake-matrix/llvm-project/lldb/packages/Python/lldbsuite/test/lldbutil.py", line 584, in check_breakpoint_result out_num_locations)) AssertionError: False is not True : Expecting 1 locations, got 0. Config=x86_64-/Users/buildslave/jenkins/workspace/lldb-cmake-matrix/clang_900_build/bin/clang-9 ====================================================================== FAIL: test_single_entry_dict_dwarf (TestObjCSingleEntryDictionary.ObjCSingleEntryDictionaryTestCase) ---------------------------------------------------------------------- Traceback (most recent call last): File "/Users/buildslave/jenkins/workspace/lldb-cmake-matrix/llvm-project/lldb/packages/Python/lldbsuite/test/lldbtest.py", line 1748, in test_method return attrvalue(self) File "/Users/buildslave/jenkins/workspace/lldb-cmake-matrix/llvm-project/lldb/packages/Python/lldbsuite/test/decorators.py", line 111, in wrapper func(*args, **kwargs) File "/Users/buildslave/jenkins/workspace/lldb-cmake-matrix/llvm-project/lldb/packages/Python/lldbsuite/test/lang/objc/single-entry-dictionary/TestObjCSingleEntryDictionary.py", line 34, in test_single_entry_dict self, "main.m", self.line, num_expected_locations=1, loc_exact=True) File "/Users/buildslave/jenkins/workspace/lldb-cmake-matrix/llvm-project/lldb/packages/Python/lldbsuite/test/lldbutil.py", line 383, in run_break_set_by_file_and_line module_name=module_name) File "/Users/buildslave/jenkins/workspace/lldb-cmake-matrix/llvm-project/lldb/packages/Python/lldbsuite/test/lldbutil.py", line 584, in check_breakpoint_result out_num_locations)) AssertionError: False is not True : Expecting 1 locations, got 0. Config=x86_64-/Users/buildslave/jenkins/workspace/lldb-cmake-matrix/clang_900_build/bin/clang-9 ---------------------------------------------------------------------- Ran 4 tests in 5.147s

Hide Details

RESULT: FAILED (0 passes, 2 failures, 0 errors, 2 skipped, 0 expected failures, 0 unexpected successes)

Hide Details

******************** FAIL: lldb-api :: functionalities/inline-stepping/TestInlineStepping.py (1781 of 1788) ******************** TEST 'lldb-api :: functionalities/inline-stepping/TestInlineStepping.py' FAILED ******************** lldb version 10.0.99 (http://labmaster3.local/git/llvm-project.git revision bfaa1082e126d922efbf5364f469f23ea1598da8) clang revision 6bfdebb412d87890c9c727a5975aed9cda66bf33 llvm revision 6bfdebb412d87890c9c727a5975aed9cda66bf33 LLDB library dir: /Users/buildslave/jenkins/workspace/lldb-cmake-matrix/lldb-build/bin LLDB import library dir: /Users/buildslave/jenkins/workspace/lldb-cmake-matrix/lldb-build/bin libstdcxx tests will not be run because: Don't know how to build with libstdcxx on macosx Skipping following debug info categories: ['dwo']

Hide Details

Session logs for test failures/errors/unexpected successes will go into directory '/Users/buildslave/jenkins/workspace/lldb-cmake-matrix/test/logs' Command invoked: /Users/buildslave/jenkins/workspace/lldb-cmake-matrix/llvm-project/lldb/test/API/dotest.py --arch=x86_64 -s /Users/buildslave/jenkins/workspace/lldb-cmake-matrix/lldb-build/lldb-test-traces -S nm -u CXXFLAGS -u CFLAGS --executable /Users/buildslave/jenkins/workspace/lldb-cmake-matrix/lldb-build/./bin/lldb --dsymutil /Users/buildslave/jenkins/workspace/lldb-cmake-matrix/lldb-build/./bin/dsymutil --filecheck /Users/buildslave/jenkins/workspace/lldb-cmake-matrix/lldb-build/./bin/FileCheck -C /Users/buildslave/jenkins/workspace/lldb-cmake-matrix/clang_900_build/bin/clang --codesign-identity lldb_codesign --server /Users/buildslave/jenkins/workspace/lldb-cmake-matrix/lldb-build/./bin/debugserver --arch x86_64 --build-dir /Users/buildslave/jenkins/workspace/lldb-cmake-matrix/lldb-build/lldb-test-build.noindex -s=/Users/buildslave/jenkins/workspace/lldb-cmake-matrix/test/logs -t --env TERM=vt100 --skip-category gmodules --skip-category watchpoint --arch=x86_64 --dwarf-version=5 --env LLVM_LIBS_DIR=/Users/buildslave/jenkins/workspace/lldb-cmake-matrix/lldb-build/./lib --build-dir /Users/buildslave/jenkins/workspace/lldb-cmake-matrix/lldb-build/tools/lldb/lldb-test-build.noindex --lldb-module-cache-dir /Users/buildslave/jenkins/workspace/lldb-cmake-matrix/lldb-build/tools/lldb/lldb-test-build.noindex/module-cache-lldb/lldb-api --clang-module-cache-dir /Users/buildslave/jenkins/workspace/lldb-cmake-matrix/lldb-build/tools/lldb/lldb-test-build.noindex/module-cache-clang/lldb-api /Users/buildslave/jenkins/workspace/lldb-cmake-matrix/llvm-project/lldb/packages/Python/lldbsuite/test/functionalities/inline-stepping -p TestInlineStepping.py Change dir to: /Users/buildslave/jenkins/workspace/lldb-cmake-matrix/llvm-project/lldb/packages/Python/lldbsuite/test/functionalities/inline-stepping runCmd: settings set symbols.enable-external-lookup false output:

Hide Details

runCmd: settings set plugin.process.gdb-remote.packet-timeout 60 output:

Hide Details

runCmd: settings set symbols.clang-modules-cache-path "/Users/buildslave/jenkins/workspace/lldb-cmake-matrix/lldb-build/tools/lldb/lldb-test-build.noindex/module-cache-lldb/lldb-api" output:

Hide Details

runCmd: settings set use-color false output:

Hide Details

warning: (x86_64) /Users/buildslave/jenkins/workspace/lldb-cmake-matrix/lldb-build/tools/lldb/lldb-test-build.noindex/functionalities/inline-stepping/TestInlineStepping.test_step_in_template_with_python_api_dsym/a.out empty dSYM file detected, dSYM was created with an executable with no debug info. FAIL: LLDB (/Users/buildslave/jenkins/workspace/lldb-cmake-matrix/clang_900_build/bin/clang-9-x86_64) :: test_step_in_template_with_python_api_dsym (TestInlineStepping.TestInlineStepping) <bound method SBProcess.Kill of <lldb.SBProcess; proxy of <Swig Object of type 'lldb::SBProcess *' at 0x13246e1b0> >>: success

Hide Details

runCmd: settings set symbols.enable-external-lookup false output:

Hide Details

runCmd: settings set plugin.process.gdb-remote.packet-timeout 60 output:

Hide Details

runCmd: settings set symbols.clang-modules-cache-path "/Users/buildslave/jenkins/workspace/lldb-cmake-matrix/lldb-build/tools/lldb/lldb-test-build.noindex/module-cache-lldb/lldb-api" output:

Hide Details

runCmd: settings set use-color false output:

Hide Details

FAIL: LLDB (/Users/buildslave/jenkins/workspace/lldb-cmake-matrix/clang_900_build/bin/clang-9-x86_64) :: test_step_in_template_with_python_api_dwarf (TestInlineStepping.TestInlineStepping) <bound method SBProcess.Kill of <lldb.SBProcess; proxy of <Swig Object of type 'lldb::SBProcess *' at 0x13246e120> >>: success

Hide Details

UNSUPPORTED: LLDB (/Users/buildslave/jenkins/workspace/lldb-cmake-matrix/clang_900_build/bin/clang-9-x86_64) :: test_step_in_template_with_python_api_dwo (TestInlineStepping.TestInlineStepping) (test case does not fall in any category of interest for this run) UNSUPPORTED: LLDB (/Users/buildslave/jenkins/workspace/lldb-cmake-matrix/clang_900_build/bin/clang-9-x86_64) :: test_step_in_template_with_python_api_gmodules (TestInlineStepping.TestInlineStepping) (test case does not fall in any category of interest for this run) runCmd: settings set symbols.enable-external-lookup false output:

Hide Details

runCmd: settings set plugin.process.gdb-remote.packet-timeout 60 output:

Hide Details

runCmd: settings set symbols.clang-modules-cache-path "/Users/buildslave/jenkins/workspace/lldb-cmake-matrix/lldb-build/tools/lldb/lldb-test-build.noindex/module-cache-lldb/lldb-api" output:

Hide Details

runCmd: settings set use-color false output:

Hide Details

warning: (x86_64) /Users/buildslave/jenkins/workspace/lldb-cmake-matrix/lldb-build/tools/lldb/lldb-test-build.noindex/functionalities/inline-stepping/TestInlineStepping.test_step_over_with_python_api_dsym/a.out empty dSYM file detected, dSYM was created with an executable with no debug info. FAIL: LLDB (/Users/buildslave/jenkins/workspace/lldb-cmake-matrix/clang_900_build/bin/clang-9-x86_64) :: test_step_over_with_python_api_dsym (TestInlineStepping.TestInlineStepping) <bound method SBProcess.Kill of <lldb.SBProcess; proxy of <Swig Object of type 'lldb::SBProcess *' at 0x13246e1b0> >>: success

Hide Details

runCmd: settings set symbols.enable-external-lookup false output:

Hide Details

runCmd: settings set plugin.process.gdb-remote.packet-timeout 60 output:

Hide Details

runCmd: settings set symbols.clang-modules-cache-path "/Users/buildslave/jenkins/workspace/lldb-cmake-matrix/lldb-build/tools/lldb/lldb-test-build.noindex/module-cache-lldb/lldb-api" output:

Hide Details

runCmd: settings set use-color false output:

Hide Details

FAIL: LLDB (/Users/buildslave/jenkins/workspace/lldb-cmake-matrix/clang_900_build/bin/clang-9-x86_64) :: test_step_over_with_python_api_dwarf (TestInlineStepping.TestInlineStepping) <bound method SBProcess.Kill of <lldb.SBProcess; proxy of <Swig Object of type 'lldb::SBProcess *' at 0x132459f90> >>: success

Hide Details

UNSUPPORTED: LLDB (/Users/buildslave/jenkins/workspace/lldb-cmake-matrix/clang_900_build/bin/clang-9-x86_64) :: test_step_over_with_python_api_dwo (TestInlineStepping.TestInlineStepping) (test case does not fall in any category of interest for this run) UNSUPPORTED: LLDB (/Users/buildslave/jenkins/workspace/lldb-cmake-matrix/clang_900_build/bin/clang-9-x86_64) :: test_step_over_with_python_api_gmodules (TestInlineStepping.TestInlineStepping) (test case does not fall in any category of interest for this run) runCmd: settings set symbols.enable-external-lookup false output:

Hide Details

runCmd: settings set plugin.process.gdb-remote.packet-timeout 60 output:

Hide Details

runCmd: settings set symbols.clang-modules-cache-path "/Users/buildslave/jenkins/workspace/lldb-cmake-matrix/lldb-build/tools/lldb/lldb-test-build.noindex/module-cache-lldb/lldb-api" output:

Hide Details

runCmd: settings set use-color false output:

Hide Details

warning: (x86_64) /Users/buildslave/jenkins/workspace/lldb-cmake-matrix/lldb-build/tools/lldb/lldb-test-build.noindex/functionalities/inline-stepping/TestInlineStepping.test_with_python_api_dsym/a.out empty dSYM file detected, dSYM was created with an executable with no debug info. FAIL: LLDB (/Users/buildslave/jenkins/workspace/lldb-cmake-matrix/clang_900_build/bin/clang-9-x86_64) :: test_with_python_api_dsym (TestInlineStepping.TestInlineStepping) <bound method SBProcess.Kill of <lldb.SBProcess; proxy of <Swig Object of type 'lldb::SBProcess *' at 0x133728f30> >>: success

Hide Details

runCmd: settings set symbols.enable-external-lookup false output:

Hide Details

runCmd: settings set plugin.process.gdb-remote.packet-timeout 60 output:

Hide Details

runCmd: settings set symbols.clang-modules-cache-path "/Users/buildslave/jenkins/workspace/lldb-cmake-matrix/lldb-build/tools/lldb/lldb-test-build.noindex/module-cache-lldb/lldb-api" output:

Hide Details

runCmd: settings set use-color false output:

Hide Details

FAIL: LLDB (/Users/buildslave/jenkins/workspace/lldb-cmake-matrix/clang_900_build/bin/clang-9-x86_64) :: test_with_python_api_dwarf (TestInlineStepping.TestInlineStepping) <bound method SBProcess.Kill of <lldb.SBProcess; proxy of <Swig Object of type 'lldb::SBProcess *' at 0x133746c60> >>: success

Hide Details

UNSUPPORTED: LLDB (/Users/buildslave/jenkins/workspace/lldb-cmake-matrix/clang_900_build/bin/clang-9-x86_64) :: test_with_python_api_dwo (TestInlineStepping.TestInlineStepping) (test case does not fall in any category of interest for this run) UNSUPPORTED: LLDB (/Users/buildslave/jenkins/workspace/lldb-cmake-matrix/clang_900_build/bin/clang-9-x86_64) :: test_with_python_api_gmodules (TestInlineStepping.TestInlineStepping) (test case does not fall in any category of interest for this run) Restore dir to: /Users/buildslave/jenkins/workspace/lldb-cmake-matrix/lldb-build/tools/lldb/test ====================================================================== FAIL: test_step_in_template_with_python_api_dsym (TestInlineStepping.TestInlineStepping) Test stepping in to templated functions. ---------------------------------------------------------------------- Traceback (most recent call last): File "/Users/buildslave/jenkins/workspace/lldb-cmake-matrix/llvm-project/lldb/packages/Python/lldbsuite/test/lldbtest.py", line 1748, in test_method return attrvalue(self) File "/Users/buildslave/jenkins/workspace/lldb-cmake-matrix/llvm-project/lldb/packages/Python/lldbsuite/test/decorators.py", line 111, in wrapper func(*args, **kwargs) File "/Users/buildslave/jenkins/workspace/lldb-cmake-matrix/llvm-project/lldb/packages/Python/lldbsuite/test/functionalities/inline-stepping/TestInlineStepping.py", line 37, in test_step_in_template_with_python_api self.step_in_template() File "/Users/buildslave/jenkins/workspace/lldb-cmake-matrix/llvm-project/lldb/packages/Python/lldbsuite/test/functionalities/inline-stepping/TestInlineStepping.py", line 313, in step_in_template self.fail("Failed to stop at first breakpoint in main.") AssertionError: Failed to stop at first breakpoint in main. Config=x86_64-/Users/buildslave/jenkins/workspace/lldb-cmake-matrix/clang_900_build/bin/clang-9 ====================================================================== FAIL: test_step_in_template_with_python_api_dwarf (TestInlineStepping.TestInlineStepping) Test stepping in to templated functions. ---------------------------------------------------------------------- Traceback (most recent call last): File "/Users/buildslave/jenkins/workspace/lldb-cmake-matrix/llvm-project/lldb/packages/Python/lldbsuite/test/lldbtest.py", line 1748, in test_method return attrvalue(self) File "/Users/buildslave/jenkins/workspace/lldb-cmake-matrix/llvm-project/lldb/packages/Python/lldbsuite/test/decorators.py", line 111, in wrapper func(*args, **kwargs) File "/Users/buildslave/jenkins/workspace/lldb-cmake-matrix/llvm-project/lldb/packages/Python/lldbsuite/test/functionalities/inline-stepping/TestInlineStepping.py", line 37, in test_step_in_template_with_python_api self.step_in_template() File "/Users/buildslave/jenkins/workspace/lldb-cmake-matrix/llvm-project/lldb/packages/Python/lldbsuite/test/functionalities/inline-stepping/TestInlineStepping.py", line 313, in step_in_template self.fail("Failed to stop at first breakpoint in main.") AssertionError: Failed to stop at first breakpoint in main. Config=x86_64-/Users/buildslave/jenkins/workspace/lldb-cmake-matrix/clang_900_build/bin/clang-9 ====================================================================== FAIL: test_step_over_with_python_api_dsym (TestInlineStepping.TestInlineStepping) Test stepping over and into inlined functions. ---------------------------------------------------------------------- Traceback (most recent call last): File "/Users/buildslave/jenkins/workspace/lldb-cmake-matrix/llvm-project/lldb/packages/Python/lldbsuite/test/lldbtest.py", line 1748, in test_method return attrvalue(self) File "/Users/buildslave/jenkins/workspace/lldb-cmake-matrix/llvm-project/lldb/packages/Python/lldbsuite/test/functionalities/inline-stepping/TestInlineStepping.py", line 30, in test_step_over_with_python_api self.inline_stepping_step_over() File "/Users/buildslave/jenkins/workspace/lldb-cmake-matrix/llvm-project/lldb/packages/Python/lldbsuite/test/functionalities/inline-stepping/TestInlineStepping.py", line 279, in inline_stepping_step_over self.fail("Failed to stop at first breakpoint in main.") AssertionError: Failed to stop at first breakpoint in main. Config=x86_64-/Users/buildslave/jenkins/workspace/lldb-cmake-matrix/clang_900_build/bin/clang-9 ====================================================================== FAIL: test_step_over_with_python_api_dwarf (TestInlineStepping.TestInlineStepping) Test stepping over and into inlined functions. ---------------------------------------------------------------------- Traceback (most recent call last): File "/Users/buildslave/jenkins/workspace/lldb-cmake-matrix/llvm-project/lldb/packages/Python/lldbsuite/test/lldbtest.py", line 1748, in test_method return attrvalue(self) File "/Users/buildslave/jenkins/workspace/lldb-cmake-matrix/llvm-project/lldb/packages/Python/lldbsuite/test/functionalities/inline-stepping/TestInlineStepping.py", line 30, in test_step_over_with_python_api self.inline_stepping_step_over() File "/Users/buildslave/jenkins/workspace/lldb-cmake-matrix/llvm-project/lldb/packages/Python/lldbsuite/test/functionalities/inline-stepping/TestInlineStepping.py", line 279, in inline_stepping_step_over self.fail("Failed to stop at first breakpoint in main.") AssertionError: Failed to stop at first breakpoint in main. Config=x86_64-/Users/buildslave/jenkins/workspace/lldb-cmake-matrix/clang_900_build/bin/clang-9 ====================================================================== FAIL: test_with_python_api_dsym (TestInlineStepping.TestInlineStepping) Test stepping over and into inlined functions. ---------------------------------------------------------------------- Traceback (most recent call last): File "/Users/buildslave/jenkins/workspace/lldb-cmake-matrix/llvm-project/lldb/packages/Python/lldbsuite/test/lldbtest.py", line 1748, in test_method return attrvalue(self) File "/Users/buildslave/jenkins/workspace/lldb-cmake-matrix/llvm-project/lldb/packages/Python/lldbsuite/test/decorators.py", line 111, in wrapper func(*args, **kwargs) File "/Users/buildslave/jenkins/workspace/lldb-cmake-matrix/llvm-project/lldb/packages/Python/lldbsuite/test/decorators.py", line 111, in wrapper func(*args, **kwargs) File "/Users/buildslave/jenkins/workspace/lldb-cmake-matrix/llvm-project/lldb/packages/Python/lldbsuite/test/functionalities/inline-stepping/TestInlineStepping.py", line 24, in test_with_python_api self.inline_stepping() File "/Users/buildslave/jenkins/workspace/lldb-cmake-matrix/llvm-project/lldb/packages/Python/lldbsuite/test/functionalities/inline-stepping/TestInlineStepping.py", line 167, in inline_stepping self.fail("Failed to stop at first breakpoint in main.") AssertionError: Failed to stop at first breakpoint in main. Config=x86_64-/Users/buildslave/jenkins/workspace/lldb-cmake-matrix/clang_900_build/bin/clang-9 ====================================================================== FAIL: test_with_python_api_dwarf (TestInlineStepping.TestInlineStepping) Test stepping over and into inlined functions. ---------------------------------------------------------------------- Traceback (most recent call last): File "/Users/buildslave/jenkins/workspace/lldb-cmake-matrix/llvm-project/lldb/packages/Python/lldbsuite/test/lldbtest.py", line 1748, in test_method return attrvalue(self) File "/Users/buildslave/jenkins/workspace/lldb-cmake-matrix/llvm-project/lldb/packages/Python/lldbsuite/test/decorators.py", line 111, in wrapper func(*args, **kwargs) File "/Users/buildslave/jenkins/workspace/lldb-cmake-matrix/llvm-project/lldb/packages/Python/lldbsuite/test/decorators.py", line 111, in wrapper func(*args, **kwargs) File "/Users/buildslave/jenkins/workspace/lldb-cmake-matrix/llvm-project/lldb/packages/Python/lldbsuite/test/functionalities/inline-stepping/TestInlineStepping.py", line 24, in test_with_python_api self.inline_stepping() File "/Users/buildslave/jenkins/workspace/lldb-cmake-matrix/llvm-project/lldb/packages/Python/lldbsuite/test/functionalities/inline-stepping/TestInlineStepping.py", line 167, in inline_stepping self.fail("Failed to stop at first breakpoint in main.") AssertionError: Failed to stop at first breakpoint in main. Config=x86_64-/Users/buildslave/jenkins/workspace/lldb-cmake-matrix/clang_900_build/bin/clang-9 ---------------------------------------------------------------------- Ran 12 tests in 8.474s

Hide Details

RESULT: FAILED (0 passes, 6 failures, 0 errors, 6 skipped, 0 expected failures, 0 unexpected successes)

Hide Details

******************** FAIL: lldb-api :: functionalities/data-formatter/nsarraysynth/TestNSArraySynthetic.py (1782 of 1788) ******************** TEST 'lldb-api :: functionalities/data-formatter/nsarraysynth/TestNSArraySynthetic.py' FAILED ******************** lldb version 10.0.99 (http://labmaster3.local/git/llvm-project.git revision bfaa1082e126d922efbf5364f469f23ea1598da8) clang revision 6bfdebb412d87890c9c727a5975aed9cda66bf33 llvm revision 6bfdebb412d87890c9c727a5975aed9cda66bf33 LLDB library dir: /Users/buildslave/jenkins/workspace/lldb-cmake-matrix/lldb-build/bin LLDB import library dir: /Users/buildslave/jenkins/workspace/lldb-cmake-matrix/lldb-build/bin libstdcxx tests will not be run because: Don't know how to build with libstdcxx on macosx Skipping following debug info categories: ['dwo']

Hide Details

Session logs for test failures/errors/unexpected successes will go into directory '/Users/buildslave/jenkins/workspace/lldb-cmake-matrix/test/logs' Command invoked: /Users/buildslave/jenkins/workspace/lldb-cmake-matrix/llvm-project/lldb/test/API/dotest.py --arch=x86_64 -s /Users/buildslave/jenkins/workspace/lldb-cmake-matrix/lldb-build/lldb-test-traces -S nm -u CXXFLAGS -u CFLAGS --executable /Users/buildslave/jenkins/workspace/lldb-cmake-matrix/lldb-build/./bin/lldb --dsymutil /Users/buildslave/jenkins/workspace/lldb-cmake-matrix/lldb-build/./bin/dsymutil --filecheck /Users/buildslave/jenkins/workspace/lldb-cmake-matrix/lldb-build/./bin/FileCheck -C /Users/buildslave/jenkins/workspace/lldb-cmake-matrix/clang_900_build/bin/clang --codesign-identity lldb_codesign --server /Users/buildslave/jenkins/workspace/lldb-cmake-matrix/lldb-build/./bin/debugserver --arch x86_64 --build-dir /Users/buildslave/jenkins/workspace/lldb-cmake-matrix/lldb-build/lldb-test-build.noindex -s=/Users/buildslave/jenkins/workspace/lldb-cmake-matrix/test/logs -t --env TERM=vt100 --skip-category gmodules --skip-category watchpoint --arch=x86_64 --dwarf-version=5 --env LLVM_LIBS_DIR=/Users/buildslave/jenkins/workspace/lldb-cmake-matrix/lldb-build/./lib --build-dir /Users/buildslave/jenkins/workspace/lldb-cmake-matrix/lldb-build/tools/lldb/lldb-test-build.noindex --lldb-module-cache-dir /Users/buildslave/jenkins/workspace/lldb-cmake-matrix/lldb-build/tools/lldb/lldb-test-build.noindex/module-cache-lldb/lldb-api --clang-module-cache-dir /Users/buildslave/jenkins/workspace/lldb-cmake-matrix/lldb-build/tools/lldb/lldb-test-build.noindex/module-cache-clang/lldb-api /Users/buildslave/jenkins/workspace/lldb-cmake-matrix/llvm-project/lldb/packages/Python/lldbsuite/test/functionalities/data-formatter/nsarraysynth -p TestNSArraySynthetic.py Change dir to: /Users/buildslave/jenkins/workspace/lldb-cmake-matrix/llvm-project/lldb/packages/Python/lldbsuite/test/functionalities/data-formatter/nsarraysynth runCmd: settings set symbols.enable-external-lookup false output:

Hide Details

runCmd: settings set plugin.process.gdb-remote.packet-timeout 60 output:

Hide Details

runCmd: settings set symbols.clang-modules-cache-path "/Users/buildslave/jenkins/workspace/lldb-cmake-matrix/lldb-build/tools/lldb/lldb-test-build.noindex/module-cache-lldb/lldb-api" output:

Hide Details

runCmd: settings set use-color false output:

Hide Details

warning: (x86_64) /Users/buildslave/jenkins/workspace/lldb-cmake-matrix/lldb-build/tools/lldb/lldb-test-build.noindex/functionalities/data-formatter/nsarraysynth/TestNSArraySynthetic.test_rdar11086338_with_run_command_dsym/a.out empty dSYM file detected, dSYM was created with an executable with no debug info. runCmd: file /Users/buildslave/jenkins/workspace/lldb-cmake-matrix/lldb-build/tools/lldb/lldb-test-build.noindex/functionalities/data-formatter/nsarraysynth/TestNSArraySynthetic.test_rdar11086338_with_run_command_dsym/a.out output: Current executable set to '/Users/buildslave/jenkins/workspace/lldb-cmake-matrix/lldb-build/tools/lldb/lldb-test-build.noindex/functionalities/data-formatter/nsarraysynth/TestNSArraySynthetic.test_rdar11086338_with_run_command_dsym/a.out' (x86_64).

Hide Details

Hide Details

runCmd: breakpoint set -f "main.m" -l 31 output: Breakpoint 1: no locations (pending). WARNING: Unable to resolve breakpoint to any actual locations.

Hide Details

Hide Details

Expecting pattern: ^Breakpoint (?P<bpno>[0-9]+): (?P<num_locations>[0-9]+) locations\.$ Not matched

Hide Details

Expecting pattern: ^Breakpoint (?P<bpno>[0-9]+): (?P<num_locations>no) locations \(pending\)\. Matched

Hide Details

FAIL: LLDB (/Users/buildslave/jenkins/workspace/lldb-cmake-matrix/clang_900_build/bin/clang-9-x86_64) :: test_rdar11086338_with_run_command_dsym (TestNSArraySynthetic.NSArraySyntheticTestCase) runCmd: settings set symbols.enable-external-lookup false output:

Hide Details

runCmd: settings set plugin.process.gdb-remote.packet-timeout 60 output:

Hide Details

runCmd: settings set symbols.clang-modules-cache-path "/Users/buildslave/jenkins/workspace/lldb-cmake-matrix/lldb-build/tools/lldb/lldb-test-build.noindex/module-cache-lldb/lldb-api" output:

Hide Details

runCmd: settings set use-color false output:

Hide Details

runCmd: file /Users/buildslave/jenkins/workspace/lldb-cmake-matrix/lldb-build/tools/lldb/lldb-test-build.noindex/functionalities/data-formatter/nsarraysynth/TestNSArraySynthetic.test_rdar11086338_with_run_command_dwarf/a.out output: Current executable set to '/Users/buildslave/jenkins/workspace/lldb-cmake-matrix/lldb-build/tools/lldb/lldb-test-build.noindex/functionalities/data-formatter/nsarraysynth/TestNSArraySynthetic.test_rdar11086338_with_run_command_dwarf/a.out' (x86_64).

Hide Details

Hide Details

runCmd: breakpoint set -f "main.m" -l 31 output: Breakpoint 1: no locations (pending). WARNING: Unable to resolve breakpoint to any actual locations.

Hide Details

Hide Details

Expecting pattern: ^Breakpoint (?P<bpno>[0-9]+): (?P<num_locations>[0-9]+) locations\.$ Not matched

Hide Details

Expecting pattern: ^Breakpoint (?P<bpno>[0-9]+): (?P<num_locations>no) locations \(pending\)\. Matched

Hide Details

FAIL: LLDB (/Users/buildslave/jenkins/workspace/lldb-cmake-matrix/clang_900_build/bin/clang-9-x86_64) :: test_rdar11086338_with_run_command_dwarf (TestNSArraySynthetic.NSArraySyntheticTestCase) UNSUPPORTED: LLDB (/Users/buildslave/jenkins/workspace/lldb-cmake-matrix/clang_900_build/bin/clang-9-x86_64) :: test_rdar11086338_with_run_command_dwo (TestNSArraySynthetic.NSArraySyntheticTestCase) (test case does not fall in any category of interest for this run) UNSUPPORTED: LLDB (/Users/buildslave/jenkins/workspace/lldb-cmake-matrix/clang_900_build/bin/clang-9-x86_64) :: test_rdar11086338_with_run_command_gmodules (TestNSArraySynthetic.NSArraySyntheticTestCase) (test case does not fall in any category of interest for this run) Restore dir to: /Users/buildslave/jenkins/workspace/lldb-cmake-matrix/lldb-build/tools/lldb/test ====================================================================== FAIL: test_rdar11086338_with_run_command_dsym (TestNSArraySynthetic.NSArraySyntheticTestCase) Test that NSArray reports its synthetic children properly. ---------------------------------------------------------------------- Traceback (most recent call last): File "/Users/buildslave/jenkins/workspace/lldb-cmake-matrix/llvm-project/lldb/packages/Python/lldbsuite/test/lldbtest.py", line 1748, in test_method return attrvalue(self) File "/Users/buildslave/jenkins/workspace/lldb-cmake-matrix/llvm-project/lldb/packages/Python/lldbsuite/test/functionalities/data-formatter/nsarraysynth/TestNSArraySynthetic.py", line 31, in test_rdar11086338_with_run_command self, "main.m", self.line, num_expected_locations=1, loc_exact=True) File "/Users/buildslave/jenkins/workspace/lldb-cmake-matrix/llvm-project/lldb/packages/Python/lldbsuite/test/lldbutil.py", line 383, in run_break_set_by_file_and_line module_name=module_name) File "/Users/buildslave/jenkins/workspace/lldb-cmake-matrix/llvm-project/lldb/packages/Python/lldbsuite/test/lldbutil.py", line 584, in check_breakpoint_result out_num_locations)) AssertionError: False is not True : Expecting 1 locations, got 0. Config=x86_64-/Users/buildslave/jenkins/workspace/lldb-cmake-matrix/clang_900_build/bin/clang-9 ====================================================================== FAIL: test_rdar11086338_with_run_command_dwarf (TestNSArraySynthetic.NSArraySyntheticTestCase) Test that NSArray reports its synthetic children properly. ---------------------------------------------------------------------- Traceback (most recent call last): File "/Users/buildslave/jenkins/workspace/lldb-cmake-matrix/llvm-project/lldb/packages/Python/lldbsuite/test/lldbtest.py", line 1748, in test_method return attrvalue(self) File "/Users/buildslave/jenkins/workspace/lldb-cmake-matrix/llvm-project/lldb/packages/Python/lldbsuite/test/functionalities/data-formatter/nsarraysynth/TestNSArraySynthetic.py", line 31, in test_rdar11086338_with_run_command self, "main.m", self.line, num_expected_locations=1, loc_exact=True) File "/Users/buildslave/jenkins/workspace/lldb-cmake-matrix/llvm-project/lldb/packages/Python/lldbsuite/test/lldbutil.py", line 383, in run_break_set_by_file_and_line module_name=module_name) File "/Users/buildslave/jenkins/workspace/lldb-cmake-matrix/llvm-project/lldb/packages/Python/lldbsuite/test/lldbutil.py", line 584, in check_breakpoint_result out_num_locations)) AssertionError: False is not True : Expecting 1 locations, got 0. Config=x86_64-/Users/buildslave/jenkins/workspace/lldb-cmake-matrix/clang_900_build/bin/clang-9 ---------------------------------------------------------------------- Ran 4 tests in 4.898s

Hide Details

RESULT: FAILED (0 passes, 2 failures, 0 errors, 2 skipped, 0 expected failures, 0 unexpected successes)

Hide Details

******************** FAIL: lldb-api :: commands/gui/basic/TestGuiBasic.py (1783 of 1788) ******************** TEST 'lldb-api :: commands/gui/basic/TestGuiBasic.py' FAILED ******************** lldb version 10.0.99 (http://labmaster3.local/git/llvm-project.git revision bfaa1082e126d922efbf5364f469f23ea1598da8) clang revision 6bfdebb412d87890c9c727a5975aed9cda66bf33 llvm revision 6bfdebb412d87890c9c727a5975aed9cda66bf33 LLDB library dir: /Users/buildslave/jenkins/workspace/lldb-cmake-matrix/lldb-build/bin LLDB import library dir: /Users/buildslave/jenkins/workspace/lldb-cmake-matrix/lldb-build/bin libstdcxx tests will not be run because: Don't know how to build with libstdcxx on macosx Skipping following debug info categories: ['dwo'] (lldb) settings set symbols.enable-external-lookup false (lldb) settings set plugin.process.gdb-remote.packet-timeout 60 (lldb) settings set symbols.clang-modules-cache-path "/Users/buildslave/jenkins/workspace/lldb-cmake-matrix/lldb-build/tools/lldb/lldb-test-build.noindex/module-cache-lldb/lldb-api" (lldb) settings set use-color false (lldb) target create "/Users/buildslave/jenkins/workspace/lldb-cmake-matrix/lldb-build/tools/lldb/lldb-test-build.noindex/commands/gui/basic/TestGuiBasic.test_gui/a.out" warning: (x86_64) /Users/buildslave/jenkins/workspace/lldb-cmake-matrix/lldb-build/tools/lldb/lldb-test-build.noindex/commands/gui/basic/TestGuiBasic.test_gui/a.out empty dSYM file detected, dSYM was created with an executable with no debug info. Current executable set to '/Users/buildslave/jenkins/workspace/lldb-cmake-matrix/lldb-build/tools/lldb/lldb-test-build.noindex/commands/gui/basic/TestGuiBasic.test_gui/a.out' (x86_64). (lldb) br set -f main.c -p "// Break here" br set -f main.c -p "// Break here" Breakpoint 1: no locations (pending). WARNING: Unable to resolve breakpoint to any actual locations. (lldb) settings set interpreter.prompt-on-quit false quit settings set interpreter.prompt-on-quit false (lldb) quit

Hide Details

Session logs for test failures/errors/unexpected successes will go into directory '/Users/buildslave/jenkins/workspace/lldb-cmake-matrix/test/logs' Command invoked: /Users/buildslave/jenkins/workspace/lldb-cmake-matrix/llvm-project/lldb/test/API/dotest.py --arch=x86_64 -s /Users/buildslave/jenkins/workspace/lldb-cmake-matrix/lldb-build/lldb-test-traces -S nm -u CXXFLAGS -u CFLAGS --executable /Users/buildslave/jenkins/workspace/lldb-cmake-matrix/lldb-build/./bin/lldb --dsymutil /Users/buildslave/jenkins/workspace/lldb-cmake-matrix/lldb-build/./bin/dsymutil --filecheck /Users/buildslave/jenkins/workspace/lldb-cmake-matrix/lldb-build/./bin/FileCheck -C /Users/buildslave/jenkins/workspace/lldb-cmake-matrix/clang_900_build/bin/clang --codesign-identity lldb_codesign --server /Users/buildslave/jenkins/workspace/lldb-cmake-matrix/lldb-build/./bin/debugserver --arch x86_64 --build-dir /Users/buildslave/jenkins/workspace/lldb-cmake-matrix/lldb-build/lldb-test-build.noindex -s=/Users/buildslave/jenkins/workspace/lldb-cmake-matrix/test/logs -t --env TERM=vt100 --skip-category gmodules --skip-category watchpoint --arch=x86_64 --dwarf-version=5 --env LLVM_LIBS_DIR=/Users/buildslave/jenkins/workspace/lldb-cmake-matrix/lldb-build/./lib --build-dir /Users/buildslave/jenkins/workspace/lldb-cmake-matrix/lldb-build/tools/lldb/lldb-test-build.noindex --lldb-module-cache-dir /Users/buildslave/jenkins/workspace/lldb-cmake-matrix/lldb-build/tools/lldb/lldb-test-build.noindex/module-cache-lldb/lldb-api --clang-module-cache-dir /Users/buildslave/jenkins/workspace/lldb-cmake-matrix/lldb-build/tools/lldb/lldb-test-build.noindex/module-cache-clang/lldb-api /Users/buildslave/jenkins/workspace/lldb-cmake-matrix/llvm-project/lldb/packages/Python/lldbsuite/test/commands/gui/basic -p TestGuiBasic.py Change dir to: /Users/buildslave/jenkins/workspace/lldb-cmake-matrix/llvm-project/lldb/packages/Python/lldbsuite/test/commands/gui/basic runCmd: settings set symbols.enable-external-lookup false output:

Hide Details

runCmd: settings set plugin.process.gdb-remote.packet-timeout 60 output:

Hide Details

runCmd: settings set symbols.clang-modules-cache-path "/Users/buildslave/jenkins/workspace/lldb-cmake-matrix/lldb-build/tools/lldb/lldb-test-build.noindex/module-cache-lldb/lldb-api" output:

Hide Details

runCmd: settings set use-color false output:

Hide Details

FAIL: LLDB (/Users/buildslave/jenkins/workspace/lldb-cmake-matrix/clang_900_build/bin/clang-9-x86_64) :: test_gui (TestGuiBasic.BasicGuiCommandTest) tearing down the child process....

Hide Details

Restore dir to: /Users/buildslave/jenkins/workspace/lldb-cmake-matrix/lldb-build/tools/lldb/test ====================================================================== ERROR: test_gui (TestGuiBasic.BasicGuiCommandTest) ---------------------------------------------------------------------- Traceback (most recent call last): File "/Users/buildslave/jenkins/workspace/lldb-cmake-matrix/llvm-project/lldb/packages/Python/lldbsuite/test/commands/gui/basic/TestGuiBasic.py", line 19, in test_gui self.expect('br set -f main.c -p "// Break here"', substrs=["Breakpoint 1", "address ="]) File "/Users/buildslave/jenkins/workspace/lldb-cmake-matrix/llvm-project/lldb/packages/Python/lldbsuite/test/lldbpexpect.py", line 56, in expect self.child.expect_exact(s) File "/Users/buildslave/jenkins/workspace/lldb-cmake-matrix/llvm-project/lldb/third_party/Python/module/pexpect-4.6/pexpect/spawnbase.py", line 418, in expect_exact return exp.expect_loop(timeout) File "/Users/buildslave/jenkins/workspace/lldb-cmake-matrix/llvm-project/lldb/third_party/Python/module/pexpect-4.6/pexpect/expect.py", line 119, in expect_loop return self.timeout(e) File "/Users/buildslave/jenkins/workspace/lldb-cmake-matrix/llvm-project/lldb/third_party/Python/module/pexpect-4.6/pexpect/expect.py", line 82, in timeout raise TIMEOUT(msg) TIMEOUT: Timeout exceeded. <pexpect.pty_spawn.spawn object at 0x1324f7c10> command: /Users/buildslave/jenkins/workspace/lldb-cmake-matrix/lldb-build/bin/lldb args: ['/Users/buildslave/jenkins/workspace/lldb-cmake-matrix/lldb-build/bin/lldb', '--no-lldbinit', '--no-use-colors', '-O', 'settings set symbols.enable-external-lookup false', '-O', 'settings set plugin.process.gdb-remote.packet-timeout 60', '-O', 'settings set symbols.clang-modules-cache-path "/Users/buildslave/jenkins/workspace/lldb-cmake-matrix/lldb-build/tools/lldb/lldb-test-build.noindex/module-cache-lldb/lldb-api"', '-O', 'settings set use-color false', '--file', '/Users/buildslave/jenkins/workspace/lldb-cmake-matrix/lldb-build/tools/lldb/lldb-test-build.noindex/commands/gui/basic/TestGuiBasic.test_gui/a.out'] buffer (last 100 chars): ': no locations (pending).\r\nWARNING: Unable to resolve breakpoint to any actual locations.\r\n(lldb) ' before (last 100 chars): ': no locations (pending).\r\nWARNING: Unable to resolve breakpoint to any actual locations.\r\n(lldb) ' after: <class 'pexpect.exceptions.TIMEOUT'> match: None match_index: None exitstatus: None flag_eof: False pid: 40302 child_fd: 6 closed: False timeout: 30 delimiter: <class 'pexpect.exceptions.EOF'> logfile: <open file '<stdout>', mode 'w' at 0x1061a1150> logfile_read: None logfile_send: None maxread: 2000 ignorecase: False searchwindowsize: None delaybeforesend: 0.05 delayafterclose: 0.1 delayafterterminate: 0.1 searcher: searcher_string: 0: 'address =' Config=x86_64-/Users/buildslave/jenkins/workspace/lldb-cmake-matrix/clang_900_build/bin/clang-9 ---------------------------------------------------------------------- Ran 1 test in 31.100s

Hide Details

RESULT: FAILED (0 passes, 0 failures, 1 errors, 0 skipped, 0 expected failures, 0 unexpected successes)

Hide Details

******************** FAIL: lldb-api :: functionalities/inferior-crashing/TestInferiorCrashingStep.py (1784 of 1788) ******************** TEST 'lldb-api :: functionalities/inferior-crashing/TestInferiorCrashingStep.py' FAILED ******************** lldb version 10.0.99 (http://labmaster3.local/git/llvm-project.git revision bfaa1082e126d922efbf5364f469f23ea1598da8) clang revision 6bfdebb412d87890c9c727a5975aed9cda66bf33 llvm revision 6bfdebb412d87890c9c727a5975aed9cda66bf33 LLDB library dir: /Users/buildslave/jenkins/workspace/lldb-cmake-matrix/lldb-build/bin LLDB import library dir: /Users/buildslave/jenkins/workspace/lldb-cmake-matrix/lldb-build/bin libstdcxx tests will not be run because: Don't know how to build with libstdcxx on macosx Skipping following debug info categories: ['dwo'] Stack trace for thread id=0x17fb21f name=None queue=com.apple.main-thread stop reason=exception frame #0: 0x00000100d94f50 a.out`main + 48 frame #1: 0x007fff60f94085 libdyld.dylib`start + 1 frame #2: 0x007fff60f94085 libdyld.dylib`start + 1 Stack trace for thread id=0x17fb2cd name=None queue=com.apple.main-thread stop reason=exception frame #0: 0x000001036bff50 a.out`main + 48 frame #1: 0x007fff60f94085 libdyld.dylib`start + 1

Hide Details

Session logs for test failures/errors/unexpected successes will go into directory '/Users/buildslave/jenkins/workspace/lldb-cmake-matrix/test/logs' Command invoked: /Users/buildslave/jenkins/workspace/lldb-cmake-matrix/llvm-project/lldb/test/API/dotest.py --arch=x86_64 -s /Users/buildslave/jenkins/workspace/lldb-cmake-matrix/lldb-build/lldb-test-traces -S nm -u CXXFLAGS -u CFLAGS --executable /Users/buildslave/jenkins/workspace/lldb-cmake-matrix/lldb-build/./bin/lldb --dsymutil /Users/buildslave/jenkins/workspace/lldb-cmake-matrix/lldb-build/./bin/dsymutil --filecheck /Users/buildslave/jenkins/workspace/lldb-cmake-matrix/lldb-build/./bin/FileCheck -C /Users/buildslave/jenkins/workspace/lldb-cmake-matrix/clang_900_build/bin/clang --codesign-identity lldb_codesign --server /Users/buildslave/jenkins/workspace/lldb-cmake-matrix/lldb-build/./bin/debugserver --arch x86_64 --build-dir /Users/buildslave/jenkins/workspace/lldb-cmake-matrix/lldb-build/lldb-test-build.noindex -s=/Users/buildslave/jenkins/workspace/lldb-cmake-matrix/test/logs -t --env TERM=vt100 --skip-category gmodules --skip-category watchpoint --arch=x86_64 --dwarf-version=5 --env LLVM_LIBS_DIR=/Users/buildslave/jenkins/workspace/lldb-cmake-matrix/lldb-build/./lib --build-dir /Users/buildslave/jenkins/workspace/lldb-cmake-matrix/lldb-build/tools/lldb/lldb-test-build.noindex --lldb-module-cache-dir /Users/buildslave/jenkins/workspace/lldb-cmake-matrix/lldb-build/tools/lldb/lldb-test-build.noindex/module-cache-lldb/lldb-api --clang-module-cache-dir /Users/buildslave/jenkins/workspace/lldb-cmake-matrix/lldb-build/tools/lldb/lldb-test-build.noindex/module-cache-clang/lldb-api /Users/buildslave/jenkins/workspace/lldb-cmake-matrix/llvm-project/lldb/packages/Python/lldbsuite/test/functionalities/inferior-crashing -p TestInferiorCrashingStep.py Change dir to: /Users/buildslave/jenkins/workspace/lldb-cmake-matrix/llvm-project/lldb/packages/Python/lldbsuite/test/functionalities/inferior-crashing runCmd: settings set symbols.enable-external-lookup false output:

Hide Details

runCmd: settings set plugin.process.gdb-remote.packet-timeout 60 output:

Hide Details

runCmd: settings set symbols.clang-modules-cache-path "/Users/buildslave/jenkins/workspace/lldb-cmake-matrix/lldb-build/tools/lldb/lldb-test-build.noindex/module-cache-lldb/lldb-api" output:

Hide Details

runCmd: settings set use-color false output:

Hide Details

warning: (x86_64) /Users/buildslave/jenkins/workspace/lldb-cmake-matrix/lldb-build/tools/lldb/lldb-test-build.noindex/functionalities/inferior-crashing/TestInferiorCrashingStep.test_inferior_crashing_dsym/a.out empty dSYM file detected, dSYM was created with an executable with no debug info. runCmd: file /Users/buildslave/jenkins/workspace/lldb-cmake-matrix/lldb-build/tools/lldb/lldb-test-build.noindex/functionalities/inferior-crashing/TestInferiorCrashingStep.test_inferior_crashing_dsym/a.out output: Current executable set to '/Users/buildslave/jenkins/workspace/lldb-cmake-matrix/lldb-build/tools/lldb/lldb-test-build.noindex/functionalities/inferior-crashing/TestInferiorCrashingStep.test_inferior_crashing_dsym/a.out' (x86_64).

Hide Details

Hide Details

runCmd: run output: Process 48212 stopped * thread #1, queue = 'com.apple.main-thread', stop reason = EXC_BAD_ACCESS (code=1, address=0x0) frame #0: 0x0000000100000f50 a.out`main + 48 a.out`main: -> 0x100000f50 <+48>: movl (%rcx), %esi 0x100000f52 <+50>: leaq 0x4e(%rip), %rdi ; "Now crash %d\n" 0x100000f59 <+57>: movl %eax, -0x1c(%rbp) 0x100000f5c <+60>: movb $0x0, %al

Hide Details

Process 48212 launched: '/Users/buildslave/jenkins/workspace/lldb-cmake-matrix/lldb-build/tools/lldb/lldb-test-build.noindex/functionalities/inferior-crashing/TestInferiorCrashingStep.test_inferior_crashing_dsym/a.out' (x86_64)

Hide Details

Hide Details

runCmd: thread list output: Process 48212 stopped * thread #1: tid = 0x17fa8ca, 0x0000000100000f50 a.out`main + 48, queue = 'com.apple.main-thread', stop reason = EXC_BAD_ACCESS (code=1, address=0x0)

Hide Details

Hide Details

Expecting sub string: stopped Matched

Hide Details

Expecting sub string: stop reason = EXC_BAD_ACCESS Matched

Hide Details

runCmd: thread backtrace all output: * thread #1, queue = 'com.apple.main-thread', stop reason = EXC_BAD_ACCESS (code=1, address=0x0) * frame #0: 0x0000000100000f50 a.out`main + 48 frame #1: 0x00007fff60f94085 libdyld.dylib`start + 1 frame #2: 0x00007fff60f94085 libdyld.dylib`start + 1

Hide Details

Hide Details

Expecting sub string: stop reason = EXC_BAD_ACCESS Matched

Hide Details

Expecting sub string: main.c:16 Not matched

Hide Details

FAIL: LLDB (/Users/buildslave/jenkins/workspace/lldb-cmake-matrix/clang_900_build/bin/clang-9-x86_64) :: test_inferior_crashing_dsym (TestInferiorCrashingStep.CrashingInferiorStepTestCase) <bound method SBProcess.Kill of <lldb.SBProcess; proxy of <Swig Object of type 'lldb::SBProcess *' at 0x1344bc5a0> >>: success

Hide Details

runCmd: settings set symbols.enable-external-lookup false output:

Hide Details

runCmd: settings set plugin.process.gdb-remote.packet-timeout 60 output:

Hide Details

runCmd: settings set symbols.clang-modules-cache-path "/Users/buildslave/jenkins/workspace/lldb-cmake-matrix/lldb-build/tools/lldb/lldb-test-build.noindex/module-cache-lldb/lldb-api" output:

Hide Details

runCmd: settings set use-color false output:

Hide Details

runCmd: file /Users/buildslave/jenkins/workspace/lldb-cmake-matrix/lldb-build/tools/lldb/lldb-test-build.noindex/functionalities/inferior-crashing/TestInferiorCrashingStep.test_inferior_crashing_dwarf/a.out output: Current executable set to '/Users/buildslave/jenkins/workspace/lldb-cmake-matrix/lldb-build/tools/lldb/lldb-test-build.noindex/functionalities/inferior-crashing/TestInferiorCrashingStep.test_inferior_crashing_dwarf/a.out' (x86_64).

Hide Details

Hide Details

runCmd: run output: Process 48401 stopped * thread #1, queue = 'com.apple.main-thread', stop reason = EXC_BAD_ACCESS (code=1, address=0x0) frame #0: 0x0000000100000f50 a.out`main + 48 a.out`main: -> 0x100000f50 <+48>: movl (%rcx), %esi 0x100000f52 <+50>: leaq 0x4e(%rip), %rdi ; "Now crash %d\n" 0x100000f59 <+57>: movl %eax, -0x1c(%rbp) 0x100000f5c <+60>: movb $0x0, %al

Hide Details

Process 48401 launched: '/Users/buildslave/jenkins/workspace/lldb-cmake-matrix/lldb-build/tools/lldb/lldb-test-build.noindex/functionalities/inferior-crashing/TestInferiorCrashingStep.test_inferior_crashing_dwarf/a.out' (x86_64)

Hide Details

Hide Details

runCmd: thread list output: Process 48401 stopped * thread #1: tid = 0x17faa1e, 0x0000000100000f50 a.out`main + 48, queue = 'com.apple.main-thread', stop reason = EXC_BAD_ACCESS (code=1, address=0x0)

Hide Details

Hide Details

Expecting sub string: stopped Matched

Hide Details

Expecting sub string: stop reason = EXC_BAD_ACCESS Matched

Hide Details

runCmd: thread backtrace all output: * thread #1, queue = 'com.apple.main-thread', stop reason = EXC_BAD_ACCESS (code=1, address=0x0) * frame #0: 0x0000000100000f50 a.out`main + 48 frame #1: 0x00007fff60f94085 libdyld.dylib`start + 1 frame #2: 0x00007fff60f94085 libdyld.dylib`start + 1

Hide Details

Hide Details

Expecting sub string: stop reason = EXC_BAD_ACCESS Matched

Hide Details

Expecting sub string: main.c:16 Not matched

Hide Details

FAIL: LLDB (/Users/buildslave/jenkins/workspace/lldb-cmake-matrix/clang_900_build/bin/clang-9-x86_64) :: test_inferior_crashing_dwarf (TestInferiorCrashingStep.CrashingInferiorStepTestCase) <bound method SBProcess.Kill of <lldb.SBProcess; proxy of <Swig Object of type 'lldb::SBProcess *' at 0x1344bc5d0> >>: success

Hide Details

UNSUPPORTED: LLDB (/Users/buildslave/jenkins/workspace/lldb-cmake-matrix/clang_900_build/bin/clang-9-x86_64) :: test_inferior_crashing_dwo (TestInferiorCrashingStep.CrashingInferiorStepTestCase) (test case does not fall in any category of interest for this run) runCmd: settings set symbols.enable-external-lookup false output:

Hide Details

runCmd: settings set plugin.process.gdb-remote.packet-timeout 60 output:

Hide Details

runCmd: settings set symbols.clang-modules-cache-path "/Users/buildslave/jenkins/workspace/lldb-cmake-matrix/lldb-build/tools/lldb/lldb-test-build.noindex/module-cache-lldb/lldb-api" output:

Hide Details

runCmd: settings set use-color false output:

Hide Details

warning: (x86_64) /Users/buildslave/jenkins/workspace/lldb-cmake-matrix/lldb-build/tools/lldb/lldb-test-build.noindex/functionalities/inferior-crashing/TestInferiorCrashingStep.test_inferior_crashing_expr_dsym/a.out empty dSYM file detected, dSYM was created with an executable with no debug info. runCmd: file /Users/buildslave/jenkins/workspace/lldb-cmake-matrix/lldb-build/tools/lldb/lldb-test-build.noindex/functionalities/inferior-crashing/TestInferiorCrashingStep.test_inferior_crashing_expr_dsym/a.out output: Current executable set to '/Users/buildslave/jenkins/workspace/lldb-cmake-matrix/lldb-build/tools/lldb/lldb-test-build.noindex/functionalities/inferior-crashing/TestInferiorCrashingStep.test_inferior_crashing_expr_dsym/a.out' (x86_64).

Hide Details

Hide Details

runCmd: run output: Process 48839 stopped * thread #1, queue = 'com.apple.main-thread', stop reason = EXC_BAD_ACCESS (code=1, address=0x0) frame #0: 0x0000000100000f50 a.out`main + 48 a.out`main: -> 0x100000f50 <+48>: movl (%rcx), %esi 0x100000f52 <+50>: leaq 0x4e(%rip), %rdi ; "Now crash %d\n" 0x100000f59 <+57>: movl %eax, -0x1c(%rbp) 0x100000f5c <+60>: movb $0x0, %al

Hide Details

Process 48839 launched: '/Users/buildslave/jenkins/workspace/lldb-cmake-matrix/lldb-build/tools/lldb/lldb-test-build.noindex/functionalities/inferior-crashing/TestInferiorCrashingStep.test_inferior_crashing_expr_dsym/a.out' (x86_64)

Hide Details

Hide Details

runCmd: p argc runCmd failed! error: <user expression 0>:1:1: use of undeclared identifier 'argc' argc ^

Hide Details

Hide Details

FAIL: LLDB (/Users/buildslave/jenkins/workspace/lldb-cmake-matrix/clang_900_build/bin/clang-9-x86_64) :: test_inferior_crashing_expr_dsym (TestInferiorCrashingStep.CrashingInferiorStepTestCase) <bound method SBProcess.Kill of <lldb.SBProcess; proxy of <Swig Object of type 'lldb::SBProcess *' at 0x1344bc570> >>: success

Hide Details

runCmd: settings set symbols.enable-external-lookup false output:

Hide Details

runCmd: settings set plugin.process.gdb-remote.packet-timeout 60 output:

Hide Details

runCmd: settings set symbols.clang-modules-cache-path "/Users/buildslave/jenkins/workspace/lldb-cmake-matrix/lldb-build/tools/lldb/lldb-test-build.noindex/module-cache-lldb/lldb-api" output:

Hide Details

runCmd: settings set use-color false output:

Hide Details

runCmd: file /Users/buildslave/jenkins/workspace/lldb-cmake-matrix/lldb-build/tools/lldb/lldb-test-build.noindex/functionalities/inferior-crashing/TestInferiorCrashingStep.test_inferior_crashing_expr_dwarf/a.out output: Current executable set to '/Users/buildslave/jenkins/workspace/lldb-cmake-matrix/lldb-build/tools/lldb/lldb-test-build.noindex/functionalities/inferior-crashing/TestInferiorCrashingStep.test_inferior_crashing_expr_dwarf/a.out' (x86_64).

Hide Details

Hide Details

runCmd: run output: Process 49186 stopped * thread #1, queue = 'com.apple.main-thread', stop reason = EXC_BAD_ACCESS (code=1, address=0x0) frame #0: 0x0000000100000f50 a.out`main + 48 a.out`main: -> 0x100000f50 <+48>: movl (%rcx), %esi 0x100000f52 <+50>: leaq 0x4e(%rip), %rdi ; "Now crash %d\n" 0x100000f59 <+57>: movl %eax, -0x1c(%rbp) 0x100000f5c <+60>: movb $0x0, %al

Hide Details

Process 49186 launched: '/Users/buildslave/jenkins/workspace/lldb-cmake-matrix/lldb-build/tools/lldb/lldb-test-build.noindex/functionalities/inferior-crashing/TestInferiorCrashingStep.test_inferior_crashing_expr_dwarf/a.out' (x86_64)

Hide Details

Hide Details

runCmd: p argc runCmd failed! error: <user expression 0>:1:1: use of undeclared identifier 'argc' argc ^

Hide Details

Hide Details

FAIL: LLDB (/Users/buildslave/jenkins/workspace/lldb-cmake-matrix/clang_900_build/bin/clang-9-x86_64) :: test_inferior_crashing_expr_dwarf (TestInferiorCrashingStep.CrashingInferiorStepTestCase) <bound method SBProcess.Kill of <lldb.SBProcess; proxy of <Swig Object of type 'lldb::SBProcess *' at 0x1344bc420> >>: success

Hide Details

UNSUPPORTED: LLDB (/Users/buildslave/jenkins/workspace/lldb-cmake-matrix/clang_900_build/bin/clang-9-x86_64) :: test_inferior_crashing_expr_dwo (TestInferiorCrashingStep.CrashingInferiorStepTestCase) (test case does not fall in any category of interest for this run) UNSUPPORTED: LLDB (/Users/buildslave/jenkins/workspace/lldb-cmake-matrix/clang_900_build/bin/clang-9-x86_64) :: test_inferior_crashing_expr_gmodules (TestInferiorCrashingStep.CrashingInferiorStepTestCase) (test case does not fall in any category of interest for this run) runCmd: settings set symbols.enable-external-lookup false output:

Hide Details

runCmd: settings set plugin.process.gdb-remote.packet-timeout 60 output:

Hide Details

runCmd: settings set symbols.clang-modules-cache-path "/Users/buildslave/jenkins/workspace/lldb-cmake-matrix/lldb-build/tools/lldb/lldb-test-build.noindex/module-cache-lldb/lldb-api" output:

Hide Details

runCmd: settings set use-color false output:

Hide Details

warning: (x86_64) /Users/buildslave/jenkins/workspace/lldb-cmake-matrix/lldb-build/tools/lldb/lldb-test-build.noindex/functionalities/inferior-crashing/TestInferiorCrashingStep.test_inferior_crashing_expr_step_and_expr_dsym/a.out empty dSYM file detected, dSYM was created with an executable with no debug info. runCmd: file /Users/buildslave/jenkins/workspace/lldb-cmake-matrix/lldb-build/tools/lldb/lldb-test-build.noindex/functionalities/inferior-crashing/TestInferiorCrashingStep.test_inferior_crashing_expr_step_and_expr_dsym/a.out output: Current executable set to '/Users/buildslave/jenkins/workspace/lldb-cmake-matrix/lldb-build/tools/lldb/lldb-test-build.noindex/functionalities/inferior-crashing/TestInferiorCrashingStep.test_inferior_crashing_expr_step_and_expr_dsym/a.out' (x86_64).

Hide Details

Hide Details

runCmd: run output: Process 49365 stopped * thread #1, queue = 'com.apple.main-thread', stop reason = EXC_BAD_ACCESS (code=1, address=0x0) frame #0: 0x0000000100000f50 a.out`main + 48 a.out`main: -> 0x100000f50 <+48>: movl (%rcx), %esi 0x100000f52 <+50>: leaq 0x4e(%rip), %rdi ; "Now crash %d\n" 0x100000f59 <+57>: movl %eax, -0x1c(%rbp) 0x100000f5c <+60>: movb $0x0, %al

Hide Details

Process 49365 launched: '/Users/buildslave/jenkins/workspace/lldb-cmake-matrix/lldb-build/tools/lldb/lldb-test-build.noindex/functionalities/inferior-crashing/TestInferiorCrashingStep.test_inferior_crashing_expr_step_and_expr_dsym/a.out' (x86_64)

Hide Details

Hide Details

runCmd: p argv[0] runCmd failed! error: <user expression 0>:1:1: use of undeclared identifier 'argv' argv[0] ^

Hide Details

Hide Details

FAIL: LLDB (/Users/buildslave/jenkins/workspace/lldb-cmake-matrix/clang_900_build/bin/clang-9-x86_64) :: test_inferior_crashing_expr_step_and_expr_dsym (TestInferiorCrashingStep.CrashingInferiorStepTestCase) <bound method SBProcess.Kill of <lldb.SBProcess; proxy of <Swig Object of type 'lldb::SBProcess *' at 0x1344bc5a0> >>: success

Hide Details

runCmd: settings set symbols.enable-external-lookup false output:

Hide Details

runCmd: settings set plugin.process.gdb-remote.packet-timeout 60 output:

Hide Details

runCmd: settings set symbols.clang-modules-cache-path "/Users/buildslave/jenkins/workspace/lldb-cmake-matrix/lldb-build/tools/lldb/lldb-test-build.noindex/module-cache-lldb/lldb-api" output:

Hide Details

runCmd: settings set use-color false output:

Hide Details

runCmd: file /Users/buildslave/jenkins/workspace/lldb-cmake-matrix/lldb-build/tools/lldb/lldb-test-build.noindex/functionalities/inferior-crashing/TestInferiorCrashingStep.test_inferior_crashing_expr_step_and_expr_dwarf/a.out output: Current executable set to '/Users/buildslave/jenkins/workspace/lldb-cmake-matrix/lldb-build/tools/lldb/lldb-test-build.noindex/functionalities/inferior-crashing/TestInferiorCrashingStep.test_inferior_crashing_expr_step_and_expr_dwarf/a.out' (x86_64).

Hide Details

Hide Details

runCmd: run output: Process 49573 stopped * thread #1, queue = 'com.apple.main-thread', stop reason = EXC_BAD_ACCESS (code=1, address=0x0) frame #0: 0x0000000100000f50 a.out`main + 48 a.out`main: -> 0x100000f50 <+48>: movl (%rcx), %esi 0x100000f52 <+50>: leaq 0x4e(%rip), %rdi ; "Now crash %d\n" 0x100000f59 <+57>: movl %eax, -0x1c(%rbp) 0x100000f5c <+60>: movb $0x0, %al

Hide Details

Process 49573 launched: '/Users/buildslave/jenkins/workspace/lldb-cmake-matrix/lldb-build/tools/lldb/lldb-test-build.noindex/functionalities/inferior-crashing/TestInferiorCrashingStep.test_inferior_crashing_expr_step_and_expr_dwarf/a.out' (x86_64)

Hide Details

Hide Details

runCmd: p argv[0] runCmd failed! error: <user expression 0>:1:1: use of undeclared identifier 'argv' argv[0] ^

Hide Details

Hide Details

FAIL: LLDB (/Users/buildslave/jenkins/workspace/lldb-cmake-matrix/clang_900_build/bin/clang-9-x86_64) :: test_inferior_crashing_expr_step_and_expr_dwarf (TestInferiorCrashingStep.CrashingInferiorStepTestCase) <bound method SBProcess.Kill of <lldb.SBProcess; proxy of <Swig Object of type 'lldb::SBProcess *' at 0x1344bc5d0> >>: success

Hide Details

UNSUPPORTED: LLDB (/Users/buildslave/jenkins/workspace/lldb-cmake-matrix/clang_900_build/bin/clang-9-x86_64) :: test_inferior_crashing_expr_step_and_expr_dwo (TestInferiorCrashingStep.CrashingInferiorStepTestCase) (test case does not fall in any category of interest for this run) UNSUPPORTED: LLDB (/Users/buildslave/jenkins/workspace/lldb-cmake-matrix/clang_900_build/bin/clang-9-x86_64) :: test_inferior_crashing_expr_step_and_expr_gmodules (TestInferiorCrashingStep.CrashingInferiorStepTestCase) (test case does not fall in any category of interest for this run) UNSUPPORTED: LLDB (/Users/buildslave/jenkins/workspace/lldb-cmake-matrix/clang_900_build/bin/clang-9-x86_64) :: test_inferior_crashing_gmodules (TestInferiorCrashingStep.CrashingInferiorStepTestCase) (test case does not fall in any category of interest for this run) runCmd: settings set symbols.enable-external-lookup false output:

Hide Details

runCmd: settings set plugin.process.gdb-remote.packet-timeout 60 output:

Hide Details

runCmd: settings set symbols.clang-modules-cache-path "/Users/buildslave/jenkins/workspace/lldb-cmake-matrix/lldb-build/tools/lldb/lldb-test-build.noindex/module-cache-lldb/lldb-api" output:

Hide Details

runCmd: settings set use-color false output:

Hide Details

warning: (x86_64) /Users/buildslave/jenkins/workspace/lldb-cmake-matrix/lldb-build/tools/lldb/lldb-test-build.noindex/functionalities/inferior-crashing/TestInferiorCrashingStep.test_inferior_crashing_python_dsym/a.out empty dSYM file detected, dSYM was created with an executable with no debug info. <bound method SBProcess.Kill of <lldb.SBProcess; proxy of <Swig Object of type 'lldb::SBProcess *' at 0x1344bc5a0> >>: success

Hide Details

PASS: LLDB (/Users/buildslave/jenkins/workspace/lldb-cmake-matrix/clang_900_build/bin/clang-9-x86_64) :: test_inferior_crashing_python_dsym (TestInferiorCrashingStep.CrashingInferiorStepTestCase) runCmd: settings set symbols.enable-external-lookup false output:

Hide Details

runCmd: settings set plugin.process.gdb-remote.packet-timeout 60 output:

Hide Details

runCmd: settings set symbols.clang-modules-cache-path "/Users/buildslave/jenkins/workspace/lldb-cmake-matrix/lldb-build/tools/lldb/lldb-test-build.noindex/module-cache-lldb/lldb-api" output:

Hide Details

runCmd: settings set use-color false output:

Hide Details

<bound method SBProcess.Kill of <lldb.SBProcess; proxy of <Swig Object of type 'lldb::SBProcess *' at 0x1353117b0> >>: success

Hide Details

PASS: LLDB (/Users/buildslave/jenkins/workspace/lldb-cmake-matrix/clang_900_build/bin/clang-9-x86_64) :: test_inferior_crashing_python_dwarf (TestInferiorCrashingStep.CrashingInferiorStepTestCase) UNSUPPORTED: LLDB (/Users/buildslave/jenkins/workspace/lldb-cmake-matrix/clang_900_build/bin/clang-9-x86_64) :: test_inferior_crashing_python_dwo (TestInferiorCrashingStep.CrashingInferiorStepTestCase) (test case does not fall in any category of interest for this run) UNSUPPORTED: LLDB (/Users/buildslave/jenkins/workspace/lldb-cmake-matrix/clang_900_build/bin/clang-9-x86_64) :: test_inferior_crashing_python_gmodules (TestInferiorCrashingStep.CrashingInferiorStepTestCase) (test case does not fall in any category of interest for this run) runCmd: settings set symbols.enable-external-lookup false output:

Hide Details

runCmd: settings set plugin.process.gdb-remote.packet-timeout 60 output:

Hide Details

runCmd: settings set symbols.clang-modules-cache-path "/Users/buildslave/jenkins/workspace/lldb-cmake-matrix/lldb-build/tools/lldb/lldb-test-build.noindex/module-cache-lldb/lldb-api" output:

Hide Details

runCmd: settings set use-color false output:

Hide Details

warning: (x86_64) /Users/buildslave/jenkins/workspace/lldb-cmake-matrix/lldb-build/tools/lldb/lldb-test-build.noindex/functionalities/inferior-crashing/TestInferiorCrashingStep.test_inferior_crashing_register_dsym/a.out empty dSYM file detected, dSYM was created with an executable with no debug info. runCmd: file /Users/buildslave/jenkins/workspace/lldb-cmake-matrix/lldb-build/tools/lldb/lldb-test-build.noindex/functionalities/inferior-crashing/TestInferiorCrashingStep.test_inferior_crashing_register_dsym/a.out output: Current executable set to '/Users/buildslave/jenkins/workspace/lldb-cmake-matrix/lldb-build/tools/lldb/lldb-test-build.noindex/functionalities/inferior-crashing/TestInferiorCrashingStep.test_inferior_crashing_register_dsym/a.out' (x86_64).

Hide Details

Hide Details

runCmd: run output: Process 50049 stopped * thread #1, queue = 'com.apple.main-thread', stop reason = EXC_BAD_ACCESS (code=1, address=0x0) frame #0: 0x0000000100000f50 a.out`main + 48 a.out`main: -> 0x100000f50 <+48>: movl (%rcx), %esi 0x100000f52 <+50>: leaq 0x4e(%rip), %rdi ; "Now crash %d\n" 0x100000f59 <+57>: movl %eax, -0x1c(%rbp) 0x100000f5c <+60>: movb $0x0, %al

Hide Details

Process 50049 launched: '/Users/buildslave/jenkins/workspace/lldb-cmake-matrix/lldb-build/tools/lldb/lldb-test-build.noindex/functionalities/inferior-crashing/TestInferiorCrashingStep.test_inferior_crashing_register_dsym/a.out' (x86_64)

Hide Details

Hide Details

runCmd: register read eax output: eax = 0x00000011

Hide Details

Hide Details

Expecting sub string: eax = 0x Matched

Hide Details

<bound method SBProcess.Kill of <lldb.SBProcess; proxy of <Swig Object of type 'lldb::SBProcess *' at 0x1353113f0> >>: success

Hide Details

PASS: LLDB (/Users/buildslave/jenkins/workspace/lldb-cmake-matrix/clang_900_build/bin/clang-9-x86_64) :: test_inferior_crashing_register_dsym (TestInferiorCrashingStep.CrashingInferiorStepTestCase) runCmd: settings set symbols.enable-external-lookup false output:

Hide Details

runCmd: settings set plugin.process.gdb-remote.packet-timeout 60 output:

Hide Details

runCmd: settings set symbols.clang-modules-cache-path "/Users/buildslave/jenkins/workspace/lldb-cmake-matrix/lldb-build/tools/lldb/lldb-test-build.noindex/module-cache-lldb/lldb-api" output:

Hide Details

runCmd: settings set use-color false output:

Hide Details

runCmd: file /Users/buildslave/jenkins/workspace/lldb-cmake-matrix/lldb-build/tools/lldb/lldb-test-build.noindex/functionalities/inferior-crashing/TestInferiorCrashingStep.test_inferior_crashing_register_dwarf/a.out output: Current executable set to '/Users/buildslave/jenkins/workspace/lldb-cmake-matrix/lldb-build/tools/lldb/lldb-test-build.noindex/functionalities/inferior-crashing/TestInferiorCrashingStep.test_inferior_crashing_register_dwarf/a.out' (x86_64).

Hide Details

Hide Details

runCmd: run output: Process 50116 stopped * thread #1, queue = 'com.apple.main-thread', stop reason = EXC_BAD_ACCESS (code=1, address=0x0) frame #0: 0x0000000100000f50 a.out`main + 48 a.out`main: -> 0x100000f50 <+48>: movl (%rcx), %esi 0x100000f52 <+50>: leaq 0x4e(%rip), %rdi ; "Now crash %d\n" 0x100000f59 <+57>: movl %eax, -0x1c(%rbp) 0x100000f5c <+60>: movb $0x0, %al

Hide Details

Process 50116 launched: '/Users/buildslave/jenkins/workspace/lldb-cmake-matrix/lldb-build/tools/lldb/lldb-test-build.noindex/functionalities/inferior-crashing/TestInferiorCrashingStep.test_inferior_crashing_register_dwarf/a.out' (x86_64)

Hide Details

Hide Details

runCmd: register read eax output: eax = 0x00000011

Hide Details

Hide Details

Expecting sub string: eax = 0x Matched

Hide Details

<bound method SBProcess.Kill of <lldb.SBProcess; proxy of <Swig Object of type 'lldb::SBProcess *' at 0x1353115d0> >>: success

Hide Details

PASS: LLDB (/Users/buildslave/jenkins/workspace/lldb-cmake-matrix/clang_900_build/bin/clang-9-x86_64) :: test_inferior_crashing_register_dwarf (TestInferiorCrashingStep.CrashingInferiorStepTestCase) UNSUPPORTED: LLDB (/Users/buildslave/jenkins/workspace/lldb-cmake-matrix/clang_900_build/bin/clang-9-x86_64) :: test_inferior_crashing_register_dwo (TestInferiorCrashingStep.CrashingInferiorStepTestCase) (test case does not fall in any category of interest for this run) UNSUPPORTED: LLDB (/Users/buildslave/jenkins/workspace/lldb-cmake-matrix/clang_900_build/bin/clang-9-x86_64) :: test_inferior_crashing_register_gmodules (TestInferiorCrashingStep.CrashingInferiorStepTestCase) (test case does not fall in any category of interest for this run) runCmd: settings set symbols.enable-external-lookup false output:

Hide Details

runCmd: settings set plugin.process.gdb-remote.packet-timeout 60 output:

Hide Details

runCmd: settings set symbols.clang-modules-cache-path "/Users/buildslave/jenkins/workspace/lldb-cmake-matrix/lldb-build/tools/lldb/lldb-test-build.noindex/module-cache-lldb/lldb-api" output:

Hide Details

runCmd: settings set use-color false output:

Hide Details

warning: (x86_64) /Users/buildslave/jenkins/workspace/lldb-cmake-matrix/lldb-build/tools/lldb/lldb-test-build.noindex/functionalities/inferior-crashing/TestInferiorCrashingStep.test_inferior_crashing_step_after_break_dsym/a.out empty dSYM file detected, dSYM was created with an executable with no debug info. runCmd: file /Users/buildslave/jenkins/workspace/lldb-cmake-matrix/lldb-build/tools/lldb/lldb-test-build.noindex/functionalities/inferior-crashing/TestInferiorCrashingStep.test_inferior_crashing_step_after_break_dsym/a.out output: Current executable set to '/Users/buildslave/jenkins/workspace/lldb-cmake-matrix/lldb-build/tools/lldb/lldb-test-build.noindex/functionalities/inferior-crashing/TestInferiorCrashingStep.test_inferior_crashing_step_after_break_dsym/a.out' (x86_64).

Hide Details

Hide Details

runCmd: run output: Process 50174 stopped * thread #1, queue = 'com.apple.main-thread', stop reason = EXC_BAD_ACCESS (code=1, address=0x0) frame #0: 0x0000000100000f50 a.out`main + 48 a.out`main: -> 0x100000f50 <+48>: movl (%rcx), %esi 0x100000f52 <+50>: leaq 0x4e(%rip), %rdi ; "Now crash %d\n" 0x100000f59 <+57>: movl %eax, -0x1c(%rbp) 0x100000f5c <+60>: movb $0x0, %al

Hide Details

Process 50174 launched: '/Users/buildslave/jenkins/workspace/lldb-cmake-matrix/lldb-build/tools/lldb/lldb-test-build.noindex/functionalities/inferior-crashing/TestInferiorCrashingStep.test_inferior_crashing_step_after_break_dsym/a.out' (x86_64)

Hide Details

Hide Details

runCmd: next output: Process 50174 stopped * thread #1, queue = 'com.apple.main-thread', stop reason = EXC_BAD_ACCESS (code=1, address=0x0) frame #0: 0x0000000100000f50 a.out`main + 48 a.out`main: -> 0x100000f50 <+48>: movl (%rcx), %esi 0x100000f52 <+50>: leaq 0x4e(%rip), %rdi ; "Now crash %d\n" 0x100000f59 <+57>: movl %eax, -0x1c(%rbp) 0x100000f5c <+60>: movb $0x0, %al

Hide Details

Hide Details

Hide Details

Expecting sub string: Process Matched

Hide Details

Expecting sub string: stopped Matched

Hide Details

<bound method SBProcess.Kill of <lldb.SBProcess; proxy of <Swig Object of type 'lldb::SBProcess *' at 0x1353117b0> >>: success

Hide Details

PASS: LLDB (/Users/buildslave/jenkins/workspace/lldb-cmake-matrix/clang_900_build/bin/clang-9-x86_64) :: test_inferior_crashing_step_after_break_dsym (TestInferiorCrashingStep.CrashingInferiorStepTestCase) runCmd: settings set symbols.enable-external-lookup false output:

Hide Details

runCmd: settings set plugin.process.gdb-remote.packet-timeout 60 output:

Hide Details

runCmd: settings set symbols.clang-modules-cache-path "/Users/buildslave/jenkins/workspace/lldb-cmake-matrix/lldb-build/tools/lldb/lldb-test-build.noindex/module-cache-lldb/lldb-api" output:

Hide Details

runCmd: settings set use-color false output:

Hide Details

runCmd: file /Users/buildslave/jenkins/workspace/lldb-cmake-matrix/lldb-build/tools/lldb/lldb-test-build.noindex/functionalities/inferior-crashing/TestInferiorCrashingStep.test_inferior_crashing_step_after_break_dwarf/a.out output: Current executable set to '/Users/buildslave/jenkins/workspace/lldb-cmake-matrix/lldb-build/tools/lldb/lldb-test-build.noindex/functionalities/inferior-crashing/TestInferiorCrashingStep.test_inferior_crashing_step_after_break_dwarf/a.out' (x86_64).

Hide Details

Hide Details

runCmd: run output: Process 50256 stopped * thread #1, queue = 'com.apple.main-thread', stop reason = EXC_BAD_ACCESS (code=1, address=0x0) frame #0: 0x0000000100000f50 a.out`main + 48 a.out`main: -> 0x100000f50 <+48>: movl (%rcx), %esi 0x100000f52 <+50>: leaq 0x4e(%rip), %rdi ; "Now crash %d\n" 0x100000f59 <+57>: movl %eax, -0x1c(%rbp) 0x100000f5c <+60>: movb $0x0, %al

Hide Details

Process 50256 launched: '/Users/buildslave/jenkins/workspace/lldb-cmake-matrix/lldb-build/tools/lldb/lldb-test-build.noindex/functionalities/inferior-crashing/TestInferiorCrashingStep.test_inferior_crashing_step_after_break_dwarf/a.out' (x86_64)

Hide Details

Hide Details

runCmd: next output: Process 50256 stopped * thread #1, queue = 'com.apple.main-thread', stop reason = EXC_BAD_ACCESS (code=1, address=0x0) frame #0: 0x0000000100000f50 a.out`main + 48 a.out`main: -> 0x100000f50 <+48>: movl (%rcx), %esi 0x100000f52 <+50>: leaq 0x4e(%rip), %rdi ; "Now crash %d\n" 0x100000f59 <+57>: movl %eax, -0x1c(%rbp) 0x100000f5c <+60>: movb $0x0, %al

Hide Details

Hide Details

Hide Details

Expecting sub string: Process Matched

Hide Details

Expecting sub string: stopped Matched

Hide Details

<bound method SBProcess.Kill of <lldb.SBProcess; proxy of <Swig Object of type 'lldb::SBProcess *' at 0x1353113f0> >>: success

Hide Details

PASS: LLDB (/Users/buildslave/jenkins/workspace/lldb-cmake-matrix/clang_900_build/bin/clang-9-x86_64) :: test_inferior_crashing_step_after_break_dwarf (TestInferiorCrashingStep.CrashingInferiorStepTestCase) UNSUPPORTED: LLDB (/Users/buildslave/jenkins/workspace/lldb-cmake-matrix/clang_900_build/bin/clang-9-x86_64) :: test_inferior_crashing_step_after_break_dwo (TestInferiorCrashingStep.CrashingInferiorStepTestCase) (test case does not fall in any category of interest for this run) UNSUPPORTED: LLDB (/Users/buildslave/jenkins/workspace/lldb-cmake-matrix/clang_900_build/bin/clang-9-x86_64) :: test_inferior_crashing_step_after_break_gmodules (TestInferiorCrashingStep.CrashingInferiorStepTestCase) (test case does not fall in any category of interest for this run) runCmd: settings set symbols.enable-external-lookup false output:

Hide Details

runCmd: settings set plugin.process.gdb-remote.packet-timeout 60 output:

Hide Details

runCmd: settings set symbols.clang-modules-cache-path "/Users/buildslave/jenkins/workspace/lldb-cmake-matrix/lldb-build/tools/lldb/lldb-test-build.noindex/module-cache-lldb/lldb-api" output:

Hide Details

runCmd: settings set use-color false output:

Hide Details

warning: (x86_64) /Users/buildslave/jenkins/workspace/lldb-cmake-matrix/lldb-build/tools/lldb/lldb-test-build.noindex/functionalities/inferior-crashing/TestInferiorCrashingStep.test_inferior_crashing_step_dsym/a.out empty dSYM file detected, dSYM was created with an executable with no debug info. runCmd: file /Users/buildslave/jenkins/workspace/lldb-cmake-matrix/lldb-build/tools/lldb/lldb-test-build.noindex/functionalities/inferior-crashing/TestInferiorCrashingStep.test_inferior_crashing_step_dsym/a.out output: Current executable set to '/Users/buildslave/jenkins/workspace/lldb-cmake-matrix/lldb-build/tools/lldb/lldb-test-build.noindex/functionalities/inferior-crashing/TestInferiorCrashingStep.test_inferior_crashing_step_dsym/a.out' (x86_64).

Hide Details

Hide Details

runCmd: breakpoint set -f "main.c" -l 16 output: Breakpoint 1: no locations (pending). WARNING: Unable to resolve breakpoint to any actual locations.

Hide Details

Hide Details

Expecting pattern: ^Breakpoint (?P<bpno>[0-9]+): (?P<num_locations>[0-9]+) locations\.$ Not matched

Hide Details

Expecting pattern: ^Breakpoint (?P<bpno>[0-9]+): (?P<num_locations>no) locations \(pending\)\. Matched

Hide Details

FAIL: LLDB (/Users/buildslave/jenkins/workspace/lldb-cmake-matrix/clang_900_build/bin/clang-9-x86_64) :: test_inferior_crashing_step_dsym (TestInferiorCrashingStep.CrashingInferiorStepTestCase) runCmd: settings set symbols.enable-external-lookup false output:

Hide Details

runCmd: settings set plugin.process.gdb-remote.packet-timeout 60 output:

Hide Details

runCmd: settings set symbols.clang-modules-cache-path "/Users/buildslave/jenkins/workspace/lldb-cmake-matrix/lldb-build/tools/lldb/lldb-test-build.noindex/module-cache-lldb/lldb-api" output:

Hide Details

runCmd: settings set use-color false output:

Hide Details

runCmd: file /Users/buildslave/jenkins/workspace/lldb-cmake-matrix/lldb-build/tools/lldb/lldb-test-build.noindex/functionalities/inferior-crashing/TestInferiorCrashingStep.test_inferior_crashing_step_dwarf/a.out output: Current executable set to '/Users/buildslave/jenkins/workspace/lldb-cmake-matrix/lldb-build/tools/lldb/lldb-test-build.noindex/functionalities/inferior-crashing/TestInferiorCrashingStep.test_inferior_crashing_step_dwarf/a.out' (x86_64).

Hide Details

Hide Details

runCmd: breakpoint set -f "main.c" -l 16 output: Breakpoint 1: no locations (pending). WARNING: Unable to resolve breakpoint to any actual locations.

Hide Details

Hide Details

Expecting pattern: ^Breakpoint (?P<bpno>[0-9]+): (?P<num_locations>[0-9]+) locations\.$ Not matched

Hide Details

Expecting pattern: ^Breakpoint (?P<bpno>[0-9]+): (?P<num_locations>no) locations \(pending\)\. Matched

Hide Details

FAIL: LLDB (/Users/buildslave/jenkins/workspace/lldb-cmake-matrix/clang_900_build/bin/clang-9-x86_64) :: test_inferior_crashing_step_dwarf (TestInferiorCrashingStep.CrashingInferiorStepTestCase) UNSUPPORTED: LLDB (/Users/buildslave/jenkins/workspace/lldb-cmake-matrix/clang_900_build/bin/clang-9-x86_64) :: test_inferior_crashing_step_dwo (TestInferiorCrashingStep.CrashingInferiorStepTestCase) (test case does not fall in any category of interest for this run) UNSUPPORTED: LLDB (/Users/buildslave/jenkins/workspace/lldb-cmake-matrix/clang_900_build/bin/clang-9-x86_64) :: test_inferior_crashing_step_gmodules (TestInferiorCrashingStep.CrashingInferiorStepTestCase) (test case does not fall in any category of interest for this run) Restore dir to: /Users/buildslave/jenkins/workspace/lldb-cmake-matrix/lldb-build/tools/lldb/test ====================================================================== FAIL: test_inferior_crashing_dsym (TestInferiorCrashingStep.CrashingInferiorStepTestCase) Test that lldb reliably catches the inferior crashing (command). ---------------------------------------------------------------------- Traceback (most recent call last): File "/Users/buildslave/jenkins/workspace/lldb-cmake-matrix/llvm-project/lldb/packages/Python/lldbsuite/test/lldbtest.py", line 1748, in test_method return attrvalue(self) File "/Users/buildslave/jenkins/workspace/lldb-cmake-matrix/llvm-project/lldb/packages/Python/lldbsuite/test/decorators.py", line 111, in wrapper func(*args, **kwargs) File "/Users/buildslave/jenkins/workspace/lldb-cmake-matrix/llvm-project/lldb/packages/Python/lldbsuite/test/decorators.py", line 111, in wrapper func(*args, **kwargs) File "/Users/buildslave/jenkins/workspace/lldb-cmake-matrix/llvm-project/lldb/packages/Python/lldbsuite/test/functionalities/inferior-crashing/TestInferiorCrashingStep.py", line 21, in test_inferior_crashing self.inferior_crashing() File "/Users/buildslave/jenkins/workspace/lldb-cmake-matrix/llvm-project/lldb/packages/Python/lldbsuite/test/functionalities/inferior-crashing/TestInferiorCrashingStep.py", line 106, in inferior_crashing substrs=[stop_reason, 'main.c:%d' % self.line]) File "/Users/buildslave/jenkins/workspace/lldb-cmake-matrix/llvm-project/lldb/packages/Python/lldbsuite/test/lldbtest.py", line 2374, in expect msg if msg else EXP_MSG(str, output, exe)) AssertionError: False is not True : 'thread backtrace all' returns expected result, got '* thread #1, queue = 'com.apple.main-thread', stop reason = EXC_BAD_ACCESS (code=1, address=0x0) * frame #0: 0x0000000100000f50 a.out`main + 48 frame #1: 0x00007fff60f94085 libdyld.dylib`start + 1 frame #2: 0x00007fff60f94085 libdyld.dylib`start + 1' Config=x86_64-/Users/buildslave/jenkins/workspace/lldb-cmake-matrix/clang_900_build/bin/clang-9 ====================================================================== FAIL: test_inferior_crashing_dwarf (TestInferiorCrashingStep.CrashingInferiorStepTestCase) Test that lldb reliably catches the inferior crashing (command). ---------------------------------------------------------------------- Traceback (most recent call last): File "/Users/buildslave/jenkins/workspace/lldb-cmake-matrix/llvm-project/lldb/packages/Python/lldbsuite/test/lldbtest.py", line 1748, in test_method return attrvalue(self) File "/Users/buildslave/jenkins/workspace/lldb-cmake-matrix/llvm-project/lldb/packages/Python/lldbsuite/test/decorators.py", line 111, in wrapper func(*args, **kwargs) File "/Users/buildslave/jenkins/workspace/lldb-cmake-matrix/llvm-project/lldb/packages/Python/lldbsuite/test/decorators.py", line 111, in wrapper func(*args, **kwargs) File "/Users/buildslave/jenkins/workspace/lldb-cmake-matrix/llvm-project/lldb/packages/Python/lldbsuite/test/functionalities/inferior-crashing/TestInferiorCrashingStep.py", line 21, in test_inferior_crashing self.inferior_crashing() File "/Users/buildslave/jenkins/workspace/lldb-cmake-matrix/llvm-project/lldb/packages/Python/lldbsuite/test/functionalities/inferior-crashing/TestInferiorCrashingStep.py", line 106, in inferior_crashing substrs=[stop_reason, 'main.c:%d' % self.line]) File "/Users/buildslave/jenkins/workspace/lldb-cmake-matrix/llvm-project/lldb/packages/Python/lldbsuite/test/lldbtest.py", line 2374, in expect msg if msg else EXP_MSG(str, output, exe)) AssertionError: False is not True : 'thread backtrace all' returns expected result, got '* thread #1, queue = 'com.apple.main-thread', stop reason = EXC_BAD_ACCESS (code=1, address=0x0) * frame #0: 0x0000000100000f50 a.out`main + 48 frame #1: 0x00007fff60f94085 libdyld.dylib`start + 1 frame #2: 0x00007fff60f94085 libdyld.dylib`start + 1' Config=x86_64-/Users/buildslave/jenkins/workspace/lldb-cmake-matrix/clang_900_build/bin/clang-9 ====================================================================== FAIL: test_inferior_crashing_expr_dsym (TestInferiorCrashingStep.CrashingInferiorStepTestCase) Test that the lldb expression interpreter can read from the inferior after crashing (command). ---------------------------------------------------------------------- Traceback (most recent call last): File "/Users/buildslave/jenkins/workspace/lldb-cmake-matrix/llvm-project/lldb/packages/Python/lldbsuite/test/lldbtest.py", line 1748, in test_method return attrvalue(self) File "/Users/buildslave/jenkins/workspace/lldb-cmake-matrix/llvm-project/lldb/packages/Python/lldbsuite/test/functionalities/inferior-crashing/TestInferiorCrashingStep.py", line 38, in test_inferior_crashing_expr self.inferior_crashing_expr() File "/Users/buildslave/jenkins/workspace/lldb-cmake-matrix/llvm-project/lldb/packages/Python/lldbsuite/test/functionalities/inferior-crashing/TestInferiorCrashingStep.py", line 155, in inferior_crashing_expr self.expect("p argc", startstr='(int) $0 = 1') File "/Users/buildslave/jenkins/workspace/lldb-cmake-matrix/llvm-project/lldb/packages/Python/lldbsuite/test/lldbtest.py", line 2309, in expect inHistory=inHistory) File "/Users/buildslave/jenkins/workspace/lldb-cmake-matrix/llvm-project/lldb/packages/Python/lldbsuite/test/lldbtest.py", line 2068, in runCmd msg if (msg) else CMD_MSG(cmd)) AssertionError: False is not True : Command 'p argc Error output: error: <user expression 0>:1:1: use of undeclared identifier 'argc' argc ^ ' returns successfully Config=x86_64-/Users/buildslave/jenkins/workspace/lldb-cmake-matrix/clang_900_build/bin/clang-9 ====================================================================== FAIL: test_inferior_crashing_expr_dwarf (TestInferiorCrashingStep.CrashingInferiorStepTestCase) Test that the lldb expression interpreter can read from the inferior after crashing (command). ---------------------------------------------------------------------- Traceback (most recent call last): File "/Users/buildslave/jenkins/workspace/lldb-cmake-matrix/llvm-project/lldb/packages/Python/lldbsuite/test/lldbtest.py", line 1748, in test_method return attrvalue(self) File "/Users/buildslave/jenkins/workspace/lldb-cmake-matrix/llvm-project/lldb/packages/Python/lldbsuite/test/functionalities/inferior-crashing/TestInferiorCrashingStep.py", line 38, in test_inferior_crashing_expr self.inferior_crashing_expr() File "/Users/buildslave/jenkins/workspace/lldb-cmake-matrix/llvm-project/lldb/packages/Python/lldbsuite/test/functionalities/inferior-crashing/TestInferiorCrashingStep.py", line 155, in inferior_crashing_expr self.expect("p argc", startstr='(int) $0 = 1') File "/Users/buildslave/jenkins/workspace/lldb-cmake-matrix/llvm-project/lldb/packages/Python/lldbsuite/test/lldbtest.py", line 2309, in expect inHistory=inHistory) File "/Users/buildslave/jenkins/workspace/lldb-cmake-matrix/llvm-project/lldb/packages/Python/lldbsuite/test/lldbtest.py", line 2068, in runCmd msg if (msg) else CMD_MSG(cmd)) AssertionError: False is not True : Command 'p argc Error output: error: <user expression 0>:1:1: use of undeclared identifier 'argc' argc ^ ' returns successfully Config=x86_64-/Users/buildslave/jenkins/workspace/lldb-cmake-matrix/clang_900_build/bin/clang-9 ====================================================================== FAIL: test_inferior_crashing_expr_step_and_expr_dsym (TestInferiorCrashingStep.CrashingInferiorStepTestCase) Test that lldb expressions work before and after stepping after a crash. ---------------------------------------------------------------------- Traceback (most recent call last): File "/Users/buildslave/jenkins/workspace/lldb-cmake-matrix/llvm-project/lldb/packages/Python/lldbsuite/test/lldbtest.py", line 1748, in test_method return attrvalue(self) File "/Users/buildslave/jenkins/workspace/lldb-cmake-matrix/llvm-project/lldb/packages/Python/lldbsuite/test/decorators.py", line 111, in wrapper func(*args, **kwargs) File "/Users/buildslave/jenkins/workspace/lldb-cmake-matrix/llvm-project/lldb/packages/Python/lldbsuite/test/functionalities/inferior-crashing/TestInferiorCrashingStep.py", line 61, in test_inferior_crashing_expr_step_and_expr self.inferior_crashing_expr_step_expr() File "/Users/buildslave/jenkins/workspace/lldb-cmake-matrix/llvm-project/lldb/packages/Python/lldbsuite/test/functionalities/inferior-crashing/TestInferiorCrashingStep.py", line 221, in inferior_crashing_expr_step_expr self.expect("p argv[0]", substrs=['a.out']) File "/Users/buildslave/jenkins/workspace/lldb-cmake-matrix/llvm-project/lldb/packages/Python/lldbsuite/test/lldbtest.py", line 2309, in expect inHistory=inHistory) File "/Users/buildslave/jenkins/workspace/lldb-cmake-matrix/llvm-project/lldb/packages/Python/lldbsuite/test/lldbtest.py", line 2068, in runCmd msg if (msg) else CMD_MSG(cmd)) AssertionError: False is not True : Command 'p argv[0] Error output: error: <user expression 0>:1:1: use of undeclared identifier 'argv' argv[0] ^ ' returns successfully Config=x86_64-/Users/buildslave/jenkins/workspace/lldb-cmake-matrix/clang_900_build/bin/clang-9 ====================================================================== FAIL: test_inferior_crashing_expr_step_and_expr_dwarf (TestInferiorCrashingStep.CrashingInferiorStepTestCase) Test that lldb expressions work before and after stepping after a crash. ---------------------------------------------------------------------- Traceback (most recent call last): File "/Users/buildslave/jenkins/workspace/lldb-cmake-matrix/llvm-project/lldb/packages/Python/lldbsuite/test/lldbtest.py", line 1748, in test_method return attrvalue(self) File "/Users/buildslave/jenkins/workspace/lldb-cmake-matrix/llvm-project/lldb/packages/Python/lldbsuite/test/decorators.py", line 111, in wrapper func(*args, **kwargs) File "/Users/buildslave/jenkins/workspace/lldb-cmake-matrix/llvm-project/lldb/packages/Python/lldbsuite/test/functionalities/inferior-crashing/TestInferiorCrashingStep.py", line 61, in test_inferior_crashing_expr_step_and_expr self.inferior_crashing_expr_step_expr() File "/Users/buildslave/jenkins/workspace/lldb-cmake-matrix/llvm-project/lldb/packages/Python/lldbsuite/test/functionalities/inferior-crashing/TestInferiorCrashingStep.py", line 221, in inferior_crashing_expr_step_expr self.expect("p argv[0]", substrs=['a.out']) File "/Users/buildslave/jenkins/workspace/lldb-cmake-matrix/llvm-project/lldb/packages/Python/lldbsuite/test/lldbtest.py", line 2309, in expect inHistory=inHistory) File "/Users/buildslave/jenkins/workspace/lldb-cmake-matrix/llvm-project/lldb/packages/Python/lldbsuite/test/lldbtest.py", line 2068, in runCmd msg if (msg) else CMD_MSG(cmd)) AssertionError: False is not True : Command 'p argv[0] Error output: error: <user expression 0>:1:1: use of undeclared identifier 'argv' argv[0] ^ ' returns successfully Config=x86_64-/Users/buildslave/jenkins/workspace/lldb-cmake-matrix/clang_900_build/bin/clang-9 ====================================================================== FAIL: test_inferior_crashing_step_dsym (TestInferiorCrashingStep.CrashingInferiorStepTestCase) Test that stepping after a crash behaves correctly. ---------------------------------------------------------------------- Traceback (most recent call last): File "/Users/buildslave/jenkins/workspace/lldb-cmake-matrix/llvm-project/lldb/packages/Python/lldbsuite/test/lldbtest.py", line 1748, in test_method return attrvalue(self) File "/Users/buildslave/jenkins/workspace/lldb-cmake-matrix/llvm-project/lldb/packages/Python/lldbsuite/test/decorators.py", line 111, in wrapper func(*args, **kwargs) File "/Users/buildslave/jenkins/workspace/lldb-cmake-matrix/llvm-project/lldb/packages/Python/lldbsuite/test/functionalities/inferior-crashing/TestInferiorCrashingStep.py", line 44, in test_inferior_crashing_step self.inferior_crashing_step() File "/Users/buildslave/jenkins/workspace/lldb-cmake-matrix/llvm-project/lldb/packages/Python/lldbsuite/test/functionalities/inferior-crashing/TestInferiorCrashingStep.py", line 164, in inferior_crashing_step self.set_breakpoint(self.line) File "/Users/buildslave/jenkins/workspace/lldb-cmake-matrix/llvm-project/lldb/packages/Python/lldbsuite/test/functionalities/inferior-crashing/TestInferiorCrashingStep.py", line 65, in set_breakpoint self, "main.c", line, num_expected_locations=1, loc_exact=True) File "/Users/buildslave/jenkins/workspace/lldb-cmake-matrix/llvm-project/lldb/packages/Python/lldbsuite/test/lldbutil.py", line 383, in run_break_set_by_file_and_line module_name=module_name) File "/Users/buildslave/jenkins/workspace/lldb-cmake-matrix/llvm-project/lldb/packages/Python/lldbsuite/test/lldbutil.py", line 584, in check_breakpoint_result out_num_locations)) AssertionError: False is not True : Expecting 1 locations, got 0. Config=x86_64-/Users/buildslave/jenkins/workspace/lldb-cmake-matrix/clang_900_build/bin/clang-9 ====================================================================== FAIL: test_inferior_crashing_step_dwarf (TestInferiorCrashingStep.CrashingInferiorStepTestCase) Test that stepping after a crash behaves correctly. ---------------------------------------------------------------------- Traceback (most recent call last): File "/Users/buildslave/jenkins/workspace/lldb-cmake-matrix/llvm-project/lldb/packages/Python/lldbsuite/test/lldbtest.py", line 1748, in test_method return attrvalue(self) File "/Users/buildslave/jenkins/workspace/lldb-cmake-matrix/llvm-project/lldb/packages/Python/lldbsuite/test/decorators.py", line 111, in wrapper func(*args, **kwargs) File "/Users/buildslave/jenkins/workspace/lldb-cmake-matrix/llvm-project/lldb/packages/Python/lldbsuite/test/functionalities/inferior-crashing/TestInferiorCrashingStep.py", line 44, in test_inferior_crashing_step self.inferior_crashing_step() File "/Users/buildslave/jenkins/workspace/lldb-cmake-matrix/llvm-project/lldb/packages/Python/lldbsuite/test/functionalities/inferior-crashing/TestInferiorCrashingStep.py", line 164, in inferior_crashing_step self.set_breakpoint(self.line) File "/Users/buildslave/jenkins/workspace/lldb-cmake-matrix/llvm-project/lldb/packages/Python/lldbsuite/test/functionalities/inferior-crashing/TestInferiorCrashingStep.py", line 65, in set_breakpoint self, "main.c", line, num_expected_locations=1, loc_exact=True) File "/Users/buildslave/jenkins/workspace/lldb-cmake-matrix/llvm-project/lldb/packages/Python/lldbsuite/test/lldbutil.py", line 383, in run_break_set_by_file_and_line module_name=module_name) File "/Users/buildslave/jenkins/workspace/lldb-cmake-matrix/llvm-project/lldb/packages/Python/lldbsuite/test/lldbutil.py", line 584, in check_breakpoint_result out_num_locations)) AssertionError: False is not True : Expecting 1 locations, got 0. Config=x86_64-/Users/buildslave/jenkins/workspace/lldb-cmake-matrix/clang_900_build/bin/clang-9 ---------------------------------------------------------------------- Ran 28 tests in 10.780s

Hide Details

RESULT: FAILED (6 passes, 8 failures, 0 errors, 14 skipped, 0 expected failures, 0 unexpected successes)

Hide Details

******************** PASS: lldb-api :: tools/lldb-server/TestLldbGdbServer.py (1785 of 1788) TIMEOUT: lldb-api :: python_api/lldbutil/iter/TestLLDBIterator.py (1786 of 1788) ******************** TEST 'lldb-api :: python_api/lldbutil/iter/TestLLDBIterator.py' FAILED ******************** Reached timeout of 600 seconds ******************** TIMEOUT: lldb-api :: python_api/lldbutil/iter/TestRegistersIterator.py (1787 of 1788) ******************** TEST 'lldb-api :: python_api/lldbutil/iter/TestRegistersIterator.py' FAILED ******************** Reached timeout of 600 seconds ******************** TIMEOUT: lldb-api :: lang/objc/foundation/TestObjCMethods.py (1788 of 1788) ******************** TEST 'lldb-api :: lang/objc/foundation/TestObjCMethods.py' FAILED ******************** Reached timeout of 600 seconds ******************** Testing Time: 775.32s ******************** Failing Tests (475): lldb-api :: functionalities/breakpoint/address_breakpoints/TestAddressBreakpoints.py lldb-api :: commands/frame/diagnose/complicated-expression/TestComplicatedExpression.py lldb-api :: commands/expression/import-std-module/conflicts/TestStdModuleWithConflicts.py lldb-api :: macosx/find-dsym/bundle-with-dot-in-filename/TestBundleWithDotInFilename.py lldb-api :: lang/c/shared_lib_stripped_symbols/TestSharedLibStrippedSymbols.py lldb-api :: functionalities/tail_call_frames/sbapi_support/TestTailCallFrameSBAPI.py lldb-api :: lang/cpp/function_refs/TestFunctionRefs.py lldb-api :: functionalities/tail_call_frames/disambiguate_tail_call_seq/TestDisambiguateTailCallSeq.py lldb-api :: lang/cpp/this/TestCPPThis.py lldb-api :: lang/objcxx/cxx-bridged-po/TestObjCXXBridgedPO.py lldb-api :: commands/expression/function_template_specialization_temp_args/TestFunctionTemplateSpecializationTempArgs.py lldb-api :: functionalities/thread/step_until/TestStepUntil.py lldb-api :: python_api/value/empty_class/TestValueAPIEmptyClass.py lldb-api :: functionalities/tail_call_frames/thread_step_out_message/TestArtificialFrameStepOutMessage.py lldb-api :: functionalities/data-formatter/data-formatter-synthtype/TestDataFormatterSynthType.py lldb-api :: commands/expression/persistent_variables/TestPersistentVariables.py lldb-api :: commands/expression/expr-in-syscall/TestExpressionInSyscall.py lldb-api :: functionalities/breakpoint/address_breakpoints/TestBadAddressBreakpoints.py lldb-api :: functionalities/value_md5_crash/TestValueMD5Crash.py lldb-api :: commands/expression/import-std-module/forward_list-dbg-info-content/TestDbgInfoContentForwardList.py lldb-api :: lang/objc/forward-decl/TestForwardDecl.py lldb-api :: lang/c/global_variables/TestGlobalVariables.py lldb-api :: lang/cpp/lambdas/TestLambdas.py lldb-api :: functionalities/data-formatter/data-formatter-objc/nsindexpath/TestDataFormatterNSIndexPath.py lldb-api :: functionalities/breakpoint/consecutive_breakpoints/TestConsecutiveBreakpoints.py lldb-api :: functionalities/data-formatter/data-formatter-objc/TestDataFormatterObjCNSData.py lldb-api :: python_api/rdar-12481949/Test-rdar-12481949.py lldb-api :: lang/objc/foundation/TestObjCMethodsNSError.py lldb-api :: functionalities/data-formatter/data-formatter-stl/libcxx/tuple/TestDataFormatterLibcxxTuple.py lldb-api :: functionalities/breakpoint/breakpoint_hit_count/TestBreakpointHitCount.py lldb-api :: lang/objc/print-obj/TestPrintObj.py lldb-api :: types/TestIntegerTypesExpr.py lldb-api :: lang/cpp/class_types/TestClassTypesDisassembly.py lldb-api :: python_api/target/TestTargetAPI.py lldb-api :: commands/expression/save_jit_objects/TestSaveJITObjects.py lldb-api :: python_api/findvalue_duplist/TestSBFrameFindValue.py lldb-api :: functionalities/step_scripted/TestStepScripted.py lldb-api :: functionalities/data-formatter/data-formatter-objc/TestDataFormatterObjCNSError.py lldb-api :: lang/cpp/rvalue-references/TestRvalueReferences.py lldb-api :: commands/expression/import-std-module/shared_ptr-dbg-info-content/TestSharedPtrDbgInfoContent.py lldb-api :: commands/expression/char/TestExprsChar.py lldb-api :: lang/cpp/nsimport/TestCppNsImport.py lldb-api :: lang/c/array_types/TestArrayTypes.py lldb-api :: functionalities/inferior-crashing/recursive-inferior/TestRecursiveInferiorStep.py lldb-api :: functionalities/signal/handle-abrt/TestHandleAbort.py lldb-api :: functionalities/data-formatter/data-formatter-cpp/TestDataFormatterCpp.py lldb-api :: python_api/process/TestProcessAPI.py lldb-api :: commands/expression/import-std-module/sysroot/TestStdModuleSysroot.py lldb-api :: functionalities/memory/cache/TestMemoryCache.py lldb-api :: functionalities/data-formatter/data-formatter-python-synth/TestDataFormatterPythonSynth.py lldb-api :: lang/objc/objc-static-method-stripped/TestObjCStaticMethodStripped.py lldb-api :: lang/cpp/template/TestTemplateArgs.py lldb-api :: functionalities/breakpoint/require_hw_breakpoints/TestRequireHWBreakpoints.py lldb-api :: functionalities/breakpoint/debugbreak/TestDebugBreak.py lldb-api :: functionalities/data-formatter/data-formatter-stl/libcxx/vector/TestDataFormatterLibcxxVector.py lldb-api :: functionalities/thread/exit_during_step/TestExitDuringStep.py lldb-api :: lang/cpp/trivial_abi/TestTrivialABI.py lldb-api :: lang/objc/rdar-11355592/TestRdar11355592.py lldb-api :: lang/objc/objc-dyn-sbtype/TestObjCDynamicSBType.py lldb-api :: functionalities/data-formatter/data-formatter-stl/libcxx/multiset/TestDataFormatterLibcxxMultiSet.py lldb-api :: sample_test/TestSampleTest.py lldb-api :: commands/expression/persist_objc_pointeetype/TestPersistObjCPointeeType.py lldb-api :: functionalities/memory/read/TestMemoryRead.py lldb-api :: lang/objc/objc-struct-return/TestObjCStructReturn.py lldb-api :: lang/cpp/operators/TestCppOperators.py lldb-api :: lang/c/stepping/TestThreadStepping.py lldb-api :: lang/cpp/call-function/TestCallCPPFunction.py lldb-api :: commands/expression/scoped_enums/TestScopedEnumType.py lldb-api :: lang/objc/modules/TestObjCModules.py lldb-api :: functionalities/signal/TestSendSignal.py lldb-api :: functionalities/thread/concurrent_events/TestConcurrentManyCrash.py lldb-api :: commands/expression/multiline-completion/TestMultilineCompletion.py lldb-api :: commands/expression/import-std-module/forward_list-basic/TestBasicForwardList.py lldb-api :: commands/expression/test/TestExprs2.py lldb-api :: commands/command/script/TestCommandScript.py lldb-api :: commands/expression/cast_int_to_anonymous_enum/TestCastIntToAnonymousEnum.py lldb-api :: functionalities/thread/step_out/TestThreadStepOut.py lldb-api :: lang/cpp/signed_types/TestSignedTypes.py lldb-api :: python_api/type/TestTypeList.py lldb-api :: functionalities/inferior-changed/TestInferiorChanged.py lldb-api :: lang/objc/orderedset/TestOrderedSet.py lldb-api :: commands/expression/two-files/TestObjCTypeQueryFromOtherCompileUnit.py lldb-api :: commands/expression/argument_passing_restrictions/TestArgumentPassingRestrictions.py lldb-api :: lang/cpp/member-and-local-vars-with-same-name/TestMembersAndLocalsWithSameName.py lldb-api :: commands/expression/call-throws/TestCallThatThrows.py lldb-api :: lang/cpp/incomplete-types/TestCppIncompleteTypes.py lldb-api :: lang/c/stepping/TestStepAndBreakpoints.py lldb-api :: functionalities/data-formatter/data-formatter-objc/TestDataFormatterObjCNSBundle.py lldb-api :: functionalities/load_unload/TestLoadUnload.py lldb-api :: commands/expression/import-std-module/queue/TestQueue.py lldb-api :: python_api/signals/TestSignalsAPI.py lldb-api :: commands/command/nested_alias/TestNestedAlias.py lldb-api :: functionalities/data-formatter/data-formatter-ptr-to-array/TestPtrToArrayFormatting.py lldb-api :: lang/mixed/TestMixedLanguages.py lldb-api :: commands/expression/formatters/TestFormatters.py lldb-api :: functionalities/breakpoint/breakpoint_options/TestBreakpointOptions.py lldb-api :: functionalities/data-formatter/hexcaps/TestDataFormatterHexCaps.py lldb-api :: functionalities/data-formatter/data-formatter-stl/libcxx/vbool/TestDataFormatterLibcxxVBool.py lldb-api :: functionalities/thread/create_after_attach/TestCreateAfterAttach.py lldb-api :: lang/objc/objc-runtime-ivars/TestRuntimeIvars.py lldb-api :: functionalities/tail_call_frames/disambiguate_call_site/TestDisambiguateCallSite.py lldb-api :: lang/objc/objc-new-syntax/TestObjCNewSyntaxLiteral.py lldb-api :: commands/expression/no-deadlock/TestExprDoesntBlock.py lldb-api :: functionalities/breakpoint/auto_continue/TestBreakpointAutoContinue.py lldb-api :: commands/expression/ir-interpreter/TestIRInterpreter.py lldb-api :: functionalities/data-formatter/parray/TestPrintArray.py lldb-api :: commands/expression/call-function/TestCallBuiltinFunction.py lldb-api :: lang/cpp/namespace_definitions/TestNamespaceDefinitions.py lldb-api :: lang/objc/foundation/TestObjectDescriptionAPI.py lldb-api :: types/TestDoubleTypes.py lldb-api :: lang/objc/objc-static-method/TestObjCStaticMethod.py lldb-api :: commands/frame/diagnose/virtual-method-call/TestDiagnoseDereferenceVirtualMethodCall.py lldb-api :: functionalities/breakpoint/breakpoint_by_line_and_column/TestBreakpointByLineAndColumn.py lldb-api :: lang/cpp/global_variables/TestCPPGlobalVariables.py lldb-api :: commands/process/launch/TestProcessLaunch.py lldb-api :: functionalities/data-formatter/data-formatter-advanced/TestDataFormatterAdv.py lldb-api :: lang/c/tls_globals/TestTlsGlobals.py lldb-api :: functionalities/ptr_refs/TestPtrRefs.py lldb-api :: functionalities/data-formatter/data-formatter-stl/libcxx/list/loop/TestDataFormatterLibcxxListLoop.py lldb-api :: lang/objc/ptr_refs/TestPtrRefsObjC.py lldb-api :: functionalities/process_group/TestChangeProcessGroup.py lldb-api :: functionalities/data-formatter/data-formatter-objc/TestDataFormatterObjCCF.py lldb-api :: python_api/process/read-mem-cstring/TestReadMemCString.py lldb-api :: commands/frame/diagnose/dereference-argument/TestDiagnoseDereferenceArgument.py lldb-api :: lang/objc/foundation/TestObjCMethodsNSArray.py lldb-api :: lang/cpp/char8_t/TestCxxChar8_t.py lldb-api :: commands/expression/options/TestExprOptions.py lldb-api :: commands/frame/select/TestFrameSelect.py lldb-api :: functionalities/data-formatter/data-formatter-smart-array/TestDataFormatterSmartArray.py lldb-api :: commands/frame/diagnose/dereference-this/TestDiagnoseDereferenceThis.py lldb-api :: python_api/sbvalue_const_addrof/TestSBValueConstAddrOf.py lldb-api :: lang/objc/real-definition/TestRealDefinition.py lldb-api :: functionalities/data-formatter/nsdictionarysynth/TestNSDictionarySynthetic.py lldb-api :: functionalities/data-formatter/synthcapping/TestSyntheticCapping.py lldb-api :: lang/c/register_variables/TestRegisterVariables.py lldb-api :: lang/cpp/unique-types/TestUniqueTypes.py lldb-api :: lang/c/inlines/TestRedefinitionsInInlines.py lldb-api :: lang/cpp/overloaded-functions/TestOverloadedFunctions.py lldb-api :: lang/cpp/limit-debug-info/TestWithLimitDebugInfo.py lldb-api :: lang/objc/objc-super/TestObjCSuper.py lldb-api :: functionalities/data-formatter/data-formatter-skip-summary/TestDataFormatterSkipSummary.py lldb-api :: lang/c/strings/TestCStrings.py lldb-api :: functionalities/archives/TestBSDArchives.py lldb-api :: commands/expression/import-std-module/vector-of-vectors/TestVectorOfVectors.py lldb-api :: functionalities/data-formatter/data-formatter-named-summaries/TestDataFormatterNamedSummaries.py lldb-api :: lang/objc/objc-baseclass-sbtype/TestObjCBaseClassSBType.py lldb-api :: commands/expression/unwind_expression/TestUnwindExpression.py lldb-api :: functionalities/breakpoint/breakpoint_command/TestBreakpointCommandsFromPython.py lldb-api :: functionalities/data-formatter/data-formatter-stl/libcxx/forward_list/TestDataFormatterLibcxxForwardList.py lldb-api :: lang/cpp/bool/TestCPPBool.py lldb-api :: python_api/class_members/TestSBTypeClassMembers.py lldb-api :: python_api/function_symbol/TestDisasmAPI.py lldb-api :: functionalities/breakpoint/dummy_target_breakpoints/TestBreakpointsWithNoTargets.py lldb-api :: functionalities/data-formatter/data-formatter-categories/TestDataFormatterCategories.py lldb-api :: lang/objc/modules-inline-functions/TestModulesInlineFunctions.py lldb-api :: python_api/function_symbol/TestSymbolAPI.py lldb-api :: commands/expression/ir-interpreter-phi-nodes/TestIRInterpreterPHINodes.py lldb-api :: lang/c/bitfields/TestBitfields.py lldb-api :: commands/expression/timeout/TestCallWithTimeout.py lldb-api :: macosx/add-dsym/TestAddDsymMidExecutionCommand.py lldb-api :: lang/cpp/namespace_conflicts/TestNamespaceConflicts.py lldb-api :: python_api/sbtype_typeclass/TestSBTypeTypeClass.py lldb-api :: functionalities/data-formatter/data-formatter-globals/TestDataFormatterGlobals.py lldb-api :: python_api/value/TestValueAPI.py lldb-api :: commands/expression/call-overridden-method/TestCallOverriddenMethod.py lldb-api :: lang/c/function_types/TestFunctionTypes.py lldb-api :: commands/process/launch-with-shellexpand/TestLaunchWithShellExpand.py lldb-api :: functionalities/modern-type-lookup/basic-objc/TestBasicObjcModernTypeLookup.py lldb-api :: commands/expression/call-function/TestCallStopAndContinue.py lldb-api :: driver/batch_mode/TestBatchMode.py lldb-api :: commands/frame/diagnose/array/TestArray.py lldb-api :: functionalities/data-formatter/dump_dynamic/TestDumpDynamic.py lldb-api :: functionalities/dynamic_value_child_count/TestDynamicValueChildCount.py lldb-api :: linux/builtin_trap/TestBuiltinTrap.py lldb-api :: lang/objc/objc-stepping/TestObjCStepping.py lldb-api :: commands/expression/xvalue/TestXValuePrinting.py lldb-api :: lang/objc/self/TestObjCSelf.py lldb-api :: functionalities/data-formatter/refpointer-recursion/TestDataFormatterRefPtrRecursion.py lldb-api :: python_api/value/change_values/TestChangeValueAPI.py lldb-api :: functionalities/data-formatter/data-formatter-enum-format/TestDataFormatterEnumFormat.py lldb-api :: lang/c/forward/TestForwardDeclaration.py lldb-api :: functionalities/breakpoint/move_nearest/TestMoveNearest.py lldb-api :: functionalities/data-formatter/data-formatter-objc/TestDataFormatterObjNSException.py lldb-api :: functionalities/thread/num_threads/TestNumThreads.py lldb-api :: python_api/thread/TestThreadAPI.py lldb-api :: lang/c/offsetof/TestOffsetof.py lldb-api :: commands/expression/entry-bp/TestExprEntryBP.py lldb-api :: python_api/objc_type/TestObjCType.py lldb-api :: lang/cpp/static_methods/TestCPPStaticMethods.py lldb-api :: lang/cpp/extern_c/TestExternCSymbols.py lldb-api :: commands/expression/unicode-in-variable/TestUnicodeInVariable.py lldb-api :: commands/expression/import-std-module/weak_ptr-dbg-info-content/TestDbgInfoContentWeakPtr.py lldb-api :: functionalities/breakpoint/breakpoint_command/TestBreakpointCommand.py lldb-api :: lang/cpp/gmodules-templates/TestGModules.py lldb-api :: lang/objc/objc++/TestObjCXX.py lldb-api :: functionalities/data-formatter/var-in-aggregate-misuse/TestVarInAggregateMisuse.py lldb-api :: types/TestDoubleTypesExpr.py lldb-api :: macosx/find-dsym/deep-bundle/TestDeepBundle.py lldb-api :: commands/expression/radar_9531204/TestPrintfAfterUp.py lldb-api :: functionalities/breakpoint/cpp/TestCPPBreakpointLocations.py lldb-api :: lang/cpp/enum_types/TestCPP11EnumTypes.py lldb-api :: functionalities/breakpoint/breakpoint_command/TestRegexpBreakCommand.py lldb-api :: functionalities/data-formatter/summary-string-onfail/Test-rdar-9974002.py lldb-api :: functionalities/step-avoids-no-debug/TestStepNoDebug.py lldb-api :: python_api/exprpath_synthetic/TestExprPathSynthetic.py lldb-api :: macosx/find-app-in-bundle/TestFindAppInBundle.py lldb-api :: lang/cpp/const_this/TestConstThis.py lldb-api :: lang/c/struct_types/TestStructTypes.py lldb-api :: functionalities/data-formatter/data-formatter-stl/libcxx/list/TestDataFormatterLibcxxList.py lldb-api :: commands/expression/import-std-module/shared_ptr/TestSharedPtr.py lldb-api :: python_api/symbol-context/two-files/TestSymbolContextTwoFiles.py lldb-api :: functionalities/breakpoint/breakpoint_conditions/TestBreakpointConditions.py lldb-api :: lang/c/set_values/TestSetValues.py lldb-api :: lang/cpp/dynamic-value-same-basename/TestDynamicValueSameBase.py lldb-api :: types/TestIntegerTypes.py lldb-api :: functionalities/var_path/TestVarPath.py lldb-api :: functionalities/data-formatter/data-formatter-disabling/TestDataFormatterDisabling.py lldb-api :: commands/expression/import-std-module/weak_ptr/TestWeakPtr.py lldb-api :: functionalities/data-formatter/data-formatter-stl/libcxx/multimap/TestDataFormatterLibccMultiMap.py lldb-api :: commands/disassemble/basic/TestDisassembleBreakpoint.py lldb-api :: commands/frame/diagnose/local-variable/TestLocalVariable.py lldb-api :: functionalities/data-formatter/data-formatter-stl/libcxx/map/TestDataFormatterLibccMap.py lldb-api :: functionalities/breakpoint/inlined_breakpoints/TestInlinedBreakpoints.py lldb-api :: functionalities/tail_call_frames/ambiguous_tail_call_seq2/TestAmbiguousTailCallSeq2.py lldb-api :: functionalities/thread/concurrent_events/TestConcurrentDelayedCrashWithBreakpointSignal.py lldb-api :: python_api/value/linked_list/TestValueAPILinkedList.py lldb-api :: commands/expression/top-level/TestTopLevelExprs.py lldb-api :: functionalities/inferior-crashing/recursive-inferior/TestRecursiveInferior.py lldb-api :: functionalities/data-formatter/data-formatter-stl/libstdcpp/unique_ptr/invalid/TestDataFormatterInvalidStdUniquePtr.py lldb-api :: lang/cpp/virtual/TestVirtual.py lldb-api :: functionalities/data-formatter/data-formatter-proper-plurals/TestFormattersOneIsSingular.py lldb-api :: functionalities/rerun/TestRerun.py lldb-api :: functionalities/data-formatter/ostypeformatting/TestFormattersOsType.py lldb-api :: lang/objc/foundation/TestObjCMethodsString.py lldb-api :: lang/cpp/global_operators/TestCppGlobalOperators.py lldb-api :: python_api/frame/get-variables/TestGetVariables.py lldb-api :: functionalities/data-formatter/data-formatter-objc/TestDataFormatterObjCNSContainer.py lldb-api :: commands/expression/import-std-module/vector-bool/TestBoolVector.py lldb-api :: functionalities/breakpoint/breakpoint_ignore_count/TestBreakpointIgnoreCount.py lldb-api :: lang/objc/rdar-10967107/TestRdar10967107.py lldb-api :: functionalities/return-value/TestReturnValue.py lldb-api :: commands/expression/rdar42038760/TestScalarURem.py lldb-api :: lang/objc/objc-property/TestObjCProperty.py lldb-api :: commands/expression/radar_8638051/Test8638051.py lldb-api :: functionalities/set-data/TestSetData.py lldb-api :: functionalities/data-formatter/type_summary_list_script/TestTypeSummaryListScript.py lldb-api :: commands/expression/import-std-module/deque-basic/TestBasicDeque.py lldb-api :: commands/frame/diagnose/inheritance/TestDiagnoseInheritance.py lldb-api :: functionalities/thread/concurrent_events/TestConcurrentTwoBreakpointsOneSignal.py lldb-api :: lang/cpp/thread_local/TestThreadLocal.py lldb-api :: commands/frame/diagnose/dereference-function-return/TestDiagnoseDereferenceFunctionReturn.py lldb-api :: lang/cpp/chained-calls/TestCppChainedCalls.py lldb-api :: lang/c/anonymous/TestAnonymous.py lldb-api :: functionalities/completion/TestCompletion.py lldb-api :: functionalities/data-formatter/poarray/TestPrintObjectArray.py lldb-api :: commands/expression/completion/TestExprCompletion.py lldb-api :: functionalities/data-formatter/nssetsynth/TestNSSetSynthetic.py lldb-api :: commands/expression/dollar-in-variable/TestDollarInVariable.py lldb-api :: commands/expression/import-std-module/unique_ptr/TestUniquePtr.py lldb-api :: commands/expression/test/TestExprs.py lldb-api :: functionalities/thread/concurrent_events/TestConcurrentTwoBreakpointsOneDelaySignal.py lldb-api :: python_api/frame/TestFrames.py lldb-api :: functionalities/breakpoint/breakpoint_locations/TestBreakpointLocations.py lldb-api :: commands/process/attach-resume/TestAttachResume.py lldb-api :: lang/cpp/symbols/TestSymbols.py lldb-api :: functionalities/data-formatter/data-formatter-objc/TestDataFormatterObjCNSURL.py lldb-api :: lang/objcxx/hide-runtime-values/TestObjCXXHideRuntimeValues.py lldb-api :: functionalities/tail_call_frames/inlining_and_tail_calls/TestInliningAndTailCalls.py lldb-api :: functionalities/modern-type-lookup/objc-modules/TestObjModulesModernTypeLookup.py lldb-api :: functionalities/data-formatter/varscript_formatting/TestDataFormatterVarScriptFormatting.py lldb-api :: functionalities/data-formatter/data-formatter-stl/libcxx/bitset/TestDataFormatterLibcxxBitset.py lldb-api :: api/check_public_api_headers/TestPublicAPIHeaders.py lldb-api :: commands/expression/import-std-module/deque-dbg-info-content/TestDbgInfoContentDeque.py lldb-api :: functionalities/modern-type-lookup/libcxx/TestLibCxxModernTypeLookup.py lldb-api :: functionalities/thread/thread_exit/TestThreadExit.py lldb-api :: lang/cpp/type_lookup/TestCppTypeLookup.py lldb-api :: commands/frame/diagnose/bad-reference/TestBadReference.py lldb-api :: commands/target/basic/TestTargetCommand.py lldb-api :: python_api/formatters/TestFormattersSBAPI.py lldb-api :: functionalities/data-formatter/stringprinter/TestStringPrinter.py lldb-api :: functionalities/thread/exit_during_break/TestExitDuringBreak.py lldb-api :: functionalities/breakpoint/breakpoint_ids/TestBreakpointIDs.py lldb-api :: lang/cpp/namespace/TestNamespace.py lldb-api :: commands/expression/persistent_types/TestPersistentTypes.py lldb-api :: functionalities/data-formatter/data-formatter-objc/nsstring/TestDataFormatterNSString.py lldb-api :: functionalities/data-formatter/format-propagation/TestFormatPropagation.py lldb-api :: lang/c/conflicting-symbol/TestConflictingSymbol.py lldb-api :: python_api/hello_world/TestHelloWorld.py lldb-api :: functionalities/data-formatter/data-formatter-stl/libcxx/set/TestDataFormatterLibcxxSet.py lldb-api :: python_api/value_var_update/TestValueVarUpdate.py lldb-api :: macosx/nslog/TestDarwinNSLogOutput.py lldb-api :: functionalities/unwind/sigtramp/TestSigtrampUnwind.py lldb-api :: lang/objc/conflicting-definition/TestConflictingDefinition.py lldb-api :: functionalities/thread/concurrent_events/TestConcurrentSignalDelayBreak.py lldb-api :: functionalities/thread/concurrent_events/TestConcurrentManyBreakpoints.py lldb-api :: lang/cpp/unsigned_types/TestUnsignedTypes.py lldb-api :: lang/objcxx/class-name-clash/TestNameClash.py lldb-api :: lang/objc/objc-optimized/TestObjcOptimized.py lldb-api :: functionalities/tail_call_frames/thread_step_out_or_return/TestSteppingOutWithArtificialFrames.py lldb-api :: lang/cpp/operator-overload/TestOperatorOverload.py lldb-api :: lang/c/find_struct_type/TestFindStructTypes.py lldb-api :: functionalities/tail_call_frames/unambiguous_sequence/TestUnambiguousTailCalls.py lldb-api :: lang/c/local_variables/TestLocalVariables.py lldb-api :: functionalities/memory-region/TestMemoryRegion.py lldb-api :: functionalities/thread/thread_specific_break/TestThreadSpecificBreakpoint.py lldb-api :: functionalities/data-formatter/data-formatter-stl/libcxx/optional/TestDataFormatterLibcxxOptional.py lldb-api :: commands/expression/completion-in-lambda-and-unnnamed-class/TestCompletionInLambdaAndUnnamedClass.py lldb-api :: commands/expression/persistent_ptr_update/TestPersistentPtrUpdate.py lldb-api :: commands/expression/import-std-module/unique_ptr-dbg-info-content/TestUniquePtrDbgInfoContent.py lldb-api :: functionalities/thread/concurrent_events/TestConcurrentBreakpointOneDelayBreakpointThreads.py lldb-api :: types/TestFloatTypes.py lldb-api :: commands/apropos/with-process/TestAproposWithProcess.py lldb-api :: python_api/name_lookup/TestNameLookup.py lldb-api :: python_api/process/io/TestProcessIO.py lldb-api :: commands/expression/anonymous-struct/TestCallUserAnonTypedef.py lldb-api :: functionalities/thread/concurrent_events/TestConcurrentCrashWithBreak.py lldb-api :: commands/expression/import-std-module/empty-module/TestEmptyStdModule.py lldb-api :: lang/objc/objc-ivar-offsets/TestObjCIvarOffsets.py lldb-api :: lang/objc/hidden-ivars/TestHiddenIvars.py lldb-api :: lang/cpp/class_types/TestClassTypes.py lldb-api :: functionalities/breakpoint/global_constructor/TestBreakpointInGlobalConstructor.py lldb-api :: functionalities/data-formatter/frameformat_smallstruct/TestFrameFormatSmallStruct.py lldb-api :: functionalities/thread/backtrace_limit/TestBacktraceLimit.py lldb-api :: functionalities/thread/concurrent_events/TestConcurrentBreakpointDelayBreakpointOneSignal.py lldb-api :: macosx/indirect_symbol/TestIndirectSymbols.py lldb-api :: lang/c/modules/TestCModules.py lldb-api :: lang/objcxx/objcxx-ivar-vector/TestIvarVector.py lldb-api :: lang/cpp/offsetof/TestOffsetofCpp.py lldb-api :: functionalities/thread/concurrent_events/TestConcurrentTwoBreakpointThreads.py lldb-api :: python_api/sbvalue_persist/TestSBValuePersist.py lldb-api :: commands/expression/class_template_specialization_empty_pack/TestClassTemplateSpecializationParametersHandling.py lldb-api :: lang/cpp/virtual-overload/TestVirtualOverload.py lldb-api :: commands/expression/issue_11588/Test11588.py lldb-api :: commands/expression/diagnostics/TestExprDiagnostics.py lldb-api :: lang/objc/objc-ivar-protocols/TestIvarProtocols.py lldb-api :: lang/objc/foundation/TestRuntimeTypes.py lldb-api :: commands/expression/context-object/TestContextObject.py lldb-api :: lang/cpp/inlines/TestInlines.py lldb-api :: functionalities/inferior-crashing/TestInferiorCrashing.py lldb-api :: lang/cpp/llvm-style/TestLLVMStyle.py lldb-api :: lang/cpp/modules-import/TestCXXModulesImport.py lldb-api :: lang/cpp/diamond/TestDiamond.py lldb-api :: lang/objc/objc-checker/TestObjCCheckers.py lldb-api :: commands/expression/po_verbosity/TestPoVerbosity.py lldb-api :: functionalities/data-formatter/data-formatter-synth/TestDataFormatterSynth.py lldb-api :: commands/expression/weak_symbols/TestWeakSymbols.py lldb-api :: python_api/lldbutil/process/TestPrintStackTraces.py lldb-api :: functionalities/breakpoint/source_regexp/TestSourceRegexBreakpoints.py lldb-api :: functionalities/data-formatter/typedef_array/TestTypedefArray.py lldb-api :: lang/cpp/nested-class-other-compilation-unit/TestNestedClassWithParentInAnotherCU.py lldb-api :: functionalities/tail_call_frames/ambiguous_tail_call_seq1/TestAmbiguousTailCallSeq1.py lldb-api :: functionalities/non-overlapping-index-variable-i/TestIndexVariable.py lldb-api :: commands/expression/import-std-module/no-std-module/TestMissingStdModule.py lldb-api :: commands/expression/pr35310/TestExprsBug35310.py lldb-api :: functionalities/thread/concurrent_events/TestConcurrentCrashWithSignal.py lldb-api :: lang/c/shared_lib/TestSharedLib.py lldb-api :: commands/expression/context-object-objc/TestContextObjectObjc.py lldb-api :: functionalities/recursion/TestValueObjectRecursion.py lldb-api :: functionalities/data-formatter/data-formatter-objc/TestDataFormatterObjCKVO.py lldb-api :: functionalities/data-formatter/boolreference/TestFormattersBoolRefPtr.py lldb-api :: functionalities/tail_call_frames/disambiguate_paths_to_common_sink/TestDisambiguatePathsToCommonSink.py lldb-api :: functionalities/data-formatter/data-formatter-stl/libcxx/atomic/TestLibCxxAtomic.py lldb-api :: lang/c/step-target/TestStepTarget.py lldb-api :: lang/objc/global_ptrs/TestGlobalObjects.py lldb-api :: functionalities/data-formatter/synthupdate/TestSyntheticFilterRecompute.py lldb-api :: sample_test/TestSampleInlineTest.py lldb-api :: functionalities/data-formatter/data-formatter-objc/TestDataFormatterObjCNSDate.py lldb-api :: lang/objc/objc-new-syntax/TestObjCNewSyntaxArray.py lldb-api :: functionalities/thread/crash_during_step/TestCrashDuringStep.py lldb-api :: lang/objc/radar-9691614/TestObjCMethodReturningBOOL.py lldb-api :: lang/objc/objc-struct-argument/TestObjCStructArgument.py lldb-api :: commands/expression/import-std-module/list-dbg-info-content/TestDbgInfoContentList.py lldb-api :: lang/objc/objc-ivar-stripped/TestObjCIvarStripped.py lldb-api :: commands/disassemble/basic/TestFrameDisassemble.py lldb-api :: lang/cpp/template-function/TestTemplateFunctions.py lldb-api :: functionalities/data-formatter/data-formatter-synthval/TestDataFormatterSynthVal.py lldb-api :: source-manager/TestSourceManager.py lldb-api :: functionalities/conditional_break/TestConditionalBreak.py lldb-api :: commands/target/stop-hooks/TestStopHooks.py lldb-api :: functionalities/breakpoint/scripted_bkpt/TestScriptedResolver.py lldb-api :: functionalities/data-formatter/user-format-vs-summary/TestUserFormatVsSummary.py lldb-api :: functionalities/data-formatter/vector-types/TestVectorTypesFormatting.py lldb-api :: lang/objc/unicode-string/TestUnicodeString.py lldb-api :: lang/cpp/scope/TestCppScope.py lldb-api :: functionalities/data-formatter/data-formatter-script/TestDataFormatterScript.py lldb-api :: lang/cpp/class_static/TestStaticVariables.py lldb-shell :: Reproducer/Functionalities/TestStepping.test lldb-api :: lang/c/enum_types/TestEnumTypes.py lldb-api :: lang/objc/modules-cache/TestClangModulesCache.py lldb-api :: functionalities/data-formatter/data-formatter-objc/TestDataFormatterObjCPlain.py lldb-api :: commands/settings/TestSettings.py lldb-api :: functionalities/data-formatter/language_category_updates/TestDataFormatterLanguageCategoryUpdates.py lldb-api :: lang/c/blocks/TestBlocks.py lldb-api :: python_api/frame/inlines/TestInlinedFrame.py lldb-api :: types/TestFloatTypesExpr.py lldb-api :: functionalities/type_lookup/TestTypeLookup.py lldb-api :: commands/expression/vector_of_enums/TestVectorOfEnums.py lldb-api :: lang/objc/objc-new-syntax/TestObjCNewSyntaxDictionary.py lldb-api :: functionalities/data-formatter/data-formatter-objc/TestDataFormatterObjCExpr.py lldb-api :: functionalities/data-formatter/pyobjsynthprovider/TestPyObjSynthProvider.py lldb-api :: lang/c/unions/TestUnionMembers.py lldb-api :: lang/objc/modules-auto-import/TestModulesAutoImport.py lldb-api :: commands/frame/var/TestFrameVar.py lldb-api :: commands/expression/import-std-module/vector-dbg-info-content/TestDbgInfoContentVector.py lldb-api :: python_api/lldbutil/frame/TestFrameUtils.py lldb-api :: lang/cpp/namespace/TestNamespaceLookup.py lldb-api :: commands/expression/call-function/TestCallStdStringFunction.py lldb-api :: functionalities/inferior-assert/TestInferiorAssert.py lldb-api :: functionalities/breakpoint/step_over_breakpoint/TestStepOverBreakpoint.py lldb-api :: functionalities/data-formatter/data-formatter-stl/libcxx/unordered/TestDataFormatterUnordered.py lldb-api :: functionalities/breakpoint/comp_dir_symlink/TestCompDirSymLink.py lldb-api :: commands/expression/import-std-module/basic/TestImportStdModule.py lldb-api :: functionalities/breakpoint/breakpoint_set_restart/TestBreakpointSetRestart.py lldb-api :: functionalities/data-formatter/setvaluefromcstring/TestSetValueFromCString.py lldb-api :: functionalities/float-display/TestFloatDisplay.py lldb-api :: commands/statistics/basic/TestStats.py lldb-api :: lang/objc/foundation/TestConstStrings.py lldb-api :: lang/objc/objc-foundation-dictionary-empty/TestNSDictionary0.py lldb-api :: functionalities/data-formatter/data-formatter-stl/libcxx/initializerlist/TestInitializerList.py lldb-api :: functionalities/thread/concurrent_events/TestConcurrentDelaySignalBreak.py lldb-api :: functionalities/thread/jump/TestThreadJump.py lldb-api :: lang/objc/exceptions/TestObjCExceptions.py lldb-api :: functionalities/data-formatter/data-formatter-stl/libcxx/variant/TestDataFormatterLibcxxVariant.py lldb-api :: lang/cpp/dynamic-value/TestDynamicValue.py lldb-api :: functionalities/data-formatter/ptr_ref_typedef/TestPtrRef2Typedef.py lldb-api :: functionalities/data-formatter/compactvectors/TestCompactVectors.py lldb-api :: lang/objc/blocks/TestObjCIvarsInBlocks.py lldb-api :: commands/gui/basic/TestGuiBasic.py lldb-api :: functionalities/type_completion/TestTypeCompletion.py lldb-api :: functionalities/thread/backtrace_all/TestBacktraceAll.py lldb-api :: lang/cpp/std-function-step-into-callable/TestStdFunctionStepIntoCallable.py lldb-api :: commands/expression/import-std-module/vector-basic/TestBasicVector.py lldb-api :: commands/expression/fixits/TestFixIts.py lldb-api :: commands/source/info/TestSourceInfo.py lldb-api :: python_api/sbdata/TestSBData.py lldb-api :: lang/cpp/breakpoint-commands/TestCPPBreakpointCommands.py lldb-api :: lang/cpp/class-template-parameter-pack/TestClassTemplateParameterPack.py lldb-api :: functionalities/memory/find/TestMemoryFind.py lldb-api :: functionalities/plugins/python_os_plugin/TestPythonOSPlugin.py lldb-api :: types/TestRecursiveTypes.py lldb-api :: commands/expression/rdar44436068/Test128BitsInteger.py lldb-api :: lang/objc/variadic_methods/TestVariadicMethods.py lldb-api :: functionalities/modern-type-lookup/basic/TestBasicModernTypeLookup.py lldb-api :: functionalities/exec/TestExec.py lldb-api :: commands/frame/var-scope/TestFrameVariableScope.py lldb-api :: lang/cpp/auto/TestCPPAuto.py lldb-api :: lang/objc/objc-builtin-types/TestObjCBuiltinTypes.py lldb-api :: lang/objc/foundation/TestObjCMethods2.py lldb-api :: functionalities/breakpoint/breakpoint_language/TestBreakpointLanguage.py lldb-api :: lang/c/unicode/TestUnicodeSymbols.py lldb-api :: lang/objc/objc-class-method/TestObjCClassMethod.py lldb-api :: lang/cpp/accelerator-table/TestCPPAccelerator.py lldb-api :: commands/expression/import-std-module/list-basic/TestBasicList.py lldb-api :: functionalities/thread/concurrent_events/TestConcurrentSignalBreak.py lldb-api :: functionalities/data-formatter/data-formatter-stl/libcxx/string/TestDataFormatterLibcxxString.py lldb-api :: lang/cpp/frame-var-anon-unions/TestFrameVariableAnonymousUnions.py lldb-api :: commands/expression/import-std-module/stack/TestStack.py lldb-api :: python_api/interpreter/TestCommandInterpreterAPI.py lldb-api :: lang/cpp/dynamic-value/TestCppValueCast.py lldb-api :: functionalities/avoids-fd-leak/TestFdLeak.py lldb-api :: commands/expression/inline-namespace/TestInlineNamespace.py lldb-api :: lang/c/vla/TestVLA.py lldb-api :: macosx/duplicate-archive-members/TestDuplicateMembers.py lldb-api :: lang/c/const_variables/TestConstVariables.py lldb-api :: commands/expression/dont_allow_jit/TestAllowJIT.py lldb-api :: functionalities/load_using_paths/TestLoadUsingPaths.py lldb-api :: python_api/symbol-context/TestSymbolContext.py lldb-api :: functionalities/data-formatter/data-formatter-stl/libcxx/queue/TestDataFormatterLibcxxQueue.py lldb-api :: functionalities/data-formatter/data-formatter-stl/libcxx/iterator/TestDataFormatterLibccIterator.py lldb-api :: functionalities/inline-stepping/TestInlineStepping.py lldb-api :: commands/expression/call-function/TestCallUserDefinedFunction.py lldb-api :: functionalities/inferior-crashing/TestInferiorCrashingStep.py lldb-api :: commands/expression/radar_9673664/TestExprHelpExamples.py lldb-api :: lang/objc/single-entry-dictionary/TestObjCSingleEntryDictionary.py lldb-api :: functionalities/data-formatter/nsarraysynth/TestNSArraySynthetic.py

Hide Details

******************** Timed Out Tests (3): lldb-api :: python_api/lldbutil/iter/TestLLDBIterator.py lldb-api :: python_api/lldbutil/iter/TestRegistersIterator.py lldb-api :: lang/objc/foundation/TestObjCMethods.py

Hide Details

Hide Details

Slowest Tests: -------------------------------------------------------------------------- 21.00s: lldb-api :: lang/cpp/namespace/TestNamespaceLookup.py 22.32s: lldb-api :: lang/objc/foundation/TestObjCMethodsString.py 23.21s: lldb-api :: python_api/module_section/TestModuleAndSection.py 23.50s: lldb-api :: lang/objc/foundation/TestObjCMethodsNSError.py 27.21s: lldb-api :: lang/objc/exceptions/TestObjCExceptions.py 28.61s: lldb-api :: lang/objc/objc-new-syntax/TestObjCNewSyntaxLiteral.py 29.74s: lldb-api :: lang/objc/real-definition/TestRealDefinition.py 31.69s: lldb-api :: commands/gui/basic/TestGuiBasic.py 44.71s: lldb-api :: lang/objc/hidden-ivars/TestHiddenIvars.py 45.85s: lldb-api :: types/TestIntegerTypes.py 47.66s: lldb-api :: types/TestIntegerTypesExpr.py 53.30s: lldb-api :: api/multithreaded/TestMultithreaded.py 58.94s: lldb-api :: tools/lldb-server/TestLldbGdbServer.py 62.46s: lldb-api :: commands/expression/multiline-completion/TestMultilineCompletion.py 69.76s: lldb-api :: macosx/nslog/TestDarwinNSLogOutput.py 98.55s: lldb-api :: driver/batch_mode/TestBatchMode.py 157.89s: lldb-api :: lang/objc/foundation/TestFoundationDisassembly.py 600.04s: lldb-api :: python_api/lldbutil/iter/TestRegistersIterator.py 600.05s: lldb-api :: python_api/lldbutil/iter/TestLLDBIterator.py 600.06s: lldb-api :: lang/objc/foundation/TestObjCMethods.py

Hide Details

Tests Times: -------------------------------------------------------------------------- [ Range ] :: [ Percentage ] :: [ Count ] -------------------------------------------------------------------------- [ 0s, 50s) :: [*************************************** ] :: [1778/1788] [ 50s,100s) :: [ ] :: [ 5/1788] [100s,150s) :: [ ] :: [ 1/1788] [150s,200s) :: [ ] :: [ 1/1788] [200s,250s) :: [ ] :: [ 0/1788] [250s,300s) :: [ ] :: [ 0/1788] [300s,350s) :: [ ] :: [ 0/1788] [350s,400s) :: [ ] :: [ 0/1788] [400s,450s) :: [ ] :: [ 0/1788] [450s,500s) :: [ ] :: [ 0/1788] [500s,550s) :: [ ] :: [ 0/1788] [550s,600s) :: [ ] :: [ 0/1788] [600s,650s) :: [ ] :: [ 3/1788] Expected Passes : 1067 Expected Failures : 5 Unsupported Tests : 238 Unexpected Failures: 475 Individual Timeouts: 3 FAILED: tools/lldb/test/CMakeFiles/check-lldb-lit cd /Users/buildslave/jenkins/workspace/lldb-cmake-matrix/lldb-build/tools/lldb/test && /usr/bin/python /Users/buildslave/jenkins/workspace/lldb-cmake-matrix/lldb-build/./bin/llvm-lit -v --time-tests --shuffle --xunit-xml-output=/Users/buildslave/jenkins/workspace/lldb-cmake-matrix/test/results.xml -v /Users/buildslave/jenkins/workspace/lldb-cmake-matrix/lldb-build/tools/lldb/test ninja: build stopped: subcommand failed. Command failed Command: ['/usr/bin/env', 'TERM=vt100', '/usr/local/bin/ninja', '-v', 'check-lldb'] + set -e [Pipeline] } [Pipeline] // timeout [Pipeline] } [Pipeline] // stage [Pipeline] stage [Pipeline] { (Build Clang 5.0.2) [Pipeline] dir Running in /Users/buildslave/jenkins/workspace/lldb-cmake-matrix/clang_502 [Pipeline] { [Pipeline] checkout [Pipeline] } [Pipeline] // dir [Pipeline] } [Pipeline] // stage [Pipeline] stage [Pipeline] { (Test Clang 5.0.2) Stage "Test Clang 5.0.2" skipped due to earlier failure(s) [Pipeline] } [Pipeline] // stage [Pipeline] stage [Pipeline] { (Build Clang 7.0.1) Stage "Build Clang 7.0.1" skipped due to earlier failure(s) [Pipeline] } [Pipeline] // stage [Pipeline] stage [Pipeline] { (Test Clang 7.0.1) Stage "Test Clang 7.0.1" skipped due to earlier failure(s) [Pipeline] } [Pipeline] // stage [Pipeline] stage [Pipeline] { (Build Clang 9.0.0) Stage "Build Clang 9.0.0" skipped due to earlier failure(s) [Pipeline] } [Pipeline] // stage [Pipeline] stage [Pipeline] { (Test Clang 9.0.0) Stage "Test Clang 9.0.0" skipped due to earlier failure(s) [Pipeline] } [Pipeline] // stage [Pipeline] } [Pipeline] // withEnv [Pipeline] } [Pipeline] // node [Pipeline] End of Pipeline [BFA] Scanning build for known causes... [BFA] Exception during parsing file: java.io.FileNotFoundException: /Users/Shared/Jenkins/Home/jobs/lldb-cmake-matrix/builds/442/log (Too many open files)[BFA] No failure causes found [BFA] Done. 0s java.nio.file.FileSystemException: /Users/Shared/Jenkins/Home/jobs/lldb-cmake-matrix/builds/442/changelog867491968086785303.xml: Too many open files at sun.nio.fs.UnixException.translateToIOException(UnixException.java:91) at sun.nio.fs.UnixException.rethrowAsIOException(UnixException.java:102) at sun.nio.fs.UnixException.rethrowAsIOException(UnixException.java:107) at sun.nio.fs.UnixFileSystemProvider.newByteChannel(UnixFileSystemProvider.java:214) at java.nio.file.Files.newByteChannel(Files.java:361) at java.nio.file.Files.createFile(Files.java:632) at java.nio.file.TempFileHelper.create(TempFileHelper.java:138) at java.nio.file.TempFileHelper.createTempFile(TempFileHelper.java:161) at java.nio.file.Files.createTempFile(Files.java:852) at org.jenkinsci.plugins.workflow.steps.scm.SCMStep.checkout(SCMStep.java:107) at org.jenkinsci.plugins.workflow.steps.scm.SCMStep$StepExecutionImpl.run(SCMStep.java:93) at org.jenkinsci.plugins.workflow.steps.scm.SCMStep$StepExecutionImpl.run(SCMStep.java:80) at org.jenkinsci.plugins.workflow.steps.SynchronousNonBlockingStepExecution.lambda$start$0(SynchronousNonBlockingStepExecution.java:47) at java.util.concurrent.Executors$RunnableAdapter.call(Executors.java:511) at java.util.concurrent.FutureTask.run(FutureTask.java:266) at java.util.concurrent.ThreadPoolExecutor.runWorker(ThreadPoolExecutor.java:1149) at java.util.concurrent.ThreadPoolExecutor$Worker.run(ThreadPoolExecutor.java:624) at java.lang.Thread.run(Thread.java:748) Finished: FAILURE Resuming build at Tue Oct 15 05:24:47 PDT 2019 after Jenkins restart Ready to run at Sun Oct 20 14:20:01 PDT 2019 Resuming build at Sun Oct 20 14:20:01 PDT 2019 after Jenkins restart Aborted by Adrian Prantl Click here to forcibly terminate running steps Aborted by Adrian Prantl Click here to forcibly terminate running steps Click here to forcibly kill entire build Click here to forcibly kill entire build Hard kill! [BFA] Scanning build for known causes... [BFA] Found failure cause(s): [BFA] Ninja target failed from category Compile [BFA] Regression test failed from category Test [BFA] Compile Error from category Compile [BFA] Done. 5s Finished: ABORTED