FailedConsole Output

Skipping 8,132 KB.. Full Log
Hxxxxxxxxxxxxxxxxxxxxxxxxxxxxxxxxxxxxxxxxxxxxxxxxxxxxxxxxxxxxxxxxxxxxxxxxxxxxxxxxxxxxxxxxxxxxxxxxxxxxxxxxxxxxxxxxxxxxxxxxxxxxxxxxxxxxlqq<Help>qqqqqqqqqqqqqqqqqqqqqqqqqqqqqqqqqqqqqqqqqqqqqqqqqqqqqqqqqqqqqqqqqqqqqqqqqqqqqqqkxxxxx Welcome to the LLDB curses GUI.xxxxxxxxxxxx Press the TAB key to change the selected view.xxxxxx Each view has its own keyboard shortcuts, press 'h' to open a dialog to display them. xxxxxxxxxxxx Common key bindings for all views:xxxxxxxxxxxxtab - Select next viewxxxxxxh - Show help dialog with view specific key bindingsxxxxxx, - Page upxxxxxx. - Page downxxxxxxup - Select previousxxxxxxdown - Select nextxxxxxxleft - Unexpand or select parentxxxxxxright - Expandxxxxxx    page-up - Page upxxxxxx  page-down - Page downxxxxxmqqqqqqqqqqqqqqqqqqqqqqqqqqqqqqqqqqqqqqqqqqqqqqqqqqqqqqqqqqqqqq[Press any key to exit]qqjxxxxxxxxxxxxxxxxxxxxxxxxxxxxxxxxxxxmqqqqqqqqqqqqqqqqqqqqqqqqqqqqqqqqqqqqqqqqqqqqqqqqqqqqqqqqqqqqqqqqqqqqqqqqqqqqqqqqqqqqqqqqqqqqqqqqqqqqqqqqqqqqqqqqqqqqqqqqqqqqqqqqqqqqqqqqqqqqqqqqqqqqqqqqqqqqqqqqqqqqqqqqqqqqqqqqqqqqqqqqqqqqqqqqqqqqqqqqqqqqqqqqqqqqqqqqqqqqqqqqqqqqqqqqqqqqqqqqqqqqqqqqqqqqqqqqqqqqqqqqqqqqqqqqqqqqqqqqqqqqqqqqqqqqqqqqqqqqqqqqqqqqqqqqqqqqqqqqqqqqqqqqqqqqqqqqqqqqqqqqqqqqqqqqqqqqqqqqqqqqqqqqqqqqqqqqqqqqqqqqqqqqqqqqqqqqqqjxxlqq<Variables>qqqqqqqqqqqqqqqqqqqqqqqqqqqqqqqqqqqqqqqqqqqqqqqqqqqqqqqqqqqqqqqqqqqqqqqqqqqqqqqqqqqqqqqqqqqqqqqqqqqqqqqqqqqqqqqqqqqqqqqqqqqqqqqqqqqqqqqqqqqqqqqqqqqqqqqqqqqqqqqqqqqqqqqqqqqqqqqqqqqqqqqqqqqqqqqqqqqqqqqqqqqqqqqqqqqqqqqqqqqqqqqqqqqqqqqqqqqqqqqqqqqqqqqqqqqqqqqqqqqqqqqqqqqqqqqqqqqqqqqqqqqqqqqqqqqqqqqqqqqqqqqqqqqqqqqqqqqqqqqqqqqqqqqqqqqqqqqqqqqqqqqqqqqqqqqqqqqqqqqqqqqqqqqqqqqqqqqqqqqqqqqqqkxxx (int) argc = 1xxxx `q(char **) argv = 0x00007ffeefbff530xxxx (int) funky_var_name_that_should_be_rendered = 22xxxxxxxxxxxxxxxxxxxxxxxxxxxxxxxxxxxxxxxxxxxxxxxxxxxxxxxxxxxxxxxxxxxxxxxxxxxxxxxxxxxxxxxxxxxxxxxxxxxxxxxmqqqqqqqqqqqqqqqqqqqqqqqqqqqqqqqqqqqqqqqqqqqqqqqqqqqqqqqqqqqqqqqqqqqqqqqqqqqqqqqqqqqqqqqqqqqqqqqqqqqqqqqqqqqqqqqqqqqqqqqqqqqqqqqqqqqqqqqqqqqqqqqqqqqqqqqqqqqqqqqqqqqqqqqqqqqqqqqqqqqqqqqqqqqqqqqqqqqqqqqqqqqqqqqqqqqqqqqqqqqqqqqqqqqqqqqqqqqqqqqqqqqqqqqqqqqqqqqqqqqqqqqqqqqqqqqqqqqqqqqqqqqqqqqqqqqqqqqqqqqqqqqqqqqqqqqqqqqqqqqqqqqqqqqqqqqqqqqqqqqqqqqqqqqqqqqqqqqqqqqqqqqqqqqqqqqqqqqqqqqqqqqqqqqqqqqqqqqqqqjmqqqqqqqqqqqqqqqqqqqqqqqqqqqqqqqqqqqqqqqqqqqqqqqqqqqqqqqqqqqqqqqqqqqqqqqqqqqqqqqqqqqqqqqqqqqqqqqqqqjProcess: 75479    stopped               Thread: 0x11cade9   Frame:   0  PC = 0x0000000100000fab
lqq<Sources>qqqqqqqqqqqqqqqqqqqqqqqqqqqqqqqqqqqqqqqqqqqqqqqqqqqqqqqqqqqqqqqqqqqqqqqqqqqqqqqqqqqqqqqqqqqqqqqqqqqqqqqqqqqqqqqqqqqqqqqqqqqqqqqqqqqqqqqqqqqqqqqqqqqqqqqqqqqqqqqqqqqqqqqqqqqqqqqqqqqqqqqqqqqqqqqqqqqqqqqqqqqqqqqqqqqqqqqqqqqqqqqqqqqqqqqqqqqqqqqqqqqqqqqqqqqqqqqqqqqqqqqqqqqqqqqqqqqqqqqqqqqqqqqqqqqqqqqqqqqqqqqqqqqqqqqqqqqqqqqqqqqqqqqqqqqqqqqqqqqqqqqqqqqqqqqqqqqqqqqqqqqqqqqqqqqqqqqqqqqqqqqqqqqk
xx
xx
xx
xx
xx
xx
xx
xx
xx
xx
xx
xx
xx
xx
xx
xx
xx
xx
xx
xx
xx
xx
xx
xx
xx
xx
xx
xx
xx
xx
xx
xx
xx
xx
xx
xx
xx
xx
xx
x                                                                                         x
x                                  x
x  x
x                                                 x
x                                                                                         x
x  x
x                                     x
x  x
x                        x
x                                                      x
x             x
x               x
x                      x
x                    x
x                                  x
x                x
x                       x
x                         x
x                                                                                         x
xx
xx
xx
xx
xx
xx
xx
xx
mqqqqqqqqqqqqqqqqqqqqqqqqqqqqqqqqqqqqqqqqqqqqqqqqqqqqqqqqqqqqqqqqqqqqqqqqqqqqqqqqqqqqqqqqqqqqqqqqqqqqqqqqqqqqqqqqqqqqqqqqqqqqqqqqqqqqqqqqqqqqqqqqqqqqqqqqqqqqqqqqqqqqqqqqqqqqqqqqqqqqqqqqqqqqqqqqqqqqqqqqqqqqqqqqqqqqqqqqqqqqqqqqqqqqqqqqqqqqqqqqqqqqqqqqqqqqqqqqqqqqqqqqqqqqqqqqqqqqqqqqqqqqqqqqqqqqqqqqqqqqqqqqqqqqqqqqqqqqqqqqqqqqqqqqqqqqqqqqqqqqqqqqqqqqqqqqqqqqqqqqqqqqqqqqqqqqqqqqqqqqqqqqqqqqqqqqqqqqqqj
[?1l>(lldb) gui
gui
(B)0[?7h[?1h=| LLDB (F1) | Target (F2) | Process (F3) | Thread (F4) | View (F5) | Help (F6) |
lqq<Sources>qqqqqqqqqqqqqqqqqqqqqqqqqqqqqqqqqqqqqqqqqqqqqqqqqqqqqqqqqqqqqqqqqqqqqqqqqqqqqqqqqqqqqqqqqqqqqqqqqqqqqqqqqqqqqqqqqqqqqqqqqqqqqqqqqqqqqqqqqqqqqqqqqqqqqqqqqqqqqqqqqqqqqqqqqqqqqqqqqqqqqqqqqqqqqqqqqqqqqqqqqqqqqqqqqqqqqqqqqqqqqqqqqqqqqqqqqqqqqqqqqqqqqqqqqqqqqqqqqqqqqqqqqqqqqqqqqqqqqqqqqqqqqqqqqqqqqqqqqqqqqqqqqqqqqqqqqqqqqqqqqqqqqqqqqqqqqqqqqqqqqqqqqqqqqqqqqqqqqqqqqqqqqqqqqqqqqqqqqqqqqqqqqqqklqq<Threads>qqqqqqqqqqqqqqqqqqqqqqqqqqqqqqqqqqqqqqqqqqqqqqqqqqqqqqqqqqqqqqqqqqqqqqqqqqqqqqqqqqqqqqqkx a.out`main                                                                                                                                                                                                                                                                                                                                                                                                   xx `qprocess 75479xx 1 x int main(int argc, char **argv) {xxxx 2 x   int funky_var_name_that_should_be_rendered = 22;xxxx 3 x`  return 0; // Break here                                                                                                                                                                                                                                                                                                                                                   <<< Thread 1: breakpoint 1.1 xxxx 4 x }xxxx 5 xxxxxxxxxxxxxxxxxxxxxxxxxxxxxxxxxxxxxxxxxxxxxxxxxxxxxxxxxxxxxxxxxxxxxxxxxxxxxxxxxxxxxxxxxxxxxxxxxxxxxxxxxxxxxxxxxxxxxxxxxxxxxxxxxxxxxxxxxxxxxxxxxxxxxxxxxxxxxxxxxxxxxxxxxxxxxxxxxxxxxxxxxxxxxxxxxxxxxxxxxxxxxxxxxxxxxxxxxxxxxxxxxxxxxxxxxxxxxxxxxxxxmqqqqqqqqqqqqqqqqqqqqqqqqqqqqqqqqqqqqqqqqqqqqqqqqqqqqqqqqqqqqqqqqqqqqqqqqqqqqqqqqqqqqqqqqqqqqqqqqqqqqqqqqqqqqqqqqqqqqqqqqqqqqqqqqqqqqqqqqqqqqqqqqqqqqqqqqqqqqqqqqqqqqqqqqqqqqqqqqqqqqqqqqqqqqqqqqqqqqqqqqqqqqqqqqqqqqqqqqqqqqqqqqqqqqqqqqqqqqqqqqqqqqqqqqqqqqqqqqqqqqqqqqqqqqqqqqqqqqqqqqqqqqqqqqqqqqqqqqqqqqqqqqqqqqqqqqqqqqqqqqqqqqqqqqqqqqqqqqqqqqqqqqqqqqqqqqqqqqqqqqqqqqqqqqqqqqqqqqqqqqqqqqqqqqqqqqqqqqqqjxxlqq<Variables>qqqqqqqqqqqqqqqqqqqqqqqqqqqqqqqqqqqqqqqqqqqqqqqqqqqqqqqqqqqqqqqqqqqqqqqqqqqqqqqqqqqqqqqqqqqqqqqqqqqqqqqqqqqqqqqqqqqqqqqqqqqqqqqqqqqqqqqqqqqqqqqqqqqqqqqqqqqqqqqqqqqqqqqqqqqqqqqqqqqqqqqqqqqqqqqqqqqqqqqqqqqqqqqqqqqqqqqqqqqqqqqqqqqqqqqqqqqqqqqqqqqqqqqqqqqqqqqqqqqqqqqqqqqqqqqqqqqqqqqqqqqqqqqqqqqqqqqqqqqqqqqqqqqqqqqqqqqqqqqqqqqqqqqqqqqqqqqqqqqqqqqqqqqqqqqqqqqqqqqqqqqqqqqqqqqqqqqqqqqqqqqqqkxxx (int) argc = 1xxxx `q(char **) argv = 0x00007ffeefbff530xxxx (int) funky_var_name_that_should_be_rendered = 22xxxxxxxxxxxxxxxxxxxxxxxxxxxxxxxxxxxxxxxxxxxxxxxxxxxxxxxxxxxxxxxxxxxxxxxxxxxxxxxxxxxxxxxxxxxxxxxxxxxxxxxmqqqqqqqqqqqqqqqqqqqqqqqqqqqqqqqqqqqqqqqqqqqqqqqqqqqqqqqqqqqqqqqqqqqqqqqqqqqqqqqqqqqqqqqqqqqqqqqqqqqqqqqqqqqqqqqqqqqqqqqqqqqqqqqqqqqqqqqqqqqqqqqqqqqqqqqqqqqqqqqqqqqqqqqqqqqqqqqqqqqqqqqqqqqqqqqqqqqqqqqqqqqqqqqqqqqqqqqqqqqqqqqqqqqqqqqqqqqqqqqqqqqqqqqqqqqqqqqqqqqqqqqqqqqqqqqqqqqqqqqqqqqqqqqqqqqqqqqqqqqqqqqqqqqqqqqqqqqqqqqqqqqqqqqqqqqqqqqqqqqqqqqqqqqqqqqqqqqqqqqqqqqqqqqqqqqqqqqqqqqqqqqqqqqqqqqqqqqqqqjmqqqqqqqqqqqqqqqqqqqqqqqqqqqqqqqqqqqqqqqqqqqqqqqqqqqqqqqqqqqqqqqqqqqqqqqqqqqqqqqqqqqqqqqqqqqqqqqqqqjProcess: 75479    stopped               Thread: 0x11cade9   Frame:   0  PC = 0x0000000100000fab
[?1l>(lldb) settings set interpreter.prompt-on-quit false

Hide Details

Session logs for test failures/errors/unexpected successes will go into directory '/Users/buildslave/jenkins/workspace/lldb-cmake-sanitized/test/logs' Command invoked: /Users/buildslave/jenkins/workspace/lldb-cmake-sanitized/llvm-project/lldb/test/dotest.py --arch=x86_64 -s /Users/buildslave/jenkins/workspace/lldb-cmake-sanitized/lldb-build/lldb-test-traces -S nm -u CXXFLAGS -u CFLAGS --executable /Users/buildslave/jenkins/workspace/lldb-cmake-sanitized/lldb-build/./bin/lldb --dsymutil /Users/buildslave/jenkins/workspace/lldb-cmake-sanitized/lldb-build/./bin/dsymutil --filecheck /Users/buildslave/jenkins/workspace/lldb-cmake-sanitized/lldb-build/./bin/FileCheck -C /Users/buildslave/jenkins/workspace/lldb-cmake-sanitized/host-compiler/bin/clang --codesign-identity lldb_codesign --server /Users/buildslave/jenkins/workspace/lldb-cmake-sanitized/lldb-build/./bin/debugserver --arch x86_64 --build-dir /Users/buildslave/jenkins/workspace/lldb-cmake-sanitized/lldb-build/lldb-test-build.noindex -s=/Users/buildslave/jenkins/workspace/lldb-cmake-sanitized/test/logs -t --env TERM=vt100 --env LLVM_LIBS_DIR=/Users/buildslave/jenkins/workspace/lldb-cmake-sanitized/lldb-build/./lib --build-dir /Users/buildslave/jenkins/workspace/lldb-cmake-sanitized/lldb-build/tools/lldb/lldb-test-build.noindex --module-cache-dir /Users/buildslave/jenkins/workspace/lldb-cmake-sanitized/lldb-build/tools/lldb/lldb-test-build.noindex/module-cache-lldb /Users/buildslave/jenkins/workspace/lldb-cmake-sanitized/llvm-project/lldb/packages/Python/lldbsuite/test/commands/gui/basic -p TestGuiBasic.py Change dir to: /Users/buildslave/jenkins/workspace/lldb-cmake-sanitized/llvm-project/lldb/packages/Python/lldbsuite/test/commands/gui/basic runCmd: settings set symbols.enable-external-lookup false output:

Hide Details

runCmd: settings set plugin.process.gdb-remote.packet-timeout 60 output:

Hide Details

runCmd: settings set symbols.clang-modules-cache-path "/Users/buildslave/jenkins/workspace/lldb-cmake-sanitized/lldb-build/tools/lldb/lldb-test-build.noindex/module-cache-lldb" output:

Hide Details

runCmd: settings set use-color false output:

Hide Details

FAIL: LLDB (/Users/buildslave/jenkins/workspace/lldb-cmake-sanitized/host-compiler/bin/clang-10-x86_64) :: test_gui (TestGuiBasic.BasicGuiCommandTest) tearing down the child process....

Hide Details

CLEANUP ERROR: LLDB (/Users/buildslave/jenkins/workspace/lldb-cmake-sanitized/host-compiler/bin/clang-10-x86_64) :: test_gui (TestGuiBasic.BasicGuiCommandTest) Restore dir to: /Users/buildslave/jenkins/workspace/lldb-cmake-sanitized/lldb-build/tools/lldb/lit ====================================================================== ERROR: test_gui (TestGuiBasic.BasicGuiCommandTest) ---------------------------------------------------------------------- Traceback (most recent call last): File "/Users/buildslave/jenkins/workspace/lldb-cmake-sanitized/llvm-project/lldb/packages/Python/lldbsuite/test/commands/gui/basic/TestGuiBasic.py", line 60, in test_gui self.quit() File "/Users/buildslave/jenkins/workspace/lldb-cmake-sanitized/llvm-project/lldb/packages/Python/lldbsuite/test/lldbpexpect.py", line 61, in quit self.child.close(force=not gracefully) File "/Users/buildslave/jenkins/workspace/lldb-cmake-sanitized/llvm-project/lldb/third_party/Python/module/pexpect-4.6/pexpect/pty_spawn.py", line 327, in close self.ptyproc.close(force=force) File "/System/Library/Frameworks/Python.framework/Versions/2.7/lib/python2.7/contextlib.py", line 35, in __exit__ self.gen.throw(type, value, traceback) File "/Users/buildslave/jenkins/workspace/lldb-cmake-sanitized/llvm-project/lldb/third_party/Python/module/pexpect-4.6/pexpect/pty_spawn.py", line 25, in _wrap_ptyprocess_err raise ExceptionPexpect(*e.args) ExceptionPexpect: Could not terminate the child. Config=x86_64-/Users/buildslave/jenkins/workspace/lldb-cmake-sanitized/host-compiler/bin/clang-10 ---------------------------------------------------------------------- Ran 1 test in 14.222s

Hide Details

RESULT: FAILED (0 passes, 0 failures, 1 errors, 0 skipped, 0 expected failures, 0 unexpected successes)

Hide Details

******************** PASS: lldb-Unit :: Utility/./UtilityTests/RecordReplayTest.InstrumentedFooSameThis (583 of 1727) PASS: lldb-Suite :: python_api/sbvalue_persist/TestSBValuePersist.py (584 of 1727) PASS: lldb-Unit :: Utility/./UtilityTests/StringListTest.Clear (585 of 1727) PASS: lldb-Unit :: Utility/./UtilityTests/FileSpecTest.RemoveLastPathComponent (586 of 1727) PASS: lldb-Suite :: functionalities/breakpoint/breakpoint_options/TestBreakpointOptions.py (587 of 1727) PASS: lldb-Suite :: benchmarks/expression/TestRepeatedExprs.py (588 of 1727) PASS: LLDB :: Breakpoint/split-dwarf-5-addrbase.test (589 of 1727) PASS: lldb-Suite :: functionalities/data-formatter/data-formatter-stl/libcxx/forward_list/TestDataFormatterLibcxxForwardList.py (590 of 1727) PASS: lldb-Unit :: Utility/./UtilityTests/StringListTest.ShiftCString (591 of 1727) PASS: lldb-Unit :: UnwindAssembly/x86/./UnwindAssemblyx86Tests/Testx86AssemblyInspectionEngine.TestMovRSPtoRBP (592 of 1727) PASS: lldb-Unit :: Host/./HostTests/SocketTest.TCPListen0ConnectAccept (593 of 1727) PASS: lldb-Suite :: lang/objc/real-definition/TestRealDefinition.py (594 of 1727) PASS: lldb-Unit :: Language/Highlighting/./HighlighterTests/HighlighterTest.DefaultHighlighterWithCursor (595 of 1727) PASS: lldb-Suite :: commands/expression/completion-crash1/TestCompletionCrash1.py (596 of 1727) PASS: lldb-Unit :: ScriptInterpreter/Python/./ScriptInterpreterPythonTests/PythonDataObjectsTest.TestObjectAttributes (597 of 1727) PASS: lldb-Suite :: functionalities/data-formatter/data-formatter-objc/TestDataFormatterObjCNSBundle.py (598 of 1727) PASS: lldb-Suite :: functionalities/memory/cache/TestMemoryCache.py (599 of 1727) PASS: lldb-Unit :: Utility/./UtilityTests/FileSpecTest.FormatFileSpec (600 of 1727) PASS: lldb-Unit :: Utility/./UtilityTests/ArgsTest.TestSingleArgWithQuotedSpace (601 of 1727) PASS: lldb-Unit :: SymbolFile/DWARF/./SymbolFileDWARFTests/DWARFASTParserClangTests.TestGetDIEForDeclContextReturnsOnlyMatchingEntries (602 of 1727) PASS: lldb-Unit :: Utility/./UtilityTests/ScalarTest.APIntConstructor (603 of 1727) PASS: lldb-Unit :: Host/./HostTests/SocketTest.DomainGetConnectURI (604 of 1727) PASS: lldb-Unit :: Utility/./UtilityTests/ArgsTest.TestUnknownEscape (605 of 1727) PASS: lldb-Unit :: UnwindAssembly/x86/./UnwindAssemblyx86Tests/Testx86AssemblyInspectionEngine.TestSubRSP (606 of 1727) PASS: LLDB :: Reproducer/Modules/TestModuleCXX.test (607 of 1727) PASS: lldb-Suite :: python_api/event/TestEvents.py (608 of 1727) PASS: lldb-Unit :: Utility/./UtilityTests/StringExtractorTest.GetHexBytesAvail_Underflow (609 of 1727) PASS: lldb-Unit :: Utility/./UtilityTests/SerializationRountripTest.SerializeDeserializePod (610 of 1727) PASS: lldb-Unit :: Utility/./UtilityTests/ScalarTest.Equality (611 of 1727) PASS: lldb-Unit :: Utility/./UtilityTests/StreamTest.PutHex16ByteOrderLittle (612 of 1727) PASS: lldb-Suite :: python_api/findvalue_duplist/TestSBFrameFindValue.py (613 of 1727) PASS: lldb-Unit :: Process/minidump/./LLDBMinidumpTests/MinidumpParserTest.GetPidWindows (614 of 1727) PASS: lldb-Suite :: commands/expression/no-deadlock/TestExprDoesntBlock.py (615 of 1727) PASS: lldb-Unit :: Core/./LLDBCoreTests/RichManglingContextTest.FromCxxMethodName (616 of 1727) PASS: lldb-Suite :: functionalities/testid/TestTestId.py (617 of 1727) PASS: lldb-Suite :: commands/expression/radar_8638051/Test8638051.py (618 of 1727) PASS: lldb-Suite :: commands/expression/completion/TestExprCompletion.py (619 of 1727) PASS: LLDB :: SymbolFile/Breakpad/unwind-via-stack-cfi.test (620 of 1727) PASS: lldb-Unit :: Utility/./UtilityTests/FileSpecTest.EqualDotsWindows (621 of 1727) PASS: lldb-Unit :: Utility/./UtilityTests/DataExtractorTest.GetMaxU64_unchecked (622 of 1727) PASS: lldb-Unit :: UnwindAssembly/x86/./UnwindAssemblyx86Tests/Testx86AssemblyInspectionEngine.TestPushRBPWithREX (623 of 1727) PASS: lldb-Suite :: arm/breakpoint-it/TestBreakpointIt.py (624 of 1727) PASS: lldb-Unit :: Utility/./UtilityTests/StringExtractorTest.GetHexBytes (625 of 1727) PASS: lldb-Unit :: Utility/./UtilityTests/StreamTest.ShiftOperatorStrings (626 of 1727) PASS: lldb-Unit :: Process/gdb-remote/./ProcessGdbRemoteTests/GDBRemoteCommunicationClientTest.GetMemoryRegionInfo (627 of 1727) PASS: lldb-Unit :: SymbolFile/NativePDB/./SymbolFileNativePDBTests/PDBFPOProgramToDWARFExpressionTests.SingleAssignmentRegisterRef (628 of 1727) PASS: lldb-Unit :: ScriptInterpreter/Python/./ScriptInterpreterPythonTests/PythonExceptionStateTest.TestAutoRestoreSemantics (629 of 1727) PASS: lldb-Unit :: Utility/./UtilityTests/StringExtractorTest.DecodeHexU8_InvalidHex (630 of 1727) PASS: LLDB :: Python/crashlog.test (631 of 1727) PASS: lldb-Suite :: functionalities/thread/concurrent_events/TestConcurrentCrashWithWatchpointBreakpointSignal.py (632 of 1727) PASS: lldb-Unit :: Utility/./UtilityTests/UriParserTest.SchemeHostSeparator3 (633 of 1727) PASS: lldb-Suite :: commands/expression/import-std-module/unique_ptr/TestUniquePtr.py (634 of 1727) PASS: lldb-Suite :: lang/objc/ptr_refs/TestPtrRefsObjC.py (635 of 1727) PASS: lldb-Suite :: functionalities/thread/step_out/TestThreadStepOut.py (636 of 1727) PASS: lldb-Suite :: functionalities/postmortem/netbsd-core/TestNetBSDCore.py (637 of 1727) PASS: lldb-Suite :: macosx/find-app-in-bundle/TestFindAppInBundle.py (638 of 1727) PASS: lldb-Suite :: python_api/value/empty_class/TestValueAPIEmptyClass.py (639 of 1727) PASS: lldb-Suite :: tools/lldb-server/TestGdbRemoteRegisterState.py (640 of 1727) PASS: lldb-Unit :: Utility/./UtilityTests/BinaryStreamTest.PutULEB128MaxValue (641 of 1727) PASS: lldb-Suite :: lang/objc/foundation/TestObjectDescriptionAPI.py (642 of 1727) PASS: lldb-Unit :: Utility/./UtilityTests/ArgsTest.ReplaceArgumentAtIndexShort (643 of 1727) PASS: lldb-Suite :: commands/expression/import-std-module/list-dbg-info-content/TestDbgInfoContentList.py (644 of 1727) PASS: lldb-Suite :: functionalities/data-formatter/typedef_array/TestTypedefArray.py (645 of 1727) PASS: LLDB :: Quit/TestQuitExitCode30.test (646 of 1727) PASS: lldb-Unit :: ScriptInterpreter/Python/./ScriptInterpreterPythonTests/PythonDataObjectsTest.TestPythonStringToStructuredString (647 of 1727) PASS: lldb-Unit :: Utility/./UtilityTests/AnsiTerminal.WhiteSpace (648 of 1727) PASS: lldb-Unit :: Utility/./UtilityTests/OptionsWithRawTest.UnterminatedQuote (649 of 1727) PASS: LLDB :: SymbolFile/Breakpad/symtab-macho.test (650 of 1727) PASS: lldb-Suite :: commands/expression/rdar44436068/Test128BitsInteger.py (651 of 1727) PASS: lldb-Unit :: UnwindAssembly/x86/./UnwindAssemblyx86Tests/Testx86AssemblyInspectionEngine.TestPopR13 (652 of 1727) PASS: lldb-Suite :: functionalities/data-formatter/data-formatter-stl/libcxx/tuple/TestDataFormatterLibcxxTuple.py (653 of 1727) PASS: lldb-Suite :: arm/breakpoint-thumb-codesection/TestBreakpointThumbCodesection.py (654 of 1727) PASS: LLDB :: Commands/CommandScriptImmediateOutput/CommandScriptImmediateOutputConsole.test (655 of 1727) PASS: lldb-Unit :: Utility/./UtilityTests/StringListTest.ShiftStdString (656 of 1727) PASS: lldb-Unit :: Utility/./UtilityTests/RangeTest.LessThan (657 of 1727) PASS: lldb-Suite :: lang/cpp/thread_local/TestThreadLocal.py (658 of 1727) PASS: lldb-Suite :: commands/expression/save_jit_objects/TestSaveJITObjects.py (659 of 1727) UNSUPPORTED: LLDB :: SymbolFile/PDB/variables-locations.test (660 of 1727) PASS: LLDB :: SymbolFile/NativePDB/ast-types.cpp (661 of 1727) PASS: lldb-Unit :: Utility/./UtilityTests/BinaryStreamTest.PutULEB128Zero (662 of 1727) PASS: LLDB :: Breakpoint/jitbp_elf.test (663 of 1727) PASS: lldb-Unit :: SymbolFile/NativePDB/./SymbolFileNativePDBTests/PDBFPOProgramToDWARFExpressionTests.InvalidOpBinary (664 of 1727) PASS: lldb-Suite :: functionalities/dynamic_value_child_count/TestDynamicValueChildCount.py (665 of 1727) PASS: lldb-Suite :: functionalities/multidebugger_commands/TestMultipleDebuggersCommands.py (666 of 1727) PASS: lldb-Suite :: commands/expression/issue_11588/Test11588.py (667 of 1727) PASS: LLDB :: Breakpoint/split-dwarf5-debug-stroffsets.test (668 of 1727) PASS: lldb-Suite :: commands/version/TestVersion.py (669 of 1727) PASS: lldb-Unit :: Utility/./UtilityTests/RangeTest.ContainsEndInclusiveInvalid (670 of 1727) PASS: lldb-Unit :: Utility/./UtilityTests/BinaryStreamTest.PutSLEB128One (671 of 1727) PASS: LLDB :: SymbolFile/NativePDB/nested-types.cpp (672 of 1727) PASS: lldb-Suite :: functionalities/tail_call_frames/unambiguous_sequence/TestUnambiguousTailCalls.py (673 of 1727) PASS: lldb-Suite :: python_api/frame/get-variables/TestGetVariables.py (674 of 1727) PASS: lldb-Suite :: benchmarks/stepping/TestSteppingSpeed.py (675 of 1727) PASS: lldb-Suite :: functionalities/ubsan/user-expression/TestUbsanUserExpression.py (676 of 1727) PASS: lldb-Unit :: Utility/./UtilityTests/VASprintfTest.BufferResize (677 of 1727) PASS: lldb-Suite :: functionalities/thread/concurrent_events/TestConcurrentManyWatchpoints.py (678 of 1727) PASS: lldb-Suite :: lang/c/shared_lib_stripped_symbols/TestSharedLibStrippedSymbols.py (679 of 1727) UNSUPPORTED: LLDB :: SymbolFile/NativePDB/stack_unwinding01.cpp (680 of 1727) PASS: lldb-Suite :: functionalities/tsan/global_location/TestTsanGlobalLocation.py (681 of 1727) PASS: lldb-Suite :: android/platform/TestDefaultCacheLineSize.py (682 of 1727) PASS: lldb-Unit :: Utility/./UtilityTests/StructuredDataTest.StringDump (683 of 1727) PASS: lldb-Unit :: Utility/./UtilityTests/ArgsTest.TestTrailingBackslash (684 of 1727) PASS: lldb-Suite :: functionalities/deleted-executable/TestDeletedExecutable.py (685 of 1727) PASS: lldb-Unit :: Utility/./UtilityTests/StringListTest.AppendStringCString (686 of 1727) PASS: lldb-Unit :: Language/CPlusPlus/./LanguageCPlusPlusTests/CPlusPlusLanguage.MethodNameParsing (687 of 1727) PASS: lldb-Unit :: Expression/./ExpressionTests/DWARFExpression.DW_OP_convert (688 of 1727) PASS: lldb-Suite :: functionalities/darwin_log/filter/exact_match/subsystem/TestDarwinLogFilterMatchSubsystem.py (689 of 1727) PASS: lldb-Unit :: ScriptInterpreter/Python/./ScriptInterpreterPythonTests/PythonDataObjectsTest.TestExtractingUInt64ThroughStructuredData (690 of 1727) PASS: lldb-Suite :: functionalities/thread/multi_break/TestMultipleBreakpoints.py (691 of 1727) PASS: lldb-Suite :: functionalities/darwin_log/format/TestDarwinLogMessageFormat.py (692 of 1727) PASS: LLDB :: Reproducer/Functionalities/TestImageList.test (693 of 1727) PASS: LLDB :: Modules/PECOFF/export-dllfunc.yaml (694 of 1727) UNSUPPORTED: LLDB :: SymbolFile/PDB/expressions.test (695 of 1727) PASS: lldb-Unit :: Host/./HostTests/TaskPoolTest.AddTask (696 of 1727) PASS: lldb-Suite :: functionalities/gdb_remote_client/TestNoWatchpointSupportInfo.py (697 of 1727) PASS: lldb-Unit :: Host/./HostTests/MainLoopTest.Signal (698 of 1727) PASS: lldb-Unit :: Host/./HostTests/SocketAddressTest.Set (699 of 1727) PASS: lldb-Suite :: python_api/breakpoint/TestBreakpointAPI.py (700 of 1727) PASS: lldb-Suite :: lang/cpp/incomplete-types/TestCppIncompleteTypes.py (701 of 1727) PASS: lldb-Suite :: python_api/lldbutil/process/TestPrintStackTraces.py (702 of 1727) PASS: lldb-Unit :: Process/minidump/./LLDBMinidumpTests/MinidumpParserTest.GetMemoryRegionInfoLinuxMaps (703 of 1727) PASS: lldb-Suite :: functionalities/longjmp/TestLongjmp.py (704 of 1727) PASS: lldb-Suite :: functionalities/data-formatter/data-formatter-objc/TestDataFormatterObjCNSData.py (705 of 1727) PASS: lldb-Unit :: ScriptInterpreter/Python/./ScriptInterpreterPythonTests/PythonExceptionStateTest.TestAcquisitionSemantics (706 of 1727) PASS: lldb-Unit :: Utility/./UtilityTests/IndexToObjectTest.ObjectForIndex (707 of 1727) PASS: lldb-Unit :: Utility/./UtilityTests/UserIDResolver.GetGroupName (708 of 1727) PASS: lldb-Unit :: Host/./HostTests/NativeProcessProtocolTest.SetBreakpointFailVerify (709 of 1727) PASS: lldb-Unit :: Utility/./UtilityTests/StreamTest.PutStringAsRawHex8 (710 of 1727) PASS: lldb-Unit :: Utility/./UtilityTests/StringListTest.AppendListCStringArray (711 of 1727) PASS: lldb-Suite :: lang/cpp/namespace/TestNamespace.py (712 of 1727) PASS: lldb-Suite :: commands/register/register/register_command/TestRegisters.py (713 of 1727) PASS: lldb-Unit :: Utility/./UtilityTests/VASprintfTest.EncodingError (714 of 1727) PASS: lldb-Unit :: Utility/./UtilityTests/FileSpecTest.EqualDotsPosixRoot (715 of 1727) PASS: lldb-Unit :: ObjectFile/Breakpad/./ObjectFileBreakpadTests/StackCFIRecord.parse (716 of 1727) PASS: lldb-Unit :: Language/Highlighting/./HighlighterTests/HighlighterTest.ClangPPDirectives (717 of 1727) PASS: lldb-Unit :: Language/CPlusPlus/./LanguageCPlusPlusTests/CPlusPlusLanguage.ExtractContextAndIdentifier (718 of 1727) PASS: lldb-Unit :: Utility/./UtilityTests/ArgsTest.BareSingleQuote (719 of 1727) PASS: lldb-Suite :: benchmarks/continue/TestBenchmarkContinue.py (720 of 1727) PASS: LLDB :: Commands/command-source.test (721 of 1727) PASS: lldb-Suite :: commands/frame/diagnose/local-variable/TestLocalVariable.py (722 of 1727) PASS: lldb-Unit :: Process/minidump/./LLDBMinidumpTests/MinidumpParserTest.MinidumpDuplicateModuleMinAddress (723 of 1727) PASS: lldb-Suite :: commands/watchpoints/watchpoint_commands/command/TestWatchpointCommandPython.py (724 of 1727) PASS: lldb-Suite :: functionalities/tail_call_frames/disambiguate_tail_call_seq/TestDisambiguateTailCallSeq.py (725 of 1727) PASS: lldb-Unit :: Utility/./UtilityTests/BroadcasterTest.EventTypeHasListeners (726 of 1727) PASS: lldb-Unit :: Symbol/./SymbolTests/Type.CompilerContextPattern (727 of 1727) PASS: lldb-Unit :: Symbol/./SymbolTests/TestClangASTContext.TestRemoveFastQualifiers (728 of 1727) PASS: lldb-Unit :: Utility/./UtilityTests/RangeTest.ContainsAddrInvalid (729 of 1727) PASS: LLDB :: Breakpoint/debug_rnglist_offset_pair.test (730 of 1727) PASS: lldb-Unit :: Process/gdb-remote/./ProcessGdbRemoteTests/GDBRemoteClientBaseTest.SendContinueDelegateStructuredDataReceipt (731 of 1727) PASS: lldb-Unit :: Host/./HostTests/NativeProcessProtocolTest.ReadCStringFromMemory_CrossPageBoundary (732 of 1727) PASS: lldb-Suite :: lang/cpp/printf/TestPrintf.py (733 of 1727) PASS: lldb-Unit :: ScriptInterpreter/Python/./ScriptInterpreterPythonTests/PythonDataObjectsTest.TestPythonTupleSize (734 of 1727) PASS: lldb-Suite :: commands/expression/import-std-module/no-std-module/TestMissingStdModule.py (735 of 1727) PASS: lldb-Suite :: functionalities/data-formatter/data-formatter-stl/libstdcpp/iterator/TestDataFormatterStdIterator.py (736 of 1727) PASS: lldb-Suite :: functionalities/data-formatter/data-formatter-stl/libstdcpp/vector/TestDataFormatterStdVector.py (737 of 1727) PASS: lldb-Unit :: Process/gdb-remote/./ProcessGdbRemoteTests/GDBRemoteCommunicationClientTest.TestPacketSpeedJSON (738 of 1727) PASS: lldb-Unit :: Utility/./UtilityTests/AnsiTerminal.Twice (739 of 1727) PASS: lldb-Suite :: functionalities/load_unload/TestLoadUnload.py (740 of 1727) PASS: lldb-Suite :: functionalities/breakpoint/address_breakpoints/TestAddressBreakpoints.py (741 of 1727) PASS: lldb-Unit :: Process/gdb-remote/./ProcessGdbRemoteTests/GDBRemoteClientBaseTest.SendContinueDelegateInterface (742 of 1727) PASS: lldb-Suite :: lang/cpp/member-and-local-vars-with-same-name/TestMembersAndLocalsWithSameName.py (743 of 1727) PASS: lldb-Suite :: commands/expression/po_verbosity/TestPoVerbosity.py (744 of 1727) PASS: lldb-Unit :: Utility/./UtilityTests/UriParserTest.BracketedHostname (745 of 1727) PASS: lldb-Unit :: Utility/./UtilityTests/StreamTest.PutCharWhitespace (746 of 1727) PASS: lldb-Unit :: ScriptInterpreter/Python/./ScriptInterpreterPythonTests/PythonDataObjectsTest.TestPythonDictionaryToStructuredDictionary (747 of 1727) PASS: lldb-Suite :: python_api/process/read-mem-cstring/TestReadMemCString.py (748 of 1727) PASS: lldb-Suite :: functionalities/data-formatter/data-formatter-stl/libcxx/initializerlist/TestInitializerList.py (749 of 1727) PASS: lldb-Unit :: Utility/./UtilityTests/AnsiTerminal.AtStart (750 of 1727) PASS: lldb-Unit :: Utility/./UtilityTests/ConstStringTest.FromMidOfBufferStringRef (751 of 1727) PASS: LLDB :: SymbolFile/Breakpad/line-table-missing-file.test (752 of 1727) PASS: lldb-Unit :: UnwindAssembly/x86/./UnwindAssemblyx86Tests/Testx86AssemblyInspectionEngine.TestPushR13 (753 of 1727) PASS: LLDB :: Modules/ELF/PT_LOAD-overlap-PT_INTERP.yaml (754 of 1727) PASS: lldb-Suite :: python_api/exprpath_synthetic/TestExprPathSynthetic.py (755 of 1727) PASS: lldb-Unit :: Core/./LLDBCoreTests/StreamCallbackTest.Callback (756 of 1727) PASS: lldb-Suite :: types/TestRecursiveTypes.py (757 of 1727) PASS: lldb-Unit :: Utility/./UtilityTests/UriParserTest.MinimalPath (758 of 1727) PASS: lldb-Suite :: tools/lldb-server/register-reading/TestGdbRemoteGPacket.py (759 of 1727) PASS: LLDB :: SymbolFile/Breakpad/line-table.test (760 of 1727) PASS: lldb-Suite :: functionalities/data-formatter/data-formatter-stl/libcxx/set/TestDataFormatterLibcxxSet.py (761 of 1727) PASS: lldb-Unit :: Expression/./ExpressionTests/DiagnosticManagerTest.AddDiagnostic (762 of 1727) PASS: lldb-Suite :: python_api/value/TestValueAPI.py (763 of 1727) PASS: lldb-Unit :: Utility/./UtilityTests/OptionsWithRawTest.WhitespaceInput (764 of 1727) PASS: lldb-Suite :: commands/expression/import-std-module/forward_list-dbg-info-content/TestDbgInfoContentForwardList.py (765 of 1727) PASS: lldb-Suite :: functionalities/data-formatter/data-formatter-objc/TestDataFormatterObjCNSURL.py (766 of 1727) PASS: LLDB :: Modules/ELF/section-types.yaml (767 of 1727) PASS: lldb-Suite :: macosx/indirect_symbol/TestIndirectSymbols.py (768 of 1727) PASS: lldb-Suite :: commands/expression/invalid-args/TestInvalidArgsExpression.py (769 of 1727) PASS: lldb-Suite :: tools/lldb-server/TestGdbRemote_qThreadStopInfo.py (770 of 1727) PASS: LLDB :: SymbolFile/DWARF/split-dwarf-inlining.cpp (771 of 1727) PASS: lldb-Suite :: functionalities/breakpoint/debugbreak/TestDebugBreak.py (772 of 1727) PASS: lldb-Suite :: functionalities/target-new-solib-notifications/TestModuleLoadedNotifys.py (773 of 1727) PASS: lldb-Unit :: ScriptInterpreter/Python/./ScriptInterpreterPythonTests/PythonDataObjectsTest.TestPythonTupleValues (774 of 1727) PASS: lldb-Unit :: ScriptInterpreter/Python/./ScriptInterpreterPythonTests/PythonDataObjectsTest.TestPythonString (775 of 1727) PASS: lldb-Suite :: commands/frame/var-scope/TestFrameVariableScope.py (776 of 1727) PASS: lldb-Unit :: UnwindAssembly/x86/./UnwindAssemblyx86Tests/Testx86AssemblyInspectionEngine.TestPushEDX (777 of 1727) PASS: LLDB :: Commands/CommandScriptImmediateOutput/CommandScriptImmediateOutputFile.test (778 of 1727) PASS: lldb-Suite :: functionalities/return-value/TestReturnValue.py (779 of 1727) PASS: lldb-Unit :: Utility/./UtilityTests/StringExtractorTest.DecodeHexU8_InvalidHex2 (780 of 1727) PASS: lldb-Suite :: macosx/macabi/TestMacABImacOSFramework.py (781 of 1727) PASS: lldb-Suite :: lang/cpp/static_methods/TestCPPStaticMethods.py (782 of 1727) PASS: LLDB :: SymbolFile/DWARF/dir-separator-no-comp-dir.s (783 of 1727) PASS: lldb-Suite :: functionalities/tsan/cpp_global_location/TestTsanCPPGlobalLocation.py (784 of 1727) PASS: lldb-Suite :: functionalities/postmortem/wow64_minidump/TestWow64MiniDump.py (785 of 1727) PASS: lldb-Suite :: python_api/disassemble-raw-data/TestDisassemble_VST1_64.py (786 of 1727) PASS: lldb-Suite :: commands/watchpoints/hello_watchlocation/TestWatchLocation.py (787 of 1727) FAIL: lldb-Suite :: commands/expression/multiline-completion/TestMultilineCompletion.py (788 of 1727) ******************** TEST 'lldb-Suite :: commands/expression/multiline-completion/TestMultilineCompletion.py' FAILED ******************** lldb version 10.0.99 (http://labmaster3.local/git/llvm-project.git revision 9c5a4a4527bc6c06b0f889501aa48aa23ccb90a5) clang revision 9c5a4a4527bc6c06b0f889501aa48aa23ccb90a5 llvm revision 9c5a4a4527bc6c06b0f889501aa48aa23ccb90a5 LLDB library dir: /Users/buildslave/jenkins/workspace/lldb-cmake-sanitized/lldb-build/bin LLDB import library dir: /Users/buildslave/jenkins/workspace/lldb-cmake-sanitized/lldb-build/bin libstdcxx tests will not be run because: Don't know how to build with libstdcxx on macosx Skipping following debug info categories: ['dwo'] (lldb) settings set symbols.enable-external-lookup false (lldb) settings set plugin.process.gdb-remote.packet-timeout 60 (lldb) settings set symbols.clang-modules-cache-path "/Users/buildslave/jenkins/workspace/lldb-cmake-sanitized/lldb-build/tools/lldb/lldb-test-build.noindex/module-cache-lldb" (lldb) settings set use-color false (lldb) target create "/Users/buildslave/jenkins/workspace/lldb-cmake-sanitized/lldb-build/tools/lldb/lldb-test-build.noindex/commands/expression/multiline-completion/TestMultilineCompletion.test_basic_completion/a.out" Current executable set to '/Users/buildslave/jenkins/workspace/lldb-cmake-sanitized/lldb-build/tools/lldb/lldb-test-build.noindex/commands/expression/multiline-completion/TestMultilineCompletion.test_basic_completion/a.out' (x86_64). (lldb) b main b main Breakpoint 1: where = a.out`main + 18 at main.c:2:7, address = 0x0000000100000fa2 (lldb) run run Process 94987 launched: '/Users/buildslave/jenkins/workspace/lldb-cmake-sanitized/lldb-build/tools/lldb/lldb-test-build.noindex/commands/expression/multiline-completion/TestMultilineCompletion.test_basic_completion/a.out' (x86_64) Process 94987 stopped * thread #1, queue = 'com.apple.main-thread', stop reason = breakpoint 1.1 frame #0: 0x0000000100000fa2 a.out`main(argc=1, argv=0x00007ffeefbff4d0) at main.c:2:7 1 int main(int argc, char **argv) { -> 2 int to_complete = 0; ^ 3 return to_complete; 4 } (lldb) expr expr Enter expressions, then terminate with an empty line to evaluate: to_  1:  1: to_ to_  1: to_complete

Hide Details

 1: to_complete 2:  2:  (int) $0 = 0 (lldb) settings set interpreter.prompt-on-quit false

Hide Details

Session logs for test failures/errors/unexpected successes will go into directory '/Users/buildslave/jenkins/workspace/lldb-cmake-sanitized/test/logs' Command invoked: /Users/buildslave/jenkins/workspace/lldb-cmake-sanitized/llvm-project/lldb/test/dotest.py --arch=x86_64 -s /Users/buildslave/jenkins/workspace/lldb-cmake-sanitized/lldb-build/lldb-test-traces -S nm -u CXXFLAGS -u CFLAGS --executable /Users/buildslave/jenkins/workspace/lldb-cmake-sanitized/lldb-build/./bin/lldb --dsymutil /Users/buildslave/jenkins/workspace/lldb-cmake-sanitized/lldb-build/./bin/dsymutil --filecheck /Users/buildslave/jenkins/workspace/lldb-cmake-sanitized/lldb-build/./bin/FileCheck -C /Users/buildslave/jenkins/workspace/lldb-cmake-sanitized/host-compiler/bin/clang --codesign-identity lldb_codesign --server /Users/buildslave/jenkins/workspace/lldb-cmake-sanitized/lldb-build/./bin/debugserver --arch x86_64 --build-dir /Users/buildslave/jenkins/workspace/lldb-cmake-sanitized/lldb-build/lldb-test-build.noindex -s=/Users/buildslave/jenkins/workspace/lldb-cmake-sanitized/test/logs -t --env TERM=vt100 --env LLVM_LIBS_DIR=/Users/buildslave/jenkins/workspace/lldb-cmake-sanitized/lldb-build/./lib --build-dir /Users/buildslave/jenkins/workspace/lldb-cmake-sanitized/lldb-build/tools/lldb/lldb-test-build.noindex --module-cache-dir /Users/buildslave/jenkins/workspace/lldb-cmake-sanitized/lldb-build/tools/lldb/lldb-test-build.noindex/module-cache-lldb /Users/buildslave/jenkins/workspace/lldb-cmake-sanitized/llvm-project/lldb/packages/Python/lldbsuite/test/commands/expression/multiline-completion -p TestMultilineCompletion.py Change dir to: /Users/buildslave/jenkins/workspace/lldb-cmake-sanitized/llvm-project/lldb/packages/Python/lldbsuite/test/commands/expression/multiline-completion runCmd: settings set symbols.enable-external-lookup false output:

Hide Details

runCmd: settings set plugin.process.gdb-remote.packet-timeout 60 output:

Hide Details

runCmd: settings set symbols.clang-modules-cache-path "/Users/buildslave/jenkins/workspace/lldb-cmake-sanitized/lldb-build/tools/lldb/lldb-test-build.noindex/module-cache-lldb" output:

Hide Details

runCmd: settings set use-color false output:

Hide Details

FAIL: LLDB (/Users/buildslave/jenkins/workspace/lldb-cmake-sanitized/host-compiler/bin/clang-10-x86_64) :: test_basic_completion (TestMultilineCompletion.MultilineCompletionTest) tearing down the child process....

Hide Details

CLEANUP ERROR: LLDB (/Users/buildslave/jenkins/workspace/lldb-cmake-sanitized/host-compiler/bin/clang-10-x86_64) :: test_basic_completion (TestMultilineCompletion.MultilineCompletionTest) Restore dir to: /Users/buildslave/jenkins/workspace/lldb-cmake-sanitized/lldb-build/tools/lldb/lit ====================================================================== ERROR: test_basic_completion (TestMultilineCompletion.MultilineCompletionTest) Test that we can complete a simple multiline expression ---------------------------------------------------------------------- Traceback (most recent call last): File "/Users/buildslave/jenkins/workspace/lldb-cmake-sanitized/llvm-project/lldb/packages/Python/lldbsuite/test/commands/expression/multiline-completion/TestMultilineCompletion.py", line 30, in test_basic_completion self.quit() File "/Users/buildslave/jenkins/workspace/lldb-cmake-sanitized/llvm-project/lldb/packages/Python/lldbsuite/test/lldbpexpect.py", line 61, in quit self.child.close(force=not gracefully) File "/Users/buildslave/jenkins/workspace/lldb-cmake-sanitized/llvm-project/lldb/third_party/Python/module/pexpect-4.6/pexpect/pty_spawn.py", line 327, in close self.ptyproc.close(force=force) File "/System/Library/Frameworks/Python.framework/Versions/2.7/lib/python2.7/contextlib.py", line 35, in __exit__ self.gen.throw(type, value, traceback) File "/Users/buildslave/jenkins/workspace/lldb-cmake-sanitized/llvm-project/lldb/third_party/Python/module/pexpect-4.6/pexpect/pty_spawn.py", line 25, in _wrap_ptyprocess_err raise ExceptionPexpect(*e.args) ExceptionPexpect: Could not terminate the child. Config=x86_64-/Users/buildslave/jenkins/workspace/lldb-cmake-sanitized/host-compiler/bin/clang-10 ---------------------------------------------------------------------- Ran 1 test in 14.688s

Hide Details

RESULT: FAILED (0 passes, 0 failures, 1 errors, 0 skipped, 0 expected failures, 0 unexpected successes)

Hide Details

******************** PASS: lldb-Unit :: Utility/./UtilityTests/DataExtractorTest.GetMaxS64 (789 of 1727) PASS: lldb-Unit :: Expression/./ExpressionTests/DiagnosticManagerTest.HasFixits (790 of 1727) PASS: lldb-Unit :: Utility/./UtilityTests/StringListTest.InsertStringAtIndexEnd (791 of 1727) PASS: lldb-Unit :: Utility/./UtilityTests/StringExtractorTest.DecodeHexU8_Underflow2 (792 of 1727) PASS: lldb-Unit :: Utility/./UtilityTests/UriParserTest.LongPath (793 of 1727) PASS: lldb-Suite :: tools/lldb-server/commandline/TestStubSetSID.py (794 of 1727) PASS: LLDB :: SymbolFile/DWARF/debug-line-basic.s (795 of 1727) PASS: lldb-Suite :: functionalities/data-formatter/parray/TestPrintArray.py (796 of 1727) PASS: LLDB :: Modules/Breakpad/breakpad-identification.test (797 of 1727) PASS: lldb-Suite :: lang/cpp/class_types/TestClassTypes.py (798 of 1727) PASS: lldb-Suite :: lang/c/local_types/TestUseClosestType.py (799 of 1727) PASS: lldb-Unit :: Language/Highlighting/./HighlighterTests/HighlighterTest.ClangCursorPosBeforeOtherToken (800 of 1727) PASS: lldb-Unit :: Utility/./UtilityTests/CompletionRequest.TestCompletionOwnership (801 of 1727) PASS: lldb-Suite :: types/TestIntegerTypesExpr.py (802 of 1727) PASS: LLDB :: Driver/TestTarget.test (803 of 1727) PASS: lldb-Suite :: functionalities/signal/handle-segv/TestHandleSegv.py (804 of 1727) PASS: lldb-Suite :: functionalities/thread/thread_exit/TestThreadExit.py (805 of 1727) PASS: lldb-Suite :: types/TestDoubleTypes.py (806 of 1727) PASS: lldb-Unit :: Host/./HostTests/FileSystemTest.Exists (807 of 1727) PASS: lldb-Suite :: functionalities/data-formatter/language_category_updates/TestDataFormatterLanguageCategoryUpdates.py (808 of 1727) PASS: lldb-Suite :: functionalities/unwind/standard/TestStandardUnwind.py (809 of 1727) PASS: lldb-Suite :: functionalities/asan/TestReportData.py (810 of 1727) PASS: lldb-Suite :: commands/expression/anonymous-struct/TestCallUserAnonTypedef.py (811 of 1727) UNSUPPORTED: LLDB :: Unwind/eh-frame-small-fde.test (812 of 1727) PASS: lldb-Unit :: Core/./LLDBCoreTests/MangledTest.ResultForValidName (813 of 1727) PASS: lldb-Unit :: Utility/./UtilityTests/EnvironmentTest.EnvpConstruction (814 of 1727) PASS: lldb-Suite :: functionalities/thread/concurrent_events/TestConcurrentDelaySignalWatch.py (815 of 1727) PASS: lldb-Suite :: functionalities/data-formatter/data-formatter-skip-summary/TestDataFormatterSkipSummary.py (816 of 1727) PASS: lldb-Unit :: ScriptInterpreter/Python/./ScriptInterpreterPythonTests/PythonDataObjectsTest.TestGlobalNameResolutionWithDot (817 of 1727) PASS: lldb-Unit :: UnwindAssembly/x86/./UnwindAssemblyx86Tests/Testx86AssemblyInspectionEngine.TestReturnDetect (818 of 1727) PASS: lldb-Suite :: functionalities/inline-stepping/TestInlineStepping.py (819 of 1727) PASS: lldb-Unit :: Utility/./UtilityTests/StringLexerTest.PutBack (820 of 1727) PASS: lldb-Unit :: Utility/./UtilityTests/StringListTest.SplitIntoLinesSingleTrailingCR (821 of 1727) PASS: lldb-Suite :: linux/mix-dwo-and-regular-objects/TestMixedDwarfBinary.py (822 of 1727) PASS: lldb-Suite :: commands/watchpoints/watchpoint_commands/command/TestWatchpointCommandLLDB.py (823 of 1727) UNSUPPORTED: LLDB :: SymbolFile/NativePDB/local-variables.cpp (824 of 1727) PASS: lldb-Unit :: Utility/./UtilityTests/UriParserTest.SchemeHostSeparator2 (825 of 1727) PASS: lldb-Unit :: Utility/./UtilityTests/ArgsTest.ReplaceArgumentAtIndexOutOfRange (826 of 1727) PASS: lldb-Suite :: functionalities/darwin_log/filter/exact_match/message/TestDarwinLogFilterMatchMessage.py (827 of 1727) PASS: lldb-Suite :: python_api/interpreter/TestCommandInterpreterAPI.py (828 of 1727) PASS: lldb-Suite :: functionalities/breakpoint/cpp_exception/TestCPPExceptionBreakpoint.py (829 of 1727) PASS: lldb-Suite :: types/TestFloatTypes.py (830 of 1727) PASS: lldb-Unit :: Utility/./UtilityTests/UriParserTest.SchemeHostSeparator4 (831 of 1727) PASS: lldb-Suite :: commands/expression/call-function/TestCallStdStringFunction.py (832 of 1727) PASS: lldb-Suite :: lang/objc/modules-incomplete/TestIncompleteModules.py (833 of 1727) PASS: LLDB :: Modules/ELF/netbsd-core-amd64.test (834 of 1727) PASS: lldb-Unit :: Utility/./UtilityTests/StringLexerTest.AdvanceIf (835 of 1727) PASS: LLDB :: Modules/MachO/lc_build_version_notools.yaml (836 of 1727) PASS: lldb-Unit :: Utility/./UtilityTests/StringExtractorTest.GetU32LittleEndian (837 of 1727) PASS: lldb-Suite :: lang/cpp/std-function-step-into-callable/TestStdFunctionStepIntoCallable.py (838 of 1727) PASS: LLDB :: SymbolFile/DWARF/find-variable-dwo.cpp (839 of 1727) PASS: lldb-Suite :: commands/expression/completion-crash2/TestCompletionCrash2.py (840 of 1727) PASS: lldb-Suite :: functionalities/thread/concurrent_events/TestConcurrentManyCrash.py (841 of 1727) PASS: lldb-Unit :: Interpreter/./InterpreterTests/CompletionTest.DirCompletionAbsolute (842 of 1727) PASS: lldb-Suite :: functionalities/fat_archives/TestFatArchives.py (843 of 1727) UNSUPPORTED: LLDB :: SymbolFile/PDB/function-nested-block.test (844 of 1727) PASS: lldb-Unit :: Utility/./UtilityTests/OptionsWithRawTest.MultiWordSuffix (845 of 1727) PASS: lldb-Unit :: Utility/./UtilityTests/StringExtractorTest.GetNameColonValueNoColon (846 of 1727) PASS: lldb-Unit :: Utility/./UtilityTests/FileSpecTest.IsRelative (847 of 1727) PASS: lldb-Unit :: Utility/./UtilityTests/StreamTeeTest.CopyConstructor (848 of 1727) PASS: lldb-Unit :: Utility/./UtilityTests/StringListTest.RemoveBlankLines (849 of 1727) PASS: lldb-Unit :: Utility/./UtilityTests/ScalarTest.Division (850 of 1727) PASS: lldb-Suite :: functionalities/data-formatter/data-formatter-stl/libcxx/list/loop/TestDataFormatterLibcxxListLoop.py (851 of 1727) PASS: lldb-Suite :: functionalities/postmortem/minidump/TestMiniDump.py (852 of 1727) PASS: LLDB :: Modules/ELF/aarch64-relocations.yaml (853 of 1727) PASS: lldb-Suite :: functionalities/breakpoint/global_constructor/TestBreakpointInGlobalConstructor.py (854 of 1727) PASS: lldb-Unit :: Utility/./UtilityTests/LogChannelEnabledTest.LogVerboseThread (855 of 1727) PASS: lldb-Suite :: benchmarks/turnaround/TestCompileRunToBreakpointTurnaround.py (856 of 1727) PASS: lldb-Suite :: lang/objc/objc++/TestObjCXX.py (857 of 1727) UNSUPPORTED: LLDB :: Register/x86-gp-write.test (858 of 1727) PASS: lldb-Suite :: functionalities/tail_call_frames/ambiguous_tail_call_seq2/TestAmbiguousTailCallSeq2.py (859 of 1727) PASS: lldb-Unit :: ScriptInterpreter/Python/./ScriptInterpreterPythonTests/PythonExceptionStateTest.TestManualRestoreSemantics (860 of 1727) PASS: lldb-Unit :: Utility/./UtilityTests/StringLexerTest.NextIfList (861 of 1727) PASS: lldb-Suite :: lang/c/anonymous/TestAnonymous.py (862 of 1727) PASS: lldb-Unit :: Process/gdb-remote/./ProcessGdbRemoteTests/GDBRemoteCommunicationClientTest.GetModulesInfoInvalidResponse (863 of 1727) PASS: lldb-Suite :: functionalities/data-formatter/data-formatter-stl/libcxx/optional/TestDataFormatterLibcxxOptional.py (864 of 1727) PASS: lldb-Unit :: Utility/./UtilityTests/SerializationRountripTest.SerializeDeserializeCString (865 of 1727) PASS: LLDB :: Quit/TestQuitExitCodeTooManyArgs.test (866 of 1727) PASS: lldb-Suite :: commands/frame/recognizer/TestFrameRecognizer.py (867 of 1727) PASS: lldb-Unit :: Host/./HostTests/SocketTest.UDPGetConnectURI (868 of 1727) XFAIL: LLDB :: SymbolFile/DWARF/find-type-in-function.cpp (869 of 1727) PASS: lldb-Unit :: UnwindAssembly/x86/./UnwindAssemblyx86Tests/Testx86AssemblyInspectionEngine.TestSimple32bitFrameFunction (870 of 1727) PASS: lldb-Unit :: Utility/./UtilityTests/LogTest.Register (871 of 1727) PASS: lldb-Unit :: Utility/./UtilityTests/CompletionRequest.DuplicateFiltering (872 of 1727) PASS: lldb-Unit :: Host/./HostTests/FileSystemTest.GetByteSize (873 of 1727) PASS: lldb-Suite :: driver/batch_mode/TestBatchMode.py (874 of 1727) PASS: lldb-Suite :: linux/thread/create_during_instruction_step/TestCreateDuringInstructionStep.py (875 of 1727) PASS: LLDB :: Quit/TestQuitExitCodeImplicit0.test (876 of 1727) PASS: lldb-Suite :: functionalities/data-formatter/data-formatter-stl/libcxx/list/TestDataFormatterLibcxxList.py (877 of 1727) PASS: lldb-Unit :: Host/./HostTests/FileSystemTest.FileAndDirectoryComponents (878 of 1727) PASS: lldb-Unit :: Utility/./UtilityTests/GeneratorTest.Create (879 of 1727) PASS: lldb-Suite :: functionalities/conditional_break/TestConditionalBreak.py (880 of 1727) PASS: lldb-Unit :: Utility/./UtilityTests/VMRange.Ordering (881 of 1727) PASS: lldb-Suite :: functionalities/signal/TestSendSignal.py (882 of 1727) PASS: lldb-Suite :: lang/objc/foundation/TestSymbolTable.py (883 of 1727) PASS: lldb-Suite :: functionalities/thread/concurrent_events/TestConcurrentCrashWithWatchpoint.py (884 of 1727) PASS: lldb-Unit :: Utility/./UtilityTests/NameMatchesTest.Ignore (885 of 1727) PASS: lldb-Unit :: Utility/./UtilityTests/RangeTest.NotEqual (886 of 1727) PASS: lldb-Unit :: Process/gdb-remote/./ProcessGdbRemoteTests/GDBRemoteCommunicationClientTest.SaveRestoreRegistersNoSuffix (887 of 1727) PASS: lldb-Suite :: tools/lldb-server/signal-filtering/TestGdbRemote_QPassSignals.py (888 of 1727) PASS: lldb-Suite :: commands/frame/select/TestFrameSelect.py (889 of 1727) PASS: lldb-Suite :: functionalities/data-formatter/nssetsynth/TestNSSetSynthetic.py (890 of 1727) PASS: lldb-Suite :: benchmarks/expression/TestExpressionCmd.py (891 of 1727) PASS: lldb-Unit :: UnwindAssembly/x86/./UnwindAssemblyx86Tests/Testx86AssemblyInspectionEngine.TestPushEAX (892 of 1727) PASS: lldb-Suite :: functionalities/data-formatter/data-formatter-script/TestDataFormatterScript.py (893 of 1727) PASS: lldb-Unit :: UnwindAssembly/x86/./UnwindAssemblyx86Tests/Testx86AssemblyInspectionEngine.TestPopR14 (894 of 1727) PASS: lldb-Suite :: lang/cpp/symbols/TestSymbols.py (895 of 1727) PASS: lldb-Unit :: SymbolFile/NativePDB/./SymbolFileNativePDBTests/PDBFPOProgramToDWARFExpressionTests.UnresolvedRegisterReference (896 of 1727) PASS: lldb-Suite :: functionalities/data-formatter/data-formatter-proper-plurals/TestFormattersOneIsSingular.py (897 of 1727) PASS: lldb-Suite :: lang/cpp/dynamic-value/TestDynamicValue.py (898 of 1727) PASS: lldb-Unit :: Utility/./UtilityTests/UriParserTest.BracketedHostnamePort (899 of 1727) PASS: lldb-Unit :: Utility/./UtilityTests/StreamTest.ShiftOperatorInts (900 of 1727) PASS: lldb-Unit :: Utility/./UtilityTests/RangeTest.Equal (901 of 1727) PASS: lldb-Unit :: Utility/./UtilityTests/StateTest.Formatv (902 of 1727) PASS: lldb-Unit :: Host/./HostTests/ConnectionFileDescriptorTest.TCPGetURIv4 (903 of 1727) PASS: lldb-Suite :: commands/expression/persist_objc_pointeetype/TestPersistObjCPointeeType.py (904 of 1727) PASS: LLDB :: SymbolFile/DWARF/debug_ranges.s (905 of 1727) PASS: lldb-Suite :: linux/sepdebugsymlink/TestTargetSymbolsSepDebugSymlink.py (906 of 1727) PASS: lldb-Unit :: Process/gdb-remote/./ProcessGdbRemoteTests/GDBRemoteCommunicationServerTest.SendErrorResponse_ErrorNumber (907 of 1727) PASS: LLDB :: Settings/TestFrameFormatColor.test (908 of 1727) PASS: LLDB :: Unwind/trap_frame_sym_ctx.test (909 of 1727) PASS: lldb-Suite :: functionalities/data-formatter/data-formatter-stl/libstdcpp/map/TestDataFormatterStdMap.py (910 of 1727) PASS: lldb-Suite :: commands/expression/timeout/TestCallWithTimeout.py (911 of 1727) PASS: lldb-Unit :: Utility/./UtilityTests/LogChannelTest.EnableOptions (912 of 1727) PASS: lldb-Unit :: UnwindAssembly/x86/./UnwindAssemblyx86Tests/Testx86AssemblyInspectionEngine.TestSubESP (913 of 1727) PASS: lldb-Suite :: commands/expression/import-std-module/shared_ptr-dbg-info-content/TestSharedPtrDbgInfoContent.py (914 of 1727) PASS: lldb-Suite :: commands/expression/completion-crash-incomplete-record/TestCompletionCrashIncompleteRecord.py (915 of 1727) PASS: LLDB :: Driver/TestCore.test (916 of 1727) PASS: LLDB :: Breakpoint/debug_rnglistx_rlex.test (917 of 1727) PASS: lldb-Unit :: ObjectFile/ELF/./ObjectFileELFTests/ObjectFileELFTest.GetModuleSpecifications_EarlySectionHeaders (918 of 1727) PASS: lldb-Unit :: UnwindAssembly/x86/./UnwindAssemblyx86Tests/Testx86AssemblyInspectionEngine.TestPopEBX (919 of 1727) PASS: lldb-Unit :: Utility/./UtilityTests/Flags.Clear (920 of 1727) PASS: lldb-Unit :: Utility/./UtilityTests/StringLexerTest.HasAtLeast (921 of 1727) PASS: lldb-Suite :: lang/objc/print-obj/TestPrintObj.py (922 of 1727) PASS: lldb-Unit :: Utility/./UtilityTests/ArchSpecTest.OperatorBool (923 of 1727) PASS: lldb-Suite :: python_api/signals/TestSignalsAPI.py (924 of 1727) PASS: LLDB :: Modules/Breakpad/discontiguous-sections.test (925 of 1727) PASS: lldb-Unit :: Utility/./UtilityTests/ArgsTest.StringListConstructor (926 of 1727) PASS: lldb-Suite :: lang/c/offsetof/TestOffsetof.py (927 of 1727) PASS: lldb-Unit :: SymbolFile/NativePDB/./SymbolFileNativePDBTests/PDBFPOProgramToDWARFExpressionTests.UnresolvedRegisterAssignmentReference (928 of 1727) PASS: lldb-Suite :: functionalities/thread/concurrent_events/TestConcurrentBreakpointsDelayedBreakpointOneWatchpoint.py (929 of 1727) PASS: lldb-Suite :: commands/expression/call-function/TestCallUserDefinedFunction.py (930 of 1727) PASS: lldb-Unit :: Utility/./UtilityTests/OptionsWithRawTest.SingleWordSuffix (931 of 1727) UNSUPPORTED: LLDB :: SymbolFile/PDB/function-level-linking.test (932 of 1727) PASS: lldb-Unit :: Target/./TargetTests/PathMappingListTest.AbsoluteTests (933 of 1727) PASS: lldb-Unit :: Utility/./UtilityTests/Flags.ClearCount (934 of 1727) PASS: lldb-Unit :: Utility/./UtilityTests/RangeTest.Copy (935 of 1727) PASS: lldb-Suite :: functionalities/postmortem/elf-core/gcore/TestGCore.py (936 of 1727) PASS: lldb-Suite :: python_api/lldbutil/TestSwigVersion.py (937 of 1727) PASS: lldb-Suite :: lang/cpp/nsimport/TestCppNsImport.py (938 of 1727) PASS: lldb-Suite :: functionalities/thread/concurrent_events/TestConcurrentSignalDelayBreak.py (939 of 1727) PASS: lldb-Suite :: commands/expression/radar_9673664/TestExprHelpExamples.py (940 of 1727) PASS: lldb-Unit :: Utility/./UtilityTests/RegularExpression.CopyAssignment (941 of 1727) PASS: lldb-Unit :: Signals/./SignalsTests/UnixSignalsTest.Iteration (942 of 1727) PASS: LLDB :: SymbolFile/DWARF/gnu-style-compression.cpp (943 of 1727) PASS: LLDB :: SymbolFile/NativePDB/s_constant.cpp (944 of 1727) PASS: lldb-Suite :: functionalities/breakpoint/breakpoint_by_line_and_column/TestBreakpointByLineAndColumn.py (945 of 1727) PASS: lldb-Suite :: functionalities/data-formatter/data-formatter-categories/TestDataFormatterCategories.py (946 of 1727) PASS: lldb-Suite :: lang/objc/foundation/TestObjCMethodsNSArray.py (947 of 1727) PASS: lldb-Suite :: commands/expression/scoped_enums/TestScopedEnumType.py (948 of 1727) PASS: lldb-Suite :: functionalities/gdb_remote_client/TestTargetXMLArch.py (949 of 1727) PASS: lldb-Suite :: lang/objc/objc-struct-return/TestObjCStructReturn.py (950 of 1727) PASS: lldb-Suite :: lang/objc/objc-stepping/TestObjCStepping.py (951 of 1727) PASS: lldb-Suite :: macosx/universal/TestUniversal.py (952 of 1727) PASS: lldb-Suite :: functionalities/inferior-crashing/TestInferiorCrashingStep.py (953 of 1727) PASS: lldb-Suite :: lang/objc/objc-checker/TestObjCCheckers.py (954 of 1727) XFAIL: LLDB :: Unwind/prefer-debug-over-eh-frame.test (955 of 1727) PASS: lldb-Suite :: commands/expression/entry-bp/TestExprEntryBP.py (956 of 1727) PASS: lldb-Unit :: Target/./TargetTests/ExecutionContextTest.GetByteOrder (957 of 1727) PASS: lldb-Suite :: commands/expression/expr-in-syscall/TestExpressionInSyscall.py (958 of 1727) PASS: lldb-Suite :: commands/command/script/import/TestImport.py (959 of 1727) PASS: lldb-Unit :: Symbol/./SymbolTests/SymbolsTest.LocateExecutableSymbolFileForUnknownExecutableAndMissingSymbolFile (960 of 1727) PASS: lldb-Suite :: python_api/function_symbol/TestSymbolAPI.py (961 of 1727) PASS: lldb-Suite :: commands/expression/xvalue/TestXValuePrinting.py (962 of 1727) PASS: lldb-Unit :: Utility/./UtilityTests/StringListTest.GetMaxStringLengthEqualSize (963 of 1727) PASS: lldb-Unit :: ScriptInterpreter/Python/./ScriptInterpreterPythonTests/PythonDataObjectsTest.TestInstanceNameResolutionNoDot (964 of 1727) PASS: lldb-Unit :: Utility/./UtilityTests/OptionsWithRawTest.EmptySuffixSingleWhitespace (965 of 1727) PASS: lldb-Suite :: functionalities/thread/break_after_join/TestBreakAfterJoin.py (966 of 1727) PASS: lldb-Unit :: Utility/./UtilityTests/ConstStringTest.CompareStringRef (967 of 1727) PASS: lldb-Unit :: Utility/./UtilityTests/BroadcasterTest.BroadcastEvent (968 of 1727) PASS: LLDB :: BuildScript/script-args.test (969 of 1727) PASS: lldb-Unit :: Utility/./UtilityTests/BinaryStreamTest.PutSLEB128FiveBytes (970 of 1727) PASS: lldb-Suite :: lang/objc/objc-class-method/TestObjCClassMethod.py (971 of 1727) PASS: lldb-Suite :: python_api/sbvalue_const_addrof/TestSBValueConstAddrOf.py (972 of 1727) PASS: lldb-Suite :: functionalities/thread/concurrent_events/TestConcurrentManySignals.py (973 of 1727) PASS: lldb-Suite :: functionalities/thread/concurrent_events/TestConcurrentBreakpointDelayBreakpointOneSignal.py (974 of 1727) PASS: lldb-Unit :: Utility/./UtilityTests/StringListTest.CopyListEmpty (975 of 1727) PASS: lldb-Suite :: lang/objc/hidden-ivars/TestHiddenIvars.py (976 of 1727) PASS: lldb-Unit :: Utility/./UtilityTests/StreamTeeTest.AppendStream (977 of 1727) PASS: LLDB :: SymbolFile/DWARF/childless-compile-unit.s (978 of 1727) PASS: lldb-Suite :: functionalities/data-formatter/data-formatter-stl/libstdcpp/unique_ptr/invalid/TestDataFormatterInvalidStdUniquePtr.py (979 of 1727) PASS: lldb-Suite :: functionalities/data-formatter/frameformat_smallstruct/TestFrameFormatSmallStruct.py (980 of 1727) PASS: lldb-Suite :: functionalities/data-formatter/nsarraysynth/TestNSArraySynthetic.py (981 of 1727) PASS: lldb-Suite :: functionalities/data-formatter/data-formatter-stl/libstdcpp/smart_ptr/TestDataFormatterStdSmartPtr.py (982 of 1727) PASS: lldb-Unit :: Utility/./UtilityTests/ConstStringTest.UpdateMangledCounterpart (983 of 1727) PASS: LLDB :: Reproducer/Functionalities/TestDataFormatter.test (984 of 1727) PASS: lldb-Unit :: Target/./TargetTests/PathMappingListTest.RelativeTests (985 of 1727) PASS: lldb-Unit :: Utility/./UtilityTests/ArchSpecTest.TestParseMachCPUDashSubtypeTripleSimple (986 of 1727) PASS: lldb-Unit :: Utility/./UtilityTests/RangeTest.Clear (987 of 1727) PASS: lldb-Suite :: functionalities/thread/concurrent_events/TestConcurrentSignalDelayWatch.py (988 of 1727) PASS: lldb-Unit :: ScriptInterpreter/Python/./ScriptInterpreterPythonTests/PythonDataObjectsTest.TestPythonDictionaryValueEquality (989 of 1727) PASS: lldb-Suite :: lang/objc/unicode-string/TestUnicodeString.py (990 of 1727) PASS: lldb-Unit :: Utility/./UtilityTests/UriParserTest.Empty (991 of 1727) PASS: lldb-Unit :: Utility/./UtilityTests/RegularExpression.Invalid (992 of 1727) PASS: lldb-Unit :: Utility/./UtilityTests/RangeTest.Slide (993 of 1727) PASS: lldb-Unit :: Utility/./UtilityTests/StreamTest.PutBytesAsRawHex8ToMixedEndian (994 of 1727) PASS: lldb-Unit :: Host/./HostTests/SocketAddressTest.GetAddressInfo (995 of 1727) PASS: lldb-Suite :: functionalities/thread/concurrent_events/TestConcurrentTwoWatchpointsOneBreakpoint.py (996 of 1727) PASS: LLDB :: Driver/TestProcessAttach.test (997 of 1727) PASS: lldb-Unit :: Utility/./UtilityTests/StringListTest.SetSize (998 of 1727) PASS: lldb-Suite :: commands/expression/completion-in-lambda-and-unnnamed-class/TestCompletionInLambdaAndUnnamedClass.py (999 of 1727) PASS: lldb-Unit :: Editline/./EditlineTests/EditlineTestFixture.EditlineReceivesSingleLineText (1000 of 1727) UNSUPPORTED: LLDB :: Register/x86-64-zmm-read.test (1001 of 1727) PASS: lldb-Suite :: functionalities/inferior-crashing/recursive-inferior/TestRecursiveInferiorStep.py (1002 of 1727) PASS: lldb-Suite :: functionalities/thread/concurrent_events/TestConcurrentDelayedCrashWithBreakpointSignal.py (1003 of 1727) PASS: LLDB :: SymbolFile/Breakpad/line-table-mixed-path-styles.test (1004 of 1727) PASS: lldb-Unit :: Utility/./UtilityTests/AnsiTerminal.Unknown (1005 of 1727) PASS: lldb-Suite :: functionalities/thread/concurrent_events/TestConcurrentDelaySignalBreak.py (1006 of 1727) PASS: lldb-Unit :: Utility/./UtilityTests/RangeTest.SlideZero (1007 of 1727) PASS: lldb-Suite :: lang/objc/objc-super/TestObjCSuper.py (1008 of 1727) PASS: lldb-Unit :: Expression/./ExpressionTests/DiagnosticManagerTest.PutString (1009 of 1727) PASS: lldb-Suite :: lang/objc/bitfield_ivars/TestBitfieldIvars.py (1010 of 1727) PASS: LLDB :: SymbolFile/Breakpad/stack-cfi-parsing.test (1011 of 1727) PASS: lldb-Unit :: Utility/./UtilityTests/StringListTest.PopBack (1012 of 1727) PASS: lldb-Unit :: Utility/./UtilityTests/SerializationRountripTest.SerializeDeserializeObjectPointer (1013 of 1727) PASS: lldb-Unit :: UnwindAssembly/x86/./UnwindAssemblyx86Tests/Testx86AssemblyInspectionEngine.Test32BitOnlyInstruction (1014 of 1727) PASS: LLDB :: SymbolFile/DWARF/find-function-regex.cpp (1015 of 1727) PASS: lldb-Suite :: functionalities/data-formatter/data-formatter-objc/TestDataFormatterObjCNSDate.py (1016 of 1727) PASS: lldb-Suite :: functionalities/thread/concurrent_events/TestConcurrentNWatchNBreak.py (1017 of 1727) PASS: lldb-Suite :: functionalities/thread/exit_during_break/TestExitDuringBreak.py (1018 of 1727) PASS: lldb-Suite :: commands/expression/namespace_local_var_same_name_obj_c/TestNamespaceLocalVarSameNameObjC.py (1019 of 1727) PASS: lldb-Suite :: functionalities/breakpoint/breakpoint_command/TestBreakpointCommandsFromPython.py (1020 of 1727) PASS: LLDB :: Driver/LocalLLDBInit.test (1021 of 1727) PASS: lldb-Unit :: Expression/./ExpressionTests/DiagnosticManagerTest.GetStringMultipleDiags (1022 of 1727) PASS: LLDB :: Modules/ELF/compressed-sections.yaml (1023 of 1727) PASS: lldb-Suite :: functionalities/exec/TestExec.py (1024 of 1727) PASS: lldb-Suite :: lang/objcxx/cxx-bridged-po/TestObjCXXBridgedPO.py (1025 of 1727) PASS: lldb-Suite :: commands/expression/calculator_mode/TestCalculatorMode.py (1026 of 1727) PASS: lldb-Unit :: ScriptInterpreter/Python/./ScriptInterpreterPythonTests/PythonDataObjectsTest.TestDictionaryResolutionWithDot (1027 of 1727) PASS: lldb-Unit :: Utility/./UtilityTests/UriParserTest.MinimalPort (1028 of 1727) PASS: lldb-Unit :: ObjectFile/Breakpad/./ObjectFileBreakpadTests/ModuleRecord.parse (1029 of 1727) PASS: lldb-Unit :: ScriptInterpreter/Python/./ScriptInterpreterPythonTests/PythonDataObjectsTest.TestPythonCallableInvoke (1030 of 1727) PASS: LLDB :: SymbolFile/NativePDB/disassembly.cpp (1031 of 1727) PASS: lldb-Suite :: lang/c/array_types/TestArrayTypes.py (1032 of 1727) UNSUPPORTED: LLDB :: SymbolFile/PDB/class-layout.test (1033 of 1727) PASS: LLDB :: Reproducer/TestReuseDirectory.test (1034 of 1727) PASS: lldb-Suite :: python_api/type/TestTypeList.py (1035 of 1727) PASS: lldb-Unit :: Utility/./UtilityTests/TimerTest.CategoryTimesNested (1036 of 1727) PASS: lldb-Suite :: lang/cpp/namespace/TestNamespaceLookup.py (1037 of 1727) PASS: lldb-Unit :: Utility/./UtilityTests/VMRange.Reset (1038 of 1727) PASS: lldb-Unit :: Process/gdb-remote/./ProcessGdbRemoteTests/GDBRemoteCommunicationClientTest.SendGetDataPacket (1039 of 1727) PASS: lldb-Suite :: python_api/objc_type/TestObjCType.py (1040 of 1727) UNSUPPORTED: LLDB :: Breakpoint/ppc64-localentry.test (1041 of 1727) PASS: lldb-Suite :: api/log/TestAPILog.py (1042 of 1727) PASS: lldb-Suite :: commands/expression/import-std-module/list-basic/TestBasicList.py (1043 of 1727) PASS: lldb-Unit :: Utility/./UtilityTests/StreamTest.PutHex32ByteOrderLittle (1044 of 1727) PASS: lldb-Unit :: Utility/./UtilityTests/RegisterValueTest.GetSet8 (1045 of 1727) PASS: lldb-Unit :: Utility/./UtilityTests/VMRange.SetEndAddress (1046 of 1727) PASS: lldb-Suite :: functionalities/thread/thread_specific_break_plus_condition/TestThreadSpecificBpPlusCondition.py (1047 of 1727) PASS: lldb-Suite :: lang/cpp/gmodules-templates/TestGModules.py (1048 of 1727) PASS: lldb-Unit :: Process/gdb-remote/./ProcessGdbRemoteTests/GDBRemoteCommunicationClientTest.WriteRegisterNoSuffix (1049 of 1727) PASS: LLDB :: Modules/ELF/PT_LOAD.yaml (1050 of 1727) PASS: lldb-Suite :: functionalities/thread/backtrace_limit/TestBacktraceLimit.py (1051 of 1727) PASS: lldb-Suite :: commands/register/register/intel_xtended_registers/TestMPXRegisters.py (1052 of 1727) PASS: lldb-Unit :: Language/Highlighting/./HighlighterTests/HighlighterTest.Keywords (1053 of 1727) PASS: LLDB :: Modules/ELF/PT_LOAD-overlap.yaml (1054 of 1727) PASS: lldb-Unit :: UnwindAssembly/x86/./UnwindAssemblyx86Tests/Testx86AssemblyInspectionEngine.TestPushExtended (1055 of 1727) PASS: lldb-Suite :: commands/target/stop-hooks/TestStopHooks.py (1056 of 1727) PASS: lldb-Suite :: commands/expression/context-object/TestContextObject.py (1057 of 1727) PASS: lldb-Suite :: lang/cpp/inlines/TestInlines.py (1058 of 1727) PASS: lldb-Suite :: functionalities/data-formatter/data-formatter-stl/libcxx/vbool/TestDataFormatterLibcxxVBool.py (1059 of 1727) PASS: lldb-Unit :: Utility/./UtilityTests/StreamTeeTest.SetStreamAtIndexOutOfBounds (1060 of 1727) PASS: lldb-Suite :: lang/c/typedef/Testtypedef.py (1061 of 1727) PASS: lldb-Suite :: functionalities/data-formatter/synthupdate/TestSyntheticFilterRecompute.py (1062 of 1727) PASS: lldb-Suite :: python_api/lldbutil/iter/TestLLDBIterator.py (1063 of 1727) PASS: lldb-Suite :: functionalities/darwin_log/filter/regex/category/TestDarwinLogFilterRegexCategory.py (1064 of 1727) PASS: lldb-Unit :: Utility/./UtilityTests/StringExtractorTest.GetHexBytesAvail_OddPair (1065 of 1727) PASS: lldb-Unit :: Utility/./UtilityTests/StringLexerTest.Peek (1066 of 1727) PASS: lldb-Suite :: functionalities/breakpoint/cpp/TestCPPBreakpointLocations.py (1067 of 1727) PASS: lldb-Unit :: Utility/./UtilityTests/UriParserTest.BadPort2 (1068 of 1727) PASS: lldb-Unit :: Host/./HostTests/FileSystemTest.EnumerateDirectory (1069 of 1727) PASS: lldb-Suite :: functionalities/breakpoint/step_over_breakpoint/TestStepOverBreakpoint.py (1070 of 1727) PASS: lldb-Suite :: commands/expression/import-std-module/vector-bool/TestBoolVector.py (1071 of 1727) PASS: LLDB :: Reproducer/Functionalities/TestStepping.test (1072 of 1727) PASS: lldb-Suite :: lang/objc/objc-foundation-dictionary-empty/TestNSDictionary0.py (1073 of 1727) PASS: lldb-Unit :: Utility/./UtilityTests/FileSpecTest.EqualSeparator (1074 of 1727) PASS: lldb-Suite :: functionalities/thread/concurrent_events/TestConcurrentWatchpointDelayWatchpointOneBreakpoint.py (1075 of 1727) UNSUPPORTED: LLDB :: BuildScript/toolchain-msvc.test (1076 of 1727) PASS: lldb-Suite :: commands/command/delete/TestCommandDelete.py (1077 of 1727) PASS: lldb-Unit :: Process/gdb-remote/./ProcessGdbRemoteTests/GDBRemoteCommunicationClientTest.GetModulesInfo (1078 of 1727) PASS: lldb-Suite :: tools/lldb-server/inferior-crash/TestGdbRemoteSegFault.py (1079 of 1727) PASS: lldb-Unit :: Process/gdb-remote/./ProcessGdbRemoteTests/GDBRemoteClientBaseTest.SendContinueAndInterrupt (1080 of 1727) PASS: lldb-Suite :: functionalities/data-formatter/data-formatter-stl/libstdcpp/string/TestDataFormatterStdString.py (1081 of 1727) PASS: lldb-Suite :: python_api/sbtype_typeclass/TestSBTypeTypeClass.py (1082 of 1727) PASS: lldb-Unit :: Language/Highlighting/./HighlighterTests/HighlighterTest.DefaultHighlighter (1083 of 1727) PASS: LLDB :: Modules/ELF/gnu-debuglink.yaml (1084 of 1727) PASS: lldb-Suite :: commands/frame/diagnose/dereference-argument/TestDiagnoseDereferenceArgument.py (1085 of 1727) PASS: lldb-Unit :: Utility/./UtilityTests/StatusTest.ErrorConversion (1086 of 1727) PASS: lldb-Suite :: commands/expression/function_template_specialization_temp_args/TestFunctionTemplateSpecializationTempArgs.py (1087 of 1727) PASS: lldb-Suite :: functionalities/data-formatter/data-formatter-stl/libstdcpp/vbool/TestDataFormatterStdVBool.py (1088 of 1727) PASS: lldb-Suite :: linux/builtin_trap/TestBuiltinTrap.py (1089 of 1727) PASS: lldb-Suite :: macosx/version_zero/TestGetVersionZeroVersion.py (1090 of 1727) PASS: lldb-Suite :: functionalities/breakpoint/scripted_bkpt/TestScriptedResolver.py (1091 of 1727) PASS: lldb-Unit :: Process/minidump/./LLDBMinidumpTests/MinidumpParserTest.GetLinuxProcStatus (1092 of 1727) PASS: lldb-Unit :: Utility/./UtilityTests/ArgsTest.GetQuotedCommandString (1093 of 1727) PASS: lldb-Unit :: Utility/./UtilityTests/RangeTest.DoesAdjoinOrIntersect (1094 of 1727) PASS: lldb-Unit :: Host/./HostTests/SocketTest.TCPGetConnectURI (1095 of 1727) PASS: lldb-Unit :: Utility/./UtilityTests/StringExtractorTest.GetU32BigEndian (1096 of 1727) PASS: lldb-Unit :: Utility/./UtilityTests/ScalarTest.ComparisonFloat (1097 of 1727) PASS: lldb-Suite :: tools/lldb-server/TestGdbRemoteSingleStep.py (1098 of 1727) PASS: lldb-Unit :: Symbol/./SymbolTests/PostfixExpression.ParseOneExpression (1099 of 1727) PASS: lldb-Suite :: functionalities/thread/state/TestThreadStates.py (1100 of 1727) PASS: lldb-Unit :: Utility/./UtilityTests/StringListTest.JoinNonSpace (1101 of 1727) PASS: lldb-Suite :: functionalities/tsan/basic/TestTsanBasic.py (1102 of 1727) PASS: lldb-Unit :: Utility/./UtilityTests/RecordReplayTest.InstrumentedBar (1103 of 1727) PASS: lldb-Unit :: Host/./HostTests/NativeProcessProtocolTest.ReadMemoryWithoutTrap (1104 of 1727) PASS: LLDB :: Modules/ELF/base-address.yaml (1105 of 1727) PASS: lldb-Unit :: Breakpoint/./LLDBBreakpointTests/BreakpointIDTest.StringIsBreakpointName (1106 of 1727) PASS: LLDB :: Modules/ELF/netbsd-exec-8.99.30-amd64.yaml (1107 of 1727) PASS: lldb-Suite :: functionalities/thread/exit_during_step/TestExitDuringStep.py (1108 of 1727) PASS: lldb-Unit :: Utility/./UtilityTests/VMRange.Comparison (1109 of 1727) PASS: LLDB :: Modules/ELF/PT_TLS-overlap-PT_LOAD.yaml (1110 of 1727) PASS: lldb-Unit :: UnwindAssembly/x86/./UnwindAssemblyx86Tests/Testx86AssemblyInspectionEngine.TestPopEDI (1111 of 1727) PASS: lldb-Suite :: lang/cpp/bool/TestCPPBool.py (1112 of 1727) PASS: lldb-Unit :: Symbol/./SymbolTests/TestClangASTContext.TemplateArguments (1113 of 1727) PASS: lldb-Suite :: lang/objc/ivar-IMP/TestObjCiVarIMP.py (1114 of 1727) PASS: LLDB :: Modules/PECOFF/basic-info.yaml (1115 of 1727) PASS: lldb-Suite :: functionalities/darwin_log/filter/exact_match/activity-chain/TestDarwinLogFilterMatchActivityChain.py (1116 of 1727) PASS: lldb-Suite :: functionalities/param_entry_vals/basic_entry_values_x86_64/TestBasicEntryValuesX86_64.py (1117 of 1727) PASS: lldb-Unit :: Process/gdb-remote/./ProcessGdbRemoteTests/GDBRemoteClientBaseTest.SendPacketAndReceiveResponseWithOutputSupport (1118 of 1727) PASS: lldb-Suite :: functionalities/data-formatter/data-formatter-objc/TestDataFormatterObjNSException.py (1119 of 1727) PASS: lldb-Suite :: functionalities/breakpoint/objc/TestObjCBreakpoints.py (1120 of 1727) FAIL: lldb-Suite :: functionalities/gdb_remote_client/TestGDBRemoteLoad.py (1121 of 1727) ******************** TEST 'lldb-Suite :: functionalities/gdb_remote_client/TestGDBRemoteLoad.py' FAILED ******************** lldb version 10.0.99 (http://labmaster3.local/git/llvm-project.git revision 9c5a4a4527bc6c06b0f889501aa48aa23ccb90a5) clang revision 9c5a4a4527bc6c06b0f889501aa48aa23ccb90a5 llvm revision 9c5a4a4527bc6c06b0f889501aa48aa23ccb90a5 LLDB library dir: /Users/buildslave/jenkins/workspace/lldb-cmake-sanitized/lldb-build/bin LLDB import library dir: /Users/buildslave/jenkins/workspace/lldb-cmake-sanitized/lldb-build/bin libstdcxx tests will not be run because: Don't know how to build with libstdcxx on macosx Skipping following debug info categories: ['dwo']

Hide Details

Session logs for test failures/errors/unexpected successes will go into directory '/Users/buildslave/jenkins/workspace/lldb-cmake-sanitized/test/logs' Command invoked: /Users/buildslave/jenkins/workspace/lldb-cmake-sanitized/llvm-project/lldb/test/dotest.py --arch=x86_64 -s /Users/buildslave/jenkins/workspace/lldb-cmake-sanitized/lldb-build/lldb-test-traces -S nm -u CXXFLAGS -u CFLAGS --executable /Users/buildslave/jenkins/workspace/lldb-cmake-sanitized/lldb-build/./bin/lldb --dsymutil /Users/buildslave/jenkins/workspace/lldb-cmake-sanitized/lldb-build/./bin/dsymutil --filecheck /Users/buildslave/jenkins/workspace/lldb-cmake-sanitized/lldb-build/./bin/FileCheck -C /Users/buildslave/jenkins/workspace/lldb-cmake-sanitized/host-compiler/bin/clang --codesign-identity lldb_codesign --server /Users/buildslave/jenkins/workspace/lldb-cmake-sanitized/lldb-build/./bin/debugserver --arch x86_64 --build-dir /Users/buildslave/jenkins/workspace/lldb-cmake-sanitized/lldb-build/lldb-test-build.noindex -s=/Users/buildslave/jenkins/workspace/lldb-cmake-sanitized/test/logs -t --env TERM=vt100 --env LLVM_LIBS_DIR=/Users/buildslave/jenkins/workspace/lldb-cmake-sanitized/lldb-build/./lib --build-dir /Users/buildslave/jenkins/workspace/lldb-cmake-sanitized/lldb-build/tools/lldb/lldb-test-build.noindex --module-cache-dir /Users/buildslave/jenkins/workspace/lldb-cmake-sanitized/lldb-build/tools/lldb/lldb-test-build.noindex/module-cache-lldb /Users/buildslave/jenkins/workspace/lldb-cmake-sanitized/llvm-project/lldb/packages/Python/lldbsuite/test/functionalities/gdb_remote_client -p TestGDBRemoteLoad.py Change dir to: /Users/buildslave/jenkins/workspace/lldb-cmake-sanitized/llvm-project/lldb/packages/Python/lldbsuite/test/functionalities/gdb_remote_client runCmd: settings set symbols.enable-external-lookup false output:

Hide Details

runCmd: settings set plugin.process.gdb-remote.packet-timeout 60 output:

Hide Details

runCmd: settings set symbols.clang-modules-cache-path "/Users/buildslave/jenkins/workspace/lldb-cmake-sanitized/lldb-build/tools/lldb/lldb-test-build.noindex/module-cache-lldb" output:

Hide Details

runCmd: settings set use-color false output:

Hide Details

<bound method SBProcess.Kill of <lldb.SBProcess; proxy of <Swig Object of type 'lldb::SBProcess *' at 0x10c607b40> >>: success

Hide Details

PASS: LLDB (/Users/buildslave/jenkins/workspace/lldb-cmake-sanitized/host-compiler/bin/clang-10-x86_64) :: test_flash_load (TestGDBRemoteLoad.TestGDBRemoteLoad) runCmd: settings set symbols.enable-external-lookup false output:

Hide Details

runCmd: settings set plugin.process.gdb-remote.packet-timeout 60 output:

Hide Details

runCmd: settings set symbols.clang-modules-cache-path "/Users/buildslave/jenkins/workspace/lldb-cmake-sanitized/lldb-build/tools/lldb/lldb-test-build.noindex/module-cache-lldb" output:

Hide Details

runCmd: settings set use-color false output:

Hide Details

<bound method SBProcess.Kill of <lldb.SBProcess; proxy of <Swig Object of type 'lldb::SBProcess *' at 0x10c607ae0> >>: success

Hide Details

PASS: LLDB (/Users/buildslave/jenkins/workspace/lldb-cmake-sanitized/host-compiler/bin/clang-10-x86_64) :: test_module_load_address (TestGDBRemoteLoad.TestGDBRemoteLoad) runCmd: settings set symbols.enable-external-lookup false output:

Hide Details

runCmd: settings set plugin.process.gdb-remote.packet-timeout 60 output:

Hide Details

runCmd: settings set symbols.clang-modules-cache-path "/Users/buildslave/jenkins/workspace/lldb-cmake-sanitized/lldb-build/tools/lldb/lldb-test-build.noindex/module-cache-lldb" output:

Hide Details

runCmd: settings set use-color false output:

Hide Details

FAIL: LLDB (/Users/buildslave/jenkins/workspace/lldb-cmake-sanitized/host-compiler/bin/clang-10-x86_64) :: test_ram_load (TestGDBRemoteLoad.TestGDBRemoteLoad) <bound method SBProcess.Kill of <lldb.SBProcess; proxy of <Swig Object of type 'lldb::SBProcess *' at 0x10c65c240> >>: success

Hide Details

Restore dir to: /Users/buildslave/jenkins/workspace/lldb-cmake-sanitized/lldb-build/tools/lldb/lit ====================================================================== FAIL: test_ram_load (TestGDBRemoteLoad.TestGDBRemoteLoad) Test loading an object file to a target's ram ---------------------------------------------------------------------- Traceback (most recent call last): File "/Users/buildslave/jenkins/workspace/lldb-cmake-sanitized/llvm-project/lldb/packages/Python/lldbsuite/test/functionalities/gdb_remote_client/TestGDBRemoteLoad.py", line 31, in test_ram_load process = self.connect(target) File "/Users/buildslave/jenkins/workspace/lldb-cmake-sanitized/llvm-project/lldb/packages/Python/lldbsuite/test/functionalities/gdb_remote_client/gdbclientutils.py", line 479, in connect self.assertTrue(error.Success(), error.description) AssertionError: False is not True : failed to get reply to handshake packet Config=x86_64-/Users/buildslave/jenkins/workspace/lldb-cmake-sanitized/host-compiler/bin/clang-10 ---------------------------------------------------------------------- Ran 3 tests in 65.318s

Hide Details

RESULT: FAILED (2 passes, 1 failures, 0 errors, 0 skipped, 0 expected failures, 0 unexpected successes)

Hide Details

******************** PASS: lldb-Unit :: Symbol/./SymbolTests/TestClangASTContext.TestGetBasicTypeFromName (1122 of 1727) PASS: lldb-Suite :: commands/expression/import-std-module/basic/TestImportStdModule.py (1123 of 1727) PASS: lldb-Unit :: SymbolFile/NativePDB/./SymbolFileNativePDBTests/PDBFPOProgramToDWARFExpressionTests.UnresolvedCyclicRegisterAssignmentReference (1124 of 1727) PASS: lldb-Suite :: functionalities/var_path/TestVarPath.py (1125 of 1727) PASS: lldb-Suite :: lang/cpp/lambdas/TestLambdas.py (1126 of 1727) PASS: lldb-Suite :: tools/lldb-server/TestAppleSimulatorOSType.py (1127 of 1727) PASS: lldb-Unit :: Utility/./UtilityTests/ArgsTest.TestMultipleArgs (1128 of 1727) PASS: lldb-Suite :: lang/cpp/signed_types/TestSignedTypes.py (1129 of 1727) PASS: lldb-Suite :: functionalities/breakpoint/dummy_target_breakpoints/TestBreakpointsWithNoTargets.py (1130 of 1727) PASS: lldb-Suite :: lang/cpp/global_operators/TestCppGlobalOperators.py (1131 of 1727) PASS: lldb-Suite :: lang/cpp/virtual-overload/TestVirtualOverload.py (1132 of 1727) PASS: lldb-Suite :: functionalities/stats_api/TestStatisticsAPI.py (1133 of 1727) PASS: lldb-Unit :: Utility/./UtilityTests/DeserializerTest.HasData (1134 of 1727) PASS: lldb-Unit :: Utility/./UtilityTests/StreamTeeTest.GetStreamAtIndexOutOfBoundsEmpty (1135 of 1727) PASS: LLDB :: SymbolFile/DWARF/dir-separator-windows.s (1136 of 1727) PASS: lldb-Unit :: Utility/./UtilityTests/FileSpecTest.EqualDotsPosix (1137 of 1727) PASS: lldb-Unit :: Utility/./UtilityTests/StreamTest.PutMaxHex64ByteOrderLittle (1138 of 1727) PASS: lldb-Unit :: Expression/./ExpressionTests/ClangHostTest.ComputeClangResourceDirectory (1139 of 1727) PASS: lldb-Unit :: ObjectFile/Breakpad/./ObjectFileBreakpadTests/PublicRecord.parse (1140 of 1727) PASS: lldb-Suite :: lang/objc/conflicting-definition/TestConflictingDefinition.py (1141 of 1727) PASS: lldb-Unit :: UnwindAssembly/x86/./UnwindAssemblyx86Tests/Testx86AssemblyInspectionEngine.Test32bitFramelessBigStackFrame (1142 of 1727) PASS: lldb-Suite :: commands/statistics/basic/TestStats.py (1143 of 1727) PASS: lldb-Unit :: Process/gdb-remote/./ProcessGdbRemoteTests/GDBRemoteCommunicationTest.ReadPacket_checksum (1144 of 1727) PASS: lldb-Suite :: functionalities/thread/concurrent_events/TestConcurrentBreakpointOneDelayBreakpointThreads.py (1145 of 1727) PASS: lldb-Suite :: tools/lldb-server/TestGdbRemoteExpeditedRegisters.py (1146 of 1727) PASS: lldb-Unit :: Utility/./UtilityTests/NameMatchesTest.StartsWith (1147 of 1727) PASS: lldb-Suite :: functionalities/data-formatter/data-formatter-python-synth/TestDataFormatterPythonSynth.py (1148 of 1727) PASS: lldb-Suite :: functionalities/data-formatter/data-formatter-stl/libcxx/queue/TestDataFormatterLibcxxQueue.py (1149 of 1727) PASS: lldb-Suite :: commands/command/nested_alias/TestNestedAlias.py (1150 of 1727) PASS: LLDB :: Minidump/Windows/find-module.test (1151 of 1727) PASS: lldb-Unit :: Symbol/./SymbolTests/TestClangASTContext.TestConvertAccessTypeToAccessSpecifier (1152 of 1727) PASS: lldb-Unit :: tools/lldb-server/tests/./LLDBServerTests/TestBase.DebugserverEnv (1153 of 1727) PASS: lldb-Unit :: Utility/./UtilityTests/ArgsTest.TestSingleQuotedArgWithSpace (1154 of 1727) PASS: lldb-Suite :: functionalities/darwin_log/filter/exact_match/activity/TestDarwinLogFilterMatchActivity.py (1155 of 1727) PASS: LLDB :: Driver/TestConvenienceVariables.test (1156 of 1727) PASS: lldb-Unit :: Utility/./UtilityTests/StructuredDataTest.ParseJSONFromFile (1157 of 1727) PASS: lldb-Unit :: Utility/./UtilityTests/RangeDataVector.FindEntryThatContains_Overlap (1158 of 1727) PASS: lldb-Unit :: UnwindAssembly/x86/./UnwindAssemblyx86Tests/Testx86AssemblyInspectionEngine.TestPushR14 (1159 of 1727) PASS: lldb-Unit :: Target/./TargetTests/ModuleCacheTest.GetAndPutUuidExists (1160 of 1727) PASS: lldb-Unit :: Process/gdb-remote/./ProcessGdbRemoteTests/GDBRemoteClientBaseTest.SendContinueAndWait (1161 of 1727) PASS: lldb-Unit :: Utility/./UtilityTests/RangeTest.EqualInvalid (1162 of 1727) PASS: lldb-Unit :: ScriptInterpreter/Python/./ScriptInterpreterPythonTests/PythonExceptionStateTest.TestResetSemantics (1163 of 1727) PASS: lldb-Unit :: Process/minidump/./LLDBMinidumpTests/MinidumpParserTest.GetThreadContext_x86_32 (1164 of 1727) PASS: lldb-Suite :: functionalities/thread/concurrent_events/TestConcurrentTwoBreakpointsOneSignal.py (1165 of 1727) PASS: lldb-Unit :: Host/./HostTests/FileSystemTest.GetPermissions (1166 of 1727) PASS: lldb-Suite :: functionalities/tail_call_frames/thread_step_out_message/TestArtificialFrameStepOutMessage.py (1167 of 1727) PASS: lldb-Suite :: commands/settings/TestSettings.py (1168 of 1727) PASS: lldb-Suite :: lang/c/stepping/TestStepAndBreakpoints.py (1169 of 1727) PASS: lldb-Suite :: lang/cpp/dynamic-value/TestCppValueCast.py (1170 of 1727) PASS: lldb-Unit :: Utility/./UtilityTests/EnvironmentTest.EnvpConversion (1171 of 1727) PASS: lldb-Unit :: Utility/./UtilityTests/GeneratorTest.Get (1172 of 1727) PASS: lldb-Unit :: Utility/./UtilityTests/StreamTest.ShiftOperatorUInts (1173 of 1727) PASS: lldb-Unit :: Utility/./UtilityTests/LogChannelEnabledTest.LogGetLogThread (1174 of 1727) PASS: lldb-Unit :: Utility/./UtilityTests/StringListTest.InsertStringAtIndexStdString (1175 of 1727) PASS: lldb-Suite :: functionalities/gdb_remote_client/TestArmRegisterDefinition.py (1176 of 1727) PASS: lldb-Unit :: Utility/./UtilityTests/StreamTeeTest.Constructor2Streams (1177 of 1727) PASS: lldb-Unit :: Utility/./UtilityTests/UserIDResolver.GetUserName (1178 of 1727) PASS: lldb-Unit :: ScriptInterpreter/Python/./ScriptInterpreterPythonTests/PythonDataObjectsTest.TestGlobalNameResolutionNoDot (1179 of 1727) PASS: lldb-Suite :: commands/apropos/basic/TestApropos.py (1180 of 1727) PASS: lldb-Unit :: Utility/./UtilityTests/FileSpecTest.CopyByAppendingPathComponent (1181 of 1727) PASS: lldb-Suite :: lang/cpp/global_variables/TestCPPGlobalVariables.py (1182 of 1727) PASS: lldb-Unit :: Signals/./SignalsTests/UnixSignalsTest.VersionChange (1183 of 1727) PASS: lldb-Suite :: commands/expression/ir-interpreter/TestIRInterpreter.py (1184 of 1727) PASS: LLDB :: Driver/TestCommands.test (1185 of 1727) PASS: lldb-Suite :: lang/c/tls_globals/TestTlsGlobals.py (1186 of 1727) PASS: lldb-Unit :: Interpreter/./InterpreterTests/OptionArgParserTest.toScriptLanguage (1187 of 1727) PASS: lldb-Suite :: tools/lldb-server/TestGdbRemoteKill.py (1188 of 1727) PASS: lldb-Suite :: functionalities/thread/backtrace_all/TestBacktraceAll.py (1189 of 1727) PASS: lldb-Suite :: python_api/process/io/TestProcessIO.py (1190 of 1727) PASS: lldb-Suite :: functionalities/data-formatter/data-formatter-named-summaries/TestDataFormatterNamedSummaries.py (1191 of 1727) PASS: lldb-Suite :: functionalities/step_scripted/TestStepScripted.py (1192 of 1727) PASS: lldb-Unit :: Target/./TargetTests/ExecutionContextTest.GetByteOrderProcess (1193 of 1727) PASS: lldb-Unit :: Symbol/./SymbolTests/TestClangASTContext.TestRecordHasFields (1194 of 1727) PASS: LLDB :: Driver/TestNoUseColor.test (1195 of 1727) PASS: lldb-Suite :: commands/expression/top-level/TestTopLevelExprs.py (1196 of 1727) PASS: LLDB :: SymbolFile/DWARF/dir-separator-posix.s (1197 of 1727) PASS: LLDB :: SymbolFile/DWARF/find-basic-variable.cpp (1198 of 1727) PASS: lldb-Unit :: Utility/./UtilityTests/LogTest.Unregister (1199 of 1727) PASS: lldb-Unit :: Utility/./UtilityTests/StringExtractorTest.GetHexBytesAvail_FullString (1200 of 1727) PASS: lldb-Unit :: Utility/./UtilityTests/ArgsTest.TestInsertArg (1201 of 1727) PASS: lldb-Suite :: lang/mixed/TestMixedLanguages.py (1202 of 1727) PASS: lldb-Suite :: commands/expression/import-std-module/weak_ptr/TestWeakPtr.py (1203 of 1727) PASS: lldb-Suite :: lang/objc/modules-cache/TestClangModulesCache.py (1204 of 1727) PASS: lldb-Unit :: Language/Highlighting/./HighlighterTests/HighlighterTest.ClangCursorOutOfBounds (1205 of 1727) PASS: lldb-Unit :: Utility/./UtilityTests/ArgsTest.TestQuotedTrailingBackslash (1206 of 1727) PASS: lldb-Suite :: functionalities/postmortem/elf-core/thread_crash/TestLinuxCoreThreads.py (1207 of 1727) PASS: lldb-Suite :: commands/watchpoints/watchpoint_set_command/TestWatchLocationWithWatchSet.py (1208 of 1727) PASS: lldb-Unit :: SymbolFile/DWARF/./SymbolFileDWARFTests/SymbolFileDWARFTests.TestAbbrevInvalidNULLTag (1209 of 1727) PASS: lldb-Unit :: Utility/./UtilityTests/RangeTest.SizeTypes (1210 of 1727) PASS: LLDB :: SymbolFile/DWARF/deterministic-build.cpp (1211 of 1727) PASS: lldb-Unit :: Utility/./UtilityTests/StringListTest.JoinEmpty (1212 of 1727) PASS: LLDB :: Expr/TestMultilineExpr.test (1213 of 1727) PASS: lldb-Suite :: functionalities/tsan/thread_numbers/TestTsanThreadNumbers.py (1214 of 1727) PASS: lldb-Unit :: Utility/./UtilityTests/EventTest.DumpEventDataBytes (1215 of 1727) PASS: lldb-Suite :: functionalities/data-formatter/type_summary_list_arg/TestTypeSummaryListArg.py (1216 of 1727) PASS: lldb-Unit :: Utility/./UtilityTests/ProcessInstanceInfo.DumpTable_invalidUID (1217 of 1727) PASS: lldb-Suite :: lang/cpp/limit-debug-info/TestWithLimitDebugInfo.py (1218 of 1727) PASS: lldb-Unit :: Symbol/./SymbolTests/TestClangASTContext.TestGetBasicTypeFromEnum (1219 of 1727) PASS: lldb-Suite :: commands/expression/call-function/TestCallBuiltinFunction.py (1220 of 1727) PASS: LLDB :: Modules/ELF/PT_LOAD-overlap-PT_TLS.yaml (1221 of 1727) PASS: lldb-Unit :: Language/Highlighting/./HighlighterTests/HighlighterTest.ClangOperators (1222 of 1727) PASS: lldb-Unit :: Utility/./UtilityTests/ScalarTest.GetValue (1223 of 1727) PASS: LLDB :: SymbolFile/Breakpad/symtab.test (1224 of 1727) PASS: lldb-Suite :: api/multithreaded/TestMultithreaded.py (1225 of 1727) PASS: lldb-Unit :: Utility/./UtilityTests/StringListTest.SplitIntoLinesEmpty (1226 of 1727) PASS: LLDB :: Modules/PECOFF/subsections.yaml (1227 of 1727) PASS: lldb-Unit :: Utility/./UtilityTests/TimerTest.CategoryTimes2 (1228 of 1727) PASS: lldb-Suite :: commands/command/script/TestCommandScript.py (1229 of 1727) PASS: lldb-Unit :: Core/./LLDBCoreTests/RichManglingContextTest.SwitchProvider (1230 of 1727) PASS: lldb-Suite :: functionalities/darwin_log/source/info/TestDarwinLogSourceInfo.py (1231 of 1727) PASS: lldb-Suite :: lang/cpp/gmodules/TestWithModuleDebugging.py (1232 of 1727) PASS: lldb-Unit :: Utility/./UtilityTests/LogChannelTest.Enable (1233 of 1727) PASS: lldb-Unit :: Utility/./UtilityTests/UriParserTest.Minimal (1234 of 1727) PASS: lldb-Suite :: lang/cpp/unicode-literals/TestUnicodeLiterals.py (1235 of 1727) PASS: lldb-Suite :: commands/expression/unicode-in-variable/TestUnicodeInVariable.py (1236 of 1727) PASS: lldb-Unit :: UnwindAssembly/x86/./UnwindAssemblyx86Tests/Testx86AssemblyInspectionEngine.TestPushESI (1237 of 1727) PASS: lldb-Suite :: functionalities/type_completion/TestTypeCompletion.py (1238 of 1727) PASS: lldb-Suite :: functionalities/breakpoint/consecutive_breakpoints/TestConsecutiveBreakpoints.py (1239 of 1727) PASS: lldb-Suite :: commands/expression/namespace_local_var_same_name_cpp_and_c/TestNamespaceLocalVarSameNameCppAndC.py (1240 of 1727) PASS: lldb-Unit :: Language/Highlighting/./HighlighterTests/HighlighterTest.FallbackHighlighter (1241 of 1727) PASS: lldb-Suite :: functionalities/thread/concurrent_events/TestConcurrentSignalNWatchNBreak.py (1242 of 1727) UNSUPPORTED: LLDB :: SymbolFile/PDB/pointers.test (1243 of 1727) PASS: lldb-Unit :: Utility/./UtilityTests/StringListTest.ForRange (1244 of 1727) PASS: lldb-Suite :: lang/cpp/rvalue-references/TestRvalueReferences.py (1245 of 1727) PASS: lldb-Unit :: UnwindAssembly/x86/./UnwindAssemblyx86Tests/Testx86AssemblyInspectionEngine.TestStackRealign8BitDisp_i386 (1246 of 1727) PASS: lldb-Unit :: Utility/./UtilityTests/ListenerTest.GetEventWait (1247 of 1727) PASS: lldb-Suite :: functionalities/data-formatter/data-formatter-stl/libcxx/map/TestDataFormatterLibccMap.py (1248 of 1727) PASS: lldb-Unit :: Host/./HostTests/TaskPoolTest.RunTasks (1249 of 1727) PASS: lldb-Unit :: Utility/./UtilityTests/StreamTest.PutPtr (1250 of 1727) PASS: lldb-Suite :: macosx/add-dsym/TestAddDsymMidExecutionCommand.py (1251 of 1727) PASS: lldb-Unit :: Utility/./UtilityTests/UUIDTest.SetFromStringRef (1252 of 1727) PASS: lldb-Unit :: Utility/./UtilityTests/BinaryStreamTest.PutULEB128OneByte (1253 of 1727) PASS: lldb-Suite :: commands/expression/char/TestExprsChar.py (1254 of 1727) PASS: lldb-Unit :: Utility/./UtilityTests/StringListTest.CopyListSingle (1255 of 1727) PASS: lldb-Unit :: Language/Highlighting/./HighlighterTests/HighlighterTest.DefaultHighlighterWithCursorOutOfBounds (1256 of 1727) PASS: lldb-Unit :: Expression/./ExpressionTests/DiagnosticManagerTest.FixedExpression (1257 of 1727) PASS: lldb-Unit :: Utility/./UtilityTests/OptionsWithRawTest.QuotedSuffix (1258 of 1727) PASS: lldb-Suite :: commands/frame/diagnose/dereference-function-return/TestDiagnoseDereferenceFunctionReturn.py (1259 of 1727) PASS: LLDB :: Modules/ELF/section-permissions.yaml (1260 of 1727) PASS: lldb-Unit :: Process/minidump/./LLDBMinidumpTests/MinidumpParserTest.MinidumpModuleOrder (1261 of 1727) PASS: lldb-Suite :: lang/objc/objc-ivar-stripped/TestObjCIvarStripped.py (1262 of 1727) PASS: lldb-Unit :: ObjectFile/Breakpad/./ObjectFileBreakpadTests/LineRecord.parse (1263 of 1727) PASS: LLDB :: Modules/ELF/section-overlap.yaml (1264 of 1727) PASS: lldb-Unit :: Utility/./UtilityTests/ScalarTest.CastOperations (1265 of 1727) PASS: lldb-Unit :: Interpreter/./InterpreterTests/OptionArgParserTest.toChar (1266 of 1727) PASS: lldb-Unit :: Host/./HostTests/Host.GetEnvironment (1267 of 1727) PASS: lldb-Suite :: types/TestFloatTypesExpr.py (1268 of 1727) PASS: lldb-Suite :: functionalities/thread/concurrent_events/TestConcurrentWatchpointWithDelayWatchpointThreads.py (1269 of 1727) PASS: lldb-Unit :: Symbol/./SymbolTests/DWARFCallFrameInfoTest.Basic_dwarf4 (1270 of 1727) PASS: LLDB :: SymbolFile/DWARF/debug-types-basic.test (1271 of 1727) PASS: lldb-Suite :: commands/watchpoints/watchpoint_commands/TestWatchpointCommands.py (1272 of 1727) PASS: lldb-Unit :: ObjectFile/Breakpad/./ObjectFileBreakpadTests/StackWinRecord.parse (1273 of 1727) PASS: LLDB :: Modules/ELF/build-id-case.yaml (1274 of 1727) PASS: lldb-Unit :: Utility/./UtilityTests/NameMatchesTest.EndsWith (1275 of 1727) PASS: lldb-Suite :: commands/process/attach-resume/TestAttachResume.py (1276 of 1727) PASS: lldb-Unit :: Language/CPlusPlus/./LanguageCPlusPlusTests/CPlusPlusLanguage.FindAlternateFunctionManglings (1277 of 1727) PASS: lldb-Suite :: commands/expression/formatters/TestFormatters.py (1278 of 1727) PASS: lldb-Suite :: commands/expression/argument_passing_restrictions/TestArgumentPassingRestrictions.py (1279 of 1727) PASS: lldb-Unit :: Utility/./UtilityTests/StringExtractorTest.GetHexBytes_Underflow (1280 of 1727) PASS: LLDB :: SymbolFile/Breakpad/unwind-via-stack-win.test (1281 of 1727) PASS: lldb-Unit :: Utility/./UtilityTests/VMRange.CollectionContains (1282 of 1727) PASS: lldb-Unit :: Utility/./UtilityTests/RangeDataVector.FindEntryThatContains (1283 of 1727) PASS: LLDB :: Breakpoint/debug_addrx.test (1284 of 1727) PASS: LLDB :: BuildScript/toolchain-clang.test (1285 of 1727) PASS: lldb-Unit :: Language/Highlighting/./HighlighterTests/HighlighterTest.ClangStringLiterals (1286 of 1727) PASS: lldb-Unit :: Utility/./UtilityTests/StringExtractorTest.GetNameColonValueContainsColon (1287 of 1727) PASS: LLDB :: Modules/PECOFF/uuid.yaml (1288 of 1727) PASS: lldb-Unit :: Language/Highlighting/./HighlighterTests/HighlighterTest.ClangCommas (1289 of 1727) PASS: lldb-Suite :: functionalities/avoids-fd-leak/TestFdLeak.py (1290 of 1727) PASS: lldb-Suite :: python_api/name_lookup/TestNameLookup.py (1291 of 1727) PASS: lldb-Suite :: functionalities/unwind/sigtramp/TestSigtrampUnwind.py (1292 of 1727) PASS: LLDB :: SymbolFile/DWARF/find-inline-method.s (1293 of 1727) PASS: lldb-Suite :: lang/objc/blocks/TestObjCIvarsInBlocks.py (1294 of 1727) PASS: lldb-Unit :: UnwindAssembly/x86/./UnwindAssemblyx86Tests/Testx86AssemblyInspectionEngine.TestStackRealignMSVC_i386 (1295 of 1727) PASS: lldb-Suite :: functionalities/gdb_remote_client/TestGDBRemoteClient.py (1296 of 1727) PASS: lldb-Unit :: Host/./HostTests/SocketTest.UDPConnect (1297 of 1727) PASS: lldb-Unit :: Core/./LLDBCoreTests/RichManglingContextTest.Basic (1298 of 1727) PASS: lldb-Suite :: commands/frame/diagnose/complicated-expression/TestComplicatedExpression.py (1299 of 1727) PASS: lldb-Suite :: lang/cpp/static_members/TestCPPStaticMembers.py (1300 of 1727) PASS: lldb-Suite :: lang/objc/exceptions/TestObjCExceptions.py (1301 of 1727) PASS: lldb-Unit :: Process/minidump/./LLDBMinidumpTests/MinidumpParserTest.GetThreadContext_x86_32_wow64 (1302 of 1727) PASS: lldb-Unit :: Utility/./UtilityTests/ArgsTest.TestArgv (1303 of 1727) PASS: lldb-Suite :: functionalities/breakpoint/breakpoint_conditions/TestBreakpointConditions.py (1304 of 1727) PASS: lldb-Unit :: Utility/./UtilityTests/StringExtractorTest.GetHexBytesAvail_OddPair2 (1305 of 1727) PASS: lldb-Suite :: commands/expression/rdar42038760/TestScalarURem.py (1306 of 1727) PASS: lldb-Suite :: functionalities/thread/concurrent_events/TestConcurrentDelayedCrashWithBreakpointWatchpoint.py (1307 of 1727) PASS: lldb-Suite :: functionalities/archives/TestBSDArchives.py (1308 of 1727) PASS: lldb-Unit :: UnwindAssembly/x86/./UnwindAssemblyx86Tests/Testx86AssemblyInspectionEngine.TestSpillRegToStackViaMOVi386 (1309 of 1727) PASS: lldb-Suite :: tools/lldb-vscode/step/TestVSCode_step.py (1310 of 1727) PASS: LLDB :: Reproducer/TestSynchronous.test (1311 of 1727) PASS: lldb-Unit :: Utility/./UtilityTests/ScalarTest.SetValueFromCString (1312 of 1727) PASS: lldb-Suite :: python_api/value/linked_list/TestValueAPILinkedList.py (1313 of 1727) PASS: lldb-Unit :: ScriptInterpreter/Python/./ScriptInterpreterPythonTests/PythonDataObjectsTest.TestOwnedReferences (1314 of 1727) PASS: lldb-Suite :: lang/objc/forward-decl/TestForwardDecl.py (1315 of 1727) PASS: lldb-Unit :: Target/./TargetTests/MemoryRegionInfoTest.Formatv (1316 of 1727) PASS: lldb-Suite :: commands/source/info/TestSourceInfo.py (1317 of 1727) PASS: lldb-Suite :: functionalities/tty/TestTerminal.py (1318 of 1727) PASS: lldb-Suite :: functionalities/data-formatter/pyobjsynthprovider/TestPyObjSynthProvider.py (1319 of 1727) PASS: lldb-Suite :: functionalities/tsan/multiple/TestTsanMultiple.py (1320 of 1727) PASS: lldb-Unit :: Utility/./UtilityTests/StringListTest.ForRangeEmpty (1321 of 1727) PASS: LLDB :: SymbolFile/DWARF/debug-types-address-ranges.s (1322 of 1727) PASS: lldb-Unit :: Symbol/./SymbolTests/Type.GetTypeScopeAndBasename (1323 of 1727) PASS: lldb-Suite :: lang/c/global_variables/TestGlobalVariables.py (1324 of 1727) PASS: lldb-Suite :: lang/cpp/call-function/TestCallCPPFunction.py (1325 of 1727) PASS: lldb-Suite :: functionalities/data-formatter/data-formatter-objc/TestDataFormatterObjCExpr.py (1326 of 1727) PASS: lldb-Unit :: Utility/./UtilityTests/BinaryStreamTest.PutULEB128FiveBytes (1327 of 1727) PASS: lldb-Unit :: Utility/./UtilityTests/StringListTest.GetMaxStringLengthEmpty (1328 of 1727) PASS: lldb-Unit :: Utility/./UtilityTests/ArgsTest.ReplaceArgumentAtIndexFarOutOfRange (1329 of 1727) PASS: lldb-Unit :: Process/minidump/./LLDBMinidumpTests/MinidumpParserTest.GetMiscInfoWindows (1330 of 1727) PASS: lldb-Unit :: Utility/./UtilityTests/StringExtractorTest.GetHexBytesAvail_Partial (1331 of 1727) PASS: lldb-Unit :: Target/./TargetTests/PathMappingListTest.RemapRoot (1332 of 1727) PASS: lldb-Unit :: Utility/./UtilityTests/StreamTest.ChangingByteOrder (1333 of 1727) PASS: lldb-Unit :: Utility/./UtilityTests/StreamTest.PutULEB128 (1334 of 1727) PASS: lldb-Unit :: Process/minidump/./LLDBMinidumpTests/RegisterContextMinidump.ConvertMinidumpContext_x86_64 (1335 of 1727) PASS: lldb-Suite :: functionalities/thread/concurrent_events/TestConcurrentSignalBreak.py (1336 of 1727) UNSUPPORTED: LLDB :: Expr/TestIRMemoryMapWindows.test (1337 of 1727) PASS: lldb-Unit :: Host/./HostTests/FileSystemTest.MakeAbsolute (1338 of 1727) PASS: lldb-Unit :: Process/minidump/./LLDBMinidumpTests/MinidumpParserTest.InvalidMinidump (1339 of 1727) PASS: lldb-Unit :: debugserver/./debugserverTests/RNBSocket.AnyListen (1340 of 1727) PASS: LLDB :: Reproducer/TestDump.test (1341 of 1727) PASS: lldb-Suite :: macosx/load-kext/TestLoadKext.py (1342 of 1727) PASS: LLDB :: Commands/command-regex-unalias.test (1343 of 1727) PASS: lldb-Unit :: Utility/./UtilityTests/UriParserTest.PortOverflow (1344 of 1727) PASS: lldb-Suite :: python_api/thread/TestThreadAPI.py (1345 of 1727) PASS: lldb-Suite :: python_api/default-constructor/TestDefaultConstructorForAPIObjects.py (1346 of 1727) PASS: lldb-Suite :: functionalities/thread/jump/TestThreadJump.py (1347 of 1727) PASS: lldb-Suite :: lang/objc/foundation/TestObjCMethods2.py (1348 of 1727) PASS: lldb-Suite :: python_api/lldbutil/frame/TestFrameUtils.py (1349 of 1727) PASS: lldb-Suite :: functionalities/thread/concurrent_events/TestConcurrentDelayWatchBreak.py (1350 of 1727) PASS: lldb-Unit :: Utility/./UtilityTests/ConstStringTest.NullAndEmptyStates (1351 of 1727) PASS: LLDB :: SymbolFile/DWARF/debug_aranges-empty-section.s (1352 of 1727) PASS: LLDB :: Reproducer/TestGDBRemoteRepro.test (1353 of 1727) PASS: lldb-Unit :: UnwindAssembly/x86/./UnwindAssemblyx86Tests/Testx86AssemblyInspectionEngine.TestAddRSP (1354 of 1727) PASS: lldb-Unit :: Host/./HostTests/ProcessLaunchInfoTest.Constructor (1355 of 1727) PASS: lldb-Suite :: python_api/watchpoint/watchlocation/TestSetWatchlocation.py (1356 of 1727) PASS: lldb-Unit :: SymbolFile/NativePDB/./SymbolFileNativePDBTests/PDBFPOProgramToDWARFExpressionTests.UnresolvedDependentCyclicRegisterAssignmentReference (1357 of 1727) PASS: lldb-Suite :: functionalities/breakpoint/breakpoint_in_delayslot/TestAvoidBreakpointInDelaySlot.py (1358 of 1727) PASS: lldb-Suite :: lang/c/unions/TestUnionMembers.py (1359 of 1727) PASS: lldb-Unit :: Utility/./UtilityTests/VMRange.ContainsAddr (1360 of 1727) PASS: lldb-Suite :: commands/frame/diagnose/array/TestArray.py (1361 of 1727) PASS: lldb-Suite :: api/multiple-debuggers/TestMultipleDebuggers.py (1362 of 1727) PASS: lldb-Unit :: SymbolFile/DWARF/./SymbolFileDWARFTests/SymbolFileDWARFTests.TestAbilitiesForDWARF (1363 of 1727) PASS: lldb-Suite :: functionalities/gdb_remote_client/TestRecognizeBreakpoint.py (1364 of 1727) PASS: lldb-Suite :: functionalities/memory-region/TestMemoryRegion.py (1365 of 1727) PASS: lldb-Unit :: UnwindAssembly/x86/./UnwindAssemblyx86Tests/Testx86AssemblyInspectionEngine.TestPopR12 (1366 of 1727) PASS: lldb-Suite :: commands/expression/import-std-module/unique_ptr-dbg-info-content/TestUniquePtrDbgInfoContent.py (1367 of 1727) PASS: LLDB :: SymbolFile/NativePDB/ast-methods.cpp (1368 of 1727) PASS: lldb-Unit :: Utility/./UtilityTests/BinaryStreamTest.PutULEB128FourBytes (1369 of 1727) PASS: lldb-Suite :: lang/c/forward/TestForwardDeclaration.py (1370 of 1727) PASS: lldb-Unit :: Utility/./UtilityTests/ArgsTest.DoubleQuotedItem (1371 of 1727) PASS: lldb-Unit :: tools/lldb-server/tests/./LLDBServerTests/StandardStartupTest.TestStopReplyContainsThreadPcs (1372 of 1727) PASS: lldb-Unit :: Utility/./UtilityTests/StreamTest.PutRawBytesToBigEndian (1373 of 1727) PASS: LLDB :: SymbolFile/NativePDB/source-list.cpp (1374 of 1727) PASS: lldb-Unit :: Language/Highlighting/./HighlighterTests/HighlighterTest.ClangCursorPosInOtherToken (1375 of 1727) PASS: lldb-Suite :: lang/cpp/exceptions/TestCPPExceptionBreakpoints.py (1376 of 1727) PASS: lldb-Suite :: tools/lldb-server/TestGdbRemoteHostInfo.py (1377 of 1727) PASS: lldb-Suite :: functionalities/breakpoint/breakpoint_command/TestRegexpBreakCommand.py (1378 of 1727) PASS: LLDB :: Modules/ELF/basic-info.yaml (1379 of 1727) PASS: lldb-Unit :: Utility/./UtilityTests/StringListTest.AppendStringStdString (1380 of 1727) PASS: lldb-Unit :: ScriptInterpreter/Python/./ScriptInterpreterPythonTests/PythonExceptionStateTest.TestDiscardSemantics (1381 of 1727) PASS: lldb-Unit :: Editline/./EditlineTests/EditlineTestFixture.EditlineReceivesMultiLineText (1382 of 1727) PASS: lldb-Suite :: lang/objc/foundation/TestObjCMethods.py (1383 of 1727) PASS: lldb-Unit :: Language/Highlighting/./HighlighterTests/HighlighterTest.ClangCursorPosAfterOtherToken (1384 of 1727) PASS: lldb-Suite :: tools/lldb-vscode/breakpoint/TestVSCode_setExceptionBreakpoints.py (1385 of 1727) PASS: lldb-Suite :: functionalities/thread/concurrent_events/TestConcurrentCrashWithBreak.py (1386 of 1727) PASS: lldb-Unit :: UnwindAssembly/x86/./UnwindAssemblyx86Tests/Testx86AssemblyInspectionEngine.TestPushEDI (1387 of 1727) PASS: lldb-Unit :: Utility/./UtilityTests/BinaryStreamTest.PutSLEB128EightBytes (1388 of 1727) PASS: lldb-Unit :: Process/minidump/./LLDBMinidumpTests/MinidumpParserTest.GetMemoryRegionInfoFromMemoryList (1389 of 1727) PASS: lldb-Suite :: functionalities/data-formatter/nsdictionarysynth/TestNSDictionarySynthetic.py (1390 of 1727) PASS: lldb-Unit :: Utility/./UtilityTests/StringListTest.DefaultConstructor (1391 of 1727) PASS: lldb-Suite :: commands/process/launch/TestProcessLaunch.py (1392 of 1727) PASS: LLDB :: Modules/ELF/PT_LOAD-overlap-section.yaml (1393 of 1727) PASS: lldb-Unit :: Utility/./UtilityTests/ScalarTest.ExtractBitfield (1394 of 1727) PASS: lldb-Unit :: Expression/./ExpressionTests/DiagnosticManagerTest.GetStringBasic (1395 of 1727) PASS: lldb-Unit :: Utility/./UtilityTests/RegularExpression.Valid (1396 of 1727) PASS: lldb-Suite :: lang/cpp/const_this/TestConstThis.py (1397 of 1727) PASS: lldb-Suite :: api/multiple-targets/TestMultipleTargets.py (1398 of 1727) PASS: lldb-Unit :: Utility/./UtilityTests/AnsiTerminal.Basic (1399 of 1727) PASS: lldb-Suite :: functionalities/data-formatter/data-formatter-stl/libcxx/string/TestDataFormatterLibcxxString.py (1400 of 1727) PASS: lldb-Suite :: functionalities/inferior-assert/TestInferiorAssert.py (1401 of 1727) PASS: lldb-Suite :: commands/frame/language/TestGuessLanguage.py (1402 of 1727) PASS: lldb-Unit :: Utility/./UtilityTests/StringListTest.CopyList (1403 of 1727) PASS: lldb-Unit :: Utility/./UtilityTests/StringExtractorTest.GetNameColonValueNoSemicolon (1404 of 1727) PASS: lldb-Suite :: functionalities/data-formatter/data-formatter-stl/libstdcpp/unique_ptr/TestDataFormatterStdUniquePtr.py (1405 of 1727) PASS: LLDB :: SymbolFile/NativePDB/function-types-calling-conv.cpp (1406 of 1727) PASS: lldb-Unit :: Process/gdb-remote/./ProcessGdbRemoteTests/GDBRemoteClientBaseTest.SendContinueAndLateInterrupt (1407 of 1727) PASS: lldb-Unit :: Utility/./UtilityTests/StreamTest.PutHex32ByteOrderBig (1408 of 1727) PASS: lldb-Suite :: functionalities/plugins/python_os_plugin/TestPythonOSPlugin.py (1409 of 1727) UNSUPPORTED: LLDB :: Register/x86-64-ymm16-write.test (1410 of 1727) PASS: lldb-Suite :: commands/log/basic/TestLogging.py (1411 of 1727) PASS: lldb-Unit :: Host/./HostTests/SocketTest.TCPGetAddress (1412 of 1727) PASS: lldb-Unit :: ScriptInterpreter/Python/./ScriptInterpreterPythonTests/PythonExceptionStateTest.TestAutoRestoreChanged (1413 of 1727) PASS: lldb-Unit :: Language/Highlighting/./HighlighterTests/HighlighterTest.ClangSquareBrackets (1414 of 1727) PASS: lldb-Suite :: python_api/interpreter/TestRunCommandInterpreterAPI.py (1415 of 1727) PASS: lldb-Unit :: ScriptInterpreter/Python/./ScriptInterpreterPythonTests/PythonDataObjectsTest.TestPythonStringToStr (1416 of 1727) PASS: lldb-Suite :: commands/frame/diagnose/bad-reference/TestBadReference.py (1417 of 1727) PASS: lldb-Unit :: Utility/./UtilityTests/ArchSpecTest.MergeFrom (1418 of 1727) PASS: lldb-Suite :: functionalities/type_lookup/TestTypeLookup.py (1419 of 1727) PASS: lldb-Suite :: commands/watchpoints/watchpoint_on_vectors/TestValueOfVectorVariable.py (1420 of 1727) PASS: lldb-Unit :: UnwindAssembly/x86/./UnwindAssemblyx86Tests/Testx86AssemblyInspectionEngine.TestPushRBP (1421 of 1727) PASS: LLDB :: Register/x86-64-read.test (1422 of 1727) PASS: lldb-Suite :: lang/objc/modules-inline-functions/TestModulesInlineFunctions.py (1423 of 1727) PASS: LLDB :: Modules/ELF/section-addresses.yaml (1424 of 1727) PASS: lldb-Unit :: SymbolFile/NativePDB/./SymbolFileNativePDBTests/PDBFPOProgramToDWARFExpressionTests.InvalidOpUnary (1425 of 1727) PASS: lldb-Suite :: lang/c/stepping/TestThreadStepping.py (1426 of 1727) PASS: LLDB :: Process/TestEnvironment.test (1427 of 1727) PASS: lldb-Suite :: functionalities/thread/concurrent_events/TestConcurrentWatchBreakDelay.py (1428 of 1727) PASS: LLDB :: SymbolFile/DWARF/debug_rnglists.s (1429 of 1727) PASS: lldb-Suite :: python_api/debugger/TestDebuggerAPI.py (1430 of 1727) PASS: lldb-Unit :: Process/minidump/./LLDBMinidumpTests/MinidumpParserTest.FindMemoryRange (1431 of 1727) PASS: lldb-Suite :: commands/target/basic/TestTargetCommand.py (1432 of 1727) PASS: lldb-Suite :: commands/expression/fixits/TestFixIts.py (1433 of 1727) PASS: lldb-Suite :: functionalities/process_save_core/TestProcessSaveCore.py (1434 of 1727) PASS: lldb-Suite :: lang/c/unicode/TestUnicodeSymbols.py (1435 of 1727) PASS: lldb-Suite :: commands/watchpoints/multiple_threads/TestWatchpointMultipleThreads.py (1436 of 1727) UNSUPPORTED: LLDB :: SymbolFile/NativePDB/typedefs.cpp (1437 of 1727) PASS: lldb-Suite :: functionalities/data-formatter/dump_dynamic/TestDumpDynamic.py (1438 of 1727) PASS: lldb-Suite :: functionalities/dead-strip/TestDeadStrip.py (1439 of 1727) PASS: lldb-Suite :: lang/cpp/offsetof/TestOffsetofCpp.py (1440 of 1727) PASS: lldb-Unit :: Process/gdb-remote/./ProcessGdbRemoteTests/GDBRemoteCommunicationClientTest.SendStartTracePacket (1441 of 1727) PASS: LLDB :: Driver/TestSingleQuote.test (1442 of 1727) PASS: lldb-Unit :: Utility/./UtilityTests/UriParserTest.MinimalPortPath (1443 of 1727) PASS: lldb-Unit :: Utility/./UtilityTests/StringExtractorTest.GetHexU8_Extra_NoEof (1444 of 1727) PASS: lldb-Suite :: tools/lldb-server/inferior-crash/TestGdbRemoteAbort.py (1445 of 1727) PASS: lldb-Suite :: functionalities/thread/concurrent_events/TestConcurrentTwoBreakpointsOneDelaySignal.py (1446 of 1727) PASS: lldb-Unit :: Utility/./UtilityTests/Flags.IsClear (1447 of 1727) UNSUPPORTED: LLDB :: ExecControl/StopHook/stop-hook-threads.test (1448 of 1727) PASS: lldb-Suite :: functionalities/data-formatter/var-in-aggregate-misuse/TestVarInAggregateMisuse.py (1449 of 1727) PASS: lldb-Suite :: functionalities/backticks/TestBackticksWithoutATarget.py (1450 of 1727) PASS: lldb-Unit :: Utility/./UtilityTests/VMRange.IsValid (1451 of 1727) PASS: lldb-Unit :: Utility/./UtilityTests/StringListTest.JoinSingle (1452 of 1727) PASS: lldb-Suite :: python_api/hello_world/TestHelloWorld.py (1453 of 1727) PASS: lldb-Suite :: macosx/find-dsym/bundle-with-dot-in-filename/TestBundleWithDotInFilename.py (1454 of 1727) PASS: lldb-Unit :: Utility/./UtilityTests/BinaryStreamTest.PutSLEB128SevenBytes (1455 of 1727) PASS: LLDB :: SymbolFile/DWARF/debug-types-line-tables.s (1456 of 1727) PASS: lldb-Unit :: ScriptInterpreter/Python/./ScriptInterpreterPythonTests/PythonDataObjectsTest.TestModuleNameResolutionNoDot (1457 of 1727) PASS: lldb-Unit :: Host/./HostTests/FileActionTest.Open (1458 of 1727) PASS: lldb-Unit :: Utility/./UtilityTests/LogTest.LLDB_LOG_nullptr (1459 of 1727) PASS: lldb-Unit :: Utility/./UtilityTests/StreamTest.ShiftOperatorPtr (1460 of 1727) PASS: lldb-Unit :: UnwindAssembly/x86/./UnwindAssemblyx86Tests/Testx86AssemblyInspectionEngine.TestSimplex86_64Augmented (1461 of 1727) PASS: lldb-Suite :: functionalities/breakpoint/serialize/TestBreakpointSerialization.py (1462 of 1727) PASS: LLDB :: Modules/Breakpad/uuid-matching-mac.test (1463 of 1727) PASS: lldb-Suite :: terminal/TestSTTYBeforeAndAfter.py (1464 of 1727) PASS: LLDB :: SymbolFile/DWARF/dir-separator-no-comp-dir-relative-name.s (1465 of 1727) PASS: lldb-Unit :: Host/./HostTests/SocketTest.DecodeHostAndPort (1466 of 1727) PASS: lldb-Suite :: commands/watchpoints/watchpoint_commands/condition/TestWatchpointConditionCmd.py (1467 of 1727) PASS: lldb-Suite :: lang/objc/objc-new-syntax/TestObjCNewSyntaxDictionary.py (1468 of 1727) PASS: lldb-Unit :: Expression/./ExpressionTests/DiagnosticManagerTest.AppendMessageAttachToLastDiag (1469 of 1727) PASS: lldb-Unit :: Utility/./UtilityTests/ScalarTest.GetBytes (1470 of 1727) PASS: LLDB :: Minidump/breakpad-symbols.test (1471 of 1727) PASS: lldb-Suite :: commands/expression/import-std-module/queue/TestQueue.py (1472 of 1727) PASS: lldb-Suite :: functionalities/memory/read/TestMemoryRead.py (1473 of 1727) PASS: lldb-Unit :: Utility/./UtilityTests/BinaryStreamTest.PutULEB128EightBytes (1474 of 1727) PASS: lldb-Suite :: commands/expression/unwind_expression/TestUnwindExpression.py (1475 of 1727) PASS: LLDB :: SymbolFile/DWARF/find-method-local-struct.cpp (1476 of 1727) PASS: lldb-Suite :: lang/cpp/trivial_abi/TestTrivialABI.py (1477 of 1727) PASS: lldb-Suite :: commands/process/attach/attach_denied/TestAttachDenied.py (1478 of 1727) PASS: lldb-Suite :: sanity/TestModuleCacheSanity.py (1479 of 1727) PASS: lldb-Suite :: lang/c/shared_lib/TestSharedLib.py (1480 of 1727) PASS: lldb-Suite :: commands/expression/inline-namespace/TestInlineNamespace.py (1481 of 1727) PASS: lldb-Suite :: functionalities/inferior-crashing/TestInferiorCrashing.py (1482 of 1727) PASS: lldb-Unit :: ScriptInterpreter/Python/./ScriptInterpreterPythonTests/PythonDataObjectsTest.TestPythonByteArray (1483 of 1727) PASS: lldb-Unit :: Utility/./UtilityTests/StringLexerTest.GetUnlexed (1484 of 1727) PASS: lldb-Suite :: functionalities/ubsan/basic/TestUbsanBasic.py (1485 of 1727) XFAIL: LLDB :: Register/x86-64-ymm-write.test (1486 of 1727) PASS: lldb-Suite :: lang/cpp/chained-calls/TestCppChainedCalls.py (1487 of 1727) PASS: LLDB :: Modules/MachO/lc_build_version.yaml (1488 of 1727) PASS: lldb-Unit :: Process/minidump/./LLDBMinidumpTests/MinidumpParserTest.GetLinuxProcStatus_no_stream (1489 of 1727) PASS: lldb-Suite :: commands/expression/import-std-module/shared_ptr/TestSharedPtr.py (1490 of 1727) PASS: lldb-Unit :: UnwindAssembly/x86/./UnwindAssemblyx86Tests/Testx86AssemblyInspectionEngine.TestPopRBX (1491 of 1727) PASS: lldb-Unit :: Utility/./UtilityTests/Flags.AnyClear (1492 of 1727) PASS: lldb-Unit :: Utility/./UtilityTests/LogChannelTest.List (1493 of 1727) PASS: LLDB :: Modules/ELF/section-types-edgecases.yaml (1494 of 1727) PASS: lldb-Unit :: Utility/./UtilityTests/BinaryStreamTest.PutULEB128One (1495 of 1727) PASS: lldb-Unit :: Utility/./UtilityTests/UriParserTest.BadPort (1496 of 1727) PASS: LLDB :: SymbolFile/DWARF/dwarf5_locations.s (1497 of 1727) PASS: lldb-Suite :: lang/cpp/dynamic-value-same-basename/TestDynamicValueSameBase.py (1498 of 1727) PASS: lldb-Unit :: Utility/./UtilityTests/RangeTest.ContainsRangeStartingFromZero (1499 of 1727) PASS: lldb-Unit :: Utility/./UtilityTests/StringListTest.ShiftMove (1500 of 1727) PASS: lldb-Suite :: commands/reproducer/invalid-args/TestInvalidArgsReproducer.py (1501 of 1727) PASS: lldb-Unit :: UnwindAssembly/x86/./UnwindAssemblyx86Tests/Testx86AssemblyInspectionEngine.TestPopRBP (1502 of 1727) PASS: lldb-Unit :: Utility/./UtilityTests/ReproducerTest.SetReplay (1503 of 1727) PASS: lldb-Suite :: functionalities/breakpoint/breakpoint_set_restart/TestBreakpointSetRestart.py (1504 of 1727) PASS: LLDB :: Settings/TestEchoCommands.test (1505 of 1727) PASS: lldb-Suite :: commands/expression/ir-interpreter-phi-nodes/TestIRInterpreterPHINodes.py (1506 of 1727) PASS: lldb-Suite :: commands/disassemble/basic/TestFrameDisassemble.py (1507 of 1727) PASS: LLDB :: SymbolFile/DWARF/debug-types-signature-loop.s (1508 of 1727) PASS: lldb-Unit :: Utility/./UtilityTests/ScalarTest.Comparison (1509 of 1727) PASS: lldb-Unit :: Utility/./UtilityTests/ProcessInfoTest.Constructor (1510 of 1727) PASS: lldb-Unit :: Utility/./UtilityTests/StreamTest.PutHex16ByteOrderBig (1511 of 1727) PASS: lldb-Unit :: Utility/./UtilityTests/StringListTest.LongestCommonPrefixEmpty (1512 of 1727) PASS: lldb-Suite :: functionalities/ptr_refs/TestPtrRefs.py (1513 of 1727) PASS: lldb-Unit :: Utility/./UtilityTests/StreamTest.PutRawBytesToLittleEndian (1514 of 1727) PASS: lldb-Suite :: commands/platform/basic/TestPlatformCommand.py (1515 of 1727) PASS: lldb-Unit :: Utility/./UtilityTests/OptionsWithRawTest.EmptyInput (1516 of 1727) PASS: lldb-Unit :: Target/./TargetTests/ExecutionContextTest.GetByteOrderTarget (1517 of 1727) PASS: lldb-Unit :: Utility/./UtilityTests/ArchSpecTest.MergeFromMachOUnknown (1518 of 1727) PASS: lldb-Suite :: functionalities/data-formatter/compactvectors/TestCompactVectors.py (1519 of 1727) PASS: lldb-Suite :: functionalities/data-formatter/data-formatter-synthtype/TestDataFormatterSynthType.py (1520 of 1727) PASS: LLDB :: SymbolFile/NativePDB/bitfields.cpp (1521 of 1727) PASS: lldb-Unit :: ScriptInterpreter/Python/./ScriptInterpreterPythonTests/PythonDataObjectsTest.TestPythonListToStructuredList (1522 of 1727) PASS: lldb-Suite :: functionalities/gdb_remote_client/TestThreadSelectionBug.py (1523 of 1727) XFAIL: LLDB :: Register/x86-mm-xmm-read.test (1524 of 1727) PASS: lldb-Unit :: Interpreter/./InterpreterTests/CompletionTest.FileCompletionAbsolute (1525 of 1727) PASS: lldb-Suite :: commands/expression/call-function/TestCallStopAndContinue.py (1526 of 1727) PASS: lldb-Unit :: Core/./LLDBCoreTests/RichManglingContextTest.IPDRealloc (1527 of 1727) PASS: lldb-Unit :: Utility/./UtilityTests/StringListTest.Join (1528 of 1727) PASS: LLDB :: SymbolFile/Breakpad/line-table-discontinuous-file-ids.test (1529 of 1727) PASS: lldb-Suite :: commands/watchpoints/step_over_watchpoint/TestStepOverWatchpoint.py (1530 of 1727) PASS: LLDB :: Breakpoint/debug_rnglist_rlestartend.test (1531 of 1727) PASS: lldb-Suite :: functionalities/tail_call_frames/disambiguate_call_site/TestDisambiguateCallSite.py (1532 of 1727) PASS: lldb-Suite :: commands/frame/diagnose/dereference-this/TestDiagnoseDereferenceThis.py (1533 of 1727) PASS: LLDB :: SymbolFile/NativePDB/break-by-line.cpp (1534 of 1727) PASS: lldb-Unit :: Utility/./UtilityTests/RegularExpression.Match (1535 of 1727) PASS: lldb-Suite :: python_api/symbol-context/two-files/TestSymbolContextTwoFiles.py (1536 of 1727) PASS: lldb-Suite :: lang/objc/rdar-11355592/TestRdar11355592.py (1537 of 1727) PASS: lldb-Unit :: Utility/./UtilityTests/VASprintfTest.NoBufferResize (1538 of 1727) PASS: lldb-Unit :: SymbolFile/DWARF/./SymbolFileDWARFTests/SymbolFileDWARFTests.TestAbbrevValidAttrNullForm (1539 of 1727) PASS: lldb-Unit :: UnwindAssembly/x86/./UnwindAssemblyx86Tests/Testx86AssemblyInspectionEngine.TestPopESI (1540 of 1727) PASS: lldb-Suite :: types/TestDoubleTypesExpr.py (1541 of 1727) PASS: lldb-Suite :: macosx/thread-names/TestInterruptThreadNames.py (1542 of 1727) PASS: lldb-Suite :: functionalities/abbreviation/TestCommonShortSpellings.py (1543 of 1727) PASS: LLDB :: SymbolFile/DWARF/debug_loc.s (1544 of 1727) PASS: lldb-Suite :: lang/cpp/wchar_t/TestCxxWCharT.py (1545 of 1727) PASS: lldb-Suite :: functionalities/thread/crash_during_step/TestCrashDuringStep.py (1546 of 1727) PASS: lldb-Unit :: Host/./HostTests/NativeProcessProtocolTest.SetBreakpoint (1547 of 1727) PASS: lldb-Unit :: Utility/./UtilityTests/UriParserTest.TypicalPortPath (1548 of 1727) PASS: lldb-Suite :: commands/frame/diagnose/virtual-method-call/TestDiagnoseDereferenceVirtualMethodCall.py (1549 of 1727) PASS: LLDB :: SymbolFile/NativePDB/break-by-function.cpp (1550 of 1727) PASS: LLDB :: Commands/command-backtrace.test (1551 of 1727) PASS: lldb-Unit :: UnwindAssembly/x86/./UnwindAssemblyx86Tests/Testx86AssemblyInspectionEngine.TestSpillRegToStackViaMOVx86_64 (1552 of 1727) PASS: lldb-Unit :: Language/Highlighting/./HighlighterTests/HighlighterTest.ClangCursorPos (1553 of 1727) PASS: lldb-Unit :: Utility/./UtilityTests/AnsiTerminal.Empty (1554 of 1727) PASS: lldb-Suite :: python_api/target/TestTargetAPI.py (1555 of 1727) PASS: lldb-Unit :: Utility/./UtilityTests/RangeTest.DoesIntersect (1556 of 1727) PASS: lldb-Unit :: Process/gdb-remote/./ProcessGdbRemoteTests/GDBRemoteCommunicationClientTest.ReadRegister (1557 of 1727) PASS: lldb-Suite :: lang/cpp/char1632_t/TestChar1632T.py (1558 of 1727) PASS: lldb-Suite :: functionalities/data-formatter/data-formatter-objc/TestDataFormatterObjCNSError.py (1559 of 1727) PASS: lldb-Suite :: lang/c/local_variables/TestLocalVariables.py (1560 of 1727) PASS: lldb-Unit :: Utility/./UtilityTests/StringListTest.SplitIntoLines (1561 of 1727) PASS: lldb-Suite :: commands/log/invalid-args/TestInvalidArgsLog.py (1562 of 1727) PASS: lldb-Suite :: lang/objc/global_ptrs/TestGlobalObjects.py (1563 of 1727) PASS: lldb-Unit :: ObjectFile/Breakpad/./ObjectFileBreakpadTests/Record.classify (1564 of 1727) PASS: lldb-Suite :: lang/c/enum_types/TestEnumTypes.py (1565 of 1727) PASS: lldb-Unit :: Utility/./UtilityTests/LogChannelEnabledTest.LLDB_LOG_ERROR (1566 of 1727) UNSUPPORTED: LLDB :: SymbolFile/PDB/calling-conventions.test (1567 of 1727) PASS: lldb-Suite :: lang/objc/objc-baseclass-sbtype/TestObjCBaseClassSBType.py (1568 of 1727) PASS: lldb-Unit :: Utility/./UtilityTests/ArchSpecTest.Compatibility (1569 of 1727) PASS: lldb-Suite :: lang/objc/objc-property/TestObjCProperty.py (1570 of 1727) PASS: lldb-Suite :: commands/expression/import_builtin_fileid/TestImportBuiltinFileID.py (1571 of 1727) PASS: lldb-Unit :: UnwindAssembly/x86/./UnwindAssemblyx86Tests/Testx86AssemblyInspectionEngine.TestPushR15 (1572 of 1727) PASS: lldb-Suite :: functionalities/data-formatter/data-formatter-ptr-to-array/TestPtrToArrayFormatting.py (1573 of 1727) PASS: lldb-Suite :: functionalities/data-formatter/data-formatter-synthval/TestDataFormatterSynthVal.py (1574 of 1727) PASS: lldb-Suite :: functionalities/darwin_log/filter/regex/subsystem/TestDarwinLogFilterRegexSubsystem.py (1575 of 1727) PASS: lldb-Unit :: Utility/./UtilityTests/StreamTeeTest.GetStreamAtIndexOutOfBounds (1576 of 1727) PASS: lldb-Suite :: python_api/sblaunchinfo/TestSBLaunchInfo.py (1577 of 1727) PASS: lldb-Suite :: functionalities/data-formatter/data-formatter-advanced/TestDataFormatterAdv.py (1578 of 1727) PASS: lldb-Unit :: Language/Highlighting/./HighlighterTests/HighlighterTest.ClangComments (1579 of 1727) PASS: lldb-Suite :: commands/watchpoints/watchpoint_disable/TestWatchpointDisable.py (1580 of 1727) PASS: lldb-Suite :: functionalities/data-formatter/ptr_ref_typedef/TestPtrRef2Typedef.py (1581 of 1727) PASS: lldb-Suite :: functionalities/signal/raise/TestRaise.py (1582 of 1727) PASS: lldb-Suite :: commands/expression/import-std-module/vector-of-vectors/TestVectorOfVectors.py (1583 of 1727) PASS: lldb-Suite :: functionalities/breakpoint/breakpoint_names/TestBreakpointNames.py (1584 of 1727) PASS: lldb-Unit :: Utility/./UtilityTests/RangeTest.ClearWithStarAddress (1585 of 1727) PASS: lldb-Suite :: functionalities/thread/concurrent_events/TestConcurrentSignalWatch.py (1586 of 1727) UNSUPPORTED: LLDB :: Register/x86-64-xmm16-write.test (1587 of 1727) PASS: lldb-Suite :: functionalities/thread/concurrent_events/TestConcurrentTwoBreakpointsOneWatchpoint.py (1588 of 1727) PASS: lldb-Suite :: functionalities/data-formatter/hexcaps/TestDataFormatterHexCaps.py (1589 of 1727) PASS: lldb-Suite :: lang/objc/objc-new-syntax/TestObjCNewSyntaxArray.py (1590 of 1727) PASS: lldb-Unit :: Expression/./ExpressionTests/DiagnosticManagerTest.GetStringPreserveOrder (1591 of 1727) PASS: LLDB :: Modules/MachO/subsections.yaml (1592 of 1727) PASS: lldb-Unit :: tools/lldb-server/tests/./LLDBServerTests/TestBase.LaunchModePreservesEnvironment (1593 of 1727) PASS: lldb-Suite :: lang/cpp/diamond/TestDiamond.py (1594 of 1727) PASS: LLDB :: SymbolFile/DWARF/find-basic-namespace.cpp (1595 of 1727) PASS: lldb-Suite :: functionalities/darwin_log/source/debug/TestDarwinLogSourceDebug.py (1596 of 1727) PASS: LLDB :: Modules/ELF/duplicate-section.yaml (1597 of 1727) PASS: LLDB :: Register/x86-64-ymm-read.test (1598 of 1727) PASS: lldb-Suite :: lang/objc/foundation/TestConstStrings.py (1599 of 1727) PASS: lldb-Unit :: ScriptInterpreter/Python/./ScriptInterpreterPythonTests/PythonDataObjectsTest.TestPythonDictionaryManipulation (1600 of 1727) PASS: lldb-Unit :: Utility/./UtilityTests/StringExtractorTest.GetHexBytes_OddPair (1601 of 1727) PASS: lldb-Unit :: Utility/./UtilityTests/StreamTest.PutHex64ByteOrderLittle (1602 of 1727) PASS: lldb-Suite :: functionalities/data-formatter/format-propagation/TestFormatPropagation.py (1603 of 1727) PASS: lldb-Suite :: tools/lldb-server/TestGdbRemoteThreadsInStopReply.py (1604 of 1727) PASS: LLDB :: SymbolFile/NativePDB/global-classes.cpp (1605 of 1727) PASS: lldb-Unit :: UnwindAssembly/x86/./UnwindAssemblyx86Tests/Testx86AssemblyInspectionEngine.TestPopRBPWithREX (1606 of 1727) PASS: lldb-Suite :: lang/cpp/function-template-parameter-pack/TestFunctionTemplateParameterPack.py (1607 of 1727) PASS: lldb-Unit :: Utility/./UtilityTests/ArchSpecTest.TestParseMachCPUDashSubtypeTripleExtra (1608 of 1727) PASS: lldb-Suite :: macosx/order/TestOrderFile.py (1609 of 1727) PASS: LLDB :: SymbolFile/DWARF/find-qualified-variable.cpp (1610 of 1727) PASS: lldb-Unit :: Utility/./UtilityTests/ConstStringTest.format_provider (1611 of 1727) PASS: lldb-Unit :: Process/gdb-remote/./ProcessGdbRemoteTests/GDBRemoteCommunicationClientTest.GetModulesInfo_UUID20 (1612 of 1727) PASS: lldb-Unit :: ObjectFile/ELF/./ObjectFileELFTests/ObjectFileELFTest.SectionsResolveConsistently (1613 of 1727) PASS: LLDB :: Minidump/Windows/Sigsegv/sigsegv.test (1614 of 1727) UNSUPPORTED: LLDB :: Breakpoint/case-insensitive.test (1615 of 1727) PASS: lldb-Suite :: functionalities/show_location/TestShowLocationDwarf5.py (1616 of 1727) PASS: lldb-Suite :: commands/expression/persistent_types/TestPersistentTypes.py (1617 of 1727) PASS: lldb-Unit :: Language/Highlighting/./HighlighterTests/HighlighterTest.ClangEmptyInput (1618 of 1727) PASS: lldb-Unit :: Utility/./UtilityTests/BinaryStreamTest.PutSLEB128SixBytes (1619 of 1727) PASS: lldb-Suite :: lang/objcxx/hide-runtime-values/TestObjCXXHideRuntimeValues.py (1620 of 1727) PASS: LLDB :: SymbolFile/DWARF/array-sizes.s (1621 of 1727) PASS: lldb-Suite :: functionalities/recursion/TestValueObjectRecursion.py (1622 of 1727) PASS: LLDB :: Modules/PECOFF/dep-modules.yaml (1623 of 1727) PASS: lldb-Suite :: functionalities/data-formatter/data-formatter-stl/libcxx/iterator/TestDataFormatterLibccIterator.py (1624 of 1727) PASS: lldb-Unit :: Process/gdb-remote/./ProcessGdbRemoteTests/GDBRemoteCommunicationClientTest.SendGetMetaDataPacket (1625 of 1727) PASS: LLDB :: SymbolFile/DWARF/find-basic-function.cpp (1626 of 1727) PASS: lldb-Unit :: Utility/./UtilityTests/StringExtractorTest.GetU64LittleEndian (1627 of 1727) PASS: lldb-Suite :: functionalities/tail_call_frames/inlining_and_tail_calls/TestInliningAndTailCalls.py (1628 of 1727) PASS: lldb-Suite :: lang/c/const_variables/TestConstVariables.py (1629 of 1727) PASS: lldb-Unit :: Utility/./UtilityTests/ConstStringTest.MangledCounterpart (1630 of 1727) PASS: lldb-Suite :: python_api/watchpoint/TestSetWatchpoint.py (1631 of 1727) PASS: lldb-Unit :: Utility/./UtilityTests/FileSpecTest.AppendPathComponent (1632 of 1727) PASS: lldb-Unit :: Utility/./UtilityTests/RangeTest.Constructor (1633 of 1727) PASS: lldb-Suite :: macosx/lc-note/kern-ver-str/TestKernVerStrLCNOTE.py (1634 of 1727) PASS: lldb-Suite :: lang/objc/objc-optimized/TestObjcOptimized.py (1635 of 1727) PASS: lldb-Suite :: commands/expression/vector_of_enums/TestVectorOfEnums.py (1636 of 1727) PASS: lldb-Unit :: Utility/./UtilityTests/BinaryStreamTest.PutULEB128NineBytes (1637 of 1727) PASS: lldb-Unit :: Utility/./UtilityTests/StringListTest.GetMaxStringLengthIncreasingSize (1638 of 1727) PASS: LLDB :: Watchpoint/SetErrorCases.test (1639 of 1727) PASS: lldb-Suite :: lang/c/struct_types/TestStructTypes.py (1640 of 1727) PASS: lldb-Unit :: Utility/./UtilityTests/BinaryStreamTest.PutSLEB128Zero (1641 of 1727) PASS: LLDB :: SymbolFile/DWARF/find-basic-type.cpp (1642 of 1727) PASS: lldb-Suite :: commands/command/history/TestCommandHistory.py (1643 of 1727) PASS: LLDB :: Driver/TestFile.test (1644 of 1727) PASS: lldb-Unit :: Utility/./UtilityTests/OptionsWithRawTest.SingleWhitespaceInput (1645 of 1727) PASS: lldb-Suite :: lang/objc/foundation/TestRuntimeTypes.py (1646 of 1727) PASS: lldb-Suite :: functionalities/thread/concurrent_events/TestConcurrentTwoWatchpointsOneDelayBreakpoint.py (1647 of 1727) PASS: lldb-Unit :: Utility/./UtilityTests/StringListTest.LongestCommonPrefixNoPrefix (1648 of 1727) PASS: lldb-Unit :: Process/minidump/./LLDBMinidumpTests/MinidumpParserTest.GetPidWow64 (1649 of 1727) PASS: lldb-Suite :: functionalities/float-display/TestFloatDisplay.py (1650 of 1727) PASS: lldb-Unit :: Utility/./UtilityTests/StreamTest.PutMaxHex64ByteOrderBig (1651 of 1727) PASS: lldb-Suite :: functionalities/thread/concurrent_events/TestConcurrentCrashWithSignal.py (1652 of 1727) PASS: lldb-Suite :: lang/objc/objc-runtime-ivars/TestRuntimeIvars.py (1653 of 1727) PASS: lldb-Unit :: Utility/./UtilityTests/StringLexerTest.NextIf (1654 of 1727) PASS: lldb-Suite :: commands/apropos/with-process/TestAproposWithProcess.py (1655 of 1727) PASS: LLDB :: Modules/Breakpad/sections-trailing-func.test (1656 of 1727) PASS: lldb-Suite :: linux/add-symbols/TestTargetSymbolsAddCommand.py (1657 of 1727) PASS: LLDB :: Modules/ELF/many-sections.s (1658 of 1727) PASS: lldb-Suite :: lang/cpp/breakpoint-commands/TestCPPBreakpointCommands.py (1659 of 1727) PASS: lldb-Unit :: ScriptInterpreter/Python/./ScriptInterpreterPythonTests/PythonDataObjectsTest.TestPythonTupleToStructuredList (1660 of 1727) PASS: lldb-Suite :: commands/watchpoints/watchpoint_events/TestWatchpointEvents.py (1661 of 1727) PASS: LLDB :: SymbolFile/DWARF/debug-types-dwarf5.s (1662 of 1727) PASS: lldb-Suite :: commands/expression/options/TestExprOptions.py (1663 of 1727) PASS: lldb-Unit :: Utility/./UtilityTests/TimerTest.CategoryTimes (1664 of 1727) PASS: lldb-Unit :: Utility/./UtilityTests/TimerTest.CategoryTimesStats (1665 of 1727) PASS: lldb-Unit :: Utility/./UtilityTests/CompletionRequest.DuplicateFilteringWithComments (1666 of 1727) PASS: LLDB :: Quit/TestQuitExitCodeNonInt.test (1667 of 1727) PASS: lldb-Suite :: commands/watchpoints/watchpoint_size/TestWatchpointSizes.py (1668 of 1727) PASS: lldb-Suite :: functionalities/abbreviation/TestAbbreviations.py (1669 of 1727) PASS: lldb-Unit :: Utility/./UtilityTests/ArgsTest.TestAppendArg (1670 of 1727) PASS: lldb-Suite :: python_api/class_members/TestSBTypeClassMembers.py (1671 of 1727) PASS: lldb-Suite :: functionalities/target_var/TestTargetVar.py (1672 of 1727) PASS: lldb-Suite :: functionalities/data-formatter/data-formatter-stl/libcxx/multiset/TestDataFormatterLibcxxMultiSet.py (1673 of 1727) PASS: lldb-Unit :: Utility/./UtilityTests/StreamTest.PutRawBytesToMixedEndian (1674 of 1727) PASS: lldb-Suite :: lang/objc/objc-builtin-types/TestObjCBuiltinTypes.py (1675 of 1727) UNSUPPORTED: LLDB :: SymbolFile/PDB/type-quals.test (1676 of 1727) PASS: lldb-Unit :: UnwindAssembly/x86/./UnwindAssemblyx86Tests/Testx86AssemblyInspectionEngine.Test32bitFramelessSmallStackFrame (1677 of 1727) UNSUPPORTED: LLDB :: SymbolFile/PDB/compilands.test (1678 of 1727) PASS: lldb-Suite :: tools/lldb-server/TestGdbRemoteModuleInfo.py (1679 of 1727) PASS: lldb-Unit :: Host/./HostTests/MainLoopTest.ReadObject (1680 of 1727) PASS: lldb-Unit :: Utility/./UtilityTests/StreamTeeTest.Write (1681 of 1727) PASS: lldb-Unit :: Utility/./UtilityTests/ArgsTest.AppendArguments (1682 of 1727) PASS: lldb-Unit :: Utility/./UtilityTests/StringListTest.JoinMultiCharSeparator (1683 of 1727) PASS: lldb-Suite :: lang/cpp/modules-import/TestCXXModulesImport.py (1684 of 1727) PASS: LLDB :: SymbolFile/DWARF/dwarf5-partial-index.cpp (1685 of 1727) UNSUPPORTED: LLDB :: Register/x86-gp-read.test (1686 of 1727) PASS: lldb-Unit :: Core/./LLDBCoreTests/MangledTest.EmptyForInvalidName (1687 of 1727) PASS: lldb-Suite :: commands/expression/persistent_types/TestNestedPersistentTypes.py (1688 of 1727) PASS: lldb-Unit :: Utility/./UtilityTests/BinaryStreamTest.PutSLEB128OneByte (1689 of 1727) PASS: lldb-Suite :: commands/target/create-deps/TestTargetCreateDeps.py (1690 of 1727) PASS: LLDB :: Settings/TestModuleCacheSanity.test (1691 of 1727) PASS: lldb-Suite :: api/check_public_api_headers/TestPublicAPIHeaders.py (1692 of 1727) PASS: lldb-Suite :: commands/command/source/TestCommandSource.py (1693 of 1727) PASS: lldb-Unit :: Utility/./UtilityTests/StringExtractorTest.DecodeHexU8_Exact (1694 of 1727) PASS: lldb-Unit :: Utility/./UtilityTests/CompletionRequest.Constructor (1695 of 1727) PASS: lldb-Suite :: lang/cpp/extern_c/TestExternCSymbols.py (1696 of 1727) PASS: lldb-Unit :: Utility/./UtilityTests/StringListTest.AppendListCStringArrayEmpty (1697 of 1727) PASS: lldb-Unit :: UnwindAssembly/x86/./UnwindAssemblyx86Tests/Testx86AssemblyInspectionEngine.TestSimplei386ugmented (1698 of 1727) PASS: lldb-Unit :: SymbolFile/DWARF/./SymbolFileDWARFTests/SymbolFileDWARFTests.TestAbbrevOrder1Start1 (1699 of 1727) PASS: LLDB :: SymbolFile/DWARF/dwarf5-index-is-used.cpp (1700 of 1727) PASS: lldb-Unit :: Utility/./UtilityTests/StreamTeeTest.DefaultConstructor (1701 of 1727) PASS: lldb-Unit :: UnwindAssembly/x86/./UnwindAssemblyx86Tests/Testx86AssemblyInspectionEngine.TestPushEBX (1702 of 1727) PASS: lldb-Unit :: Utility/./UtilityTests/OptionsWithRawTest.ArgsButNoDelimiter (1703 of 1727) PASS: lldb-Unit :: Process/minidump/./LLDBMinidumpTests/MinidumpParserTest.GetMiscInfo_no_stream (1704 of 1727) PASS: lldb-Suite :: functionalities/breakpoint/breakpoint_locations/TestBreakpointLocations.py (1705 of 1727) UNSUPPORTED: LLDB :: SymbolFile/PDB/variables.test (1706 of 1727) PASS: lldb-Suite :: lang/c/find_struct_type/TestFindStructTypes.py (1707 of 1727) PASS: lldb-Unit :: Utility/./UtilityTests/UriParserTest.SchemeHostSeparator (1708 of 1727) PASS: LLDB :: Quit/TestQuitExitCode0.test (1709 of 1727) PASS: lldb-Unit :: Utility/./UtilityTests/OptionsWithRawTest.LeadingSpaceArgs (1710 of 1727) PASS: lldb-Suite :: commands/watchpoints/hello_watchpoint/TestMyFirstWatchpoint.py (1711 of 1727) XFAIL: LLDB :: Register/x86-64-write.test (1712 of 1727) PASS: lldb-Suite :: functionalities/pre_run_dylibs/TestPreRunDylibs.py (1713 of 1727) PASS: lldb-Suite :: python_api/symbol-context/TestSymbolContext.py (1714 of 1727) PASS: lldb-Suite :: lang/objc/objc-new-syntax/TestObjCNewSyntaxLiteral.py (1715 of 1727) PASS: lldb-Suite :: commands/watchpoints/multiple_hits/TestMultipleHits.py (1716 of 1727) PASS: lldb-Suite :: lang/objcxx/objcxx-ivar-vector/TestIvarVector.py (1717 of 1727) PASS: lldb-Suite :: functionalities/load_using_paths/TestLoadUsingPaths.py (1718 of 1727) PASS: lldb-Suite :: lang/c/step-target/TestStepTarget.py (1719 of 1727) PASS: lldb-Suite :: functionalities/data-formatter/data-formatter-objc/TestDataFormatterObjCPlain.py (1720 of 1727) PASS: lldb-Suite :: lang/cpp/operator-overload/TestOperatorOverload.py (1721 of 1727) PASS: lldb-Suite :: lang/c/function_types/TestFunctionTypes.py (1722 of 1727) PASS: lldb-Suite :: lang/cpp/class_static/TestStaticVariables.py (1723 of 1727) PASS: lldb-Suite :: functionalities/data-formatter/poarray/TestPrintObjectArray.py (1724 of 1727) PASS: lldb-Suite :: commands/expression/two-files/TestObjCTypeQueryFromOtherCompileUnit.py (1725 of 1727) PASS: lldb-Suite :: functionalities/data-formatter/data-formatter-objc/nsindexpath/TestDataFormatterNSIndexPath.py (1726 of 1727) TIMEOUT: lldb-Suite :: lang/objc/foundation/TestFoundationDisassembly.py (1727 of 1727) ******************** TEST 'lldb-Suite :: lang/objc/foundation/TestFoundationDisassembly.py' FAILED ******************** Reached timeout of 1200 seconds ******************** Testing Time: 2375.89s ******************** Failing Tests (5): lldb-Suite :: iohandler/completion/TestIOHandlerCompletion.py lldb-Suite :: tools/lldb-server/TestGdbRemoteProcessInfo.py lldb-Suite :: commands/gui/basic/TestGuiBasic.py lldb-Suite :: commands/expression/multiline-completion/TestMultilineCompletion.py lldb-Suite :: functionalities/gdb_remote_client/TestGDBRemoteLoad.py

Hide Details

******************** Timed Out Tests (1): lldb-Suite :: lang/objc/foundation/TestFoundationDisassembly.py

Hide Details

Hide Details

Slowest Tests: -------------------------------------------------------------------------- 118.97s: lldb-Suite :: commands/target/basic/TestTargetCommand.py 120.45s: lldb-Suite :: functionalities/inferior-crashing/TestInferiorCrashingStep.py 123.68s: lldb-Suite :: lang/objc/real-definition/TestRealDefinition.py 131.10s: lldb-Suite :: lang/objc/objc-new-syntax/TestObjCNewSyntaxArray.py 136.30s: lldb-Suite :: lang/objc/objc-new-syntax/TestObjCNewSyntaxDictionary.py 140.60s: lldb-Suite :: lang/c/anonymous/TestAnonymous.py 159.76s: lldb-Suite :: functionalities/recursion/TestValueObjectRecursion.py 171.59s: lldb-Suite :: lang/objc/objc-new-syntax/TestObjCNewSyntaxLiteral.py 173.08s: lldb-Suite :: lang/objc/exceptions/TestObjCExceptions.py 181.37s: lldb-Suite :: lang/cpp/namespace/TestNamespaceLookup.py 211.07s: lldb-Suite :: lang/objc/foundation/TestObjCMethods.py 228.26s: lldb-Suite :: tools/lldb-server/TestLldbGdbServer.py 232.44s: lldb-Suite :: lang/cpp/enum_types/TestCPP11EnumTypes.py 238.84s: lldb-Suite :: api/multithreaded/TestMultithreaded.py 250.29s: lldb-Suite :: functionalities/return-value/TestReturnValue.py 252.30s: lldb-Suite :: lang/objc/hidden-ivars/TestHiddenIvars.py 252.31s: lldb-Suite :: functionalities/load_unload/TestLoadUnload.py 467.58s: lldb-Suite :: types/TestIntegerTypes.py 652.34s: lldb-Suite :: types/TestIntegerTypesExpr.py 1200.76s: lldb-Suite :: lang/objc/foundation/TestFoundationDisassembly.py

Hide Details

Tests Times: -------------------------------------------------------------------------- [ Range ] :: [ Percentage ] :: [ Count ] -------------------------------------------------------------------------- [ 0s, 100s) :: [*************************************** ] :: [1700/1727] [ 100s, 200s) :: [ ] :: [ 17/1727] [ 200s, 300s) :: [ ] :: [ 7/1727] [ 300s, 400s) :: [ ] :: [ 0/1727] [ 400s, 500s) :: [ ] :: [ 0/1727] [ 500s, 600s) :: [ ] :: [ 1/1727] [ 600s, 700s) :: [ ] :: [ 0/1727] [ 700s, 800s) :: [ ] :: [ 1/1727] [ 800s, 900s) :: [ ] :: [ 0/1727] [ 900s,1000s) :: [ ] :: [ 0/1727] [1000s,1100s) :: [ ] :: [ 0/1727] [1100s,1200s) :: [ ] :: [ 0/1727] [1200s,1300s) :: [ ] :: [ 1/1727] Expected Passes : 1671 Expected Failures : 6 Unsupported Tests : 44 Unexpected Failures: 5 Individual Timeouts: 1 FAILED: tools/lldb/lit/CMakeFiles/check-lldb-lit cd /Users/buildslave/jenkins/workspace/lldb-cmake-sanitized/lldb-build/tools/lldb/lit && /usr/bin/python /Users/buildslave/jenkins/workspace/lldb-cmake-sanitized/lldb-build/./bin/llvm-lit -v --time-tests --shuffle --xunit-xml-output=/Users/buildslave/jenkins/workspace/lldb-cmake-sanitized/test/results.xml -v --timeout 1200 /Users/buildslave/jenkins/workspace/lldb-cmake-sanitized/lldb-build/tools/lldb/lit ninja: build stopped: subcommand failed. Command failed Command: ['/usr/bin/env', 'TERM=vt100', '/usr/local/bin/ninja', '-v', 'check-lldb'] [Pipeline] } [Pipeline] // timeout [Pipeline] } [Pipeline] // stage [Pipeline] stage [Pipeline] { (Declarative: Post Actions) [Pipeline] scanForIssues No credentials specified [Clang (LLVM based)] Sleeping for 5 seconds due to JENKINS-32191... [Clang (LLVM based)] Parsing console log (workspace: '/Users/buildslave/jenkins/workspace/lldb-cmake-sanitized') [Clang (LLVM based)] [-ERROR-] Git blame errors: [Clang (LLVM based)] [-ERROR-] - no blame results for request <llvm-project/lldb/tools/lldb-server/lldb-platform.cpp - [112]>.

Hide Details

[Clang (LLVM based)] Post processing issues on 'green-dragon-23' with source code encoding 'UTF-8' [Clang (LLVM based)] Resolving absolute file names for all issues in workspace '/Users/buildslave/jenkins/workspace/lldb-cmake-sanitized' [Clang (LLVM based)] -> 0 resolved, 0 unresolved, 1 already resolved [Clang (LLVM based)] Copying affected files to Jenkins' build folder '/Users/Shared/Jenkins/Home/jobs/lldb-cmake-sanitized/builds/160/files-with-issues' [Clang (LLVM based)] -> 1 copied, 0 not in workspace, 0 not-found, 0 with I/O error [Clang (LLVM based)] Resolving module names from module definitions (build.xml, pom.xml, or Manifest.mf files) [Clang (LLVM based)] -> resolved module names for 1 issues [Clang (LLVM based)] Resolving package names (or namespaces) by parsing the affected files [Clang (LLVM based)] -> resolved package names of 1 affected files [Clang (LLVM based)] No filter has been set, publishing all 1 issues [Clang (LLVM based)] Creating fingerprints for all affected code blocks to track issues over different builds [Clang (LLVM based)] -> created fingerprints for 1 issues [Clang (LLVM based)] Invoking Git blamer to create author and commit information for all affected files [Clang (LLVM based)] GIT_COMMIT env = 'HEAD' [Clang (LLVM based)] Git working tree = '/Users/buildslave/jenkins/workspace/lldb-cmake-sanitized' [Clang (LLVM based)] Git commit ID = '3f47ba41b6f8380e321c10cd908212eaaa9e1847' [Clang (LLVM based)] Job workspace = '/Users/buildslave/jenkins/workspace/lldb-cmake-sanitized' [Clang (LLVM based)] Created blame requests for 1 files - invoking Git blame on agent for each of the requests [Clang (LLVM based)] -> blamed authors of issues in 1 files
[Pipeline] junit Recording test results [Pipeline] } [Pipeline] // stage [Pipeline] } [Pipeline] // withEnv [Pipeline] } [Pipeline] // node [Pipeline] End of Pipeline [BFA] Scanning build for known causes... > git rev-parse HEAD^{commit} # timeout=10 [BFA] Found failure cause(s): [BFA] Regression test failed from category Test [BFA] Ninja target failed from category Compile [BFA] Done. 1s ERROR: script returned exit code 1 Finished: FAILURE