FailedConsole Output

Skipping 3,531 KB.. Full Log
db/packages/Python/lldbsuite/test/functionalities/gdb_remote_client/gdbclientutils.py", line 479, in connect
    self.assertTrue(error.Success(), error.description)
AssertionError: False is not True : failed to get reply to handshake packet
Config=x86_64-/Users/buildslave/jenkins/workspace/lldb-cmake-sanitized/host-compiler/bin/clang-10
======================================================================
FAIL: test_ram_load (TestGDBRemoteLoad.TestGDBRemoteLoad)
   Test loading an object file to a target's ram
----------------------------------------------------------------------
Traceback (most recent call last):
  File "/Users/buildslave/jenkins/workspace/lldb-cmake-sanitized/llvm-project/lldb/packages/Python/lldbsuite/test/functionalities/gdb_remote_client/TestGDBRemoteLoad.py", line 31, in test_ram_load
    process = self.connect(target)
  File "/Users/buildslave/jenkins/workspace/lldb-cmake-sanitized/llvm-project/lldb/packages/Python/lldbsuite/test/functionalities/gdb_remote_client/gdbclientutils.py", line 479, in connect
    self.assertTrue(error.Success(), error.description)
AssertionError: False is not True : failed to get reply to handshake packet
Config=x86_64-/Users/buildslave/jenkins/workspace/lldb-cmake-sanitized/host-compiler/bin/clang-10
----------------------------------------------------------------------
Ran 3 tests in 127.301s

Hide Details

RESULT: FAILED (1 passes, 2 failures, 0 errors, 0 skipped, 0 expected failures, 0 unexpected successes)

Hide Details

******************** PASS: lldb-Suite :: functionalities/data-formatter/data-formatter-skip-summary/TestDataFormatterSkipSummary.py (603 of 1726) PASS: lldb-Unit :: Process/minidump/./LLDBMinidumpTests/MinidumpParserTest.GetMemoryRegionInfoFromMemoryList (604 of 1726) PASS: lldb-Unit :: Utility/./UtilityTests/StreamTest.PutRawBytesToLittleEndian (605 of 1726) PASS: lldb-Unit :: Process/gdb-remote/./ProcessGdbRemoteTests/GDBRemoteCommunicationServerTest.SendErrorResponse_Status (606 of 1726) PASS: lldb-Suite :: functionalities/object-file/TestImageListMultiArchitecture.py (607 of 1726) PASS: lldb-Suite :: functionalities/data-formatter/stringprinter/TestStringPrinter.py (608 of 1726) PASS: lldb-Suite :: commands/watchpoints/step_over_watchpoint/TestStepOverWatchpoint.py (609 of 1726) PASS: lldb-Unit :: Utility/./UtilityTests/StringExtractorTest.GetHexBytesAvail_OddPair (610 of 1726) PASS: lldb-Suite :: linux/mix-dwo-and-regular-objects/TestMixedDwarfBinary.py (611 of 1726) PASS: LLDB :: Minidump/breakpad-symbols.test (612 of 1726) PASS: lldb-Suite :: python_api/value/linked_list/TestValueAPILinkedList.py (613 of 1726) PASS: lldb-Unit :: Utility/./UtilityTests/BinaryStreamTest.PutSLEB128FiveBytes (614 of 1726) PASS: lldb-Unit :: Utility/./UtilityTests/RangeTest.DefaultConstructor (615 of 1726) PASS: lldb-Unit :: UnwindAssembly/x86/./UnwindAssemblyx86Tests/Testx86AssemblyInspectionEngine.TestPushR14 (616 of 1726) PASS: lldb-Suite :: functionalities/breakpoint/breakpoint_names/TestBreakpointNames.py (617 of 1726) PASS: lldb-Unit :: ScriptInterpreter/Python/./ScriptInterpreterPythonTests/PythonDataObjectsTest.TestPythonString (618 of 1726) PASS: lldb-Unit :: Utility/./UtilityTests/UserIDResolver.GetGroupName (619 of 1726) PASS: LLDB :: SymbolFile/DWARF/dwarf5-partial-index.cpp (620 of 1726) PASS: lldb-Unit :: SymbolFile/NativePDB/./SymbolFileNativePDBTests/PDBFPOProgramToDWARFExpressionTests.UnresolvedRegisterAssignmentReference (621 of 1726) PASS: LLDB :: Reproducer/TestSynchronous.test (622 of 1726) PASS: lldb-Unit :: Utility/./UtilityTests/FileSpecTest.GetNormalizedPath (623 of 1726) PASS: lldb-Unit :: Process/minidump/./LLDBMinidumpTests/RegisterContextMinidump.ConvertMinidumpContext_x86_32 (624 of 1726) PASS: lldb-Unit :: Utility/./UtilityTests/StreamTeeTest.GetStreamAtIndexOutOfBounds (625 of 1726) PASS: lldb-Unit :: Symbol/./SymbolTests/TestClangASTContext.TestIsClangType (626 of 1726) PASS: lldb-Unit :: Utility/./UtilityTests/StringExtractorTest.GetHexBytes_Underflow (627 of 1726) PASS: lldb-Unit :: Utility/./UtilityTests/ScalarTest.ComparisonFloat (628 of 1726) PASS: lldb-Unit :: Utility/./UtilityTests/BinaryStreamTest.PutULEB128Zero (629 of 1726) PASS: lldb-Suite :: python_api/frame/inlines/TestInlinedFrame.py (630 of 1726) PASS: lldb-Suite :: commands/frame/diagnose/complicated-expression/TestComplicatedExpression.py (631 of 1726) PASS: lldb-Suite :: commands/platform/basic/TestPlatformPython.py (632 of 1726) PASS: lldb-Unit :: Utility/./UtilityTests/StringListTest.LongestCommonPrefixSingleElement (633 of 1726) PASS: lldb-Unit :: Utility/./UtilityTests/StreamTest.PutHex64ByteOrderBig (634 of 1726) PASS: lldb-Unit :: Utility/./UtilityTests/StringListTest.LongestCommonPrefixEmpty (635 of 1726) PASS: LLDB :: Register/x86-64-ymm-read.test (636 of 1726) PASS: lldb-Unit :: Host/./HostTests/FileSystemTest.FileAndDirectoryComponents (637 of 1726) PASS: lldb-Unit :: Host/./HostTests/FileSystemTest.GetPermissions (638 of 1726) PASS: lldb-Unit :: Utility/./UtilityTests/RangeTest.Copy (639 of 1726) PASS: lldb-Unit :: ScriptInterpreter/Python/./ScriptInterpreterPythonTests/PythonExceptionStateTest.TestManualRestoreSemantics (640 of 1726) PASS: lldb-Suite :: python_api/watchpoint/watchlocation/TestSetWatchlocation.py (641 of 1726) PASS: lldb-Unit :: Symbol/./SymbolTests/SymbolsTest.LocateExecutableSymbolFileForUnknownExecutableAndMissingSymbolFile (642 of 1726) PASS: lldb-Suite :: python_api/lldbutil/iter/TestLLDBIterator.py (643 of 1726) PASS: lldb-Suite :: functionalities/paths/TestPaths.py (644 of 1726) PASS: lldb-Suite :: functionalities/data-formatter/data-formatter-stl/libcxx/multimap/TestDataFormatterLibccMultiMap.py (645 of 1726) PASS: lldb-Suite :: functionalities/thread/step_until/TestStepUntil.py (646 of 1726) PASS: lldb-Suite :: commands/register/register/register_command/TestRegisters.py (647 of 1726) PASS: lldb-Suite :: lang/c/anonymous/TestAnonymous.py (648 of 1726) PASS: lldb-Suite :: android/platform/TestDefaultCacheLineSize.py (649 of 1726) PASS: LLDB :: Settings/TestEchoCommands.test (650 of 1726) PASS: lldb-Suite :: macosx/macabi/TestMacABImacOSFramework.py (651 of 1726) PASS: lldb-Suite :: functionalities/asan/TestReportData.py (652 of 1726) PASS: lldb-Unit :: Utility/./UtilityTests/ArchSpecTest.MergeFromMachOUnknown (653 of 1726) PASS: lldb-Unit :: Utility/./UtilityTests/Predicate.WaitForValueEqualTo (654 of 1726) PASS: lldb-Suite :: types/TestIntegerTypes.py (655 of 1726) PASS: lldb-Unit :: ScriptInterpreter/Python/./ScriptInterpreterPythonTests/PythonDataObjectsTest.TestPythonTupleInitializerList2 (656 of 1726) PASS: lldb-Unit :: Utility/./UtilityTests/RegisterValueTest.GetSet8 (657 of 1726) PASS: lldb-Suite :: lang/cpp/class-template-parameter-pack/TestClassTemplateParameterPack.py (658 of 1726) PASS: lldb-Suite :: functionalities/data-formatter/data-formatter-stl/libcxx/variant/TestDataFormatterLibcxxVariant.py (659 of 1726) PASS: lldb-Suite :: functionalities/exec/TestExec.py (660 of 1726) PASS: lldb-Unit :: ScriptInterpreter/Python/./ScriptInterpreterPythonTests/PythonExceptionStateTest.TestDiscardSemantics (661 of 1726) UNSUPPORTED: LLDB :: SymbolFile/PDB/vbases.test (662 of 1726) PASS: lldb-Unit :: Utility/./UtilityTests/StringExtractorTest.GetNameColonValueContainsColon (663 of 1726) PASS: lldb-Unit :: Process/minidump/./LLDBMinidumpTests/MinidumpParserTest.GetMiscInfoWindows (664 of 1726) PASS: lldb-Unit :: Utility/./UtilityTests/BinaryStreamTest.PutULEB128NineBytes (665 of 1726) PASS: lldb-Unit :: ScriptInterpreter/Python/./ScriptInterpreterPythonTests/PythonDataObjectsTest.TestPythonDictionaryValueEquality (666 of 1726) PASS: lldb-Suite :: macosx/thread-names/TestInterruptThreadNames.py (667 of 1726) PASS: lldb-Suite :: commands/watchpoints/watchpoint_events/TestWatchpointEvents.py (668 of 1726) PASS: lldb-Suite :: functionalities/plugins/command_plugin/TestPluginCommands.py (669 of 1726) PASS: LLDB :: Quit/TestQuitExitCode30.test (670 of 1726) PASS: lldb-Unit :: Symbol/./SymbolTests/Type.GetTypeScopeAndBasename (671 of 1726) PASS: lldb-Suite :: lang/cpp/signed_types/TestSignedTypes.py (672 of 1726) PASS: lldb-Unit :: Utility/./UtilityTests/StreamTeeTest.Assignment (673 of 1726) PASS: lldb-Unit :: Utility/./UtilityTests/FileSpecTest.RemoveLastPathComponent (674 of 1726) PASS: lldb-Suite :: commands/expression/function_template_specialization_temp_args/TestFunctionTemplateSpecializationTempArgs.py (675 of 1726) PASS: lldb-Suite :: functionalities/unwind/noreturn/module-end/TestNoReturnModuleEnd.py (676 of 1726) PASS: lldb-Unit :: UnwindAssembly/x86/./UnwindAssemblyx86Tests/Testx86AssemblyInspectionEngine.TestSimple32bitFrameFunction (677 of 1726) PASS: lldb-Suite :: lang/objc/modules/TestObjCModules.py (678 of 1726) PASS: lldb-Suite :: macosx/order/TestOrderFile.py (679 of 1726) PASS: lldb-Unit :: Host/./HostTests/MainLoopTest.UnmonitoredSignal (680 of 1726) PASS: lldb-Suite :: commands/expression/radar_9531204/TestPrintfAfterUp.py (681 of 1726) PASS: lldb-Unit :: Utility/./UtilityTests/ScalarTest.Division (682 of 1726) PASS: lldb-Suite :: functionalities/breakpoint/breakpoint_command/TestBreakpointCommand.py (683 of 1726) PASS: lldb-Suite :: functionalities/darwin_log/source/debug/TestDarwinLogSourceDebug.py (684 of 1726) PASS: lldb-Unit :: Utility/./UtilityTests/ArgsTest.AppendArguments (685 of 1726) PASS: lldb-Suite :: functionalities/gdb_remote_client/TestRecognizeBreakpoint.py (686 of 1726) PASS: lldb-Suite :: functionalities/breakpoint/hardware_breakpoints/hardware_breakpoint_on_multiple_threads/TestHWBreakMultiThread.py (687 of 1726) PASS: lldb-Unit :: ScriptInterpreter/Python/./ScriptInterpreterPythonTests/PythonDataObjectsTest.TestBorrowedReferences (688 of 1726) PASS: lldb-Unit :: Process/gdb-remote/./ProcessGdbRemoteTests/GDBRemoteCommunicationClientTest.GetModulesInfo_UUID20 (689 of 1726) PASS: lldb-Suite :: arm/breakpoint-thumb-codesection/TestBreakpointThumbCodesection.py (690 of 1726) PASS: lldb-Unit :: Utility/./UtilityTests/UriParserTest.TypicalPortPath (691 of 1726) PASS: lldb-Suite :: lang/cpp/call-function/TestCallCPPFunction.py (692 of 1726) PASS: lldb-Unit :: ObjectFile/Breakpad/./ObjectFileBreakpadTests/FileRecord.parse (693 of 1726) PASS: lldb-Unit :: Language/Highlighting/./HighlighterTests/HighlighterTest.ClangCursorPosBeforeOtherToken (694 of 1726) PASS: lldb-Unit :: Utility/./UtilityTests/StringListTest.JoinSingle (695 of 1726) PASS: lldb-Unit :: Utility/./UtilityTests/StringExtractorTest.GetHexBytesAvail_OddPair2 (696 of 1726) PASS: lldb-Suite :: commands/expression/call-function/TestCallBuiltinFunction.py (697 of 1726) PASS: LLDB :: SymbolFile/NativePDB/function-types-calling-conv.cpp (698 of 1726) PASS: lldb-Suite :: functionalities/ptr_refs/TestPtrRefs.py (699 of 1726) PASS: lldb-Suite :: lang/objc/orderedset/TestOrderedSet.py (700 of 1726) PASS: lldb-Unit :: Core/./LLDBCoreTests/MangledTest.NameIndexes_FindFunctionSymbols (701 of 1726) PASS: lldb-Suite :: functionalities/signal/handle-segv/TestHandleSegv.py (702 of 1726) PASS: LLDB :: Reproducer/TestReuseDirectory.test (703 of 1726) PASS: lldb-Unit :: Expression/./ExpressionTests/ClangHostTest.ComputeClangResourceDirectory (704 of 1726) PASS: LLDB :: Modules/ELF/section-overlap.yaml (705 of 1726) PASS: lldb-Suite :: python_api/frame/TestFrames.py (706 of 1726) PASS: lldb-Unit :: Utility/./UtilityTests/BroadcasterTest.BroadcastEvent (707 of 1726) PASS: lldb-Suite :: functionalities/deleted-executable/TestDeletedExecutable.py (708 of 1726) PASS: lldb-Suite :: functionalities/tsan/multiple/TestTsanMultiple.py (709 of 1726) PASS: lldb-Suite :: macosx/add-dsym/TestAddDsymMidExecutionCommand.py (710 of 1726) PASS: lldb-Unit :: ScriptInterpreter/Python/./ScriptInterpreterPythonTests/PythonDataObjectsTest.TestPythonDictionaryManipulation (711 of 1726) PASS: lldb-Suite :: functionalities/value_md5_crash/TestValueMD5Crash.py (712 of 1726) PASS: lldb-Unit :: Utility/./UtilityTests/VASprintfTest.NoBufferResize (713 of 1726) PASS: lldb-Unit :: ScriptInterpreter/Python/./ScriptInterpreterPythonTests/PythonDataObjectsTest.TestPythonTupleInitializerList (714 of 1726) PASS: lldb-Suite :: commands/settings/quoting/TestQuoting.py (715 of 1726) PASS: lldb-Suite :: lang/objc/foundation/TestObjCMethodsString.py (716 of 1726) PASS: lldb-Unit :: UnwindAssembly/x86/./UnwindAssemblyx86Tests/Testx86AssemblyInspectionEngine.TestSubESP (717 of 1726) PASS: lldb-Suite :: functionalities/gdb_remote_client/TestTargetXMLArch.py (718 of 1726) PASS: lldb-Suite :: commands/expression/context-object/TestContextObject.py (719 of 1726) PASS: lldb-Suite :: python_api/value_var_update/TestValueVarUpdate.py (720 of 1726) UNSUPPORTED: LLDB :: BuildScript/toolchain-msvc.test (721 of 1726) PASS: lldb-Unit :: Signals/./SignalsTests/UnixSignalsTest.Iteration (722 of 1726) PASS: lldb-Suite :: functionalities/completion/TestCompletion.py (723 of 1726) PASS: lldb-Unit :: Utility/./UtilityTests/LogTest.LLDB_LOG_nullptr (724 of 1726) PASS: lldb-Suite :: functionalities/thread/concurrent_events/TestConcurrentTwoWatchpointsOneDelayBreakpoint.py (725 of 1726) PASS: lldb-Suite :: functionalities/postmortem/elf-core/thread_crash/TestLinuxCoreThreads.py (726 of 1726) PASS: lldb-Suite :: python_api/process/io/TestProcessIO.py (727 of 1726) PASS: lldb-Unit :: Utility/./UtilityTests/DataExtractorTest.GetMaxU64_unchecked (728 of 1726) PASS: lldb-Unit :: Utility/./UtilityTests/RangeTest.Clear (729 of 1726) PASS: lldb-Suite :: lang/cpp/overloaded-functions/TestOverloadedFunctions.py (730 of 1726) PASS: lldb-Suite :: commands/statistics/basic/TestStats.py (731 of 1726) PASS: lldb-Suite :: lang/objc/unicode-string/TestUnicodeString.py (732 of 1726) PASS: lldb-Suite :: python_api/lldbutil/frame/TestFrameUtils.py (733 of 1726) PASS: lldb-Suite :: commands/expression/import-std-module/forward_list-dbg-info-content/TestDbgInfoContentForwardList.py (734 of 1726) PASS: LLDB :: Minidump/fb-dump.test (735 of 1726) PASS: lldb-Suite :: functionalities/breakpoint/breakpoint_language/TestBreakpointLanguage.py (736 of 1726) PASS: LLDB :: Modules/ELF/duplicate-section.yaml (737 of 1726) PASS: lldb-Suite :: functionalities/tail_call_frames/ambiguous_tail_call_seq2/TestAmbiguousTailCallSeq2.py (738 of 1726) PASS: lldb-Unit :: Host/./HostTests/SocketTest.TCPGetAddress (739 of 1726) PASS: lldb-Unit :: Utility/./UtilityTests/StringExtractorTest.GetHexU8_Underflow_NoEof (740 of 1726) PASS: lldb-Unit :: Expression/./ExpressionTests/DiagnosticManagerTest.GetStringSeverityLabels (741 of 1726) PASS: lldb-Suite :: arm/emulation/TestEmulations.py (742 of 1726) PASS: lldb-Suite :: lang/cpp/incomplete-types/TestCppIncompleteTypes.py (743 of 1726) PASS: lldb-Unit :: UnwindAssembly/x86/./UnwindAssemblyx86Tests/Testx86AssemblyInspectionEngine.Test32BitOnlyInstruction (744 of 1726) PASS: lldb-Suite :: lang/objc/objc-checker/TestObjCCheckers.py (745 of 1726) PASS: lldb-Suite :: python_api/lldbutil/iter/TestRegistersIterator.py (746 of 1726) PASS: lldb-Suite :: commands/expression/import_builtin_fileid/TestImportBuiltinFileID.py (747 of 1726) PASS: lldb-Unit :: Language/Highlighting/./HighlighterTests/HighlighterTest.Keywords (748 of 1726) PASS: lldb-Suite :: lang/objc/global_ptrs/TestGlobalObjects.py (749 of 1726) PASS: LLDB :: Modules/Breakpad/sections-trailing-func.test (750 of 1726) PASS: LLDB :: SymbolFile/Breakpad/line-table-missing-file.test (751 of 1726) PASS: lldb-Suite :: tools/lldb-server/commandline/TestStubSetSID.py (752 of 1726) PASS: lldb-Unit :: Utility/./UtilityTests/StreamTest.ShiftOperatorChars (753 of 1726) PASS: lldb-Unit :: Utility/./UtilityTests/StreamTest.PutHex32ByteOrderBig (754 of 1726) PASS: lldb-Unit :: Core/./LLDBCoreTests/RichManglingContextTest.Basic (755 of 1726) PASS: lldb-Suite :: functionalities/breakpoint/breakpoint_ids/TestBreakpointIDs.py (756 of 1726) PASS: lldb-Unit :: Host/./HostTests/FileSystemTest.Resolve (757 of 1726) PASS: lldb-Unit :: ScriptInterpreter/Python/./ScriptInterpreterPythonTests/PythonDataObjectsTest.TestPythonTupleValues (758 of 1726) PASS: lldb-Suite :: functionalities/float-display/TestFloatDisplay.py (759 of 1726) PASS: lldb-Suite :: functionalities/data-formatter/data-formatter-stl/libcxx/optional/TestDataFormatterLibcxxOptional.py (760 of 1726) PASS: lldb-Suite :: commands/expression/completion/TestExprCompletion.py (761 of 1726) PASS: lldb-Unit :: Utility/./UtilityTests/BinaryStreamTest.PutULEB128EightBytes (762 of 1726) PASS: lldb-Unit :: Utility/./UtilityTests/StringListTest.CopyList (763 of 1726) PASS: lldb-Unit :: Utility/./UtilityTests/StringExtractorTest.GetHexBytesAvail (764 of 1726) PASS: lldb-Unit :: Interpreter/./InterpreterTests/CompletionTest.DirCompletionAbsolute (765 of 1726) PASS: lldb-Unit :: Utility/./UtilityTests/IndexToObjectTest.ObjectForIndex (766 of 1726) PASS: lldb-Suite :: lang/objc/objc-static-method/TestObjCStaticMethod.py (767 of 1726) PASS: lldb-Suite :: lang/c/bitfields/TestBitfields.py (768 of 1726) PASS: lldb-Suite :: linux/thread/create_during_instruction_step/TestCreateDuringInstructionStep.py (769 of 1726) PASS: lldb-Unit :: UnwindAssembly/x86/./UnwindAssemblyx86Tests/Testx86AssemblyInspectionEngine.TestSubRSP (770 of 1726) UNSUPPORTED: LLDB :: Register/x86-ymm-write.test (771 of 1726) PASS: lldb-Unit :: Utility/./UtilityTests/StringExtractorTest.DecodeHexU8_InvalidHex2 (772 of 1726) PASS: lldb-Unit :: Utility/./UtilityTests/StreamTest.PutMaxHex64ByteOrderBig (773 of 1726) PASS: lldb-Suite :: functionalities/data-formatter/data-formatter-objc/TestDataFormatterObjCNSBundle.py (774 of 1726) PASS: lldb-Unit :: UnwindAssembly/x86/./UnwindAssemblyx86Tests/Testx86AssemblyInspectionEngine.TestPushEAX (775 of 1726) PASS: lldb-Unit :: Utility/./UtilityTests/FileSpecTest.EqualDotsWindows (776 of 1726) PASS: lldb-Suite :: lang/objc/foundation/TestObjCMethodsNSError.py (777 of 1726) PASS: lldb-Suite :: macosx/duplicate-archive-members/TestDuplicateMembers.py (778 of 1726) PASS: lldb-Unit :: Utility/./UtilityTests/StreamTeeTest.GetStreamAtIndexOutOfBoundsEmpty (779 of 1726) PASS: lldb-Unit :: Utility/./UtilityTests/StringListTest.GetMaxStringLengthEmpty (780 of 1726) PASS: lldb-Suite :: macosx/find-dsym/deep-bundle/TestDeepBundle.py (781 of 1726) PASS: lldb-Unit :: Utility/./UtilityTests/ProcessInstanceInfo.DumpTable (782 of 1726) PASS: lldb-Unit :: Utility/./UtilityTests/StringListTest.AppendListCStringArray (783 of 1726) PASS: lldb-Unit :: UnwindAssembly/x86/./UnwindAssemblyx86Tests/Testx86AssemblyInspectionEngine.TestLEAVE (784 of 1726) PASS: lldb-Unit :: Expression/./ExpressionTests/DWARFExpression.DW_OP_pick (785 of 1726) PASS: lldb-Unit :: Utility/./UtilityTests/StreamTeeTest.CopyConstructor (786 of 1726) PASS: lldb-Unit :: Utility/./UtilityTests/StringListTest.ShiftStdString (787 of 1726) PASS: lldb-Unit :: Utility/./UtilityTests/EnvironmentTest.EnvpConstruction (788 of 1726) PASS: lldb-Suite :: commands/expression/persist_objc_pointeetype/TestPersistObjCPointeeType.py (789 of 1726) PASS: lldb-Suite :: functionalities/data-formatter/parray/TestPrintArray.py (790 of 1726) PASS: lldb-Unit :: Utility/./UtilityTests/AnsiTerminal.Twice (791 of 1726) PASS: lldb-Suite :: functionalities/data-formatter/data-formatter-stl/libcxx/forward_list/TestDataFormatterLibcxxForwardList.py (792 of 1726) PASS: lldb-Unit :: Utility/./UtilityTests/GeneratorTest.GetOrCreate (793 of 1726) PASS: lldb-Suite :: python_api/sbdata/TestSBData.py (794 of 1726) PASS: lldb-Suite :: functionalities/thread/concurrent_events/TestConcurrentWatchpointWithDelayWatchpointThreads.py (795 of 1726) PASS: lldb-Suite :: functionalities/data-formatter/data-formatter-stl/libcxx/queue/TestDataFormatterLibcxxQueue.py (796 of 1726) PASS: LLDB :: SymbolFile/DWARF/forward-declarations.s (797 of 1726) PASS: lldb-Unit :: Utility/./UtilityTests/ArgsTest.EscapeLLDBCommandArgument (798 of 1726) PASS: lldb-Unit :: Utility/./UtilityTests/StringExtractorTest.GetHexBytes_Partial (799 of 1726) PASS: lldb-Suite :: commands/expression/test/TestExprs.py (800 of 1726) PASS: LLDB :: Commands/command-script-import.test (801 of 1726) PASS: lldb-Suite :: functionalities/data-formatter/data-formatter-stl/libstdcpp/tuple/TestDataFormatterStdTuple.py (802 of 1726) PASS: lldb-Suite :: functionalities/breakpoint/breakpoint_hit_count/TestBreakpointHitCount.py (803 of 1726) PASS: lldb-Unit :: Process/gdb-remote/./ProcessGdbRemoteTests/GDBRemoteCommunicationClientTest.TestPacketSpeedJSON (804 of 1726) PASS: lldb-Unit :: Host/./HostTests/ConnectionFileDescriptorTest.TCPGetURIv6 (805 of 1726) PASS: lldb-Suite :: lang/cpp/member-and-local-vars-with-same-name/TestMembersAndLocalsWithSameName.py (806 of 1726) PASS: lldb-Suite :: lang/cpp/template/TestTemplateArgs.py (807 of 1726) PASS: LLDB :: SymbolFile/DWARF/dir-separator-posix.s (808 of 1726) PASS: lldb-Unit :: Symbol/./SymbolTests/PostfixExpression.ParseFPOProgram (809 of 1726) PASS: lldb-Unit :: Process/gdb-remote/./ProcessGdbRemoteTests/GDBRemoteClientBaseTest.SendContinueAndInterrupt (810 of 1726) PASS: lldb-Unit :: Utility/./UtilityTests/RangeTest.ContainsAddrInvalid (811 of 1726) PASS: lldb-Unit :: Utility/./UtilityTests/StringListTest.JoinThree (812 of 1726) PASS: lldb-Unit :: Utility/./UtilityTests/StringExtractorTest.GetHexBytes_FullString (813 of 1726) PASS: lldb-Unit :: Utility/./UtilityTests/ScalarTest.Equality (814 of 1726) PASS: lldb-Unit :: Utility/./UtilityTests/UriParserTest.MinimalPort (815 of 1726) PASS: lldb-Suite :: functionalities/breakpoint/cpp_exception/TestCPPExceptionBreakpoint.py (816 of 1726) PASS: lldb-Unit :: Utility/./UtilityTests/ConstStringTest.MangledCounterpart (817 of 1726) PASS: lldb-Suite :: commands/frame/diagnose/local-variable/TestLocalVariable.py (818 of 1726) PASS: lldb-Suite :: functionalities/data-formatter/compactvectors/TestCompactVectors.py (819 of 1726) PASS: lldb-Suite :: functionalities/data-formatter/var-in-aggregate-misuse/TestVarInAggregateMisuse.py (820 of 1726) PASS: lldb-Unit :: ScriptInterpreter/Python/./ScriptInterpreterPythonTests/PythonDataObjectsTest.TestPythonIntegerToStr (821 of 1726) PASS: lldb-Unit :: Utility/./UtilityTests/ArgsTest.StringListConstructor (822 of 1726) PASS: lldb-Unit :: Utility/./UtilityTests/ReproducerTest.SetCapture (823 of 1726) PASS: lldb-Unit :: Process/gdb-remote/./ProcessGdbRemoteTests/GDBRemoteCommunicationClientTest.GetModulesInfoInvalidResponse (824 of 1726) PASS: lldb-Suite :: lang/objcxx/cxx-bridged-po/TestObjCXXBridgedPO.py (825 of 1726) UNSUPPORTED: LLDB :: Register/x86-64-ymm16-read.test (826 of 1726) PASS: lldb-Suite :: functionalities/data-formatter/summary-string-onfail/Test-rdar-9974002.py (827 of 1726) PASS: lldb-Suite :: functionalities/inferior-changed/TestInferiorChanged.py (828 of 1726) PASS: lldb-Unit :: Utility/./UtilityTests/AnsiTerminal.KnownPrefix (829 of 1726) UNSUPPORTED: LLDB :: ExecControl/StopHook/stop-hook-threads.test (830 of 1726) PASS: LLDB :: SymbolFile/DWARF/childless-compile-unit.s (831 of 1726) PASS: lldb-Unit :: Utility/./UtilityTests/BinaryStreamTest.PutSLEB128ThreeBytes (832 of 1726) PASS: lldb-Suite :: commands/expression/import-std-module/forward_list-basic/TestBasicForwardList.py (833 of 1726) PASS: lldb-Suite :: functionalities/memory-region/TestMemoryRegion.py (834 of 1726) PASS: lldb-Suite :: functionalities/breakpoint/breakpoint_locations/TestBreakpointLocations.py (835 of 1726) PASS: lldb-Suite :: python_api/sbtype_typeclass/TestSBTypeTypeClass.py (836 of 1726) PASS: lldb-Suite :: python_api/module_section/TestModuleAndSection.py (837 of 1726) PASS: LLDB :: SymbolFile/DWARF/dir-separator-no-comp-dir-relative-name.s (838 of 1726) PASS: lldb-Suite :: lang/c/unicode/TestUnicodeSymbols.py (839 of 1726) PASS: lldb-Suite :: functionalities/thread/multi_break/TestMultipleBreakpoints.py (840 of 1726) PASS: lldb-Unit :: Utility/./UtilityTests/RangeTest.NotEqual (841 of 1726) PASS: lldb-Unit :: Target/./TargetTests/MemoryRegionInfoTest.Formatv (842 of 1726) PASS: lldb-Unit :: Utility/./UtilityTests/StringListTest.CopyListEmpty (843 of 1726) PASS: lldb-Unit :: Utility/./UtilityTests/StringExtractorTest.GetNameColonValueNoSemicolon (844 of 1726) PASS: lldb-Unit :: UnwindAssembly/x86/./UnwindAssemblyx86Tests/Testx86AssemblyInspectionEngine.TestPushRBP (845 of 1726) PASS: LLDB :: Driver/TestProcessAttach.test (846 of 1726) PASS: lldb-Suite :: functionalities/thread/concurrent_events/TestConcurrentCrashWithSignal.py (847 of 1726) PASS: lldb-Suite :: functionalities/unwind/standard/TestStandardUnwind.py (848 of 1726) PASS: lldb-Suite :: functionalities/tail_call_frames/thread_step_out_or_return/TestSteppingOutWithArtificialFrames.py (849 of 1726) PASS: lldb-Unit :: Utility/./UtilityTests/BinaryStreamTest.PutSLEB128Zero (850 of 1726) FAIL: lldb-Suite :: functionalities/gdb_remote_client/TestThreadSelectionBug.py (851 of 1726) ******************** TEST 'lldb-Suite :: functionalities/gdb_remote_client/TestThreadSelectionBug.py' FAILED ******************** lldb version 10.0.99 (http://labmaster3.local/git/llvm-project.git revision 66e9f239b5b3b4367eef580696b4e695164f164a) clang revision 1bd58870e5bd715c7bcbd1180bd50c4f4c7663ff llvm revision 1bd58870e5bd715c7bcbd1180bd50c4f4c7663ff LLDB library dir: /Users/buildslave/jenkins/workspace/lldb-cmake-sanitized/lldb-build/bin LLDB import library dir: /Users/buildslave/jenkins/workspace/lldb-cmake-sanitized/lldb-build/bin libstdcxx tests will not be run because: Don't know how to build with libstdcxx on macosx Skipping following debug info categories: ['dwo']

Hide Details

Session logs for test failures/errors/unexpected successes will go into directory '/Users/buildslave/jenkins/workspace/lldb-cmake-sanitized/test/logs' Command invoked: /Users/buildslave/jenkins/workspace/lldb-cmake-sanitized/llvm-project/lldb/test/dotest.py --arch=x86_64 -s /Users/buildslave/jenkins/workspace/lldb-cmake-sanitized/lldb-build/lldb-test-traces -S nm -u CXXFLAGS -u CFLAGS --executable /Users/buildslave/jenkins/workspace/lldb-cmake-sanitized/lldb-build/./bin/lldb --dsymutil /Users/buildslave/jenkins/workspace/lldb-cmake-sanitized/lldb-build/./bin/dsymutil --filecheck /Users/buildslave/jenkins/workspace/lldb-cmake-sanitized/lldb-build/./bin/FileCheck -C /Users/buildslave/jenkins/workspace/lldb-cmake-sanitized/host-compiler/bin/clang --codesign-identity lldb_codesign --server /Users/buildslave/jenkins/workspace/lldb-cmake-sanitized/lldb-build/./bin/debugserver --arch x86_64 --build-dir /Users/buildslave/jenkins/workspace/lldb-cmake-sanitized/lldb-build/lldb-test-build.noindex -s=/Users/buildslave/jenkins/workspace/lldb-cmake-sanitized/test/logs -t --env TERM=vt100 --env LLVM_LIBS_DIR=/Users/buildslave/jenkins/workspace/lldb-cmake-sanitized/lldb-build/./lib --build-dir /Users/buildslave/jenkins/workspace/lldb-cmake-sanitized/lldb-build/tools/lldb/lldb-test-build.noindex --module-cache-dir /Users/buildslave/jenkins/workspace/lldb-cmake-sanitized/lldb-build/tools/lldb/lldb-test-build.noindex/module-cache-lldb /Users/buildslave/jenkins/workspace/lldb-cmake-sanitized/llvm-project/lldb/packages/Python/lldbsuite/test/functionalities/gdb_remote_client -p TestThreadSelectionBug.py Change dir to: /Users/buildslave/jenkins/workspace/lldb-cmake-sanitized/llvm-project/lldb/packages/Python/lldbsuite/test/functionalities/gdb_remote_client runCmd: settings set symbols.enable-external-lookup false output:

Hide Details

runCmd: settings set plugin.process.gdb-remote.packet-timeout 60 output:

Hide Details

runCmd: settings set symbols.clang-modules-cache-path "/Users/buildslave/jenkins/workspace/lldb-cmake-sanitized/lldb-build/tools/lldb/lldb-test-build.noindex/module-cache-lldb" output:

Hide Details

runCmd: settings set use-color false output:

Hide Details

FAIL: LLDB (/Users/buildslave/jenkins/workspace/lldb-cmake-sanitized/host-compiler/bin/clang-10-x86_64) :: test (TestThreadSelectionBug.TestThreadSelectionBug) <bound method SBProcess.Kill of <lldb.SBProcess; proxy of <Swig Object of type 'lldb::SBProcess *' at 0x10f18d960> >>: success

Hide Details

Restore dir to: /Users/buildslave/jenkins/workspace/lldb-cmake-sanitized/lldb-build/tools/lldb/lit ====================================================================== FAIL: test (TestThreadSelectionBug.TestThreadSelectionBug) ---------------------------------------------------------------------- Traceback (most recent call last): File "/Users/buildslave/jenkins/workspace/lldb-cmake-sanitized/llvm-project/lldb/packages/Python/lldbsuite/test/functionalities/gdb_remote_client/TestThreadSelectionBug.py", line 17, in test process = self.connect(target) File "/Users/buildslave/jenkins/workspace/lldb-cmake-sanitized/llvm-project/lldb/packages/Python/lldbsuite/test/functionalities/gdb_remote_client/gdbclientutils.py", line 479, in connect self.assertTrue(error.Success(), error.description) AssertionError: False is not True : failed to get reply to handshake packet Config=x86_64-/Users/buildslave/jenkins/workspace/lldb-cmake-sanitized/host-compiler/bin/clang-10 ---------------------------------------------------------------------- Ran 1 test in 62.795s

Hide Details

RESULT: FAILED (0 passes, 1 failures, 0 errors, 0 skipped, 0 expected failures, 0 unexpected successes)

Hide Details

******************** PASS: LLDB :: Modules/Breakpad/uuid-matching-mac.test (852 of 1726) PASS: lldb-Unit :: Utility/./UtilityTests/StringExtractorTest.DecodeHexU8_InvalidHex (853 of 1726) PASS: lldb-Suite :: functionalities/data-formatter/data-formatter-stl/libstdcpp/map/TestDataFormatterStdMap.py (854 of 1726) PASS: lldb-Unit :: Host/./HostTests/NativeProcessProtocolTest.SetBreakpoint (855 of 1726) PASS: lldb-Suite :: functionalities/data-formatter/data-formatter-objc/TestDataFormatterObjCNSDate.py (856 of 1726) PASS: lldb-Suite :: functionalities/darwin_log/filter/regex/activity/TestDarwinLogFilterRegexActivity.py (857 of 1726) PASS: LLDB :: Modules/Breakpad/sections.test (858 of 1726) PASS: lldb-Unit :: Utility/./UtilityTests/UUIDTest.SetFromStringRef (859 of 1726) PASS: lldb-Suite :: functionalities/process_save_core/TestProcessSaveCore.py (860 of 1726) PASS: lldb-Suite :: python_api/event/TestEvents.py (861 of 1726) PASS: lldb-Unit :: Utility/./UtilityTests/ListenerTest.GetEventWait (862 of 1726) PASS: lldb-Unit :: Utility/./UtilityTests/RegularExpression.Match (863 of 1726) PASS: lldb-Unit :: Utility/./UtilityTests/StringListTest.GetMaxStringLengthDecreasingSize (864 of 1726) PASS: lldb-Unit :: Utility/./UtilityTests/ScalarTest.Promotion (865 of 1726) PASS: lldb-Unit :: Utility/./UtilityTests/RangeTest.LessThanInvalid (866 of 1726) PASS: lldb-Suite :: functionalities/gdb_remote_client/TestWriteMemory.py (867 of 1726) PASS: lldb-Unit :: Process/minidump/./LLDBMinidumpTests/MinidumpParserTest.GetThreadContext_x86_64 (868 of 1726) PASS: lldb-Suite :: lang/objc/radar-9691614/TestObjCMethodReturningBOOL.py (869 of 1726) PASS: lldb-Unit :: Utility/./UtilityTests/ConstStringTest.FromMidOfBufferStringRef (870 of 1726) PASS: lldb-Unit :: Utility/./UtilityTests/FileSpecTest.IsRelative (871 of 1726) PASS: lldb-Suite :: functionalities/data-formatter/nsarraysynth/TestNSArraySynthetic.py (872 of 1726) PASS: lldb-Unit :: Process/gdb-remote/./ProcessGdbRemoteTests/GDBRemoteCommunicationTest.ReadPacket_checksum (873 of 1726) PASS: lldb-Unit :: Utility/./UtilityTests/ArchSpecTest.OperatorBool (874 of 1726) PASS: lldb-Suite :: functionalities/data-formatter/nssetsynth/TestNSSetSynthetic.py (875 of 1726) PASS: lldb-Suite :: functionalities/darwin_log/filter/exact_match/message/TestDarwinLogFilterMatchMessage.py (876 of 1726) PASS: lldb-Suite :: python_api/value/change_values/TestChangeValueAPI.py (877 of 1726) PASS: lldb-Suite :: lang/objc/ptr_refs/TestPtrRefsObjC.py (878 of 1726) PASS: lldb-Unit :: Utility/./UtilityTests/StringExtractorTest.GetHexU8_InvalidHex_NoEof (879 of 1726) PASS: lldb-Unit :: Utility/./UtilityTests/RegularExpression.Invalid (880 of 1726) PASS: lldb-Unit :: Utility/./UtilityTests/BinaryStreamTest.PutULEB128TwoBytes (881 of 1726) PASS: lldb-Unit :: Host/./HostTests/MainLoopTest.TerminatesImmediately (882 of 1726) PASS: lldb-Unit :: Utility/./UtilityTests/UUIDTest.StringConverion (883 of 1726) PASS: lldb-Suite :: functionalities/data-formatter/data-formatter-script/TestDataFormatterScript.py (884 of 1726) PASS: lldb-Unit :: Language/Highlighting/./HighlighterTests/HighlighterTest.ClangPPDirectives (885 of 1726) PASS: lldb-Unit :: Process/minidump/./LLDBMinidumpTests/MinidumpParserTest.GetPidWindows (886 of 1726) PASS: lldb-Suite :: commands/expression/context-object-objc/TestContextObjectObjc.py (887 of 1726) PASS: lldb-Suite :: macosx/nslog/TestDarwinNSLogOutput.py (888 of 1726) PASS: lldb-Unit :: Utility/./UtilityTests/StreamTest.PutHex8 (889 of 1726) PASS: lldb-Suite :: functionalities/breakpoint/objc/TestObjCBreakpoints.py (890 of 1726) PASS: lldb-Unit :: Host/./HostTests/FileSystemTest.GetByteSize (891 of 1726) PASS: lldb-Unit :: Utility/./UtilityTests/RangeTest.ContainsRangeStartingFromZero (892 of 1726) PASS: lldb-Suite :: commands/log/invalid-args/TestInvalidArgsLog.py (893 of 1726) PASS: lldb-Suite :: lang/cpp/modules-import/TestCXXModulesImport.py (894 of 1726) PASS: lldb-Unit :: Host/./HostTests/ProcessLaunchInfoTest.Constructor (895 of 1726) PASS: lldb-Suite :: linux/builtin_trap/TestBuiltinTrap.py (896 of 1726) PASS: lldb-Suite :: functionalities/data-formatter/vector-types/TestVectorTypesFormatting.py (897 of 1726) PASS: lldb-Unit :: Utility/./UtilityTests/StreamTeeTest.Write (898 of 1726) PASS: lldb-Suite :: functionalities/inferior-assert/TestInferiorAssert.py (899 of 1726) PASS: lldb-Unit :: Host/./HostTests/HostInfoTest.GetAugmentedArchSpec (900 of 1726) PASS: lldb-Unit :: Utility/./UtilityTests/StreamTest.PutMaxHex64ByteOrderLittle (901 of 1726) PASS: lldb-Unit :: Utility/./UtilityTests/BinaryStreamTest.PutULEB128OneByte (902 of 1726) PASS: lldb-Unit :: Utility/./UtilityTests/OptionsWithRawTest.EmptyArgsOnlySuffix (903 of 1726) PASS: lldb-Suite :: functionalities/step-avoids-no-debug/TestStepNoDebug.py (904 of 1726) PASS: lldb-Unit :: Utility/./UtilityTests/FileSpecTest.PrependPathComponent (905 of 1726) PASS: lldb-Suite :: lang/c/shared_lib/TestSharedLib.py (906 of 1726) PASS: lldb-Unit :: Language/Highlighting/./HighlighterTests/HighlighterTest.ClangCursorPosEndOfLine (907 of 1726) UNSUPPORTED: LLDB :: Register/x86-gp-write.test (908 of 1726) PASS: lldb-Suite :: lang/c/array_types/TestArrayTypes.py (909 of 1726) PASS: lldb-Unit :: Host/./HostTests/Host.WaitStatusFormat (910 of 1726) PASS: lldb-Unit :: Utility/./UtilityTests/DataExtractorTest.GetBitfield (911 of 1726) PASS: lldb-Suite :: commands/target/stop-hooks/TestStopHooks.py (912 of 1726) PASS: lldb-Unit :: Utility/./UtilityTests/VMRange.CollectionContains (913 of 1726) PASS: lldb-Unit :: Core/./LLDBCoreTests/MangledTest.ResultForValidName (914 of 1726) PASS: lldb-Unit :: Utility/./UtilityTests/StringListTest.GetSize (915 of 1726) PASS: lldb-Unit :: Utility/./UtilityTests/Flags.AnyClear (916 of 1726) PASS: lldb-Unit :: Utility/./UtilityTests/LogChannelEnabledTest.LogGetLogThread (917 of 1726) PASS: lldb-Suite :: commands/log/basic/TestLogging.py (918 of 1726) PASS: lldb-Suite :: lang/cpp/dynamic-value-same-basename/TestDynamicValueSameBase.py (919 of 1726) PASS: lldb-Unit :: Utility/./UtilityTests/LogChannelTest.List (920 of 1726) PASS: lldb-Suite :: functionalities/thread/concurrent_events/TestConcurrentManyWatchpoints.py (921 of 1726) PASS: lldb-Unit :: UnwindAssembly/x86/./UnwindAssemblyx86Tests/Testx86AssemblyInspectionEngine.TestDisassemblyJunkBytes (922 of 1726) PASS: lldb-Suite :: python_api/thread/TestThreadAPI.py (923 of 1726) PASS: lldb-Suite :: types/TestIntegerTypesExpr.py (924 of 1726) PASS: lldb-Unit :: Utility/./UtilityTests/OptionsWithRawTest.EmptySuffixSingleWhitespace (925 of 1726) PASS: LLDB :: Modules/ELF/PT_LOAD-overlap-PT_TLS.yaml (926 of 1726) PASS: lldb-Unit :: Utility/./UtilityTests/DataExtractorTest.GetMaxS64 (927 of 1726) PASS: LLDB :: SymbolFile/DWARF/debug_loc.s (928 of 1726) PASS: lldb-Unit :: Process/gdb-remote/./ProcessGdbRemoteTests/GDBRemoteCommunicationClientTest.SendGetTraceConfigPacket (929 of 1726) PASS: LLDB :: Reproducer/Functionalities/TestStepping.test (930 of 1726) PASS: lldb-Suite :: linux/add-symbols/TestTargetSymbolsAddCommand.py (931 of 1726) PASS: lldb-Unit :: Utility/./UtilityTests/StreamTest.ShiftOperatorStrings (932 of 1726) PASS: lldb-Unit :: Utility/./UtilityTests/StringExtractorTest.GetHexU8_Exact_NoEof (933 of 1726) PASS: lldb-Unit :: Utility/./UtilityTests/StringExtractorTest.DecodeHexU8_Exact (934 of 1726) PASS: lldb-Unit :: UnwindAssembly/x86/./UnwindAssemblyx86Tests/Testx86AssemblyInspectionEngine.TestPushEBX (935 of 1726) PASS: lldb-Unit :: UnwindAssembly/x86/./UnwindAssemblyx86Tests/Testx86AssemblyInspectionEngine.TestStackRealign8BitDisp_i386 (936 of 1726) PASS: lldb-Suite :: commands/watchpoints/variable_out_of_scope/TestWatchedVarHitWhenInScope.py (937 of 1726) PASS: lldb-Unit :: Utility/./UtilityTests/StringListTest.PopBack (938 of 1726) PASS: lldb-Suite :: functionalities/thread/concurrent_events/TestConcurrentManyCrash.py (939 of 1726) PASS: lldb-Suite :: python_api/process/TestProcessAPI.py (940 of 1726) PASS: lldb-Unit :: Utility/./UtilityTests/StringExtractorTest.DecodeHexU8_Extra (941 of 1726) PASS: LLDB :: SymbolFile/DWARF/dwarf5_locations.s (942 of 1726) PASS: lldb-Suite :: lang/cpp/static_members/TestCPPStaticMembers.py (943 of 1726) PASS: lldb-Suite :: functionalities/tail_call_frames/disambiguate_call_site/TestDisambiguateCallSite.py (944 of 1726) UNSUPPORTED: LLDB :: SymbolFile/NativePDB/ast-functions-msvc.cpp (945 of 1726) PASS: lldb-Unit :: Language/Highlighting/./HighlighterTests/HighlighterTest.HighlighterSelectionPath (946 of 1726) PASS: lldb-Suite :: functionalities/breakpoint/dummy_target_breakpoints/TestBreakpointsWithNoTargets.py (947 of 1726) PASS: lldb-Suite :: lang/c/local_types/TestUseClosestType.py (948 of 1726) PASS: lldb-Unit :: Symbol/./SymbolTests/TestClangASTContext.TemplateArguments (949 of 1726) PASS: lldb-Unit :: Utility/./UtilityTests/ArgsTest.TestAppendArg (950 of 1726) PASS: LLDB :: SymbolFile/DWARF/find-basic-function.cpp (951 of 1726) PASS: lldb-Suite :: lang/objc/modules-auto-import/TestModulesAutoImport.py (952 of 1726) PASS: lldb-Suite :: commands/expression/import-std-module/weak_ptr/TestWeakPtr.py (953 of 1726) PASS: lldb-Suite :: commands/frame/diagnose/inheritance/TestDiagnoseInheritance.py (954 of 1726) PASS: lldb-Suite :: functionalities/thread/backtrace_limit/TestBacktraceLimit.py (955 of 1726) PASS: lldb-Suite :: functionalities/conditional_break/TestConditionalBreak.py (956 of 1726) PASS: lldb-Suite :: api/log/TestAPILog.py (957 of 1726) PASS: lldb-Unit :: Utility/./UtilityTests/BinaryStreamTest.PutULEB128SevenBytes (958 of 1726) PASS: lldb-Suite :: commands/apropos/basic/TestApropos.py (959 of 1726) PASS: lldb-Suite :: functionalities/breakpoint/step_over_breakpoint/TestStepOverBreakpoint.py (960 of 1726) PASS: LLDB :: Breakpoint/implicit_const_form_support.test (961 of 1726) PASS: LLDB :: SymbolFile/DWARF/debug-types-dwo-cross-reference.cpp (962 of 1726) PASS: lldb-Unit :: Utility/./UtilityTests/RangeTest.Union (963 of 1726) PASS: lldb-Unit :: Process/minidump/./LLDBMinidumpTests/MinidumpParserTest.GetMiscInfo_no_stream (964 of 1726) PASS: lldb-Suite :: functionalities/thread/concurrent_events/TestConcurrentSignalWatchBreak.py (965 of 1726) PASS: lldb-Unit :: Core/./LLDBCoreTests/RichManglingContextTest.FromCxxMethodName (966 of 1726) PASS: lldb-Unit :: ScriptInterpreter/Python/./ScriptInterpreterPythonTests/PythonDataObjectsTest.TestPythonStringToStructuredString (967 of 1726) PASS: LLDB :: Quit/TestQuitExitCodeHex0.test (968 of 1726) PASS: lldb-Suite :: lang/cpp/unique-types/TestUniqueTypes.py (969 of 1726) PASS: lldb-Unit :: Utility/./UtilityTests/StringExtractorTest.GetHexBytes_OddPair (970 of 1726) PASS: lldb-Suite :: functionalities/data-formatter/data-formatter-categories/TestDataFormatterCategories.py (971 of 1726) PASS: lldb-Suite :: functionalities/inferior-crashing/recursive-inferior/TestRecursiveInferior.py (972 of 1726) PASS: lldb-Suite :: commands/expression/inline-namespace/TestInlineNamespace.py (973 of 1726) UNSUPPORTED: LLDB :: SymbolFile/PDB/expressions.test (974 of 1726) PASS: lldb-Unit :: Utility/./UtilityTests/ArgsTest.TestMultipleArgs (975 of 1726) PASS: lldb-Unit :: Host/./HostTests/FileSystemTest.MakeAbsolute (976 of 1726) PASS: lldb-Unit :: Utility/./UtilityTests/StreamTest.PutCharWhitespace (977 of 1726) PASS: lldb-Suite :: lang/objc/objc-property/TestObjCProperty.py (978 of 1726) PASS: LLDB :: Modules/MachO/lc_build_version.yaml (979 of 1726) PASS: lldb-Suite :: commands/expression/test/TestExprs2.py (980 of 1726) PASS: lldb-Suite :: python_api/value/empty_class/TestValueAPIEmptyClass.py (981 of 1726) PASS: lldb-Suite :: lang/cpp/lambdas/TestLambdas.py (982 of 1726) PASS: lldb-Suite :: functionalities/gdb_remote_client/TestRestartBug.py (983 of 1726) PASS: lldb-Suite :: functionalities/data-formatter/data-formatter-stl/libcxx/map/TestDataFormatterLibccMap.py (984 of 1726) PASS: lldb-Suite :: functionalities/data-formatter/data-formatter-objc/TestDataFormatterObjNSException.py (985 of 1726) UNSUPPORTED: LLDB :: SymbolFile/PDB/variables-locations.test (986 of 1726) PASS: lldb-Unit :: Host/./HostTests/TaskPoolTest.RunTasks (987 of 1726) PASS: LLDB :: Quit/TestQuitExitCode-30.test (988 of 1726) PASS: lldb-Suite :: benchmarks/expression/TestExpressionCmd.py (989 of 1726) PASS: lldb-Suite :: functionalities/archives/TestBSDArchives.py (990 of 1726) PASS: lldb-Unit :: Utility/./UtilityTests/StringListTest.JoinEmpty (991 of 1726) PASS: lldb-Suite :: lang/objc/rdar-11355592/TestRdar11355592.py (992 of 1726) PASS: lldb-Unit :: UnwindAssembly/x86/./UnwindAssemblyx86Tests/Testx86AssemblyInspectionEngine.TestPopEDI (993 of 1726) PASS: LLDB :: Commands/CommandScriptImmediateOutput/CommandScriptImmediateOutputFile.test (994 of 1726) PASS: lldb-Suite :: python_api/type/TestTypeList.py (995 of 1726) PASS: lldb-Unit :: Utility/./UtilityTests/RegularExpression.Valid (996 of 1726) PASS: lldb-Suite :: python_api/lldbutil/process/TestPrintStackTraces.py (997 of 1726) UNSUPPORTED: LLDB :: SymbolFile/PDB/compilands.test (998 of 1726) PASS: lldb-Unit :: Utility/./UtilityTests/StreamTest.ShiftOperatorInts (999 of 1726) PASS: lldb-Suite :: functionalities/load_using_paths/TestLoadUsingPaths.py (1000 of 1726) PASS: lldb-Unit :: Utility/./UtilityTests/OptionsWithRawTest.SingleWordSuffix (1001 of 1726) PASS: lldb-Unit :: Utility/./UtilityTests/Flags.Test (1002 of 1726) PASS: LLDB :: Settings/TestFrameFormatColor.test (1003 of 1726) PASS: LLDB :: Minidump/Windows/find-module.test (1004 of 1726) PASS: LLDB :: SymbolFile/NativePDB/break-by-function.cpp (1005 of 1726) PASS: lldb-Unit :: Utility/./UtilityTests/StringListTest.LongestCommonPrefixDuplicateElement (1006 of 1726) PASS: lldb-Suite :: arm/breakpoint-it/TestBreakpointIt.py (1007 of 1726) PASS: lldb-Unit :: Expression/./ExpressionTests/DiagnosticManagerTest.AppendMessageSubsequentDiags (1008 of 1726) PASS: lldb-Suite :: lang/cpp/symbols/TestSymbols.py (1009 of 1726) PASS: lldb-Suite :: commands/watchpoints/watchpoint_set_command/TestWatchLocationWithWatchSet.py (1010 of 1726) PASS: lldb-Unit :: Utility/./UtilityTests/RangeTest.ContainsEndInclusiveInvalid (1011 of 1726) PASS: LLDB :: SymbolFile/Breakpad/line-table-mixed-path-styles.test (1012 of 1726) PASS: LLDB :: Breakpoint/debug_rnglist_rlestartend.test (1013 of 1726) PASS: LLDB :: SymbolFile/DWARF/find-basic-variable.cpp (1014 of 1726) PASS: LLDB :: Settings/TestStopCommandSourceOnError.test (1015 of 1726) PASS: lldb-Unit :: Utility/./UtilityTests/ScalarTest.ExtractBitfield (1016 of 1726) UNSUPPORTED: LLDB :: SymbolFile/PDB/variables.test (1017 of 1726) PASS: lldb-Unit :: Utility/./UtilityTests/Flags.AllClear (1018 of 1726) PASS: lldb-Unit :: Utility/./UtilityTests/BinaryStreamTest.PutSLEB128NineBytes (1019 of 1726) PASS: lldb-Suite :: functionalities/data-formatter/data-formatter-stl/libcxx/multiset/TestDataFormatterLibcxxMultiSet.py (1020 of 1726) PASS: lldb-Unit :: Target/./TargetTests/PathMappingListTest.RelativeTests (1021 of 1726) PASS: lldb-Suite :: functionalities/var_path/TestVarPath.py (1022 of 1726) PASS: lldb-Suite :: functionalities/rerun/TestRerun.py (1023 of 1726) PASS: lldb-Unit :: Utility/./UtilityTests/Flags.AllSet (1024 of 1726) PASS: LLDB :: Quit/TestQuitExitCode0.test (1025 of 1726) PASS: lldb-Unit :: SymbolFile/NativePDB/./SymbolFileNativePDBTests/PDBFPOProgramToDWARFExpressionTests.UnresolvedDependentCyclicRegisterAssignmentReference (1026 of 1726) PASS: LLDB :: SymbolFile/DWARF/debug_ranges-missing-section.s (1027 of 1726) PASS: lldb-Unit :: Process/gdb-remote/./ProcessGdbRemoteTests/GDBRemoteClientBaseTest.SendContinueAndAsyncPacket (1028 of 1726) PASS: lldb-Suite :: python_api/function_symbol/TestSymbolAPI.py (1029 of 1726) PASS: lldb-Suite :: commands/expression/ir-interpreter-phi-nodes/TestIRInterpreterPHINodes.py (1030 of 1726) PASS: lldb-Suite :: lang/c/global_variables/TestGlobalVariables.py (1031 of 1726) PASS: LLDB :: SymbolFile/NativePDB/function-types-builtins.cpp (1032 of 1726) XFAIL: LLDB :: Unwind/prefer-debug-over-eh-frame.test (1033 of 1726) PASS: lldb-Unit :: UnwindAssembly/x86/./UnwindAssemblyx86Tests/Testx86AssemblyInspectionEngine.TestPopESI (1034 of 1726) PASS: lldb-Suite :: lang/objc/objc-new-syntax/TestObjCNewSyntaxLiteral.py (1035 of 1726) PASS: lldb-Suite :: functionalities/thread/concurrent_events/TestConcurrentBreakpointsDelayedBreakpointOneWatchpoint.py (1036 of 1726) PASS: lldb-Unit :: Process/gdb-remote/./ProcessGdbRemoteTests/GDBRemoteClientBaseTest.SendContinueAndInterrupt2PacketBug (1037 of 1726) PASS: lldb-Suite :: types/TestFloatTypesExpr.py (1038 of 1726) XFAIL: LLDB :: Register/x86-64-ymm-write.test (1039 of 1726) PASS: lldb-Suite :: commands/watchpoints/multi_watchpoint_slots/TestWatchpointMultipleSlots.py (1040 of 1726) PASS: lldb-Unit :: ScriptInterpreter/Python/./ScriptInterpreterPythonTests/PythonDataObjectsTest.TestDictionaryResolutionWithDot (1041 of 1726) PASS: LLDB :: Settings/TestSettingsWrite.test (1042 of 1726) PASS: lldb-Unit :: Utility/./UtilityTests/StringLexerTest.GetUnlexed (1043 of 1726) PASS: lldb-Unit :: SymbolFile/DWARF/./SymbolFileDWARFTests/SymbolFileDWARFTests.TestAbbrevOutOfOrder (1044 of 1726) PASS: lldb-Suite :: commands/expression/fixits/TestFixIts.py (1045 of 1726) PASS: LLDB :: Modules/ELF/PT_TLS-overlap-PT_LOAD.yaml (1046 of 1726) PASS: lldb-Suite :: functionalities/target-new-solib-notifications/TestModuleLoadedNotifys.py (1047 of 1726) PASS: lldb-Suite :: lang/c/conflicting-symbol/TestConflictingSymbol.py (1048 of 1726) PASS: lldb-Unit :: Utility/./UtilityTests/StringListTest.SplitIntoLinesEmpty (1049 of 1726) XFAIL: LLDB :: Register/x86-mm-xmm-read.test (1050 of 1726) PASS: lldb-Suite :: commands/expression/scoped_enums/TestScopedEnumType.py (1051 of 1726) PASS: lldb-Unit :: ScriptInterpreter/Python/./ScriptInterpreterPythonTests/PythonDataObjectsTest.TestPythonDictionaryToStructuredDictionary (1052 of 1726) PASS: lldb-Suite :: lang/c/forward/TestForwardDeclaration.py (1053 of 1726) PASS: lldb-Unit :: UnwindAssembly/x86/./UnwindAssemblyx86Tests/Testx86AssemblyInspectionEngine.TestPopR12 (1054 of 1726) PASS: lldb-Suite :: functionalities/tsan/basic/TestTsanBasic.py (1055 of 1726) PASS: lldb-Suite :: functionalities/postmortem/elf-core/gcore/TestGCore.py (1056 of 1726) PASS: lldb-Unit :: Utility/./UtilityTests/StringListTest.Assignment (1057 of 1726) PASS: lldb-Unit :: debugserver/./debugserverTests/RNBSocket.LoopBackListenIPv6 (1058 of 1726) PASS: lldb-Suite :: commands/disassemble/basic/TestFrameDisassemble.py (1059 of 1726) PASS: lldb-Suite :: functionalities/longjmp/TestLongjmp.py (1060 of 1726) PASS: lldb-Unit :: ScriptInterpreter/Python/./ScriptInterpreterPythonTests/PythonDataObjectsTest.TestObjectAttributes (1061 of 1726) PASS: lldb-Unit :: Utility/./UtilityTests/UriParserTest.MinimalPortPath (1062 of 1726) PASS: lldb-Suite :: lang/objcxx/objcxx-ivar-vector/TestIvarVector.py (1063 of 1726) PASS: lldb-Suite :: functionalities/data-formatter/poarray/TestPrintObjectArray.py (1064 of 1726) PASS: lldb-Suite :: functionalities/data-formatter/type_summary_list_arg/TestTypeSummaryListArg.py (1065 of 1726) PASS: lldb-Unit :: Utility/./UtilityTests/RangeTest.ContainsEndInclusive (1066 of 1726) PASS: lldb-Suite :: python_api/formatters/TestFormattersSBAPI.py (1067 of 1726) PASS: lldb-Unit :: UnwindAssembly/x86/./UnwindAssemblyx86Tests/Testx86AssemblyInspectionEngine.TestPushR13 (1068 of 1726) PASS: lldb-Suite :: functionalities/breakpoint/breakpoint_ignore_count/TestBreakpointIgnoreCount.py (1069 of 1726) PASS: lldb-Suite :: functionalities/thread/concurrent_events/TestConcurrentTwoBreakpointsOneWatchpoint.py (1070 of 1726) PASS: lldb-Unit :: Utility/./UtilityTests/SerializationRountripTest.SerializeDeserializePodReferences (1071 of 1726) PASS: lldb-Suite :: functionalities/data-formatter/data-formatter-objc/nsindexpath/TestDataFormatterNSIndexPath.py (1072 of 1726) PASS: lldb-Suite :: macosx/safe-to-func-call/TestSafeFuncCalls.py (1073 of 1726) PASS: lldb-Unit :: Utility/./UtilityTests/OptionsWithRawTest.QuotedSuffix (1074 of 1726) PASS: lldb-Suite :: functionalities/darwin_log/filter/regex/message/TestDarwinLogFilterRegexMessage.py (1075 of 1726) PASS: lldb-Suite :: commands/expression/call-function/TestCallStdStringFunction.py (1076 of 1726) PASS: lldb-Unit :: Utility/./UtilityTests/StructuredDataTest.StringDump (1077 of 1726) PASS: lldb-Suite :: commands/expression/call-restarts/TestCallThatRestarts.py (1078 of 1726) PASS: lldb-Suite :: macosx/universal/TestUniversal.py (1079 of 1726) PASS: lldb-Unit :: Utility/./UtilityTests/TimeoutTest.Format (1080 of 1726) PASS: lldb-Suite :: commands/expression/rdar42038760/TestScalarURem.py (1081 of 1726) PASS: lldb-Suite :: functionalities/breakpoint/breakpoint_command/TestBreakpointCommandsFromPython.py (1082 of 1726) PASS: lldb-Unit :: Utility/./UtilityTests/StringExtractorTest.GetHexBytesAvail_FullString (1083 of 1726) PASS: lldb-Suite :: functionalities/data-formatter/data-formatter-objc/TestDataFormatterObjCNSContainer.py (1084 of 1726) PASS: lldb-Suite :: lang/cpp/virtual/TestVirtual.py (1085 of 1726) PASS: lldb-Unit :: Utility/./UtilityTests/StreamTeeTest.AppendStream (1086 of 1726) PASS: lldb-Suite :: lang/objc/objc-super/TestObjCSuper.py (1087 of 1726) PASS: lldb-Unit :: SymbolFile/NativePDB/./SymbolFileNativePDBTests/PDBFPOProgramToDWARFExpressionTests.InvalidOpBinary (1088 of 1726) PASS: lldb-Unit :: Utility/./UtilityTests/BinaryStreamTest.PutSLEB128One (1089 of 1726) PASS: lldb-Suite :: functionalities/fat_archives/TestFatArchives.py (1090 of 1726) PASS: lldb-Unit :: Process/minidump/./LLDBMinidumpTests/MinidumpParserTest.MinidumpDuplicateModuleMinAddress (1091 of 1726) PASS: lldb-Suite :: lang/cpp/std-function-step-into-callable/TestStdFunctionStepIntoCallable.py (1092 of 1726) PASS: lldb-Suite :: api/listeners/TestListener.py (1093 of 1726) PASS: lldb-Unit :: Symbol/./SymbolTests/Type.CompilerContextPattern (1094 of 1726) PASS: lldb-Suite :: functionalities/postmortem/minidump-new/TestMiniDumpNew.py (1095 of 1726) PASS: lldb-Unit :: Utility/./UtilityTests/StreamTest.PutChar (1096 of 1726) PASS: LLDB :: Modules/MachO/lc_version_min.yaml (1097 of 1726) UNSUPPORTED: LLDB :: Unwind/unwind-plan-dwarf-dump.test (1098 of 1726) PASS: lldb-Unit :: Utility/./UtilityTests/BinaryStreamTest.PutSLEB128OneByte (1099 of 1726) PASS: lldb-Unit :: Utility/./UtilityTests/OptionsWithRawTest.WhitespaceInput (1100 of 1726) PASS: lldb-Unit :: Target/./TargetTests/ExecutionContextTest.GetByteOrder (1101 of 1726) PASS: lldb-Suite :: python_api/sbvalue_persist/TestSBValuePersist.py (1102 of 1726) PASS: lldb-Suite :: commands/watchpoints/watchpoint_size/TestWatchpointSizes.py (1103 of 1726) PASS: lldb-Unit :: ScriptInterpreter/Python/./ScriptInterpreterPythonTests/PythonDataObjectsTest.TestPythonCallableCheck (1104 of 1726) PASS: lldb-Suite :: lang/c/stepping/TestStepAndBreakpoints.py (1105 of 1726) PASS: lldb-Unit :: Utility/./UtilityTests/StreamTest.PutBytesAsRawHex8ToLittleEndian (1106 of 1726) PASS: lldb-Unit :: Utility/./UtilityTests/BinaryStreamTest.PutULEB128MaxValue (1107 of 1726) PASS: lldb-Suite :: functionalities/thread/concurrent_events/TestConcurrentCrashWithBreak.py (1108 of 1726) PASS: lldb-Suite :: functionalities/avoids-fd-leak/TestFdLeak.py (1109 of 1726) PASS: lldb-Suite :: commands/expression/calculator_mode/TestCalculatorMode.py (1110 of 1726) PASS: lldb-Suite :: tools/lldb-server/TestGdbRemoteExpeditedRegisters.py (1111 of 1726) PASS: lldb-Suite :: tools/lldb-server/signal-filtering/TestGdbRemote_QPassSignals.py (1112 of 1726) PASS: LLDB :: Quit/TestQuitExitCodeHexA.test (1113 of 1726) PASS: lldb-Unit :: Utility/./UtilityTests/AnsiTerminal.Incomplete (1114 of 1726) PASS: lldb-Suite :: functionalities/inline-stepping/TestInlineStepping.py (1115 of 1726) PASS: lldb-Unit :: Process/minidump/./LLDBMinidumpTests/MinidumpParserTest.GetLinuxProcStatus_no_stream (1116 of 1726) PASS: lldb-Suite :: functionalities/thread/concurrent_events/TestConcurrentCrashWithWatchpointBreakpointSignal.py (1117 of 1726) PASS: LLDB :: Breakpoint/case-sensitive.test (1118 of 1726) PASS: lldb-Unit :: UnwindAssembly/x86/./UnwindAssemblyx86Tests/Testx86AssemblyInspectionEngine.TestPushExtended (1119 of 1726) PASS: lldb-Unit :: Utility/./UtilityTests/ArchSpecTest.TestParseMachCPUDashSubtypeTripleSimple (1120 of 1726) PASS: lldb-Unit :: Process/minidump/./LLDBMinidumpTests/MinidumpParserTest.GetLinuxProcStatus (1121 of 1726) PASS: lldb-Unit :: Core/./LLDBCoreTests/StreamCallbackTest.Callback (1122 of 1726) PASS: lldb-Unit :: Process/minidump/./LLDBMinidumpTests/MinidumpParserTest.GetFilteredModuleList (1123 of 1726) PASS: lldb-Unit :: Utility/./UtilityTests/StreamTest.PutCharNull (1124 of 1726) PASS: lldb-Suite :: lang/cpp/gmodules-templates/TestGModules.py (1125 of 1726) PASS: lldb-Unit :: Utility/./UtilityTests/StringListTest.RemoveBlankLines (1126 of 1726) PASS: lldb-Suite :: functionalities/stats_api/TestStatisticsAPI.py (1127 of 1726) PASS: LLDB :: Modules/ELF/PT_LOAD-overlap.yaml (1128 of 1726) PASS: LLDB :: Modules/ELF/short-build-id.yaml (1129 of 1726) PASS: lldb-Unit :: Process/minidump/./LLDBMinidumpTests/MinidumpParserTest.GetMemoryRegionInfoFromMemory64List (1130 of 1726) PASS: lldb-Suite :: source-manager/TestSourceManager.py (1131 of 1726) PASS: LLDB :: Commands/CommandScriptImmediateOutput/CommandScriptImmediateOutputConsole.test (1132 of 1726) PASS: lldb-Suite :: functionalities/thread/exit_during_step/TestExitDuringStep.py (1133 of 1726) PASS: lldb-Suite :: functionalities/data-formatter/pyobjsynthprovider/TestPyObjSynthProvider.py (1134 of 1726) PASS: lldb-Unit :: ScriptInterpreter/Python/./ScriptInterpreterPythonTests/PythonDataObjectsTest.TestResetting (1135 of 1726) PASS: lldb-Unit :: Host/./HostTests/SocketTest.UDPGetConnectURI (1136 of 1726) PASS: lldb-Suite :: commands/expression/import-std-module/deque-dbg-info-content/TestDbgInfoContentDeque.py (1137 of 1726) PASS: lldb-Unit :: Process/gdb-remote/./ProcessGdbRemoteTests/GDBRemoteCommunicationClientTest.SendStartTracePacket (1138 of 1726) PASS: lldb-Suite :: functionalities/darwin_log/basic/TestDarwinLogBasic.py (1139 of 1726) PASS: lldb-Unit :: Process/gdb-remote/./ProcessGdbRemoteTests/GDBRemoteCommunicationClientTest.GetMemoryRegionInfo (1140 of 1726) PASS: lldb-Suite :: tools/lldb-vscode/stackTrace/TestVSCode_stackTrace.py (1141 of 1726) PASS: lldb-Unit :: Utility/./UtilityTests/CompletionRequest.TestCompletionOwnership (1142 of 1726) PASS: lldb-Suite :: functionalities/data-formatter/data-formatter-synthtype/TestDataFormatterSynthType.py (1143 of 1726) PASS: LLDB :: Driver/TestConvenienceVariables.test (1144 of 1726) PASS: lldb-Suite :: lang/cpp/function-template-parameter-pack/TestFunctionTemplateParameterPack.py (1145 of 1726) PASS: LLDB :: SymbolFile/NativePDB/globals-bss.cpp (1146 of 1726) PASS: lldb-Unit :: Process/gdb-remote/./ProcessGdbRemoteTests/GDBRemoteCommunicationClientTest.SyncThreadState (1147 of 1726) PASS: lldb-Suite :: lang/c/step-target/TestStepTarget.py (1148 of 1726) PASS: lldb-Unit :: Utility/./UtilityTests/BroadcasterTest.EventTypeHasListeners (1149 of 1726) PASS: lldb-Suite :: functionalities/data-formatter/data-formatter-globals/TestDataFormatterGlobals.py (1150 of 1726) PASS: lldb-Unit :: Utility/./UtilityTests/GeneratorTest.Get (1151 of 1726) PASS: lldb-Unit :: UnwindAssembly/x86/./UnwindAssemblyx86Tests/Testx86AssemblyInspectionEngine.TestReturnDetect (1152 of 1726) PASS: lldb-Suite :: functionalities/tail_call_frames/disambiguate_paths_to_common_sink/TestDisambiguatePathsToCommonSink.py (1153 of 1726) PASS: LLDB :: Settings/TestDisassemblyFormat.test (1154 of 1726) PASS: lldb-Suite :: lang/cpp/char8_t/TestCxxChar8_t.py (1155 of 1726) PASS: lldb-Suite :: python_api/watchpoint/TestWatchpointIter.py (1156 of 1726) PASS: lldb-Unit :: Target/./TargetTests/ExecutionContextTest.GetByteOrderProcess (1157 of 1726) PASS: lldb-Suite :: functionalities/gdb_remote_client/TestNestedRegDefinitions.py (1158 of 1726) PASS: LLDB :: Settings/TestFrameFormatNoColor.test (1159 of 1726) PASS: lldb-Suite :: commands/command/source/TestCommandSource.py (1160 of 1726) PASS: LLDB :: Modules/ELF/netbsd-core-amd64.test (1161 of 1726) PASS: lldb-Suite :: functionalities/postmortem/mach-core/TestMachCore.py (1162 of 1726) PASS: lldb-Unit :: ScriptInterpreter/Python/./ScriptInterpreterPythonTests/PythonDataObjectsTest.TestPythonTupleToStructuredList (1163 of 1726) PASS: lldb-Suite :: commands/expression/import-std-module/unique_ptr/TestUniquePtr.py (1164 of 1726) PASS: lldb-Unit :: Utility/./UtilityTests/UriParserTest.MinimalPath (1165 of 1726) PASS: LLDB :: Modules/MachO/subsections.yaml (1166 of 1726) PASS: lldb-Unit :: Utility/./UtilityTests/Flags.Clear (1167 of 1726) PASS: lldb-Suite :: functionalities/unwind/noreturn/TestNoreturnUnwind.py (1168 of 1726) PASS: lldb-Suite :: functionalities/data-formatter/data-formatter-objc/TestDataFormatterObjCNSError.py (1169 of 1726) PASS: lldb-Unit :: Host/./HostTests/SocketTest.DecodeHostAndPort (1170 of 1726) PASS: lldb-Suite :: functionalities/breakpoint/auto_continue/TestBreakpointAutoContinue.py (1171 of 1726) PASS: lldb-Suite :: functionalities/type_lookup/TestTypeLookup.py (1172 of 1726) PASS: lldb-Suite :: lang/objc/objc-foundation-dictionary-empty/TestNSDictionary0.py (1173 of 1726) PASS: lldb-Suite :: lang/objc/foundation/TestConstStrings.py (1174 of 1726) PASS: lldb-Suite :: lang/mixed/TestMixedLanguages.py (1175 of 1726) PASS: lldb-Unit :: Utility/./UtilityTests/SerializationRountripTest.SerializeDeserializeObjectReference (1176 of 1726) PASS: lldb-Unit :: Utility/./UtilityTests/StringListTest.LongestCommonPrefixNoPrefix (1177 of 1726) PASS: lldb-Suite :: functionalities/thread/exit_during_break/TestExitDuringBreak.py (1178 of 1726) PASS: lldb-Unit :: Host/./HostTests/FileActionTest.Open (1179 of 1726) PASS: lldb-Unit :: Utility/./UtilityTests/UriParserTest.SchemeHostSeparator3 (1180 of 1726) PASS: lldb-Unit :: Utility/./UtilityTests/ArgsTest.TestInsertArg (1181 of 1726) PASS: LLDB :: SymbolFile/DWARF/dir-separator-windows.s (1182 of 1726) PASS: LLDB :: SymbolFile/DWARF/debug-names-compressed.cpp (1183 of 1726) PASS: lldb-Unit :: Utility/./UtilityTests/AnsiTerminal.AtStart (1184 of 1726) PASS: lldb-Suite :: functionalities/darwin_log/format/TestDarwinLogMessageFormat.py (1185 of 1726) PASS: lldb-Suite :: functionalities/thread/concurrent_events/TestConcurrentSignalNWatchNBreak.py (1186 of 1726) PASS: lldb-Unit :: Utility/./UtilityTests/StreamTest.PutHex16ByteOrderLittle (1187 of 1726) PASS: lldb-Suite :: functionalities/gdb_remote_client/TestArmRegisterDefinition.py (1188 of 1726) PASS: lldb-Suite :: functionalities/breakpoint/breakpoint_command/TestRegexpBreakCommand.py (1189 of 1726) UNSUPPORTED: LLDB :: Register/x86-64-xmm16-read.test (1190 of 1726) PASS: lldb-Suite :: functionalities/data-formatter/ostypeformatting/TestFormattersOsType.py (1191 of 1726) PASS: lldb-Unit :: Host/./HostTests/ConnectionFileDescriptorTest.TCPGetURIv4 (1192 of 1726) PASS: lldb-Unit :: ScriptInterpreter/Python/./ScriptInterpreterPythonTests/PythonDataObjectsTest.TestPythonByteArray (1193 of 1726) PASS: LLDB :: SymbolFile/NativePDB/global-classes.cpp (1194 of 1726) PASS: LLDB :: Modules/PECOFF/export-dllfunc.yaml (1195 of 1726) PASS: lldb-Suite :: commands/expression/import-std-module/stack/TestStack.py (1196 of 1726) PASS: lldb-Unit :: Utility/./UtilityTests/StringListTest.InsertStringAtIndexOutOfBounds (1197 of 1726) PASS: lldb-Unit :: Utility/./UtilityTests/StringExtractorTest.GetHexBytes_OddPair2 (1198 of 1726) PASS: lldb-Unit :: Utility/./UtilityTests/OptionsWithRawTest.MultiWordSuffix (1199 of 1726) PASS: lldb-Unit :: UnwindAssembly/x86/./UnwindAssemblyx86Tests/Testx86AssemblyInspectionEngine.TestPopRBX (1200 of 1726) PASS: lldb-Unit :: Utility/./UtilityTests/StringListTest.SplitIntoLinesSingleTrailingCR (1201 of 1726) PASS: lldb-Unit :: Process/minidump/./LLDBMinidumpTests/MinidumpParserTest.GetArchitectureWindows (1202 of 1726) PASS: lldb-Unit :: Utility/./UtilityTests/BinaryStreamTest.PutULEB128FiveBytes (1203 of 1726) PASS: lldb-Unit :: Utility/./UtilityTests/RangeTest.ContainsAddr (1204 of 1726) PASS: lldb-Unit :: Utility/./UtilityTests/ArchSpecTest.Compatibility (1205 of 1726) PASS: lldb-Unit :: Utility/./UtilityTests/StringExtractorTest.GetHexU8_Underflow (1206 of 1726) PASS: lldb-Unit :: Utility/./UtilityTests/StringExtractorTest.GetHexBytesAvail_Underflow (1207 of 1726) PASS: lldb-Unit :: Utility/./UtilityTests/Flags.AnySet (1208 of 1726) PASS: lldb-Suite :: commands/target/create-no-such-arch/TestNoSuchArch.py (1209 of 1726) PASS: lldb-Unit :: Host/./HostTests/SocketTest.DomainListenConnectAccept (1210 of 1726) PASS: lldb-Suite :: commands/frame/var/TestFrameVar.py (1211 of 1726) PASS: LLDB :: Expr/TestTypeOfDeclTypeExpr.test (1212 of 1726) PASS: lldb-Unit :: Utility/./UtilityTests/StringListTest.GetMaxStringLengthIncreasingSize (1213 of 1726) PASS: lldb-Suite :: commands/frame/diagnose/dereference-this/TestDiagnoseDereferenceThis.py (1214 of 1726) PASS: LLDB :: Commands/command-regex-delete.test (1215 of 1726) UNSUPPORTED: LLDB :: SymbolFile/target-symbols-add-unwind.test (1216 of 1726) PASS: lldb-Suite :: tools/lldb-server/TestGdbRemoteThreadsInStopReply.py (1217 of 1726) PASS: lldb-Unit :: SymbolFile/DWARF/./SymbolFileDWARFTests/SymbolFileDWARFTests.TestAbilitiesForDWARF (1218 of 1726) PASS: LLDB :: Reproducer/Functionalities/TestImageList.test (1219 of 1726) PASS: lldb-Unit :: Language/Highlighting/./HighlighterTests/HighlighterTest.ClangStringLiterals (1220 of 1726) PASS: lldb-Unit :: Utility/./UtilityTests/TimerTest.CategoryTimesNested (1221 of 1726) PASS: LLDB :: Commands/command-source.test (1222 of 1726) PASS: LLDB :: Reproducer/Modules/TestModuleCXX.test (1223 of 1726) PASS: LLDB :: Quit/TestQuitExitCodeTooManyArgs.test (1224 of 1726) PASS: lldb-Suite :: lang/objc/bitfield_ivars/TestBitfieldIvars.py (1225 of 1726) PASS: lldb-Unit :: Utility/./UtilityTests/StreamTest.PutNHex8 (1226 of 1726) PASS: lldb-Unit :: Utility/./UtilityTests/NameMatchesTest.StartsWith (1227 of 1726) PASS: lldb-Suite :: functionalities/thread/num_threads/TestNumThreads.py (1228 of 1726) PASS: lldb-Unit :: Utility/./UtilityTests/RangeDataVector.FindEntryThatContains (1229 of 1726) PASS: lldb-Suite :: tools/lldb-server/libraries-svr4/TestGdbRemoteLibrariesSvr4Support.py (1230 of 1726) PASS: lldb-Unit :: Utility/./UtilityTests/StringListTest.InsertStringAtIndexMove (1231 of 1726) PASS: lldb-Suite :: functionalities/data-formatter/ptr_ref_typedef/TestPtrRef2Typedef.py (1232 of 1726) PASS: lldb-Unit :: Language/Highlighting/./HighlighterTests/HighlighterTest.DefaultHighlighterWithCursor (1233 of 1726) PASS: lldb-Unit :: UnwindAssembly/x86/./UnwindAssemblyx86Tests/Testx86AssemblyInspectionEngine.Testi386IgnoredRegisters (1234 of 1726) PASS: lldb-Suite :: lang/c/find_struct_type/TestFindStructTypes.py (1235 of 1726) PASS: lldb-Suite :: functionalities/thread/concurrent_events/TestConcurrentTwoBreakpointsOneDelaySignal.py (1236 of 1726) PASS: lldb-Suite :: functionalities/data-formatter/data-formatter-stl/libcxx/tuple/TestDataFormatterLibcxxTuple.py (1237 of 1726) PASS: lldb-Suite :: functionalities/breakpoint/source_regexp/TestSourceRegexBreakpoints.py (1238 of 1726) PASS: LLDB :: SymbolFile/Breakpad/symtab-macho.test (1239 of 1726) PASS: lldb-Suite :: tools/lldb-vscode/variables/TestVSCode_variables.py (1240 of 1726) PASS: lldb-Suite :: functionalities/darwin_log/filter/exact_match/activity/TestDarwinLogFilterMatchActivity.py (1241 of 1726) PASS: lldb-Suite :: functionalities/breakpoint/inlined_breakpoints/TestInlinedBreakpoints.py (1242 of 1726) PASS: LLDB :: Modules/PECOFF/uuid.yaml (1243 of 1726) PASS: lldb-Suite :: functionalities/darwin_log/filter/regex/subsystem/TestDarwinLogFilterRegexSubsystem.py (1244 of 1726) PASS: lldb-Suite :: api/multiple-debuggers/TestMultipleDebuggers.py (1245 of 1726) PASS: lldb-Suite :: functionalities/signal/handle-abrt/TestHandleAbort.py (1246 of 1726) PASS: lldb-Suite :: commands/expression/import-std-module/list-basic/TestBasicList.py (1247 of 1726) PASS: lldb-Unit :: Utility/./UtilityTests/OptionsWithRawTest.EmptyInput (1248 of 1726) PASS: lldb-Unit :: Language/Highlighting/./HighlighterTests/HighlighterTest.ClangCommas (1249 of 1726) PASS: lldb-Suite :: lang/cpp/class_types/TestClassTypes.py (1250 of 1726) PASS: lldb-Suite :: commands/command/invalid-args/TestInvalidArgsCommand.py (1251 of 1726) PASS: lldb-Unit :: Utility/./UtilityTests/AnsiTerminal.Basic (1252 of 1726) PASS: lldb-Suite :: functionalities/tail_call_frames/thread_step_out_message/TestArtificialFrameStepOutMessage.py (1253 of 1726) PASS: lldb-Unit :: Utility/./UtilityTests/ScalarTest.APIntConstructor (1254 of 1726) PASS: lldb-Unit :: Utility/./UtilityTests/LogChannelTest.Enable (1255 of 1726) PASS: LLDB :: SymbolFile/DWARF/find-basic-type.cpp (1256 of 1726) PASS: lldb-Suite :: functionalities/breakpoint/serialize/TestBreakpointSerialization.py (1257 of 1726) PASS: lldb-Suite :: commands/expression/radar_8638051/Test8638051.py (1258 of 1726) PASS: lldb-Suite :: lang/objc/objc-optimized/TestObjcOptimized.py (1259 of 1726) PASS: lldb-Suite :: commands/process/launch/TestProcessLaunch.py (1260 of 1726) PASS: lldb-Unit :: Utility/./UtilityTests/OptionsWithRawTest.EmptySuffix (1261 of 1726) PASS: lldb-Unit :: Utility/./UtilityTests/StringExtractorTest.GetHexBytes (1262 of 1726) PASS: lldb-Suite :: lang/objc/modules-incomplete/TestIncompleteModules.py (1263 of 1726) PASS: LLDB :: SymbolFile/DWARF/debug_rnglists.s (1264 of 1726) PASS: lldb-Suite :: tools/lldb-server/register-reading/TestGdbRemoteGPacket.py (1265 of 1726) PASS: lldb-Suite :: commands/expression/import-std-module/vector-bool/TestBoolVector.py (1266 of 1726) PASS: lldb-Suite :: commands/apropos/with-process/TestAproposWithProcess.py (1267 of 1726) PASS: lldb-Suite :: python_api/hello_world/TestHelloWorld.py (1268 of 1726) PASS: LLDB :: Reproducer/TestFileRepro.test (1269 of 1726) PASS: lldb-Unit :: Utility/./UtilityTests/StringExtractorTest.GetHexU8_Extra (1270 of 1726) PASS: lldb-Unit :: Utility/./UtilityTests/BinaryStreamTest.PutULEB128One (1271 of 1726) PASS: LLDB :: Modules/ELF/aarch64-relocations.yaml (1272 of 1726) PASS: lldb-Suite :: tools/lldb-server/TestGdbRemoteSingleStep.py (1273 of 1726) PASS: lldb-Unit :: Host/./HostTests/TaskPoolTest.TaskMap (1274 of 1726) PASS: LLDB :: Modules/ELF/compressed-sections.yaml (1275 of 1726) PASS: lldb-Suite :: functionalities/data-formatter/data-formatter-synth/TestDataFormatterSynth.py (1276 of 1726) PASS: lldb-Unit :: Utility/./UtilityTests/ConstStringTest.NullAndEmptyStates (1277 of 1726) PASS: lldb-Suite :: macosx/indirect_symbol/TestIndirectSymbols.py (1278 of 1726) PASS: lldb-Suite :: functionalities/darwin_log/filter/exact_match/subsystem/TestDarwinLogFilterMatchSubsystem.py (1279 of 1726) PASS: lldb-Suite :: commands/expression/class_template_specialization_empty_pack/TestClassTemplateSpecializationParametersHandling.py (1280 of 1726) PASS: lldb-Suite :: lang/c/offsetof/TestOffsetof.py (1281 of 1726) PASS: lldb-Unit :: Expression/./ExpressionTests/DiagnosticManagerTest.GetStringNoDiags (1282 of 1726) PASS: lldb-Unit :: UnwindAssembly/x86/./UnwindAssemblyx86Tests/Testx86AssemblyInspectionEngine.TestPush0 (1283 of 1726) PASS: lldb-Suite :: commands/quit/TestQuit.py (1284 of 1726) PASS: lldb-Suite :: functionalities/thread/thread_exit/TestThreadExit.py (1285 of 1726) PASS: lldb-Suite :: functionalities/data-formatter/data-formatter-smart-array/TestDataFormatterSmartArray.py (1286 of 1726) PASS: lldb-Suite :: functionalities/inferior-crashing/TestInferiorCrashing.py (1287 of 1726) PASS: lldb-Suite :: functionalities/data-formatter/data-formatter-advanced/TestDataFormatterAdv.py (1288 of 1726) PASS: LLDB :: SymbolFile/DWARF/debug-types-address-ranges.s (1289 of 1726) PASS: lldb-Unit :: Host/./HostTests/NativeProcessProtocolTest.ReadCStringFromMemory (1290 of 1726) PASS: LLDB :: Modules/ELF/gnu-debuglink.yaml (1291 of 1726) PASS: lldb-Unit :: Process/gdb-remote/./ProcessGdbRemoteTests/GDBRemoteCommunicationClientTest.WriteRegisterNoSuffix (1292 of 1726) UNSUPPORTED: LLDB :: SymbolFile/PDB/func-symbols.test (1293 of 1726) PASS: lldb-Unit :: Utility/./UtilityTests/StreamTest.PutHex16ByteOrderBig (1294 of 1726) PASS: lldb-Unit :: Language/Highlighting/./HighlighterTests/HighlighterTest.FallbackHighlighter (1295 of 1726) PASS: lldb-Suite :: commands/watchpoints/watchpoint_commands/condition/TestWatchpointConditionCmd.py (1296 of 1726) PASS: lldb-Suite :: lang/objc/exceptions/TestObjCExceptions.py (1297 of 1726) PASS: lldb-Suite :: commands/expression/vector_of_enums/TestVectorOfEnums.py (1298 of 1726) PASS: lldb-Suite :: lang/cpp/static_methods/TestCPPStaticMethods.py (1299 of 1726) PASS: lldb-Unit :: Utility/./UtilityTests/BinaryStreamTest.PutSLEB128MaxValue (1300 of 1726) PASS: lldb-Suite :: functionalities/data-formatter/data-formatter-stl/libcxx/initializerlist/TestInitializerList.py (1301 of 1726) XFAIL: LLDB :: SymbolFile/DWARF/find-type-in-function.cpp (1302 of 1726) PASS: lldb-Suite :: lang/objc/objc-new-syntax/TestObjCNewSyntaxArray.py (1303 of 1726) PASS: lldb-Suite :: commands/expression/argument_passing_restrictions/TestArgumentPassingRestrictions.py (1304 of 1726) PASS: lldb-Suite :: functionalities/testid/TestTestId.py (1305 of 1726) PASS: lldb-Unit :: Symbol/./SymbolTests/PostfixExpression.ToDWARF (1306 of 1726) PASS: lldb-Suite :: lang/cpp/scope/TestCppScope.py (1307 of 1726) PASS: lldb-Suite :: terminal/TestSTTYBeforeAndAfter.py (1308 of 1726) PASS: lldb-Suite :: lang/objc/modules-cache/TestClangModulesCache.py (1309 of 1726) PASS: lldb-Unit :: UnwindAssembly/x86/./UnwindAssemblyx86Tests/Testx86AssemblyInspectionEngine.TestPushR15 (1310 of 1726) PASS: lldb-Suite :: functionalities/breakpoint/consecutive_breakpoints/TestConsecutiveBreakpoints.py (1311 of 1726) PASS: lldb-Unit :: Utility/./UtilityTests/StringListTest.SetSize (1312 of 1726) PASS: LLDB :: Minidump/dump-all.test (1313 of 1726) PASS: lldb-Unit :: Symbol/./SymbolTests/TestClangASTContext.TestBuiltinTypeForEncodingAndBitSize (1314 of 1726) PASS: lldb-Suite :: functionalities/asan/TestMemoryHistory.py (1315 of 1726) XFAIL: LLDB :: Register/x86-64-write.test (1316 of 1726) PASS: LLDB :: SymbolFile/NativePDB/nested-types.cpp (1317 of 1726) PASS: lldb-Suite :: functionalities/thread/concurrent_events/TestConcurrentSignalWatch.py (1318 of 1726) PASS: lldb-Suite :: lang/objc/objc-runtime-ivars/TestRuntimeIvars.py (1319 of 1726) PASS: lldb-Unit :: Host/./HostTests/SocketTest.DomainGetConnectURI (1320 of 1726) PASS: lldb-Suite :: commands/add-dsym/uuid/TestAddDsymCommand.py (1321 of 1726) PASS: lldb-Suite :: functionalities/data-formatter/synthupdate/TestSyntheticFilterRecompute.py (1322 of 1726) PASS: lldb-Suite :: tools/lldb-vscode/breakpoint/TestVSCode_setBreakpoints.py (1323 of 1726) PASS: lldb-Suite :: functionalities/show_location/TestShowLocationDwarf5.py (1324 of 1726) PASS: lldb-Unit :: Expression/./ExpressionTests/DiagnosticManagerTest.GetStringBasic (1325 of 1726) UNSUPPORTED: LLDB :: Expr/TestIRMemoryMapWindows.test (1326 of 1726) PASS: lldb-Suite :: lang/objc/foundation/TestObjectDescriptionAPI.py (1327 of 1726) UNSUPPORTED: LLDB :: Process/Windows/exception_access_violation.cpp (1328 of 1726) PASS: lldb-Unit :: Utility/./UtilityTests/LogChannelTest.EnableOptions (1329 of 1726) PASS: lldb-Unit :: Utility/./UtilityTests/Flags.GetBitSize (1330 of 1726) PASS: lldb-Suite :: commands/expression/expr-in-syscall/TestExpressionInSyscall.py (1331 of 1726) PASS: lldb-Suite :: lang/cpp/auto/TestCPPAuto.py (1332 of 1726) PASS: lldb-Suite :: python_api/default-constructor/TestDefaultConstructorForAPIObjects.py (1333 of 1726) PASS: lldb-Suite :: lang/c/unions/TestUnionMembers.py (1334 of 1726) PASS: lldb-Suite :: python_api/section/TestSectionAPI.py (1335 of 1726) PASS: lldb-Unit :: Language/Highlighting/./HighlighterTests/HighlighterTest.ClangUnterminatedString (1336 of 1726) PASS: lldb-Unit :: Utility/./UtilityTests/StringListTest.InsertStringAtIndexEnd (1337 of 1726) PASS: lldb-Suite :: commands/watchpoints/hello_watchpoint/TestMyFirstWatchpoint.py (1338 of 1726) PASS: lldb-Suite :: benchmarks/turnaround/TestCompileRunToBreakpointTurnaround.py (1339 of 1726) PASS: lldb-Suite :: tools/lldb-server/TestGdbRemote_vCont.py (1340 of 1726) PASS: lldb-Unit :: Utility/./UtilityTests/VMRange.IsValid (1341 of 1726) PASS: lldb-Suite :: functionalities/postmortem/elf-core/TestLinuxCore.py (1342 of 1726) PASS: lldb-Unit :: Utility/./UtilityTests/SerializationRountripTest.SerializeDeserializePod (1343 of 1726) PASS: lldb-Suite :: functionalities/thread/concurrent_events/TestConcurrentWatchBreakDelay.py (1344 of 1726) PASS: lldb-Suite :: functionalities/data-formatter/data-formatter-stl/libstdcpp/iterator/TestDataFormatterStdIterator.py (1345 of 1726) PASS: lldb-Unit :: Process/minidump/./LLDBMinidumpTests/RegisterContextMinidump.ConvertMinidumpContext_x86_64 (1346 of 1726) PASS: lldb-Suite :: functionalities/thread/concurrent_events/TestConcurrentManyBreakpoints.py (1347 of 1726) PASS: lldb-Unit :: ScriptInterpreter/Python/./ScriptInterpreterPythonTests/PythonDataObjectsTest.TestPythonInteger (1348 of 1726) PASS: lldb-Unit :: Utility/./UtilityTests/UriParserTest.SchemeHostSeparator4 (1349 of 1726) PASS: lldb-Unit :: Utility/./UtilityTests/ArgsTest.ReplaceArgumentAtIndexLonger (1350 of 1726) PASS: lldb-Suite :: python_api/sbvalue_const_addrof/TestSBValueConstAddrOf.py (1351 of 1726) PASS: lldb-Suite :: lang/cpp/namespace_conflicts/TestNamespaceConflicts.py (1352 of 1726) PASS: lldb-Unit :: UnwindAssembly/x86/./UnwindAssemblyx86Tests/Testx86AssemblyInspectionEngine.TestMovRSPtoRBP (1353 of 1726) PASS: lldb-Unit :: Language/Highlighting/./HighlighterTests/HighlighterTest.ClangOperators (1354 of 1726) PASS: lldb-Suite :: lang/cpp/breakpoint_in_member_func_w_non_primitive_params/TestBreakpointInMemberFuncWNonPrimitiveParams.py (1355 of 1726) PASS: lldb-Suite :: commands/expression/persistent_ptr_update/TestPersistentPtrUpdate.py (1356 of 1726) PASS: lldb-Suite :: functionalities/breakpoint/scripted_bkpt/TestScriptedResolver.py (1357 of 1726) PASS: LLDB :: Settings/TestSettingsSet.test (1358 of 1726) PASS: lldb-Suite :: tools/lldb-vscode/breakpoint/TestVSCode_setFunctionBreakpoints.py (1359 of 1726) PASS: lldb-Suite :: functionalities/data-formatter/data-formatter-python-synth/TestDataFormatterPythonSynth.py (1360 of 1726) PASS: lldb-Suite :: lang/objc/print-obj/TestPrintObj.py (1361 of 1726) UNSUPPORTED: LLDB :: Breakpoint/case-insensitive.test (1362 of 1726) PASS: lldb-Unit :: ObjectFile/Breakpad/./ObjectFileBreakpadTests/PublicRecord.parse (1363 of 1726) PASS: lldb-Suite :: commands/watchpoints/multiple_threads/TestWatchpointMultipleThreads.py (1364 of 1726) PASS: lldb-Suite :: lang/cpp/global_operators/TestCppGlobalOperators.py (1365 of 1726) PASS: lldb-Suite :: lang/objc/foundation/TestObjCMethods.py (1366 of 1726) PASS: LLDB :: SymbolFile/DWARF/deterministic-build.cpp (1367 of 1726) PASS: lldb-Unit :: Utility/./UtilityTests/TimeoutTest.Construction (1368 of 1726) PASS: lldb-Suite :: functionalities/thread/concurrent_events/TestConcurrentTwoWatchpointsOneBreakpoint.py (1369 of 1726) PASS: lldb-Unit :: SymbolFile/DWARF/./SymbolFileDWARFTests/SymbolFileDWARFTests.TestAbbrevNullAttrValidForm (1370 of 1726) PASS: lldb-Suite :: python_api/name_lookup/TestNameLookup.py (1371 of 1726) PASS: lldb-Unit :: SymbolFile/NativePDB/./SymbolFileNativePDBTests/PDBFPOProgramToDWARFExpressionTests.MultipleIndependentAssignments (1372 of 1726) PASS: lldb-Unit :: Language/Highlighting/./HighlighterTests/HighlighterTest.ClangCursorOutOfBounds (1373 of 1726) PASS: LLDB :: SymbolFile/DWARF/split-dwarf-multiple-cu.ll (1374 of 1726) PASS: lldb-Unit :: Utility/./UtilityTests/StringListTest.AppendListCStringArrayEmpty (1375 of 1726) PASS: lldb-Suite :: functionalities/jitloader_gdb/TestJITLoaderGDB.py (1376 of 1726) PASS: LLDB :: Driver/TestCore.test (1377 of 1726) PASS: LLDB :: BuildScript/script-args.test (1378 of 1726) PASS: lldb-Unit :: ObjectFile/Breakpad/./ObjectFileBreakpadTests/Record.classify (1379 of 1726) PASS: lldb-Suite :: functionalities/thread/concurrent_events/TestConcurrentTwoBreakpointsOneSignal.py (1380 of 1726) PASS: lldb-Unit :: SymbolFile/NativePDB/./SymbolFileNativePDBTests/PDBFPOProgramToDWARFExpressionTests.MultipleDependentAssignments (1381 of 1726) PASS: lldb-Suite :: functionalities/data-formatter/data-formatter-synthval/TestDataFormatterSynthVal.py (1382 of 1726) PASS: LLDB :: Modules/ELF/PT_LOAD-overlap-section.yaml (1383 of 1726) PASS: LLDB :: Modules/PECOFF/dep-modules.yaml (1384 of 1726) PASS: lldb-Unit :: Utility/./UtilityTests/ArgsTest.TestTrailingBackslash (1385 of 1726) PASS: lldb-Unit :: Utility/./UtilityTests/RecordReplayTest.InstrumentedFooSameThis (1386 of 1726) PASS: lldb-Suite :: commands/platform/basic/TestPlatformCommand.py (1387 of 1726) PASS: lldb-Suite :: lang/c/struct_types/TestStructTypes.py (1388 of 1726) PASS: lldb-Suite :: functionalities/source-map/TestTargetSourceMap.py (1389 of 1726) PASS: lldb-Suite :: functionalities/data-formatter/data-formatter-proper-plurals/TestFormattersOneIsSingular.py (1390 of 1726) PASS: lldb-Unit :: Utility/./UtilityTests/GeneratorTest.Create (1391 of 1726) PASS: lldb-Suite :: macosx/lc-note/kern-ver-str/TestKernVerStrLCNOTE.py (1392 of 1726) PASS: lldb-Suite :: benchmarks/frame_variable/TestFrameVariableResponse.py (1393 of 1726) PASS: LLDB :: SymbolFile/NativePDB/break-by-line.cpp (1394 of 1726) PASS: LLDB :: SymbolFile/DWARF/parallel-indexing-stress.s (1395 of 1726) PASS: lldb-Suite :: functionalities/data-formatter/data-formatter-stl/libcxx/list/loop/TestDataFormatterLibcxxListLoop.py (1396 of 1726) PASS: LLDB :: Breakpoint/debug_rnglistx_rlex.test (1397 of 1726) PASS: lldb-Suite :: commands/expression/timeout/TestCallWithTimeout.py (1398 of 1726) PASS: lldb-Unit :: Utility/./UtilityTests/ProcessInstanceInfo.Dump (1399 of 1726) PASS: lldb-Unit :: Core/./LLDBCoreTests/RichManglingContextTest.IPDRealloc (1400 of 1726) PASS: lldb-Unit :: Language/Highlighting/./HighlighterTests/HighlighterTest.ClangBraces (1401 of 1726) PASS: lldb-Suite :: commands/expression/formatters/TestFormatters.py (1402 of 1726) PASS: lldb-Suite :: commands/frame/diagnose/virtual-method-call/TestDiagnoseDereferenceVirtualMethodCall.py (1403 of 1726) PASS: lldb-Suite :: lang/objc/single-entry-dictionary/TestObjCSingleEntryDictionary.py (1404 of 1726) PASS: lldb-Unit :: Utility/./UtilityTests/LogChannelEnabledTest.log_options (1405 of 1726) PASS: lldb-Unit :: ScriptInterpreter/Python/./ScriptInterpreterPythonTests/PythonDataObjectsTest.TestPythonBytes (1406 of 1726) PASS: lldb-Suite :: benchmarks/expression/TestRepeatedExprs.py (1407 of 1726) PASS: lldb-Suite :: commands/expression/entry-bp/TestExprEntryBP.py (1408 of 1726) PASS: lldb-Unit :: ObjectFile/Breakpad/./ObjectFileBreakpadTests/InfoRecord.parse (1409 of 1726) PASS: lldb-Unit :: Utility/./UtilityTests/UriParserTest.SchemeHostSeparator2 (1410 of 1726) PASS: lldb-Unit :: Host/./HostTests/SocketTest.TCPListen0ConnectAccept (1411 of 1726) PASS: lldb-Unit :: Utility/./UtilityTests/StreamTest.PutBytesAsRawHex8ToMixedEndian (1412 of 1726) PASS: lldb-Unit :: Process/minidump/./LLDBMinidumpTests/MinidumpParserTest.GetMemoryRegionInfo (1413 of 1726) PASS: lldb-Unit :: Utility/./UtilityTests/RangeDataVector.FindEntryThatContains_Overlap (1414 of 1726) PASS: lldb-Suite :: functionalities/data-formatter/data-formatter-stl/libstdcpp/smart_ptr/TestDataFormatterStdSmartPtr.py (1415 of 1726) PASS: lldb-Unit :: Utility/./UtilityTests/AnsiTerminal.Empty (1416 of 1726) PASS: lldb-Suite :: commands/expression/two-files/TestObjCTypeQueryFromOtherCompileUnit.py (1417 of 1726) XFAIL: LLDB :: Register/x86-mm-xmm-write.test (1418 of 1726) PASS: lldb-Unit :: UnwindAssembly/x86/./UnwindAssemblyx86Tests/Testx86AssemblyInspectionEngine.TestCALLNextInsn (1419 of 1726) PASS: lldb-Suite :: functionalities/data-formatter/data-formatter-stl/libcxx/iterator/TestDataFormatterLibccIterator.py (1420 of 1726) PASS: lldb-Unit :: Utility/./UtilityTests/StreamTest.PutHex32ByteOrderLittle (1421 of 1726) PASS: LLDB :: Modules/ELF/section-types-edgecases.yaml (1422 of 1726) PASS: LLDB :: SymbolFile/DWARF/split-dwarf-inlining.cpp (1423 of 1726) PASS: lldb-Unit :: Utility/./UtilityTests/JSONTest.Newlines (1424 of 1726) PASS: lldb-Unit :: Process/gdb-remote/./ProcessGdbRemoteTests/GDBRemoteClientBaseTest.InterruptNoResponse (1425 of 1726) PASS: lldb-Suite :: lang/cpp/exceptions/TestCPPExceptionBreakpoints.py (1426 of 1726) PASS: lldb-Unit :: ScriptInterpreter/Python/./ScriptInterpreterPythonTests/PythonDataObjectsTest.TestInstanceNameResolutionNoDot (1427 of 1726) PASS: lldb-Suite :: commands/watchpoints/multiple_hits/TestMultipleHits.py (1428 of 1726) PASS: lldb-Unit :: Utility/./UtilityTests/LogChannelEnabledTest.LogVerboseThread (1429 of 1726) PASS: lldb-Unit :: Utility/./UtilityTests/UriParserTest.BracketedHostnameWithColon (1430 of 1726) PASS: lldb-Unit :: Utility/./UtilityTests/ArchSpecTest.TestSetTriple (1431 of 1726) PASS: lldb-Suite :: commands/watchpoints/watchpoint_commands/command/TestWatchpointCommandPython.py (1432 of 1726) PASS: LLDB :: Breakpoint/debug_rnglist_offset_pair.test (1433 of 1726) PASS: lldb-Unit :: ScriptInterpreter/Python/./ScriptInterpreterPythonTests/PythonDataObjectsTest.TestPythonStringToStr (1434 of 1726) PASS: lldb-Suite :: functionalities/breakpoint/require_hw_breakpoints/TestRequireHWBreakpoints.py (1435 of 1726) PASS: LLDB :: Settings/TestModuleCacheSanity.test (1436 of 1726) PASS: lldb-Suite :: commands/process/attach-resume/TestAttachResume.py (1437 of 1726) PASS: lldb-Unit :: Utility/./UtilityTests/UriParserTest.BadPort (1438 of 1726) PASS: LLDB :: Breakpoint/split-dwarf5-debug-stroffsets.test (1439 of 1726) PASS: lldb-Unit :: Symbol/./SymbolTests/DWARFCallFrameInfoTest.Basic_eh (1440 of 1726) PASS: lldb-Unit :: Target/./TargetTests/ModuleCacheTest.GetAndPutUuidExists (1441 of 1726) PASS: lldb-Suite :: functionalities/tail_call_frames/sbapi_support/TestTailCallFrameSBAPI.py (1442 of 1726) PASS: lldb-Suite :: lang/cpp/printf/TestPrintf.py (1443 of 1726) PASS: LLDB :: Driver/TestNoUseColor.test (1444 of 1726) PASS: lldb-Suite :: python_api/frame/get-variables/TestGetVariables.py (1445 of 1726) PASS: lldb-Suite :: python_api/watchpoint/TestWatchpointIgnoreCount.py (1446 of 1726) UNSUPPORTED: LLDB :: SymbolFile/PDB/type-quals.test (1447 of 1726) PASS: lldb-Unit :: Utility/./UtilityTests/StringExtractorTest.GetNameColonValueNoColon (1448 of 1726) PASS: lldb-Suite :: commands/expression/call-function/TestCallUserDefinedFunction.py (1449 of 1726) PASS: lldb-Unit :: SymbolFile/NativePDB/./SymbolFileNativePDBTests/PDBFPOProgramToDWARFExpressionTests.UnknownOp (1450 of 1726) PASS: lldb-Unit :: Process/minidump/./LLDBMinidumpTests/MinidumpParserTest.GetThreadsAndGetThreadContext (1451 of 1726) PASS: lldb-Suite :: functionalities/thread/create_during_step/TestCreateDuringStep.py (1452 of 1726) PASS: lldb-Unit :: Expression/./ExpressionTests/DiagnosticManagerTest.GetStringPreserveOrder (1453 of 1726) PASS: lldb-Suite :: commands/expression/anonymous-struct/TestCallUserAnonTypedef.py (1454 of 1726) PASS: lldb-Unit :: Symbol/./SymbolTests/LineEntryTest.GetSameLineContiguousAddressRangeNoInlines (1455 of 1726) PASS: lldb-Unit :: UnwindAssembly/x86/./UnwindAssemblyx86Tests/Testx86AssemblyInspectionEngine.Test32bitFramelessBigStackFrame (1456 of 1726) PASS: lldb-Unit :: Host/./HostTests/SocketAddressTest.Set (1457 of 1726) PASS: lldb-Suite :: types/TestDoubleTypes.py (1458 of 1726) PASS: lldb-Unit :: SymbolFile/DWARF/./SymbolFileDWARFTests/SymbolFileDWARFTests.TestAbbrevOrder1Start1 (1459 of 1726) PASS: lldb-Suite :: functionalities/step_scripted/TestStepScripted.py (1460 of 1726) PASS: LLDB :: Minidump/disassemble-no-module.yaml (1461 of 1726) PASS: lldb-Unit :: UnwindAssembly/x86/./UnwindAssemblyx86Tests/Testx86AssemblyInspectionEngine.TestStackRealign32BitDisp_x86_64 (1462 of 1726) PASS: LLDB :: Driver/LocalLLDBInit.test (1463 of 1726) PASS: lldb-Unit :: Utility/./UtilityTests/ArgsTest.TestSingleQuotedArgWithSpace (1464 of 1726) PASS: lldb-Unit :: Core/./LLDBCoreTests/RichManglingContextTest.SwitchProvider (1465 of 1726) PASS: lldb-Suite :: python_api/findvalue_duplist/TestSBFrameFindValue.py (1466 of 1726) PASS: lldb-Unit :: Utility/./UtilityTests/StatusTest.Formatv (1467 of 1726) PASS: lldb-Suite :: lang/cpp/thread_local/TestThreadLocal.py (1468 of 1726) PASS: lldb-Suite :: functionalities/param_entry_vals/basic_entry_values_x86_64/TestBasicEntryValuesX86_64.py (1469 of 1726) PASS: lldb-Suite :: lang/cpp/llvm-style/TestLLVMStyle.py (1470 of 1726) PASS: lldb-Unit :: Host/./HostTests/FileSystemTest.EnumerateDirectory (1471 of 1726) PASS: lldb-Unit :: Process/minidump/./LLDBMinidumpTests/MinidumpParserTest.GetThreadContext_x86_32_wow64 (1472 of 1726) UNSUPPORTED: LLDB :: BuildScript/toolchain-clang-cl.test (1473 of 1726) PASS: lldb-Suite :: lang/cpp/unicode-literals/TestUnicodeLiterals.py (1474 of 1726) PASS: lldb-Unit :: Utility/./UtilityTests/LogTest.Register (1475 of 1726) PASS: lldb-Unit :: Process/gdb-remote/./ProcessGdbRemoteTests/GDBRemoteCommunicationClientTest.GetModulesInfo (1476 of 1726) PASS: lldb-Unit :: Utility/./UtilityTests/UriParserTest.Minimal (1477 of 1726) PASS: lldb-Unit :: Utility/./UtilityTests/UriParserTest.Empty (1478 of 1726) PASS: LLDB :: Heap/heap-cstr.test (1479 of 1726) PASS: lldb-Unit :: SymbolFile/DWARF/./SymbolFileDWARFTests/SymbolFileDWARFTests.TestAbbrevMissingTerminator (1480 of 1726) UNSUPPORTED: LLDB :: Register/x86-zmm-read.test (1481 of 1726) PASS: lldb-Suite :: types/TestRecursiveTypes.py (1482 of 1726) PASS: lldb-Suite :: python_api/sblaunchinfo/TestSBLaunchInfo.py (1483 of 1726) PASS: lldb-Unit :: Process/gdb-remote/./ProcessGdbRemoteTests/GDBRemoteCommunicationServerTest.SendErrorResponse_UnimplementedError (1484 of 1726) PASS: lldb-Suite :: functionalities/ubsan/user-expression/TestUbsanUserExpression.py (1485 of 1726) PASS: lldb-Suite :: functionalities/data-formatter/data-formatter-cpp/TestDataFormatterCpp.py (1486 of 1726) PASS: lldb-Unit :: Utility/./UtilityTests/OptionsWithRawTest.WhitespaceSuffix (1487 of 1726) PASS: lldb-Unit :: Process/gdb-remote/./ProcessGdbRemoteTests/GDBRemoteClientBaseTest.SendContinueAndAsyncSignal (1488 of 1726) PASS: lldb-Unit :: UnwindAssembly/x86/./UnwindAssemblyx86Tests/Testx86AssemblyInspectionEngine.TestSimplei386ugmented (1489 of 1726) PASS: LLDB :: SymbolFile/DWARF/find-method-local-struct.cpp (1490 of 1726) PASS: lldb-Unit :: UnwindAssembly/x86/./UnwindAssemblyx86Tests/Testx86AssemblyInspectionEngine.TestAddRSP (1491 of 1726) PASS: lldb-Unit :: Utility/./UtilityTests/ArgsTest.GetArgumentArrayRef (1492 of 1726) PASS: lldb-Unit :: Utility/./UtilityTests/VMRange.Clear (1493 of 1726) PASS: lldb-Suite :: commands/expression/persistent_variables/TestPersistentVariables.py (1494 of 1726) PASS: LLDB :: Register/x86-64-gp-read.test (1495 of 1726) PASS: lldb-Suite :: functionalities/thread/concurrent_events/TestConcurrentTwoWatchpointThreads.py (1496 of 1726) PASS: lldb-Unit :: Utility/./UtilityTests/ArgsTest.TestQuotedUnknownEscape (1497 of 1726) PASS: lldb-Unit :: Utility/./UtilityTests/LogChannelEnabledTest.LLDB_LOG_ERROR (1498 of 1726) PASS: lldb-Unit :: Utility/./UtilityTests/StreamTest.PutPtr (1499 of 1726) PASS: lldb-Unit :: Utility/./UtilityTests/RegularExpression.CopyAssignment (1500 of 1726) UNSUPPORTED: LLDB :: Unwind/eh-frame-small-fde.test (1501 of 1726) PASS: LLDB :: SymbolFile/DWARF/debug_ranges_and_rnglists.test (1502 of 1726) PASS: lldb-Suite :: tools/lldb-server/TestAppleSimulatorOSType.py (1503 of 1726) PASS: lldb-Suite :: python_api/lldbutil/TestSwigVersion.py (1504 of 1726) PASS: lldb-Suite :: lang/objc/objc-new-syntax/TestObjCNewSyntaxDictionary.py (1505 of 1726) PASS: lldb-Suite :: sample_test/TestSampleInlineTest.py (1506 of 1726) PASS: lldb-Unit :: ScriptInterpreter/Python/./ScriptInterpreterPythonTests/PythonDataObjectsTest.TestPythonListValueEquality (1507 of 1726) PASS: lldb-Unit :: Utility/./UtilityTests/ConstStringTest.CompareConstString (1508 of 1726) PASS: lldb-Unit :: UnwindAssembly/x86/./UnwindAssemblyx86Tests/Testx86AssemblyInspectionEngine.TestPopEBP (1509 of 1726) PASS: lldb-Suite :: python_api/interpreter/TestRunCommandInterpreterAPI.py (1510 of 1726) PASS: lldb-Suite :: functionalities/data-formatter/data-formatter-stl/libcxx/list/TestDataFormatterLibcxxList.py (1511 of 1726) PASS: lldb-Suite :: lang/objc/self/TestObjCSelf.py (1512 of 1726) PASS: lldb-Unit :: UnwindAssembly/x86/./UnwindAssemblyx86Tests/Testx86AssemblyInspectionEngine.TestDisassemblyMidFunctionEpilogues (1513 of 1726) PASS: lldb-Suite :: sanity/TestModuleCacheSanity.py (1514 of 1726) PASS: LLDB :: Breakpoint/single-file-split-dwarf.test (1515 of 1726) PASS: LLDB :: Modules/MachO/lc_build_version_notools.yaml (1516 of 1726) PASS: LLDB :: SymbolFile/DWARF/debug-types-signature-loop.s (1517 of 1726) PASS: lldb-Unit :: Utility/./UtilityTests/StringExtractorTest.GetU64LittleEndian (1518 of 1726) PASS: lldb-Unit :: Core/./LLDBCoreTests/MangledTest.EmptyForInvalidName (1519 of 1726) PASS: LLDB :: SymbolFile/DWARF/debug-types-line-tables.s (1520 of 1726) PASS: lldb-Unit :: Utility/./UtilityTests/ArgsTest.ReplaceArgumentAtIndexOutOfRange (1521 of 1726) PASS: lldb-Suite :: functionalities/thread/thread_specific_break_plus_condition/TestThreadSpecificBpPlusCondition.py (1522 of 1726) PASS: lldb-Suite :: lang/cpp/namespace/TestNamespace.py (1523 of 1726) PASS: lldb-Suite :: functionalities/wrong_commands/TestWrongCommands.py (1524 of 1726) PASS: lldb-Unit :: Utility/./UtilityTests/StateTest.Formatv (1525 of 1726) PASS: lldb-Unit :: debugserver/./debugserverTests/RNBSocket.LoopBackConnectIPv4 (1526 of 1726) PASS: lldb-Suite :: commands/process/launch-with-shellexpand/TestLaunchWithShellExpand.py (1527 of 1726) PASS: lldb-Unit :: Process/minidump/./LLDBMinidumpTests/MinidumpParserTest.GetPid (1528 of 1726) PASS: lldb-Unit :: Utility/./UtilityTests/BinaryStreamTest.PutSLEB128TwoBytes (1529 of 1726) PASS: lldb-Unit :: Utility/./UtilityTests/UriParserTest.BracketedHostnamePort (1530 of 1726) PASS: lldb-Unit :: Utility/./UtilityTests/FileSpecTest.GuessPathStyle (1531 of 1726) PASS: lldb-Unit :: Utility/./UtilityTests/FileSpecTest.EqualSeparator (1532 of 1726) PASS: lldb-Suite :: functionalities/mtc/simple/TestMTCSimple.py (1533 of 1726) PASS: lldb-Suite :: functionalities/thread/concurrent_events/TestConcurrentDelaySignalWatch.py (1534 of 1726) PASS: lldb-Unit :: Utility/./UtilityTests/TildeExpressionResolver.ResolveFullPath (1535 of 1726) PASS: lldb-Suite :: functionalities/data-formatter/setvaluefromcstring/TestSetValueFromCString.py (1536 of 1726) PASS: lldb-Unit :: UnwindAssembly/x86/./UnwindAssemblyx86Tests/Testx86AssemblyInspectionEngine.TestPushESI (1537 of 1726) PASS: LLDB :: SymbolFile/NativePDB/ast-methods.cpp (1538 of 1726) PASS: lldb-Suite :: lang/objcxx/class-name-clash/TestNameClash.py (1539 of 1726) PASS: lldb-Suite :: functionalities/inferior-crashing/TestInferiorCrashingStep.py (1540 of 1726) PASS: lldb-Suite :: functionalities/breakpoint/global_constructor/TestBreakpointInGlobalConstructor.py (1541 of 1726) PASS: lldb-Suite :: commands/frame/diagnose/bad-reference/TestBadReference.py (1542 of 1726) PASS: lldb-Unit :: Utility/./UtilityTests/StringExtractorTest.InitMisc (1543 of 1726) PASS: lldb-Unit :: ScriptInterpreter/Python/./ScriptInterpreterPythonTests/PythonDataObjectsTest.TestPythonFile (1544 of 1726) PASS: lldb-Unit :: Signals/./SignalsTests/UnixSignalsTest.GetFilteredSignals (1545 of 1726) PASS: lldb-Unit :: Utility/./UtilityTests/StreamTest.ShiftOperatorUInts (1546 of 1726) PASS: lldb-Suite :: commands/source/info/TestSourceInfo.py (1547 of 1726) PASS: lldb-Unit :: Symbol/./SymbolTests/TestClangASTContext.TestRecordHasFields (1548 of 1726) PASS: lldb-Unit :: Language/Highlighting/./HighlighterTests/HighlighterTest.ClangCursorPos (1549 of 1726) FAIL: lldb-Suite :: commands/expression/multiline-completion/TestMultilineCompletion.py (1550 of 1726) ******************** TEST 'lldb-Suite :: commands/expression/multiline-completion/TestMultilineCompletion.py' FAILED ******************** lldb version 10.0.99 (http://labmaster3.local/git/llvm-project.git revision 66e9f239b5b3b4367eef580696b4e695164f164a) clang revision 1bd58870e5bd715c7bcbd1180bd50c4f4c7663ff llvm revision 1bd58870e5bd715c7bcbd1180bd50c4f4c7663ff LLDB library dir: /Users/buildslave/jenkins/workspace/lldb-cmake-sanitized/lldb-build/bin LLDB import library dir: /Users/buildslave/jenkins/workspace/lldb-cmake-sanitized/lldb-build/bin libstdcxx tests will not be run because: Don't know how to build with libstdcxx on macosx Skipping following debug info categories: ['dwo'] (lldb) settings set symbols.enable-external-lookup false (lldb) settings set plugin.process.gdb-remote.packet-timeout 60 (lldb) settings set symbols.clang-modules-cache-path "/Users/buildslave/jenkins/workspace/lldb-cmake-sanitized/lldb-build/tools/lldb/lldb-test-build.noindex/module-cache-lldb" (lldb) settings set use-color false (lldb) target create "/Users/buildslave/jenkins/workspace/lldb-cmake-sanitized/lldb-build/tools/lldb/lldb-test-build.noindex/commands/expression/multiline-completion/TestMultilineCompletion.test_basic_completion/a.out" Current executable set to '/Users/buildslave/jenkins/workspace/lldb-cmake-sanitized/lldb-build/tools/lldb/lldb-test-build.noindex/commands/expression/multiline-completion/TestMultilineCompletion.test_basic_completion/a.out' (x86_64). (lldb) b main b main Breakpoint 1: where = a.out`main + 18 at main.c:2:7, address = 0x0000000100000fa2 (lldb) run run Process 20775 launched: '/Users/buildslave/jenkins/workspace/lldb-cmake-sanitized/lldb-build/tools/lldb/lldb-test-build.noindex/commands/expression/multiline-completion/TestMultilineCompletion.test_basic_completion/a.out' (x86_64) Process 20775 stopped * thread #1, queue = 'com.apple.main-thread', stop reason = breakpoint 1.1 frame #0: 0x0000000100000fa2 a.out`main(argc=1, argv=0x00007ffeefbff4d0) at main.c:2:7 1 int main(int argc, char **argv) { -> 2 int to_complete = 0; ^ 3 return to_complete; 4 } (lldb) expr expr Enter expressions, then terminate with an empty line to evaluate: to_  1:  1: to_ to_  1: to_complete

Hide Details

 1: to_complete 2:  2:  (int) $0 = 0 (lldb) settings set interpreter.prompt-on-quit false

Hide Details

Session logs for test failures/errors/unexpected successes will go into directory '/Users/buildslave/jenkins/workspace/lldb-cmake-sanitized/test/logs' Command invoked: /Users/buildslave/jenkins/workspace/lldb-cmake-sanitized/llvm-project/lldb/test/dotest.py --arch=x86_64 -s /Users/buildslave/jenkins/workspace/lldb-cmake-sanitized/lldb-build/lldb-test-traces -S nm -u CXXFLAGS -u CFLAGS --executable /Users/buildslave/jenkins/workspace/lldb-cmake-sanitized/lldb-build/./bin/lldb --dsymutil /Users/buildslave/jenkins/workspace/lldb-cmake-sanitized/lldb-build/./bin/dsymutil --filecheck /Users/buildslave/jenkins/workspace/lldb-cmake-sanitized/lldb-build/./bin/FileCheck -C /Users/buildslave/jenkins/workspace/lldb-cmake-sanitized/host-compiler/bin/clang --codesign-identity lldb_codesign --server /Users/buildslave/jenkins/workspace/lldb-cmake-sanitized/lldb-build/./bin/debugserver --arch x86_64 --build-dir /Users/buildslave/jenkins/workspace/lldb-cmake-sanitized/lldb-build/lldb-test-build.noindex -s=/Users/buildslave/jenkins/workspace/lldb-cmake-sanitized/test/logs -t --env TERM=vt100 --env LLVM_LIBS_DIR=/Users/buildslave/jenkins/workspace/lldb-cmake-sanitized/lldb-build/./lib --build-dir /Users/buildslave/jenkins/workspace/lldb-cmake-sanitized/lldb-build/tools/lldb/lldb-test-build.noindex --module-cache-dir /Users/buildslave/jenkins/workspace/lldb-cmake-sanitized/lldb-build/tools/lldb/lldb-test-build.noindex/module-cache-lldb /Users/buildslave/jenkins/workspace/lldb-cmake-sanitized/llvm-project/lldb/packages/Python/lldbsuite/test/commands/expression/multiline-completion -p TestMultilineCompletion.py Change dir to: /Users/buildslave/jenkins/workspace/lldb-cmake-sanitized/llvm-project/lldb/packages/Python/lldbsuite/test/commands/expression/multiline-completion runCmd: settings set symbols.enable-external-lookup false output:

Hide Details

runCmd: settings set plugin.process.gdb-remote.packet-timeout 60 output:

Hide Details

runCmd: settings set symbols.clang-modules-cache-path "/Users/buildslave/jenkins/workspace/lldb-cmake-sanitized/lldb-build/tools/lldb/lldb-test-build.noindex/module-cache-lldb" output:

Hide Details

runCmd: settings set use-color false output:

Hide Details

FAIL: LLDB (/Users/buildslave/jenkins/workspace/lldb-cmake-sanitized/host-compiler/bin/clang-10-x86_64) :: test_basic_completion (TestMultilineCompletion.MultilineCompletionTest) tearing down the child process....

Hide Details

CLEANUP ERROR: LLDB (/Users/buildslave/jenkins/workspace/lldb-cmake-sanitized/host-compiler/bin/clang-10-x86_64) :: test_basic_completion (TestMultilineCompletion.MultilineCompletionTest) Restore dir to: /Users/buildslave/jenkins/workspace/lldb-cmake-sanitized/lldb-build/tools/lldb/lit ====================================================================== ERROR: test_basic_completion (TestMultilineCompletion.MultilineCompletionTest) Test that we can complete a simple multiline expression ---------------------------------------------------------------------- Traceback (most recent call last): File "/Users/buildslave/jenkins/workspace/lldb-cmake-sanitized/llvm-project/lldb/packages/Python/lldbsuite/test/commands/expression/multiline-completion/TestMultilineCompletion.py", line 30, in test_basic_completion self.quit() File "/Users/buildslave/jenkins/workspace/lldb-cmake-sanitized/llvm-project/lldb/packages/Python/lldbsuite/test/lldbpexpect.py", line 61, in quit self.child.close(force=not gracefully) File "/Users/buildslave/jenkins/workspace/lldb-cmake-sanitized/llvm-project/lldb/third_party/Python/module/pexpect-4.6/pexpect/pty_spawn.py", line 327, in close self.ptyproc.close(force=force) File "/System/Library/Frameworks/Python.framework/Versions/2.7/lib/python2.7/contextlib.py", line 35, in __exit__ self.gen.throw(type, value, traceback) File "/Users/buildslave/jenkins/workspace/lldb-cmake-sanitized/llvm-project/lldb/third_party/Python/module/pexpect-4.6/pexpect/pty_spawn.py", line 25, in _wrap_ptyprocess_err raise ExceptionPexpect(*e.args) ExceptionPexpect: Could not terminate the child. Config=x86_64-/Users/buildslave/jenkins/workspace/lldb-cmake-sanitized/host-compiler/bin/clang-10 ---------------------------------------------------------------------- Ran 1 test in 13.216s

Hide Details

RESULT: FAILED (0 passes, 0 failures, 1 errors, 0 skipped, 0 expected failures, 0 unexpected successes)

Hide Details

******************** PASS: lldb-Unit :: Utility/./UtilityTests/FileSpecTest.EqualDotsPosixRoot (1551 of 1726) PASS: lldb-Unit :: Utility/./UtilityTests/DeserializerTest.HasData (1552 of 1726) PASS: LLDB :: SymbolFile/DWARF/debug-line-basic.s (1553 of 1726) PASS: lldb-Unit :: SymbolFile/DWARF/./SymbolFileDWARFTests/SymbolFileDWARFTests.TestAbbrevValidAttrNullForm (1554 of 1726) PASS: lldb-Unit :: Utility/./UtilityTests/ProcessInfoTest.Constructor (1555 of 1726) PASS: lldb-Suite :: functionalities/process_group/TestChangeProcessGroup.py (1556 of 1726) PASS: LLDB :: Driver/TestRepl.test (1557 of 1726) PASS: LLDB :: SymbolFile/sizeless-symbol.test (1558 of 1726) PASS: lldb-Unit :: Process/gdb-remote/./ProcessGdbRemoteTests/GDBRemoteCommunicationServerTest.SendErrorResponse_StringError (1559 of 1726) PASS: lldb-Unit :: Utility/./UtilityTests/UriParserTest.LongPath (1560 of 1726) PASS: lldb-Unit :: Utility/./UtilityTests/ConstStringTest.format_provider (1561 of 1726) PASS: lldb-Suite :: lang/cpp/class_static/TestStaticVariables.py (1562 of 1726) PASS: lldb-Unit :: Utility/./UtilityTests/StringListTest.CopyListSingle (1563 of 1726) PASS: lldb-Unit :: Utility/./UtilityTests/ArgsTest.TestSingleArg (1564 of 1726) PASS: lldb-Unit :: Utility/./UtilityTests/RangeTest.EqualInvalid (1565 of 1726) PASS: lldb-Unit :: Language/Highlighting/./HighlighterTests/HighlighterTest.DefaultHighlighterWithCursorOutOfBounds (1566 of 1726) PASS: lldb-Unit :: Utility/./UtilityTests/RangeTest.Constructor (1567 of 1726) PASS: lldb-Suite :: commands/expression/import-std-module/basic/TestImportStdModule.py (1568 of 1726) PASS: lldb-Unit :: UnwindAssembly/x86/./UnwindAssemblyx86Tests/Testx86AssemblyInspectionEngine.Test64bitFramelessBigStackFrame (1569 of 1726) PASS: lldb-Unit :: Utility/./UtilityTests/VMRange.ContainsRange (1570 of 1726) PASS: lldb-Unit :: Process/minidump/./LLDBMinidumpTests/MinidumpParserTest.GetExceptionStream (1571 of 1726) PASS: lldb-Suite :: commands/help/TestHelp.py (1572 of 1726) PASS: LLDB :: SymbolFile/Breakpad/line-table-edgecases.test (1573 of 1726) PASS: lldb-Suite :: lang/cpp/class_types/TestClassTypesDisassembly.py (1574 of 1726) PASS: lldb-Suite :: tools/lldb-server/platform-process-connect/TestPlatformProcessConnect.py (1575 of 1726) PASS: LLDB :: Modules/ELF/many-sections.s (1576 of 1726) PASS: lldb-Unit :: Utility/./UtilityTests/BinaryStreamTest.PutSLEB128EightBytes (1577 of 1726) PASS: lldb-Unit :: Utility/./UtilityTests/LogChannelEnabledTest.LogThread (1578 of 1726) PASS: lldb-Suite :: commands/watchpoints/watchpoint_commands/TestWatchpointCommands.py (1579 of 1726) PASS: lldb-Suite :: functionalities/breakpoint/breakpoint_set_restart/TestBreakpointSetRestart.py (1580 of 1726) PASS: lldb-Unit :: Process/gdb-remote/./ProcessGdbRemoteTests/GDBRemoteClientBaseTest.SendContinueAndWait (1581 of 1726) PASS: lldb-Suite :: lang/cpp/offsetof/TestOffsetofCpp.py (1582 of 1726) PASS: LLDB :: BuildScript/toolchain-clang.test (1583 of 1726) PASS: lldb-Unit :: Utility/./UtilityTests/StringListTest.ShiftMove (1584 of 1726) PASS: lldb-Suite :: tools/lldb-server/TestGdbRemoteAuxvSupport.py (1585 of 1726) PASS: lldb-Unit :: Utility/./UtilityTests/RangeTest.NotEqualInvalid (1586 of 1726) PASS: lldb-Suite :: commands/frame/diagnose/dereference-function-return/TestDiagnoseDereferenceFunctionReturn.py (1587 of 1726) PASS: lldb-Unit :: Expression/./ExpressionTests/DiagnosticManagerTest.GetStringMultipleDiags (1588 of 1726) PASS: lldb-Unit :: Utility/./UtilityTests/StringListTest.InsertStringAtIndexStdString (1589 of 1726) PASS: lldb-Unit :: Process/gdb-remote/./ProcessGdbRemoteTests/GDBRemoteClientBaseTest.SendPacketAndReceiveResponseWithOutputSupport (1590 of 1726) PASS: lldb-Suite :: lang/objc/foundation/TestSymbolTable.py (1591 of 1726) PASS: lldb-Suite :: functionalities/breakpoint/cpp/TestCPPBreakpointLocations.py (1592 of 1726) PASS: lldb-Suite :: functionalities/thread/state/TestThreadStates.py (1593 of 1726) PASS: lldb-Unit :: ObjectFile/Breakpad/./ObjectFileBreakpadTests/ModuleRecord.parse (1594 of 1726) PASS: lldb-Unit :: Language/Highlighting/./HighlighterTests/HighlighterTest.ClangScalarLiterals (1595 of 1726) PASS: LLDB :: SymbolFile/Breakpad/line-table-discontinuous-file-ids.test (1596 of 1726) PASS: lldb-Suite :: lang/cpp/global_variables/TestCPPGlobalVariables.py (1597 of 1726) PASS: lldb-Unit :: Language/CPlusPlus/./LanguageCPlusPlusTests/CPlusPlusLanguage.CPlusPlusNameParser (1598 of 1726) PASS: lldb-Unit :: Host/./HostTests/NativeProcessProtocolTest.SetBreakpointFailVerify (1599 of 1726) PASS: lldb-Suite :: types/TestFloatTypes.py (1600 of 1726) PASS: lldb-Unit :: Utility/./UtilityTests/ArgsTest.TestArgv (1601 of 1726) PASS: lldb-Unit :: Utility/./UtilityTests/ArgsTest.TestQuotedTrailingBackslash (1602 of 1726) PASS: lldb-Unit :: Process/minidump/./LLDBMinidumpTests/MinidumpParserTest.GetMemory (1603 of 1726) PASS: lldb-Unit :: Utility/./UtilityTests/StringLexerTest.NextIfList (1604 of 1726) PASS: lldb-Suite :: commands/expression/import-std-module/shared_ptr-dbg-info-content/TestSharedPtrDbgInfoContent.py (1605 of 1726) PASS: lldb-Unit :: Language/Highlighting/./HighlighterTests/HighlighterTest.ClangComments (1606 of 1726) PASS: lldb-Suite :: commands/expression/top-level/TestTopLevelExprs.py (1607 of 1726) PASS: lldb-Suite :: python_api/symbol-context/TestSymbolContext.py (1608 of 1726) PASS: lldb-Unit :: Utility/./UtilityTests/ArgsTest.BareSingleQuote (1609 of 1726) PASS: lldb-Unit :: Utility/./UtilityTests/ArgsTest.TestSingleArgWithQuotedSpace (1610 of 1726) PASS: lldb-Unit :: Process/minidump/./LLDBMinidumpTests/MinidumpParserTest.GetMemoryRegionInfoLinuxMaps (1611 of 1726) PASS: lldb-Suite :: lang/c/vla/TestVLA.py (1612 of 1726) PASS: lldb-Suite :: functionalities/postmortem/minidump-new/TestMiniDumpUUID.py (1613 of 1726) PASS: lldb-Unit :: ScriptInterpreter/Python/./ScriptInterpreterPythonTests/PythonExceptionStateTest.TestResetSemantics (1614 of 1726) PASS: lldb-Unit :: Utility/./UtilityTests/RangeTest.Equal (1615 of 1726) PASS: LLDB :: BuildScript/modes.test (1616 of 1726) PASS: lldb-Suite :: commands/process/attach/attach_denied/TestAttachDenied.py (1617 of 1726) PASS: lldb-Unit :: UnwindAssembly/x86/./UnwindAssemblyx86Tests/Testx86AssemblyInspectionEngine.TestPopEBX (1618 of 1726) PASS: lldb-Suite :: python_api/symbol-context/two-files/TestSymbolContextTwoFiles.py (1619 of 1726) PASS: LLDB :: Expr/TestMultilineExpr.test (1620 of 1726) PASS: lldb-Unit :: Utility/./UtilityTests/StringListTest.AppendList (1621 of 1726) UNSUPPORTED: LLDB :: SymbolFile/PDB/calling-conventions.test (1622 of 1726) PASS: LLDB :: Breakpoint/jitbp_elf.test (1623 of 1726) PASS: lldb-Unit :: Utility/./UtilityTests/ArgsTest.GetQuotedCommandString (1624 of 1726) PASS: lldb-Suite :: lang/cpp/function_refs/TestFunctionRefs.py (1625 of 1726) PASS: lldb-Unit :: Symbol/./SymbolTests/TestClangASTContext.TestUnifyAccessSpecifiers (1626 of 1726) PASS: lldb-Suite :: functionalities/thread/concurrent_events/TestConcurrentDelayWatchBreak.py (1627 of 1726) PASS: lldb-Unit :: Host/./HostTests/SocketTest.UDPConnect (1628 of 1726) PASS: lldb-Unit :: Utility/./UtilityTests/UUIDTest.RelationalOperators (1629 of 1726) PASS: lldb-Unit :: Signals/./SignalsTests/UnixSignalsTest.GetInfo (1630 of 1726) PASS: lldb-Suite :: functionalities/postmortem/minidump/TestMiniDump.py (1631 of 1726) PASS: lldb-Suite :: lang/cpp/char1632_t/TestChar1632T.py (1632 of 1726) PASS: lldb-Unit :: Utility/./UtilityTests/StringListTest.LongestCommonPrefix (1633 of 1726) PASS: lldb-Unit :: Symbol/./SymbolTests/TestClangASTContext.TestGetBasicTypeFromName (1634 of 1726) PASS: lldb-Unit :: Utility/./UtilityTests/StringLexerTest.NextIf (1635 of 1726) PASS: lldb-Unit :: Expression/./ExpressionTests/DiagnosticManagerTest.AppendMessageAttachToLastDiag (1636 of 1726) PASS: lldb-Suite :: commands/command/script/TestCommandScript.py (1637 of 1726) PASS: lldb-Unit :: Utility/./UtilityTests/AnsiTerminal.WhiteSpace (1638 of 1726) PASS: lldb-Suite :: types/TestDoubleTypesExpr.py (1639 of 1726) PASS: lldb-Suite :: functionalities/thread/concurrent_events/TestConcurrentWatchBreak.py (1640 of 1726) PASS: lldb-Unit :: Utility/./UtilityTests/StringLexerTest.Next (1641 of 1726) PASS: lldb-Unit :: Utility/./UtilityTests/StringExtractorTest.InitEmpty (1642 of 1726) PASS: lldb-Suite :: commands/expression/unicode-in-variable/TestUnicodeInVariable.py (1643 of 1726) PASS: lldb-Suite :: python_api/breakpoint/TestBreakpointAPI.py (1644 of 1726) PASS: lldb-Suite :: lang/cpp/namespace_definitions/TestNamespaceDefinitions.py (1645 of 1726) PASS: lldb-Unit :: UnwindAssembly/x86/./UnwindAssemblyx86Tests/Testx86AssemblyInspectionEngine.TestPopRBP (1646 of 1726) PASS: lldb-Suite :: lang/cpp/dynamic-value/TestCppValueCast.py (1647 of 1726) PASS: lldb-Unit :: Process/gdb-remote/./ProcessGdbRemoteTests/GDBRemoteCommunicationClientTest.GetMemoryRegionInfoInvalidResponse (1648 of 1726) PASS: lldb-Unit :: SymbolFile/NativePDB/./SymbolFileNativePDBTests/PDBFPOProgramToDWARFExpressionTests.InvalidAssignmentSingle (1649 of 1726) PASS: lldb-Unit :: Utility/./UtilityTests/StringExtractorTest.GetNameColonValueSuccess (1650 of 1726) PASS: lldb-Suite :: commands/expression/call-throws/TestCallThatThrows.py (1651 of 1726) PASS: lldb-Unit :: Language/Highlighting/./HighlighterTests/HighlighterTest.ClangEmptyInput (1652 of 1726) PASS: lldb-Unit :: Symbol/./SymbolTests/PostfixExpression.ParseOneExpression (1653 of 1726) PASS: LLDB :: SymbolFile/NativePDB/bitfields.cpp (1654 of 1726) PASS: lldb-Unit :: Expression/./ExpressionTests/DiagnosticManagerTest.AppendMessageNoDiag (1655 of 1726) PASS: lldb-Unit :: Process/minidump/./LLDBMinidumpTests/MinidumpParserTest.FindMemoryRangeWithFullMemoryMinidump (1656 of 1726) PASS: lldb-Unit :: Interpreter/./InterpreterTests/OptionArgParserTest.toBoolean (1657 of 1726) PASS: lldb-Suite :: python_api/sbstructureddata/TestStructuredDataAPI.py (1658 of 1726) PASS: lldb-Unit :: Host/./HostTests/HostInfoTest.GetHostname (1659 of 1726) PASS: lldb-Suite :: functionalities/data-formatter/hexcaps/TestDataFormatterHexCaps.py (1660 of 1726) PASS: lldb-Suite :: python_api/disassemble-raw-data/TestDisassembleRawData.py (1661 of 1726) PASS: lldb-Suite :: benchmarks/libcxxlist/TestBenchmarkLibcxxList.py (1662 of 1726) PASS: lldb-Unit :: ScriptInterpreter/Python/./ScriptInterpreterPythonTests/PythonExceptionStateTest.TestAcquisitionSemantics (1663 of 1726) PASS: lldb-Unit :: Utility/./UtilityTests/StringListTest.Clear (1664 of 1726) PASS: lldb-Suite :: functionalities/load_unload/TestLoadUnload.py (1665 of 1726) PASS: lldb-Unit :: Process/gdb-remote/./ProcessGdbRemoteTests/GDBRemoteCommunicationClientTest.SendSignalsToIgnore (1666 of 1726) UNSUPPORTED: LLDB :: SymbolFile/PDB/ast-restore.test (1667 of 1726) PASS: lldb-Unit :: Language/Highlighting/./HighlighterTests/HighlighterTest.ClangSquareBrackets (1668 of 1726) PASS: LLDB :: Expr/TestIRMemoryMap.test (1669 of 1726) PASS: lldb-Unit :: Utility/./UtilityTests/ScalarTest.GetValue (1670 of 1726) PASS: lldb-Suite :: commands/expression/import-std-module/no-std-module/TestMissingStdModule.py (1671 of 1726) PASS: lldb-Suite :: tools/lldb-server/TestGdbRemoteKill.py (1672 of 1726) PASS: lldb-Suite :: lang/objc/foundation/TestRuntimeTypes.py (1673 of 1726) PASS: lldb-Unit :: Process/gdb-remote/./ProcessGdbRemoteTests/GDBRemoteCommunicationClientTest.ReadRegister (1674 of 1726) PASS: lldb-Unit :: Utility/./UtilityTests/StringListTest.GetMaxStringLengthMixed (1675 of 1726) PASS: lldb-Unit :: Symbol/./SymbolTests/DWARFCallFrameInfoTest.Basic_dwarf4 (1676 of 1726) PASS: LLDB :: SymbolFile/DWARF/debug-types-missing-signature.test (1677 of 1726) PASS: LLDB :: Reproducer/TestGDBRemoteRepro.test (1678 of 1726) PASS: lldb-Unit :: Utility/./UtilityTests/UriParserTest.PortOverflow (1679 of 1726) PASS: lldb-Unit :: Utility/./UtilityTests/Flags.Reset (1680 of 1726) PASS: LLDB :: SymbolFile/DWARF/debug_ranges.s (1681 of 1726) PASS: lldb-Unit :: Utility/./UtilityTests/StreamTeeTest.SetStreamAtIndexOutOfBounds (1682 of 1726) PASS: LLDB :: Modules/ELF/section-types.yaml (1683 of 1726) PASS: lldb-Suite :: functionalities/dynamic_value_child_count/TestDynamicValueChildCount.py (1684 of 1726) PASS: LLDB :: SymbolFile/DWARF/find-inline-method.s (1685 of 1726) PASS: lldb-Suite :: api/multiple-targets/TestMultipleTargets.py (1686 of 1726) PASS: lldb-Suite :: lang/objc/modules-inline-functions/TestModulesInlineFunctions.py (1687 of 1726) PASS: lldb-Suite :: commands/expression/import-std-module/unique_ptr-dbg-info-content/TestUniquePtrDbgInfoContent.py (1688 of 1726) PASS: lldb-Suite :: functionalities/memory/cache/TestMemoryCache.py (1689 of 1726) PASS: LLDB :: Quit/TestQuitExitCodeNonInt.test (1690 of 1726) PASS: lldb-Suite :: lang/objc/objc-struct-return/TestObjCStructReturn.py (1691 of 1726) PASS: lldb-Unit :: Process/gdb-remote/./ProcessGdbRemoteTests/GDBRemoteCommunicationClientTest.SendStopTracePacket (1692 of 1726) PASS: lldb-Suite :: functionalities/plugins/python_os_plugin/TestPythonOSPlugin.py (1693 of 1726) PASS: lldb-Unit :: Utility/./UtilityTests/ConstStringTest.CompareStringRef (1694 of 1726) PASS: lldb-Suite :: tools/lldb-server/TestGdbRemoteModuleInfo.py (1695 of 1726) FAIL: lldb-Suite :: commands/gui/basic/TestGuiBasic.py (1696 of 1726) ******************** TEST 'lldb-Suite :: commands/gui/basic/TestGuiBasic.py' FAILED ******************** lldb version 10.0.99 (http://labmaster3.local/git/llvm-project.git revision 66e9f239b5b3b4367eef580696b4e695164f164a) clang revision 1bd58870e5bd715c7bcbd1180bd50c4f4c7663ff llvm revision 1bd58870e5bd715c7bcbd1180bd50c4f4c7663ff LLDB library dir: /Users/buildslave/jenkins/workspace/lldb-cmake-sanitized/lldb-build/bin LLDB import library dir: /Users/buildslave/jenkins/workspace/lldb-cmake-sanitized/lldb-build/bin libstdcxx tests will not be run because: Don't know how to build with libstdcxx on macosx Skipping following debug info categories: ['dwo'] (lldb) settings set symbols.enable-external-lookup false (lldb) settings set plugin.process.gdb-remote.packet-timeout 60 (lldb) settings set symbols.clang-modules-cache-path "/Users/buildslave/jenkins/workspace/lldb-cmake-sanitized/lldb-build/tools/lldb/lldb-test-build.noindex/module-cache-lldb" (lldb) settings set use-color false (lldb) target create "/Users/buildslave/jenkins/workspace/lldb-cmake-sanitized/lldb-build/tools/lldb/lldb-test-build.noindex/commands/gui/basic/TestGuiBasic.test_gui/a.out" Current executable set to '/Users/buildslave/jenkins/workspace/lldb-cmake-sanitized/lldb-build/tools/lldb/lldb-test-build.noindex/commands/gui/basic/TestGuiBasic.test_gui/a.out' (x86_64). (lldb) br set -f main.c -p "// Break here" br set -f main.c -p "// Break here" Breakpoint 1: where = a.out`main + 27 at main.c:3:3, address = 0x0000000100000fab (lldb) run run Process 32353 launched: '/Users/buildslave/jenkins/workspace/lldb-cmake-sanitized/lldb-build/tools/lldb/lldb-test-build.noindex/commands/gui/basic/TestGuiBasic.test_gui/a.out' (x86_64) Process 32353 stopped * thread #1, queue = 'com.apple.main-thread', stop reason = breakpoint 1.1 frame #0: 0x0000000100000fab a.out`main(argc=1, argv=0x00007ffeefbff530) at main.c:3:3 1 int main(int argc, char **argv) { 2 int funky_var_name_that_should_be_rendered = 22; -> 3 return 0; // Break here ^ 4 } (lldb) gui gui (B)0[?7h[?1h=| LLDB (F1) | Target (F2) | Process (F3) | Thread (F4) | View (F5) | Help (F6) | lqq<Sources>qqqqqqqqqqqqqqqqqqqqqqqqqqqqqqqqqqqqqqqqqqqqqqqqqqqqqqqqqqqqqqqqqqqqqqqqqqqqqqqqqqqqqqqqqqqqqqqqqqqqqqqqqqqqqqqqqqqqqqqqqqqqqqqqqqqqqqqqqqqqqqqqqqqqqqqqqqqqqqqqqqqqqqqqqqqqqqqqqqqqqqqqqqqqqqqqqqqqqqqqqqqqqqqqqqqqqqqqqqqqqqqqqqqqqqqqqqqqqqqqqqqqqqqqqqqqqqqqqqqqqqqqqqqqqqqqqqqqqqqqqqqqqqqqqqqqqqqqqqqqqqqqqqqqqqqqqqqqqqqqqqqqqqqqqqqqqqqqqqqqqqqqqqqqqqqqqqqqqqqqqqqqqqqqqqqqqqqqqqqqqqqqqqqklqq<Threads>qqqqqqqqqqqqqqqqqqqqqqqqqqqqqqqqqqqqqqqqqqqqqqqqqqqqqqqqqqqqqqqqqqqqqqqqqqqqqqqqqqqqqqqkx a.out`main xx `qprocess 32353xx 1 x int main(int argc, char **argv) {xxxx 2 x int funky_var_name_that_should_be_rendered = 22;xxxx 3 x` return 0; // Break here <<< Thread 1: breakpoint 1.1 xxxx 4 x }xxxx 5 xxxxxxxxxxxxxxxxxxxxxxxxxxxxxxxxxxxxxxxxxxxxxxxxxxxxxxxxxxxxxxxxxxxxxxxxxxxxxxxxxxxxxxxxxxxxxxxxxxxxxxxxxxxxxxxxxxxxxxxxxxxxxxxxxxxxxxxxxlqq<Help>qqqqqqqqqqqqqqqqqqqqqqqqqqqqqqqqqqqqqqqqqqqqqqqqqqqqqqqqqqqqqqqqqqqqqqqqqqqqqqqkxxxxx Welcome to the LLDB curses GUI.xxxxxxxxxxxx Press the TAB key to change the selected view.xxxxxx Each view has its own keyboard shortcuts, press 'h' to open a dialog to display them. xxxxxxxxxxxx Common key bindings for all views:xxxxxxxxxxxxtab - Select next viewxxxxxxh - Show help dialog with view specific key bindingsxxxxxx, - Page upxxxxxx. - Page downxxxxxxup - Select previousxxxxxxdown - Select nextxxxxxxleft - Unexpand or select parentxxxxxxright - Expandxxxxxx page-up - Page upxxxxxx page-down - Page downxxxxxmqqqqqqqqqqqqqqqqqqqqqqqqqqqqqqqqqqqqqqqqqqqqqqqqqqqqqqqqqqqqqq[Press any key to exit]qqjxxxxxxxxxxxxxxxxxxxxxxxxxxxxxxxxxxxmqqqqqqqqqqqqqqqqqqqqqqqqqqqqqqqqqqqqqqqqqqqqqqqqqqqqqqqqqqqqqqqqqqqqqqqqqqqqqqqqqqqqqqqqqqqqqqqqqqqqqqqqqqqqqqqqqqqqqqqqqqqqqqqqqqqqqqqqqqqqqqqqqqqqqqqqqqqqqqqqqqqqqqqqqqqqqqqqqqqqqqqqqqqqqqqqqqqqqqqqqqqqqqqqqqqqqqqqqqqqqqqqqqqqqqqqqqqqqqqqqqqqqqqqqqqqqqqqqqqqqqqqqqqqqqqqqqqqqqqqqqqqqqqqqqqqqqqqqqqqqqqqqqqqqqqqqqqqqqqqqqqqqqqqqqqqqqqqqqqqqqqqqqqqqqqqqqqqqqqqqqqqqqqqqqqqqqqqqqqqqqqqqqqqqqqqqqqqqqjxxlqq<Variables>qqqqqqqqqqqqqqqqqqqqqqqqqqqqqqqqqqqqqqqqqqqqqqqqqqqqqqqqqqqqqqqqqqqqqqqqqqqqqqqqqqqqqqqqqqqqqqqqqqqqqqqqqqqqqqqqqqqqqqqqqqqqqqqqqqqqqqqqqqqqqqqqqqqqqqqqqqqqqqqqqqqqqqqqqqqqqqqqqqqqqqqqqqqqqqqqqqqqqqqqqqqqqqqqqqqqqqqqqqqqqqqqqqqqqqqqqqqqqqqqqqqqqqqqqqqqqqqqqqqqqqqqqqqqqqqqqqqqqqqqqqqqqqqqqqqqqqqqqqqqqqqqqqqqqqqqqqqqqqqqqqqqqqqqqqqqqqqqqqqqqqqqqqqqqqqqqqqqqqqqqqqqqqqqqqqqqqqqqqqqqqqqqkxxx (int) argc = 1xxxx `q(char **) argv = 0x00007ffeefbff530xxxx (int) funky_var_name_that_should_be_rendered = 22xxxxxxxxxxxxxxxxxxxxxxxxxxxxxxxxxxxxxxxxxxxxxxxxxxxxxxxxxxxxxxxxxxxxxxxxxxxxxxxxxxxxxxxxxxxxxxxxxxxxxxxmqqqqqqqqqqqqqqqqqqqqqqqqqqqqqqqqqqqqqqqqqqqqqqqqqqqqqqqqqqqqqqqqqqqqqqqqqqqqqqqqqqqqqqqqqqqqqqqqqqqqqqqqqqqqqqqqqqqqqqqqqqqqqqqqqqqqqqqqqqqqqqqqqqqqqqqqqqqqqqqqqqqqqqqqqqqqqqqqqqqqqqqqqqqqqqqqqqqqqqqqqqqqqqqqqqqqqqqqqqqqqqqqqqqqqqqqqqqqqqqqqqqqqqqqqqqqqqqqqqqqqqqqqqqqqqqqqqqqqqqqqqqqqqqqqqqqqqqqqqqqqqqqqqqqqqqqqqqqqqqqqqqqqqqqqqqqqqqqqqqqqqqqqqqqqqqqqqqqqqqqqqqqqqqqqqqqqqqqqqqqqqqqqqqqqqqqqqqqqqjmqqqqqqqqqqqqqqqqqqqqqqqqqqqqqqqqqqqqqqqqqqqqqqqqqqqqqqqqqqqqqqqqqqqqqqqqqqqqqqqqqqqqqqqqqqqqqqqqqqjProcess: 32353 stopped Thread: 0x32d5a1 Frame: 0 PC = 0x0000000100000fab lqq<Sources>qqqqqqqqqqqqqqqqqqqqqqqqqqqqqqqqqqqqqqqqqqqqqqqqqqqqqqqqqqqqqqqqqqqqqqqqqqqqqqqqqqqqqqqqqqqqqqqqqqqqqqqqqqqqqqqqqqqqqqqqqqqqqqqqqqqqqqqqqqqqqqqqqqqqqqqqqqqqqqqqqqqqqqqqqqqqqqqqqqqqqqqqqqqqqqqqqqqqqqqqqqqqqqqqqqqqqqqqqqqqqqqqqqqqqqqqqqqqqqqqqqqqqqqqqqqqqqqqqqqqqqqqqqqqqqqqqqqqqqqqqqqqqqqqqqqqqqqqqqqqqqqqqqqqqqqqqqqqqqqqqqqqqqqqqqqqqqqqqqqqqqqqqqqqqqqqqqqqqqqqqqqqqqqqqqqqqqqqqqqqqqqqqqqk xx xx xx xx xx xx xx xx xx xx xx xx xx xx xx xx xx xx xx xx xx xx xx xx xx xx xx xx xx xx xx xx xx xx xx xx xx xx xx x x x  x x  x x  x x x x  x x  x x  x x   x x   x x   x x   x x   x x   x x   x x   x x  x x  x x x xx xx xx xx xx xx xx xx mqqqqqqqqqqqqqqqqqqqqqqqqqqqqqqqqqqqqqqqqqqqqqqqqqqqqqqqqqqqqqqqqqqqqqqqqqqqqqqqqqqqqqqqqqqqqqqqqqqqqqqqqqqqqqqqqqqqqqqqqqqqqqqqqqqqqqqqqqqqqqqqqqqqqqqqqqqqqqqqqqqqqqqqqqqqqqqqqqqqqqqqqqqqqqqqqqqqqqqqqqqqqqqqqqqqqqqqqqqqqqqqqqqqqqqqqqqqqqqqqqqqqqqqqqqqqqqqqqqqqqqqqqqqqqqqqqqqqqqqqqqqqqqqqqqqqqqqqqqqqqqqqqqqqqqqqqqqqqqqqqqqqqqqqqqqqqqqqqqqqqqqqqqqqqqqqqqqqqqqqqqqqqqqqqqqqqqqqqqqqqqqqqqqqqqqqqqqqqqj [?1l>(lldb) gui gui (B)0[?7h[?1h=| LLDB (F1) | Target (F2) | Process (F3) | Thread (F4) | View (F5) | Help (F6) | lqq<Sources>qqqqqqqqqqqqqqqqqqqqqqqqqqqqqqqqqqqqqqqqqqqqqqqqqqqqqqqqqqqqqqqqqqqqqqqqqqqqqqqqqqqqqqqqqqqqqqqqqqqqqqqqqqqqqqqqqqqqqqqqqqqqqqqqqqqqqqqqqqqqqqqqqqqqqqqqqqqqqqqqqqqqqqqqqqqqqqqqqqqqqqqqqqqqqqqqqqqqqqqqqqqqqqqqqqqqqqqqqqqqqqqqqqqqqqqqqqqqqqqqqqqqqqqqqqqqqqqqqqqqqqqqqqqqqqqqqqqqqqqqqqqqqqqqqqqqqqqqqqqqqqqqqqqqqqqqqqqqqqqqqqqqqqqqqqqqqqqqqqqqqqqqqqqqqqqqqqqqqqqqqqqqqqqqqqqqqqqqqqqqqqqqqqqklqq<Threads>qqqqqqqqqqqqqqqqqqqqqqqqqqqqqqqqqqqqqqqqqqqqqqqqqqqqqqqqqqqqqqqqqqqqqqqqqqqqqqqqqqqqqqqkx a.out`main xx `qprocess 32353xx 1 x int main(int argc, char **argv) {xxxx 2 x int funky_var_name_that_should_be_rendered = 22;xxxx 3 x` return 0; // Break here <<< Thread 1: breakpoint 1.1 xxxx 4 x }xxxx 5 xxxxxxxxxxxxxxxxxxxxxxxxxxxxxxxxxxxxxxxxxxxxxxxxxxxxxxxxxxxxxxxxxxxxxxxxxxxxxxxxxxxxxxxxxxxxxxxxxxxxxxxxxxxxxxxxxxxxxxxxxxxxxxxxxxxxxxxxxxxxxxxxxxxxxxxxxxxxxxxxxxxxxxxxxxxxxxxxxxxxxxxxxxxxxxxxxxxxxxxxxxxxxxxxxxxxxxxxxxxxxxxxxxxxxxxxxxxxxxxxxxxxmqqqqqqqqqqqqqqqqqqqqqqqqqqqqqqqqqqqqqqqqqqqqqqqqqqqqqqqqqqqqqqqqqqqqqqqqqqqqqqqqqqqqqqqqqqqqqqqqqqqqqqqqqqqqqqqqqqqqqqqqqqqqqqqqqqqqqqqqqqqqqqqqqqqqqqqqqqqqqqqqqqqqqqqqqqqqqqqqqqqqqqqqqqqqqqqqqqqqqqqqqqqqqqqqqqqqqqqqqqqqqqqqqqqqqqqqqqqqqqqqqqqqqqqqqqqqqqqqqqqqqqqqqqqqqqqqqqqqqqqqqqqqqqqqqqqqqqqqqqqqqqqqqqqqqqqqqqqqqqqqqqqqqqqqqqqqqqqqqqqqqqqqqqqqqqqqqqqqqqqqqqqqqqqqqqqqqqqqqqqqqqqqqqqqqqqqqqqqqqjxxlqq<Variables>qqqqqqqqqqqqqqqqqqqqqqqqqqqqqqqqqqqqqqqqqqqqqqqqqqqqqqqqqqqqqqqqqqqqqqqqqqqqqqqqqqqqqqqqqqqqqqqqqqqqqqqqqqqqqqqqqqqqqqqqqqqqqqqqqqqqqqqqqqqqqqqqqqqqqqqqqqqqqqqqqqqqqqqqqqqqqqqqqqqqqqqqqqqqqqqqqqqqqqqqqqqqqqqqqqqqqqqqqqqqqqqqqqqqqqqqqqqqqqqqqqqqqqqqqqqqqqqqqqqqqqqqqqqqqqqqqqqqqqqqqqqqqqqqqqqqqqqqqqqqqqqqqqqqqqqqqqqqqqqqqqqqqqqqqqqqqqqqqqqqqqqqqqqqqqqqqqqqqqqqqqqqqqqqqqqqqqqqqqqqqqqqqkxxx (int) argc = 1xxxx `q(char **) argv = 0x00007ffeefbff530xxxx (int) funky_var_name_that_should_be_rendered = 22xxxxxxxxxxxxxxxxxxxxxxxxxxxxxxxxxxxxxxxxxxxxxxxxxxxxxxxxxxxxxxxxxxxxxxxxxxxxxxxxxxxxxxxxxxxxxxxxxxxxxxxmqqqqqqqqqqqqqqqqqqqqqqqqqqqqqqqqqqqqqqqqqqqqqqqqqqqqqqqqqqqqqqqqqqqqqqqqqqqqqqqqqqqqqqqqqqqqqqqqqqqqqqqqqqqqqqqqqqqqqqqqqqqqqqqqqqqqqqqqqqqqqqqqqqqqqqqqqqqqqqqqqqqqqqqqqqqqqqqqqqqqqqqqqqqqqqqqqqqqqqqqqqqqqqqqqqqqqqqqqqqqqqqqqqqqqqqqqqqqqqqqqqqqqqqqqqqqqqqqqqqqqqqqqqqqqqqqqqqqqqqqqqqqqqqqqqqqqqqqqqqqqqqqqqqqqqqqqqqqqqqqqqqqqqqqqqqqqqqqqqqqqqqqqqqqqqqqqqqqqqqqqqqqqqqqqqqqqqqqqqqqqqqqqqqqqqqqqqqqqqjmqqqqqqqqqqqqqqqqqqqqqqqqqqqqqqqqqqqqqqqqqqqqqqqqqqqqqqqqqqqqqqqqqqqqqqqqqqqqqqqqqqqqqqqqqqqqqqqqqqjProcess: 32353 stopped Thread: 0x32d5a1 Frame: 0 PC = 0x0000000100000fab [?1l>(lldb) settings set interpreter.prompt-on-quit false

Hide Details

Session logs for test failures/errors/unexpected successes will go into directory '/Users/buildslave/jenkins/workspace/lldb-cmake-sanitized/test/logs' Command invoked: /Users/buildslave/jenkins/workspace/lldb-cmake-sanitized/llvm-project/lldb/test/dotest.py --arch=x86_64 -s /Users/buildslave/jenkins/workspace/lldb-cmake-sanitized/lldb-build/lldb-test-traces -S nm -u CXXFLAGS -u CFLAGS --executable /Users/buildslave/jenkins/workspace/lldb-cmake-sanitized/lldb-build/./bin/lldb --dsymutil /Users/buildslave/jenkins/workspace/lldb-cmake-sanitized/lldb-build/./bin/dsymutil --filecheck /Users/buildslave/jenkins/workspace/lldb-cmake-sanitized/lldb-build/./bin/FileCheck -C /Users/buildslave/jenkins/workspace/lldb-cmake-sanitized/host-compiler/bin/clang --codesign-identity lldb_codesign --server /Users/buildslave/jenkins/workspace/lldb-cmake-sanitized/lldb-build/./bin/debugserver --arch x86_64 --build-dir /Users/buildslave/jenkins/workspace/lldb-cmake-sanitized/lldb-build/lldb-test-build.noindex -s=/Users/buildslave/jenkins/workspace/lldb-cmake-sanitized/test/logs -t --env TERM=vt100 --env LLVM_LIBS_DIR=/Users/buildslave/jenkins/workspace/lldb-cmake-sanitized/lldb-build/./lib --build-dir /Users/buildslave/jenkins/workspace/lldb-cmake-sanitized/lldb-build/tools/lldb/lldb-test-build.noindex --module-cache-dir /Users/buildslave/jenkins/workspace/lldb-cmake-sanitized/lldb-build/tools/lldb/lldb-test-build.noindex/module-cache-lldb /Users/buildslave/jenkins/workspace/lldb-cmake-sanitized/llvm-project/lldb/packages/Python/lldbsuite/test/commands/gui/basic -p TestGuiBasic.py Change dir to: /Users/buildslave/jenkins/workspace/lldb-cmake-sanitized/llvm-project/lldb/packages/Python/lldbsuite/test/commands/gui/basic runCmd: settings set symbols.enable-external-lookup false output:

Hide Details

runCmd: settings set plugin.process.gdb-remote.packet-timeout 60 output:

Hide Details

runCmd: settings set symbols.clang-modules-cache-path "/Users/buildslave/jenkins/workspace/lldb-cmake-sanitized/lldb-build/tools/lldb/lldb-test-build.noindex/module-cache-lldb" output:

Hide Details

runCmd: settings set use-color false output:

Hide Details

FAIL: LLDB (/Users/buildslave/jenkins/workspace/lldb-cmake-sanitized/host-compiler/bin/clang-10-x86_64) :: test_gui (TestGuiBasic.BasicGuiCommandTest) tearing down the child process....

Hide Details

CLEANUP ERROR: LLDB (/Users/buildslave/jenkins/workspace/lldb-cmake-sanitized/host-compiler/bin/clang-10-x86_64) :: test_gui (TestGuiBasic.BasicGuiCommandTest) Restore dir to: /Users/buildslave/jenkins/workspace/lldb-cmake-sanitized/lldb-build/tools/lldb/lit ====================================================================== ERROR: test_gui (TestGuiBasic.BasicGuiCommandTest) ---------------------------------------------------------------------- Traceback (most recent call last): File "/Users/buildslave/jenkins/workspace/lldb-cmake-sanitized/llvm-project/lldb/packages/Python/lldbsuite/test/commands/gui/basic/TestGuiBasic.py", line 60, in test_gui self.quit() File "/Users/buildslave/jenkins/workspace/lldb-cmake-sanitized/llvm-project/lldb/packages/Python/lldbsuite/test/lldbpexpect.py", line 61, in quit self.child.close(force=not gracefully) File "/Users/buildslave/jenkins/workspace/lldb-cmake-sanitized/llvm-project/lldb/third_party/Python/module/pexpect-4.6/pexpect/pty_spawn.py", line 327, in close self.ptyproc.close(force=force) File "/System/Library/Frameworks/Python.framework/Versions/2.7/lib/python2.7/contextlib.py", line 35, in __exit__ self.gen.throw(type, value, traceback) File "/Users/buildslave/jenkins/workspace/lldb-cmake-sanitized/llvm-project/lldb/third_party/Python/module/pexpect-4.6/pexpect/pty_spawn.py", line 25, in _wrap_ptyprocess_err raise ExceptionPexpect(*e.args) ExceptionPexpect: Could not terminate the child. Config=x86_64-/Users/buildslave/jenkins/workspace/lldb-cmake-sanitized/host-compiler/bin/clang-10 ---------------------------------------------------------------------- Ran 1 test in 10.895s

Hide Details

RESULT: FAILED (0 passes, 0 failures, 1 errors, 0 skipped, 0 expected failures, 0 unexpected successes)

Hide Details

******************** PASS: lldb-Suite :: lang/cpp/virtual-overload/TestVirtualOverload.py (1697 of 1726) PASS: lldb-Suite :: lang/cpp/const_this/TestConstThis.py (1698 of 1726) PASS: lldb-Suite :: functionalities/unwind/sigtramp/TestSigtrampUnwind.py (1699 of 1726) PASS: lldb-Unit :: Host/./HostTests/NativeProcessProtocolTest.ReadCStringFromMemory_CrossPageBoundary (1700 of 1726) PASS: lldb-Suite :: commands/disassemble/basic/TestDisassembleBreakpoint.py (1701 of 1726) PASS: lldb-Suite :: functionalities/dead-strip/TestDeadStrip.py (1702 of 1726) PASS: lldb-Unit :: Host/./HostTests/FileSystemTest.Exists (1703 of 1726) PASS: lldb-Suite :: commands/register/register/intel_xtended_registers/mpx_bound_violation/TestBoundViolation.py (1704 of 1726) PASS: lldb-Unit :: Utility/./UtilityTests/RangeTest.DoesIntersect (1705 of 1726) PASS: lldb-Unit :: UnwindAssembly/x86/./UnwindAssemblyx86Tests/Testx86AssemblyInspectionEngine.TestSimple64bitFrameFunction (1706 of 1726) PASS: lldb-Unit :: Utility/./UtilityTests/StringListTest.GetMaxStringLengthEqualSize (1707 of 1726) PASS: lldb-Suite :: lang/c/enum_types/TestEnumTypes.py (1708 of 1726) PASS: lldb-Unit :: Utility/./UtilityTests/StreamTest.ShiftOperatorPtr (1709 of 1726) PASS: lldb-Unit :: Utility/./UtilityTests/VMRange.Reset (1710 of 1726) PASS: lldb-Unit :: Utility/./UtilityTests/FileSpecTest.FormatFileSpec (1711 of 1726) PASS: lldb-Suite :: functionalities/target_var/TestTargetVar.py (1712 of 1726) PASS: lldb-Suite :: python_api/exprpath_synthetic/TestExprPathSynthetic.py (1713 of 1726) PASS: LLDB :: Reproducer/Functionalities/TestDataFormatter.test (1714 of 1726) PASS: LLDB :: ExecControl/StopHook/stop-hook.test (1715 of 1726) PASS: LLDB :: SymbolFile/DWARF/compilercontext.ll (1716 of 1726) PASS: lldb-Suite :: commands/expression/cast_int_to_anonymous_enum/TestCastIntToAnonymousEnum.py (1717 of 1726) PASS: lldb-Suite :: lang/c/register_variables/TestRegisterVariables.py (1718 of 1726) PASS: lldb-Suite :: functionalities/thread/step_out/TestThreadStepOut.py (1719 of 1726) PASS: lldb-Suite :: lang/objc/objc-dynamic-value/TestObjCDynamicValue.py (1720 of 1726) PASS: lldb-Suite :: functionalities/breakpoint/breakpoint_by_line_and_column/TestBreakpointByLineAndColumn.py (1721 of 1726) PASS: lldb-Suite :: driver/batch_mode/TestBatchMode.py (1722 of 1726) PASS: lldb-Suite :: lang/cpp/namespace/TestNamespaceLookup.py (1723 of 1726) PASS: lldb-Suite :: api/check_public_api_headers/TestPublicAPIHeaders.py (1724 of 1726) PASS: lldb-Suite :: lang/objc/hidden-ivars/TestHiddenIvars.py (1725 of 1726) TIMEOUT: lldb-Suite :: lang/objc/foundation/TestFoundationDisassembly.py (1726 of 1726) ******************** TEST 'lldb-Suite :: lang/objc/foundation/TestFoundationDisassembly.py' FAILED ******************** Reached timeout of 1200 seconds ******************** Testing Time: 1943.65s ******************** Failing Tests (5): lldb-Suite :: tools/lldb-server/TestLldbGdbServer.py lldb-Suite :: functionalities/gdb_remote_client/TestGDBRemoteLoad.py lldb-Suite :: functionalities/gdb_remote_client/TestThreadSelectionBug.py lldb-Suite :: commands/expression/multiline-completion/TestMultilineCompletion.py lldb-Suite :: commands/gui/basic/TestGuiBasic.py

Hide Details

******************** Timed Out Tests (1): lldb-Suite :: lang/objc/foundation/TestFoundationDisassembly.py

Hide Details

Hide Details

Slowest Tests: -------------------------------------------------------------------------- 122.80s: lldb-Suite :: lang/cpp/namespace/TestNamespaceLookup.py 130.72s: lldb-Suite :: lang/c/anonymous/TestAnonymous.py 132.58s: lldb-Suite :: functionalities/gdb_remote_client/TestGDBRemoteLoad.py 135.29s: lldb-Suite :: commands/target/basic/TestTargetCommand.py 138.29s: lldb-Suite :: lang/objc/objc-new-syntax/TestObjCNewSyntaxArray.py 141.60s: lldb-Suite :: functionalities/inferior-crashing/TestInferiorCrashingStep.py 141.79s: lldb-Suite :: lang/objc/objc-new-syntax/TestObjCNewSyntaxDictionary.py 150.40s: lldb-Suite :: functionalities/recursion/TestValueObjectRecursion.py 153.80s: lldb-Suite :: lang/objc/hidden-ivars/TestHiddenIvars.py 160.18s: lldb-Suite :: lang/objc/exceptions/TestObjCExceptions.py 171.48s: lldb-Suite :: functionalities/return-value/TestReturnValue.py 177.61s: lldb-Suite :: lang/objc/objc-new-syntax/TestObjCNewSyntaxLiteral.py 192.31s: lldb-Suite :: functionalities/load_unload/TestLoadUnload.py 193.47s: lldb-Suite :: lang/objc/foundation/TestObjCMethods.py 197.65s: lldb-Suite :: lang/cpp/enum_types/TestCPP11EnumTypes.py 207.79s: lldb-Suite :: tools/lldb-server/TestLldbGdbServer.py 227.23s: lldb-Suite :: api/multithreaded/TestMultithreaded.py 400.46s: lldb-Suite :: types/TestIntegerTypes.py 518.91s: lldb-Suite :: types/TestIntegerTypesExpr.py 1200.66s: lldb-Suite :: lang/objc/foundation/TestFoundationDisassembly.py

Hide Details

Tests Times: -------------------------------------------------------------------------- [ Range ] :: [ Percentage ] :: [ Count ] -------------------------------------------------------------------------- [ 0s, 100s) :: [*************************************** ] :: [1702/1726] [ 100s, 200s) :: [ ] :: [ 16/1726] [ 200s, 300s) :: [ ] :: [ 5/1726] [ 300s, 400s) :: [ ] :: [ 0/1726] [ 400s, 500s) :: [ ] :: [ 1/1726] [ 500s, 600s) :: [ ] :: [ 1/1726] [ 600s, 700s) :: [ ] :: [ 0/1726] [ 700s, 800s) :: [ ] :: [ 0/1726] [ 800s, 900s) :: [ ] :: [ 0/1726] [ 900s,1000s) :: [ ] :: [ 0/1726] [1000s,1100s) :: [ ] :: [ 0/1726] [1100s,1200s) :: [ ] :: [ 0/1726] [1200s,1300s) :: [ ] :: [ 1/1726] Expected Passes : 1670 Expected Failures : 6 Unsupported Tests : 44 Unexpected Failures: 5 Individual Timeouts: 1 FAILED: tools/lldb/lit/CMakeFiles/check-lldb-lit cd /Users/buildslave/jenkins/workspace/lldb-cmake-sanitized/lldb-build/tools/lldb/lit && /usr/bin/python /Users/buildslave/jenkins/workspace/lldb-cmake-sanitized/lldb-build/./bin/llvm-lit -v --time-tests --shuffle --xunit-xml-output=/Users/buildslave/jenkins/workspace/lldb-cmake-sanitized/test/results.xml -v --timeout 1200 /Users/buildslave/jenkins/workspace/lldb-cmake-sanitized/lldb-build/tools/lldb/lit ninja: build stopped: subcommand failed. Command failed Command: ['/usr/bin/env', 'TERM=vt100', '/usr/local/bin/ninja', '-v', 'check-lldb'] [Pipeline] } [Pipeline] // timeout [Pipeline] } [Pipeline] // stage [Pipeline] stage [Pipeline] { (Declarative: Post Actions) [Pipeline] scanForIssues No credentials specified [Clang (LLVM based)] Sleeping for 5 seconds due to JENKINS-32191... [Clang (LLVM based)] Parsing console log (workspace: '/Users/buildslave/jenkins/workspace/lldb-cmake-sanitized') [Pipeline] junit Recording test results [Pipeline] } [Pipeline] // stage [Pipeline] } [Pipeline] // withEnv [Pipeline] } [Pipeline] // node [Pipeline] End of Pipeline [BFA] Scanning build for known causes... [BFA] Found failure cause(s): [BFA] Regression test failed from category Test [BFA] Ninja target failed from category Compile [BFA] Done. 0s ERROR: script returned exit code 1 Finished: FAILURE