FailedConsole Output

Skipping 8,068 KB.. Full Log
honTests/PythonDataObjectsTest.TestOwnedReferences (429 of 1726)
PASS: lldb-Unit :: Utility/./UtilityTests/StringExtractorTest.GetNameColonValueSuccess (430 of 1726)
PASS: lldb-Suite :: lang/cpp/dynamic-value/TestCppValueCast.py (431 of 1726)
PASS: lldb-Suite :: functionalities/unwind/noreturn/module-end/TestNoReturnModuleEnd.py (432 of 1726)
PASS: lldb-Unit :: Utility/./UtilityTests/StreamTest.PutHex64ByteOrderBig (433 of 1726)
PASS: lldb-Unit :: Utility/./UtilityTests/StreamTest.PutCharNull (434 of 1726)
PASS: lldb-Unit :: Process/gdb-remote/./ProcessGdbRemoteTests/GDBRemoteClientBaseTest.SendContinueAndAsyncSignal (435 of 1726)
PASS: lldb-Suite :: python_api/file_handle/TestFileHandle.py (436 of 1726)
PASS: lldb-Unit :: Signals/./SignalsTests/UnixSignalsTest.VersionChange (437 of 1726)
PASS: lldb-Unit :: UnwindAssembly/x86/./UnwindAssemblyx86Tests/Testx86AssemblyInspectionEngine.TestPushImm (438 of 1726)
PASS: lldb-Suite :: python_api/findvalue_duplist/TestSBFrameFindValue.py (439 of 1726)
PASS: lldb-Unit :: Utility/./UtilityTests/StringExtractorTest.DecodeHexU8_Underflow (440 of 1726)
PASS: lldb-Suite :: functionalities/gdb_remote_client/TestStopPCs.py (441 of 1726)
PASS: lldb-Suite :: functionalities/thread/concurrent_events/TestConcurrentSignalWatch.py (442 of 1726)
PASS: lldb-Suite :: lang/c/unions/TestUnionMembers.py (443 of 1726)
PASS: lldb-Unit :: Utility/./UtilityTests/StructuredDataTest.ParseJSONFromFile (444 of 1726)
PASS: lldb-Unit :: UnwindAssembly/x86/./UnwindAssemblyx86Tests/Testx86AssemblyInspectionEngine.Test32bitFramelessSmallStackFrame (445 of 1726)
PASS: lldb-Suite :: commands/expression/call-function/TestCallStdStringFunction.py (446 of 1726)
PASS: LLDB :: Reproducer/TestSynchronous.test (447 of 1726)
PASS: lldb-Unit :: Utility/./UtilityTests/ProcessInfoTest.Constructor (448 of 1726)
PASS: LLDB :: SymbolFile/DWARF/find-inline-method.s (449 of 1726)
PASS: lldb-Unit :: Utility/./UtilityTests/StringListTest.InsertStringAtIndexStdString (450 of 1726)
PASS: LLDB :: Quit/TestQuitExitCode30.test (451 of 1726)
PASS: lldb-Suite :: lang/cpp/wchar_t/TestCxxWCharT.py (452 of 1726)
PASS: lldb-Suite :: functionalities/dynamic_value_child_count/TestDynamicValueChildCount.py (453 of 1726)
PASS: lldb-Suite :: functionalities/signal/handle-abrt/TestHandleAbort.py (454 of 1726)
PASS: lldb-Suite :: commands/expression/macros/TestMacros.py (455 of 1726)
PASS: lldb-Suite :: functionalities/breakpoint/serialize/TestBreakpointSerialization.py (456 of 1726)
PASS: lldb-Suite :: functionalities/history/TestHistoryRecall.py (457 of 1726)
PASS: lldb-Unit :: Process/gdb-remote/./ProcessGdbRemoteTests/GDBRemoteCommunicationClientTest.ReadRegister (458 of 1726)
PASS: lldb-Suite :: lang/objc/unicode-string/TestUnicodeString.py (459 of 1726)
PASS: lldb-Unit :: ScriptInterpreter/Python/./ScriptInterpreterPythonTests/PythonDataObjectsTest.TestPythonCallableCheck (460 of 1726)
PASS: lldb-Suite :: commands/watchpoints/watchpoint_commands/command/TestWatchpointCommandLLDB.py (461 of 1726)
PASS: lldb-Suite :: commands/expression/persistent_ptr_update/TestPersistentPtrUpdate.py (462 of 1726)
PASS: lldb-Suite :: commands/watchpoints/watchpoint_size/TestWatchpointSizes.py (463 of 1726)
PASS: lldb-Unit :: Utility/./UtilityTests/StringListTest.GetMaxStringLengthDecreasingSize (464 of 1726)
PASS: lldb-Unit :: Utility/./UtilityTests/StringExtractorTest.GetHexU8_Exact (465 of 1726)
PASS: lldb-Suite :: linux/builtin_trap/TestBuiltinTrap.py (466 of 1726)
PASS: lldb-Unit :: Utility/./UtilityTests/LogChannelEnabledTest.log_options (467 of 1726)
PASS: lldb-Unit :: Utility/./UtilityTests/Flags.Test (468 of 1726)
PASS: lldb-Suite :: sanity/TestModuleCacheSanity.py (469 of 1726)
PASS: lldb-Suite :: lang/objc/objc-new-syntax/TestObjCNewSyntaxDictionary.py (470 of 1726)
PASS: lldb-Suite :: lang/cpp/limit-debug-info/TestWithLimitDebugInfo.py (471 of 1726)
PASS: lldb-Suite :: commands/expression/char/TestExprsChar.py (472 of 1726)
PASS: lldb-Suite :: python_api/sbvalue_const_addrof/TestSBValueConstAddrOf.py (473 of 1726)
PASS: lldb-Suite :: functionalities/breakpoint/source_regexp/TestSourceRegexBreakpoints.py (474 of 1726)
PASS: lldb-Suite :: functionalities/thread/concurrent_events/TestConcurrentCrashWithBreak.py (475 of 1726)
PASS: lldb-Suite :: commands/expression/call-function/TestCallUserDefinedFunction.py (476 of 1726)
PASS: lldb-Unit :: ObjectFile/Breakpad/./ObjectFileBreakpadTests/FileRecord.parse (477 of 1726)
PASS: lldb-Unit :: Symbol/./SymbolTests/TestClangASTContext.TestGetBasicTypeFromName (478 of 1726)
PASS: lldb-Unit :: Utility/./UtilityTests/DataExtractorTest.GetMaxU64 (479 of 1726)
PASS: lldb-Unit :: Utility/./UtilityTests/NameMatchesTest.StartsWith (480 of 1726)
PASS: lldb-Suite :: functionalities/data-formatter/data-formatter-stl/libcxx/string/TestDataFormatterLibcxxString.py (481 of 1726)
PASS: lldb-Unit :: Utility/./UtilityTests/NameMatchesTest.EndsWith (482 of 1726)
PASS: lldb-Suite :: commands/watchpoints/watchpoint_commands/condition/TestWatchpointConditionCmd.py (483 of 1726)
PASS: lldb-Suite :: lang/objc/single-entry-dictionary/TestObjCSingleEntryDictionary.py (484 of 1726)
PASS: LLDB :: Settings/TestFrameFormatNoColor.test (485 of 1726)
PASS: lldb-Unit :: SymbolFile/NativePDB/./SymbolFileNativePDBTests/PDBFPOProgramToDWARFExpressionTests.InvalidAssignmentSingle (486 of 1726)
PASS: lldb-Unit :: Utility/./UtilityTests/Flags.AnyClear (487 of 1726)
PASS: lldb-Unit :: UnwindAssembly/x86/./UnwindAssemblyx86Tests/Testx86AssemblyInspectionEngine.TestSpillRegToStackViaMOVx86_64 (488 of 1726)
PASS: lldb-Unit :: Utility/./UtilityTests/TimerTest.CategoryTimes (489 of 1726)
PASS: lldb-Suite :: lang/objc/rdar-12408181/TestRdar12408181.py (490 of 1726)
PASS: lldb-Unit :: SymbolFile/DWARF/./SymbolFileDWARFTests/SymbolFileDWARFTests.TestAbbrevOrder1Start1 (491 of 1726)
PASS: lldb-Unit :: Process/minidump/./LLDBMinidumpTests/MinidumpParserTest.InvalidMinidump (492 of 1726)
PASS: lldb-Unit :: Host/./HostTests/MainLoopTest.ReadObject (493 of 1726)
PASS: LLDB :: SymbolFile/DWARF/dir-separator-posix.s (494 of 1726)
PASS: lldb-Unit :: Host/./HostTests/SocketTest.TCPListen0ConnectAccept (495 of 1726)
PASS: lldb-Unit :: Symbol/./SymbolTests/TestClangASTContext.TestBuiltinTypeForEncodingAndBitSize (496 of 1726)
PASS: lldb-Suite :: macosx/duplicate-archive-members/TestDuplicateMembers.py (497 of 1726)
PASS: lldb-Unit :: Utility/./UtilityTests/EnvironmentTest.EnvpConstruction (498 of 1726)
PASS: lldb-Unit :: Utility/./UtilityTests/StringExtractorTest.GetNameColonValueNoColon (499 of 1726)
PASS: lldb-Suite :: lang/objc/variadic_methods/TestVariadicMethods.py (500 of 1726)
PASS: lldb-Unit :: Expression/./ExpressionTests/DiagnosticManagerTest.FixedExpression (501 of 1726)
PASS: lldb-Unit :: Utility/./UtilityTests/StringExtractorTest.GetU32BigEndian (502 of 1726)
PASS: lldb-Unit :: Utility/./UtilityTests/StringListTest.SplitIntoLinesSingleTrailingCR (503 of 1726)
PASS: lldb-Unit :: Utility/./UtilityTests/NameMatchesTest.Contains (504 of 1726)
PASS: lldb-Unit :: ObjectFile/Breakpad/./ObjectFileBreakpadTests/FuncRecord.parse (505 of 1726)
PASS: LLDB :: Modules/ELF/PT_LOAD-overlap-PT_INTERP.yaml (506 of 1726)
PASS: lldb-Suite :: commands/expression/function_template_specialization_temp_args/TestFunctionTemplateSpecializationTempArgs.py (507 of 1726)
PASS: lldb-Unit :: Utility/./UtilityTests/StringListTest.LongestCommonPrefixSingleElement (508 of 1726)
PASS: lldb-Suite :: python_api/event/TestEvents.py (509 of 1726)
PASS: lldb-Unit :: Process/minidump/./LLDBMinidumpTests/MinidumpParserTest.FindMemoryRangeWithFullMemoryMinidump (510 of 1726)
PASS: lldb-Unit :: Expression/./ExpressionTests/DiagnosticManagerTest.AppendMessageAttachToLastDiag (511 of 1726)
PASS: lldb-Suite :: lang/objc/objc-static-method-stripped/TestObjCStaticMethodStripped.py (512 of 1726)
PASS: lldb-Suite :: python_api/rdar-12481949/Test-rdar-12481949.py (513 of 1726)
PASS: lldb-Unit :: Utility/./UtilityTests/Flags.GetBitSize (514 of 1726)
PASS: LLDB :: Python/crashlog.test (515 of 1726)
PASS: lldb-Unit :: Utility/./UtilityTests/UUIDTest.StringConverion (516 of 1726)
PASS: lldb-Suite :: python_api/sbtype_typeclass/TestSBTypeTypeClass.py (517 of 1726)
PASS: lldb-Suite :: functionalities/tsan/basic/TestTsanBasic.py (518 of 1726)
PASS: lldb-Suite :: functionalities/thread/concurrent_events/TestConcurrentTwoWatchpointsOneSignal.py (519 of 1726)
PASS: LLDB :: Driver/LocalLLDBInit.test (520 of 1726)
PASS: LLDB :: SymbolFile/Breakpad/line-table-missing-file.test (521 of 1726)
PASS: lldb-Suite :: api/multithreaded/TestMultithreaded.py (522 of 1726)
PASS: lldb-Unit :: Process/gdb-remote/./ProcessGdbRemoteTests/GDBRemoteCommunicationServerTest.SendErrorResponse_StringError (523 of 1726)
PASS: lldb-Suite :: commands/expression/xvalue/TestXValuePrinting.py (524 of 1726)
PASS: lldb-Unit :: Utility/./UtilityTests/StreamTest.ShiftOperatorUInts (525 of 1726)
PASS: lldb-Suite :: functionalities/data-formatter/data-formatter-synthtype/TestDataFormatterSynthType.py (526 of 1726)
PASS: lldb-Suite :: python_api/symbol-context/two-files/TestSymbolContextTwoFiles.py (527 of 1726)
PASS: lldb-Suite :: lang/objc/orderedset/TestOrderedSet.py (528 of 1726)
PASS: lldb-Unit :: Utility/./UtilityTests/ReproducerTest.SetCapture (529 of 1726)
PASS: lldb-Unit :: ObjectFile/Breakpad/./ObjectFileBreakpadTests/LineRecord.parse (530 of 1726)
PASS: lldb-Unit :: Utility/./UtilityTests/AnsiTerminal.KnownPrefix (531 of 1726)
PASS: LLDB :: Breakpoint/single-file-split-dwarf.test (532 of 1726)
PASS: LLDB :: SymbolFile/DWARF/gnu-style-compression.cpp (533 of 1726)
PASS: LLDB :: SymbolFile/Breakpad/line-table-mixed-path-styles.test (534 of 1726)
PASS: lldb-Suite :: tools/lldb-server/TestGdbRemoteModuleInfo.py (535 of 1726)
PASS: lldb-Suite :: functionalities/thread/concurrent_events/TestConcurrentWatchpointWithDelayWatchpointThreads.py (536 of 1726)
PASS: lldb-Suite :: lang/cpp/trivial_abi/TestTrivialABI.py (537 of 1726)
PASS: lldb-Unit :: Utility/./UtilityTests/BinaryStreamTest.PutSLEB128SixBytes (538 of 1726)
PASS: lldb-Suite :: functionalities/breakpoint/breakpoint_by_line_and_column/TestBreakpointByLineAndColumn.py (539 of 1726)
PASS: lldb-Unit :: Utility/./UtilityTests/UriParserTest.BadPort (540 of 1726)
PASS: lldb-Unit :: Utility/./UtilityTests/StreamTest.ShiftOperatorPtr (541 of 1726)
PASS: lldb-Suite :: functionalities/data-formatter/data-formatter-stl/libcxx/function/TestLibCxxFunction.py (542 of 1726)
PASS: lldb-Unit :: Utility/./UtilityTests/StreamTest.ChangingByteOrder (543 of 1726)
PASS: lldb-Unit :: Process/gdb-remote/./ProcessGdbRemoteTests/GDBRemoteCommunicationClientTest.GetModulesInfo_UUID20 (544 of 1726)
PASS: lldb-Unit :: Utility/./UtilityTests/ProcessInstanceInfo.Dump (545 of 1726)
PASS: lldb-Suite :: functionalities/mtc/simple/TestMTCSimple.py (546 of 1726)
PASS: lldb-Suite :: functionalities/target-new-solib-notifications/TestModuleLoadedNotifys.py (547 of 1726)
PASS: lldb-Suite :: functionalities/breakpoint/require_hw_breakpoints/TestRequireHWBreakpoints.py (548 of 1726)
PASS: lldb-Unit :: Host/./HostTests/NativeProcessProtocolTest.SetBreakpointFailRead (549 of 1726)
PASS: lldb-Suite :: lang/cpp/llvm-style/TestLLVMStyle.py (550 of 1726)
PASS: lldb-Suite :: commands/frame/select/TestFrameSelect.py (551 of 1726)
PASS: lldb-Suite :: functionalities/tsan/thread_numbers/TestTsanThreadNumbers.py (552 of 1726)
PASS: lldb-Suite :: commands/process/attach/TestProcessAttach.py (553 of 1726)
PASS: lldb-Unit :: Process/gdb-remote/./ProcessGdbRemoteTests/GDBRemoteClientBaseTest.SendContinueAndLateInterrupt (554 of 1726)
PASS: lldb-Suite :: python_api/value/change_values/TestChangeValueAPI.py (555 of 1726)
PASS: LLDB :: SymbolFile/NativePDB/break-by-function.cpp (556 of 1726)
PASS: lldb-Suite :: commands/expression/import-std-module/vector-dbg-info-content/TestDbgInfoContentVector.py (557 of 1726)
PASS: lldb-Suite :: commands/expression/multiline-completion/TestMultilineCompletion.py (558 of 1726)
PASS: lldb-Suite :: functionalities/breakpoint/breakpoint_conditions/TestBreakpointConditions.py (559 of 1726)
PASS: lldb-Unit :: Utility/./UtilityTests/StatusTest.ErrorConstructor (560 of 1726)
PASS: lldb-Unit :: Utility/./UtilityTests/StreamTeeTest.DefaultConstructor (561 of 1726)
PASS: lldb-Suite :: lang/objc/forward-decl/TestForwardDecl.py (562 of 1726)
PASS: LLDB :: SymbolFile/Breakpad/symtab-macho.test (563 of 1726)
PASS: lldb-Suite :: lang/c/const_variables/TestConstVariables.py (564 of 1726)
PASS: lldb-Suite :: functionalities/thread/concurrent_events/TestConcurrentTwoWatchpointThreads.py (565 of 1726)
PASS: lldb-Unit :: Utility/./UtilityTests/StreamTest.PutPtr (566 of 1726)
PASS: lldb-Suite :: functionalities/thread/concurrent_events/TestConcurrentTwoBreakpointsOneDelaySignal.py (567 of 1726)
PASS: lldb-Unit :: Utility/./UtilityTests/StringListTest.CopyListSingle (568 of 1726)
PASS: lldb-Suite :: functionalities/breakpoint/auto_continue/TestBreakpointAutoContinue.py (569 of 1726)
PASS: lldb-Unit :: Utility/./UtilityTests/RangeTest.ContainsRangeStartingFromZero (570 of 1726)
PASS: lldb-Suite :: arm/breakpoint-it/TestBreakpointIt.py (571 of 1726)
PASS: lldb-Suite :: functionalities/thread/concurrent_events/TestConcurrentManySignals.py (572 of 1726)
PASS: lldb-Unit :: UnwindAssembly/x86/./UnwindAssemblyx86Tests/Testx86AssemblyInspectionEngine.TestSimplei386ugmented (573 of 1726)
UNSUPPORTED: LLDB :: Process/Windows/exception_access_violation.cpp (574 of 1726)
PASS: lldb-Unit :: Utility/./UtilityTests/RangeTest.ContainsRange (575 of 1726)
PASS: lldb-Suite :: lang/c/register_variables/TestRegisterVariables.py (576 of 1726)
PASS: lldb-Unit :: Utility/./UtilityTests/UUIDTest.SetFromStringRef (577 of 1726)
PASS: lldb-Suite :: commands/command/script/import/rdar-12586188/TestRdar12586188.py (578 of 1726)
PASS: lldb-Suite :: functionalities/recursion/TestValueObjectRecursion.py (579 of 1726)
PASS: LLDB :: SymbolFile/DWARF/parallel-indexing-stress.s (580 of 1726)
PASS: LLDB :: SymbolFile/DWARF/find-basic-type.cpp (581 of 1726)
PASS: lldb-Unit :: Language/Highlighting/./HighlighterTests/HighlighterTest.ClangUnterminatedString (582 of 1726)
PASS: lldb-Suite :: macosx/add-dsym/TestAddDsymMidExecutionCommand.py (583 of 1726)
PASS: lldb-Unit :: Utility/./UtilityTests/Predicate.WaitForValueNotEqualTo (584 of 1726)
PASS: lldb-Unit :: ScriptInterpreter/Python/./ScriptInterpreterPythonTests/PythonDataObjectsTest.TestObjectAttributes (585 of 1726)
PASS: lldb-Unit :: Utility/./UtilityTests/BinaryStreamTest.PutSLEB128FiveBytes (586 of 1726)
PASS: lldb-Suite :: tools/lldb-server/TestGdbRemoteAuxvSupport.py (587 of 1726)
PASS: lldb-Unit :: Process/gdb-remote/./ProcessGdbRemoteTests/GDBRemoteCommunicationServerTest.SendErrorResponse_UnimplementedError (588 of 1726)
PASS: lldb-Unit :: Utility/./UtilityTests/ArchSpecTest.MergeFrom (589 of 1726)
PASS: lldb-Suite :: commands/frame/diagnose/inheritance/TestDiagnoseInheritance.py (590 of 1726)
PASS: lldb-Unit :: Utility/./UtilityTests/StreamTest.PutCStringWithStringRef (591 of 1726)
PASS: lldb-Unit :: Utility/./UtilityTests/DataExtractorTest.GetBitfield (592 of 1726)
UNSUPPORTED: LLDB :: BuildScript/toolchain-msvc.test (593 of 1726)
PASS: lldb-Suite :: functionalities/data-formatter/refpointer-recursion/TestDataFormatterRefPtrRecursion.py (594 of 1726)
PASS: lldb-Suite :: tools/lldb-server/libraries-svr4/TestGdbRemoteLibrariesSvr4Support.py (595 of 1726)
PASS: lldb-Suite :: functionalities/tail_call_frames/ambiguous_tail_call_seq2/TestAmbiguousTailCallSeq2.py (596 of 1726)
PASS: lldb-Suite :: lang/cpp/class_static/TestStaticVariables.py (597 of 1726)
PASS: LLDB :: Quit/TestQuitExitCodeHexA.test (598 of 1726)
PASS: lldb-Suite :: commands/apropos/with-process/TestAproposWithProcess.py (599 of 1726)
PASS: lldb-Unit :: Utility/./UtilityTests/BinaryStreamTest.PutSLEB128One (600 of 1726)
PASS: lldb-Suite :: functionalities/data-formatter/dump_dynamic/TestDumpDynamic.py (601 of 1726)
PASS: lldb-Suite :: functionalities/data-formatter/data-formatter-stl/libcxx/multiset/TestDataFormatterLibcxxMultiSet.py (602 of 1726)
PASS: lldb-Unit :: Expression/./ExpressionTests/DiagnosticManagerTest.GetStringNoDiags (603 of 1726)
PASS: LLDB :: Modules/ELF/netbsd-core-amd64.test (604 of 1726)
PASS: lldb-Unit :: Language/Highlighting/./HighlighterTests/HighlighterTest.DefaultHighlighter (605 of 1726)
PASS: LLDB :: Settings/TestFrameFormatColor.test (606 of 1726)
PASS: lldb-Unit :: Utility/./UtilityTests/StringLexerTest.Next (607 of 1726)
UNSUPPORTED: LLDB :: SymbolFile/PDB/class-layout.test (608 of 1726)
PASS: LLDB :: BuildScript/toolchain-clang.test (609 of 1726)
PASS: lldb-Suite :: functionalities/data-formatter/data-formatter-stl/libcxx/list/TestDataFormatterLibcxxList.py (610 of 1726)
PASS: lldb-Suite :: commands/platform/basic/TestPlatformCommand.py (611 of 1726)
PASS: lldb-Suite :: tools/lldb-server/platform-process-connect/TestPlatformProcessConnect.py (612 of 1726)
PASS: lldb-Unit :: Utility/./UtilityTests/BinaryStreamTest.PutULEB128OneByte (613 of 1726)
PASS: lldb-Suite :: functionalities/inferior-assert/TestInferiorAssert.py (614 of 1726)
PASS: lldb-Unit :: Utility/./UtilityTests/RangeTest.ContainsAddr (615 of 1726)
PASS: lldb-Unit :: Utility/./UtilityTests/ArchSpecTest.TripleComponentsWereSpecified (616 of 1726)
PASS: lldb-Unit :: Utility/./UtilityTests/StringListTest.JoinSingle (617 of 1726)
PASS: lldb-Suite :: functionalities/tail_call_frames/unambiguous_sequence/TestUnambiguousTailCalls.py (618 of 1726)
PASS: lldb-Unit :: Utility/./UtilityTests/ArgsTest.TestTrailingBackslash (619 of 1726)
PASS: lldb-Unit :: Utility/./UtilityTests/AnsiTerminal.WhiteSpace (620 of 1726)
PASS: lldb-Suite :: commands/frame/diagnose/local-variable/TestLocalVariable.py (621 of 1726)
PASS: LLDB :: Modules/PECOFF/subsections.yaml (622 of 1726)
PASS: LLDB :: Unwind/trap_frame_sym_ctx.test (623 of 1726)
PASS: lldb-Unit :: UnwindAssembly/x86/./UnwindAssemblyx86Tests/Testx86AssemblyInspectionEngine.TestSubESP (624 of 1726)
PASS: lldb-Suite :: commands/frame/var-scope/TestFrameVariableScope.py (625 of 1726)
PASS: LLDB :: SymbolFile/Breakpad/unwind-via-stack-cfi.test (626 of 1726)
PASS: lldb-Suite :: lang/cpp/global_variables/TestCPPGlobalVariables.py (627 of 1726)
PASS: lldb-Unit :: SymbolFile/DWARF/./SymbolFileDWARFTests/SymbolFileDWARFTests.TestAbilitiesForDWARF (628 of 1726)
PASS: LLDB :: Unwind/eh-frame-dwarf-unwind.test (629 of 1726)
PASS: lldb-Unit :: Host/./HostTests/MainLoopTest.DetectsEOF (630 of 1726)
PASS: lldb-Suite :: functionalities/data-formatter/data-formatter-stl/libcxx/atomic/TestLibCxxAtomic.py (631 of 1726)
PASS: lldb-Suite :: commands/help/TestHelp.py (632 of 1726)
PASS: lldb-Unit :: Utility/./UtilityTests/StreamTeeTest.AppendStream (633 of 1726)
PASS: lldb-Unit :: Utility/./UtilityTests/BinaryStreamTest.PutSLEB128FourBytes (634 of 1726)
PASS: LLDB :: SymbolFile/Breakpad/symtab.test (635 of 1726)
PASS: lldb-Unit :: Language/Highlighting/./HighlighterTests/HighlighterTest.ClangSquareBrackets (636 of 1726)
PASS: lldb-Unit :: Expression/./ExpressionTests/DiagnosticManagerTest.GetStringMultipleDiags (637 of 1726)
PASS: lldb-Suite :: lang/c/array_types/TestArrayTypes.py (638 of 1726)
PASS: lldb-Suite :: functionalities/breakpoint/address_breakpoints/TestBadAddressBreakpoints.py (639 of 1726)
PASS: lldb-Suite :: commands/expression/unicode-in-variable/TestUnicodeInVariable.py (640 of 1726)
PASS: LLDB :: SymbolFile/DWARF/debug_loc.s (641 of 1726)
PASS: lldb-Unit :: Utility/./UtilityTests/StringExtractorTest.GetHexU8_InvalidHex (642 of 1726)
PASS: lldb-Suite :: lang/cpp/function_refs/TestFunctionRefs.py (643 of 1726)
PASS: lldb-Suite :: lang/objc/rdar-10967107/TestRdar10967107.py (644 of 1726)
PASS: lldb-Unit :: Expression/./ExpressionTests/DiagnosticManagerTest.AddDiagnostic (645 of 1726)
PASS: lldb-Unit :: Utility/./UtilityTests/UriParserTest.SchemeHostSeparator3 (646 of 1726)
PASS: lldb-Unit :: Utility/./UtilityTests/JSONTest.Newlines (647 of 1726)
PASS: lldb-Unit :: Process/minidump/./LLDBMinidumpTests/MinidumpParserTest.MinidumpModuleOrder (648 of 1726)
PASS: lldb-Unit :: Language/Highlighting/./HighlighterTests/HighlighterTest.ClangCursorPosAfterOtherToken (649 of 1726)
PASS: LLDB :: Modules/ELF/base-address.yaml (650 of 1726)
PASS: LLDB :: Breakpoint/debug_rnglist_basic.test (651 of 1726)
PASS: lldb-Unit :: UnwindAssembly/x86/./UnwindAssemblyx86Tests/Testx86AssemblyInspectionEngine.TestReturnDetect (652 of 1726)
PASS: LLDB :: Modules/ELF/PT_LOAD-empty.yaml (653 of 1726)
PASS: LLDB :: SymbolFile/DWARF/dwarf5-index-is-used.cpp (654 of 1726)
PASS: lldb-Suite :: lang/cpp/class-template-parameter-pack/TestClassTemplateParameterPack.py (655 of 1726)
PASS: lldb-Unit :: Utility/./UtilityTests/AnsiTerminal.Empty (656 of 1726)
PASS: lldb-Unit :: Utility/./UtilityTests/UriParserTest.BracketedHostnameWithColon (657 of 1726)
PASS: lldb-Unit :: Utility/./UtilityTests/RangeTest.Union (658 of 1726)
PASS: lldb-Suite :: lang/cpp/incomplete-types/TestCppIncompleteTypes.py (659 of 1726)
PASS: lldb-Unit :: Interpreter/./InterpreterTests/OptionArgParserTest.toChar (660 of 1726)
UNSUPPORTED: LLDB :: Unwind/eh-frame-small-fde.test (661 of 1726)
PASS: lldb-Unit :: Utility/./UtilityTests/RangeTest.Equal (662 of 1726)
PASS: lldb-Unit :: Utility/./UtilityTests/ScalarTest.ExtractBitfield (663 of 1726)
PASS: LLDB :: Modules/ELF/PT_TLS-overlap-PT_LOAD.yaml (664 of 1726)
PASS: LLDB :: Settings/TestSettingsWrite.test (665 of 1726)
PASS: lldb-Suite :: commands/expression/call-overridden-method/TestCallOverriddenMethod.py (666 of 1726)
PASS: lldb-Unit :: Utility/./UtilityTests/StreamTeeTest.GetStreamAtIndexOutOfBoundsEmpty (667 of 1726)
PASS: LLDB :: SymbolFile/DWARF/debug-types-dwo-cross-reference.cpp (668 of 1726)
PASS: lldb-Unit :: Utility/./UtilityTests/TimerTest.CategoryTimesNested (669 of 1726)
PASS: lldb-Suite :: functionalities/thread/concurrent_events/TestConcurrentBreakpointDelayBreakpointOneSignal.py (670 of 1726)
PASS: lldb-Suite :: functionalities/var_path/TestVarPath.py (671 of 1726)
PASS: lldb-Suite :: python_api/frame/get-variables/TestGetVariables.py (672 of 1726)
PASS: lldb-Unit :: ScriptInterpreter/Python/./ScriptInterpreterPythonTests/PythonDataObjectsTest.TestPythonFile (673 of 1726)
PASS: lldb-Suite :: lang/objc/blocks/TestObjCIvarsInBlocks.py (674 of 1726)
PASS: lldb-Suite :: lang/cpp/template-function/TestTemplateFunctions.py (675 of 1726)
PASS: lldb-Suite :: python_api/lldbutil/TestSwigVersion.py (676 of 1726)
PASS: lldb-Suite :: functionalities/darwin_log/filter/exact_match/message/TestDarwinLogFilterMatchMessage.py (677 of 1726)
PASS: lldb-Unit :: Utility/./UtilityTests/ArgsTest.TestSingleArgWithQuotedSpace (678 of 1726)
UNSUPPORTED: LLDB :: Register/x86-ymm-read.test (679 of 1726)
PASS: lldb-Unit :: Utility/./UtilityTests/ConstStringTest.CompareConstString (680 of 1726)
PASS: LLDB :: SymbolFile/DWARF/deterministic-build.cpp (681 of 1726)
PASS: LLDB :: Quit/TestQuitExitCodeTooManyArgs.test (682 of 1726)
PASS: lldb-Suite :: lang/cpp/thread_local/TestThreadLocal.py (683 of 1726)
PASS: lldb-Unit :: SymbolFile/NativePDB/./SymbolFileNativePDBTests/PDBFPOProgramToDWARFExpressionTests.UnresolvedDependentCyclicRegisterAssignmentReference (684 of 1726)
PASS: lldb-Unit :: UnwindAssembly/x86/./UnwindAssemblyx86Tests/Testx86AssemblyInspectionEngine.Test32bitFramelessBigStackFrame (685 of 1726)
PASS: lldb-Unit :: Utility/./UtilityTests/StringExtractorTest.GetU64BigEndian (686 of 1726)
PASS: lldb-Suite :: functionalities/inferior-changed/TestInferiorChanged.py (687 of 1726)
PASS: lldb-Suite :: functionalities/data-formatter/data-formatter-objc/TestDataFormatterObjCNSBundle.py (688 of 1726)
PASS: lldb-Suite :: tools/lldb-vscode/stackTrace/TestVSCode_stackTrace.py (689 of 1726)
PASS: lldb-Unit :: Utility/./UtilityTests/NameMatchesTest.Equals (690 of 1726)
PASS: LLDB :: Modules/ELF/netbsd-exec-8.99.30-amd64.yaml (691 of 1726)
PASS: lldb-Suite :: functionalities/data-formatter/data-formatter-stl/libcxx/optional/TestDataFormatterLibcxxOptional.py (692 of 1726)
PASS: lldb-Unit :: debugserver/./debugserverTests/RNBSocket.LoopBackConnectIPv6 (693 of 1726)
PASS: lldb-Unit :: Process/gdb-remote/./ProcessGdbRemoteTests/GDBRemoteCommunicationClientTest.SaveRestoreRegistersNoSuffix (694 of 1726)
PASS: lldb-Unit :: ScriptInterpreter/Python/./ScriptInterpreterPythonTests/PythonDataObjectsTest.TestPythonString (695 of 1726)
PASS: lldb-Suite :: lang/objc/objc-property/TestObjCProperty.py (696 of 1726)
PASS: lldb-Unit :: Symbol/./SymbolTests/TestClangASTContext.TestRemoveFastQualifiers (697 of 1726)
PASS: LLDB :: Commands/CommandScriptImmediateOutput/CommandScriptImmediateOutputConsole.test (698 of 1726)
PASS: lldb-Unit :: Utility/./UtilityTests/StringListTest.Clear (699 of 1726)
PASS: lldb-Suite :: api/multiple-targets/TestMultipleTargets.py (700 of 1726)
PASS: LLDB :: SymbolFile/DWARF/find-basic-variable.cpp (701 of 1726)
PASS: lldb-Suite :: functionalities/breakpoint/cpp_exception/TestCPPExceptionBreakpoint.py (702 of 1726)
PASS: lldb-Suite :: functionalities/tsan/cpp_global_location/TestTsanCPPGlobalLocation.py (703 of 1726)
PASS: lldb-Suite :: functionalities/tail_call_frames/thread_step_out_message/TestArtificialFrameStepOutMessage.py (704 of 1726)
PASS: lldb-Suite :: linux/thread/create_during_instruction_step/TestCreateDuringInstructionStep.py (705 of 1726)
PASS: lldb-Suite :: commands/version/TestVersion.py (706 of 1726)
PASS: lldb-Unit :: Utility/./UtilityTests/LogChannelEnabledTest.LLDB_LOG_ERROR (707 of 1726)
PASS: lldb-Suite :: python_api/watchpoint/watchlocation/TestSetWatchlocation.py (708 of 1726)
PASS: lldb-Suite :: commands/expression/import-std-module/unique_ptr-dbg-info-content/TestUniquePtrDbgInfoContent.py (709 of 1726)
PASS: lldb-Suite :: functionalities/data-formatter/data-formatter-stl/libstdcpp/string/TestDataFormatterStdString.py (710 of 1726)
PASS: lldb-Unit :: Utility/./UtilityTests/BinaryStreamTest.PutSLEB128EightBytes (711 of 1726)
PASS: lldb-Unit :: Utility/./UtilityTests/StringLexerTest.GetUnlexed (712 of 1726)
PASS: lldb-Unit :: ScriptInterpreter/Python/./ScriptInterpreterPythonTests/PythonDataObjectsTest.TestPythonInteger (713 of 1726)
PASS: lldb-Suite :: lang/objc/modules-cache/TestClangModulesCache.py (714 of 1726)
PASS: lldb-Suite :: functionalities/paths/TestPaths.py (715 of 1726)
PASS: lldb-Unit :: Utility/./UtilityTests/OptionsWithRawTest.WhitespaceSuffix (716 of 1726)
PASS: lldb-Unit :: Utility/./UtilityTests/StringListTest.AppendListCStringArray (717 of 1726)
PASS: lldb-Unit :: ScriptInterpreter/Python/./ScriptInterpreterPythonTests/PythonDataObjectsTest.TestPythonByteArray (718 of 1726)
PASS: LLDB :: SymbolFile/NativePDB/ast-methods.cpp (719 of 1726)
UNSUPPORTED: LLDB :: ExecControl/StopHook/stop-hook-threads.test (720 of 1726)
PASS: LLDB :: Settings/TestSettingsSet.test (721 of 1726)
PASS: lldb-Suite :: lang/c/stepping/TestThreadStepping.py (722 of 1726)
PASS: lldb-Unit :: SymbolFile/DWARF/./SymbolFileDWARFTests/SymbolFileDWARFTests.TestAbbrevNullAttrValidForm (723 of 1726)
PASS: lldb-Unit :: UnwindAssembly/x86/./UnwindAssemblyx86Tests/Testx86AssemblyInspectionEngine.TestPushEAX (724 of 1726)
PASS: lldb-Unit :: Utility/./UtilityTests/SerializationRountripTest.SerializeDeserializeCString (725 of 1726)
UNSUPPORTED: LLDB :: SymbolFile/DWARF/debug-types-expressions.test (726 of 1726)
PASS: lldb-Suite :: python_api/watchpoint/TestWatchpointIgnoreCount.py (727 of 1726)
PASS: lldb-Suite :: lang/c/shared_lib_stripped_symbols/TestSharedLibStrippedSymbols.py (728 of 1726)
PASS: lldb-Suite :: functionalities/data-formatter/stringprinter/TestStringPrinter.py (729 of 1726)
PASS: lldb-Suite :: lang/objc/objc-struct-argument/TestObjCStructArgument.py (730 of 1726)
PASS: LLDB :: Modules/ELF/section-addresses.yaml (731 of 1726)
PASS: lldb-Unit :: Symbol/./SymbolTests/TestClangASTContext.TestConvertAccessTypeToAccessSpecifier (732 of 1726)
PASS: lldb-Unit :: Utility/./UtilityTests/SerializationRountripTest.SerializeDeserializeObjectReference (733 of 1726)
PASS: lldb-Suite :: functionalities/type_lookup/TestTypeLookup.py (734 of 1726)
PASS: lldb-Unit :: Process/gdb-remote/./ProcessGdbRemoteTests/GDBRemoteClientBaseTest.SendContinueDelegateInterface (735 of 1726)
PASS: lldb-Suite :: functionalities/thread/concurrent_events/TestConcurrentDelayWatchBreak.py (736 of 1726)
PASS: LLDB :: Quit/TestQuitExitCodeNonInt.test (737 of 1726)
PASS: lldb-Unit :: Utility/./UtilityTests/VASprintfTest.NoBufferResize (738 of 1726)
PASS: lldb-Suite :: commands/expression/completion/TestExprCompletion.py (739 of 1726)
PASS: lldb-Unit :: Expression/./ExpressionTests/DiagnosticManagerTest.PutStringMultiple (740 of 1726)
PASS: lldb-Unit :: UnwindAssembly/x86/./UnwindAssemblyx86Tests/Testx86AssemblyInspectionEngine.TestPushEDX (741 of 1726)
UNSUPPORTED: LLDB :: SymbolFile/PDB/enums-layout.test (742 of 1726)
PASS: lldb-Unit :: Language/Highlighting/./HighlighterTests/HighlighterTest.ClangScalarLiterals (743 of 1726)
PASS: LLDB :: SymbolFile/DWARF/find-basic-namespace.cpp (744 of 1726)
PASS: lldb-Unit :: Utility/./UtilityTests/StringExtractorTest.DecodeHexU8_Extra (745 of 1726)
PASS: lldb-Suite :: commands/expression/import-std-module/no-std-module/TestMissingStdModule.py (746 of 1726)
PASS: lldb-Unit :: UnwindAssembly/x86/./UnwindAssemblyx86Tests/Testx86AssemblyInspectionEngine.TestPopR15 (747 of 1726)
PASS: lldb-Unit :: Utility/./UtilityTests/UUIDTest.RelationalOperators (748 of 1726)
PASS: lldb-Suite :: lang/c/modules/TestCModules.py (749 of 1726)
PASS: LLDB :: Modules/Breakpad/discontiguous-sections.test (750 of 1726)
PASS: lldb-Suite :: lang/cpp/frame-var-anon-unions/TestFrameVariableAnonymousUnions.py (751 of 1726)
PASS: lldb-Unit :: Interpreter/./InterpreterTests/CompletionTest.DirCompletionUsername (752 of 1726)
PASS: lldb-Suite :: functionalities/signal/TestSendSignal.py (753 of 1726)
PASS: lldb-Unit :: Utility/./UtilityTests/StringListTest.LongestCommonPrefixDuplicateElement (754 of 1726)
PASS: lldb-Unit :: Utility/./UtilityTests/EventTest.DumpEventDataBytes (755 of 1726)
PASS: lldb-Suite :: commands/expression/dollar-in-variable/TestDollarInVariable.py (756 of 1726)
PASS: lldb-Unit :: Process/gdb-remote/./ProcessGdbRemoteTests/GDBRemoteCommunicationClientTest.GetModulesInfoInvalidResponse (757 of 1726)
PASS: lldb-Unit :: Utility/./UtilityTests/StreamTeeTest.Constructor1Stream (758 of 1726)
PASS: LLDB :: SymbolFile/DWARF/debug_rnglists.s (759 of 1726)
PASS: lldb-Unit :: Symbol/./SymbolTests/TestClangASTContext.TestIsClangType (760 of 1726)
PASS: lldb-Suite :: functionalities/rerun/TestRerun.py (761 of 1726)
PASS: lldb-Unit :: Host/./HostTests/SocketTest.TCPListen0GetPort (762 of 1726)
PASS: lldb-Suite :: functionalities/thread/concurrent_events/TestConcurrentBreakpointOneDelayBreakpointThreads.py (763 of 1726)
PASS: lldb-Unit :: Utility/./UtilityTests/TimeoutTest.Format (764 of 1726)
PASS: lldb-Unit :: ScriptInterpreter/Python/./ScriptInterpreterPythonTests/PythonDataObjectsTest.TestPythonListValueEquality (765 of 1726)
PASS: LLDB :: SymbolFile/DWARF/find-function-regex.cpp (766 of 1726)
PASS: lldb-Unit :: debugserver/./debugserverTests/RNBSocket.LoopBackConnectIPv4 (767 of 1726)
PASS: lldb-Suite :: lang/objc/real-definition/TestRealDefinition.py (768 of 1726)
PASS: lldb-Unit :: Utility/./UtilityTests/StringListTest.SplitIntoLines (769 of 1726)
PASS: lldb-Unit :: Utility/./UtilityTests/ArgsTest.GetQuotedCommandString (770 of 1726)
PASS: lldb-Unit :: ObjectFile/ELF/./ObjectFileELFTests/ObjectFileELFTest.GetModuleSpecifications_EarlySectionHeaders (771 of 1726)
PASS: lldb-Unit :: Utility/./UtilityTests/ArgsTest.StringListConstructor (772 of 1726)
PASS: lldb-Unit :: Utility/./UtilityTests/ConstStringTest.MangledCounterpart (773 of 1726)
PASS: lldb-Suite :: lang/objc/objc-baseclass-sbtype/TestObjCBaseClassSBType.py (774 of 1726)
PASS: lldb-Unit :: Utility/./UtilityTests/OptionsWithRawTest.EmptyArgsOnlySuffix (775 of 1726)
PASS: lldb-Suite :: lang/c/find_struct_type/TestFindStructTypes.py (776 of 1726)
PASS: lldb-Unit :: Symbol/./SymbolTests/SymbolsTest.LocateExecutableSymbolFileForUnknownExecutableAndMissingSymbolFile (777 of 1726)
PASS: LLDB :: Minidump/fb-dump.test (778 of 1726)
PASS: lldb-Unit :: Utility/./UtilityTests/ArchSpecTest.TestParseMachCPUDashSubtypeTripleSimple (779 of 1726)
PASS: lldb-Unit :: ScriptInterpreter/Python/./ScriptInterpreterPythonTests/PythonDataObjectsTest.TestDictionaryResolutionWithDot (780 of 1726)
PASS: lldb-Suite :: python_api/default-constructor/TestDefaultConstructorForAPIObjects.py (781 of 1726)
PASS: lldb-Suite :: functionalities/data-formatter/data-formatter-ptr-to-array/TestPtrToArrayFormatting.py (782 of 1726)
PASS: lldb-Suite :: functionalities/asan/TestMemoryHistory.py (783 of 1726)
PASS: lldb-Suite :: functionalities/postmortem/minidump-new/TestMiniDumpUUID.py (784 of 1726)
PASS: lldb-Unit :: Expression/./ExpressionTests/DiagnosticManagerTest.HasFixits (785 of 1726)
PASS: lldb-Suite :: lang/objc/radar-9691614/TestObjCMethodReturningBOOL.py (786 of 1726)
PASS: lldb-Unit :: Utility/./UtilityTests/FileSpecTest.AppendPathComponent (787 of 1726)
PASS: lldb-Unit :: Process/minidump/./LLDBMinidumpTests/MinidumpParserTest.GetArchitectureWindows (788 of 1726)
PASS: lldb-Unit :: Symbol/./SymbolTests/LineEntryTest.GetSameLineContiguousAddressRangeOneInline (789 of 1726)
PASS: LLDB :: SymbolFile/NativePDB/disassembly.cpp (790 of 1726)
PASS: lldb-Suite :: commands/expression/namespace_local_var_same_name_obj_c/TestNamespaceLocalVarSameNameObjC.py (791 of 1726)
PASS: lldb-Suite :: functionalities/data-formatter/var-in-aggregate-misuse/TestVarInAggregateMisuse.py (792 of 1726)
PASS: lldb-Unit :: Utility/./UtilityTests/BroadcasterTest.BroadcastEvent (793 of 1726)
PASS: LLDB :: Breakpoint/debug_rnglistx_rlex.test (794 of 1726)
PASS: lldb-Unit :: Utility/./UtilityTests/StringExtractorTest.GetU32LittleEndian (795 of 1726)
PASS: lldb-Unit :: UnwindAssembly/x86/./UnwindAssemblyx86Tests/Testx86AssemblyInspectionEngine.TestSubRSP (796 of 1726)
PASS: lldb-Unit :: Utility/./UtilityTests/ArgsTest.TestAppendArg (797 of 1726)
PASS: lldb-Unit :: Utility/./UtilityTests/BinaryStreamTest.PutULEB128SixBytes (798 of 1726)
PASS: lldb-Suite :: commands/expression/import-std-module/queue/TestQueue.py (799 of 1726)
PASS: lldb-Unit :: ScriptInterpreter/Python/./ScriptInterpreterPythonTests/PythonDataObjectsTest.TestPythonDictionaryManipulation (800 of 1726)
PASS: lldb-Unit :: Utility/./UtilityTests/Flags.IsClear (801 of 1726)
PASS: lldb-Unit :: Utility/./UtilityTests/UriParserTest.MinimalPath (802 of 1726)
PASS: lldb-Suite :: lang/c/blocks/TestBlocks.py (803 of 1726)
PASS: lldb-Suite :: lang/objcxx/hide-runtime-values/TestObjCXXHideRuntimeValues.py (804 of 1726)
PASS: lldb-Suite :: python_api/value/empty_class/TestValueAPIEmptyClass.py (805 of 1726)
PASS: lldb-Suite :: functionalities/thread/concurrent_events/TestConcurrentWatchpointDelayWatchpointOneBreakpoint.py (806 of 1726)
UNSUPPORTED: LLDB :: SymbolFile/NativePDB/stack_unwinding01.cpp (807 of 1726)
XFAIL: LLDB :: Register/x86-64-ymm-write.test (808 of 1726)
PASS: lldb-Unit :: SymbolFile/DWARF/./SymbolFileDWARFTests/DWARFASTParserClangTests.TestGetDIEForDeclContextReturnsOnlyMatchingEntries (809 of 1726)
PASS: lldb-Suite :: python_api/process/TestProcessAPI.py (810 of 1726)
PASS: lldb-Unit :: Process/minidump/./LLDBMinidumpTests/MinidumpParserTest.GetMemoryRegionInfo (811 of 1726)
PASS: lldb-Unit :: SymbolFile/NativePDB/./SymbolFileNativePDBTests/PDBFPOProgramToDWARFExpressionTests.MultipleIndependentAssignments (812 of 1726)
PASS: lldb-Unit :: Utility/./UtilityTests/LogChannelTest.EnableOptions (813 of 1726)
UNSUPPORTED: LLDB :: Register/x86-64-ymm16-read.test (814 of 1726)
PASS: lldb-Unit :: SymbolFile/NativePDB/./SymbolFileNativePDBTests/PDBFPOProgramToDWARFExpressionTests.MissingTargetRegister (815 of 1726)
PASS: lldb-Suite :: functionalities/darwin_log/format/TestDarwinLogMessageFormat.py (816 of 1726)
PASS: lldb-Unit :: Utility/./UtilityTests/BinaryStreamTest.PutSLEB128ThreeBytes (817 of 1726)
PASS: lldb-Suite :: tools/lldb-server/TestGdbRemoteProcessInfo.py (818 of 1726)
PASS: lldb-Suite :: functionalities/data-formatter/data-formatter-stl/libcxx/set/TestDataFormatterLibcxxSet.py (819 of 1726)
PASS: lldb-Suite :: functionalities/thread/concurrent_events/TestConcurrentCrashWithWatchpoint.py (820 of 1726)
PASS: lldb-Unit :: Process/minidump/./LLDBMinidumpTests/MinidumpParserTest.GetThreadContext_x86_64 (821 of 1726)
PASS: lldb-Suite :: functionalities/breakpoint/step_over_breakpoint/TestStepOverBreakpoint.py (822 of 1726)
PASS: lldb-Suite :: functionalities/data-formatter/data-formatter-stl/libstdcpp/iterator/TestDataFormatterStdIterator.py (823 of 1726)
PASS: lldb-Suite :: lang/objc/foundation/TestConstStrings.py (824 of 1726)
PASS: lldb-Suite :: types/TestDoubleTypes.py (825 of 1726)
PASS: lldb-Suite :: commands/expression/context-object/TestContextObject.py (826 of 1726)
PASS: lldb-Suite :: python_api/exprpath_synthetic/TestExprPathSynthetic.py (827 of 1726)
PASS: lldb-Suite :: functionalities/data-formatter/data-formatter-categories/TestDataFormatterCategories.py (828 of 1726)
PASS: lldb-Unit :: Utility/./UtilityTests/RangeTest.DoesAdjoinOrIntersect (829 of 1726)
PASS: lldb-Unit :: Utility/./UtilityTests/StreamTest.PutMaxHex64ByteOrderBig (830 of 1726)
PASS: LLDB :: Modules/ELF/PT_LOAD.yaml (831 of 1726)
PASS: lldb-Suite :: functionalities/data-formatter/frameformat_smallstruct/TestFrameFormatSmallStruct.py (832 of 1726)
PASS: lldb-Unit :: Language/Highlighting/./HighlighterTests/HighlighterTest.FallbackHighlighter (833 of 1726)
PASS: lldb-Suite :: lang/cpp/stl/TestSTL.py (834 of 1726)
PASS: lldb-Suite :: functionalities/tsan/global_location/TestTsanGlobalLocation.py (835 of 1726)
PASS: lldb-Suite :: tools/lldb-vscode/breakpoint/TestVSCode_setExceptionBreakpoints.py (836 of 1726)
PASS: lldb-Suite :: functionalities/breakpoint/breakpoint_command/TestBreakpointCommand.py (837 of 1726)
PASS: lldb-Suite :: functionalities/thread/backtrace_limit/TestBacktraceLimit.py (838 of 1726)
PASS: lldb-Unit :: Utility/./UtilityTests/AnsiTerminal.Incomplete (839 of 1726)
PASS: LLDB :: Modules/MachO/lc_version_min.yaml (840 of 1726)
PASS: lldb-Unit :: Utility/./UtilityTests/Predicate.WaitForValueEqualTo (841 of 1726)
PASS: lldb-Unit :: Utility/./UtilityTests/RecordReplayTest.InstrumentedBar (842 of 1726)
PASS: lldb-Unit :: Process/minidump/./LLDBMinidumpTests/MinidumpParserTest.GetFilteredModuleList (843 of 1726)
PASS: lldb-Unit :: Utility/./UtilityTests/SerializationRountripTest.SerializeDeserializePod (844 of 1726)
PASS: lldb-Unit :: Utility/./UtilityTests/RangeTest.DoesIntersect (845 of 1726)
PASS: lldb-Suite :: lang/cpp/inlines/TestInlines.py (846 of 1726)
PASS: lldb-Unit :: Utility/./UtilityTests/ArgsTest.AppendArguments (847 of 1726)
PASS: lldb-Unit :: SymbolFile/NativePDB/./SymbolFileNativePDBTests/PDBFPOProgramToDWARFExpressionTests.InvalidAssignmentMultiple (848 of 1726)
PASS: lldb-Unit :: Utility/./UtilityTests/StringListTest.CopyList (849 of 1726)
PASS: lldb-Unit :: SymbolFile/NativePDB/./SymbolFileNativePDBTests/PDBFPOProgramToDWARFExpressionTests.UnsupportedRASearch (850 of 1726)
PASS: lldb-Suite :: lang/cpp/printf/TestPrintf.py (851 of 1726)
PASS: lldb-Unit :: UnwindAssembly/x86/./UnwindAssemblyx86Tests/Testx86AssemblyInspectionEngine.TestPushR14 (852 of 1726)
PASS: lldb-Unit :: Utility/./UtilityTests/ScalarTest.SetValueFromCString (853 of 1726)
UNSUPPORTED: LLDB :: SymbolFile/PDB/function-nested-block.test (854 of 1726)
PASS: lldb-Unit :: Utility/./UtilityTests/VMRange.SetEndAddress (855 of 1726)
PASS: lldb-Suite :: benchmarks/startup/TestStartupDelays.py (856 of 1726)
UNSUPPORTED: LLDB :: SymbolFile/PDB/variables-locations.test (857 of 1726)
PASS: lldb-Unit :: Utility/./UtilityTests/UriParserTest.BadPort2 (858 of 1726)
PASS: lldb-Unit :: Expression/./ExpressionTests/DiagnosticManagerTest.GetStringMultiline (859 of 1726)
PASS: lldb-Unit :: Utility/./UtilityTests/FileSpecTest.FileAndDirectoryComponents (860 of 1726)
PASS: lldb-Unit :: UnwindAssembly/x86/./UnwindAssemblyx86Tests/Testx86AssemblyInspectionEngine.TestPopR13 (861 of 1726)
PASS: lldb-Suite :: functionalities/data-formatter/boolreference/TestFormattersBoolRefPtr.py (862 of 1726)
UNSUPPORTED: LLDB :: SymbolFile/PDB/type-quals.test (863 of 1726)
PASS: lldb-Suite :: functionalities/data-formatter/data-formatter-python-synth/TestDataFormatterPythonSynth.py (864 of 1726)
PASS: lldb-Suite :: lang/objc/objc-stepping/TestObjCStepping.py (865 of 1726)
PASS: LLDB :: SymbolFile/DWARF/debug_ranges-missing-section.s (866 of 1726)
PASS: LLDB :: SymbolFile/DWARF/debug_aranges-empty-section.s (867 of 1726)
PASS: lldb-Unit :: Utility/./UtilityTests/BinaryStreamTest.PutSLEB128TwoBytes (868 of 1726)
PASS: lldb-Unit :: Utility/./UtilityTests/ArgsTest.GetArgumentArrayRef (869 of 1726)
PASS: lldb-Unit :: Utility/./UtilityTests/CompletionRequest.DuplicateFiltering (870 of 1726)
PASS: lldb-Suite :: lang/cpp/nsimport/TestCppNsImport.py (871 of 1726)
PASS: lldb-Unit :: ScriptInterpreter/Python/./ScriptInterpreterPythonTests/PythonDataObjectsTest.TestBorrowedReferences (872 of 1726)
PASS: lldb-Suite :: functionalities/data-formatter/data-formatter-objc/TestDataFormatterObjCNSDate.py (873 of 1726)
PASS: lldb-Unit :: Utility/./UtilityTests/ArchSpecTest.Compatibility (874 of 1726)
PASS: LLDB :: Expr/TestMultilineExpr.test (875 of 1726)
PASS: LLDB :: Modules/ELF/compressed-sections.yaml (876 of 1726)
PASS: lldb-Suite :: lang/objc/modules/TestObjCModules.py (877 of 1726)
PASS: LLDB :: SymbolFile/DWARF/split-dwarf-multiple-cu.ll (878 of 1726)
PASS: LLDB :: Driver/TestFile.test (879 of 1726)
PASS: lldb-Unit :: Utility/./UtilityTests/FileSpecTest.EqualSeparator (880 of 1726)
PASS: lldb-Suite :: lang/objc/foundation/TestSymbolTable.py (881 of 1726)
PASS: lldb-Unit :: Utility/./UtilityTests/StringListTest.AppendStringMove (882 of 1726)
PASS: lldb-Suite :: functionalities/thread/concurrent_events/TestConcurrentTwoBreakpointsOneSignal.py (883 of 1726)
PASS: lldb-Suite :: functionalities/data-formatter/data-formatter-objc/TestDataFormatterObjCPlain.py (884 of 1726)
PASS: lldb-Suite :: python_api/watchpoint/condition/TestWatchpointConditionAPI.py (885 of 1726)
PASS: lldb-Unit :: Utility/./UtilityTests/ScalarTest.RightShiftOperator (886 of 1726)
PASS: lldb-Suite :: functionalities/object-file/TestImageListMultiArchitecture.py (887 of 1726)
PASS: lldb-Unit :: Utility/./UtilityTests/StringListTest.PopBack (888 of 1726)
PASS: LLDB :: Modules/ELF/section-permissions.yaml (889 of 1726)
PASS: lldb-Unit :: Utility/./UtilityTests/TimerTest.CategoryTimesStats (890 of 1726)
PASS: lldb-Suite :: functionalities/archives/TestBSDArchives.py (891 of 1726)
PASS: lldb-Suite :: functionalities/memory/find/TestMemoryFind.py (892 of 1726)
PASS: lldb-Suite :: functionalities/data-formatter/data-formatter-objc/TestDataFormatterObjCNSError.py (893 of 1726)
PASS: lldb-Unit :: Utility/./UtilityTests/StringExtractorTest.GetNameColonValueContainsColon (894 of 1726)
PASS: lldb-Unit :: Utility/./UtilityTests/StreamTest.PutStringAsRawHex8 (895 of 1726)
PASS: lldb-Unit :: Utility/./UtilityTests/ArchSpecTest.OperatorBool (896 of 1726)
PASS: lldb-Unit :: Utility/./UtilityTests/UriParserTest.BracketedHostnamePort (897 of 1726)
PASS: lldb-Unit :: Target/./TargetTests/PathMappingListTest.RemapRoot (898 of 1726)
PASS: lldb-Suite :: tools/lldb-server/TestGdbRemoteRegisterState.py (899 of 1726)
PASS: lldb-Unit :: Utility/./UtilityTests/RangeTest.Clear (900 of 1726)
PASS: lldb-Unit :: Utility/./UtilityTests/StringLexerTest.NextIfList (901 of 1726)
PASS: LLDB :: SymbolFile/sizeless-symbol.test (902 of 1726)
PASS: lldb-Suite :: functionalities/inferior-crashing/recursive-inferior/TestRecursiveInferior.py (903 of 1726)
PASS: lldb-Suite :: lang/cpp/enum_types/TestCPP11EnumTypes.py (904 of 1726)
PASS: lldb-Suite :: functionalities/data-formatter/type_summary_list_script/TestTypeSummaryListScript.py (905 of 1726)
PASS: lldb-Suite :: lang/c/inlines/TestRedefinitionsInInlines.py (906 of 1726)
PASS: LLDB :: Breakpoint/jitbp_elf.test (907 of 1726)
PASS: lldb-Suite :: commands/watchpoints/hello_watchpoint/TestMyFirstWatchpoint.py (908 of 1726)
PASS: lldb-Suite :: python_api/signals/TestSignalsAPI.py (909 of 1726)
PASS: lldb-Unit :: UnwindAssembly/x86/./UnwindAssemblyx86Tests/Testx86AssemblyInspectionEngine.TestPushR12 (910 of 1726)
PASS: lldb-Suite :: commands/expression/import-std-module/sysroot/TestStdModuleSysroot.py (911 of 1726)
PASS: lldb-Unit :: Utility/./UtilityTests/SerializationRountripTest.SerializeDeserializePodPointers (912 of 1726)
PASS: lldb-Suite :: functionalities/data-formatter/data-formatter-stl/libstdcpp/map/TestDataFormatterStdMap.py (913 of 1726)
UNSUPPORTED: LLDB :: SymbolFile/NativePDB/local-variables.cpp (914 of 1726)
PASS: lldb-Unit :: Utility/./UtilityTests/StringExtractorTest.GetHexU8_Underflow2 (915 of 1726)
PASS: lldb-Suite :: commands/watchpoints/step_over_watchpoint/TestStepOverWatchpoint.py (916 of 1726)
PASS: lldb-Suite :: functionalities/gdb_remote_client/TestRecognizeBreakpoint.py (917 of 1726)
PASS: LLDB :: Driver/TestConvenienceVariables.test (918 of 1726)
PASS: lldb-Unit :: Utility/./UtilityTests/UserIDResolver.GetUserName (919 of 1726)
PASS: lldb-Suite :: lang/cpp/std-function-step-into-callable/TestStdFunctionStepIntoCallable.py (920 of 1726)
PASS: lldb-Unit :: Utility/./UtilityTests/RecordReplayTest.InstrumentedFooSameThis (921 of 1726)
PASS: lldb-Suite :: lang/objcxx/cxx-bridged-po/TestObjCXXBridgedPO.py (922 of 1726)
PASS: lldb-Suite :: commands/expression/top-level/TestTopLevelExprs.py (923 of 1726)
PASS: lldb-Suite :: commands/expression/inline-namespace/TestInlineNamespace.py (924 of 1726)
PASS: lldb-Suite :: lang/cpp/stl/TestStdCXXDisassembly.py (925 of 1726)
PASS: LLDB :: Breakpoint/split-dwarf-5-addrbase.test (926 of 1726)
PASS: lldb-Unit :: Utility/./UtilityTests/ScalarTest.GetBytes (927 of 1726)
PASS: lldb-Unit :: Process/gdb-remote/./ProcessGdbRemoteTests/GDBRemoteCommunicationClientTest.SendStopTracePacket (928 of 1726)
PASS: lldb-Unit :: Utility/./UtilityTests/RegularExpression.CopyAssignment (929 of 1726)
PASS: lldb-Unit :: Utility/./UtilityTests/StringExtractorTest.GetHexBytes_OddPair (930 of 1726)
PASS: lldb-Unit :: Utility/./UtilityTests/StreamTeeTest.Assignment (931 of 1726)
PASS: lldb-Unit :: tools/lldb-server/tests/./LLDBServerTests/TestBase.LaunchModePreservesEnvironment (932 of 1726)
PASS: lldb-Suite :: commands/expression/rdar42038760/TestScalarURem.py (933 of 1726)
UNSUPPORTED: LLDB :: SymbolFile/PDB/typedefs.test (934 of 1726)
PASS: lldb-Unit :: Process/gdb-remote/./ProcessGdbRemoteTests/GDBRemoteCommunicationClientTest.WriteRegister (935 of 1726)
PASS: lldb-Unit :: Platform/./LLDBPlatformTests/PlatformDarwinTest.TestParseVersionBuildDir (936 of 1726)
UNSUPPORTED: LLDB :: SymbolFile/NativePDB/ast-functions-msvc.cpp (937 of 1726)
PASS: lldb-Unit :: Utility/./UtilityTests/RangeTest.EqualInvalid (938 of 1726)
PASS: lldb-Suite :: python_api/process/read-mem-cstring/TestReadMemCString.py (939 of 1726)
PASS: lldb-Unit :: Utility/./UtilityTests/OptionsWithRawTest.SingleWhitespaceInput (940 of 1726)
PASS: LLDB :: SymbolFile/Breakpad/stack-cfi-parsing.test (941 of 1726)
PASS: lldb-Suite :: functionalities/data-formatter/format-propagation/TestFormatPropagation.py (942 of 1726)
PASS: lldb-Unit :: Utility/./UtilityTests/StreamTest.PutBytesAsRawHex8ToMixedEndian (943 of 1726)
PASS: lldb-Suite :: functionalities/data-formatter/data-formatter-stl/libcxx/vector/TestDataFormatterLibcxxVector.py (944 of 1726)
PASS: lldb-Unit :: tools/lldb-server/tests/./LLDBServerTests/TestBase.DebugserverEnv (945 of 1726)
PASS: lldb-Suite :: lang/c/tls_globals/TestTlsGlobals.py (946 of 1726)
PASS: lldb-Unit :: SymbolFile/NativePDB/./SymbolFileNativePDBTests/PDBFPOProgramToDWARFExpressionTests.UnknownOp (947 of 1726)
PASS: lldb-Unit :: Utility/./UtilityTests/StatusTest.Formatv (948 of 1726)
PASS: lldb-Suite :: benchmarks/libcxxlist/TestBenchmarkLibcxxList.py (949 of 1726)
PASS: lldb-Unit :: Process/gdb-remote/./ProcessGdbRemoteTests/GDBRemoteCommunicationServerTest.SendErrorResponse_ErrorNumber (950 of 1726)
PASS: lldb-Suite :: functionalities/tail_call_frames/sbapi_support/TestTailCallFrameSBAPI.py (951 of 1726)
PASS: lldb-Unit :: Utility/./UtilityTests/UriParserTest.LongPath (952 of 1726)
PASS: lldb-Suite :: python_api/name_lookup/TestNameLookup.py (953 of 1726)
PASS: lldb-Unit :: Utility/./UtilityTests/LogChannelTest.Enable (954 of 1726)
PASS: lldb-Suite :: lang/cpp/bool/TestCPPBool.py (955 of 1726)
PASS: lldb-Unit :: Utility/./UtilityTests/OptionsWithRawTest.UnterminatedQuote (956 of 1726)
PASS: lldb-Unit :: Utility/./UtilityTests/StreamTest.PutRawBytesToLittleEndian (957 of 1726)
PASS: lldb-Suite :: functionalities/tail_call_frames/disambiguate_paths_to_common_sink/TestDisambiguatePathsToCommonSink.py (958 of 1726)
PASS: lldb-Suite :: commands/frame/diagnose/bad-reference/TestBadReference.py (959 of 1726)
PASS: lldb-Suite :: lang/objc/objc-class-method/TestObjCClassMethod.py (960 of 1726)
PASS: lldb-Suite :: functionalities/thread/concurrent_events/TestConcurrentSignalBreak.py (961 of 1726)
PASS: lldb-Unit :: Utility/./UtilityTests/FileSpecTest.GetNormalizedPath (962 of 1726)
PASS: LLDB :: Modules/ELF/section-types-edgecases.yaml (963 of 1726)
PASS: lldb-Suite :: functionalities/breakpoint/inlined_breakpoints/TestInlinedBreakpoints.py (964 of 1726)
PASS: lldb-Unit :: Utility/./UtilityTests/TimeoutTest.Construction (965 of 1726)
PASS: lldb-Suite :: functionalities/data-formatter/poarray/TestPrintObjectArray.py (966 of 1726)
PASS: lldb-Suite :: functionalities/jitloader_gdb/TestJITLoaderGDB.py (967 of 1726)
PASS: lldb-Unit :: Utility/./UtilityTests/StreamTest.PutULEB128 (968 of 1726)
FAIL: lldb-Suite :: tools/lldb-server/commandline/TestStubSetSID.py (969 of 1726)
******************** TEST 'lldb-Suite :: tools/lldb-server/commandline/TestStubSetSID.py' FAILED ********************
lldb version 10.0.99 (http://labmaster3.local/git/llvm-project.git revision 0c0de794f1affc7460eb90626b8483e4a0cbde6c)
  clang revision 0c0de794f1affc7460eb90626b8483e4a0cbde6c
  llvm revision 0c0de794f1affc7460eb90626b8483e4a0cbde6c
LLDB library dir: /Users/buildslave/jenkins/workspace/lldb-cmake-sanitized/lldb-build/bin
LLDB import library dir: /Users/buildslave/jenkins/workspace/lldb-cmake-sanitized/lldb-build/bin
libstdcxx tests will not be run because: Don't know how to build with libstdcxx on macosx
Skipping following debug info categories: ['dwo']

Hide Details

Session logs for test failures/errors/unexpected successes will go into directory '/Users/buildslave/jenkins/workspace/lldb-cmake-sanitized/test/logs' Command invoked: /Users/buildslave/jenkins/workspace/lldb-cmake-sanitized/llvm-project/lldb/test/dotest.py --arch=x86_64 -s /Users/buildslave/jenkins/workspace/lldb-cmake-sanitized/lldb-build/lldb-test-traces -S nm -u CXXFLAGS -u CFLAGS --executable /Users/buildslave/jenkins/workspace/lldb-cmake-sanitized/lldb-build/./bin/lldb --dsymutil /Users/buildslave/jenkins/workspace/lldb-cmake-sanitized/lldb-build/./bin/dsymutil --filecheck /Users/buildslave/jenkins/workspace/lldb-cmake-sanitized/lldb-build/./bin/FileCheck -C /Users/buildslave/jenkins/workspace/lldb-cmake-sanitized/host-compiler/bin/clang --codesign-identity lldb_codesign --server /Users/buildslave/jenkins/workspace/lldb-cmake-sanitized/lldb-build/./bin/debugserver --arch x86_64 --build-dir /Users/buildslave/jenkins/workspace/lldb-cmake-sanitized/lldb-build/lldb-test-build.noindex -s=/Users/buildslave/jenkins/workspace/lldb-cmake-sanitized/test/logs -t --env TERM=vt100 --env LLVM_LIBS_DIR=/Users/buildslave/jenkins/workspace/lldb-cmake-sanitized/lldb-build/./lib --build-dir /Users/buildslave/jenkins/workspace/lldb-cmake-sanitized/lldb-build/tools/lldb/lldb-test-build.noindex --module-cache-dir /Users/buildslave/jenkins/workspace/lldb-cmake-sanitized/lldb-build/tools/lldb/lldb-test-build.noindex/module-cache-lldb /Users/buildslave/jenkins/workspace/lldb-cmake-sanitized/llvm-project/lldb/packages/Python/lldbsuite/test/tools/lldb-server/commandline -p TestStubSetSID.py Change dir to: /Users/buildslave/jenkins/workspace/lldb-cmake-sanitized/llvm-project/lldb/packages/Python/lldbsuite/test/tools/lldb-server/commandline runCmd: settings set symbols.enable-external-lookup false output:

Hide Details

runCmd: settings set plugin.process.gdb-remote.packet-timeout 60 output:

Hide Details

runCmd: settings set symbols.clang-modules-cache-path "/Users/buildslave/jenkins/workspace/lldb-cmake-sanitized/lldb-build/tools/lldb/lldb-test-build.noindex/module-cache-lldb" output:

Hide Details

runCmd: settings set use-color false output:

Hide Details

Adding tearDown hook: def shutdown_named_pipe(): # Close the pipe. try: named_pipe.close() except: print("failed to close named pipe") None

Hide Details

# Delete the pipe. try: os.remove(named_pipe_path) except: print("failed to delete named pipe: {}".format(named_pipe_path)) None

Hide Details

# Delete the temp directory. try: os.rmdir(temp_dir) except: print( "failed to delete temp dir: {}, directory contents: '{}'".format( temp_dir, os.listdir(temp_dir))) None

Hide Details

Hide Details

Adding tearDown hook: def cleanupSubprocesses(self): # Ensure any subprocesses are cleaned up for p in self.subprocesses: p.terminate() del p del self.subprocesses[:] # Ensure any forked processes are cleaned up for pid in self.forkedProcessPids: if os.path.exists("/proc/" + str(pid)): os.kill(pid, signal.SIGTERM)

Hide Details

Hide Details

Executing tearDown hook: def cleanupSubprocesses(self): # Ensure any subprocesses are cleaned up for p in self.subprocesses: p.terminate() del p del self.subprocesses[:] # Ensure any forked processes are cleaned up for pid in self.forkedProcessPids: if os.path.exists("/proc/" + str(pid)): os.kill(pid, signal.SIGTERM)

Hide Details

Hide Details

Executing tearDown hook: def shutdown_named_pipe(): # Close the pipe. try: named_pipe.close() except: print("failed to close named pipe") None

Hide Details

# Delete the pipe. try: os.remove(named_pipe_path) except: print("failed to delete named pipe: {}".format(named_pipe_path)) None

Hide Details

# Delete the temp directory. try: os.rmdir(temp_dir) except: print( "failed to delete temp dir: {}, directory contents: '{}'".format( temp_dir, os.listdir(temp_dir))) None

Hide Details

Hide Details

PASS: LLDB (/Users/buildslave/jenkins/workspace/lldb-cmake-sanitized/host-compiler/bin/clang-10-x86_64) :: test_sid_is_different_with_S_debugserver (TestStubSetSID.TestStubSetSIDTestCase) runCmd: settings set symbols.enable-external-lookup false output:

Hide Details

runCmd: settings set plugin.process.gdb-remote.packet-timeout 60 output:

Hide Details

runCmd: settings set symbols.clang-modules-cache-path "/Users/buildslave/jenkins/workspace/lldb-cmake-sanitized/lldb-build/tools/lldb/lldb-test-build.noindex/module-cache-lldb" output:

Hide Details

runCmd: settings set use-color false output:

Hide Details

UNSUPPORTED: LLDB (/Users/buildslave/jenkins/workspace/lldb-cmake-sanitized/host-compiler/bin/clang-10-x86_64) :: test_sid_is_different_with_S_llgs (TestStubSetSID.TestStubSetSIDTestCase) (llgs tests) runCmd: settings set symbols.enable-external-lookup false output:

Hide Details

runCmd: settings set plugin.process.gdb-remote.packet-timeout 60 output:

Hide Details

runCmd: settings set symbols.clang-modules-cache-path "/Users/buildslave/jenkins/workspace/lldb-cmake-sanitized/lldb-build/tools/lldb/lldb-test-build.noindex/module-cache-lldb" output:

Hide Details

runCmd: settings set use-color false output:

Hide Details

Adding tearDown hook: def shutdown_named_pipe(): # Close the pipe. try: named_pipe.close() except: print("failed to close named pipe") None

Hide Details

# Delete the pipe. try: os.remove(named_pipe_path) except: print("failed to delete named pipe: {}".format(named_pipe_path)) None

Hide Details

# Delete the temp directory. try: os.rmdir(temp_dir) except: print( "failed to delete temp dir: {}, directory contents: '{}'".format( temp_dir, os.listdir(temp_dir))) None

Hide Details

Hide Details

Adding tearDown hook: def cleanupSubprocesses(self): # Ensure any subprocesses are cleaned up for p in self.subprocesses: p.terminate() del p del self.subprocesses[:] # Ensure any forked processes are cleaned up for pid in self.forkedProcessPids: if os.path.exists("/proc/" + str(pid)): os.kill(pid, signal.SIGTERM)

Hide Details

Hide Details

FAIL: LLDB (/Users/buildslave/jenkins/workspace/lldb-cmake-sanitized/host-compiler/bin/clang-10-x86_64) :: test_sid_is_different_with_setsid_debugserver (TestStubSetSID.TestStubSetSIDTestCase) Executing tearDown hook: def cleanupSubprocesses(self): # Ensure any subprocesses are cleaned up for p in self.subprocesses: p.terminate() del p del self.subprocesses[:] # Ensure any forked processes are cleaned up for pid in self.forkedProcessPids: if os.path.exists("/proc/" + str(pid)): os.kill(pid, signal.SIGTERM)

Hide Details

Hide Details

Executing tearDown hook: def shutdown_named_pipe(): # Close the pipe. try: named_pipe.close() except: print("failed to close named pipe") None

Hide Details

# Delete the pipe. try: os.remove(named_pipe_path) except: print("failed to delete named pipe: {}".format(named_pipe_path)) None

Hide Details

# Delete the temp directory. try: os.rmdir(temp_dir) except: print( "failed to delete temp dir: {}, directory contents: '{}'".format( temp_dir, os.listdir(temp_dir))) None

Hide Details

Hide Details

runCmd: settings set symbols.enable-external-lookup false output:

Hide Details

runCmd: settings set plugin.process.gdb-remote.packet-timeout 60 output:

Hide Details

runCmd: settings set symbols.clang-modules-cache-path "/Users/buildslave/jenkins/workspace/lldb-cmake-sanitized/lldb-build/tools/lldb/lldb-test-build.noindex/module-cache-lldb" output:

Hide Details

runCmd: settings set use-color false output:

Hide Details

UNSUPPORTED: LLDB (/Users/buildslave/jenkins/workspace/lldb-cmake-sanitized/host-compiler/bin/clang-10-x86_64) :: test_sid_is_different_with_setsid_llgs (TestStubSetSID.TestStubSetSIDTestCase) (llgs tests) runCmd: settings set symbols.enable-external-lookup false output:

Hide Details

runCmd: settings set plugin.process.gdb-remote.packet-timeout 60 output:

Hide Details

runCmd: settings set symbols.clang-modules-cache-path "/Users/buildslave/jenkins/workspace/lldb-cmake-sanitized/lldb-build/tools/lldb/lldb-test-build.noindex/module-cache-lldb" output:

Hide Details

runCmd: settings set use-color false output:

Hide Details

Adding tearDown hook: def shutdown_named_pipe(): # Close the pipe. try: named_pipe.close() except: print("failed to close named pipe") None

Hide Details

# Delete the pipe. try: os.remove(named_pipe_path) except: print("failed to delete named pipe: {}".format(named_pipe_path)) None

Hide Details

# Delete the temp directory. try: os.rmdir(temp_dir) except: print( "failed to delete temp dir: {}, directory contents: '{}'".format( temp_dir, os.listdir(temp_dir))) None

Hide Details

Hide Details

Adding tearDown hook: def cleanupSubprocesses(self): # Ensure any subprocesses are cleaned up for p in self.subprocesses: p.terminate() del p del self.subprocesses[:] # Ensure any forked processes are cleaned up for pid in self.forkedProcessPids: if os.path.exists("/proc/" + str(pid)): os.kill(pid, signal.SIGTERM)

Hide Details

Hide Details

Executing tearDown hook: def cleanupSubprocesses(self): # Ensure any subprocesses are cleaned up for p in self.subprocesses: p.terminate() del p del self.subprocesses[:] # Ensure any forked processes are cleaned up for pid in self.forkedProcessPids: if os.path.exists("/proc/" + str(pid)): os.kill(pid, signal.SIGTERM)

Hide Details

Hide Details

Executing tearDown hook: def shutdown_named_pipe(): # Close the pipe. try: named_pipe.close() except: print("failed to close named pipe") None

Hide Details

# Delete the pipe. try: os.remove(named_pipe_path) except: print("failed to delete named pipe: {}".format(named_pipe_path)) None

Hide Details

# Delete the temp directory. try: os.rmdir(temp_dir) except: print( "failed to delete temp dir: {}, directory contents: '{}'".format( temp_dir, os.listdir(temp_dir))) None

Hide Details

Hide Details

PASS: LLDB (/Users/buildslave/jenkins/workspace/lldb-cmake-sanitized/host-compiler/bin/clang-10-x86_64) :: test_sid_is_same_without_setsid_debugserver (TestStubSetSID.TestStubSetSIDTestCase) runCmd: settings set symbols.enable-external-lookup false output:

Hide Details

runCmd: settings set plugin.process.gdb-remote.packet-timeout 60 output:

Hide Details

runCmd: settings set symbols.clang-modules-cache-path "/Users/buildslave/jenkins/workspace/lldb-cmake-sanitized/lldb-build/tools/lldb/lldb-test-build.noindex/module-cache-lldb" output:

Hide Details

runCmd: settings set use-color false output:

Hide Details

UNSUPPORTED: LLDB (/Users/buildslave/jenkins/workspace/lldb-cmake-sanitized/host-compiler/bin/clang-10-x86_64) :: test_sid_is_same_without_setsid_llgs (TestStubSetSID.TestStubSetSIDTestCase) (llgs tests) Restore dir to: /Users/buildslave/jenkins/workspace/lldb-cmake-sanitized/lldb-build/tools/lldb/lit ====================================================================== FAIL: test_sid_is_different_with_setsid_debugserver (TestStubSetSID.TestStubSetSIDTestCase) ---------------------------------------------------------------------- Traceback (most recent call last): File "/Users/buildslave/jenkins/workspace/lldb-cmake-sanitized/llvm-project/lldb/packages/Python/lldbsuite/test/decorators.py", line 141, in wrapper func(*args, **kwargs) File "/Users/buildslave/jenkins/workspace/lldb-cmake-sanitized/llvm-project/lldb/packages/Python/lldbsuite/test/decorators.py", line 141, in wrapper func(*args, **kwargs) File "/Users/buildslave/jenkins/workspace/lldb-cmake-sanitized/llvm-project/lldb/packages/Python/lldbsuite/test/tools/lldb-server/commandline/TestStubSetSID.py", line 64, in test_sid_is_different_with_setsid_debugserver self.sid_is_different_with_setsid() File "/Users/buildslave/jenkins/workspace/lldb-cmake-sanitized/llvm-project/lldb/packages/Python/lldbsuite/test/tools/lldb-server/commandline/TestStubSetSID.py", line 36, in sid_is_different_with_setsid stub_sid = self.get_stub_sid(["--setsid"]) File "/Users/buildslave/jenkins/workspace/lldb-cmake-sanitized/llvm-project/lldb/packages/Python/lldbsuite/test/tools/lldb-server/commandline/TestStubSetSID.py", line 26, in get_stub_sid server.pid, True)) AssertionError: False is not True Config=x86_64-/Users/buildslave/jenkins/workspace/lldb-cmake-sanitized/host-compiler/bin/clang-10 ---------------------------------------------------------------------- Ran 6 tests in 10.276s

Hide Details

RESULT: FAILED (2 passes, 1 failures, 0 errors, 3 skipped, 0 expected failures, 0 unexpected successes)

Hide Details

******************** PASS: lldb-Suite :: commands/command/delete/TestCommandDelete.py (970 of 1726) PASS: lldb-Unit :: Utility/./UtilityTests/StringExtractorTest.GetHexU8_Exact_NoEof (971 of 1726) PASS: lldb-Suite :: functionalities/thread/num_threads/TestNumThreads.py (972 of 1726) PASS: lldb-Unit :: Utility/./UtilityTests/GeneratorTest.Get (973 of 1726) PASS: lldb-Suite :: functionalities/data-formatter/data-formatter-stl/libcxx/variant/TestDataFormatterLibcxxVariant.py (974 of 1726) PASS: LLDB :: SymbolFile/DWARF/forward-declarations.s (975 of 1726) UNSUPPORTED: LLDB :: SymbolFile/NativePDB/typedefs.cpp (976 of 1726) PASS: lldb-Unit :: Utility/./UtilityTests/OptionsWithRawTest.TerminatedQuote (977 of 1726) PASS: LLDB :: Driver/TestSingleQuote.test (978 of 1726) PASS: lldb-Suite :: functionalities/darwin_log/filter/regex/activity-chain/TestDarwinLogFilterRegexActivityChain.py (979 of 1726) PASS: lldb-Unit :: UnwindAssembly/x86/./UnwindAssemblyx86Tests/Testx86AssemblyInspectionEngine.Testi386IgnoredRegisters (980 of 1726) PASS: lldb-Unit :: Core/./LLDBCoreTests/MangledTest.EmptyForInvalidName (981 of 1726) PASS: lldb-Unit :: Language/CPlusPlus/./LanguageCPlusPlusTests/CPlusPlusLanguage.MethodNameParsing (982 of 1726) XFAIL: LLDB :: SymbolFile/DWARF/find-type-in-function.cpp (983 of 1726) PASS: lldb-Suite :: lang/objc/foundation/TestObjCMethods2.py (984 of 1726) PASS: lldb-Unit :: Process/minidump/./LLDBMinidumpTests/MinidumpParserTest.GetLinuxProcStatus (985 of 1726) PASS: lldb-Suite :: linux/mix-dwo-and-regular-objects/TestMixedDwarfBinary.py (986 of 1726) PASS: lldb-Suite :: commands/frame/diagnose/virtual-method-call/TestDiagnoseDereferenceVirtualMethodCall.py (987 of 1726) PASS: lldb-Unit :: Process/minidump/./LLDBMinidumpTests/MinidumpParserTest.GetMemoryRegionInfoFromMemory64List (988 of 1726) PASS: lldb-Suite :: commands/process/attach/attach_denied/TestAttachDenied.py (989 of 1726) PASS: lldb-Suite :: macosx/order/TestOrderFile.py (990 of 1726) PASS: LLDB :: SymbolFile/NativePDB/function-types-builtins.cpp (991 of 1726) PASS: lldb-Suite :: functionalities/inline-stepping/TestInlineStepping.py (992 of 1726) PASS: lldb-Unit :: debugserver/./debugserverTests/RNBSocket.LoopBackListenIPv6 (993 of 1726) PASS: lldb-Suite :: functionalities/data-formatter/data-formatter-objc/TestDataFormatterObjCKVO.py (994 of 1726) PASS: lldb-Unit :: Host/./HostTests/MainLoopTest.UnmonitoredSignal (995 of 1726) PASS: lldb-Unit :: Editline/./EditlineTests/EditlineTestFixture.EditlineReceivesSingleLineText (996 of 1726) PASS: LLDB :: Driver/TestRepl.test (997 of 1726) PASS: lldb-Suite :: functionalities/data-formatter/data-formatter-stl/libstdcpp/unique_ptr/invalid/TestDataFormatterInvalidStdUniquePtr.py (998 of 1726) PASS: lldb-Unit :: Utility/./UtilityTests/StringListTest.ShiftMove (999 of 1726) PASS: lldb-Unit :: Process/gdb-remote/./ProcessGdbRemoteTests/GDBRemoteClientBaseTest.SendContinueAndWait (1000 of 1726) PASS: lldb-Unit :: Utility/./UtilityTests/StringExtractorTest.GetHexBytes_Underflow (1001 of 1726) PASS: lldb-Suite :: tools/lldb-server/TestGdbRemoteExitCode.py (1002 of 1726) PASS: lldb-Suite :: functionalities/breakpoint/address_breakpoints/TestAddressBreakpoints.py (1003 of 1726) PASS: lldb-Suite :: lang/cpp/virtual/TestVirtual.py (1004 of 1726) PASS: lldb-Suite :: lang/c/set_values/TestSetValues.py (1005 of 1726) PASS: lldb-Suite :: sample_test/TestSampleInlineTest.py (1006 of 1726) PASS: lldb-Suite :: lang/mixed/TestMixedLanguages.py (1007 of 1726) PASS: LLDB :: Modules/Breakpad/sections-trailing-func.test (1008 of 1726) PASS: lldb-Suite :: functionalities/breakpoint/breakpoint_command/TestRegexpBreakCommand.py (1009 of 1726) PASS: lldb-Unit :: Language/Highlighting/./HighlighterTests/HighlighterTest.HighlighterSelectionType (1010 of 1726) PASS: lldb-Unit :: Utility/./UtilityTests/BinaryStreamTest.PutULEB128FourBytes (1011 of 1726) PASS: lldb-Suite :: functionalities/breakpoint/objc/TestObjCBreakpoints.py (1012 of 1726) PASS: LLDB :: Commands/command-source.test (1013 of 1726) PASS: lldb-Unit :: ScriptInterpreter/Python/./ScriptInterpreterPythonTests/PythonExceptionStateTest.TestManualRestoreSemantics (1014 of 1726) PASS: lldb-Unit :: Utility/./UtilityTests/ScalarTest.Scalar_512 (1015 of 1726) PASS: lldb-Unit :: Utility/./UtilityTests/ArgsTest.EscapeLLDBCommandArgument (1016 of 1726) PASS: lldb-Suite :: python_api/frame/inlines/TestInlinedFrame.py (1017 of 1726) PASS: lldb-Suite :: lang/objc/conflicting-definition/TestConflictingDefinition.py (1018 of 1726) PASS: lldb-Unit :: Utility/./UtilityTests/StringExtractorTest.DecodeHexU8_Exact (1019 of 1726) PASS: lldb-Unit :: Expression/./ExpressionTests/DiagnosticManagerTest.GetStringSeverityLabels (1020 of 1726) PASS: lldb-Suite :: arm/breakpoint-thumb-codesection/TestBreakpointThumbCodesection.py (1021 of 1726) PASS: lldb-Suite :: types/TestDoubleTypesExpr.py (1022 of 1726) PASS: lldb-Unit :: Process/gdb-remote/./ProcessGdbRemoteTests/GDBRemoteCommunicationClientTest.TestPacketSpeedJSON (1023 of 1726) PASS: lldb-Unit :: Utility/./UtilityTests/ConstStringTest.NullAndEmptyStates (1024 of 1726) PASS: lldb-Unit :: Utility/./UtilityTests/StringListTest.RemoveBlankLines (1025 of 1726) PASS: lldb-Unit :: Utility/./UtilityTests/StringExtractorTest.GetNameColonValueNoSemicolon (1026 of 1726) PASS: lldb-Suite :: linux/sepdebugsymlink/TestTargetSymbolsSepDebugSymlink.py (1027 of 1726) PASS: lldb-Suite :: functionalities/data-formatter/data-formatter-objc/TestDataFormatterObjCNSURL.py (1028 of 1726) PASS: lldb-Suite :: commands/expression/import-std-module/weak_ptr-dbg-info-content/TestDbgInfoContentWeakPtr.py (1029 of 1726) PASS: lldb-Suite :: functionalities/breakpoint/breakpoint_names/TestBreakpointNames.py (1030 of 1726) PASS: lldb-Suite :: functionalities/breakpoint/breakpoint_set_restart/TestBreakpointSetRestart.py (1031 of 1726) PASS: lldb-Unit :: Host/./HostTests/FileSystemTest.GetPermissions (1032 of 1726) UNSUPPORTED: LLDB :: SymbolFile/PDB/pointers.test (1033 of 1726) PASS: lldb-Suite :: lang/cpp/global_operators/TestCppGlobalOperators.py (1034 of 1726) PASS: lldb-Unit :: Utility/./UtilityTests/RangeTest.Constructor (1035 of 1726) PASS: LLDB :: Settings/TestDisableColor.test (1036 of 1726) PASS: lldb-Suite :: tools/lldb-server/TestGdbRemote_vCont.py (1037 of 1726) UNSUPPORTED: LLDB :: SymbolFile/PDB/func-symbols.test (1038 of 1726) PASS: lldb-Unit :: Utility/./UtilityTests/SerializationRountripTest.SerializeDeserializePodReferences (1039 of 1726) PASS: lldb-Unit :: Utility/./UtilityTests/StreamTest.PutHex8 (1040 of 1726) PASS: lldb-Unit :: Language/Highlighting/./HighlighterTests/HighlighterTest.ClangCursorPosBeforeOtherToken (1041 of 1726) PASS: LLDB :: Modules/ELF/section-overlap.yaml (1042 of 1726) PASS: lldb-Unit :: Target/./TargetTests/ExecutionContextTest.GetByteOrder (1043 of 1726) FAIL: lldb-Suite :: functionalities/gdb_remote_client/TestThreadSelectionBug.py (1044 of 1726) ******************** TEST 'lldb-Suite :: functionalities/gdb_remote_client/TestThreadSelectionBug.py' FAILED ******************** lldb version 10.0.99 (http://labmaster3.local/git/llvm-project.git revision 0c0de794f1affc7460eb90626b8483e4a0cbde6c) clang revision 0c0de794f1affc7460eb90626b8483e4a0cbde6c llvm revision 0c0de794f1affc7460eb90626b8483e4a0cbde6c LLDB library dir: /Users/buildslave/jenkins/workspace/lldb-cmake-sanitized/lldb-build/bin LLDB import library dir: /Users/buildslave/jenkins/workspace/lldb-cmake-sanitized/lldb-build/bin libstdcxx tests will not be run because: Don't know how to build with libstdcxx on macosx Skipping following debug info categories: ['dwo']

Hide Details

Session logs for test failures/errors/unexpected successes will go into directory '/Users/buildslave/jenkins/workspace/lldb-cmake-sanitized/test/logs' Command invoked: /Users/buildslave/jenkins/workspace/lldb-cmake-sanitized/llvm-project/lldb/test/dotest.py --arch=x86_64 -s /Users/buildslave/jenkins/workspace/lldb-cmake-sanitized/lldb-build/lldb-test-traces -S nm -u CXXFLAGS -u CFLAGS --executable /Users/buildslave/jenkins/workspace/lldb-cmake-sanitized/lldb-build/./bin/lldb --dsymutil /Users/buildslave/jenkins/workspace/lldb-cmake-sanitized/lldb-build/./bin/dsymutil --filecheck /Users/buildslave/jenkins/workspace/lldb-cmake-sanitized/lldb-build/./bin/FileCheck -C /Users/buildslave/jenkins/workspace/lldb-cmake-sanitized/host-compiler/bin/clang --codesign-identity lldb_codesign --server /Users/buildslave/jenkins/workspace/lldb-cmake-sanitized/lldb-build/./bin/debugserver --arch x86_64 --build-dir /Users/buildslave/jenkins/workspace/lldb-cmake-sanitized/lldb-build/lldb-test-build.noindex -s=/Users/buildslave/jenkins/workspace/lldb-cmake-sanitized/test/logs -t --env TERM=vt100 --env LLVM_LIBS_DIR=/Users/buildslave/jenkins/workspace/lldb-cmake-sanitized/lldb-build/./lib --build-dir /Users/buildslave/jenkins/workspace/lldb-cmake-sanitized/lldb-build/tools/lldb/lldb-test-build.noindex --module-cache-dir /Users/buildslave/jenkins/workspace/lldb-cmake-sanitized/lldb-build/tools/lldb/lldb-test-build.noindex/module-cache-lldb /Users/buildslave/jenkins/workspace/lldb-cmake-sanitized/llvm-project/lldb/packages/Python/lldbsuite/test/functionalities/gdb_remote_client -p TestThreadSelectionBug.py Change dir to: /Users/buildslave/jenkins/workspace/lldb-cmake-sanitized/llvm-project/lldb/packages/Python/lldbsuite/test/functionalities/gdb_remote_client runCmd: settings set symbols.enable-external-lookup false output:

Hide Details

runCmd: settings set plugin.process.gdb-remote.packet-timeout 60 output:

Hide Details

runCmd: settings set symbols.clang-modules-cache-path "/Users/buildslave/jenkins/workspace/lldb-cmake-sanitized/lldb-build/tools/lldb/lldb-test-build.noindex/module-cache-lldb" output:

Hide Details

runCmd: settings set use-color false output:

Hide Details

FAIL: LLDB (/Users/buildslave/jenkins/workspace/lldb-cmake-sanitized/host-compiler/bin/clang-10-x86_64) :: test (TestThreadSelectionBug.TestThreadSelectionBug) <bound method SBProcess.Kill of <lldb.SBProcess; proxy of <Swig Object of type 'lldb::SBProcess *' at 0x123376960> >>: success

Hide Details

Restore dir to: /Users/buildslave/jenkins/workspace/lldb-cmake-sanitized/lldb-build/tools/lldb/lit ====================================================================== FAIL: test (TestThreadSelectionBug.TestThreadSelectionBug) ---------------------------------------------------------------------- Traceback (most recent call last): File "/Users/buildslave/jenkins/workspace/lldb-cmake-sanitized/llvm-project/lldb/packages/Python/lldbsuite/test/functionalities/gdb_remote_client/TestThreadSelectionBug.py", line 17, in test process = self.connect(target) File "/Users/buildslave/jenkins/workspace/lldb-cmake-sanitized/llvm-project/lldb/packages/Python/lldbsuite/test/functionalities/gdb_remote_client/gdbclientutils.py", line 479, in connect self.assertTrue(error.Success(), error.description) AssertionError: False is not True : failed to get reply to handshake packet Config=x86_64-/Users/buildslave/jenkins/workspace/lldb-cmake-sanitized/host-compiler/bin/clang-10 ---------------------------------------------------------------------- Ran 1 test in 62.729s

Hide Details

RESULT: FAILED (0 passes, 1 failures, 0 errors, 0 skipped, 0 expected failures, 0 unexpected successes)

Hide Details

******************** PASS: lldb-Unit :: Utility/./UtilityTests/StringExtractorTest.GetHexU8_Underflow2_NoEof (1045 of 1726) PASS: lldb-Suite :: python_api/watchpoint/watchlocation/TestTargetWatchAddress.py (1046 of 1726) PASS: lldb-Suite :: macosx/indirect_symbol/TestIndirectSymbols.py (1047 of 1726) PASS: lldb-Suite :: functionalities/postmortem/minidump-new/TestMiniDumpNew.py (1048 of 1726) PASS: lldb-Suite :: functionalities/data-formatter/ostypeformatting/TestFormattersOsType.py (1049 of 1726) PASS: LLDB :: Breakpoint/implicit_const_form_support.test (1050 of 1726) PASS: lldb-Unit :: Utility/./UtilityTests/StringExtractorTest.InitMisc (1051 of 1726) PASS: lldb-Unit :: Expression/./ExpressionTests/DiagnosticManagerTest.AppendMessageSubsequentDiags (1052 of 1726) PASS: lldb-Unit :: Process/gdb-remote/./ProcessGdbRemoteTests/GDBRemoteCommunicationTest.ReadPacket_checksum (1053 of 1726) PASS: lldb-Suite :: functionalities/darwin_log/source/info/TestDarwinLogSourceInfo.py (1054 of 1726) PASS: lldb-Suite :: functionalities/tsan/thread_leak/TestTsanThreadLeak.py (1055 of 1726) XFAIL: LLDB :: Register/x86-mm-xmm-read.test (1056 of 1726) PASS: lldb-Unit :: Language/Highlighting/./HighlighterTests/HighlighterTest.ClangStringLiterals (1057 of 1726) PASS: LLDB :: SymbolFile/DWARF/dir-separator-no-comp-dir.s (1058 of 1726) PASS: lldb-Suite :: functionalities/step_scripted/TestStepScripted.py (1059 of 1726) PASS: LLDB :: Modules/ELF/PT_LOAD-overlap.yaml (1060 of 1726) PASS: lldb-Suite :: lang/objc/objc-builtin-types/TestObjCBuiltinTypes.py (1061 of 1726) PASS: lldb-Suite :: functionalities/data-formatter/data-formatter-stl/libstdcpp/tuple/TestDataFormatterStdTuple.py (1062 of 1726) PASS: LLDB :: Breakpoint/split-dwarf5-debug-stroffsets.test (1063 of 1726) UNSUPPORTED: LLDB :: SymbolFile/PDB/vbases.test (1064 of 1726) PASS: lldb-Unit :: Utility/./UtilityTests/UriParserTest.MinimalPortPath (1065 of 1726) PASS: lldb-Suite :: commands/log/invalid-args/TestInvalidArgsLog.py (1066 of 1726) PASS: lldb-Suite :: functionalities/data-formatter/data-formatter-script/TestDataFormatterScript.py (1067 of 1726) PASS: lldb-Unit :: Language/CPlusPlus/./LanguageCPlusPlusTests/CPlusPlusLanguage.FindAlternateFunctionManglings (1068 of 1726) PASS: lldb-Suite :: python_api/lldbutil/frame/TestFrameUtils.py (1069 of 1726) PASS: lldb-Unit :: Language/CPlusPlus/./LanguageCPlusPlusTests/CPlusPlusLanguage.ExtractContextAndIdentifier (1070 of 1726) PASS: lldb-Unit :: UnwindAssembly/x86/./UnwindAssemblyx86Tests/Testx86AssemblyInspectionEngine.TestPushEDI (1071 of 1726) PASS: lldb-Suite :: lang/cpp/breakpoint_in_member_func_w_non_primitive_params/TestBreakpointInMemberFuncWNonPrimitiveParams.py (1072 of 1726) PASS: lldb-Unit :: Utility/./UtilityTests/StreamTeeTest.Flush (1073 of 1726) PASS: lldb-Suite :: python_api/value/linked_list/TestValueAPILinkedList.py (1074 of 1726) PASS: lldb-Suite :: commands/expression/dont_allow_jit/TestAllowJIT.py (1075 of 1726) PASS: lldb-Unit :: Utility/./UtilityTests/StreamTeeTest.Write (1076 of 1726) PASS: LLDB :: SymbolFile/DWARF/debug-types-signature-loop.s (1077 of 1726) PASS: lldb-Suite :: tools/lldb-server/inferior-crash/TestGdbRemoteAbort.py (1078 of 1726) PASS: lldb-Suite :: tools/lldb-server/thread-name/TestGdbRemoteThreadName.py (1079 of 1726) PASS: lldb-Unit :: Utility/./UtilityTests/OptionsWithRawTest.QuotedSuffix (1080 of 1726) PASS: lldb-Suite :: benchmarks/frame_variable/TestFrameVariableResponse.py (1081 of 1726) PASS: lldb-Unit :: Host/./HostTests/FileSystemTest.MakeAbsolute (1082 of 1726) PASS: lldb-Suite :: commands/target/stop-hooks/TestStopHooks.py (1083 of 1726) PASS: lldb-Suite :: lang/cpp/namespace/TestNamespaceLookup.py (1084 of 1726) PASS: LLDB :: Register/x86-64-gp-read.test (1085 of 1726) PASS: lldb-Suite :: functionalities/breakpoint/breakpoint_command/TestBreakpointCommandsFromPython.py (1086 of 1726) PASS: lldb-Suite :: commands/expression/test/TestExprs.py (1087 of 1726) PASS: lldb-Unit :: Expression/./ExpressionTests/DiagnosticManagerTest.GetStringPreserveOrder (1088 of 1726) PASS: LLDB :: SymbolFile/NativePDB/tag-types.cpp (1089 of 1726) PASS: lldb-Unit :: Utility/./UtilityTests/RangeTest.ContainsEndInclusiveInvalid (1090 of 1726) UNSUPPORTED: LLDB :: SymbolFile/PDB/expressions.test (1091 of 1726) PASS: lldb-Unit :: Utility/./UtilityTests/RangeTest.LessThan (1092 of 1726) PASS: lldb-Suite :: lang/c/enum_types/TestEnumTypes.py (1093 of 1726) PASS: lldb-Unit :: ObjectFile/Breakpad/./ObjectFileBreakpadTests/Record.classify (1094 of 1726) PASS: lldb-Unit :: Utility/./UtilityTests/ArgsTest.TestQuotedUnknownEscape (1095 of 1726) UNSUPPORTED: LLDB :: SymbolFile/target-symbols-add-unwind.test (1096 of 1726) PASS: lldb-Unit :: Host/./HostTests/SocketTest.DomainGetConnectURI (1097 of 1726) PASS: lldb-Suite :: tools/lldb-server/inferior-crash/TestGdbRemoteSegFault.py (1098 of 1726) PASS: lldb-Suite :: functionalities/postmortem/mach-core/TestMachCore.py (1099 of 1726) PASS: lldb-Unit :: ObjectFile/Breakpad/./ObjectFileBreakpadTests/ModuleRecord.parse (1100 of 1726) PASS: lldb-Unit :: Utility/./UtilityTests/RangeDataVector.FindEntryThatContains_Overlap (1101 of 1726) PASS: lldb-Unit :: SymbolFile/DWARF/./SymbolFileDWARFTests/SymbolFileDWARFTests.TestAbbrevValidAttrNullForm (1102 of 1726) PASS: LLDB :: Reproducer/Modules/TestModuleCXX.test (1103 of 1726) PASS: lldb-Suite :: commands/log/basic/TestLogging.py (1104 of 1726) PASS: lldb-Suite :: python_api/module_section/TestModuleAndSection.py (1105 of 1726) PASS: lldb-Suite :: commands/process/launch-with-shellexpand/TestLaunchWithShellExpand.py (1106 of 1726) PASS: lldb-Suite :: commands/expression/test/TestExprs2.py (1107 of 1726) PASS: lldb-Suite :: lang/cpp/exceptions/TestCPPExceptionBreakpoints.py (1108 of 1726) PASS: lldb-Suite :: lang/cpp/template/TestTemplateArgs.py (1109 of 1726) PASS: lldb-Unit :: Utility/./UtilityTests/OptionsWithRawTest.EmptySuffixSingleWhitespace (1110 of 1726) PASS: lldb-Suite :: functionalities/data-formatter/data-formatter-stl/libstdcpp/smart_ptr/TestDataFormatterStdSmartPtr.py (1111 of 1726) PASS: lldb-Suite :: functionalities/asan/TestReportData.py (1112 of 1726) PASS: lldb-Suite :: functionalities/postmortem/elf-core/thread_crash/TestLinuxCoreThreads.py (1113 of 1726) PASS: lldb-Unit :: Process/gdb-remote/./ProcessGdbRemoteTests/GDBRemoteCommunicationClientTest.GetModulesInfo (1114 of 1726) UNSUPPORTED: LLDB :: Register/x86-zmm-write.test (1115 of 1726) PASS: lldb-Unit :: Utility/./UtilityTests/VMRange.ContainsRange (1116 of 1726) PASS: lldb-Unit :: Target/./TargetTests/MemoryRegionInfoTest.Formatv (1117 of 1726) PASS: LLDB :: SymbolFile/NativePDB/bitfields.cpp (1118 of 1726) PASS: lldb-Suite :: functionalities/data-formatter/data-formatter-stl/libstdcpp/list/TestDataFormatterStdList.py (1119 of 1726) PASS: lldb-Suite :: functionalities/non-overlapping-index-variable-i/TestIndexVariable.py (1120 of 1726) PASS: lldb-Suite :: functionalities/thread/concurrent_events/TestConcurrentSignalNWatchNBreak.py (1121 of 1726) PASS: lldb-Unit :: Process/gdb-remote/./ProcessGdbRemoteTests/GDBRemoteCommunicationClientTest.SyncThreadState (1122 of 1726) PASS: lldb-Suite :: functionalities/unwind/noreturn/TestNoreturnUnwind.py (1123 of 1726) PASS: lldb-Suite :: lang/cpp/offsetof/TestOffsetofCpp.py (1124 of 1726) PASS: LLDB :: SymbolFile/DWARF/debug-types-dwarf5.s (1125 of 1726) PASS: lldb-Unit :: UnwindAssembly/x86/./UnwindAssemblyx86Tests/Testx86AssemblyInspectionEngine.TestPopEBP (1126 of 1726) PASS: lldb-Unit :: Host/./HostTests/NativeProcessProtocolTest.SetBreakpointFailVerify (1127 of 1726) PASS: lldb-Unit :: Utility/./UtilityTests/StreamTeeTest.SetStreamAtIndexOutOfBounds (1128 of 1726) PASS: lldb-Unit :: UnwindAssembly/x86/./UnwindAssemblyx86Tests/Testx86AssemblyInspectionEngine.TestPopRBP (1129 of 1726) PASS: lldb-Unit :: Utility/./UtilityTests/ConstStringTest.format_provider (1130 of 1726) PASS: lldb-Suite :: python_api/sbdata/TestSBData.py (1131 of 1726) PASS: lldb-Unit :: Utility/./UtilityTests/ArgsTest.ReplaceArgumentAtIndexFarOutOfRange (1132 of 1726) PASS: lldb-Unit :: Language/Highlighting/./HighlighterTests/HighlighterTest.DefaultHighlighterWithCursor (1133 of 1726) PASS: lldb-Unit :: Utility/./UtilityTests/SerializationRountripTest.SerializeDeserializeObjectPointer (1134 of 1726) PASS: lldb-Unit :: Signals/./SignalsTests/UnixSignalsTest.Iteration (1135 of 1726) PASS: lldb-Unit :: Process/gdb-remote/./ProcessGdbRemoteTests/GDBRemoteCommunicationClientTest.SendGetTraceConfigPacket (1136 of 1726) PASS: lldb-Suite :: lang/objc/exceptions/TestObjCExceptions.py (1137 of 1726) PASS: lldb-Suite :: commands/expression/unwind_expression/TestUnwindExpression.py (1138 of 1726) PASS: lldb-Suite :: functionalities/darwin_log/filter/exact_match/category/TestDarwinLogFilterMatchCategory.py (1139 of 1726) PASS: lldb-Suite :: functionalities/data-formatter/data-formatter-globals/TestDataFormatterGlobals.py (1140 of 1726) PASS: LLDB :: Commands/CommandScriptImmediateOutput/CommandScriptImmediateOutputFile.test (1141 of 1726) PASS: lldb-Suite :: functionalities/type_completion/TestTypeCompletion.py (1142 of 1726) PASS: lldb-Unit :: UnwindAssembly/x86/./UnwindAssemblyx86Tests/Testx86AssemblyInspectionEngine.TestPushRBP (1143 of 1726) PASS: lldb-Unit :: Utility/./UtilityTests/StreamTeeTest.SetStreamAtIndexOverwrite (1144 of 1726) PASS: lldb-Unit :: Utility/./UtilityTests/ArgsTest.ReplaceArgumentAtIndexLonger (1145 of 1726) PASS: lldb-Unit :: ScriptInterpreter/Python/./ScriptInterpreterPythonTests/PythonDataObjectsTest.TestPythonTupleInitializerList2 (1146 of 1726) PASS: lldb-Unit :: Process/gdb-remote/./ProcessGdbRemoteTests/GDBRemoteCommunicationServerTest.SendErrorResponse_ErrorList (1147 of 1726) PASS: lldb-Suite :: types/TestFloatTypesExpr.py (1148 of 1726) PASS: lldb-Suite :: functionalities/thread/concurrent_events/TestConcurrentBreakpointsDelayedBreakpointOneWatchpoint.py (1149 of 1726) PASS: lldb-Unit :: Host/./HostTests/NativeProcessProtocolTest.SetBreakpoint (1150 of 1726) PASS: lldb-Unit :: ScriptInterpreter/Python/./ScriptInterpreterPythonTests/PythonDataObjectsTest.TestPythonTupleValues (1151 of 1726) PASS: lldb-Unit :: Utility/./UtilityTests/StreamTest.PutHex16ByteOrderLittle (1152 of 1726) PASS: lldb-Unit :: Target/./TargetTests/ModuleCacheTest.GetAndPut (1153 of 1726) PASS: lldb-Unit :: UnwindAssembly/x86/./UnwindAssemblyx86Tests/Testx86AssemblyInspectionEngine.TestPushRBX (1154 of 1726) PASS: lldb-Unit :: Process/minidump/./LLDBMinidumpTests/RegisterContextMinidump.ConvertMinidumpContext_x86_32 (1155 of 1726) PASS: lldb-Unit :: Utility/./UtilityTests/VASprintfTest.EncodingError (1156 of 1726) PASS: lldb-Suite :: commands/expression/fixits/TestFixIts.py (1157 of 1726) PASS: lldb-Unit :: Utility/./UtilityTests/RangeTest.NotEqualInvalid (1158 of 1726) PASS: LLDB :: Quit/TestQuitExitCode-30.test (1159 of 1726) PASS: lldb-Unit :: SymbolFile/NativePDB/./SymbolFileNativePDBTests/PDBFPOProgramToDWARFExpressionTests.InvalidOpBinary (1160 of 1726) PASS: lldb-Unit :: Core/./LLDBCoreTests/MangledTest.ResultForValidName (1161 of 1726) PASS: LLDB :: Quit/TestQuitExitCodeHex0.test (1162 of 1726) PASS: lldb-Suite :: functionalities/data-formatter/data-formatter-disabling/TestDataFormatterDisabling.py (1163 of 1726) PASS: lldb-Unit :: Utility/./UtilityTests/StringListTest.InsertStringAtIndexMove (1164 of 1726) PASS: lldb-Unit :: Host/./HostTests/TaskPoolTest.RunTasks (1165 of 1726) PASS: lldb-Unit :: Language/Highlighting/./HighlighterTests/HighlighterTest.ClangCursorPos (1166 of 1726) PASS: lldb-Suite :: lang/cpp/dynamic-value/TestDynamicValue.py (1167 of 1726) PASS: lldb-Unit :: Language/CPlusPlus/./LanguageCPlusPlusTests/CPlusPlusLanguage.CPlusPlusNameParser (1168 of 1726) PASS: lldb-Suite :: functionalities/gdb_remote_client/TestTargetXMLArch.py (1169 of 1726) PASS: lldb-Unit :: Core/./LLDBCoreTests/StreamCallbackTest.Callback (1170 of 1726) PASS: lldb-Unit :: Host/./HostTests/NativeProcessProtocolTest.ReadCStringFromMemory (1171 of 1726) PASS: lldb-Unit :: SymbolFile/NativePDB/./SymbolFileNativePDBTests/PDBFPOProgramToDWARFExpressionTests.SingleAssignmentRegisterRef (1172 of 1726) PASS: lldb-Unit :: Expression/./ExpressionTests/DWARFExpression.DW_OP_convert (1173 of 1726) UNSUPPORTED: LLDB :: Breakpoint/case-insensitive.test (1174 of 1726) PASS: lldb-Unit :: Utility/./UtilityTests/StringExtractorTest.GetU64LittleEndian (1175 of 1726) PASS: lldb-Unit :: Utility/./UtilityTests/UUIDTest.Validity (1176 of 1726) PASS: lldb-Suite :: functionalities/data-formatter/data-formatter-stl/libcxx/iterator/TestDataFormatterLibccIterator.py (1177 of 1726) PASS: lldb-Unit :: Target/./TargetTests/PathMappingListTest.RelativeTests (1178 of 1726) PASS: lldb-Unit :: Utility/./UtilityTests/UriParserTest.SchemeHostSeparator (1179 of 1726) PASS: lldb-Suite :: commands/frame/recognizer/TestFrameRecognizer.py (1180 of 1726) PASS: lldb-Unit :: Signals/./SignalsTests/UnixSignalsTest.GetFilteredSignals (1181 of 1726) PASS: lldb-Unit :: Host/./HostTests/FileSystemTest.Resolve (1182 of 1726) PASS: LLDB :: Register/x86-64-ymm-read.test (1183 of 1726) PASS: lldb-Suite :: commands/expression/import-std-module/shared_ptr/TestSharedPtr.py (1184 of 1726) PASS: lldb-Suite :: commands/frame/diagnose/dereference-function-return/TestDiagnoseDereferenceFunctionReturn.py (1185 of 1726) PASS: lldb-Unit :: Utility/./UtilityTests/ArgsTest.DoubleQuotedItem (1186 of 1726) PASS: lldb-Suite :: functionalities/thread/concurrent_events/TestConcurrentTwoWatchpointsOneBreakpoint.py (1187 of 1726) PASS: lldb-Unit :: Utility/./UtilityTests/ConstStringTest.UpdateMangledCounterpart (1188 of 1726) PASS: lldb-Suite :: functionalities/data-formatter/data-formatter-named-summaries/TestDataFormatterNamedSummaries.py (1189 of 1726) PASS: lldb-Suite :: python_api/function_symbol/TestSymbolAPI.py (1190 of 1726) PASS: lldb-Unit :: Utility/./UtilityTests/BinaryStreamTest.PutSLEB128Zero (1191 of 1726) PASS: lldb-Unit :: Utility/./UtilityTests/StreamTest.PutHex64ByteOrderLittle (1192 of 1726) PASS: lldb-Suite :: commands/command/script/TestCommandScript.py (1193 of 1726) PASS: lldb-Suite :: lang/cpp/overloaded-functions/TestOverloadedFunctions.py (1194 of 1726) PASS: lldb-Suite :: functionalities/inferior-crashing/TestInferiorCrashingStep.py (1195 of 1726) PASS: lldb-Unit :: Utility/./UtilityTests/StringListTest.JoinNonSpace (1196 of 1726) PASS: lldb-Unit :: Process/gdb-remote/./ProcessGdbRemoteTests/GDBRemoteClientBaseTest.SendPacketAndReceiveResponseWithOutputSupport (1197 of 1726) PASS: lldb-Suite :: python_api/target/TestTargetAPI.py (1198 of 1726) PASS: lldb-Unit :: Utility/./UtilityTests/BroadcasterTest.EventTypeHasListeners (1199 of 1726) PASS: lldb-Unit :: Utility/./UtilityTests/AnsiTerminal.Twice (1200 of 1726) PASS: lldb-Suite :: functionalities/data-formatter/data-formatter-cpp/TestDataFormatterCpp.py (1201 of 1726) PASS: LLDB :: Breakpoint/debug_addrx.test (1202 of 1726) PASS: lldb-Unit :: Utility/./UtilityTests/LogChannelTest.List (1203 of 1726) PASS: lldb-Suite :: commands/expression/ir-interpreter-phi-nodes/TestIRInterpreterPHINodes.py (1204 of 1726) PASS: lldb-Unit :: Utility/./UtilityTests/StreamTest.PutHex32ByteOrderLittle (1205 of 1726) PASS: lldb-Unit :: Language/Highlighting/./HighlighterTests/HighlighterTest.ClangCursorPosEndOfLine (1206 of 1726) PASS: lldb-Unit :: Interpreter/./InterpreterTests/OptionArgParserTest.toBoolean (1207 of 1726) PASS: lldb-Suite :: commands/watchpoints/watchpoint_disable/TestWatchpointDisable.py (1208 of 1726) PASS: lldb-Suite :: python_api/disassemble-raw-data/TestDisassembleRawData.py (1209 of 1726) PASS: lldb-Unit :: Utility/./UtilityTests/FileSpecTest.GuessPathStyle (1210 of 1726) PASS: lldb-Unit :: Symbol/./SymbolTests/PostfixExpression.ParseOneExpression (1211 of 1726) PASS: lldb-Unit :: Utility/./UtilityTests/ScalarTest.APIntConstructor (1212 of 1726) PASS: lldb-Unit :: Utility/./UtilityTests/LogTest.Register (1213 of 1726) PASS: lldb-Unit :: Utility/./UtilityTests/UriParserTest.PortOverflow (1214 of 1726) PASS: lldb-Suite :: commands/expression/weak_symbols/TestWeakSymbols.py (1215 of 1726) PASS: LLDB :: Modules/PECOFF/basic-info.yaml (1216 of 1726) PASS: lldb-Unit :: UnwindAssembly/x86/./UnwindAssemblyx86Tests/Testx86AssemblyInspectionEngine.TestSimple64bitFrameFunction (1217 of 1726) PASS: lldb-Suite :: lang/objc/objc-ivar-stripped/TestObjCIvarStripped.py (1218 of 1726) PASS: lldb-Suite :: python_api/hello_world/TestHelloWorld.py (1219 of 1726) PASS: lldb-Suite :: functionalities/darwin_log/filter/exact_match/activity/TestDarwinLogFilterMatchActivity.py (1220 of 1726) PASS: lldb-Suite :: lang/cpp/breakpoint-commands/TestCPPBreakpointCommands.py (1221 of 1726) PASS: lldb-Suite :: commands/expression/import-std-module/vector-basic/TestBasicVector.py (1222 of 1726) PASS: lldb-Unit :: Utility/./UtilityTests/StreamTest.PutSLEB128 (1223 of 1726) PASS: lldb-Suite :: functionalities/multidebugger_commands/TestMultipleDebuggersCommands.py (1224 of 1726) PASS: lldb-Unit :: UnwindAssembly/x86/./UnwindAssemblyx86Tests/Testx86AssemblyInspectionEngine.TestPopESI (1225 of 1726) PASS: lldb-Unit :: Interpreter/./InterpreterTests/CompletionTest.FileCompletionAbsolute (1226 of 1726) PASS: lldb-Unit :: Host/./HostTests/NativeProcessProtocolTest.ReadCStringFromMemory_CrossPageBoundary (1227 of 1726) PASS: lldb-Unit :: Utility/./UtilityTests/ScalarTest.GetValue (1228 of 1726) PASS: lldb-Suite :: functionalities/thread/concurrent_events/TestConcurrentSignalDelayBreak.py (1229 of 1726) PASS: lldb-Unit :: Utility/./UtilityTests/ScalarTest.Equality (1230 of 1726) PASS: lldb-Suite :: functionalities/data-formatter/data-formatter-stl/libcxx/tuple/TestDataFormatterLibcxxTuple.py (1231 of 1726) PASS: lldb-Suite :: macosx/universal/TestUniversal.py (1232 of 1726) PASS: lldb-Suite :: functionalities/data-formatter/data-formatter-stl/libcxx/list/loop/TestDataFormatterLibcxxListLoop.py (1233 of 1726) PASS: lldb-Unit :: Host/./HostTests/ConnectionFileDescriptorTest.TCPGetURIv4 (1234 of 1726) PASS: lldb-Unit :: Utility/./UtilityTests/StringLexerTest.PutBack (1235 of 1726) PASS: lldb-Suite :: commands/expression/anonymous-struct/TestCallUserAnonTypedef.py (1236 of 1726) PASS: lldb-Suite :: lang/objc/objc++/TestObjCXX.py (1237 of 1726) PASS: lldb-Unit :: Utility/./UtilityTests/ArgsTest.TestQuotedTrailingBackslash (1238 of 1726) PASS: lldb-Unit :: UnwindAssembly/x86/./UnwindAssemblyx86Tests/Testx86AssemblyInspectionEngine.TestPushEBX (1239 of 1726) PASS: lldb-Suite :: functionalities/thread/state/TestThreadStates.py (1240 of 1726) PASS: lldb-Unit :: ObjectFile/Breakpad/./ObjectFileBreakpadTests/PublicRecord.parse (1241 of 1726) PASS: lldb-Unit :: Utility/./UtilityTests/StateTest.Formatv (1242 of 1726) PASS: LLDB :: SymbolFile/DWARF/find-basic-function.cpp (1243 of 1726) PASS: LLDB :: Quit/TestQuitExitCodeImplicit0.test (1244 of 1726) PASS: lldb-Unit :: Utility/./UtilityTests/ReproducerTest.SetReplay (1245 of 1726) PASS: LLDB :: SymbolFile/DWARF/debug-names-compressed.cpp (1246 of 1726) PASS: lldb-Suite :: commands/register/register/intel_xtended_registers/TestMPXRegisters.py (1247 of 1726) PASS: lldb-Unit :: Utility/./UtilityTests/UserIDResolver.GetGroupName (1248 of 1726) PASS: lldb-Unit :: UnwindAssembly/x86/./UnwindAssemblyx86Tests/Testx86AssemblyInspectionEngine.TestPopRBX (1249 of 1726) PASS: lldb-Unit :: ScriptInterpreter/Python/./ScriptInterpreterPythonTests/PythonDataObjectsTest.TestModuleNameResolutionNoDot (1250 of 1726) PASS: lldb-Suite :: functionalities/thread/concurrent_events/TestConcurrentNWatchNBreak.py (1251 of 1726) PASS: lldb-Suite :: functionalities/thread/multi_break/TestMultipleBreakpoints.py (1252 of 1726) PASS: lldb-Suite :: commands/watchpoints/watchpoint_commands/TestWatchpointCommands.py (1253 of 1726) PASS: lldb-Suite :: python_api/section/TestSectionAPI.py (1254 of 1726) PASS: lldb-Unit :: Utility/./UtilityTests/StringListTest.Assignment (1255 of 1726) PASS: lldb-Unit :: Utility/./UtilityTests/BinaryStreamTest.PutULEB128Zero (1256 of 1726) PASS: lldb-Unit :: UnwindAssembly/x86/./UnwindAssemblyx86Tests/Testx86AssemblyInspectionEngine.TestStackRealign8BitDisp_i386 (1257 of 1726) PASS: lldb-Unit :: UnwindAssembly/x86/./UnwindAssemblyx86Tests/Testx86AssemblyInspectionEngine.TestDisassemblyMidFunctionEpilogues (1258 of 1726) PASS: lldb-Suite :: functionalities/thread/concurrent_events/TestConcurrentWatchBreakDelay.py (1259 of 1726) PASS: lldb-Suite :: functionalities/inferior-crashing/TestInferiorCrashing.py (1260 of 1726) PASS: LLDB :: SymbolFile/NativePDB/ast-functions.cpp (1261 of 1726) PASS: lldb-Unit :: Utility/./UtilityTests/EnvironmentTest.EnvpConversion (1262 of 1726) UNSUPPORTED: LLDB :: Register/x86-ymm-write.test (1263 of 1726) PASS: lldb-Unit :: Utility/./UtilityTests/DataExtractorTest.GetMaxU64_unchecked (1264 of 1726) PASS: lldb-Unit :: Utility/./UtilityTests/StreamTest.PutCString (1265 of 1726) PASS: lldb-Unit :: Process/minidump/./LLDBMinidumpTests/MinidumpParserTest.GetPidWindows (1266 of 1726) PASS: lldb-Suite :: commands/expression/completion-crash2/TestCompletionCrash2.py (1267 of 1726) PASS: lldb-Suite :: functionalities/data-formatter/varscript_formatting/TestDataFormatterVarScriptFormatting.py (1268 of 1726) PASS: lldb-Unit :: UnwindAssembly/x86/./UnwindAssemblyx86Tests/Testx86AssemblyInspectionEngine.TestPushExtended (1269 of 1726) PASS: lldb-Suite :: lang/objc/foundation/TestObjCMethodsString.py (1270 of 1726) PASS: LLDB :: SymbolFile/DWARF/debug-types-line-tables.s (1271 of 1726) PASS: lldb-Suite :: commands/expression/save_jit_objects/TestSaveJITObjects.py (1272 of 1726) PASS: lldb-Suite :: functionalities/thread/exit_during_break/TestExitDuringBreak.py (1273 of 1726) PASS: lldb-Suite :: functionalities/breakpoint/breakpoint_in_delayslot/TestAvoidBreakpointInDelaySlot.py (1274 of 1726) PASS: lldb-Suite :: commands/expression/two-files/TestObjCTypeQueryFromOtherCompileUnit.py (1275 of 1726) PASS: lldb-Unit :: Host/./HostTests/ConnectionFileDescriptorTest.TCPGetURIv6 (1276 of 1726) PASS: lldb-Suite :: tools/lldb-vscode/attach/TestVSCode_attach.py (1277 of 1726) PASS: LLDB :: SymbolFile/DWARF/apple-index-is-used.cpp (1278 of 1726) PASS: lldb-Unit :: Host/./HostTests/SocketTest.UDPGetConnectURI (1279 of 1726) PASS: lldb-Unit :: ObjectFile/Breakpad/./ObjectFileBreakpadTests/StackCFIRecord.parse (1280 of 1726) PASS: lldb-Suite :: commands/expression/call-throws/TestCallThatThrows.py (1281 of 1726) PASS: lldb-Unit :: Utility/./UtilityTests/ArgsTest.TestSingleArg (1282 of 1726) PASS: lldb-Suite :: commands/watchpoints/watchpoint_set_command/TestWatchLocationWithWatchSet.py (1283 of 1726) PASS: LLDB :: Commands/command-backtrace.test (1284 of 1726) PASS: lldb-Unit :: Process/gdb-remote/./ProcessGdbRemoteTests/GDBRemoteCommunicationClientTest.SendGetMetaDataPacket (1285 of 1726) PASS: lldb-Suite :: lang/objc/objc-dynamic-value/TestObjCDynamicValue.py (1286 of 1726) PASS: lldb-Suite :: commands/expression/import-std-module/vector-bool/TestBoolVector.py (1287 of 1726) PASS: lldb-Suite :: lang/objc/modules-inline-functions/TestModulesInlineFunctions.py (1288 of 1726) PASS: LLDB :: SymbolFile/DWARF/array-sizes.s (1289 of 1726) PASS: lldb-Unit :: Utility/./UtilityTests/RangeTest.ClearWithStarAddress (1290 of 1726) PASS: lldb-Unit :: Utility/./UtilityTests/BinaryStreamTest.PutSLEB128OneByte (1291 of 1726) UNSUPPORTED: LLDB :: Register/x86-zmm-read.test (1292 of 1726) PASS: lldb-Suite :: commands/command/history/TestCommandHistory.py (1293 of 1726) PASS: lldb-Unit :: Utility/./UtilityTests/StringListTest.SetSize (1294 of 1726) PASS: lldb-Suite :: commands/expression/import-std-module/deque-basic/TestBasicDeque.py (1295 of 1726) PASS: lldb-Suite :: lang/cpp/gmodules/TestWithModuleDebugging.py (1296 of 1726) PASS: lldb-Unit :: Utility/./UtilityTests/DeserializerTest.HasData (1297 of 1726) PASS: lldb-Suite :: tools/lldb-server/TestGdbRemoteKill.py (1298 of 1726) PASS: lldb-Unit :: Host/./HostTests/HostInfoTest.GetHostname (1299 of 1726) PASS: lldb-Suite :: commands/watchpoints/watchpoint_on_vectors/TestValueOfVectorVariable.py (1300 of 1726) PASS: lldb-Suite :: functionalities/data-formatter/data-formatter-enum-format/TestDataFormatterEnumFormat.py (1301 of 1726) PASS: LLDB :: Driver/TestCore.test (1302 of 1726) PASS: lldb-Suite :: commands/watchpoints/variable_out_of_scope/TestWatchedVarHitWhenInScope.py (1303 of 1726) PASS: lldb-Suite :: functionalities/postmortem/minidump/TestMiniDump.py (1304 of 1726) PASS: lldb-Suite :: lang/cpp/virtual-overload/TestVirtualOverload.py (1305 of 1726) PASS: lldb-Unit :: Process/gdb-remote/./ProcessGdbRemoteTests/GDBRemoteClientBaseTest.SendContinueAndAsyncPacket (1306 of 1726) PASS: lldb-Suite :: functionalities/data-formatter/data-formatter-stl/libstdcpp/vbool/TestDataFormatterStdVBool.py (1307 of 1726) PASS: lldb-Unit :: Utility/./UtilityTests/GeneratorTest.Create (1308 of 1726) PASS: lldb-Suite :: functionalities/data-formatter/typedef_array/TestTypedefArray.py (1309 of 1726) PASS: lldb-Suite :: lang/objc/foundation/TestObjCMethodsNSArray.py (1310 of 1726) PASS: lldb-Unit :: Utility/./UtilityTests/StringListTest.LongestCommonPrefixNoPrefix (1311 of 1726) PASS: lldb-Unit :: Symbol/./SymbolTests/Type.GetTypeScopeAndBasename (1312 of 1726) PASS: LLDB :: SymbolFile/DWARF/debug-types-missing-signature.test (1313 of 1726) PASS: lldb-Unit :: ScriptInterpreter/Python/./ScriptInterpreterPythonTests/PythonDataObjectsTest.TestPythonBytes (1314 of 1726) PASS: lldb-Unit :: Process/gdb-remote/./ProcessGdbRemoteTests/GDBRemoteCommunicationClientTest.SendStartTracePacket (1315 of 1726) PASS: lldb-Unit :: Host/./HostTests/SocketTest.UDPConnect (1316 of 1726) PASS: lldb-Unit :: Host/./HostTests/HostInfoTest.GetAugmentedArchSpec (1317 of 1726) PASS: lldb-Unit :: Expression/./ExpressionTests/DiagnosticManagerTest.PutString (1318 of 1726) PASS: lldb-Suite :: functionalities/data-formatter/data-formatter-synth/TestDataFormatterSynth.py (1319 of 1726) PASS: lldb-Unit :: Interpreter/./InterpreterTests/CompletionTest.DirCompletionAbsolute (1320 of 1726) PASS: lldb-Suite :: functionalities/darwin_log/basic/TestDarwinLogBasic.py (1321 of 1726) PASS: lldb-Suite :: types/TestIntegerTypesExpr.py (1322 of 1726) PASS: LLDB :: Minidump/Windows/find-module.test (1323 of 1726) PASS: lldb-Suite :: commands/expression/formatters/TestFormatters.py (1324 of 1726) PASS: LLDB :: Commands/command-script-import.test (1325 of 1726) UNSUPPORTED: LLDB :: SymbolFile/PDB/compilands.test (1326 of 1726) PASS: LLDB :: Reproducer/TestDriverOptions.test (1327 of 1726) PASS: lldb-Unit :: Process/minidump/./LLDBMinidumpTests/MinidumpParserTest.GetLinuxProcStatus_no_stream (1328 of 1726) PASS: lldb-Suite :: functionalities/data-formatter/nsdictionarysynth/TestNSDictionarySynthetic.py (1329 of 1726) PASS: lldb-Suite :: functionalities/gdb_remote_client/TestWriteMemory.py (1330 of 1726) PASS: lldb-Suite :: lang/objc/objc-foundation-dictionary-empty/TestNSDictionary0.py (1331 of 1726) PASS: lldb-Suite :: functionalities/thread/concurrent_events/TestConcurrentDelaySignalBreak.py (1332 of 1726) PASS: lldb-Unit :: Host/./HostTests/FileSystemTest.FileAndDirectoryComponents (1333 of 1726) PASS: lldb-Suite :: lang/cpp/rvalue-references/TestRvalueReferences.py (1334 of 1726) PASS: lldb-Unit :: ScriptInterpreter/Python/./ScriptInterpreterPythonTests/PythonDataObjectsTest.TestTypeNameResolutionNoDot (1335 of 1726) PASS: lldb-Suite :: functionalities/breakpoint/debugbreak/TestDebugBreak.py (1336 of 1726) PASS: lldb-Suite :: lang/cpp/scope/TestCppScope.py (1337 of 1726) PASS: LLDB :: SymbolFile/DWARF/dwarf5-partial-index.cpp (1338 of 1726) PASS: lldb-Suite :: functionalities/exec/TestExec.py (1339 of 1726) PASS: lldb-Unit :: Utility/./UtilityTests/StringExtractorTest.GetHexBytesAvail (1340 of 1726) PASS: lldb-Unit :: Utility/./UtilityTests/OptionsWithRawTest.ArgsButNoLeadingDash (1341 of 1726) PASS: lldb-Unit :: Utility/./UtilityTests/RangeTest.LessThanInvalid (1342 of 1726) PASS: lldb-Suite :: functionalities/return-value/TestReturnValue.py (1343 of 1726) PASS: lldb-Unit :: Utility/./UtilityTests/StringListTest.AppendList (1344 of 1726) PASS: LLDB :: BuildScript/modes.test (1345 of 1726) PASS: lldb-Unit :: Utility/./UtilityTests/OptionsWithRawTest.ArgsButNoDelimiter (1346 of 1726) PASS: lldb-Suite :: macosx/function-starts/TestFunctionStarts.py (1347 of 1726) PASS: LLDB :: SymbolFile/NativePDB/globals-fundamental.cpp (1348 of 1726) PASS: lldb-Suite :: python_api/symbol-context/TestSymbolContext.py (1349 of 1726) PASS: lldb-Suite :: functionalities/data-formatter/ptr_ref_typedef/TestPtrRef2Typedef.py (1350 of 1726) PASS: LLDB :: Modules/PECOFF/dep-modules.yaml (1351 of 1726) PASS: lldb-Unit :: Host/./HostTests/SocketTest.DomainListenConnectAccept (1352 of 1726) PASS: lldb-Unit :: Utility/./UtilityTests/StreamTest.PutMaxHex64ByteOrderLittle (1353 of 1726) PASS: lldb-Unit :: Utility/./UtilityTests/NameMatchesTest.Ignore (1354 of 1726) PASS: lldb-Unit :: UnwindAssembly/x86/./UnwindAssemblyx86Tests/Testx86AssemblyInspectionEngine.TestPopR14 (1355 of 1726) PASS: lldb-Suite :: functionalities/thread/concurrent_events/TestConcurrentSignalDelayWatch.py (1356 of 1726) PASS: lldb-Unit :: UnwindAssembly/x86/./UnwindAssemblyx86Tests/Testx86AssemblyInspectionEngine.TestPushR13 (1357 of 1726) PASS: lldb-Suite :: commands/watchpoints/watchpoint_commands/command/TestWatchpointCommandPython.py (1358 of 1726) PASS: LLDB :: Breakpoint/debug_rnglist_rlestartend.test (1359 of 1726) PASS: lldb-Unit :: Expression/./ExpressionTests/DWARFExpression.DW_OP_pick (1360 of 1726) XFAIL: LLDB :: Register/x86-mm-xmm-write.test (1361 of 1726) PASS: lldb-Suite :: lang/cpp/operator-overload/TestOperatorOverload.py (1362 of 1726) PASS: lldb-Suite :: arm/emulation/TestEmulations.py (1363 of 1726) PASS: lldb-Suite :: commands/watchpoints/watchpoint_events/TestWatchpointEvents.py (1364 of 1726) PASS: lldb-Suite :: lang/objc/modules-incomplete/TestIncompleteModules.py (1365 of 1726) PASS: lldb-Suite :: functionalities/breakpoint/dummy_target_breakpoints/TestBreakpointsWithNoTargets.py (1366 of 1726) PASS: LLDB :: Minidump/Windows/Sigsegv/sigsegv.test (1367 of 1726) PASS: LLDB :: Commands/command-regex-delete.test (1368 of 1726) PASS: lldb-Unit :: Utility/./UtilityTests/CompletionRequest.Constructor (1369 of 1726) PASS: lldb-Suite :: functionalities/thread/concurrent_events/TestConcurrentDelaySignalWatch.py (1370 of 1726) PASS: lldb-Unit :: SymbolFile/NativePDB/./SymbolFileNativePDBTests/PDBFPOProgramToDWARFExpressionTests.MultipleDependentAssignments (1371 of 1726) PASS: lldb-Suite :: lang/cpp/namespace_conflicts/TestNamespaceConflicts.py (1372 of 1726) PASS: LLDB :: SymbolFile/DWARF/find-method-local-struct.cpp (1373 of 1726) PASS: lldb-Unit :: Process/minidump/./LLDBMinidumpTests/MinidumpParserTest.GetPidWow64 (1374 of 1726) PASS: lldb-Unit :: Utility/./UtilityTests/BinaryStreamTest.PutULEB128SevenBytes (1375 of 1726) PASS: lldb-Unit :: ScriptInterpreter/Python/./ScriptInterpreterPythonTests/PythonExceptionStateTest.TestAutoRestoreSemantics (1376 of 1726) PASS: lldb-Unit :: Utility/./UtilityTests/RangeTest.SizeTypes (1377 of 1726) PASS: lldb-Suite :: python_api/debugger/TestDebuggerAPI.py (1378 of 1726) PASS: lldb-Suite :: functionalities/thread/create_after_attach/TestCreateAfterAttach.py (1379 of 1726) PASS: lldb-Suite :: lang/c/global_variables/TestGlobalVariables.py (1380 of 1726) PASS: lldb-Suite :: lang/cpp/auto/TestCPPAuto.py (1381 of 1726) PASS: LLDB :: Modules/ELF/aarch64-relocations.yaml (1382 of 1726) PASS: lldb-Unit :: Utility/./UtilityTests/LogTest.Unregister (1383 of 1726) PASS: lldb-Unit :: Language/Highlighting/./HighlighterTests/HighlighterTest.ClangComments (1384 of 1726) PASS: lldb-Suite :: commands/gui/basic/TestGuiBasic.py (1385 of 1726) PASS: lldb-Unit :: Utility/./UtilityTests/RegularExpression.Match (1386 of 1726) PASS: lldb-Suite :: functionalities/load_using_paths/TestLoadUsingPaths.py (1387 of 1726) PASS: lldb-Suite :: python_api/lldbutil/iter/TestRegistersIterator.py (1388 of 1726) PASS: lldb-Suite :: lang/cpp/diamond/TestDiamond.py (1389 of 1726) PASS: lldb-Suite :: tools/lldb-server/TestLldbGdbServer.py (1390 of 1726) PASS: lldb-Suite :: lang/objc/foundation/TestObjCMethodsNSError.py (1391 of 1726) PASS: lldb-Suite :: lang/objc/objc-ivar-protocols/TestIvarProtocols.py (1392 of 1726) PASS: LLDB :: SymbolFile/Breakpad/line-table-edgecases.test (1393 of 1726) PASS: lldb-Suite :: functionalities/thread/concurrent_events/TestConcurrentTwoWatchpointsOneDelayBreakpoint.py (1394 of 1726) PASS: lldb-Suite :: commands/watchpoints/multiple_threads/TestWatchpointMultipleThreads.py (1395 of 1726) PASS: lldb-Unit :: Utility/./UtilityTests/StringExtractorTest.GetHexU8_InvalidHex_NoEof (1396 of 1726) PASS: lldb-Suite :: commands/process/launch/TestProcessLaunch.py (1397 of 1726) PASS: LLDB :: Reproducer/TestDump.test (1398 of 1726) PASS: lldb-Unit :: Utility/./UtilityTests/CompletionRequest.DuplicateFilteringWithComments (1399 of 1726) PASS: LLDB :: SymbolFile/NativePDB/function-types-classes.cpp (1400 of 1726) PASS: LLDB :: Modules/MachO/lc_build_version_notools.yaml (1401 of 1726) PASS: LLDB :: Minidump/disassemble-no-module.yaml (1402 of 1726) PASS: lldb-Unit :: Utility/./UtilityTests/VMRange.Clear (1403 of 1726) PASS: lldb-Suite :: functionalities/data-formatter/setvaluefromcstring/TestSetValueFromCString.py (1404 of 1726) PASS: lldb-Suite :: api/log/TestAPILog.py (1405 of 1726) PASS: lldb-Suite :: functionalities/data-formatter/data-formatter-stl/libstdcpp/unique_ptr/TestDataFormatterStdUniquePtr.py (1406 of 1726) PASS: lldb-Unit :: Utility/./UtilityTests/StatusTest.ErrorConversion (1407 of 1726) PASS: lldb-Unit :: Utility/./UtilityTests/StringExtractorTest.GetHexBytesAvail_Underflow (1408 of 1726) PASS: lldb-Unit :: UnwindAssembly/x86/./UnwindAssemblyx86Tests/Testx86AssemblyInspectionEngine.TestPushESI (1409 of 1726) PASS: lldb-Suite :: commands/register/register/intel_xtended_registers/mpx_bound_violation/TestBoundViolation.py (1410 of 1726) PASS: lldb-Suite :: lang/cpp/symbols/TestSymbols.py (1411 of 1726) PASS: LLDB :: Modules/ELF/short-build-id.yaml (1412 of 1726) PASS: lldb-Unit :: Utility/./UtilityTests/BinaryStreamTest.PutULEB128One (1413 of 1726) PASS: lldb-Unit :: Utility/./UtilityTests/StreamTest.PutChar (1414 of 1726) PASS: lldb-Suite :: python_api/objc_type/TestObjCType.py (1415 of 1726) PASS: lldb-Suite :: functionalities/gdb_remote_client/TestRestartBug.py (1416 of 1726) PASS: lldb-Unit :: Utility/./UtilityTests/LogChannelEnabledTest.LogGetLogThread (1417 of 1726) PASS: lldb-Unit :: Utility/./UtilityTests/StringListTest.GetSize (1418 of 1726) PASS: lldb-Unit :: Utility/./UtilityTests/StringListTest.InsertStringAtIndexOutOfBounds (1419 of 1726) PASS: lldb-Suite :: terminal/TestSTTYBeforeAndAfter.py (1420 of 1726) PASS: lldb-Suite :: commands/expression/namespace_local_var_same_name_cpp_and_c/TestNamespaceLocalVarSameNameCppAndC.py (1421 of 1726) PASS: lldb-Unit :: UnwindAssembly/x86/./UnwindAssemblyx86Tests/Testx86AssemblyInspectionEngine.TestAddRSP (1422 of 1726) PASS: lldb-Unit :: ObjectFile/Breakpad/./ObjectFileBreakpadTests/InfoRecord.parse (1423 of 1726) UNSUPPORTED: LLDB :: BuildScript/toolchain-clang-cl.test (1424 of 1726) PASS: lldb-Unit :: Utility/./UtilityTests/VASprintfTest.BufferResize (1425 of 1726) PASS: lldb-Suite :: functionalities/data-formatter/user-format-vs-summary/TestUserFormatVsSummary.py (1426 of 1726) PASS: lldb-Unit :: ScriptInterpreter/Python/./ScriptInterpreterPythonTests/PythonDataObjectsTest.TestGlobalNameResolutionWithDot (1427 of 1726) PASS: lldb-Suite :: lang/cpp/static_members/TestCPPStaticMembers.py (1428 of 1726) PASS: lldb-Unit :: UnwindAssembly/x86/./UnwindAssemblyx86Tests/Testx86AssemblyInspectionEngine.TestPopRBPWithREX (1429 of 1726) PASS: lldb-Unit :: Process/minidump/./LLDBMinidumpTests/MinidumpParserTest.GetPid (1430 of 1726) XFAIL: LLDB :: Unwind/prefer-debug-over-eh-frame.test (1431 of 1726) PASS: lldb-Unit :: Utility/./UtilityTests/StringListTest.LongestCommonPrefix (1432 of 1726) PASS: lldb-Suite :: lang/c/strings/TestCStrings.py (1433 of 1726) PASS: lldb-Suite :: functionalities/show_location/TestShowLocationDwarf5.py (1434 of 1726) PASS: lldb-Suite :: commands/expression/persistent_variables/TestPersistentVariables.py (1435 of 1726) PASS: lldb-Suite :: lang/c/typedef/Testtypedef.py (1436 of 1726) PASS: lldb-Unit :: Language/Highlighting/./HighlighterTests/HighlighterTest.ClangOperators (1437 of 1726) PASS: lldb-Unit :: ScriptInterpreter/Python/./ScriptInterpreterPythonTests/PythonDataObjectsTest.TestPythonTupleToStructuredList (1438 of 1726) PASS: lldb-Suite :: functionalities/param_entry_vals/basic_entry_values_x86_64/TestBasicEntryValuesX86_64.py (1439 of 1726) PASS: lldb-Unit :: Utility/./UtilityTests/ScalarTest.Promotion (1440 of 1726) PASS: lldb-Unit :: Symbol/./SymbolTests/LineEntryTest.GetSameLineContiguousAddressRangeNestedInline (1441 of 1726) PASS: lldb-Unit :: Utility/./UtilityTests/FileSpecTest.RemoveLastPathComponent (1442 of 1726) PASS: lldb-Unit :: Utility/./UtilityTests/AnsiTerminal.AtStart (1443 of 1726) PASS: lldb-Unit :: Utility/./UtilityTests/NameMatchesTest.RegularExpression (1444 of 1726) PASS: lldb-Unit :: Expression/./ExpressionTests/DiagnosticManagerTest.GetStringBasic (1445 of 1726) PASS: lldb-Unit :: Utility/./UtilityTests/ArgsTest.TestInsertArg (1446 of 1726) PASS: lldb-Unit :: Utility/./UtilityTests/VMRange.IsValid (1447 of 1726) PASS: lldb-Unit :: ScriptInterpreter/Python/./ScriptInterpreterPythonTests/PythonDataObjectsTest.TestResetting (1448 of 1726) PASS: lldb-Unit :: Process/minidump/./LLDBMinidumpTests/MinidumpParserTest.GetMemory (1449 of 1726) PASS: lldb-Suite :: functionalities/gdb_remote_client/TestNestedRegDefinitions.py (1450 of 1726) PASS: lldb-Suite :: python_api/frame/TestFrames.py (1451 of 1726) PASS: lldb-Unit :: Utility/./UtilityTests/BinaryStreamTest.PutULEB128MaxValue (1452 of 1726) PASS: lldb-Unit :: ScriptInterpreter/Python/./ScriptInterpreterPythonTests/PythonDataObjectsTest.TestPythonDictionaryValueEquality (1453 of 1726) PASS: lldb-Suite :: lang/objc/objc-runtime-ivars/TestRuntimeIvars.py (1454 of 1726) PASS: lldb-Unit :: Utility/./UtilityTests/StringExtractorTest.GetHexBytesAvail_Partial (1455 of 1726) PASS: lldb-Suite :: functionalities/unwind/sigtramp/TestSigtrampUnwind.py (1456 of 1726) PASS: lldb-Suite :: tools/lldb-vscode/breakpoint/TestVSCode_setBreakpoints.py (1457 of 1726) PASS: LLDB :: Expr/TestTypeOfDeclTypeExpr.test (1458 of 1726) PASS: lldb-Suite :: functionalities/thread/concurrent_events/TestConcurrentSignalWatchBreak.py (1459 of 1726) PASS: lldb-Unit :: ScriptInterpreter/Python/./ScriptInterpreterPythonTests/PythonExceptionStateTest.TestDiscardSemantics (1460 of 1726) PASS: lldb-Suite :: commands/register/register/register_command/TestRegisters.py (1461 of 1726) PASS: lldb-Suite :: functionalities/darwin_log/filter/exact_match/subsystem/TestDarwinLogFilterMatchSubsystem.py (1462 of 1726) PASS: lldb-Unit :: ScriptInterpreter/Python/./ScriptInterpreterPythonTests/PythonDataObjectsTest.TestPythonTupleSize (1463 of 1726) PASS: lldb-Unit :: Utility/./UtilityTests/StringExtractorTest.GetHexBytes_Partial (1464 of 1726) PASS: lldb-Suite :: lang/objc/objc-new-syntax/TestObjCNewSyntaxArray.py (1465 of 1726) PASS: lldb-Unit :: Host/./HostTests/FileSystemTest.Exists (1466 of 1726) PASS: LLDB :: Modules/PECOFF/export-dllfunc.yaml (1467 of 1726) PASS: lldb-Suite :: functionalities/data-formatter/data-formatter-stl/libcxx/vbool/TestDataFormatterLibcxxVBool.py (1468 of 1726) PASS: lldb-Suite :: commands/expression/scoped_enums/TestScopedEnumType.py (1469 of 1726) PASS: lldb-Suite :: macosx/safe-to-func-call/TestSafeFuncCalls.py (1470 of 1726) PASS: lldb-Suite :: lang/objc/objc-struct-return/TestObjCStructReturn.py (1471 of 1726) PASS: lldb-Suite :: functionalities/thread/thread_specific_break_plus_condition/TestThreadSpecificBpPlusCondition.py (1472 of 1726) PASS: LLDB :: SymbolFile/DWARF/debug-types-address-ranges.s (1473 of 1726) PASS: lldb-Suite :: commands/expression/import-std-module/basic/TestImportStdModule.py (1474 of 1726) PASS: lldb-Unit :: Process/gdb-remote/./ProcessGdbRemoteTests/GDBRemoteCommunicationClientTest.GetMemoryRegionInfo (1475 of 1726) PASS: lldb-Unit :: Utility/./UtilityTests/BinaryStreamTest.PutULEB128EightBytes (1476 of 1726) PASS: lldb-Unit :: ScriptInterpreter/Python/./ScriptInterpreterPythonTests/PythonDataObjectsTest.TestExtractingUInt64ThroughStructuredData (1477 of 1726) PASS: lldb-Suite :: benchmarks/expression/TestExpressionCmd.py (1478 of 1726) PASS: lldb-Unit :: ScriptInterpreter/Python/./ScriptInterpreterPythonTests/PythonDataObjectsTest.TestPythonListManipulation (1479 of 1726) PASS: lldb-Unit :: Utility/./UtilityTests/FileSpecTest.EqualDotsPosixRoot (1480 of 1726) PASS: lldb-Unit :: Utility/./UtilityTests/StringLexerTest.NextIf (1481 of 1726) PASS: lldb-Unit :: Utility/./UtilityTests/VMRange.Reset (1482 of 1726) PASS: lldb-Unit :: UnwindAssembly/x86/./UnwindAssemblyx86Tests/Testx86AssemblyInspectionEngine.TestPush0 (1483 of 1726) PASS: lldb-Suite :: commands/settings/quoting/TestQuoting.py (1484 of 1726) PASS: LLDB :: Reproducer/TestFileRepro.test (1485 of 1726) PASS: LLDB :: Minidump/breakpad-symbols.test (1486 of 1726) PASS: lldb-Unit :: Process/gdb-remote/./ProcessGdbRemoteTests/GDBRemoteCommunicationClientTest.SendSignalsToIgnore (1487 of 1726) PASS: lldb-Suite :: functionalities/data-formatter/language_category_updates/TestDataFormatterLanguageCategoryUpdates.py (1488 of 1726) PASS: lldb-Suite :: python_api/process/io/TestProcessIO.py (1489 of 1726) PASS: lldb-Suite :: source-manager/TestSourceManager.py (1490 of 1726) PASS: lldb-Suite :: commands/expression/cast_int_to_anonymous_enum/TestCastIntToAnonymousEnum.py (1491 of 1726) PASS: lldb-Suite :: functionalities/breakpoint/breakpoint_hit_count/TestBreakpointHitCount.py (1492 of 1726) PASS: lldb-Suite :: tools/lldb-server/signal-filtering/TestGdbRemote_QPassSignals.py (1493 of 1726) PASS: lldb-Suite :: functionalities/thread/backtrace_all/TestBacktraceAll.py (1494 of 1726) PASS: lldb-Unit :: Signals/./SignalsTests/UnixSignalsTest.GetInfo (1495 of 1726) PASS: lldb-Unit :: Host/./HostTests/SocketAddressTest.Set (1496 of 1726) PASS: lldb-Unit :: Utility/./UtilityTests/StreamTest.QuotedCString (1497 of 1726) PASS: lldb-Suite :: functionalities/memory-region/TestMemoryRegion.py (1498 of 1726) PASS: lldb-Unit :: Symbol/./SymbolTests/PostfixExpression.ToDWARF (1499 of 1726) PASS: lldb-Suite :: python_api/breakpoint/TestBreakpointAPI.py (1500 of 1726) PASS: lldb-Suite :: functionalities/dead-strip/TestDeadStrip.py (1501 of 1726) PASS: lldb-Unit :: Utility/./UtilityTests/StringListTest.GetMaxStringLengthMixed (1502 of 1726) PASS: lldb-Unit :: UnwindAssembly/x86/./UnwindAssemblyx86Tests/Testx86AssemblyInspectionEngine.TestPushRBPWithREX (1503 of 1726) XFAIL: LLDB :: Register/x86-64-write.test (1504 of 1726) PASS: lldb-Unit :: debugserver/./debugserverTests/RNBSocket.AnyListen (1505 of 1726) UNSUPPORTED: LLDB :: Register/x86-gp-read.test (1506 of 1726) PASS: lldb-Suite :: lang/cpp/namespace_definitions/TestNamespaceDefinitions.py (1507 of 1726) PASS: lldb-Unit :: Utility/./UtilityTests/AnsiTerminal.AtEnd (1508 of 1726) PASS: lldb-Unit :: Utility/./UtilityTests/VMRange.ContainsAddr (1509 of 1726) PASS: lldb-Suite :: functionalities/data-formatter/data-formatter-advanced/TestDataFormatterAdv.py (1510 of 1726) PASS: lldb-Suite :: lang/c/conflicting-symbol/TestConflictingSymbol.py (1511 of 1726) UNSUPPORTED: LLDB :: SymbolFile/PDB/variables.test (1512 of 1726) PASS: lldb-Unit :: Utility/./UtilityTests/StringExtractorTest.GetHexU8_Underflow_NoEof (1513 of 1726) PASS: lldb-Unit :: SymbolFile/DWARF/./SymbolFileDWARFTests/SymbolFileDWARFTests.TestAbbrevOutOfOrder (1514 of 1726) PASS: lldb-Unit :: Target/./TargetTests/PathMappingListTest.AbsoluteTests (1515 of 1726) PASS: lldb-Suite :: functionalities/thread/concurrent_events/TestConcurrentManyCrash.py (1516 of 1726) PASS: lldb-Unit :: Utility/./UtilityTests/UriParserTest.SchemeHostSeparator4 (1517 of 1726) PASS: lldb-Suite :: tools/lldb-vscode/launch/TestVSCode_launch.py (1518 of 1726) UNSUPPORTED: LLDB :: SymbolFile/PDB/udt-layout.test (1519 of 1726) PASS: lldb-Suite :: lang/cpp/type_lookup/TestCppTypeLookup.py (1520 of 1726) PASS: lldb-Unit :: Language/Highlighting/./HighlighterTests/HighlighterTest.ClangCursorOutOfBounds (1521 of 1726) PASS: lldb-Unit :: Utility/./UtilityTests/ArgsTest.TestOverwriteArgs (1522 of 1726) PASS: lldb-Unit :: UnwindAssembly/x86/./UnwindAssemblyx86Tests/Testx86AssemblyInspectionEngine.TestSimple32bitFrameFunction (1523 of 1726) PASS: lldb-Unit :: Utility/./UtilityTests/FileSpecTest.CopyByAppendingPathComponent (1524 of 1726) PASS: lldb-Suite :: lang/objcxx/objcxx-ivar-vector/TestIvarVector.py (1525 of 1726) PASS: lldb-Unit :: Core/./LLDBCoreTests/RichManglingContextTest.IPDRealloc (1526 of 1726) PASS: lldb-Unit :: Utility/./UtilityTests/StringListTest.SplitIntoLinesEmpty (1527 of 1726) PASS: lldb-Unit :: UnwindAssembly/x86/./UnwindAssemblyx86Tests/Testx86AssemblyInspectionEngine.TestAddESP (1528 of 1726) PASS: lldb-Suite :: lang/c/struct_types/TestStructTypes.py (1529 of 1726) PASS: lldb-Unit :: Utility/./UtilityTests/StreamTest.PutRawBytesToBigEndian (1530 of 1726) PASS: lldb-Suite :: functionalities/breakpoint/hardware_breakpoints/hardware_breakpoint_on_multiple_threads/TestHWBreakMultiThread.py (1531 of 1726) PASS: lldb-Unit :: ScriptInterpreter/Python/./ScriptInterpreterPythonTests/PythonDataObjectsTest.TestInstanceNameResolutionNoDot (1532 of 1726) PASS: lldb-Suite :: functionalities/ptr_refs/TestPtrRefs.py (1533 of 1726) PASS: lldb-Suite :: lang/c/anonymous/TestAnonymous.py (1534 of 1726) PASS: lldb-Suite :: commands/process/attach-resume/TestAttachResume.py (1535 of 1726) PASS: lldb-Unit :: Utility/./UtilityTests/ConstStringTest.CompareStringRef (1536 of 1726) PASS: lldb-Unit :: Utility/./UtilityTests/StreamTest.PutRawBytesToMixedEndian (1537 of 1726) PASS: lldb-Suite :: functionalities/darwin_log/filter/regex/category/TestDarwinLogFilterRegexCategory.py (1538 of 1726) PASS: lldb-Unit :: Utility/./UtilityTests/StringListTest.ShiftStdString (1539 of 1726) PASS: lldb-Suite :: functionalities/plugins/command_plugin/TestPluginCommands.py (1540 of 1726) PASS: lldb-Suite :: functionalities/signal/handle-segv/TestHandleSegv.py (1541 of 1726) PASS: lldb-Suite :: lang/objc/foundation/TestRuntimeTypes.py (1542 of 1726) PASS: LLDB :: Register/x86-64-read.test (1543 of 1726) PASS: lldb-Suite :: functionalities/thread/concurrent_events/TestConcurrentDelayedCrashWithBreakpointSignal.py (1544 of 1726) PASS: lldb-Suite :: functionalities/thread/thread_specific_break/TestThreadSpecificBreakpoint.py (1545 of 1726) PASS: lldb-Suite :: commands/expression/class_template_specialization_empty_pack/TestClassTemplateSpecializationParametersHandling.py (1546 of 1726) PASS: lldb-Unit :: Utility/./UtilityTests/StringExtractorTest.GetHexBytes_FullString (1547 of 1726) UNSUPPORTED: LLDB :: SymbolFile/PDB/function-level-linking.test (1548 of 1726) PASS: lldb-Suite :: python_api/interpreter/TestCommandInterpreterAPI.py (1549 of 1726) PASS: lldb-Unit :: Target/./TargetTests/ModuleCacheTest.GetAndPutUuidExists (1550 of 1726) PASS: LLDB :: Reproducer/Functionalities/TestImageList.test (1551 of 1726) PASS: lldb-Suite :: python_api/class_members/TestSBTypeClassMembers.py (1552 of 1726) PASS: lldb-Unit :: Expression/./ExpressionTests/DiagnosticManagerTest.PutStringSeverities (1553 of 1726) PASS: lldb-Unit :: Process/minidump/./LLDBMinidumpTests/MinidumpParserTest.GetMemoryRegionInfoLinuxMaps (1554 of 1726) PASS: lldb-Unit :: Utility/./UtilityTests/StringListTest.LongestCommonPrefixEmpty (1555 of 1726) PASS: lldb-Suite :: functionalities/longjmp/TestLongjmp.py (1556 of 1726) PASS: lldb-Suite :: functionalities/thread/concurrent_events/TestConcurrentDelayedCrashWithBreakpointWatchpoint.py (1557 of 1726) PASS: lldb-Suite :: commands/statistics/basic/TestStats.py (1558 of 1726) PASS: lldb-Suite :: functionalities/darwin_log/filter/regex/activity/TestDarwinLogFilterRegexActivity.py (1559 of 1726) PASS: lldb-Suite :: functionalities/darwin_log/filter/regex/message/TestDarwinLogFilterRegexMessage.py (1560 of 1726) PASS: lldb-Suite :: functionalities/thread/thread_exit/TestThreadExit.py (1561 of 1726) PASS: lldb-Unit :: Utility/./UtilityTests/StringListTest.GetMaxStringLengthEqualSize (1562 of 1726) PASS: lldb-Suite :: lang/objc/foundation/TestObjectDescriptionAPI.py (1563 of 1726) FAIL: lldb-Suite :: functionalities/gdb_remote_client/TestGDBRemoteClient.py (1564 of 1726) ******************** TEST 'lldb-Suite :: functionalities/gdb_remote_client/TestGDBRemoteClient.py' FAILED ******************** lldb version 10.0.99 (http://labmaster3.local/git/llvm-project.git revision 0c0de794f1affc7460eb90626b8483e4a0cbde6c) clang revision 0c0de794f1affc7460eb90626b8483e4a0cbde6c llvm revision 0c0de794f1affc7460eb90626b8483e4a0cbde6c LLDB library dir: /Users/buildslave/jenkins/workspace/lldb-cmake-sanitized/lldb-build/bin LLDB import library dir: /Users/buildslave/jenkins/workspace/lldb-cmake-sanitized/lldb-build/bin libstdcxx tests will not be run because: Don't know how to build with libstdcxx on macosx Skipping following debug info categories: ['dwo']

Hide Details

Session logs for test failures/errors/unexpected successes will go into directory '/Users/buildslave/jenkins/workspace/lldb-cmake-sanitized/test/logs' Command invoked: /Users/buildslave/jenkins/workspace/lldb-cmake-sanitized/llvm-project/lldb/test/dotest.py --arch=x86_64 -s /Users/buildslave/jenkins/workspace/lldb-cmake-sanitized/lldb-build/lldb-test-traces -S nm -u CXXFLAGS -u CFLAGS --executable /Users/buildslave/jenkins/workspace/lldb-cmake-sanitized/lldb-build/./bin/lldb --dsymutil /Users/buildslave/jenkins/workspace/lldb-cmake-sanitized/lldb-build/./bin/dsymutil --filecheck /Users/buildslave/jenkins/workspace/lldb-cmake-sanitized/lldb-build/./bin/FileCheck -C /Users/buildslave/jenkins/workspace/lldb-cmake-sanitized/host-compiler/bin/clang --codesign-identity lldb_codesign --server /Users/buildslave/jenkins/workspace/lldb-cmake-sanitized/lldb-build/./bin/debugserver --arch x86_64 --build-dir /Users/buildslave/jenkins/workspace/lldb-cmake-sanitized/lldb-build/lldb-test-build.noindex -s=/Users/buildslave/jenkins/workspace/lldb-cmake-sanitized/test/logs -t --env TERM=vt100 --env LLVM_LIBS_DIR=/Users/buildslave/jenkins/workspace/lldb-cmake-sanitized/lldb-build/./lib --build-dir /Users/buildslave/jenkins/workspace/lldb-cmake-sanitized/lldb-build/tools/lldb/lldb-test-build.noindex --module-cache-dir /Users/buildslave/jenkins/workspace/lldb-cmake-sanitized/lldb-build/tools/lldb/lldb-test-build.noindex/module-cache-lldb /Users/buildslave/jenkins/workspace/lldb-cmake-sanitized/llvm-project/lldb/packages/Python/lldbsuite/test/functionalities/gdb_remote_client -p TestGDBRemoteClient.py Change dir to: /Users/buildslave/jenkins/workspace/lldb-cmake-sanitized/llvm-project/lldb/packages/Python/lldbsuite/test/functionalities/gdb_remote_client runCmd: settings set symbols.enable-external-lookup false output:

Hide Details

runCmd: settings set plugin.process.gdb-remote.packet-timeout 60 output:

Hide Details

runCmd: settings set symbols.clang-modules-cache-path "/Users/buildslave/jenkins/workspace/lldb-cmake-sanitized/lldb-build/tools/lldb/lldb-test-build.noindex/module-cache-lldb" output:

Hide Details

runCmd: settings set use-color false output:

Hide Details

<bound method SBProcess.Kill of <lldb.SBProcess; proxy of <Swig Object of type 'lldb::SBProcess *' at 0x10d468c00> >>: success

Hide Details

PASS: LLDB (/Users/buildslave/jenkins/workspace/lldb-cmake-sanitized/host-compiler/bin/clang-10-x86_64) :: test_attach_fail (TestGDBRemoteClient.TestGDBRemoteClient) runCmd: settings set symbols.enable-external-lookup false output:

Hide Details

runCmd: settings set plugin.process.gdb-remote.packet-timeout 60 output:

Hide Details

runCmd: settings set symbols.clang-modules-cache-path "/Users/buildslave/jenkins/workspace/lldb-cmake-sanitized/lldb-build/tools/lldb/lldb-test-build.noindex/module-cache-lldb" output:

Hide Details

runCmd: settings set use-color false output:

Hide Details

FAIL: LLDB (/Users/buildslave/jenkins/workspace/lldb-cmake-sanitized/host-compiler/bin/clang-10-x86_64) :: test_connect (TestGDBRemoteClient.TestGDBRemoteClient) <bound method SBProcess.Kill of <lldb.SBProcess; proxy of <Swig Object of type 'lldb::SBProcess *' at 0x10d468960> >>: success

Hide Details

Restore dir to: /Users/buildslave/jenkins/workspace/lldb-cmake-sanitized/lldb-build/tools/lldb/lit ====================================================================== FAIL: test_connect (TestGDBRemoteClient.TestGDBRemoteClient) Test connecting to a remote gdb server ---------------------------------------------------------------------- Traceback (most recent call last): File "/Users/buildslave/jenkins/workspace/lldb-cmake-sanitized/llvm-project/lldb/packages/Python/lldbsuite/test/functionalities/gdb_remote_client/TestGDBRemoteClient.py", line 13, in test_connect process = self.connect(target) File "/Users/buildslave/jenkins/workspace/lldb-cmake-sanitized/llvm-project/lldb/packages/Python/lldbsuite/test/functionalities/gdb_remote_client/gdbclientutils.py", line 479, in connect self.assertTrue(error.Success(), error.description) AssertionError: False is not True : failed to get reply to handshake packet Config=x86_64-/Users/buildslave/jenkins/workspace/lldb-cmake-sanitized/host-compiler/bin/clang-10 ---------------------------------------------------------------------- Ran 2 tests in 62.722s

Hide Details

RESULT: FAILED (1 passes, 1 failures, 0 errors, 0 skipped, 0 expected failures, 0 unexpected successes)

Hide Details

******************** PASS: lldb-Unit :: ScriptInterpreter/Python/./ScriptInterpreterPythonTests/PythonDataObjectsTest.TestPythonDictionaryToStructuredDictionary (1565 of 1726) PASS: LLDB :: Modules/PECOFF/uuid.yaml (1566 of 1726) PASS: LLDB :: SymbolFile/DWARF/debug_ranges_and_rnglists.test (1567 of 1726) UNSUPPORTED: LLDB :: Unwind/unwind-plan-dwarf-dump.test (1568 of 1726) PASS: lldb-Unit :: Utility/./UtilityTests/StringLexerTest.HasAtLeast (1569 of 1726) PASS: lldb-Unit :: UnwindAssembly/x86/./UnwindAssemblyx86Tests/Testx86AssemblyInspectionEngine.TestPopEDI (1570 of 1726) PASS: lldb-Suite :: functionalities/breakpoint/breakpoint_options/TestBreakpointOptions.py (1571 of 1726) PASS: lldb-Unit :: Utility/./UtilityTests/StringListTest.ShiftCString (1572 of 1726) PASS: lldb-Suite :: commands/expression/calculator_mode/TestCalculatorMode.py (1573 of 1726) PASS: lldb-Unit :: Process/minidump/./LLDBMinidumpTests/RegisterContextMinidump.ConvertMinidumpContext_x86_64 (1574 of 1726) PASS: lldb-Unit :: Utility/./UtilityTests/RegisterValueTest.GetSet8 (1575 of 1726) PASS: lldb-Suite :: functionalities/data-formatter/data-formatter-objc/TestDataFormatterObjNSException.py (1576 of 1726) PASS: lldb-Unit :: Utility/./UtilityTests/BinaryStreamTest.PutULEB128ThreeBytes (1577 of 1726) PASS: lldb-Suite :: commands/gui/invalid-args/TestInvalidArgsGui.py (1578 of 1726) PASS: lldb-Unit :: Process/gdb-remote/./ProcessGdbRemoteTests/GDBRemoteCommunicationServerTest.SendErrorResponse_Status (1579 of 1726) PASS: LLDB :: SymbolFile/DWARF/dir-separator-no-comp-dir-relative-name.s (1580 of 1726) PASS: lldb-Suite :: functionalities/step-avoids-no-debug/TestStepNoDebug.py (1581 of 1726) PASS: lldb-Suite :: commands/target/basic/TestTargetCommand.py (1582 of 1726) PASS: lldb-Suite :: lang/c/local_variables/TestLocalVariables.py (1583 of 1726) PASS: lldb-Unit :: Utility/./UtilityTests/RangeTest.Copy (1584 of 1726) PASS: lldb-Unit :: Process/gdb-remote/./ProcessGdbRemoteTests/GDBRemoteClientBaseTest.SendContinueAndInterrupt2PacketBug (1585 of 1726) PASS: lldb-Unit :: UnwindAssembly/x86/./UnwindAssemblyx86Tests/Testx86AssemblyInspectionEngine.Test64bitFramelessSmallStackFrame (1586 of 1726) PASS: lldb-Unit :: Utility/./UtilityTests/BinaryStreamTest.PutULEB128FiveBytes (1587 of 1726) PASS: lldb-Unit :: UnwindAssembly/x86/./UnwindAssemblyx86Tests/Testx86AssemblyInspectionEngine.TestDisassemblyJunkBytes (1588 of 1726) PASS: lldb-Suite :: commands/target/create-deps/TestTargetCreateDeps.py (1589 of 1726) PASS: lldb-Suite :: commands/expression/pr35310/TestExprsBug35310.py (1590 of 1726) PASS: LLDB :: SymbolFile/DWARF/find-variable-dwo.cpp (1591 of 1726) PASS: lldb-Suite :: functionalities/tail_call_frames/inlining_and_tail_calls/TestInliningAndTailCalls.py (1592 of 1726) PASS: lldb-Suite :: lang/c/shared_lib/TestSharedLib.py (1593 of 1726) PASS: lldb-Suite :: python_api/thread/TestThreadAPI.py (1594 of 1726) PASS: LLDB :: SymbolFile/DWARF/debug-types-basic.test (1595 of 1726) PASS: lldb-Unit :: Symbol/./SymbolTests/TestClangASTContext.TestUnifyAccessSpecifiers (1596 of 1726) PASS: lldb-Unit :: Process/minidump/./LLDBMinidumpTests/MinidumpParserTest.GetExceptionStream (1597 of 1726) PASS: lldb-Unit :: Utility/./UtilityTests/StringExtractorTest.DecodeHexU8_Underflow2 (1598 of 1726) PASS: lldb-Suite :: commands/expression/entry-bp/TestExprEntryBP.py (1599 of 1726) PASS: lldb-Unit :: Utility/./UtilityTests/ArgsTest.TestArgv (1600 of 1726) PASS: lldb-Unit :: SymbolFile/DWARF/./SymbolFileDWARFTests/SymbolFileDWARFTests.TestAbbrevInvalidNULLTag (1601 of 1726) PASS: lldb-Suite :: functionalities/avoids-fd-leak/TestFdLeak.py (1602 of 1726) PASS: lldb-Suite :: functionalities/ubsan/user-expression/TestUbsanUserExpression.py (1603 of 1726) PASS: lldb-Unit :: Utility/./UtilityTests/BinaryStreamTest.PutSLEB128MaxValue (1604 of 1726) PASS: lldb-Unit :: Symbol/./SymbolTests/TestClangASTContext.TestRecordHasFields (1605 of 1726) PASS: lldb-Unit :: Host/./HostTests/SocketTest.TCPGetAddress (1606 of 1726) PASS: lldb-Suite :: functionalities/darwin_log/filter/exact_match/activity-chain/TestDarwinLogFilterMatchActivityChain.py (1607 of 1726) PASS: lldb-Unit :: Language/Highlighting/./HighlighterTests/HighlighterTest.ClangIdentifiers (1608 of 1726) PASS: lldb-Unit :: Utility/./UtilityTests/StringListTest.AppendStringStdString (1609 of 1726) PASS: lldb-Unit :: SymbolFile/NativePDB/./SymbolFileNativePDBTests/PDBFPOProgramToDWARFExpressionTests.InvalidOpUnary (1610 of 1726) PASS: lldb-Suite :: lang/c/offsetof/TestOffsetof.py (1611 of 1726) PASS: lldb-Suite :: commands/expression/timeout/TestCallWithTimeout.py (1612 of 1726) PASS: lldb-Suite :: functionalities/plugins/python_os_plugin/TestPythonOSPlugin.py (1613 of 1726) PASS: lldb-Suite :: functionalities/data-formatter/hexcaps/TestDataFormatterHexCaps.py (1614 of 1726) PASS: LLDB :: ExecControl/StopHook/stop-hook.test (1615 of 1726) PASS: lldb-Suite :: commands/expression/expr-in-syscall/TestExpressionInSyscall.py (1616 of 1726) PASS: LLDB :: SymbolFile/NativePDB/source-list.cpp (1617 of 1726) PASS: lldb-Suite :: benchmarks/continue/TestBenchmarkContinue.py (1618 of 1726) PASS: lldb-Suite :: functionalities/data-formatter/pyobjsynthprovider/TestPyObjSynthProvider.py (1619 of 1726) PASS: LLDB :: Driver/TestTarget.test (1620 of 1726) PASS: lldb-Unit :: Language/Highlighting/./HighlighterTests/HighlighterTest.ClangBraces (1621 of 1726) PASS: LLDB :: Settings/TestStopCommandSourceOnError.test (1622 of 1726) PASS: lldb-Suite :: lang/objc/objc-static-method/TestObjCStaticMethod.py (1623 of 1726) PASS: lldb-Suite :: lang/objcxx/class-name-clash/TestNameClash.py (1624 of 1726) PASS: lldb-Suite :: commands/expression/import-std-module/shared_ptr-dbg-info-content/TestSharedPtrDbgInfoContent.py (1625 of 1726) PASS: lldb-Unit :: Utility/./UtilityTests/ListenerTest.GetEventImmediate (1626 of 1726) PASS: lldb-Suite :: lang/objc/self/TestObjCSelf.py (1627 of 1726) PASS: lldb-Suite :: tools/lldb-server/register-reading/TestGdbRemoteGPacket.py (1628 of 1726) PASS: LLDB :: Breakpoint/debug_rnglist_offset_pair.test (1629 of 1726) PASS: lldb-Suite :: functionalities/process_save_core/TestProcessSaveCore.py (1630 of 1726) PASS: lldb-Unit :: Core/./LLDBCoreTests/RichManglingContextTest.Basic (1631 of 1726) PASS: lldb-Unit :: Process/minidump/./LLDBMinidumpTests/MinidumpParserTest.MinidumpDuplicateModuleMinAddress (1632 of 1726) PASS: lldb-Suite :: python_api/value/TestValueAPI.py (1633 of 1726) PASS: lldb-Unit :: Language/Highlighting/./HighlighterTests/HighlighterTest.DefaultHighlighterWithCursorOutOfBounds (1634 of 1726) PASS: lldb-Unit :: Utility/./UtilityTests/RangeTest.Slide (1635 of 1726) PASS: lldb-Unit :: Utility/./UtilityTests/StringExtractorTest.DecodeHexU8_InvalidHex2 (1636 of 1726) PASS: lldb-Unit :: UnwindAssembly/x86/./UnwindAssemblyx86Tests/Testx86AssemblyInspectionEngine.TestSimplex86_64Augmented (1637 of 1726) PASS: lldb-Suite :: android/platform/TestDefaultCacheLineSize.py (1638 of 1726) PASS: lldb-Unit :: Symbol/./SymbolTests/DWARFCallFrameInfoTest.Basic_dwarf3 (1639 of 1726) PASS: lldb-Suite :: commands/source/info/TestSourceInfo.py (1640 of 1726) PASS: lldb-Suite :: lang/cpp/this/TestCPPThis.py (1641 of 1726) PASS: lldb-Suite :: commands/expression/call-restarts/TestCallThatRestarts.py (1642 of 1726) PASS: lldb-Suite :: lang/objc/ivar-IMP/TestObjCiVarIMP.py (1643 of 1726) PASS: lldb-Unit :: Utility/./UtilityTests/Flags.Clear (1644 of 1726) PASS: lldb-Suite :: functionalities/data-formatter/data-formatter-stl/libcxx/bitset/TestDataFormatterLibcxxBitset.py (1645 of 1726) PASS: lldb-Suite :: commands/expression/import-std-module/forward_list-basic/TestBasicForwardList.py (1646 of 1726) PASS: lldb-Unit :: Utility/./UtilityTests/ArgsTest.BareSingleQuote (1647 of 1726) PASS: lldb-Suite :: commands/expression/import-std-module/list-dbg-info-content/TestDbgInfoContentList.py (1648 of 1726) PASS: lldb-Unit :: Utility/./UtilityTests/ScalarTest.CastOperations (1649 of 1726) PASS: lldb-Unit :: Utility/./UtilityTests/RegularExpression.Valid (1650 of 1726) PASS: lldb-Suite :: commands/expression/completion-crash1/TestCompletionCrash1.py (1651 of 1726) PASS: lldb-Suite :: lang/cpp/static_methods/TestCPPStaticMethods.py (1652 of 1726) PASS: lldb-Suite :: tools/lldb-server/TestGdbRemoteAttach.py (1653 of 1726) PASS: lldb-Suite :: functionalities/postmortem/netbsd-core/TestNetBSDCore.py (1654 of 1726) PASS: lldb-Suite :: commands/expression/radar_8638051/Test8638051.py (1655 of 1726) PASS: lldb-Suite :: functionalities/breakpoint/scripted_bkpt/TestScriptedResolver.py (1656 of 1726) PASS: lldb-Suite :: functionalities/breakpoint/global_constructor/TestBreakpointInGlobalConstructor.py (1657 of 1726) PASS: lldb-Unit :: Utility/./UtilityTests/RangeTest.ContainsEndInclusive (1658 of 1726) PASS: lldb-Suite :: commands/expression/invalid-args/TestInvalidArgsExpression.py (1659 of 1726) PASS: LLDB :: Settings/TestEchoCommands.test (1660 of 1726) PASS: lldb-Suite :: commands/frame/diagnose/array/TestArray.py (1661 of 1726) PASS: lldb-Suite :: lang/cpp/class_types/TestClassTypesDisassembly.py (1662 of 1726) PASS: lldb-Unit :: Process/minidump/./LLDBMinidumpTests/MinidumpParserTest.GetThreadContext_x86_32_wow64 (1663 of 1726) PASS: lldb-Suite :: functionalities/backticks/TestBackticksWithoutATarget.py (1664 of 1726) PASS: lldb-Suite :: functionalities/deleted-executable/TestDeletedExecutable.py (1665 of 1726) PASS: lldb-Unit :: Utility/./UtilityTests/StringListTest.Join (1666 of 1726) UNSUPPORTED: LLDB :: SymbolFile/PDB/calling-conventions.test (1667 of 1726) PASS: lldb-Unit :: Host/./HostTests/TaskPoolTest.AddTask (1668 of 1726) PASS: LLDB :: Expr/TestIRMemoryMap.test (1669 of 1726) PASS: lldb-Unit :: Utility/./UtilityTests/BinaryStreamTest.PutSLEB128SevenBytes (1670 of 1726) PASS: lldb-Unit :: Host/./HostTests/FileSystemTest.Readable (1671 of 1726) PASS: LLDB :: Settings/TestDisassemblyFormat.test (1672 of 1726) PASS: lldb-Unit :: Language/Highlighting/./HighlighterTests/HighlighterTest.Keywords (1673 of 1726) PASS: lldb-Unit :: Utility/./UtilityTests/ScalarTest.Division (1674 of 1726) PASS: lldb-Suite :: lang/cpp/operators/TestCppOperators.py (1675 of 1726) PASS: lldb-Suite :: api/multiple-debuggers/TestMultipleDebuggers.py (1676 of 1726) PASS: lldb-Suite :: lang/objc/global_ptrs/TestGlobalObjects.py (1677 of 1726) PASS: lldb-Suite :: commands/expression/call-function/TestCallStopAndContinue.py (1678 of 1726) PASS: lldb-Suite :: commands/expression/import-std-module/deque-dbg-info-content/TestDbgInfoContentDeque.py (1679 of 1726) PASS: lldb-Unit :: Utility/./UtilityTests/StringExtractorTest.GetHexBytesAvail_OddPair (1680 of 1726) PASS: lldb-Suite :: commands/command/nested_alias/TestNestedAlias.py (1681 of 1726) PASS: lldb-Unit :: Symbol/./SymbolTests/SymbolsTest.TerminateLocateExecutableSymbolFileForUnknownExecutableAndUnknownSymbolFile (1682 of 1726) PASS: lldb-Suite :: functionalities/breakpoint/breakpoint_ids/TestBreakpointIDs.py (1683 of 1726) PASS: lldb-Unit :: ScriptInterpreter/Python/./ScriptInterpreterPythonTests/PythonExceptionStateTest.TestExceptionStateChecking (1684 of 1726) PASS: lldb-Suite :: functionalities/tty/TestTerminal.py (1685 of 1726) PASS: LLDB :: Watchpoint/SetErrorCases.test (1686 of 1726) PASS: lldb-Unit :: SymbolFile/DWARF/./SymbolFileDWARFTests/SymbolFileDWARFTests.TestAbbrevOrder1Start5 (1687 of 1726) PASS: lldb-Suite :: commands/frame/diagnose/complicated-expression/TestComplicatedExpression.py (1688 of 1726) PASS: lldb-Suite :: functionalities/tail_call_frames/thread_step_out_or_return/TestSteppingOutWithArtificialFrames.py (1689 of 1726) PASS: lldb-Unit :: Utility/./UtilityTests/VMRange.Ordering (1690 of 1726) PASS: LLDB :: Modules/ELF/duplicate-section.yaml (1691 of 1726) PASS: lldb-Suite :: commands/command/script_alias/TestCommandScriptAlias.py (1692 of 1726) PASS: lldb-Suite :: functionalities/thread/step_out/TestThreadStepOut.py (1693 of 1726) PASS: lldb-Unit :: Utility/./UtilityTests/Flags.Reset (1694 of 1726) PASS: lldb-Unit :: Process/minidump/./LLDBMinidumpTests/MinidumpParserTest.GetThreadsAndGetThreadContext (1695 of 1726) PASS: lldb-Unit :: Utility/./UtilityTests/RangeTest.DefaultConstructor (1696 of 1726) PASS: lldb-Suite :: sample_test/TestSampleTest.py (1697 of 1726) PASS: lldb-Suite :: python_api/lldbutil/process/TestPrintStackTraces.py (1698 of 1726) PASS: lldb-Suite :: functionalities/data-formatter/nsarraysynth/TestNSArraySynthetic.py (1699 of 1726) PASS: lldb-Unit :: Language/Highlighting/./HighlighterTests/HighlighterTest.HighlighterSelectionPath (1700 of 1726) PASS: lldb-Unit :: Utility/./UtilityTests/StringLexerTest.Peek (1701 of 1726) PASS: LLDB :: SymbolFile/DWARF/debug_ranges.s (1702 of 1726) PASS: lldb-Suite :: functionalities/thread/create_during_step/TestCreateDuringStep.py (1703 of 1726) PASS: LLDB :: Reproducer/TestGDBRemoteRepro.test (1704 of 1726) PASS: lldb-Unit :: Utility/./UtilityTests/StringListTest.InsertStringAtIndexEnd (1705 of 1726) PASS: LLDB :: SymbolFile/NativePDB/s_constant.cpp (1706 of 1726) PASS: lldb-Unit :: Utility/./UtilityTests/RecordReplayTest.InstrumentedBarPtr (1707 of 1726) PASS: lldb-Suite :: lang/objc/modules-auto-import/TestModulesAutoImport.py (1708 of 1726) PASS: lldb-Unit :: Utility/./UtilityTests/StreamTest.PutHex16ByteOrderBig (1709 of 1726) PASS: lldb-Suite :: types/TestIntegerTypes.py (1710 of 1726) PASS: lldb-Suite :: commands/expression/import-std-module/weak_ptr/TestWeakPtr.py (1711 of 1726) PASS: lldb-Suite :: lang/objc/ptr_refs/TestPtrRefsObjC.py (1712 of 1726) PASS: lldb-Suite :: commands/expression/import-std-module/forward_list-dbg-info-content/TestDbgInfoContentForwardList.py (1713 of 1726) PASS: lldb-Suite :: commands/frame/language/TestGuessLanguage.py (1714 of 1726) PASS: lldb-Suite :: lang/objc/objc-super/TestObjCSuper.py (1715 of 1726) PASS: lldb-Suite :: commands/expression/persistent_types/TestNestedPersistentTypes.py (1716 of 1726) PASS: lldb-Suite :: functionalities/set-data/TestSetData.py (1717 of 1726) PASS: lldb-Suite :: python_api/lldbutil/iter/TestLLDBIterator.py (1718 of 1726) PASS: lldb-Suite :: functionalities/data-formatter/data-formatter-objc/TestDataFormatterObjCNSContainer.py (1719 of 1726) PASS: lldb-Suite :: lang/objc/foundation/TestObjCMethods.py (1720 of 1726) PASS: lldb-Suite :: commands/expression/import_builtin_fileid/TestImportBuiltinFileID.py (1721 of 1726) PASS: lldb-Suite :: commands/expression/context-object-objc/TestContextObjectObjc.py (1722 of 1726) PASS: lldb-Suite :: functionalities/tsan/multiple/TestTsanMultiple.py (1723 of 1726) PASS: lldb-Suite :: lang/objc/objc-new-syntax/TestObjCNewSyntaxLiteral.py (1724 of 1726) PASS: lldb-Suite :: lang/objc/hidden-ivars/TestHiddenIvars.py (1725 of 1726) TIMEOUT: lldb-Suite :: lang/objc/foundation/TestFoundationDisassembly.py (1726 of 1726) ******************** TEST 'lldb-Suite :: lang/objc/foundation/TestFoundationDisassembly.py' FAILED ******************** Reached timeout of 1200 seconds ******************** Testing Time: 2057.94s ******************** Failing Tests (4): lldb-Suite :: functionalities/gdb_remote_client/TestGDBRemoteLoad.py lldb-Suite :: tools/lldb-server/commandline/TestStubSetSID.py lldb-Suite :: functionalities/gdb_remote_client/TestThreadSelectionBug.py lldb-Suite :: functionalities/gdb_remote_client/TestGDBRemoteClient.py

Hide Details

******************** Timed Out Tests (1): lldb-Suite :: lang/objc/foundation/TestFoundationDisassembly.py

Hide Details

Hide Details

Slowest Tests: -------------------------------------------------------------------------- 117.22s: lldb-Suite :: lang/objc/real-definition/TestRealDefinition.py 120.61s: lldb-Suite :: lang/c/anonymous/TestAnonymous.py 121.41s: lldb-Suite :: commands/target/basic/TestTargetCommand.py 124.84s: lldb-Suite :: lang/objc/hidden-ivars/TestHiddenIvars.py 130.52s: lldb-Suite :: lang/objc/objc-new-syntax/TestObjCNewSyntaxDictionary.py 135.45s: lldb-Suite :: functionalities/inferior-crashing/TestInferiorCrashingStep.py 135.46s: lldb-Suite :: lang/objc/objc-new-syntax/TestObjCNewSyntaxArray.py 135.54s: lldb-Suite :: functionalities/gdb_remote_client/TestGDBRemoteLoad.py 147.34s: lldb-Suite :: functionalities/recursion/TestValueObjectRecursion.py 160.56s: lldb-Suite :: lang/objc/exceptions/TestObjCExceptions.py 164.05s: lldb-Suite :: functionalities/load_unload/TestLoadUnload.py 164.16s: lldb-Suite :: functionalities/return-value/TestReturnValue.py 181.37s: lldb-Suite :: lang/cpp/namespace/TestNamespaceLookup.py 189.42s: lldb-Suite :: lang/objc/foundation/TestObjCMethods.py 193.86s: lldb-Suite :: tools/lldb-server/TestLldbGdbServer.py 207.82s: lldb-Suite :: lang/cpp/enum_types/TestCPP11EnumTypes.py 215.57s: lldb-Suite :: api/multithreaded/TestMultithreaded.py 371.39s: lldb-Suite :: types/TestIntegerTypes.py 541.16s: lldb-Suite :: types/TestIntegerTypesExpr.py 1200.70s: lldb-Suite :: lang/objc/foundation/TestFoundationDisassembly.py

Hide Details

Tests Times: -------------------------------------------------------------------------- [ Range ] :: [ Percentage ] :: [ Count ] -------------------------------------------------------------------------- [ 0s, 100s) :: [*************************************** ] :: [1698/1726] [ 100s, 200s) :: [ ] :: [ 21/1726] [ 200s, 300s) :: [ ] :: [ 4/1726] [ 300s, 400s) :: [ ] :: [ 0/1726] [ 400s, 500s) :: [ ] :: [ 1/1726] [ 500s, 600s) :: [ ] :: [ 1/1726] [ 600s, 700s) :: [ ] :: [ 0/1726] [ 700s, 800s) :: [ ] :: [ 0/1726] [ 800s, 900s) :: [ ] :: [ 0/1726] [ 900s,1000s) :: [ ] :: [ 0/1726] [1000s,1100s) :: [ ] :: [ 0/1726] [1100s,1200s) :: [ ] :: [ 0/1726] [1200s,1300s) :: [ ] :: [ 1/1726] Expected Passes : 1671 Expected Failures : 6 Unsupported Tests : 44 Unexpected Failures: 4 Individual Timeouts: 1 FAILED: tools/lldb/lit/CMakeFiles/check-lldb-lit cd /Users/buildslave/jenkins/workspace/lldb-cmake-sanitized/lldb-build/tools/lldb/lit && /usr/bin/python /Users/buildslave/jenkins/workspace/lldb-cmake-sanitized/lldb-build/./bin/llvm-lit -v --time-tests --shuffle --xunit-xml-output=/Users/buildslave/jenkins/workspace/lldb-cmake-sanitized/test/results.xml -v --timeout 1200 /Users/buildslave/jenkins/workspace/lldb-cmake-sanitized/lldb-build/tools/lldb/lit ninja: build stopped: subcommand failed. Command failed Command: ['/usr/bin/env', 'TERM=vt100', '/usr/local/bin/ninja', '-v', 'check-lldb'] [Pipeline] } [Pipeline] // timeout [Pipeline] } [Pipeline] // stage [Pipeline] stage [Pipeline] { (Declarative: Post Actions) [Pipeline] scanForIssues No credentials specified [Clang (LLVM based)] Sleeping for 5 seconds due to JENKINS-32191... [Clang (LLVM based)] Parsing console log (workspace: '/Users/buildslave/jenkins/workspace/lldb-cmake-sanitized') [Pipeline] junit Recording test results [Pipeline] } [Pipeline] // stage [Pipeline] } [Pipeline] // withEnv [Pipeline] } [Pipeline] // node [Pipeline] End of Pipeline [BFA] Scanning build for known causes... [BFA] Found failure cause(s): [BFA] Regression test failed from category Test [BFA] Ninja target failed from category Compile [BFA] Done. 1s ERROR: script returned exit code 1 Finished: FAILURE