FailedConsole Output

Skipping 6,083 KB.. Full Log
h[?1h=| LLDB (F1) | Target (F2) | Process (F3) | Thread (F4) | View (F5) | Help (F6) |
lqq<Sources>qqqqqqqqqqqqqqqqqqqqqqqqqqqqqqqqqqqqqqqqqqqqqqqqqqqqqqqqqqqqqqqqqqqqqqqqqqqqqqqqqqqqqqqqqqqqqqqqqqqqqqqqqqqqqqqqqqqqqqqqqqqqqqqqqqqqqqqqqqqqqqqqqqqqqqqqqqqqqqqqqqqqqqqqqqqqqqqqqqqqqqqqqqqqqqqqqqqqqqqqqqqqqqqqqqqqqqqqqqqqqqqqqqqqqqqqqqqqqqqqqqqqqqqqqqqqqqqqqqqqqqqqqqqqqqqqqqqqqqqqqqqqqqqqqqqqqqqqqqqqqqqqqqqqqqqqqqqqqqqqqqqqqqqqqqqqqqqqqqqqqqqqqqqqqqqqqqqqqqqqqqqqqqqqqqqqqqqqqqqqqqqqqqqklqq<Threads>qqqqqqqqqqqqqqqqqqqqqqqqqqqqqqqqqqqqqqqqqqqqqqqqqqqqqqqqqqqqqqqqqqqqqqqqqqqqqqqqqqqqqqqkx a.out`main                                                                                                                                                                                                                                                                                                                                                                                                   xx `qprocess 74680xx 1 x int main(int argc, char **argv) {xxxx 2 x   int funky_var_name_that_should_be_rendered = 22;xxxx 3 x`  return 0; // Break here                                                                                                                                                                                                                                                                                                                                                   <<< Thread 1: breakpoint 1.1 xxxx 4 x }xxxx 5 xxxxxxxxxxxxxxxxxxxxxxxxxxxxxxxxxxxxxxxxxxxxxxxxxxxxxxxxxxxxxxxxxxxxxxxxxxxxxxxxxxxxxxxxxxxxxxxxxxxxxxxxxxxxxxxxxxxxxxxxxxxxxxxxxxxxxxxxxlqq<Help>qqqqqqqqqqqqqqqqqqqqqqqqqqqqqqqqqqqqqqqqqqqqqqqqqqqqqqqqqqqqqqqqqqqqqqqqqqqqqqqkxxxxx Welcome to the LLDB curses GUI.xxxxxxxxxxxx Press the TAB key to change the selected view.xxxxxx Each view has its own keyboard shortcuts, press 'h' to open a dialog to display them. xxxxxxxxxxxx Common key bindings for all views:xxxxxxxxxxxxtab - Select next viewxxxxxxh - Show help dialog with view specific key bindingsxxxxxx, - Page upxxxxxx. - Page downxxxxxxup - Select previousxxxxxxdown - Select nextxxxxxxleft - Unexpand or select parentxxxxxxright - Expandxxxxxx    page-up - Page upxxxxxx  page-down - Page downxxxxxmqqqqqqqqqqqqqqqqqqqqqqqqqqqqqqqqqqqqqqqqqqqqqqqqqqqqqqqqqqqqqq[Press any key to exit]qqjxxxxxxxxxxxxxxxxxxxxxxxxxxxxxxxxxxxmqqqqqqqqqqqqqqqqqqqqqqqqqqqqqqqqqqqqqqqqqqqqqqqqqqqqqqqqqqqqqqqqqqqqqqqqqqqqqqqqqqqqqqqqqqqqqqqqqqqqqqqqqqqqqqqqqqqqqqqqqqqqqqqqqqqqqqqqqqqqqqqqqqqqqqqqqqqqqqqqqqqqqqqqqqqqqqqqqqqqqqqqqqqqqqqqqqqqqqqqqqqqqqqqqqqqqqqqqqqqqqqqqqqqqqqqqqqqqqqqqqqqqqqqqqqqqqqqqqqqqqqqqqqqqqqqqqqqqqqqqqqqqqqqqqqqqqqqqqqqqqqqqqqqqqqqqqqqqqqqqqqqqqqqqqqqqqqqqqqqqqqqqqqqqqqqqqqqqqqqqqqqqqqqqqqqqqqqqqqqqqqqqqqqqqqqqqqqqqjxxlqq<Variables>qqqqqqqqqqqqqqqqqqqqqqqqqqqqqqqqqqqqqqqqqqqqqqqqqqqqqqqqqqqqqqqqqqqqqqqqqqqqqqqqqqqqqqqqqqqqqqqqqqqqqqqqqqqqqqqqqqqqqqqqqqqqqqqqqqqqqqqqqqqqqqqqqqqqqqqqqqqqqqqqqqqqqqqqqqqqqqqqqqqqqqqqqqqqqqqqqqqqqqqqqqqqqqqqqqqqqqqqqqqqqqqqqqqqqqqqqqqqqqqqqqqqqqqqqqqqqqqqqqqqqqqqqqqqqqqqqqqqqqqqqqqqqqqqqqqqqqqqqqqqqqqqqqqqqqqqqqqqqqqqqqqqqqqqqqqqqqqqqqqqqqqqqqqqqqqqqqqqqqqqqqqqqqqqqqqqqqqqqqqqqqqqqkxxx (int) argc = 1xxxx `q(char **) argv = 0x00007ffeefbff530xxxx (int) funky_var_name_that_should_be_rendered = 22xxxxxxxxxxxxxxxxxxxxxxxxxxxxxxxxxxxxxxxxxxxxxxxxxxxxxxxxxxxxxxxxxxxxxxxxxxxxxxxxxxxxxxxxxxxxxxxxxxxxxxxmqqqqqqqqqqqqqqqqqqqqqqqqqqqqqqqqqqqqqqqqqqqqqqqqqqqqqqqqqqqqqqqqqqqqqqqqqqqqqqqqqqqqqqqqqqqqqqqqqqqqqqqqqqqqqqqqqqqqqqqqqqqqqqqqqqqqqqqqqqqqqqqqqqqqqqqqqqqqqqqqqqqqqqqqqqqqqqqqqqqqqqqqqqqqqqqqqqqqqqqqqqqqqqqqqqqqqqqqqqqqqqqqqqqqqqqqqqqqqqqqqqqqqqqqqqqqqqqqqqqqqqqqqqqqqqqqqqqqqqqqqqqqqqqqqqqqqqqqqqqqqqqqqqqqqqqqqqqqqqqqqqqqqqqqqqqqqqqqqqqqqqqqqqqqqqqqqqqqqqqqqqqqqqqqqqqqqqqqqqqqqqqqqqqqqqqqqqqqqqjmqqqqqqqqqqqqqqqqqqqqqqqqqqqqqqqqqqqqqqqqqqqqqqqqqqqqqqqqqqqqqqqqqqqqqqqqqqqqqqqqqqqqqqqqqqqqqqqqqqjProcess: 74680    stopped               Thread: 0x68ebcc    Frame:   0  PC = 0x0000000100000fab
lqq<Sources>qqqqqqqqqqqqqqqqqqqqqqqqqqqqqqqqqqqqqqqqqqqqqqqqqqqqqqqqqqqqqqqqqqqqqqqqqqqqqqqqqqqqqqqqqqqqqqqqqqqqqqqqqqqqqqqqqqqqqqqqqqqqqqqqqqqqqqqqqqqqqqqqqqqqqqqqqqqqqqqqqqqqqqqqqqqqqqqqqqqqqqqqqqqqqqqqqqqqqqqqqqqqqqqqqqqqqqqqqqqqqqqqqqqqqqqqqqqqqqqqqqqqqqqqqqqqqqqqqqqqqqqqqqqqqqqqqqqqqqqqqqqqqqqqqqqqqqqqqqqqqqqqqqqqqqqqqqqqqqqqqqqqqqqqqqqqqqqqqqqqqqqqqqqqqqqqqqqqqqqqqqqqqqqqqqqqqqqqqqqqqqqqqqqk
xx
xx
xx
xx
xx
xx
xx
xx
xx
xx
xx
xx
xx
xx
xx
xx
xx
xx
xx
xx
xx
xx
xx
xx
xx
xx
xx
xx
xx
xx
xx
xx
xx
xx
xx
xx
xx
xx
xx
x                                                                                         x
x                                  x
x  x
x                                                 x
x                                                                                         x
x  x
x                                     x
x  x
x                        x
x                                                      x
x             x
x               x
x                      x
x                    x
x                                  x
x                x
x                       x
x                         x
x                                                                                         x
xx
xx
xx
xx
xx
xx
xx
xx
mqqqqqqqqqqqqqqqqqqqqqqqqqqqqqqqqqqqqqqqqqqqqqqqqqqqqqqqqqqqqqqqqqqqqqqqqqqqqqqqqqqqqqqqqqqqqqqqqqqqqqqqqqqqqqqqqqqqqqqqqqqqqqqqqqqqqqqqqqqqqqqqqqqqqqqqqqqqqqqqqqqqqqqqqqqqqqqqqqqqqqqqqqqqqqqqqqqqqqqqqqqqqqqqqqqqqqqqqqqqqqqqqqqqqqqqqqqqqqqqqqqqqqqqqqqqqqqqqqqqqqqqqqqqqqqqqqqqqqqqqqqqqqqqqqqqqqqqqqqqqqqqqqqqqqqqqqqqqqqqqqqqqqqqqqqqqqqqqqqqqqqqqqqqqqqqqqqqqqqqqqqqqqqqqqqqqqqqqqqqqqqqqqqqqqqqqqqqqqqj
[?1l>(lldb) gui
gui
(B)0[?7h[?1h=| LLDB (F1) | Target (F2) | Process (F3) | Thread (F4) | View (F5) | Help (F6) |
lqq<Sources>qqqqqqqqqqqqqqqqqqqqqqqqqqqqqqqqqqqqqqqqqqqqqqqqqqqqqqqqqqqqqqqqqqqqqqqqqqqqqqqqqqqqqqqqqqqqqqqqqqqqqqqqqqqqqqqqqqqqqqqqqqqqqqqqqqqqqqqqqqqqqqqqqqqqqqqqqqqqqqqqqqqqqqqqqqqqqqqqqqqqqqqqqqqqqqqqqqqqqqqqqqqqqqqqqqqqqqqqqqqqqqqqqqqqqqqqqqqqqqqqqqqqqqqqqqqqqqqqqqqqqqqqqqqqqqqqqqqqqqqqqqqqqqqqqqqqqqqqqqqqqqqqqqqqqqqqqqqqqqqqqqqqqqqqqqqqqqqqqqqqqqqqqqqqqqqqqqqqqqqqqqqqqqqqqqqqqqqqqqqqqqqqqqqklqq<Threads>qqqqqqqqqqqqqqqqqqqqqqqqqqqqqqqqqqqqqqqqqqqqqqqqqqqqqqqqqqqqqqqqqqqqqqqqqqqqqqqqqqqqqqqkx a.out`main                                                                                                                                                                                                                                                                                                                                                                                                   xx `qprocess 74680xx 1 x int main(int argc, char **argv) {xxxx 2 x   int funky_var_name_that_should_be_rendered = 22;xxxx 3 x`  return 0; // Break here                                                                                                                                                                                                                                                                                                                                                   <<< Thread 1: breakpoint 1.1 xxxx 4 x }xxxx 5 xxxxxxxxxxxxxxxxxxxxxxxxxxxxxxxxxxxxxxxxxxxxxxxxxxxxxxxxxxxxxxxxxxxxxxxxxxxxxxxxxxxxxxxxxxxxxxxxxxxxxxxxxxxxxxxxxxxxxxxxxxxxxxxxxxxxxxxxxxxxxxxxxxxxxxxxxxxxxxxxxxxxxxxxxxxxxxxxxxxxxxxxxxxxxxxxxxxxxxxxxxxxxxxxxxxxxxxxxxxxxxxxxxxxxxxxxxxxxxxxxxxxmqqqqqqqqqqqqqqqqqqqqqqqqqqqqqqqqqqqqqqqqqqqqqqqqqqqqqqqqqqqqqqqqqqqqqqqqqqqqqqqqqqqqqqqqqqqqqqqqqqqqqqqqqqqqqqqqqqqqqqqqqqqqqqqqqqqqqqqqqqqqqqqqqqqqqqqqqqqqqqqqqqqqqqqqqqqqqqqqqqqqqqqqqqqqqqqqqqqqqqqqqqqqqqqqqqqqqqqqqqqqqqqqqqqqqqqqqqqqqqqqqqqqqqqqqqqqqqqqqqqqqqqqqqqqqqqqqqqqqqqqqqqqqqqqqqqqqqqqqqqqqqqqqqqqqqqqqqqqqqqqqqqqqqqqqqqqqqqqqqqqqqqqqqqqqqqqqqqqqqqqqqqqqqqqqqqqqqqqqqqqqqqqqqqqqqqqqqqqqqjxxlqq<Variables>qqqqqqqqqqqqqqqqqqqqqqqqqqqqqqqqqqqqqqqqqqqqqqqqqqqqqqqqqqqqqqqqqqqqqqqqqqqqqqqqqqqqqqqqqqqqqqqqqqqqqqqqqqqqqqqqqqqqqqqqqqqqqqqqqqqqqqqqqqqqqqqqqqqqqqqqqqqqqqqqqqqqqqqqqqqqqqqqqqqqqqqqqqqqqqqqqqqqqqqqqqqqqqqqqqqqqqqqqqqqqqqqqqqqqqqqqqqqqqqqqqqqqqqqqqqqqqqqqqqqqqqqqqqqqqqqqqqqqqqqqqqqqqqqqqqqqqqqqqqqqqqqqqqqqqqqqqqqqqqqqqqqqqqqqqqqqqqqqqqqqqqqqqqqqqqqqqqqqqqqqqqqqqqqqqqqqqqqqqqqqqqqqkxxx (int) argc = 1xxxx `q(char **) argv = 0x00007ffeefbff530xxxx (int) funky_var_name_that_should_be_rendered = 22xxxxxxxxxxxxxxxxxxxxxxxxxxxxxxxxxxxxxxxxxxxxxxxxxxxxxxxxxxxxxxxxxxxxxxxxxxxxxxxxxxxxxxxxxxxxxxxxxxxxxxxmqqqqqqqqqqqqqqqqqqqqqqqqqqqqqqqqqqqqqqqqqqqqqqqqqqqqqqqqqqqqqqqqqqqqqqqqqqqqqqqqqqqqqqqqqqqqqqqqqqqqqqqqqqqqqqqqqqqqqqqqqqqqqqqqqqqqqqqqqqqqqqqqqqqqqqqqqqqqqqqqqqqqqqqqqqqqqqqqqqqqqqqqqqqqqqqqqqqqqqqqqqqqqqqqqqqqqqqqqqqqqqqqqqqqqqqqqqqqqqqqqqqqqqqqqqqqqqqqqqqqqqqqqqqqqqqqqqqqqqqqqqqqqqqqqqqqqqqqqqqqqqqqqqqqqqqqqqqqqqqqqqqqqqqqqqqqqqqqqqqqqqqqqqqqqqqqqqqqqqqqqqqqqqqqqqqqqqqqqqqqqqqqqqqqqqqqqqqqqqjmqqqqqqqqqqqqqqqqqqqqqqqqqqqqqqqqqqqqqqqqqqqqqqqqqqqqqqqqqqqqqqqqqqqqqqqqqqqqqqqqqqqqqqqqqqqqqqqqqqjProcess: 74680    stopped               Thread: 0x68ebcc    Frame:   0  PC = 0x0000000100000fab
[?1l>(lldb) settings set interpreter.prompt-on-quit false

Hide Details

Session logs for test failures/errors/unexpected successes will go into directory '/Users/buildslave/jenkins/workspace/lldb-cmake-sanitized/test/logs' Command invoked: /Users/buildslave/jenkins/workspace/lldb-cmake-sanitized/llvm-project/lldb/test/dotest.py --arch=x86_64 -s /Users/buildslave/jenkins/workspace/lldb-cmake-sanitized/lldb-build/lldb-test-traces -S nm -u CXXFLAGS -u CFLAGS --executable /Users/buildslave/jenkins/workspace/lldb-cmake-sanitized/lldb-build/./bin/lldb --dsymutil /Users/buildslave/jenkins/workspace/lldb-cmake-sanitized/lldb-build/./bin/dsymutil --filecheck /Users/buildslave/jenkins/workspace/lldb-cmake-sanitized/lldb-build/./bin/FileCheck -C /Users/buildslave/jenkins/workspace/lldb-cmake-sanitized/host-compiler/bin/clang --codesign-identity lldb_codesign --server /Users/buildslave/jenkins/workspace/lldb-cmake-sanitized/lldb-build/./bin/debugserver --arch x86_64 --build-dir /Users/buildslave/jenkins/workspace/lldb-cmake-sanitized/lldb-build/lldb-test-build.noindex -s=/Users/buildslave/jenkins/workspace/lldb-cmake-sanitized/test/logs -t --env TERM=vt100 --env LLVM_LIBS_DIR=/Users/buildslave/jenkins/workspace/lldb-cmake-sanitized/lldb-build/./lib --build-dir /Users/buildslave/jenkins/workspace/lldb-cmake-sanitized/lldb-build/tools/lldb/lldb-test-build.noindex --module-cache-dir /Users/buildslave/jenkins/workspace/lldb-cmake-sanitized/lldb-build/tools/lldb/lldb-test-build.noindex/module-cache-lldb /Users/buildslave/jenkins/workspace/lldb-cmake-sanitized/llvm-project/lldb/packages/Python/lldbsuite/test/commands/gui/basic -p TestGuiBasic.py Change dir to: /Users/buildslave/jenkins/workspace/lldb-cmake-sanitized/llvm-project/lldb/packages/Python/lldbsuite/test/commands/gui/basic runCmd: settings set symbols.enable-external-lookup false output:

Hide Details

runCmd: settings set plugin.process.gdb-remote.packet-timeout 60 output:

Hide Details

runCmd: settings set symbols.clang-modules-cache-path "/Users/buildslave/jenkins/workspace/lldb-cmake-sanitized/lldb-build/tools/lldb/lldb-test-build.noindex/module-cache-lldb" output:

Hide Details

runCmd: settings set use-color false output:

Hide Details

FAIL: LLDB (/Users/buildslave/jenkins/workspace/lldb-cmake-sanitized/host-compiler/bin/clang-10-x86_64) :: test_gui (TestGuiBasic.BasicGuiCommandTest) tearing down the child process....

Hide Details

CLEANUP ERROR: LLDB (/Users/buildslave/jenkins/workspace/lldb-cmake-sanitized/host-compiler/bin/clang-10-x86_64) :: test_gui (TestGuiBasic.BasicGuiCommandTest) Restore dir to: /Users/buildslave/jenkins/workspace/lldb-cmake-sanitized/lldb-build/tools/lldb/lit ====================================================================== ERROR: test_gui (TestGuiBasic.BasicGuiCommandTest) ---------------------------------------------------------------------- Traceback (most recent call last): File "/Users/buildslave/jenkins/workspace/lldb-cmake-sanitized/llvm-project/lldb/packages/Python/lldbsuite/test/commands/gui/basic/TestGuiBasic.py", line 60, in test_gui self.quit() File "/Users/buildslave/jenkins/workspace/lldb-cmake-sanitized/llvm-project/lldb/packages/Python/lldbsuite/test/lldbpexpect.py", line 61, in quit self.child.close(force=not gracefully) File "/Users/buildslave/jenkins/workspace/lldb-cmake-sanitized/llvm-project/lldb/third_party/Python/module/pexpect-4.6/pexpect/pty_spawn.py", line 327, in close self.ptyproc.close(force=force) File "/System/Library/Frameworks/Python.framework/Versions/2.7/lib/python2.7/contextlib.py", line 35, in __exit__ self.gen.throw(type, value, traceback) File "/Users/buildslave/jenkins/workspace/lldb-cmake-sanitized/llvm-project/lldb/third_party/Python/module/pexpect-4.6/pexpect/pty_spawn.py", line 25, in _wrap_ptyprocess_err raise ExceptionPexpect(*e.args) ExceptionPexpect: Could not terminate the child. Config=x86_64-/Users/buildslave/jenkins/workspace/lldb-cmake-sanitized/host-compiler/bin/clang-10 ---------------------------------------------------------------------- Ran 1 test in 8.900s

Hide Details

RESULT: FAILED (0 passes, 0 failures, 1 errors, 0 skipped, 0 expected failures, 0 unexpected successes)

Hide Details

******************** PASS: lldb-Unit :: Host/./HostTests/TaskPoolTest.AddTask (746 of 1726) PASS: lldb-Unit :: Utility/./UtilityTests/ArgsTest.TestUnknownEscape (747 of 1726) PASS: lldb-Unit :: UnwindAssembly/x86/./UnwindAssemblyx86Tests/Testx86AssemblyInspectionEngine.TestMovRSPtoRBP (748 of 1726) PASS: lldb-Suite :: api/multithreaded/TestMultithreaded.py (749 of 1726) PASS: lldb-Suite :: lang/cpp/unicode-literals/TestUnicodeLiterals.py (750 of 1726) PASS: lldb-Suite :: lang/objc/objc-struct-return/TestObjCStructReturn.py (751 of 1726) PASS: lldb-Unit :: Utility/./UtilityTests/StatusTest.ErrorConversion (752 of 1726) PASS: lldb-Suite :: functionalities/data-formatter/nsdictionarysynth/TestNSDictionarySynthetic.py (753 of 1726) PASS: lldb-Unit :: UnwindAssembly/x86/./UnwindAssemblyx86Tests/Testx86AssemblyInspectionEngine.TestPushRBP (754 of 1726) PASS: LLDB :: SymbolFile/NativePDB/nested-types.cpp (755 of 1726) PASS: lldb-Unit :: Utility/./UtilityTests/BinaryStreamTest.PutULEB128One (756 of 1726) PASS: lldb-Unit :: Utility/./UtilityTests/StructuredDataTest.ParseJSONFromFile (757 of 1726) PASS: lldb-Suite :: functionalities/data-formatter/language_category_updates/TestDataFormatterLanguageCategoryUpdates.py (758 of 1726) PASS: lldb-Unit :: ScriptInterpreter/Python/./ScriptInterpreterPythonTests/PythonDataObjectsTest.TestPythonDictionaryToStructuredDictionary (759 of 1726) PASS: lldb-Unit :: Utility/./UtilityTests/ArgsTest.ReplaceArgumentAtIndexOutOfRange (760 of 1726) PASS: lldb-Suite :: functionalities/gdb_remote_client/TestRestartBug.py (761 of 1726) PASS: LLDB :: SymbolFile/NativePDB/global-classes.cpp (762 of 1726) PASS: lldb-Suite :: commands/add-dsym/uuid/TestAddDsymCommand.py (763 of 1726) UNSUPPORTED: LLDB :: Register/x86-64-xmm16-read.test (764 of 1726) PASS: LLDB :: SymbolFile/NativePDB/break-by-function.cpp (765 of 1726) PASS: lldb-Suite :: macosx/add-dsym/TestAddDsymMidExecutionCommand.py (766 of 1726) PASS: lldb-Unit :: Utility/./UtilityTests/ScalarTest.GetBytes (767 of 1726) PASS: lldb-Suite :: functionalities/unwind/noreturn/module-end/TestNoReturnModuleEnd.py (768 of 1726) PASS: lldb-Suite :: lang/c/const_variables/TestConstVariables.py (769 of 1726) PASS: lldb-Suite :: lang/objcxx/class-name-clash/TestNameClash.py (770 of 1726) PASS: lldb-Unit :: ObjectFile/Breakpad/./ObjectFileBreakpadTests/ModuleRecord.parse (771 of 1726) PASS: lldb-Unit :: Utility/./UtilityTests/StreamTest.PutHex8 (772 of 1726) PASS: lldb-Suite :: functionalities/thread/create_during_step/TestCreateDuringStep.py (773 of 1726) PASS: lldb-Unit :: Expression/./ExpressionTests/DiagnosticManagerTest.GetStringBasic (774 of 1726) PASS: lldb-Unit :: UnwindAssembly/x86/./UnwindAssemblyx86Tests/Testx86AssemblyInspectionEngine.Testi386IgnoredRegisters (775 of 1726) PASS: lldb-Suite :: commands/expression/call-function/TestCallStdStringFunction.py (776 of 1726) PASS: LLDB :: Modules/ELF/PT_TLS-overlap-PT_LOAD.yaml (777 of 1726) PASS: LLDB :: SymbolFile/DWARF/split-dwarf-inlining.cpp (778 of 1726) PASS: lldb-Suite :: functionalities/thread/concurrent_events/TestConcurrentCrashWithWatchpoint.py (779 of 1726) PASS: lldb-Unit :: Process/minidump/./LLDBMinidumpTests/MinidumpParserTest.GetMiscInfoWindows (780 of 1726) UNSUPPORTED: LLDB :: Register/x86-ymm-write.test (781 of 1726) UNSUPPORTED: LLDB :: Register/x86-ymm-read.test (782 of 1726) PASS: lldb-Suite :: macosx/find-app-in-bundle/TestFindAppInBundle.py (783 of 1726) PASS: lldb-Suite :: lang/objc/modules-inline-functions/TestModulesInlineFunctions.py (784 of 1726) PASS: lldb-Suite :: functionalities/data-formatter/typedef_array/TestTypedefArray.py (785 of 1726) PASS: lldb-Suite :: functionalities/dead-strip/TestDeadStrip.py (786 of 1726) PASS: lldb-Unit :: Utility/./UtilityTests/ArgsTest.GetQuotedCommandString (787 of 1726) PASS: LLDB :: Modules/ELF/many-sections.s (788 of 1726) PASS: lldb-Suite :: benchmarks/stepping/TestSteppingSpeed.py (789 of 1726) PASS: lldb-Suite :: functionalities/non-overlapping-index-variable-i/TestIndexVariable.py (790 of 1726) PASS: lldb-Suite :: functionalities/multidebugger_commands/TestMultipleDebuggersCommands.py (791 of 1726) PASS: lldb-Unit :: Utility/./UtilityTests/StringLexerTest.Next (792 of 1726) PASS: lldb-Unit :: Utility/./UtilityTests/ArchSpecTest.Compatibility (793 of 1726) PASS: lldb-Unit :: Host/./HostTests/ConnectionFileDescriptorTest.TCPGetURIv6 (794 of 1726) PASS: lldb-Suite :: functionalities/breakpoint/breakpoint_by_line_and_column/TestBreakpointByLineAndColumn.py (795 of 1726) PASS: lldb-Unit :: Utility/./UtilityTests/StreamTest.PutHex16ByteOrderBig (796 of 1726) PASS: lldb-Suite :: macosx/function-starts/TestFunctionStarts.py (797 of 1726) PASS: lldb-Unit :: Utility/./UtilityTests/FileSpecTest.CopyByAppendingPathComponent (798 of 1726) PASS: lldb-Unit :: Utility/./UtilityTests/StringListTest.CopyListEmpty (799 of 1726) PASS: lldb-Unit :: Process/gdb-remote/./ProcessGdbRemoteTests/GDBRemoteClientBaseTest.SendContinueAndWait (800 of 1726) PASS: lldb-Suite :: commands/expression/import-std-module/conflicts/TestStdModuleWithConflicts.py (801 of 1726) PASS: lldb-Unit :: Utility/./UtilityTests/StringExtractorTest.GetHexBytes_FullString (802 of 1726) PASS: lldb-Unit :: Utility/./UtilityTests/StringListTest.SplitIntoLinesEmpty (803 of 1726) PASS: lldb-Unit :: Utility/./UtilityTests/StreamTest.ShiftOperatorPtr (804 of 1726) PASS: lldb-Suite :: functionalities/breakpoint/breakpoint_in_delayslot/TestAvoidBreakpointInDelaySlot.py (805 of 1726) PASS: lldb-Suite :: linux/thread/create_during_instruction_step/TestCreateDuringInstructionStep.py (806 of 1726) PASS: lldb-Unit :: Expression/./ExpressionTests/ClangHostTest.MacOSX (807 of 1726) PASS: LLDB :: Heap/heap-cstr.test (808 of 1726) PASS: lldb-Unit :: Utility/./UtilityTests/EnvironmentTest.EnvpConversion (809 of 1726) PASS: lldb-Suite :: functionalities/data-formatter/data-formatter-categories/TestDataFormatterCategories.py (810 of 1726) PASS: lldb-Unit :: Target/./TargetTests/MemoryRegionInfoTest.Formatv (811 of 1726) PASS: lldb-Unit :: Utility/./UtilityTests/StreamTest.QuotedCString (812 of 1726) PASS: lldb-Suite :: lang/c/array_types/TestArrayTypes.py (813 of 1726) PASS: lldb-Unit :: Language/Highlighting/./HighlighterTests/HighlighterTest.ClangPPDirectives (814 of 1726) PASS: lldb-Unit :: Utility/./UtilityTests/BinaryStreamTest.PutULEB128FourBytes (815 of 1726) PASS: lldb-Suite :: functionalities/thread/state/TestThreadStates.py (816 of 1726) PASS: LLDB :: Modules/PECOFF/subsections.yaml (817 of 1726) PASS: LLDB :: SymbolFile/Breakpad/line-table-mixed-path-styles.test (818 of 1726) PASS: LLDB :: Register/x86-64-gp-read.test (819 of 1726) PASS: lldb-Unit :: Utility/./UtilityTests/UriParserTest.TypicalPortPath (820 of 1726) PASS: lldb-Unit :: Process/gdb-remote/./ProcessGdbRemoteTests/GDBRemoteCommunicationTest.ReadPacket_checksum (821 of 1726) PASS: lldb-Suite :: lang/objcxx/objcxx-ivar-vector/TestIvarVector.py (822 of 1726) PASS: lldb-Suite :: functionalities/data-formatter/data-formatter-stl/libstdcpp/tuple/TestDataFormatterStdTuple.py (823 of 1726) PASS: lldb-Suite :: commands/register/register/register_command/TestRegisters.py (824 of 1726) PASS: lldb-Unit :: Utility/./UtilityTests/BinaryStreamTest.PutSLEB128FiveBytes (825 of 1726) PASS: lldb-Unit :: Utility/./UtilityTests/DataExtractorTest.PeekData (826 of 1726) PASS: lldb-Suite :: python_api/value/change_values/TestChangeValueAPI.py (827 of 1726) PASS: lldb-Unit :: Utility/./UtilityTests/OptionsWithRawTest.LeadingSpaceArgs (828 of 1726) PASS: lldb-Unit :: Host/./HostTests/ProcessLaunchInfoTest.Constructor (829 of 1726) PASS: LLDB :: Quit/TestQuitExitCode30.test (830 of 1726) PASS: lldb-Unit :: Host/./HostTests/SocketTest.TCPListen0ConnectAccept (831 of 1726) PASS: lldb-Unit :: Process/gdb-remote/./ProcessGdbRemoteTests/GDBRemoteCommunicationClientTest.WriteRegister (832 of 1726) PASS: LLDB :: SymbolFile/Breakpad/symtab-macho.test (833 of 1726) PASS: lldb-Suite :: functionalities/data-formatter/data-formatter-named-summaries/TestDataFormatterNamedSummaries.py (834 of 1726) PASS: lldb-Suite :: python_api/thread/TestThreadAPI.py (835 of 1726) PASS: lldb-Suite :: python_api/sblaunchinfo/TestSBLaunchInfo.py (836 of 1726) PASS: lldb-Unit :: Utility/./UtilityTests/FileSpecTest.PrependPathComponent (837 of 1726) PASS: lldb-Suite :: lang/objc/modules-auto-import/TestModulesAutoImport.py (838 of 1726) PASS: lldb-Unit :: ScriptInterpreter/Python/./ScriptInterpreterPythonTests/PythonDataObjectsTest.TestBorrowedReferences (839 of 1726) PASS: lldb-Suite :: functionalities/data-formatter/compactvectors/TestCompactVectors.py (840 of 1726) PASS: lldb-Unit :: Utility/./UtilityTests/BinaryStreamTest.PutULEB128OneByte (841 of 1726) PASS: lldb-Suite :: functionalities/thread/concurrent_events/TestConcurrentSignalBreak.py (842 of 1726) PASS: lldb-Unit :: Utility/./UtilityTests/StringListTest.JoinMultiCharSeparator (843 of 1726) PASS: lldb-Unit :: Process/minidump/./LLDBMinidumpTests/MinidumpParserTest.GetArchitectureWindows (844 of 1726) PASS: lldb-Unit :: Utility/./UtilityTests/OptionsWithRawTest.ArgsButNoDelimiter (845 of 1726) PASS: lldb-Suite :: commands/expression/ir-interpreter-phi-nodes/TestIRInterpreterPHINodes.py (846 of 1726) PASS: lldb-Unit :: Utility/./UtilityTests/StringExtractorTest.GetU64BigEndian (847 of 1726) PASS: lldb-Suite :: functionalities/show_location/TestShowLocationDwarf5.py (848 of 1726) PASS: lldb-Suite :: functionalities/tsan/multiple/TestTsanMultiple.py (849 of 1726) PASS: lldb-Unit :: Utility/./UtilityTests/StringListTest.ShiftStdString (850 of 1726) PASS: LLDB :: Quit/TestQuitExitCodeImplicit0.test (851 of 1726) PASS: lldb-Unit :: Utility/./UtilityTests/RangeTest.ContainsAddr (852 of 1726) PASS: lldb-Suite :: macosx/universal/TestUniversal.py (853 of 1726) PASS: lldb-Unit :: Utility/./UtilityTests/Flags.AnySet (854 of 1726) PASS: lldb-Suite :: lang/cpp/member-and-local-vars-with-same-name/TestMembersAndLocalsWithSameName.py (855 of 1726) PASS: lldb-Suite :: lang/objc/objc-super/TestObjCSuper.py (856 of 1726) PASS: lldb-Suite :: lang/cpp/thread_local/TestThreadLocal.py (857 of 1726) PASS: lldb-Suite :: commands/expression/import-std-module/weak_ptr-dbg-info-content/TestDbgInfoContentWeakPtr.py (858 of 1726) PASS: lldb-Suite :: lang/cpp/symbols/TestSymbols.py (859 of 1726) PASS: lldb-Suite :: lang/objc/print-obj/TestPrintObj.py (860 of 1726) PASS: lldb-Suite :: lang/cpp/type_lookup/TestCppTypeLookup.py (861 of 1726) PASS: LLDB :: ExecControl/StopHook/stop-hook.test (862 of 1726) PASS: lldb-Unit :: Process/gdb-remote/./ProcessGdbRemoteTests/GDBRemoteCommunicationClientTest.GetModulesInfoInvalidResponse (863 of 1726) PASS: lldb-Suite :: lang/cpp/template/TestTemplateArgs.py (864 of 1726) PASS: lldb-Unit :: Process/minidump/./LLDBMinidumpTests/MinidumpParserTest.GetMiscInfo_no_stream (865 of 1726) PASS: lldb-Unit :: ScriptInterpreter/Python/./ScriptInterpreterPythonTests/PythonExceptionStateTest.TestAutoRestoreSemantics (866 of 1726) PASS: lldb-Unit :: Symbol/./SymbolTests/TestClangASTContext.TestGetBasicTypeFromEnum (867 of 1726) PASS: lldb-Unit :: Utility/./UtilityTests/ArgsTest.TestSingleQuotedArgWithSpace (868 of 1726) PASS: lldb-Suite :: lang/cpp/inlines/TestInlines.py (869 of 1726) PASS: lldb-Unit :: debugserver/./debugserverTests/RNBSocket.LoopBackConnectIPv6 (870 of 1726) PASS: lldb-Suite :: python_api/process/TestProcessAPI.py (871 of 1726) PASS: lldb-Suite :: commands/expression/call-throws/TestCallThatThrows.py (872 of 1726) PASS: lldb-Unit :: Utility/./UtilityTests/LogTest.Register (873 of 1726) PASS: lldb-Unit :: Utility/./UtilityTests/RegularExpression.Invalid (874 of 1726) PASS: lldb-Unit :: Utility/./UtilityTests/StringListTest.AppendListCStringArrayEmpty (875 of 1726) PASS: lldb-Unit :: Utility/./UtilityTests/StringListTest.ForRange (876 of 1726) PASS: lldb-Suite :: functionalities/breakpoint/breakpoint_command/TestRegexpBreakCommand.py (877 of 1726) PASS: lldb-Suite :: lang/objc/radar-9691614/TestObjCMethodReturningBOOL.py (878 of 1726) PASS: lldb-Unit :: Symbol/./SymbolTests/Type.GetTypeScopeAndBasename (879 of 1726) PASS: lldb-Suite :: functionalities/tail_call_frames/disambiguate_paths_to_common_sink/TestDisambiguatePathsToCommonSink.py (880 of 1726) PASS: lldb-Unit :: SymbolFile/NativePDB/./SymbolFileNativePDBTests/PDBFPOProgramToDWARFExpressionTests.UnresolvedRegisterReference (881 of 1726) PASS: lldb-Suite :: lang/cpp/diamond/TestDiamond.py (882 of 1726) PASS: lldb-Unit :: Utility/./UtilityTests/OptionsWithRawTest.EmptySuffixSingleWhitespace (883 of 1726) PASS: lldb-Unit :: Utility/./UtilityTests/StringLexerTest.HasAtLeast (884 of 1726) PASS: lldb-Unit :: Utility/./UtilityTests/OptionsWithRawTest.SingleWhitespaceInput (885 of 1726) PASS: lldb-Suite :: lang/c/struct_types/TestStructTypes.py (886 of 1726) PASS: lldb-Unit :: SymbolFile/DWARF/./SymbolFileDWARFTests/SymbolFileDWARFTests.TestAbbrevOutOfOrder (887 of 1726) PASS: lldb-Unit :: Language/Highlighting/./HighlighterTests/HighlighterTest.DefaultHighlighterWithCursorOutOfBounds (888 of 1726) PASS: LLDB :: SymbolFile/DWARF/find-variable-dwo.cpp (889 of 1726) PASS: lldb-Suite :: lang/cpp/static_methods/TestCPPStaticMethods.py (890 of 1726) PASS: LLDB :: Settings/TestModuleCacheSanity.test (891 of 1726) PASS: lldb-Suite :: commands/expression/import-std-module/shared_ptr/TestSharedPtr.py (892 of 1726) UNSUPPORTED: LLDB :: SymbolFile/PDB/variables.test (893 of 1726) PASS: lldb-Unit :: ScriptInterpreter/Python/./ScriptInterpreterPythonTests/PythonDataObjectsTest.TestPythonIntegerToStr (894 of 1726) PASS: lldb-Unit :: Host/./HostTests/Host.WaitStatusFormat (895 of 1726) PASS: lldb-Suite :: commands/watchpoints/watchpoint_commands/TestWatchpointCommands.py (896 of 1726) PASS: lldb-Suite :: functionalities/breakpoint/breakpoint_ignore_count/TestBreakpointIgnoreCount.py (897 of 1726) PASS: lldb-Suite :: python_api/target/TestTargetAPI.py (898 of 1726) PASS: lldb-Suite :: lang/mixed/TestMixedLanguages.py (899 of 1726) PASS: lldb-Unit :: ScriptInterpreter/Python/./ScriptInterpreterPythonTests/PythonDataObjectsTest.TestPythonTupleToStructuredList (900 of 1726) PASS: lldb-Unit :: UnwindAssembly/x86/./UnwindAssemblyx86Tests/Testx86AssemblyInspectionEngine.TestPushR14 (901 of 1726) PASS: lldb-Unit :: Editline/./EditlineTests/EditlineTestFixture.EditlineReceivesMultiLineText (902 of 1726) PASS: lldb-Unit :: Utility/./UtilityTests/StringExtractorTest.InitEmpty (903 of 1726) PASS: lldb-Suite :: api/check_public_api_headers/TestPublicAPIHeaders.py (904 of 1726) PASS: lldb-Suite :: commands/expression/import-std-module/shared_ptr-dbg-info-content/TestSharedPtrDbgInfoContent.py (905 of 1726) PASS: lldb-Suite :: commands/expression/call-function/TestCallUserDefinedFunction.py (906 of 1726) PASS: lldb-Unit :: Utility/./UtilityTests/StringExtractorTest.GetHexU8_Underflow_NoEof (907 of 1726) PASS: lldb-Suite :: api/multiple-debuggers/TestMultipleDebuggers.py (908 of 1726) PASS: LLDB :: Breakpoint/implicit_const_form_support.test (909 of 1726) PASS: lldb-Suite :: functionalities/exec/TestExec.py (910 of 1726) PASS: lldb-Unit :: Utility/./UtilityTests/StreamTeeTest.Flush (911 of 1726) UNSUPPORTED: LLDB :: BuildScript/toolchain-msvc.test (912 of 1726) PASS: lldb-Suite :: functionalities/param_entry_vals/basic_entry_values_x86_64/TestBasicEntryValuesX86_64.py (913 of 1726) PASS: lldb-Unit :: Symbol/./SymbolTests/DWARFCallFrameInfoTest.Basic_dwarf3 (914 of 1726) PASS: lldb-Unit :: Utility/./UtilityTests/RangeTest.Union (915 of 1726) PASS: lldb-Unit :: Utility/./UtilityTests/StringListTest.CopyListSingle (916 of 1726) PASS: lldb-Suite :: commands/expression/persistent_variables/TestPersistentVariables.py (917 of 1726) PASS: lldb-Unit :: Process/minidump/./LLDBMinidumpTests/MinidumpParserTest.GetThreadContext_x86_32 (918 of 1726) PASS: LLDB :: SymbolFile/DWARF/dwarf5_locations.s (919 of 1726) PASS: lldb-Unit :: Process/minidump/./LLDBMinidumpTests/MinidumpParserTest.GetLinuxProcStatus_no_stream (920 of 1726) PASS: lldb-Suite :: functionalities/data-formatter/data-formatter-objc/TestDataFormatterObjCNSError.py (921 of 1726) PASS: LLDB :: SymbolFile/DWARF/dir-separator-posix.s (922 of 1726) PASS: lldb-Unit :: Utility/./UtilityTests/StringExtractorTest.GetHexU8_Extra_NoEof (923 of 1726) PASS: lldb-Suite :: lang/cpp/operator-overload/TestOperatorOverload.py (924 of 1726) PASS: lldb-Unit :: Utility/./UtilityTests/VMRange.ContainsRange (925 of 1726) PASS: LLDB :: Modules/ELF/PT_LOAD-overlap-PT_TLS.yaml (926 of 1726) PASS: lldb-Unit :: SymbolFile/DWARF/./SymbolFileDWARFTests/SymbolFileDWARFTests.TestAbbrevNullAttrValidForm (927 of 1726) PASS: lldb-Suite :: lang/objcxx/hide-runtime-values/TestObjCXXHideRuntimeValues.py (928 of 1726) PASS: lldb-Suite :: python_api/value/TestValueAPI.py (929 of 1726) XFAIL: LLDB :: Register/x86-64-ymm-write.test (930 of 1726) PASS: lldb-Suite :: functionalities/tsan/basic/TestTsanBasic.py (931 of 1726) PASS: lldb-Suite :: commands/gui/invalid-args/TestInvalidArgsGui.py (932 of 1726) PASS: lldb-Unit :: Signals/./SignalsTests/UnixSignalsTest.Iteration (933 of 1726) PASS: lldb-Unit :: Utility/./UtilityTests/LogChannelEnabledTest.LogThread (934 of 1726) PASS: lldb-Suite :: functionalities/object-file/TestImageListMultiArchitecture.py (935 of 1726) PASS: lldb-Suite :: functionalities/fat_archives/TestFatArchives.py (936 of 1726) PASS: lldb-Suite :: functionalities/thread/concurrent_events/TestConcurrentCrashWithBreak.py (937 of 1726) PASS: lldb-Suite :: lang/c/step-target/TestStepTarget.py (938 of 1726) PASS: lldb-Suite :: functionalities/breakpoint/breakpoint_options/TestBreakpointOptions.py (939 of 1726) PASS: lldb-Suite :: functionalities/thread/concurrent_events/TestConcurrentBreakpointsDelayedBreakpointOneWatchpoint.py (940 of 1726) PASS: lldb-Unit :: ScriptInterpreter/Python/./ScriptInterpreterPythonTests/PythonDataObjectsTest.TestResetting (941 of 1726) PASS: lldb-Suite :: functionalities/darwin_log/filter/regex/message/TestDarwinLogFilterRegexMessage.py (942 of 1726) PASS: LLDB :: Driver/TestNoUseColor.test (943 of 1726) PASS: lldb-Suite :: python_api/watchpoint/watchlocation/TestSetWatchlocation.py (944 of 1726) PASS: lldb-Suite :: lang/objc/objc-new-syntax/TestObjCNewSyntaxArray.py (945 of 1726) PASS: LLDB :: Driver/TestCommands.test (946 of 1726) PASS: lldb-Suite :: commands/platform/basic/TestPlatformPython.py (947 of 1726) PASS: LLDB :: Modules/ELF/gnu-debuglink.yaml (948 of 1726) PASS: lldb-Unit :: UnwindAssembly/x86/./UnwindAssemblyx86Tests/Testx86AssemblyInspectionEngine.TestPushESI (949 of 1726) PASS: lldb-Suite :: lang/c/bitfields/TestBitfields.py (950 of 1726) PASS: lldb-Suite :: commands/frame/diagnose/inheritance/TestDiagnoseInheritance.py (951 of 1726) PASS: lldb-Unit :: Utility/./UtilityTests/DataExtractorTest.GetMaxU64 (952 of 1726) UNSUPPORTED: LLDB :: SymbolFile/target-symbols-add-unwind.test (953 of 1726) PASS: lldb-Suite :: commands/expression/function_template_specialization_temp_args/TestFunctionTemplateSpecializationTempArgs.py (954 of 1726) PASS: lldb-Unit :: Utility/./UtilityTests/RangeTest.Copy (955 of 1726) PASS: lldb-Suite :: tools/lldb-server/signal-filtering/TestGdbRemote_QPassSignals.py (956 of 1726) PASS: lldb-Unit :: Utility/./UtilityTests/ProcessInfoTest.Constructor (957 of 1726) PASS: lldb-Unit :: Utility/./UtilityTests/BinaryStreamTest.PutULEB128NineBytes (958 of 1726) PASS: LLDB :: BuildScript/script-args.test (959 of 1726) PASS: lldb-Unit :: Utility/./UtilityTests/FileSpecTest.EqualSeparator (960 of 1726) PASS: LLDB :: SymbolFile/NativePDB/function-types-builtins.cpp (961 of 1726) PASS: lldb-Unit :: Process/gdb-remote/./ProcessGdbRemoteTests/GDBRemoteClientBaseTest.SendContinueAndInterrupt (962 of 1726) PASS: lldb-Suite :: lang/c/unicode/TestUnicodeSymbols.py (963 of 1726) PASS: lldb-Suite :: commands/watchpoints/multi_watchpoint_slots/TestWatchpointMultipleSlots.py (964 of 1726) PASS: lldb-Suite :: functionalities/rerun/TestRerun.py (965 of 1726) PASS: lldb-Suite :: lang/objc/objc-struct-argument/TestObjCStructArgument.py (966 of 1726) PASS: lldb-Suite :: python_api/lldbutil/process/TestPrintStackTraces.py (967 of 1726) PASS: lldb-Suite :: tools/lldb-server/platform-process-connect/TestPlatformProcessConnect.py (968 of 1726) PASS: lldb-Suite :: functionalities/tsan/thread_numbers/TestTsanThreadNumbers.py (969 of 1726) PASS: lldb-Unit :: Utility/./UtilityTests/StringExtractorTest.DecodeHexU8_Extra (970 of 1726) PASS: LLDB :: Modules/ELF/section-types.yaml (971 of 1726) PASS: lldb-Suite :: lang/c/function_types/TestFunctionTypes.py (972 of 1726) PASS: LLDB :: Commands/command-script-import.test (973 of 1726) PASS: LLDB :: Reproducer/TestGDBRemoteRepro.test (974 of 1726) PASS: lldb-Suite :: lang/objc/foundation/TestObjCMethodsNSError.py (975 of 1726) PASS: lldb-Unit :: Utility/./UtilityTests/UUIDTest.StringConverion (976 of 1726) PASS: LLDB :: SymbolFile/DWARF/debug-types-line-tables.s (977 of 1726) PASS: lldb-Suite :: commands/expression/call-restarts/TestCallThatRestarts.py (978 of 1726) PASS: lldb-Suite :: arm/emulation/TestEmulations.py (979 of 1726) PASS: lldb-Suite :: commands/process/launch/TestProcessLaunch.py (980 of 1726) PASS: lldb-Unit :: tools/lldb-server/tests/./LLDBServerTests/TestBase.LaunchModePreservesEnvironment (981 of 1726) PASS: lldb-Unit :: Utility/./UtilityTests/ArgsTest.ReplaceArgumentAtIndexEqual (982 of 1726) PASS: lldb-Suite :: functionalities/thread/thread_specific_break/TestThreadSpecificBreakpoint.py (983 of 1726) PASS: lldb-Unit :: Host/./HostTests/NativeProcessProtocolTest.ReadCStringFromMemory_MaxSize (984 of 1726) PASS: lldb-Unit :: Utility/./UtilityTests/BroadcasterTest.BroadcastEvent (985 of 1726) PASS: lldb-Suite :: macosx/indirect_symbol/TestIndirectSymbols.py (986 of 1726) PASS: lldb-Suite :: python_api/class_members/TestSBTypeClassMembers.py (987 of 1726) PASS: lldb-Unit :: Utility/./UtilityTests/ArchSpecTest.TripleComponentsWereSpecified (988 of 1726) PASS: lldb-Unit :: SymbolFile/NativePDB/./SymbolFileNativePDBTests/PDBFPOProgramToDWARFExpressionTests.InvalidOpUnary (989 of 1726) PASS: lldb-Suite :: types/TestFloatTypes.py (990 of 1726) PASS: lldb-Unit :: UnwindAssembly/x86/./UnwindAssemblyx86Tests/Testx86AssemblyInspectionEngine.TestPushEBP (991 of 1726) PASS: lldb-Unit :: Utility/./UtilityTests/SerializationRountripTest.SerializeDeserializeObjectPointer (992 of 1726) UNSUPPORTED: LLDB :: Breakpoint/ppc64-localentry.test (993 of 1726) PASS: lldb-Suite :: commands/expression/completion-crash1/TestCompletionCrash1.py (994 of 1726) PASS: lldb-Suite :: functionalities/thread/concurrent_events/TestConcurrentDelayedCrashWithBreakpointWatchpoint.py (995 of 1726) PASS: LLDB :: Expr/TestIRMemoryMap.test (996 of 1726) PASS: lldb-Unit :: Language/Highlighting/./HighlighterTests/HighlighterTest.FallbackHighlighter (997 of 1726) PASS: lldb-Unit :: Utility/./UtilityTests/RangeTest.SlideZero (998 of 1726) PASS: lldb-Unit :: Utility/./UtilityTests/VMRange.SetEndAddress (999 of 1726) PASS: lldb-Suite :: functionalities/gdb_remote_client/TestStopPCs.py (1000 of 1726) PASS: lldb-Unit :: Target/./TargetTests/PathMappingListTest.AbsoluteTests (1001 of 1726) PASS: lldb-Unit :: Utility/./UtilityTests/StringExtractorTest.DecodeHexU8_InvalidHex2 (1002 of 1726) PASS: lldb-Suite :: functionalities/data-formatter/data-formatter-globals/TestDataFormatterGlobals.py (1003 of 1726) PASS: lldb-Suite :: tools/lldb-server/TestGdbRemoteAuxvSupport.py (1004 of 1726) PASS: lldb-Unit :: Utility/./UtilityTests/ScalarTest.Equality (1005 of 1726) PASS: LLDB :: Modules/ELF/short-build-id.yaml (1006 of 1726) PASS: lldb-Suite :: lang/cpp/static_members/TestCPPStaticMembers.py (1007 of 1726) PASS: lldb-Suite :: linux/sepdebugsymlink/TestTargetSymbolsSepDebugSymlink.py (1008 of 1726) PASS: lldb-Suite :: functionalities/inferior-assert/TestInferiorAssert.py (1009 of 1726) PASS: lldb-Suite :: lang/c/local_variables/TestLocalVariables.py (1010 of 1726) PASS: lldb-Unit :: Utility/./UtilityTests/RegularExpression.Empty (1011 of 1726) PASS: lldb-Unit :: ScriptInterpreter/Python/./ScriptInterpreterPythonTests/PythonDataObjectsTest.TestTypeNameResolutionNoDot (1012 of 1726) PASS: lldb-Unit :: Host/./HostTests/SocketAddressTest.Set (1013 of 1726) PASS: lldb-Unit :: Utility/./UtilityTests/StringListTest.LongestCommonPrefixDuplicateElement (1014 of 1726) PASS: lldb-Suite :: commands/expression/call-overridden-method/TestCallOverriddenMethod.py (1015 of 1726) PASS: lldb-Unit :: Utility/./UtilityTests/StringListTest.JoinEmpty (1016 of 1726) PASS: lldb-Unit :: Utility/./UtilityTests/StringExtractorTest.DecodeHexU8_Exact (1017 of 1726) PASS: LLDB :: SymbolFile/DWARF/find-basic-namespace.cpp (1018 of 1726) PASS: lldb-Unit :: Host/./HostTests/FileActionTest.Open (1019 of 1726) PASS: lldb-Suite :: commands/process/attach-resume/TestAttachResume.py (1020 of 1726) PASS: lldb-Unit :: Language/Highlighting/./HighlighterTests/HighlighterTest.ClangCursorPosInOtherToken (1021 of 1726) PASS: lldb-Unit :: Process/minidump/./LLDBMinidumpTests/MinidumpParserTest.GetMemoryRegionInfoFromMemory64List (1022 of 1726) PASS: lldb-Suite :: functionalities/mtc/simple/TestMTCSimple.py (1023 of 1726) PASS: lldb-Unit :: Utility/./UtilityTests/ArgsTest.TestTrailingBackslash (1024 of 1726) PASS: lldb-Unit :: ScriptInterpreter/Python/./ScriptInterpreterPythonTests/PythonDataObjectsTest.TestOwnedReferences (1025 of 1726) PASS: lldb-Unit :: UnwindAssembly/x86/./UnwindAssemblyx86Tests/Testx86AssemblyInspectionEngine.Test32bitFramelessSmallStackFrame (1026 of 1726) PASS: lldb-Unit :: Utility/./UtilityTests/BinaryStreamTest.PutSLEB128NineBytes (1027 of 1726) PASS: lldb-Unit :: UnwindAssembly/x86/./UnwindAssemblyx86Tests/Testx86AssemblyInspectionEngine.TestSimple32bitFrameFunction (1028 of 1726) UNSUPPORTED: LLDB :: Register/x86-gp-read.test (1029 of 1726) PASS: lldb-Suite :: functionalities/thread/concurrent_events/TestConcurrentNWatchNBreak.py (1030 of 1726) PASS: LLDB :: SymbolFile/NativePDB/globals-fundamental.cpp (1031 of 1726) PASS: lldb-Suite :: arm/breakpoint-it/TestBreakpointIt.py (1032 of 1726) PASS: lldb-Suite :: lang/cpp/trivial_abi/TestTrivialABI.py (1033 of 1726) PASS: lldb-Suite :: functionalities/darwin_log/filter/regex/activity/TestDarwinLogFilterRegexActivity.py (1034 of 1726) PASS: lldb-Unit :: Utility/./UtilityTests/StringListTest.LongestCommonPrefix (1035 of 1726) PASS: lldb-Unit :: UnwindAssembly/x86/./UnwindAssemblyx86Tests/Testx86AssemblyInspectionEngine.TestPopRBP (1036 of 1726) PASS: lldb-Suite :: lang/cpp/breakpoint-commands/TestCPPBreakpointCommands.py (1037 of 1726) PASS: lldb-Suite :: functionalities/breakpoint/cpp/TestCPPBreakpointLocations.py (1038 of 1726) PASS: lldb-Suite :: functionalities/backticks/TestBackticksWithoutATarget.py (1039 of 1726) PASS: lldb-Unit :: Utility/./UtilityTests/LogChannelTest.EnableOptions (1040 of 1726) PASS: lldb-Suite :: lang/objc/orderedset/TestOrderedSet.py (1041 of 1726) PASS: lldb-Suite :: lang/objc/objc-builtin-types/TestObjCBuiltinTypes.py (1042 of 1726) PASS: lldb-Suite :: commands/expression/pr35310/TestExprsBug35310.py (1043 of 1726) PASS: lldb-Suite :: functionalities/inferior-crashing/recursive-inferior/TestRecursiveInferior.py (1044 of 1726) PASS: lldb-Unit :: Utility/./UtilityTests/FileSpecTest.FormatFileSpec (1045 of 1726) PASS: lldb-Suite :: lang/c/stepping/TestThreadStepping.py (1046 of 1726) PASS: lldb-Unit :: Utility/./UtilityTests/ReproducerTest.SetReplay (1047 of 1726) PASS: lldb-Suite :: lang/cpp/exceptions/TestCPPExceptionBreakpoints.py (1048 of 1726) PASS: lldb-Suite :: commands/expression/scoped_enums/TestScopedEnumType.py (1049 of 1726) PASS: lldb-Suite :: python_api/exprpath_synthetic/TestExprPathSynthetic.py (1050 of 1726) PASS: lldb-Unit :: Host/./HostTests/Host.GetEnvironment (1051 of 1726) PASS: LLDB :: Settings/TestDisableColor.test (1052 of 1726) PASS: lldb-Suite :: functionalities/data-formatter/data-formatter-objc/TestDataFormatterObjCNSData.py (1053 of 1726) PASS: lldb-Unit :: Utility/./UtilityTests/StringListTest.Join (1054 of 1726) PASS: lldb-Unit :: Process/minidump/./LLDBMinidumpTests/MinidumpParserTest.GetPidWow64 (1055 of 1726) PASS: lldb-Suite :: functionalities/breakpoint/breakpoint_conditions/TestBreakpointConditions.py (1056 of 1726) PASS: LLDB :: SymbolFile/Breakpad/line-table-edgecases.test (1057 of 1726) PASS: lldb-Suite :: functionalities/tail_call_frames/thread_step_out_message/TestArtificialFrameStepOutMessage.py (1058 of 1726) PASS: lldb-Suite :: lang/cpp/frame-var-anon-unions/TestFrameVariableAnonymousUnions.py (1059 of 1726) PASS: lldb-Suite :: commands/expression/import-std-module/vector-of-vectors/TestVectorOfVectors.py (1060 of 1726) PASS: lldb-Unit :: Utility/./UtilityTests/ArgsTest.TestSingleArg (1061 of 1726) PASS: LLDB :: Modules/ELF/PT_LOAD-overlap-section.yaml (1062 of 1726) PASS: lldb-Suite :: functionalities/memory-region/TestMemoryRegion.py (1063 of 1726) PASS: lldb-Unit :: Utility/./UtilityTests/StreamTest.PutRawBytesToLittleEndian (1064 of 1726) PASS: lldb-Unit :: UnwindAssembly/x86/./UnwindAssemblyx86Tests/Testx86AssemblyInspectionEngine.TestCALLNextInsn (1065 of 1726) PASS: LLDB :: SymbolFile/NativePDB/tag-types.cpp (1066 of 1726) PASS: lldb-Suite :: commands/expression/rdar42038760/TestScalarURem.py (1067 of 1726) PASS: lldb-Suite :: commands/expression/import-std-module/list-basic/TestBasicList.py (1068 of 1726) PASS: lldb-Unit :: Utility/./UtilityTests/TimerTest.CategoryTimes2 (1069 of 1726) PASS: LLDB :: Reproducer/Modules/TestModuleCXX.test (1070 of 1726) PASS: lldb-Unit :: Symbol/./SymbolTests/TestClangASTContext.TestIsClangType (1071 of 1726) PASS: lldb-Suite :: lang/objc/objc-runtime-ivars/TestRuntimeIvars.py (1072 of 1726) PASS: lldb-Unit :: Utility/./UtilityTests/LogChannelEnabledTest.LogVerboseThread (1073 of 1726) PASS: lldb-Suite :: functionalities/data-formatter/data-formatter-python-synth/TestDataFormatterPythonSynth.py (1074 of 1726) PASS: lldb-Unit :: Utility/./UtilityTests/StringExtractorTest.GetHexBytesAvail_OddPair (1075 of 1726) PASS: lldb-Unit :: Host/./HostTests/NativeProcessProtocolTest.ReadMemoryWithoutTrap (1076 of 1726) PASS: lldb-Suite :: functionalities/breakpoint/hardware_breakpoints/hardware_breakpoint_on_multiple_threads/TestHWBreakMultiThread.py (1077 of 1726) PASS: lldb-Suite :: python_api/default-constructor/TestDefaultConstructorForAPIObjects.py (1078 of 1726) PASS: lldb-Unit :: Host/./HostTests/MainLoopTest.Signal (1079 of 1726) PASS: lldb-Unit :: ScriptInterpreter/Python/./ScriptInterpreterPythonTests/PythonDataObjectsTest.TestPythonIntegerToStructuredInteger (1080 of 1726) PASS: lldb-Suite :: functionalities/breakpoint/breakpoint_hit_count/TestBreakpointHitCount.py (1081 of 1726) PASS: lldb-Suite :: functionalities/data-formatter/data-formatter-objc/TestDataFormatterObjCPlain.py (1082 of 1726) PASS: lldb-Unit :: Process/gdb-remote/./ProcessGdbRemoteTests/GDBRemoteClientBaseTest.SendContinueAndAsyncPacket (1083 of 1726) PASS: lldb-Unit :: Utility/./UtilityTests/UriParserTest.LongPath (1084 of 1726) PASS: lldb-Suite :: functionalities/breakpoint/comp_dir_symlink/TestCompDirSymLink.py (1085 of 1726) PASS: lldb-Suite :: tools/lldb-server/commandline/TestStubReverseConnect.py (1086 of 1726) PASS: lldb-Unit :: Utility/./UtilityTests/OptionsWithRawTest.EmptySuffix (1087 of 1726) PASS: LLDB :: Modules/ELF/build-id-case.yaml (1088 of 1726) PASS: lldb-Suite :: lang/c/typedef/Testtypedef.py (1089 of 1726) PASS: lldb-Unit :: Utility/./UtilityTests/BinaryStreamTest.PutSLEB128FourBytes (1090 of 1726) PASS: lldb-Suite :: functionalities/data-formatter/data-formatter-stl/libcxx/initializerlist/TestInitializerList.py (1091 of 1726) PASS: lldb-Suite :: functionalities/ptr_refs/TestPtrRefs.py (1092 of 1726) PASS: lldb-Unit :: Utility/./UtilityTests/UUIDTest.RelationalOperators (1093 of 1726) PASS: lldb-Suite :: lang/c/shared_lib/TestSharedLib.py (1094 of 1726) PASS: lldb-Unit :: Utility/./UtilityTests/Predicate.WaitForValueNotEqualTo (1095 of 1726) PASS: lldb-Suite :: python_api/lldbutil/TestSwigVersion.py (1096 of 1726) PASS: lldb-Suite :: lang/cpp/stl/TestStdCXXDisassembly.py (1097 of 1726) PASS: lldb-Unit :: Utility/./UtilityTests/RangeTest.LessThanInvalid (1098 of 1726) PASS: lldb-Unit :: UnwindAssembly/x86/./UnwindAssemblyx86Tests/Testx86AssemblyInspectionEngine.TestPopESI (1099 of 1726) PASS: LLDB :: Modules/MachO/lc_build_version_notools.yaml (1100 of 1726) PASS: lldb-Unit :: Target/./TargetTests/ModuleCacheTest.GetAndPut (1101 of 1726) PASS: lldb-Unit :: Expression/./ExpressionTests/DiagnosticManagerTest.PutString (1102 of 1726) PASS: lldb-Suite :: lang/cpp/extern_c/TestExternCSymbols.py (1103 of 1726) PASS: lldb-Unit :: Utility/./UtilityTests/StringListTest.AppendStringCString (1104 of 1726) PASS: lldb-Suite :: macosx/nslog/TestDarwinNSLogOutput.py (1105 of 1726) PASS: lldb-Unit :: Utility/./UtilityTests/ListenerTest.GetEventImmediate (1106 of 1726) PASS: lldb-Unit :: Process/minidump/./LLDBMinidumpTests/MinidumpParserTest.GetExceptionStream (1107 of 1726) PASS: lldb-Unit :: debugserver/./debugserverTests/RNBSocket.LoopBackListenIPv4 (1108 of 1726) PASS: lldb-Unit :: Utility/./UtilityTests/UriParserTest.SchemeHostSeparator4 (1109 of 1726) PASS: LLDB :: SymbolFile/DWARF/find-variable-file.cpp (1110 of 1726) PASS: lldb-Suite :: functionalities/postmortem/mach-core/TestMachCore.py (1111 of 1726) PASS: lldb-Suite :: functionalities/data-formatter/parray/TestPrintArray.py (1112 of 1726) PASS: lldb-Suite :: commands/frame/diagnose/virtual-method-call/TestDiagnoseDereferenceVirtualMethodCall.py (1113 of 1726) PASS: lldb-Unit :: Utility/./UtilityTests/StringLexerTest.GetUnlexed (1114 of 1726) PASS: lldb-Unit :: Utility/./UtilityTests/StreamTeeTest.SetStreamAtIndexOverwrite (1115 of 1726) PASS: lldb-Unit :: Utility/./UtilityTests/BinaryStreamTest.PutULEB128FiveBytes (1116 of 1726) PASS: lldb-Unit :: Language/Highlighting/./HighlighterTests/HighlighterTest.ClangOperators (1117 of 1726) PASS: lldb-Suite :: functionalities/inferior-crashing/TestInferiorCrashingStep.py (1118 of 1726) UNSUPPORTED: LLDB :: Register/x86-64-xmm16-write.test (1119 of 1726) PASS: LLDB :: Expr/TestMultilineExpr.test (1120 of 1726) PASS: lldb-Suite :: commands/expression/top-level/TestTopLevelExprs.py (1121 of 1726) PASS: lldb-Unit :: Utility/./UtilityTests/RangeTest.DoesIntersect (1122 of 1726) PASS: lldb-Unit :: Utility/./UtilityTests/GeneratorTest.Create (1123 of 1726) PASS: LLDB :: SymbolFile/DWARF/dir-separator-no-comp-dir-relative-name.s (1124 of 1726) PASS: lldb-Unit :: SymbolFile/NativePDB/./SymbolFileNativePDBTests/PDBFPOProgramToDWARFExpressionTests.UnknownOp (1125 of 1726) UNSUPPORTED: LLDB :: Process/Windows/exception_access_violation.cpp (1126 of 1726) PASS: lldb-Suite :: functionalities/data-formatter/varscript_formatting/TestDataFormatterVarScriptFormatting.py (1127 of 1726) PASS: lldb-Suite :: commands/expression/test/TestExprs.py (1128 of 1726) PASS: lldb-Suite :: functionalities/thread/concurrent_events/TestConcurrentDelayWatchBreak.py (1129 of 1726) PASS: lldb-Unit :: Expression/./ExpressionTests/ClangHostTest.ComputeClangResourceDirectory (1130 of 1726) PASS: LLDB :: Modules/ELF/duplicate-section.yaml (1131 of 1726) PASS: lldb-Unit :: Utility/./UtilityTests/SerializationRountripTest.SerializeDeserializeCString (1132 of 1726) PASS: lldb-Suite :: lang/c/find_struct_type/TestFindStructTypes.py (1133 of 1726) PASS: lldb-Suite :: functionalities/memory/read/TestMemoryRead.py (1134 of 1726) PASS: lldb-Suite :: functionalities/thread/concurrent_events/TestConcurrentWatchBreak.py (1135 of 1726) PASS: LLDB :: Breakpoint/debug_rnglist_rlestartend.test (1136 of 1726) UNSUPPORTED: LLDB :: BuildScript/toolchain-clang-cl.test (1137 of 1726) PASS: lldb-Suite :: functionalities/data-formatter/user-format-vs-summary/TestUserFormatVsSummary.py (1138 of 1726) UNSUPPORTED: LLDB :: SymbolFile/PDB/variables-locations.test (1139 of 1726) PASS: lldb-Unit :: Utility/./UtilityTests/RecordReplayTest.InstrumentedBarRef (1140 of 1726) PASS: lldb-Suite :: commands/watchpoints/step_over_watchpoint/TestStepOverWatchpoint.py (1141 of 1726) PASS: lldb-Suite :: functionalities/inferior-changed/TestInferiorChanged.py (1142 of 1726) UNSUPPORTED: LLDB :: SymbolFile/PDB/ast-restore.test (1143 of 1726) PASS: lldb-Unit :: Utility/./UtilityTests/RangeTest.Clear (1144 of 1726) PASS: lldb-Suite :: functionalities/darwin_log/filter/regex/subsystem/TestDarwinLogFilterRegexSubsystem.py (1145 of 1726) PASS: lldb-Suite :: functionalities/plugins/command_plugin/TestPluginCommands.py (1146 of 1726) PASS: LLDB :: SymbolFile/NativePDB/ast-functions.cpp (1147 of 1726) PASS: lldb-Suite :: lang/objc/modules-incomplete/TestIncompleteModules.py (1148 of 1726) PASS: lldb-Suite :: lang/objc/exceptions/TestObjCExceptions.py (1149 of 1726) PASS: lldb-Unit :: Expression/./ExpressionTests/DiagnosticManagerTest.AppendMessageSubsequentDiags (1150 of 1726) PASS: lldb-Unit :: Utility/./UtilityTests/StringLexerTest.NextIf (1151 of 1726) PASS: lldb-Suite :: functionalities/set-data/TestSetData.py (1152 of 1726) PASS: lldb-Unit :: Utility/./UtilityTests/BinaryStreamTest.PutSLEB128SixBytes (1153 of 1726) PASS: lldb-Unit :: UnwindAssembly/x86/./UnwindAssemblyx86Tests/Testx86AssemblyInspectionEngine.TestPushImm (1154 of 1726) PASS: lldb-Suite :: functionalities/data-formatter/data-formatter-proper-plurals/TestFormattersOneIsSingular.py (1155 of 1726) PASS: lldb-Suite :: lang/cpp/chained-calls/TestCppChainedCalls.py (1156 of 1726) PASS: lldb-Unit :: Utility/./UtilityTests/CompletionRequest.Constructor (1157 of 1726) PASS: lldb-Suite :: functionalities/inline-stepping/TestInlineStepping.py (1158 of 1726) UNSUPPORTED: LLDB :: Register/x86-gp-write.test (1159 of 1726) PASS: LLDB :: SymbolFile/DWARF/parallel-indexing-stress.s (1160 of 1726) PASS: lldb-Unit :: Utility/./UtilityTests/StreamTest.PutULEB128 (1161 of 1726) PASS: lldb-Suite :: functionalities/thread/concurrent_events/TestConcurrentManyCrash.py (1162 of 1726) PASS: lldb-Suite :: lang/c/blocks/TestBlocks.py (1163 of 1726) PASS: lldb-Suite :: commands/command/script/TestCommandScript.py (1164 of 1726) PASS: lldb-Unit :: Target/./TargetTests/PathMappingListTest.RemapRoot (1165 of 1726) PASS: lldb-Unit :: Utility/./UtilityTests/UriParserTest.MinimalPort (1166 of 1726) PASS: lldb-Suite :: lang/c/unions/TestUnionMembers.py (1167 of 1726) PASS: lldb-Suite :: commands/expression/unicode-in-variable/TestUnicodeInVariable.py (1168 of 1726) PASS: lldb-Unit :: SymbolFile/DWARF/./SymbolFileDWARFTests/SymbolFileDWARFTests.TestAbilitiesForDWARF (1169 of 1726) PASS: lldb-Suite :: commands/watchpoints/watchpoint_size/TestWatchpointSizes.py (1170 of 1726) PASS: lldb-Suite :: functionalities/inferior-crashing/TestInferiorCrashing.py (1171 of 1726) PASS: lldb-Suite :: functionalities/data-formatter/data-formatter-objc/nsindexpath/TestDataFormatterNSIndexPath.py (1172 of 1726) PASS: lldb-Suite :: commands/settings/TestSettings.py (1173 of 1726) PASS: lldb-Unit :: Utility/./UtilityTests/ArgsTest.GetArgumentArrayRef (1174 of 1726) PASS: lldb-Unit :: Utility/./UtilityTests/OptionsWithRawTest.EmptyInput (1175 of 1726) PASS: lldb-Unit :: Process/minidump/./LLDBMinidumpTests/MinidumpParserTest.GetFilteredModuleList (1176 of 1726) PASS: lldb-Suite :: lang/objc/forward-decl/TestForwardDecl.py (1177 of 1726) PASS: lldb-Unit :: Utility/./UtilityTests/BinaryStreamTest.PutULEB128Zero (1178 of 1726) PASS: lldb-Suite :: lang/objc/foundation/TestObjCMethodsNSArray.py (1179 of 1726) PASS: lldb-Suite :: tools/lldb-server/inferior-crash/TestGdbRemoteAbort.py (1180 of 1726) PASS: lldb-Suite :: functionalities/load_unload/TestLoadUnload.py (1181 of 1726) PASS: LLDB :: Modules/PECOFF/dep-modules.yaml (1182 of 1726) PASS: lldb-Unit :: Utility/./UtilityTests/ArchSpecTest.TestParseMachCPUDashSubtypeTripleExtra (1183 of 1726) PASS: lldb-Unit :: Symbol/./SymbolTests/Type.CompilerContextPattern (1184 of 1726) PASS: lldb-Unit :: ScriptInterpreter/Python/./ScriptInterpreterPythonTests/PythonDataObjectsTest.TestPythonBytes (1185 of 1726) PASS: lldb-Suite :: lang/c/stepping/TestStepAndBreakpoints.py (1186 of 1726) PASS: lldb-Unit :: Utility/./UtilityTests/TimerTest.CategoryTimes (1187 of 1726) PASS: lldb-Unit :: Expression/./ExpressionTests/DiagnosticManagerTest.PutStringMultiple (1188 of 1726) PASS: lldb-Unit :: Utility/./UtilityTests/OptionsWithRawTest.EmptyArgsOnlySuffix (1189 of 1726) PASS: lldb-Suite :: tools/lldb-server/TestGdbRemoteHostInfo.py (1190 of 1726) PASS: lldb-Suite :: commands/source/info/TestSourceInfo.py (1191 of 1726) PASS: LLDB :: SymbolFile/DWARF/dir-separator-windows.s (1192 of 1726) PASS: lldb-Unit :: Utility/./UtilityTests/StringExtractorTest.GetNameColonValueSuccess (1193 of 1726) PASS: lldb-Unit :: Core/./LLDBCoreTests/MangledTest.EmptyForInvalidName (1194 of 1726) FAIL: lldb-Suite :: commands/expression/multiline-completion/TestMultilineCompletion.py (1195 of 1726) ******************** TEST 'lldb-Suite :: commands/expression/multiline-completion/TestMultilineCompletion.py' FAILED ******************** lldb version 10.0.99 (http://labmaster3.local/git/llvm-project.git revision 0c0de794f1affc7460eb90626b8483e4a0cbde6c) clang revision 4a07336a886d6fa908ee19d72abe0ecb3732b377 llvm revision 4a07336a886d6fa908ee19d72abe0ecb3732b377 LLDB library dir: /Users/buildslave/jenkins/workspace/lldb-cmake-sanitized/lldb-build/bin LLDB import library dir: /Users/buildslave/jenkins/workspace/lldb-cmake-sanitized/lldb-build/bin libstdcxx tests will not be run because: Don't know how to build with libstdcxx on macosx Skipping following debug info categories: ['dwo'] (lldb) settings set symbols.enable-external-lookup false (lldb) settings set plugin.process.gdb-remote.packet-timeout 60 (lldb) settings set symbols.clang-modules-cache-path "/Users/buildslave/jenkins/workspace/lldb-cmake-sanitized/lldb-build/tools/lldb/lldb-test-build.noindex/module-cache-lldb" (lldb) settings set use-color false (lldb) target create "/Users/buildslave/jenkins/workspace/lldb-cmake-sanitized/lldb-build/tools/lldb/lldb-test-build.noindex/commands/expression/multiline-completion/TestMultilineCompletion.test_basic_completion/a.out" Current executable set to '/Users/buildslave/jenkins/workspace/lldb-cmake-sanitized/lldb-build/tools/lldb/lldb-test-build.noindex/commands/expression/multiline-completion/TestMultilineCompletion.test_basic_completion/a.out' (x86_64). (lldb) b main b main Breakpoint 1: where = a.out`main + 18 at main.c:2:7, address = 0x0000000100000fa2 (lldb) run run Process 26726 launched: '/Users/buildslave/jenkins/workspace/lldb-cmake-sanitized/lldb-build/tools/lldb/lldb-test-build.noindex/commands/expression/multiline-completion/TestMultilineCompletion.test_basic_completion/a.out' (x86_64) Process 26726 stopped * thread #1, queue = 'com.apple.main-thread', stop reason = breakpoint 1.1 frame #0: 0x0000000100000fa2 a.out`main(argc=1, argv=0x00007ffeefbff4d0) at main.c:2:7 1 int main(int argc, char **argv) { -> 2 int to_complete = 0; ^ 3 return to_complete; 4 } (lldb) expr expr Enter expressions, then terminate with an empty line to evaluate: to_  1:  1: to_ to_  1: to_complete

Hide Details

 1: to_complete 2:  2:  (int) $0 = 0 (lldb) settings set interpreter.prompt-on-quit false

Hide Details

Session logs for test failures/errors/unexpected successes will go into directory '/Users/buildslave/jenkins/workspace/lldb-cmake-sanitized/test/logs' Command invoked: /Users/buildslave/jenkins/workspace/lldb-cmake-sanitized/llvm-project/lldb/test/dotest.py --arch=x86_64 -s /Users/buildslave/jenkins/workspace/lldb-cmake-sanitized/lldb-build/lldb-test-traces -S nm -u CXXFLAGS -u CFLAGS --executable /Users/buildslave/jenkins/workspace/lldb-cmake-sanitized/lldb-build/./bin/lldb --dsymutil /Users/buildslave/jenkins/workspace/lldb-cmake-sanitized/lldb-build/./bin/dsymutil --filecheck /Users/buildslave/jenkins/workspace/lldb-cmake-sanitized/lldb-build/./bin/FileCheck -C /Users/buildslave/jenkins/workspace/lldb-cmake-sanitized/host-compiler/bin/clang --codesign-identity lldb_codesign --server /Users/buildslave/jenkins/workspace/lldb-cmake-sanitized/lldb-build/./bin/debugserver --arch x86_64 --build-dir /Users/buildslave/jenkins/workspace/lldb-cmake-sanitized/lldb-build/lldb-test-build.noindex -s=/Users/buildslave/jenkins/workspace/lldb-cmake-sanitized/test/logs -t --env TERM=vt100 --env LLVM_LIBS_DIR=/Users/buildslave/jenkins/workspace/lldb-cmake-sanitized/lldb-build/./lib --build-dir /Users/buildslave/jenkins/workspace/lldb-cmake-sanitized/lldb-build/tools/lldb/lldb-test-build.noindex --module-cache-dir /Users/buildslave/jenkins/workspace/lldb-cmake-sanitized/lldb-build/tools/lldb/lldb-test-build.noindex/module-cache-lldb /Users/buildslave/jenkins/workspace/lldb-cmake-sanitized/llvm-project/lldb/packages/Python/lldbsuite/test/commands/expression/multiline-completion -p TestMultilineCompletion.py Change dir to: /Users/buildslave/jenkins/workspace/lldb-cmake-sanitized/llvm-project/lldb/packages/Python/lldbsuite/test/commands/expression/multiline-completion runCmd: settings set symbols.enable-external-lookup false output:

Hide Details

runCmd: settings set plugin.process.gdb-remote.packet-timeout 60 output:

Hide Details

runCmd: settings set symbols.clang-modules-cache-path "/Users/buildslave/jenkins/workspace/lldb-cmake-sanitized/lldb-build/tools/lldb/lldb-test-build.noindex/module-cache-lldb" output:

Hide Details

runCmd: settings set use-color false output:

Hide Details

FAIL: LLDB (/Users/buildslave/jenkins/workspace/lldb-cmake-sanitized/host-compiler/bin/clang-10-x86_64) :: test_basic_completion (TestMultilineCompletion.MultilineCompletionTest) tearing down the child process....

Hide Details

CLEANUP ERROR: LLDB (/Users/buildslave/jenkins/workspace/lldb-cmake-sanitized/host-compiler/bin/clang-10-x86_64) :: test_basic_completion (TestMultilineCompletion.MultilineCompletionTest) Restore dir to: /Users/buildslave/jenkins/workspace/lldb-cmake-sanitized/lldb-build/tools/lldb/lit ====================================================================== ERROR: test_basic_completion (TestMultilineCompletion.MultilineCompletionTest) Test that we can complete a simple multiline expression ---------------------------------------------------------------------- Traceback (most recent call last): File "/Users/buildslave/jenkins/workspace/lldb-cmake-sanitized/llvm-project/lldb/packages/Python/lldbsuite/test/commands/expression/multiline-completion/TestMultilineCompletion.py", line 30, in test_basic_completion self.quit() File "/Users/buildslave/jenkins/workspace/lldb-cmake-sanitized/llvm-project/lldb/packages/Python/lldbsuite/test/lldbpexpect.py", line 61, in quit self.child.close(force=not gracefully) File "/Users/buildslave/jenkins/workspace/lldb-cmake-sanitized/llvm-project/lldb/third_party/Python/module/pexpect-4.6/pexpect/pty_spawn.py", line 327, in close self.ptyproc.close(force=force) File "/System/Library/Frameworks/Python.framework/Versions/2.7/lib/python2.7/contextlib.py", line 35, in __exit__ self.gen.throw(type, value, traceback) File "/Users/buildslave/jenkins/workspace/lldb-cmake-sanitized/llvm-project/lldb/third_party/Python/module/pexpect-4.6/pexpect/pty_spawn.py", line 25, in _wrap_ptyprocess_err raise ExceptionPexpect(*e.args) ExceptionPexpect: Could not terminate the child. Config=x86_64-/Users/buildslave/jenkins/workspace/lldb-cmake-sanitized/host-compiler/bin/clang-10 ---------------------------------------------------------------------- Ran 1 test in 11.167s

Hide Details

RESULT: FAILED (0 passes, 0 failures, 1 errors, 0 skipped, 0 expected failures, 0 unexpected successes)

Hide Details

******************** PASS: LLDB :: Commands/CommandScriptImmediateOutput/CommandScriptImmediateOutputFile.test (1196 of 1726) PASS: lldb-Unit :: Process/gdb-remote/./ProcessGdbRemoteTests/GDBRemoteCommunicationClientTest.SendGetTraceConfigPacket (1197 of 1726) PASS: lldb-Unit :: Target/./TargetTests/ModuleCacheTest.GetAndPutUuidExists (1198 of 1726) PASS: lldb-Suite :: functionalities/value_md5_crash/TestValueMD5Crash.py (1199 of 1726) PASS: lldb-Unit :: UnwindAssembly/x86/./UnwindAssemblyx86Tests/Testx86AssemblyInspectionEngine.TestPopR15 (1200 of 1726) PASS: lldb-Unit :: Utility/./UtilityTests/StringListTest.Clear (1201 of 1726) PASS: lldb-Suite :: functionalities/thread/num_threads/TestNumThreads.py (1202 of 1726) PASS: lldb-Unit :: Utility/./UtilityTests/StringListTest.GetMaxStringLengthIncreasingSize (1203 of 1726) PASS: lldb-Suite :: commands/command/invalid-args/TestInvalidArgsCommand.py (1204 of 1726) XFAIL: LLDB :: Register/x86-64-write.test (1205 of 1726) PASS: lldb-Suite :: functionalities/breakpoint/address_breakpoints/TestBadAddressBreakpoints.py (1206 of 1726) PASS: lldb-Unit :: Utility/./UtilityTests/DeserializerTest.HasData (1207 of 1726) PASS: lldb-Unit :: Process/gdb-remote/./ProcessGdbRemoteTests/GDBRemoteCommunicationServerTest.SendErrorResponse_ErrorNumber (1208 of 1726) PASS: LLDB :: Reproducer/Functionalities/TestDataFormatter.test (1209 of 1726) PASS: lldb-Suite :: macosx/macabi/TestMacABImacOSFramework.py (1210 of 1726) PASS: lldb-Unit :: ScriptInterpreter/Python/./ScriptInterpreterPythonTests/PythonDataObjectsTest.TestPythonCallableCheck (1211 of 1726) PASS: lldb-Unit :: Host/./HostTests/FileSystemTest.GetByteSize (1212 of 1726) PASS: lldb-Suite :: commands/frame/select/TestFrameSelect.py (1213 of 1726) PASS: lldb-Suite :: commands/expression/formatters/TestFormatters.py (1214 of 1726) PASS: lldb-Suite :: commands/expression/test/TestExprs2.py (1215 of 1726) PASS: lldb-Unit :: ObjectFile/ELF/./ObjectFileELFTests/ObjectFileELFTest.SectionsResolveConsistently (1216 of 1726) PASS: lldb-Unit :: Host/./HostTests/HostInfoTest.GetHostname (1217 of 1726) PASS: lldb-Suite :: functionalities/gdb_remote_client/TestNestedRegDefinitions.py (1218 of 1726) PASS: lldb-Unit :: Language/Highlighting/./HighlighterTests/HighlighterTest.Colons (1219 of 1726) PASS: lldb-Suite :: functionalities/gdb_remote_client/TestThreadSelectionBug.py (1220 of 1726) PASS: lldb-Suite :: tools/lldb-server/TestGdbRemoteProcessInfo.py (1221 of 1726) PASS: lldb-Unit :: Utility/./UtilityTests/OptionsWithRawTest.TerminatedQuote (1222 of 1726) PASS: lldb-Suite :: python_api/sbtype_typeclass/TestSBTypeTypeClass.py (1223 of 1726) PASS: lldb-Unit :: Utility/./UtilityTests/BinaryStreamTest.PutSLEB128One (1224 of 1726) PASS: lldb-Unit :: Language/Highlighting/./HighlighterTests/HighlighterTest.HighlighterSelectionPath (1225 of 1726) PASS: lldb-Suite :: tools/lldb-vscode/breakpoint/TestVSCode_setBreakpoints.py (1226 of 1726) PASS: lldb-Suite :: functionalities/deleted-executable/TestDeletedExecutable.py (1227 of 1726) PASS: lldb-Suite :: lang/objc/objc-class-method/TestObjCClassMethod.py (1228 of 1726) UNSUPPORTED: LLDB :: SymbolFile/PDB/type-quals.test (1229 of 1726) PASS: lldb-Suite :: lang/c/offsetof/TestOffsetof.py (1230 of 1726) PASS: lldb-Unit :: Language/Highlighting/./HighlighterTests/HighlighterTest.ClangUnterminatedString (1231 of 1726) PASS: LLDB :: Reproducer/TestReuseDirectory.test (1232 of 1726) PASS: lldb-Suite :: benchmarks/frame_variable/TestFrameVariableResponse.py (1233 of 1726) PASS: lldb-Suite :: tools/lldb-server/TestLldbGdbServer.py (1234 of 1726) PASS: lldb-Unit :: UnwindAssembly/x86/./UnwindAssemblyx86Tests/Testx86AssemblyInspectionEngine.TestPushRBX (1235 of 1726) PASS: lldb-Unit :: Target/./TargetTests/ExecutionContextTest.GetByteOrderTarget (1236 of 1726) PASS: lldb-Unit :: Utility/./UtilityTests/RangeTest.DoesAdjoinOrIntersect (1237 of 1726) PASS: lldb-Suite :: functionalities/thread/step_out/TestThreadStepOut.py (1238 of 1726) PASS: lldb-Suite :: functionalities/thread/backtrace_limit/TestBacktraceLimit.py (1239 of 1726) PASS: lldb-Unit :: Utility/./UtilityTests/AnsiTerminal.Basic (1240 of 1726) PASS: lldb-Unit :: Expression/./ExpressionTests/DWARFExpression.DW_OP_convert (1241 of 1726) PASS: lldb-Unit :: Utility/./UtilityTests/BroadcasterTest.EventTypeHasListeners (1242 of 1726) PASS: lldb-Suite :: commands/expression/import-std-module/forward_list-basic/TestBasicForwardList.py (1243 of 1726) PASS: lldb-Unit :: Utility/./UtilityTests/StringListTest.AppendList (1244 of 1726) PASS: lldb-Suite :: commands/expression/import_builtin_fileid/TestImportBuiltinFileID.py (1245 of 1726) PASS: lldb-Unit :: ScriptInterpreter/Python/./ScriptInterpreterPythonTests/PythonDataObjectsTest.TestModuleNameResolutionNoDot (1246 of 1726) PASS: lldb-Suite :: python_api/event/TestEvents.py (1247 of 1726) PASS: lldb-Suite :: commands/expression/import-std-module/queue/TestQueue.py (1248 of 1726) PASS: lldb-Unit :: Utility/./UtilityTests/StringExtractorTest.GetNameColonValueNoColon (1249 of 1726) PASS: lldb-Suite :: python_api/file_handle/TestFileHandle.py (1250 of 1726) PASS: lldb-Suite :: commands/expression/call-function/TestCallStopAndContinue.py (1251 of 1726) PASS: lldb-Suite :: tools/lldb-server/TestGdbRemoteRegisterState.py (1252 of 1726) PASS: lldb-Suite :: lang/cpp/class-template-parameter-pack/TestClassTemplateParameterPack.py (1253 of 1726) PASS: lldb-Suite :: commands/expression/entry-bp/TestExprEntryBP.py (1254 of 1726) PASS: lldb-Unit :: Symbol/./SymbolTests/PostfixExpression.ToDWARF (1255 of 1726) PASS: lldb-Suite :: commands/command/script/import/rdar-12586188/TestRdar12586188.py (1256 of 1726) PASS: lldb-Unit :: Symbol/./SymbolTests/SymbolsTest.LocateExecutableSymbolFileForUnknownExecutableAndMissingSymbolFile (1257 of 1726) PASS: lldb-Unit :: Host/./HostTests/HostInfoTest.GetAugmentedArchSpec (1258 of 1726) PASS: lldb-Suite :: lang/c/tls_globals/TestTlsGlobals.py (1259 of 1726) UNSUPPORTED: LLDB :: SymbolFile/NativePDB/typedefs.cpp (1260 of 1726) PASS: lldb-Unit :: Utility/./UtilityTests/StringListTest.JoinThree (1261 of 1726) PASS: lldb-Suite :: functionalities/avoids-fd-leak/TestFdLeak.py (1262 of 1726) PASS: lldb-Suite :: commands/expression/class_template_specialization_empty_pack/TestClassTemplateSpecializationParametersHandling.py (1263 of 1726) PASS: lldb-Unit :: Language/Highlighting/./HighlighterTests/HighlighterTest.DefaultHighlighterWithCursor (1264 of 1726) PASS: lldb-Unit :: Host/./HostTests/FileSystemTest.Resolve (1265 of 1726) PASS: lldb-Suite :: functionalities/breakpoint/debugbreak/TestDebugBreak.py (1266 of 1726) PASS: lldb-Suite :: python_api/interpreter/TestRunCommandInterpreterAPI.py (1267 of 1726) PASS: lldb-Suite :: python_api/rdar-12481949/Test-rdar-12481949.py (1268 of 1726) PASS: lldb-Suite :: python_api/disassemble-raw-data/TestDisassemble_VST1_64.py (1269 of 1726) PASS: lldb-Unit :: Language/Highlighting/./HighlighterTests/HighlighterTest.ClangScalarLiterals (1270 of 1726) PASS: LLDB :: BuildScript/modes.test (1271 of 1726) PASS: lldb-Suite :: lang/objc/ptr_refs/TestPtrRefsObjC.py (1272 of 1726) PASS: lldb-Unit :: Utility/./UtilityTests/StringListTest.SplitIntoLines (1273 of 1726) PASS: LLDB :: SymbolFile/NativePDB/ast-methods.cpp (1274 of 1726) PASS: lldb-Suite :: macosx/version_zero/TestGetVersionZeroVersion.py (1275 of 1726) PASS: lldb-Unit :: ScriptInterpreter/Python/./ScriptInterpreterPythonTests/PythonExceptionStateTest.TestAutoRestoreChanged (1276 of 1726) PASS: lldb-Suite :: functionalities/data-formatter/dump_dynamic/TestDumpDynamic.py (1277 of 1726) PASS: lldb-Suite :: functionalities/data-formatter/data-formatter-stl/libcxx/forward_list/TestDataFormatterLibcxxForwardList.py (1278 of 1726) PASS: lldb-Suite :: commands/watchpoints/multiple_hits/TestMultipleHits.py (1279 of 1726) PASS: lldb-Unit :: Utility/./UtilityTests/StringListTest.GetSize (1280 of 1726) PASS: lldb-Unit :: Process/gdb-remote/./ProcessGdbRemoteTests/GDBRemoteCommunicationClientTest.GetMemoryRegionInfo (1281 of 1726) PASS: lldb-Suite :: lang/objc/objc++/TestObjCXX.py (1282 of 1726) UNSUPPORTED: LLDB :: SymbolFile/PDB/udt-layout.test (1283 of 1726) PASS: lldb-Suite :: python_api/signals/TestSignalsAPI.py (1284 of 1726) PASS: lldb-Unit :: ObjectFile/Breakpad/./ObjectFileBreakpadTests/LineRecord.parse (1285 of 1726) PASS: lldb-Suite :: lang/cpp/signed_types/TestSignedTypes.py (1286 of 1726) PASS: lldb-Suite :: python_api/watchpoint/condition/TestWatchpointConditionAPI.py (1287 of 1726) PASS: lldb-Unit :: Utility/./UtilityTests/StringExtractorTest.GetHexBytes_OddPair2 (1288 of 1726) PASS: lldb-Unit :: Utility/./UtilityTests/StateTest.Formatv (1289 of 1726) PASS: lldb-Suite :: functionalities/data-formatter/data-formatter-smart-array/TestDataFormatterSmartArray.py (1290 of 1726) PASS: lldb-Suite :: functionalities/data-formatter/data-formatter-stl/libcxx/function/TestLibCxxFunction.py (1291 of 1726) PASS: lldb-Unit :: Utility/./UtilityTests/ConstStringTest.FromMidOfBufferStringRef (1292 of 1726) PASS: lldb-Suite :: functionalities/thread/concurrent_events/TestConcurrentDelaySignalWatch.py (1293 of 1726) PASS: lldb-Unit :: Utility/./UtilityTests/StreamTeeTest.Write (1294 of 1726) PASS: lldb-Suite :: lang/cpp/virtual/TestVirtual.py (1295 of 1726) PASS: lldb-Unit :: Utility/./UtilityTests/StreamTest.PutBytesAsRawHex8ToBigEndian (1296 of 1726) PASS: lldb-Suite :: commands/help/TestHelp.py (1297 of 1726) PASS: lldb-Unit :: UnwindAssembly/x86/./UnwindAssemblyx86Tests/Testx86AssemblyInspectionEngine.TestSimplex86_64Augmented (1298 of 1726) PASS: lldb-Suite :: lang/cpp/auto/TestCPPAuto.py (1299 of 1726) PASS: lldb-Unit :: UnwindAssembly/x86/./UnwindAssemblyx86Tests/Testx86AssemblyInspectionEngine.TestPushEDX (1300 of 1726) PASS: lldb-Unit :: Utility/./UtilityTests/GeneratorTest.Get (1301 of 1726) PASS: lldb-Suite :: tools/lldb-vscode/attach/TestVSCode_attach.py (1302 of 1726) PASS: lldb-Suite :: commands/watchpoints/hello_watchpoint/TestMyFirstWatchpoint.py (1303 of 1726) PASS: lldb-Suite :: lang/objc/objc-static-method/TestObjCStaticMethod.py (1304 of 1726) PASS: lldb-Unit :: Utility/./UtilityTests/ScalarTest.Promotion (1305 of 1726) PASS: LLDB :: Reproducer/TestSynchronous.test (1306 of 1726) PASS: lldb-Suite :: functionalities/data-formatter/synthupdate/TestSyntheticFilterRecompute.py (1307 of 1726) PASS: lldb-Unit :: Target/./TargetTests/ModuleCacheTest.GetAndPutStrangeHostname (1308 of 1726) PASS: lldb-Unit :: Symbol/./SymbolTests/DWARFCallFrameInfoTest.Basic_eh (1309 of 1726) PASS: lldb-Suite :: commands/expression/import-std-module/sysroot/TestStdModuleSysroot.py (1310 of 1726) PASS: lldb-Unit :: SymbolFile/DWARF/./SymbolFileDWARFTests/SymbolFileDWARFTests.TestAbbrevOrder1Start5 (1311 of 1726) PASS: lldb-Suite :: types/TestRecursiveTypes.py (1312 of 1726) PASS: lldb-Suite :: commands/log/invalid-args/TestInvalidArgsLog.py (1313 of 1726) PASS: lldb-Unit :: Utility/./UtilityTests/LogChannelEnabledTest.log_options (1314 of 1726) PASS: LLDB :: SymbolFile/DWARF/debug-types-signature-loop.s (1315 of 1726) PASS: lldb-Unit :: ScriptInterpreter/Python/./ScriptInterpreterPythonTests/PythonExceptionStateTest.TestDiscardSemantics (1316 of 1726) PASS: lldb-Unit :: Utility/./UtilityTests/OptionsWithRawTest.WhitespaceSuffix (1317 of 1726) PASS: lldb-Suite :: functionalities/breakpoint/move_nearest/TestMoveNearest.py (1318 of 1726) PASS: lldb-Suite :: functionalities/conditional_break/TestConditionalBreak.py (1319 of 1726) PASS: lldb-Suite :: functionalities/data-formatter/poarray/TestPrintObjectArray.py (1320 of 1726) PASS: LLDB :: SymbolFile/DWARF/debug-line-basic.s (1321 of 1726) PASS: LLDB :: Modules/MachO/subsections.yaml (1322 of 1726) UNSUPPORTED: LLDB :: SymbolFile/PDB/pointers.test (1323 of 1726) PASS: LLDB :: Minidump/disassemble-no-module.yaml (1324 of 1726) PASS: lldb-Unit :: Utility/./UtilityTests/TildeExpressionResolver.ResolveFullPath (1325 of 1726) PASS: lldb-Suite :: commands/watchpoints/hello_watchlocation/TestWatchLocation.py (1326 of 1726) PASS: lldb-Suite :: lang/objc/foundation/TestObjCMethodsString.py (1327 of 1726) PASS: lldb-Unit :: Utility/./UtilityTests/ScalarTest.Scalar_512 (1328 of 1726) PASS: lldb-Suite :: lang/cpp/overloaded-functions/TestOverloadedFunctions.py (1329 of 1726) PASS: lldb-Suite :: functionalities/data-formatter/format-propagation/TestFormatPropagation.py (1330 of 1726) PASS: lldb-Unit :: Utility/./UtilityTests/StreamTest.PutCharNull (1331 of 1726) PASS: LLDB :: Driver/TestCore.test (1332 of 1726) PASS: lldb-Unit :: Process/gdb-remote/./ProcessGdbRemoteTests/GDBRemoteCommunicationClientTest.GetModulesInfo_UUID20 (1333 of 1726) PASS: lldb-Suite :: lang/objc/bitfield_ivars/TestBitfieldIvars.py (1334 of 1726) PASS: lldb-Unit :: Utility/./UtilityTests/RangeTest.EqualInvalid (1335 of 1726) PASS: lldb-Unit :: Utility/./UtilityTests/SerializationRountripTest.SerializeDeserializeObjectReference (1336 of 1726) PASS: LLDB :: Settings/TestSettingsWrite.test (1337 of 1726) PASS: lldb-Suite :: commands/reproducer/invalid-args/TestInvalidArgsReproducer.py (1338 of 1726) PASS: lldb-Unit :: Host/./HostTests/TaskPoolTest.TaskMap (1339 of 1726) UNSUPPORTED: LLDB :: ExecControl/StopHook/stop-hook-threads.test (1340 of 1726) PASS: lldb-Suite :: types/TestIntegerTypes.py (1341 of 1726) PASS: lldb-Suite :: functionalities/breakpoint/serialize/TestBreakpointSerialization.py (1342 of 1726) PASS: lldb-Unit :: Utility/./UtilityTests/RangeTest.SizeTypes (1343 of 1726) PASS: lldb-Unit :: Process/gdb-remote/./ProcessGdbRemoteTests/GDBRemoteClientBaseTest.SendContinueDelegateStructuredDataReceipt (1344 of 1726) XFAIL: LLDB :: Unwind/prefer-debug-over-eh-frame.test (1345 of 1726) PASS: lldb-Unit :: UnwindAssembly/x86/./UnwindAssemblyx86Tests/Testx86AssemblyInspectionEngine.TestPopEBP (1346 of 1726) PASS: lldb-Unit :: Host/./HostTests/MainLoopTest.DetectsEOF (1347 of 1726) PASS: lldb-Unit :: Utility/./UtilityTests/StringExtractorTest.GetHexBytes_Underflow (1348 of 1726) PASS: lldb-Unit :: UnwindAssembly/x86/./UnwindAssemblyx86Tests/Testx86AssemblyInspectionEngine.TestPushR12 (1349 of 1726) PASS: LLDB :: Commands/command-regex-delete.test (1350 of 1726) PASS: lldb-Suite :: functionalities/data-formatter/data-formatter-ptr-to-array/TestPtrToArrayFormatting.py (1351 of 1726) PASS: lldb-Suite :: functionalities/darwin_log/filter/exact_match/activity-chain/TestDarwinLogFilterMatchActivityChain.py (1352 of 1726) PASS: lldb-Suite :: functionalities/data-formatter/data-formatter-synthtype/TestDataFormatterSynthType.py (1353 of 1726) PASS: lldb-Suite :: functionalities/thread/crash_during_step/TestCrashDuringStep.py (1354 of 1726) PASS: lldb-Unit :: Process/gdb-remote/./ProcessGdbRemoteTests/GDBRemoteClientBaseTest.SendPacketAndReceiveResponseWithOutputSupport (1355 of 1726) PASS: lldb-Suite :: python_api/module_section/TestModuleAndSection.py (1356 of 1726) PASS: LLDB :: Modules/ELF/PT_LOAD-overlap.yaml (1357 of 1726) PASS: lldb-Suite :: lang/cpp/function_refs/TestFunctionRefs.py (1358 of 1726) PASS: lldb-Unit :: ObjectFile/Breakpad/./ObjectFileBreakpadTests/FuncRecord.parse (1359 of 1726) PASS: lldb-Unit :: Utility/./UtilityTests/RegularExpression.Valid (1360 of 1726) PASS: lldb-Unit :: Utility/./UtilityTests/StringExtractorTest.GetHexU8_InvalidHex (1361 of 1726) PASS: lldb-Suite :: lang/cpp/bool/TestCPPBool.py (1362 of 1726) PASS: lldb-Suite :: lang/c/anonymous/TestAnonymous.py (1363 of 1726) PASS: lldb-Unit :: Utility/./UtilityTests/DataExtractorTest.GetBitfield (1364 of 1726) PASS: lldb-Unit :: Utility/./UtilityTests/UriParserTest.PortOverflow (1365 of 1726) PASS: LLDB :: SymbolFile/DWARF/dwarf5-index-is-used.cpp (1366 of 1726) PASS: lldb-Unit :: Symbol/./SymbolTests/TestClangASTContext.TestBuiltinTypeForEncodingAndBitSize (1367 of 1726) PASS: lldb-Suite :: functionalities/data-formatter/data-formatter-synth/TestDataFormatterSynth.py (1368 of 1726) PASS: LLDB :: Quit/TestQuitExitCode-30.test (1369 of 1726) PASS: lldb-Unit :: Process/gdb-remote/./ProcessGdbRemoteTests/GDBRemoteCommunicationServerTest.SendErrorResponse_StringError (1370 of 1726) PASS: lldb-Suite :: commands/expression/anonymous-struct/TestCallUserAnonTypedef.py (1371 of 1726) PASS: lldb-Suite :: commands/expression/persistent_types/TestNestedPersistentTypes.py (1372 of 1726) PASS: lldb-Suite :: functionalities/archives/TestBSDArchives.py (1373 of 1726) PASS: LLDB :: SymbolFile/DWARF/deterministic-build.cpp (1374 of 1726) PASS: lldb-Suite :: tools/lldb-server/TestGdbRemoteAttach.py (1375 of 1726) PASS: lldb-Unit :: Target/./TargetTests/PathMappingListTest.RelativeTests (1376 of 1726) PASS: lldb-Unit :: ScriptInterpreter/Python/./ScriptInterpreterPythonTests/PythonDataObjectsTest.TestDictionaryResolutionWithDot (1377 of 1726) PASS: lldb-Unit :: Language/Highlighting/./HighlighterTests/HighlighterTest.ClangIdentifiers (1378 of 1726) PASS: lldb-Unit :: Utility/./UtilityTests/BinaryStreamTest.PutSLEB128EightBytes (1379 of 1726) PASS: lldb-Suite :: lang/cpp/class_types/TestClassTypesDisassembly.py (1380 of 1726) PASS: lldb-Suite :: lang/objc/foundation/TestConstStrings.py (1381 of 1726) PASS: lldb-Suite :: lang/cpp/class_static/TestStaticVariables.py (1382 of 1726) PASS: lldb-Unit :: Host/./HostTests/SocketAddressTest.GetAddressInfo (1383 of 1726) PASS: LLDB :: Expr/TestTypeOfDeclTypeExpr.test (1384 of 1726) PASS: lldb-Unit :: debugserver/./debugserverTests/RNBSocket.LoopBackConnectIPv4 (1385 of 1726) PASS: lldb-Suite :: functionalities/tail_call_frames/unambiguous_sequence/TestUnambiguousTailCalls.py (1386 of 1726) PASS: lldb-Unit :: Utility/./UtilityTests/StreamTeeTest.Constructor2Streams (1387 of 1726) PASS: lldb-Unit :: Utility/./UtilityTests/LogChannelEnabledTest.LLDB_LOG_ERROR (1388 of 1726) PASS: lldb-Unit :: Utility/./UtilityTests/StringListTest.JoinSingle (1389 of 1726) PASS: lldb-Suite :: commands/watchpoints/watchpoint_commands/command/TestWatchpointCommandPython.py (1390 of 1726) PASS: lldb-Suite :: functionalities/abbreviation/TestAbbreviations.py (1391 of 1726) PASS: lldb-Unit :: Host/./HostTests/MainLoopTest.ReadObject (1392 of 1726) PASS: lldb-Suite :: python_api/process/io/TestProcessIO.py (1393 of 1726) PASS: lldb-Suite :: lang/objc/global_ptrs/TestGlobalObjects.py (1394 of 1726) PASS: lldb-Suite :: commands/expression/rdar44436068/Test128BitsInteger.py (1395 of 1726) UNSUPPORTED: LLDB :: SymbolFile/NativePDB/local-variables.cpp (1396 of 1726) PASS: LLDB :: SymbolFile/Breakpad/line-table.test (1397 of 1726) PASS: lldb-Unit :: Process/gdb-remote/./ProcessGdbRemoteTests/GDBRemoteCommunicationClientTest.GetModulesInfo (1398 of 1726) PASS: LLDB :: SymbolFile/DWARF/debug_loc.s (1399 of 1726) PASS: lldb-Suite :: functionalities/darwin_log/format/TestDarwinLogMessageFormat.py (1400 of 1726) PASS: lldb-Unit :: Expression/./ExpressionTests/DiagnosticManagerTest.AddDiagnostic (1401 of 1726) PASS: lldb-Unit :: Utility/./UtilityTests/TimeoutTest.Format (1402 of 1726) PASS: lldb-Unit :: SymbolFile/NativePDB/./SymbolFileNativePDBTests/PDBFPOProgramToDWARFExpressionTests.InvalidAssignmentMultiple (1403 of 1726) PASS: lldb-Unit :: Utility/./UtilityTests/StringExtractorTest.GetHexU8_Extra (1404 of 1726) PASS: lldb-Suite :: functionalities/thread/concurrent_events/TestConcurrentTwoWatchpointsOneBreakpoint.py (1405 of 1726) PASS: lldb-Unit :: Process/minidump/./LLDBMinidumpTests/MinidumpParserTest.GetPid (1406 of 1726) PASS: lldb-Unit :: Utility/./UtilityTests/StreamTest.PutHex64ByteOrderBig (1407 of 1726) PASS: lldb-Suite :: functionalities/data-formatter/nssetsynth/TestNSSetSynthetic.py (1408 of 1726) PASS: lldb-Suite :: commands/watchpoints/watchpoint_disable/TestWatchpointDisable.py (1409 of 1726) PASS: lldb-Unit :: Utility/./UtilityTests/StringListTest.DefaultConstructor (1410 of 1726) PASS: lldb-Suite :: functionalities/unwind/ehframe/TestEhFrameUnwind.py (1411 of 1726) PASS: lldb-Suite :: lang/cpp/template-function/TestTemplateFunctions.py (1412 of 1726) PASS: lldb-Suite :: functionalities/thread/break_after_join/TestBreakAfterJoin.py (1413 of 1726) PASS: lldb-Unit :: ObjectFile/Breakpad/./ObjectFileBreakpadTests/StackWinRecord.parse (1414 of 1726) PASS: lldb-Suite :: types/TestDoubleTypesExpr.py (1415 of 1726) PASS: LLDB :: Modules/ELF/PT_LOAD.yaml (1416 of 1726) PASS: lldb-Unit :: Target/./TargetTests/ExecutionContextTest.GetByteOrderProcess (1417 of 1726) PASS: LLDB :: SymbolFile/Breakpad/stack-cfi-parsing.test (1418 of 1726) PASS: lldb-Suite :: functionalities/data-formatter/data-formatter-stl/libcxx/variant/TestDataFormatterLibcxxVariant.py (1419 of 1726) PASS: lldb-Suite :: functionalities/load_using_paths/TestLoadUsingPaths.py (1420 of 1726) PASS: lldb-Unit :: UnwindAssembly/x86/./UnwindAssemblyx86Tests/Testx86AssemblyInspectionEngine.TestSpillRegToStackViaMOVi386 (1421 of 1726) PASS: lldb-Suite :: commands/expression/char/TestExprsChar.py (1422 of 1726) PASS: lldb-Unit :: Utility/./UtilityTests/AnsiTerminal.WhiteSpace (1423 of 1726) PASS: lldb-Suite :: android/platform/TestDefaultCacheLineSize.py (1424 of 1726) PASS: LLDB :: SymbolFile/NativePDB/s_constant.cpp (1425 of 1726) PASS: lldb-Suite :: commands/expression/namespace_local_var_same_name_obj_c/TestNamespaceLocalVarSameNameObjC.py (1426 of 1726) PASS: lldb-Unit :: Utility/./UtilityTests/Flags.IsClear (1427 of 1726) PASS: lldb-Unit :: Utility/./UtilityTests/ArgsTest.EscapeLLDBCommandArgument (1428 of 1726) PASS: lldb-Unit :: Host/./HostTests/FileSystemTest.FileAndDirectoryComponents (1429 of 1726) PASS: lldb-Unit :: Utility/./UtilityTests/AnsiTerminal.Twice (1430 of 1726) PASS: lldb-Suite :: python_api/function_symbol/TestSymbolAPI.py (1431 of 1726) PASS: lldb-Unit :: ScriptInterpreter/Python/./ScriptInterpreterPythonTests/PythonDataObjectsTest.TestPythonFile (1432 of 1726) PASS: lldb-Suite :: functionalities/wrong_commands/TestWrongCommands.py (1433 of 1726) PASS: lldb-Unit :: SymbolFile/NativePDB/./SymbolFileNativePDBTests/PDBFPOProgramToDWARFExpressionTests.InvalidAssignmentSingle (1434 of 1726) PASS: lldb-Unit :: Utility/./UtilityTests/StreamTest.PutRawBytesToBigEndian (1435 of 1726) PASS: lldb-Unit :: UnwindAssembly/x86/./UnwindAssemblyx86Tests/Testx86AssemblyInspectionEngine.TestPushEAX (1436 of 1726) PASS: lldb-Suite :: commands/log/basic/TestLogging.py (1437 of 1726) PASS: lldb-Unit :: Utility/./UtilityTests/StringListTest.ShiftCString (1438 of 1726) PASS: lldb-Suite :: commands/expression/radar_8638051/Test8638051.py (1439 of 1726) PASS: lldb-Suite :: functionalities/signal/handle-segv/TestHandleSegv.py (1440 of 1726) PASS: lldb-Unit :: ScriptInterpreter/Python/./ScriptInterpreterPythonTests/PythonDataObjectsTest.TestObjectAttributes (1441 of 1726) PASS: LLDB :: Driver/TestTarget.test (1442 of 1726) PASS: lldb-Unit :: Utility/./UtilityTests/TimeoutTest.Construction (1443 of 1726) PASS: lldb-Suite :: sanity/TestModuleCacheSanity.py (1444 of 1726) PASS: lldb-Unit :: Process/gdb-remote/./ProcessGdbRemoteTests/GDBRemoteCommunicationClientTest.SendGetDataPacket (1445 of 1726) PASS: lldb-Unit :: Process/minidump/./LLDBMinidumpTests/RegisterContextMinidump.ConvertMinidumpContext_x86_32 (1446 of 1726) PASS: lldb-Unit :: Process/minidump/./LLDBMinidumpTests/MinidumpParserTest.GetMemory (1447 of 1726) PASS: lldb-Suite :: lang/cpp/char8_t/TestCxxChar8_t.py (1448 of 1726) PASS: LLDB :: Modules/ELF/section-overlap.yaml (1449 of 1726) UNSUPPORTED: LLDB :: SymbolFile/PDB/expressions.test (1450 of 1726) PASS: lldb-Suite :: commands/expression/import-std-module/vector-basic/TestBasicVector.py (1451 of 1726) FAIL: lldb-Suite :: iohandler/completion/TestIOHandlerCompletion.py (1452 of 1726) ******************** TEST 'lldb-Suite :: iohandler/completion/TestIOHandlerCompletion.py' FAILED ******************** lldb version 10.0.99 (http://labmaster3.local/git/llvm-project.git revision 0c0de794f1affc7460eb90626b8483e4a0cbde6c) clang revision 4a07336a886d6fa908ee19d72abe0ecb3732b377 llvm revision 4a07336a886d6fa908ee19d72abe0ecb3732b377 LLDB library dir: /Users/buildslave/jenkins/workspace/lldb-cmake-sanitized/lldb-build/bin LLDB import library dir: /Users/buildslave/jenkins/workspace/lldb-cmake-sanitized/lldb-build/bin libstdcxx tests will not be run because: Don't know how to build with libstdcxx on macosx Skipping following debug info categories: ['dwo'] (lldb) settings set symbols.enable-external-lookup false (lldb) settings set plugin.process.gdb-remote.packet-timeout 60 (lldb) settings set symbols.clang-modules-cache-path "/Users/buildslave/jenkins/workspace/lldb-cmake-sanitized/lldb-build/tools/lldb/lldb-test-build.noindex/module-cache-lldb" (lldb) settings set use-color false (lldb) a Available completions: _regexp-attach -- Attach to process by ID or name. _regexp-break -- Set a breakpoint using one of several shorthand formats. _regexp-bt -- Show the current thread's call stack. Any numeric argument displays at most that many frames. The argument 'all' displays all threads. Use 'settings set frame-format' to customize the printing of individual frames and 'settings set thread-format' to customize the thread header. _regexp-display -- Evaluate an expression at every stop (see 'help target stop-hook'.) _regexp-down -- Select a newer stack frame. Defaults to moving one frame, a numeric argument can specify an arbitrary number. _regexp-env -- Shorthand for viewing and setting environment variables. _regexp-jump -- Set the program counter to a new address. _regexp-list -- List relevant source code using one of several shorthand formats. _regexp-tbreak -- Set a one-shot breakpoint using one of several shorthand formats. _regexp-undisplay -- Stop displaying expression at every stop (specified by stop-hook index.) _regexp-up -- Select an older stack frame. Defaults to moving one frame, a numeric argument can specify an arbitrary number. apropos -- List debugger commands related to a word or subject. breakpoint -- Commands for operating on breakpoints (see 'help b' for shorthand.) command -- Commands for managing custom LLDB commands. disassemble -- Disassemble specified instructions in the current target. Defaults to the current function for the current thread and stack frame. expression -- Evaluate an expression on the current thread. Displays any returned value with LLDB's default formatting. frame -- Commands for selecting and examing the current thread's stack frames. gdb-remote -- Connect to a process via remote GDB server. If no host is specifed, localhost is assumed. gui -- Switch into the curses based GUI mode. help -- Show a list of all debugger commands, or give details about a specific command. kdp-remote -- Connect to a process via remote KDP server. If no UDP port is specified, port 41139 is assumed. language -- Commands specific to a source language. log -- Commands controlling LLDB internal logging. memory -- Commands for operating on memory in the current target process. platform -- Commands to manage and create platforms. plugin -- Commands for managing LLDB plugins. process -- Commands for interacting with processes on the current platform. quit -- Quit the LLDB debugger. register regi -- Commands to access registers for the current thread and stack frame. reproducer -- Commands for manipulate the reproducer functionality. script -- Invoke the script interpreter with provided code and display any results. Start the interactive interpreter if no code is supplied. settings -- Commands for managing LLDB settings. source -- Commands for examining source code described by debug information for the current target process. statistics -- Print statistics about a debugging session target -- Commands for operating on debugger targets. thread -- Commands for operating on one or more threads in the current process. type -- Commands for operating on the type system. version -- Show the LLDB debugger version. watchpoint -- Commands for operating on watchpoints. add-dsym -- Add a debug symbol file to one of the target's current modules by specifying a path to a debug symbols file, or using the options to specify a module to download symbols for. More (Y/n/a): attach -- Attach to process by ID or name. b -- Set a breakpoint using one of several shorthand formats. bt -- Show the current thread's call stack. Any numeric argument displays at most that many frames. The argument 'all' displays all threads. Use 'settings set frame-format' to customize the printing of individual frames and 'settings set thread-format' to customize the thread header. c -- Continue execution of all threads in the current process. call -- Evaluate an expression on the current thread. Displays any returned value with LLDB's default formatting. continue -- Continue execution of all threads in the current process. detach -- Detach from the current target process. di -- Disassemble specified instructions in the current target. Defaults to the current function for the current thread and stack frame. dis -- Disassemble specified instructions in the current target. Defaults to the current function for the current thread and stack frame. display -- Evaluate an expression at every stop (see 'help target stop-hook'.) down -- Select a newer stack frame. Defaults to moving one frame, a numeric argument can specify an arbitrary number. env -- Shorthand for viewing and setting environment variables. exit -- Quit the LLDB debugger. f -- Select the current stack frame by index from within the current thread (see 'thread backtrace'.) file -- Create a target using the argument as the main executable. finish -- Finish executing the current stack frame and stop after returning. Defaults to current thread unless specified. image -- Commands for accessing information for one or more target modules. j -- Set the program counter to a new address. jump -- Set the program counter to a new address. kill -- Terminate the current target process. l -- List relevant source code using one of several shorthand formats. list -- List relevant source code using one of several shorthand formats. n -- Source level single step, stepping over calls. Defaults to current thread unless specified. next -- Source level single step, stepping over calls. Defaults to current thread unless specified. nexti -- Instruction level single step, stepping over calls. Defaults to current thread unless specified. ni -- Instruction level single step, stepping over calls. Defaults to current thread unless specified. p -- Evaluate an expression on the current thread. Displays any returned value with LLDB's default formatting. parray -- Evaluate an expression on the current thread. Displays any returned value with LLDB's default formatting. po -- Evaluate an expression on the current thread. Displays any returned value with formatting controlled by the type's author. poarray -- Evaluate an expression on the current thread. Displays any returned value with LLDB's default formatting. print -- Evaluate an expression on the current thread. Displays any returned value with LLDB's default formatting. q -- Quit the LLDB debugger. r -- Launch the executable in the debugger. rbreak -- Sets a breakpoint or set of breakpoints in the executable. re -- Commands to access registers for the current thread and stack frame. run -- Launch the executable in the debugger. s -- Source level single step, stepping into calls. Defaults to current thread unless specified. si -- Instruction level single step, stepping into calls. Defaults to current thread unless specified. sif -- Step through the current block, stopping if you step directly into a function whose name matches the TargetFunctionName. step -- Source level single step, stepping into calls. Defaults to current thread unless specified. More (Y/n/a): stepi -- Instruction level single step, stepping into calls. Defaults to current thread unless specified. t -- Change the currently selected thread. tbreak -- Set a one-shot breakpoint using one of several shorthand formats. undisplay -- Stop displaying expression at every stop (specified by stop-hook index.) up -- Select an older stack frame. Defaults to moving one frame, a numeric argument can specify an arbitrary number. v -- Show variables for the current stack frame. Defaults to all arguments and local variables in scope. Names of argument, local, file static and file global variables can be specified. Children of aggregate variables can be specified such as 'var->child.x'. The -> and [] operators in 'frame variable' do not invoke operator overloads if they exist, but directly access the specified element. If you want to trigger operator overloads use the expression command to print the variable instead. It is worth noting that except for overloaded operators, when printing local variables 'expr local_var' and 'frame var local_var' produce the same results. However, 'frame variable' is more efficient, since it uses debug information and memory reads directly, rather than parsing and evaluating an expression, which may even involve JITing and running code in the target program. var -- Show variables for the current stack frame. Defaults to all arguments and local variables in scope. Names of argument, local, file static and file global variables can be specified. Children of aggregate variables can be specified such as 'var->child.x'. The -> and [] operators in 'frame variable' do not invoke operator overloads if they exist, but directly access the specified element. If you want to trigger operator overloads use the expression command to print the variable instead. It is worth noting that except for overloaded operators, when printing local variables 'expr local_var' and 'frame var local_var' produce the same results. However, 'frame variable' is more efficient, since it uses debug information and memory reads directly, rather than parsing and evaluating an expression, which may even involve JITing and running code in the target program. vo -- Show variables for the current stack frame. Defaults to all arguments and local variables in scope. Names of argument, local, file static and file global variables can be specified. Children of aggregate variables can be specified such as 'var->child.x'. The -> and [] operators in 'frame variable' do not invoke operator overloads if they exist, but directly access the specified element. If you want to trigger operator overloads use the expression command to print the variable instead. It is worth noting that except for overloaded operators, when printing local variables 'expr local_var' and 'frame var local_var' produce the same results. However, 'frame variable' is more efficient, since it uses debug information and memory reads directly, rather than parsing and evaluating an expression, which may even involve JITing and running code in the target program. x -- Read from the memory of the current target process. (lldb)  (lldb) regi (lldb) register

Hide Details

Commands to access registers for the current thread and stack frame.

Hide Details

Syntax: register [read|write] ...

Hide Details

The following subcommands are supported:

Hide Details

read -- Dump the contents of one or more register values from the current frame. If no register is specified, dumps them all. write -- Modify a single register value.

Hide Details

For more help on any particular subcommand, type 'help <command> <subcommand>'. (lldb) file /Users/buildslave/jenkins/workspace/lldb-cmake-sanitized/llvm-project/lldb/packages/Python/lldbsuite/test/iohandler/completion file /Users/buildslave/jenkins/workspace/lldb-cmake-sanitized/llvm-project/lldb/packages/Python/lldbsuite/test/iohandler/completion (lldb) file /Users/buildslave/jenkins/workspace/lldb-cmake-sanitized/llvm-project/lldb/packages/Python/lldbsuite/test/iohandler/completion/TestIOHandler TestIOHandler (lldb) file /Users/buildslave/jenkins/workspace/lldb-cmake-sanitized/llvm-project/lldb/packages/Python/lldbsuite/test/iohandler/completion/TestIOHandlerCompletion.py

Hide Details

error: '/Users/buildslave/jenkins/workspace/lldb-cmake-sanitized/llvm-project/lldb/packages/Python/lldbsuite/test/iohandler/completion/TestIOHandlerCompletion.py' doesn't contain any 'host' platform architectures: x86_64, i386 (lldb) Available completions: _regexp-attach -- Attach to process by ID or name. _regexp-break -- Set a breakpoint using one of several shorthand formats. _regexp-bt -- Show the current thread's call stack. Any numeric argument displays at most that many frames. The argument 'all' displays all threads. Use 'settings set frame-format' to customize the printing of individual frames and 'settings set thread-format' to customize the thread header. _regexp-display -- Evaluate an expression at every stop (see 'help target stop-hook'.) _regexp-down -- Select a newer stack frame. Defaults to moving one frame, a numeric argument can specify an arbitrary number. _regexp-env -- Shorthand for viewing and setting environment variables. _regexp-jump -- Set the program counter to a new address. _regexp-list -- List relevant source code using one of several shorthand formats. _regexp-tbreak -- Set a one-shot breakpoint using one of several shorthand formats. _regexp-undisplay -- Stop displaying expression at every stop (specified by stop-hook index.) _regexp-up -- Select an older stack frame. Defaults to moving one frame, a numeric argument can specify an arbitrary number. apropos -- List debugger commands related to a word or subject. breakpoint -- Commands for operating on breakpoints (see 'help b' for shorthand.) command -- Commands for managing custom LLDB commands. disassemble -- Disassemble specified instructions in the current target. Defaults to the current function for the current thread and stack frame. expression -- Evaluate an expression on the current thread. Displays any returned value with LLDB's default formatting. frame -- Commands for selecting and examing the current thread's stack frames. gdb-remote -- Connect to a process via remote GDB server. If no host is specifed, localhost is assumed. gui -- Switch into the curses based GUI mode. help -- Show a list of all debugger commands, or give details about a specific command. kdp-remote -- Connect to a process via remote KDP server. If no UDP port is specified, port 41139 is assumed. language -- Commands specific to a source language. log -- Commands controlling LLDB internal logging. memory -- Commands for operating on memory in the current target process. platform -- Commands to manage and create platforms. plugin -- Commands for managing LLDB plugins. process -- Commands for interacting with processes on the current platform. quit -- Quit the LLDB debugger. register -- Commands to access registers for the current thread and stack frame. reproducer -- Commands for manipulate the reproducer functionality. script -- Invoke the script interpreter with provided code and display any results. Start the interactive interpreter if no code is supplied. settings -- Commands for managing LLDB settings. source -- Commands for examining source code described by debug information for the current target process. statistics -- Print statistics about a debugging session target -- Commands for operating on debugger targets. thread -- Commands for operating on one or more threads in the current process. type -- Commands for operating on the type system. version -- Show the LLDB debugger version. watchpoint -- Commands for operating on watchpoints. add-dsym -- Add a debug symbol file to one of the target's current modules by specifying a path to a debug symbols file, or using the options to specify a module to download symbols for. More (Y/n/a): n (lldb) regoinvalid (lldb) regosettings set interpreter.prompt-on-quit false

Hide Details

Session logs for test failures/errors/unexpected successes will go into directory '/Users/buildslave/jenkins/workspace/lldb-cmake-sanitized/test/logs' Command invoked: /Users/buildslave/jenkins/workspace/lldb-cmake-sanitized/llvm-project/lldb/test/dotest.py --arch=x86_64 -s /Users/buildslave/jenkins/workspace/lldb-cmake-sanitized/lldb-build/lldb-test-traces -S nm -u CXXFLAGS -u CFLAGS --executable /Users/buildslave/jenkins/workspace/lldb-cmake-sanitized/lldb-build/./bin/lldb --dsymutil /Users/buildslave/jenkins/workspace/lldb-cmake-sanitized/lldb-build/./bin/dsymutil --filecheck /Users/buildslave/jenkins/workspace/lldb-cmake-sanitized/lldb-build/./bin/FileCheck -C /Users/buildslave/jenkins/workspace/lldb-cmake-sanitized/host-compiler/bin/clang --codesign-identity lldb_codesign --server /Users/buildslave/jenkins/workspace/lldb-cmake-sanitized/lldb-build/./bin/debugserver --arch x86_64 --build-dir /Users/buildslave/jenkins/workspace/lldb-cmake-sanitized/lldb-build/lldb-test-build.noindex -s=/Users/buildslave/jenkins/workspace/lldb-cmake-sanitized/test/logs -t --env TERM=vt100 --env LLVM_LIBS_DIR=/Users/buildslave/jenkins/workspace/lldb-cmake-sanitized/lldb-build/./lib --build-dir /Users/buildslave/jenkins/workspace/lldb-cmake-sanitized/lldb-build/tools/lldb/lldb-test-build.noindex --module-cache-dir /Users/buildslave/jenkins/workspace/lldb-cmake-sanitized/lldb-build/tools/lldb/lldb-test-build.noindex/module-cache-lldb /Users/buildslave/jenkins/workspace/lldb-cmake-sanitized/llvm-project/lldb/packages/Python/lldbsuite/test/iohandler/completion -p TestIOHandlerCompletion.py Change dir to: /Users/buildslave/jenkins/workspace/lldb-cmake-sanitized/llvm-project/lldb/packages/Python/lldbsuite/test/iohandler/completion runCmd: settings set symbols.enable-external-lookup false output:

Hide Details

runCmd: settings set plugin.process.gdb-remote.packet-timeout 60 output:

Hide Details

runCmd: settings set symbols.clang-modules-cache-path "/Users/buildslave/jenkins/workspace/lldb-cmake-sanitized/lldb-build/tools/lldb/lldb-test-build.noindex/module-cache-lldb" output:

Hide Details

runCmd: settings set use-color false output:

Hide Details

FAIL: LLDB (/Users/buildslave/jenkins/workspace/lldb-cmake-sanitized/host-compiler/bin/clang-10-x86_64) :: test_completion (TestIOHandlerCompletion.IOHandlerCompletionTest) tearing down the child process....

Hide Details

CLEANUP ERROR: LLDB (/Users/buildslave/jenkins/workspace/lldb-cmake-sanitized/host-compiler/bin/clang-10-x86_64) :: test_completion (TestIOHandlerCompletion.IOHandlerCompletionTest) Restore dir to: /Users/buildslave/jenkins/workspace/lldb-cmake-sanitized/lldb-build/tools/lldb/lit ====================================================================== ERROR: test_completion (TestIOHandlerCompletion.IOHandlerCompletionTest) ---------------------------------------------------------------------- Traceback (most recent call last): File "/Users/buildslave/jenkins/workspace/lldb-cmake-sanitized/llvm-project/lldb/packages/Python/lldbsuite/test/iohandler/completion/TestIOHandlerCompletion.py", line 52, in test_completion self.quit() File "/Users/buildslave/jenkins/workspace/lldb-cmake-sanitized/llvm-project/lldb/packages/Python/lldbsuite/test/lldbpexpect.py", line 61, in quit self.child.close(force=not gracefully) File "/Users/buildslave/jenkins/workspace/lldb-cmake-sanitized/llvm-project/lldb/third_party/Python/module/pexpect-4.6/pexpect/pty_spawn.py", line 327, in close self.ptyproc.close(force=force) File "/System/Library/Frameworks/Python.framework/Versions/2.7/lib/python2.7/contextlib.py", line 35, in __exit__ self.gen.throw(type, value, traceback) File "/Users/buildslave/jenkins/workspace/lldb-cmake-sanitized/llvm-project/lldb/third_party/Python/module/pexpect-4.6/pexpect/pty_spawn.py", line 25, in _wrap_ptyprocess_err raise ExceptionPexpect(*e.args) ExceptionPexpect: Could not terminate the child. Config=x86_64-/Users/buildslave/jenkins/workspace/lldb-cmake-sanitized/host-compiler/bin/clang-10 ---------------------------------------------------------------------- Ran 1 test in 2.914s

Hide Details

RESULT: FAILED (0 passes, 0 failures, 1 errors, 0 skipped, 0 expected failures, 0 unexpected successes)

Hide Details

******************** PASS: lldb-Suite :: functionalities/data-formatter/data-formatter-stl/libcxx/multimap/TestDataFormatterLibccMultiMap.py (1453 of 1726) PASS: lldb-Unit :: Utility/./UtilityTests/IndexToObjectTest.ObjectForIndex (1454 of 1726) PASS: lldb-Unit :: Language/CPlusPlus/./LanguageCPlusPlusTests/CPlusPlusLanguage.CPlusPlusNameParser (1455 of 1726) PASS: lldb-Unit :: Utility/./UtilityTests/VMRange.Reset (1456 of 1726) PASS: lldb-Suite :: functionalities/thread/concurrent_events/TestConcurrentManySignals.py (1457 of 1726) PASS: lldb-Unit :: Utility/./UtilityTests/ArchSpecTest.MergeFrom (1458 of 1726) PASS: lldb-Suite :: functionalities/data-formatter/data-formatter-skip-summary/TestDataFormatterSkipSummary.py (1459 of 1726) PASS: lldb-Unit :: Utility/./UtilityTests/EventTest.DumpEventDataBytes (1460 of 1726) PASS: lldb-Suite :: functionalities/thread/concurrent_events/TestConcurrentCrashWithSignal.py (1461 of 1726) PASS: lldb-Unit :: Utility/./UtilityTests/ProcessInstanceInfo.DumpTable_invalidUID (1462 of 1726) PASS: lldb-Suite :: commands/expression/completion-crash2/TestCompletionCrash2.py (1463 of 1726) PASS: LLDB :: Breakpoint/debug_rnglistx_rlex.test (1464 of 1726) PASS: LLDB :: SymbolFile/DWARF/find-method-local-struct.cpp (1465 of 1726) PASS: LLDB :: Modules/ELF/netbsd-exec-8.99.30-amd64.yaml (1466 of 1726) PASS: lldb-Suite :: functionalities/data-formatter/data-formatter-stl/libcxx/list/TestDataFormatterLibcxxList.py (1467 of 1726) PASS: LLDB :: Python/crashlog.test (1468 of 1726) PASS: lldb-Suite :: api/listeners/TestListener.py (1469 of 1726) PASS: LLDB :: Driver/TestProcessAttach.test (1470 of 1726) PASS: lldb-Suite :: tools/lldb-server/commandline/TestStubSetSID.py (1471 of 1726) PASS: lldb-Suite :: functionalities/data-formatter/data-formatter-objc/TestDataFormatterObjCKVO.py (1472 of 1726) PASS: lldb-Suite :: python_api/breakpoint/TestBreakpointAPI.py (1473 of 1726) PASS: LLDB :: SymbolFile/sizeless-symbol.test (1474 of 1726) PASS: lldb-Unit :: Utility/./UtilityTests/NameMatchesTest.StartsWith (1475 of 1726) PASS: lldb-Unit :: Utility/./UtilityTests/CompletionRequest.DuplicateFilteringWithComments (1476 of 1726) PASS: lldb-Unit :: Utility/./UtilityTests/SerializationRountripTest.SerializeDeserializePodPointers (1477 of 1726) PASS: lldb-Suite :: functionalities/postmortem/minidump-new/TestMiniDumpUUID.py (1478 of 1726) PASS: lldb-Suite :: python_api/objc_type/TestObjCType.py (1479 of 1726) PASS: lldb-Suite :: lang/cpp/scope/TestCppScope.py (1480 of 1726) PASS: lldb-Suite :: commands/target/create-no-such-arch/TestNoSuchArch.py (1481 of 1726) PASS: lldb-Unit :: Utility/./UtilityTests/LogChannelEnabledTest.LogGetLogThread (1482 of 1726) PASS: LLDB :: SymbolFile/DWARF/find-inline-method.s (1483 of 1726) PASS: lldb-Unit :: Symbol/./SymbolTests/LineEntryTest.GetSameLineContiguousAddressRangeNoInlines (1484 of 1726) PASS: lldb-Suite :: functionalities/target-new-solib-notifications/TestModuleLoadedNotifys.py (1485 of 1726) PASS: LLDB :: Reproducer/Functionalities/TestStepping.test (1486 of 1726) PASS: lldb-Suite :: functionalities/type_lookup/TestTypeLookup.py (1487 of 1726) PASS: lldb-Suite :: commands/command/source/TestCommandSource.py (1488 of 1726) PASS: lldb-Unit :: UnwindAssembly/x86/./UnwindAssemblyx86Tests/Testx86AssemblyInspectionEngine.TestPopR14 (1489 of 1726) PASS: lldb-Unit :: Host/./HostTests/NativeProcessProtocolTest.SetBreakpointFailRead (1490 of 1726) PASS: lldb-Unit :: Utility/./UtilityTests/StringExtractorTest.InitMisc (1491 of 1726) PASS: lldb-Unit :: Utility/./UtilityTests/ArgsTest.StringListConstructor (1492 of 1726) PASS: lldb-Unit :: UnwindAssembly/x86/./UnwindAssemblyx86Tests/Testx86AssemblyInspectionEngine.TestStackRealign32BitDisp_x86_64 (1493 of 1726) PASS: lldb-Unit :: Language/Highlighting/./HighlighterTests/HighlighterTest.ClangCursorPosEndOfLine (1494 of 1726) PASS: lldb-Unit :: Utility/./UtilityTests/ProcessInstanceInfo.DumpTable (1495 of 1726) PASS: lldb-Unit :: Utility/./UtilityTests/UserIDResolver.GetUserName (1496 of 1726) PASS: LLDB :: Modules/ELF/compressed-sections.yaml (1497 of 1726) PASS: lldb-Suite :: python_api/watchpoint/TestWatchpointIter.py (1498 of 1726) PASS: lldb-Suite :: lang/cpp/enum_types/TestCPP11EnumTypes.py (1499 of 1726) PASS: lldb-Suite :: functionalities/breakpoint/scripted_bkpt/TestScriptedResolver.py (1500 of 1726) PASS: lldb-Unit :: Host/./HostTests/SocketTest.TCPGetConnectURI (1501 of 1726) PASS: lldb-Unit :: Utility/./UtilityTests/LogChannelTest.List (1502 of 1726) PASS: lldb-Suite :: commands/watchpoints/watchpoint_commands/command/TestWatchpointCommandLLDB.py (1503 of 1726) PASS: lldb-Suite :: lang/cpp/std-function-step-into-callable/TestStdFunctionStepIntoCallable.py (1504 of 1726) PASS: lldb-Suite :: functionalities/process_save_core/TestProcessSaveCore.py (1505 of 1726) PASS: lldb-Suite :: functionalities/breakpoint/dummy_target_breakpoints/TestBreakpointsWithNoTargets.py (1506 of 1726) PASS: lldb-Suite :: benchmarks/libcxxmap/TestBenchmarkLibcxxMap.py (1507 of 1726) PASS: lldb-Suite :: commands/frame/diagnose/local-variable/TestLocalVariable.py (1508 of 1726) PASS: lldb-Suite :: lang/cpp/printf/TestPrintf.py (1509 of 1726) PASS: lldb-Suite :: commands/frame/var-scope/TestFrameVariableScope.py (1510 of 1726) PASS: lldb-Suite :: functionalities/thread/exit_during_break/TestExitDuringBreak.py (1511 of 1726) PASS: lldb-Suite :: commands/frame/recognizer/TestFrameRecognizer.py (1512 of 1726) PASS: lldb-Unit :: Utility/./UtilityTests/RangeTest.Equal (1513 of 1726) PASS: lldb-Unit :: ScriptInterpreter/Python/./ScriptInterpreterPythonTests/PythonDataObjectsTest.TestPythonListToStructuredList (1514 of 1726) PASS: lldb-Suite :: lang/objc/real-definition/TestRealDefinition.py (1515 of 1726) PASS: lldb-Suite :: commands/command/nested_alias/TestNestedAlias.py (1516 of 1726) PASS: lldb-Unit :: Utility/./UtilityTests/StreamTest.ShiftOperatorInts (1517 of 1726) PASS: lldb-Suite :: functionalities/stats_api/TestStatisticsAPI.py (1518 of 1726) PASS: LLDB :: Driver/LocalLLDBInit.test (1519 of 1726) PASS: lldb-Suite :: functionalities/thread/concurrent_events/TestConcurrentTwoBreakpointsOneDelaySignal.py (1520 of 1726) PASS: lldb-Unit :: Expression/./ExpressionTests/DiagnosticManagerTest.GetStringNoDiags (1521 of 1726) PASS: lldb-Unit :: Process/minidump/./LLDBMinidumpTests/MinidumpParserTest.GetMemoryRegionInfoLinuxMaps (1522 of 1726) PASS: lldb-Suite :: commands/platform/basic/TestPlatformCommand.py (1523 of 1726) PASS: lldb-Unit :: Utility/./UtilityTests/BinaryStreamTest.PutSLEB128TwoBytes (1524 of 1726) PASS: lldb-Unit :: Expression/./ExpressionTests/DiagnosticManagerTest.AppendMessageAttachToLastDiag (1525 of 1726) PASS: lldb-Suite :: functionalities/breakpoint/source_regexp/TestSourceRegexBreakpoints.py (1526 of 1726) PASS: lldb-Suite :: functionalities/step-avoids-no-debug/TestStepNoDebug.py (1527 of 1726) PASS: lldb-Suite :: lang/cpp/this/TestCPPThis.py (1528 of 1726) PASS: lldb-Unit :: Utility/./UtilityTests/FileSpecTest.RemoveLastPathComponent (1529 of 1726) PASS: lldb-Suite :: functionalities/breakpoint/consecutive_breakpoints/TestConsecutiveBreakpoints.py (1530 of 1726) PASS: lldb-Suite :: tools/lldb-vscode/step/TestVSCode_step.py (1531 of 1726) PASS: lldb-Suite :: functionalities/breakpoint/cpp_exception/TestCPPExceptionBreakpoint.py (1532 of 1726) PASS: LLDB :: Breakpoint/single-file-split-dwarf.test (1533 of 1726) PASS: lldb-Unit :: UnwindAssembly/x86/./UnwindAssemblyx86Tests/Testx86AssemblyInspectionEngine.Test64bitFramelessSmallStackFrame (1534 of 1726) PASS: lldb-Unit :: Host/./HostTests/MainLoopTest.TerminatesImmediately (1535 of 1726) PASS: lldb-Suite :: lang/c/register_variables/TestRegisterVariables.py (1536 of 1726) PASS: LLDB :: Modules/ELF/base-address.yaml (1537 of 1726) PASS: lldb-Suite :: commands/target/basic/TestTargetCommand.py (1538 of 1726) PASS: lldb-Unit :: debugserver/./debugserverTests/RNBSocket.AnyListen (1539 of 1726) PASS: lldb-Unit :: Utility/./UtilityTests/StringExtractorTest.GetNameColonValueContainsColon (1540 of 1726) PASS: lldb-Unit :: Utility/./UtilityTests/VMRange.Comparison (1541 of 1726) PASS: LLDB :: Modules/ELF/basic-info.yaml (1542 of 1726) PASS: lldb-Suite :: functionalities/tail_call_frames/disambiguate_tail_call_seq/TestDisambiguateTailCallSeq.py (1543 of 1726) PASS: lldb-Unit :: Utility/./UtilityTests/NameMatchesTest.Ignore (1544 of 1726) PASS: LLDB :: Modules/ELF/section-addresses.yaml (1545 of 1726) PASS: lldb-Unit :: Symbol/./SymbolTests/TestClangASTContext.TestConvertAccessTypeToAccessSpecifier (1546 of 1726) PASS: lldb-Unit :: UnwindAssembly/x86/./UnwindAssemblyx86Tests/Testx86AssemblyInspectionEngine.TestDisassemblyMidFunctionEpilogues (1547 of 1726) PASS: LLDB :: SymbolFile/Breakpad/unwind-via-stack-win.test (1548 of 1726) PASS: lldb-Suite :: functionalities/return-value/TestReturnValue.py (1549 of 1726) PASS: lldb-Suite :: commands/expression/issue_11588/Test11588.py (1550 of 1726) PASS: LLDB :: SymbolFile/DWARF/debug-types-missing-signature.test (1551 of 1726) PASS: lldb-Suite :: tools/lldb-server/TestGdbRemoteThreadsInStopReply.py (1552 of 1726) PASS: lldb-Suite :: tools/lldb-vscode/variables/TestVSCode_variables.py (1553 of 1726) PASS: lldb-Suite :: functionalities/unwind/standard/TestStandardUnwind.py (1554 of 1726) PASS: lldb-Unit :: Utility/./UtilityTests/VASprintfTest.EncodingError (1555 of 1726) PASS: lldb-Unit :: SymbolFile/NativePDB/./SymbolFileNativePDBTests/PDBFPOProgramToDWARFExpressionTests.UnsupportedRASearch (1556 of 1726) PASS: lldb-Suite :: lang/cpp/class_types/TestClassTypes.py (1557 of 1726) PASS: lldb-Suite :: functionalities/data-formatter/data-formatter-stl/libcxx/iterator/TestDataFormatterLibccIterator.py (1558 of 1726) PASS: lldb-Suite :: driver/batch_mode/TestBatchMode.py (1559 of 1726) PASS: lldb-Unit :: Host/./HostTests/NativeProcessProtocolTest.SetBreakpoint (1560 of 1726) PASS: lldb-Unit :: Utility/./UtilityTests/AnsiTerminal.Incomplete (1561 of 1726) PASS: lldb-Suite :: types/TestFloatTypesExpr.py (1562 of 1726) PASS: lldb-Suite :: commands/expression/expr-in-syscall/TestExpressionInSyscall.py (1563 of 1726) PASS: lldb-Suite :: benchmarks/libcxxlist/TestBenchmarkLibcxxList.py (1564 of 1726) UNSUPPORTED: LLDB :: SymbolFile/PDB/enums-layout.test (1565 of 1726) PASS: lldb-Unit :: Interpreter/./InterpreterTests/CompletionTest.DirCompletionUsername (1566 of 1726) PASS: lldb-Suite :: macosx/find-dsym/deep-bundle/TestDeepBundle.py (1567 of 1726) PASS: lldb-Unit :: Utility/./UtilityTests/RangeTest.ContainsEndInclusiveInvalid (1568 of 1726) PASS: lldb-Unit :: Expression/./ExpressionTests/DiagnosticManagerTest.GetStringSeverityLabels (1569 of 1726) PASS: lldb-Suite :: commands/expression/two-files/TestObjCTypeQueryFromOtherCompileUnit.py (1570 of 1726) PASS: lldb-Suite :: api/log/TestAPILog.py (1571 of 1726) PASS: lldb-Unit :: Utility/./UtilityTests/ScalarTest.Division (1572 of 1726) PASS: lldb-Unit :: Symbol/./SymbolTests/TestClangASTContext.TemplateArguments (1573 of 1726) PASS: lldb-Suite :: functionalities/breakpoint/auto_continue/TestBreakpointAutoContinue.py (1574 of 1726) PASS: lldb-Unit :: Utility/./UtilityTests/ConstStringTest.CompareConstString (1575 of 1726) PASS: lldb-Unit :: Utility/./UtilityTests/StringExtractorTest.GetHexU8_InvalidHex_NoEof (1576 of 1726) PASS: lldb-Unit :: Host/./HostTests/SocketTest.TCPGetAddress (1577 of 1726) UNSUPPORTED: LLDB :: Register/x86-zmm-write.test (1578 of 1726) PASS: lldb-Unit :: Utility/./UtilityTests/ProcessInstanceInfo.Dump (1579 of 1726) PASS: LLDB :: Driver/TestRepl.test (1580 of 1726) PASS: lldb-Suite :: commands/quit/TestQuit.py (1581 of 1726) PASS: lldb-Unit :: Language/Highlighting/./HighlighterTests/HighlighterTest.ClangCursorPosAfterOtherToken (1582 of 1726) PASS: lldb-Unit :: Utility/./UtilityTests/StreamTest.PutHex16ByteOrderLittle (1583 of 1726) PASS: lldb-Suite :: commands/expression/cast_int_to_anonymous_enum/TestCastIntToAnonymousEnum.py (1584 of 1726) PASS: lldb-Suite :: commands/statistics/basic/TestStats.py (1585 of 1726) PASS: lldb-Suite :: lang/objc/rdar-10967107/TestRdar10967107.py (1586 of 1726) PASS: lldb-Unit :: Utility/./UtilityTests/ArgsTest.TestOverwriteArgs (1587 of 1726) PASS: lldb-Suite :: functionalities/data-formatter/data-formatter-stl/libcxx/string/TestDataFormatterLibcxxString.py (1588 of 1726) PASS: lldb-Suite :: functionalities/recursion/TestValueObjectRecursion.py (1589 of 1726) PASS: lldb-Unit :: Utility/./UtilityTests/BinaryStreamTest.PutULEB128MaxValue (1590 of 1726) PASS: lldb-Unit :: Utility/./UtilityTests/UserIDResolver.GetGroupName (1591 of 1726) PASS: lldb-Suite :: python_api/value_var_update/TestValueVarUpdate.py (1592 of 1726) PASS: lldb-Suite :: sample_test/TestSampleInlineTest.py (1593 of 1726) PASS: lldb-Suite :: macosx/safe-to-func-call/TestSafeFuncCalls.py (1594 of 1726) PASS: lldb-Suite :: functionalities/pre_run_dylibs/TestPreRunDylibs.py (1595 of 1726) PASS: lldb-Suite :: functionalities/data-formatter/refpointer-recursion/TestDataFormatterRefPtrRecursion.py (1596 of 1726) PASS: lldb-Unit :: ScriptInterpreter/Python/./ScriptInterpreterPythonTests/PythonDataObjectsTest.TestPythonListValueEquality (1597 of 1726) PASS: lldb-Suite :: functionalities/darwin_log/filter/exact_match/category/TestDarwinLogFilterMatchCategory.py (1598 of 1726) PASS: lldb-Unit :: Utility/./UtilityTests/RangeTest.NotEqualInvalid (1599 of 1726) PASS: lldb-Suite :: lang/cpp/char1632_t/TestChar1632T.py (1600 of 1726) PASS: lldb-Suite :: functionalities/data-formatter/data-formatter-stl/libcxx/list/loop/TestDataFormatterLibcxxListLoop.py (1601 of 1726) PASS: LLDB :: SymbolFile/DWARF/find-method.cpp (1602 of 1726) PASS: lldb-Suite :: functionalities/data-formatter/data-formatter-stl/libcxx/unordered/TestDataFormatterUnordered.py (1603 of 1726) PASS: lldb-Suite :: functionalities/history/TestHistoryRecall.py (1604 of 1726) PASS: LLDB :: Settings/TestFrameFormatNoColor.test (1605 of 1726) PASS: lldb-Unit :: Language/CPlusPlus/./LanguageCPlusPlusTests/CPlusPlusLanguage.FindAlternateFunctionManglings (1606 of 1726) PASS: lldb-Suite :: lang/c/set_values/TestSetValues.py (1607 of 1726) UNSUPPORTED: LLDB :: Unwind/eh-frame-small-fde.test (1608 of 1726) PASS: LLDB :: Quit/TestQuitExitCode0.test (1609 of 1726) PASS: lldb-Suite :: lang/objc/objc-foundation-dictionary-empty/TestNSDictionary0.py (1610 of 1726) PASS: LLDB :: Driver/TestFile.test (1611 of 1726) PASS: LLDB :: SymbolFile/DWARF/compilercontext.ll (1612 of 1726) PASS: LLDB :: SymbolFile/NativePDB/globals-bss.cpp (1613 of 1726) PASS: lldb-Suite :: python_api/watchpoint/TestSetWatchpoint.py (1614 of 1726) PASS: lldb-Unit :: Utility/./UtilityTests/ArgsTest.TestArgv (1615 of 1726) PASS: lldb-Unit :: Utility/./UtilityTests/StructuredDataTest.StringDump (1616 of 1726) PASS: lldb-Unit :: Process/minidump/./LLDBMinidumpTests/RegisterContextMinidump.ConvertMinidumpContext_x86_64 (1617 of 1726) PASS: lldb-Unit :: UnwindAssembly/x86/./UnwindAssemblyx86Tests/Testx86AssemblyInspectionEngine.TestPushECX (1618 of 1726) PASS: lldb-Unit :: Language/Highlighting/./HighlighterTests/HighlighterTest.ClangStringLiterals (1619 of 1726) PASS: lldb-Unit :: Utility/./UtilityTests/NameMatchesTest.EndsWith (1620 of 1726) PASS: lldb-Unit :: Utility/./UtilityTests/RegularExpression.CopyAssignment (1621 of 1726) PASS: lldb-Suite :: commands/disassemble/basic/TestFrameDisassemble.py (1622 of 1726) PASS: lldb-Unit :: ObjectFile/Breakpad/./ObjectFileBreakpadTests/PublicRecord.parse (1623 of 1726) PASS: lldb-Unit :: Process/minidump/./LLDBMinidumpTests/MinidumpParserTest.GetThreadContext_x86_64 (1624 of 1726) PASS: lldb-Unit :: SymbolFile/NativePDB/./SymbolFileNativePDBTests/PDBFPOProgramToDWARFExpressionTests.UnresolvedDependentCyclicRegisterAssignmentReference (1625 of 1726) PASS: lldb-Suite :: lang/cpp/namespace/TestNamespaceLookup.py (1626 of 1726) PASS: lldb-Suite :: lang/objc/rdar-12408181/TestRdar12408181.py (1627 of 1726) PASS: lldb-Suite :: python_api/value/linked_list/TestValueAPILinkedList.py (1628 of 1726) PASS: lldb-Suite :: commands/apropos/basic/TestApropos.py (1629 of 1726) PASS: lldb-Suite :: lang/objc/objc-dynamic-value/TestObjCDynamicValue.py (1630 of 1726) PASS: lldb-Suite :: python_api/value/empty_class/TestValueAPIEmptyClass.py (1631 of 1726) PASS: LLDB :: Commands/command-regex-unalias.test (1632 of 1726) PASS: lldb-Suite :: lang/objc/objc-property/TestObjCProperty.py (1633 of 1726) PASS: lldb-Suite :: functionalities/thread/step_until/TestStepUntil.py (1634 of 1726) PASS: lldb-Unit :: Host/./HostTests/NativeProcessProtocolTest.SetBreakpointFailWrite (1635 of 1726) PASS: lldb-Suite :: lang/cpp/namespace/TestNamespace.py (1636 of 1726) PASS: lldb-Unit :: Utility/./UtilityTests/OptionsWithRawTest.ArgsButNoLeadingDash (1637 of 1726) PASS: lldb-Suite :: lang/objcxx/cxx-bridged-po/TestObjCXXBridgedPO.py (1638 of 1726) PASS: lldb-Unit :: Utility/./UtilityTests/StringListTest.InsertStringAtIndexMove (1639 of 1726) PASS: lldb-Unit :: Utility/./UtilityTests/StringLexerTest.Peek (1640 of 1726) PASS: lldb-Unit :: Utility/./UtilityTests/RecordReplayTest.InstrumentedBarPtr (1641 of 1726) PASS: LLDB :: Commands/command-source.test (1642 of 1726) PASS: lldb-Suite :: python_api/lldbutil/iter/TestRegistersIterator.py (1643 of 1726) PASS: lldb-Unit :: Utility/./UtilityTests/StringListTest.GetMaxStringLengthDecreasingSize (1644 of 1726) PASS: lldb-Suite :: functionalities/postmortem/elf-core/TestLinuxCore.py (1645 of 1726) PASS: lldb-Unit :: Utility/./UtilityTests/CompletionRequest.DuplicateFiltering (1646 of 1726) UNSUPPORTED: LLDB :: SymbolFile/NativePDB/ast-functions-msvc.cpp (1647 of 1726) PASS: lldb-Suite :: lang/c/modules/TestCModules.py (1648 of 1726) PASS: lldb-Suite :: commands/expression/import-std-module/weak_ptr/TestWeakPtr.py (1649 of 1726) PASS: lldb-Suite :: lang/c/conflicting-symbol/TestConflictingSymbol.py (1650 of 1726) PASS: lldb-Suite :: functionalities/tail_call_frames/ambiguous_tail_call_seq1/TestAmbiguousTailCallSeq1.py (1651 of 1726) PASS: LLDB :: SymbolFile/NativePDB/source-list.cpp (1652 of 1726) PASS: LLDB :: SymbolFile/NativePDB/ast-types.cpp (1653 of 1726) PASS: lldb-Unit :: Utility/./UtilityTests/GeneratorTest.GetOrCreate (1654 of 1726) PASS: lldb-Unit :: Utility/./UtilityTests/ArgsTest.DoubleQuotedItem (1655 of 1726) PASS: lldb-Suite :: functionalities/thread/concurrent_events/TestConcurrentTwoBreakpointThreads.py (1656 of 1726) PASS: lldb-Unit :: Core/./LLDBCoreTests/RichManglingContextTest.SwitchProvider (1657 of 1726) PASS: lldb-Suite :: functionalities/breakpoint/breakpoint_ids/TestBreakpointIDs.py (1658 of 1726) PASS: lldb-Suite :: functionalities/data-formatter/data-formatter-script/TestDataFormatterScript.py (1659 of 1726) PASS: lldb-Suite :: functionalities/thread/concurrent_events/TestConcurrentManyBreakpoints.py (1660 of 1726) PASS: lldb-Suite :: tools/lldb-server/TestGdbRemote_vCont.py (1661 of 1726) PASS: lldb-Suite :: commands/command/history/TestCommandHistory.py (1662 of 1726) PASS: lldb-Unit :: Process/minidump/./LLDBMinidumpTests/MinidumpParserTest.GetPidWindows (1663 of 1726) PASS: lldb-Unit :: Utility/./UtilityTests/RangeDataVector.FindEntryThatContains_Overlap (1664 of 1726) PASS: lldb-Suite :: functionalities/inferior-crashing/recursive-inferior/TestRecursiveInferiorStep.py (1665 of 1726) PASS: LLDB :: Modules/ELF/netbsd-core-amd64.test (1666 of 1726) PASS: lldb-Unit :: UnwindAssembly/x86/./UnwindAssemblyx86Tests/Testx86AssemblyInspectionEngine.Test64bitFramelessBigStackFrame (1667 of 1726) PASS: lldb-Suite :: functionalities/data-formatter/data-formatter-disabling/TestDataFormatterDisabling.py (1668 of 1726) PASS: lldb-Suite :: functionalities/thread/backtrace_all/TestBacktraceAll.py (1669 of 1726) PASS: lldb-Suite :: functionalities/jitloader_gdb/TestJITLoaderGDB.py (1670 of 1726) PASS: lldb-Suite :: functionalities/tail_call_frames/thread_step_out_or_return/TestSteppingOutWithArtificialFrames.py (1671 of 1726) PASS: lldb-Suite :: functionalities/thread/concurrent_events/TestConcurrentManyWatchpoints.py (1672 of 1726) PASS: LLDB :: SymbolFile/Breakpad/line-table-missing-file.test (1673 of 1726) PASS: lldb-Unit :: Utility/./UtilityTests/RegularExpression.Match (1674 of 1726) PASS: lldb-Unit :: Utility/./UtilityTests/OptionsWithRawTest.MultiWordSuffix (1675 of 1726) PASS: lldb-Unit :: SymbolFile/NativePDB/./SymbolFileNativePDBTests/PDBFPOProgramToDWARFExpressionTests.MultipleDependentAssignments (1676 of 1726) PASS: lldb-Unit :: Utility/./UtilityTests/VASprintfTest.NoBufferResize (1677 of 1726) PASS: lldb-Unit :: Core/./LLDBCoreTests/StreamCallbackTest.Callback (1678 of 1726) PASS: lldb-Unit :: ScriptInterpreter/Python/./ScriptInterpreterPythonTests/PythonDataObjectsTest.TestPythonStringToStructuredString (1679 of 1726) PASS: lldb-Suite :: lang/cpp/operators/TestCppOperators.py (1680 of 1726) PASS: lldb-Suite :: lang/objc/objc-new-syntax/TestObjCNewSyntaxLiteral.py (1681 of 1726) PASS: lldb-Suite :: lang/cpp/const_this/TestConstThis.py (1682 of 1726) PASS: lldb-Unit :: Process/gdb-remote/./ProcessGdbRemoteTests/GDBRemoteCommunicationClientTest.TestPacketSpeedJSON (1683 of 1726) PASS: lldb-Suite :: functionalities/data-formatter/data-formatter-stl/libstdcpp/vbool/TestDataFormatterStdVBool.py (1684 of 1726) PASS: lldb-Unit :: Process/gdb-remote/./ProcessGdbRemoteTests/GDBRemoteCommunicationClientTest.WriteRegisterNoSuffix (1685 of 1726) PASS: lldb-Suite :: tools/lldb-server/inferior-crash/TestGdbRemoteSegFault.py (1686 of 1726) PASS: lldb-Suite :: commands/frame/var/TestFrameVar.py (1687 of 1726) PASS: lldb-Suite :: lang/objc/objc-new-syntax/TestObjCNewSyntaxDictionary.py (1688 of 1726) PASS: lldb-Unit :: Utility/./UtilityTests/StringExtractorTest.GetHexBytes_Partial (1689 of 1726) PASS: lldb-Suite :: lang/cpp/virtual-overload/TestVirtualOverload.py (1690 of 1726) PASS: lldb-Suite :: functionalities/thread/thread_exit/TestThreadExit.py (1691 of 1726) PASS: lldb-Unit :: ScriptInterpreter/Python/./ScriptInterpreterPythonTests/PythonDataObjectsTest.TestPythonDictionaryValueEquality (1692 of 1726) PASS: lldb-Suite :: functionalities/unwind/noreturn/TestNoreturnUnwind.py (1693 of 1726) PASS: lldb-Suite :: lang/objc/modules-cache/TestClangModulesCache.py (1694 of 1726) PASS: lldb-Unit :: Core/./LLDBCoreTests/MangledTest.NameIndexes_FindFunctionSymbols (1695 of 1726) PASS: lldb-Unit :: UnwindAssembly/x86/./UnwindAssemblyx86Tests/Testx86AssemblyInspectionEngine.TestPush0 (1696 of 1726) PASS: lldb-Unit :: Host/./HostTests/TaskPoolTest.RunTasks (1697 of 1726) PASS: lldb-Suite :: functionalities/data-formatter/setvaluefromcstring/TestSetValueFromCString.py (1698 of 1726) PASS: lldb-Unit :: ScriptInterpreter/Python/./ScriptInterpreterPythonTests/PythonDataObjectsTest.TestGlobalNameResolutionNoDot (1699 of 1726) PASS: lldb-Unit :: Utility/./UtilityTests/StringListTest.GetMaxStringLengthMixed (1700 of 1726) PASS: lldb-Unit :: Utility/./UtilityTests/StreamTest.PutChar (1701 of 1726) PASS: lldb-Suite :: commands/expression/macros/TestMacros.py (1702 of 1726) PASS: lldb-Unit :: Symbol/./SymbolTests/PostfixExpression.ParseFPOProgram (1703 of 1726) PASS: lldb-Unit :: Expression/./ExpressionTests/DiagnosticManagerTest.GetStringPreserveOrder (1704 of 1726) PASS: lldb-Suite :: functionalities/data-formatter/type_summary_list_arg/TestTypeSummaryListArg.py (1705 of 1726) PASS: lldb-Unit :: Utility/./UtilityTests/BinaryStreamTest.PutULEB128ThreeBytes (1706 of 1726) PASS: LLDB :: Modules/PECOFF/export-dllfunc.yaml (1707 of 1726) PASS: lldb-Unit :: UnwindAssembly/x86/./UnwindAssemblyx86Tests/Testx86AssemblyInspectionEngine.TestAddESP (1708 of 1726) PASS: lldb-Unit :: Utility/./UtilityTests/VMRange.CollectionContains (1709 of 1726) PASS: lldb-Suite :: functionalities/data-formatter/data-formatter-objc/TestDataFormatterObjCNSURL.py (1710 of 1726) PASS: lldb-Suite :: commands/watchpoints/watchpoint_commands/condition/TestWatchpointConditionCmd.py (1711 of 1726) PASS: lldb-Suite :: lang/objc/objc-ivar-stripped/TestObjCIvarStripped.py (1712 of 1726) PASS: lldb-Suite :: python_api/sbvalue_persist/TestSBValuePersist.py (1713 of 1726) PASS: lldb-Suite :: functionalities/paths/TestPaths.py (1714 of 1726) PASS: lldb-Suite :: commands/disassemble/basic/TestDisassembleBreakpoint.py (1715 of 1726) PASS: lldb-Suite :: lang/objc/objc-checker/TestObjCCheckers.py (1716 of 1726) PASS: LLDB :: SymbolFile/DWARF/debug-types-basic.test (1717 of 1726) PASS: lldb-Suite :: functionalities/tail_call_frames/ambiguous_tail_call_seq2/TestAmbiguousTailCallSeq2.py (1718 of 1726) PASS: lldb-Suite :: lang/objc/foundation/TestObjCMethods2.py (1719 of 1726) PASS: lldb-Suite :: lang/cpp/global_variables/TestCPPGlobalVariables.py (1720 of 1726) PASS: lldb-Suite :: lang/objc/single-entry-dictionary/TestObjCSingleEntryDictionary.py (1721 of 1726) PASS: lldb-Suite :: lang/objc/objc-stepping/TestObjCStepping.py (1722 of 1726) PASS: lldb-Suite :: functionalities/data-formatter/data-formatter-stl/libcxx/vector/TestDataFormatterLibcxxVector.py (1723 of 1726) PASS: lldb-Suite :: lang/objc/foundation/TestFoundationDisassembly.py (1724 of 1726) PASS: lldb-Suite :: lang/objc/hidden-ivars/TestHiddenIvars.py (1725 of 1726) PASS: lldb-Suite :: types/TestIntegerTypesExpr.py (1726 of 1726) Testing Time: 1689.61s ******************** Failing Tests (5): lldb-Suite :: functionalities/gdb_remote_client/TestGDBRemoteLoad.py lldb-Suite :: functionalities/gdb_remote_client/TestGDBRemoteClient.py lldb-Suite :: commands/gui/basic/TestGuiBasic.py lldb-Suite :: commands/expression/multiline-completion/TestMultilineCompletion.py lldb-Suite :: iohandler/completion/TestIOHandlerCompletion.py

Hide Details

Hide Details

Slowest Tests: -------------------------------------------------------------------------- 126.33s: lldb-Suite :: api/check_public_api_headers/TestPublicAPIHeaders.py 127.03s: lldb-Suite :: lang/objc/objc-new-syntax/TestObjCNewSyntaxDictionary.py 134.85s: lldb-Suite :: functionalities/inferior-crashing/TestInferiorCrashingStep.py 135.75s: lldb-Suite :: commands/target/basic/TestTargetCommand.py 138.11s: lldb-Suite :: lang/objc/objc-new-syntax/TestObjCNewSyntaxArray.py 142.47s: lldb-Suite :: functionalities/recursion/TestValueObjectRecursion.py 146.45s: lldb-Suite :: lang/objc/hidden-ivars/TestHiddenIvars.py 164.04s: lldb-Suite :: functionalities/load_unload/TestLoadUnload.py 164.76s: lldb-Suite :: lang/objc/exceptions/TestObjCExceptions.py 174.74s: lldb-Suite :: lang/objc/objc-new-syntax/TestObjCNewSyntaxLiteral.py 176.22s: lldb-Suite :: lang/cpp/namespace/TestNamespaceLookup.py 178.02s: lldb-Suite :: functionalities/return-value/TestReturnValue.py 199.49s: lldb-Suite :: functionalities/gdb_remote_client/TestGDBRemoteLoad.py 201.93s: lldb-Suite :: tools/lldb-server/TestLldbGdbServer.py 203.41s: lldb-Suite :: lang/objc/foundation/TestObjCMethods.py 211.60s: lldb-Suite :: lang/cpp/enum_types/TestCPP11EnumTypes.py 228.39s: lldb-Suite :: api/multithreaded/TestMultithreaded.py 274.12s: lldb-Suite :: types/TestIntegerTypesExpr.py 384.83s: lldb-Suite :: types/TestIntegerTypes.py 669.46s: lldb-Suite :: lang/objc/foundation/TestFoundationDisassembly.py

Hide Details

Tests Times: -------------------------------------------------------------------------- [ Range ] :: [ Percentage ] :: [ Count ] -------------------------------------------------------------------------- [ 0s, 50s) :: [************************************* ] :: [1602/1726] [ 50s,100s) :: [** ] :: [ 96/1726] [100s,150s) :: [ ] :: [ 14/1726] [150s,200s) :: [ ] :: [ 6/1726] [200s,250s) :: [ ] :: [ 5/1726] [250s,300s) :: [ ] :: [ 1/1726] [300s,350s) :: [ ] :: [ 0/1726] [350s,400s) :: [ ] :: [ 0/1726] [400s,450s) :: [ ] :: [ 1/1726] [450s,500s) :: [ ] :: [ 0/1726] [500s,550s) :: [ ] :: [ 0/1726] [550s,600s) :: [ ] :: [ 0/1726] [600s,650s) :: [ ] :: [ 0/1726] [650s,700s) :: [ ] :: [ 1/1726] Expected Passes : 1671 Expected Failures : 6 Unsupported Tests : 44 Unexpected Failures: 5 FAILED: tools/lldb/lit/CMakeFiles/check-lldb-lit cd /Users/buildslave/jenkins/workspace/lldb-cmake-sanitized/lldb-build/tools/lldb/lit && /usr/bin/python /Users/buildslave/jenkins/workspace/lldb-cmake-sanitized/lldb-build/./bin/llvm-lit -v --time-tests --shuffle --xunit-xml-output=/Users/buildslave/jenkins/workspace/lldb-cmake-sanitized/test/results.xml -v --timeout 1200 /Users/buildslave/jenkins/workspace/lldb-cmake-sanitized/lldb-build/tools/lldb/lit ninja: build stopped: subcommand failed. Command failed Command: ['/usr/bin/env', 'TERM=vt100', '/usr/local/bin/ninja', '-v', 'check-lldb'] [Pipeline] } [Pipeline] // timeout [Pipeline] } [Pipeline] // stage [Pipeline] stage [Pipeline] { (Declarative: Post Actions) [Pipeline] scanForIssues No credentials specified [Clang (LLVM based)] Sleeping for 5 seconds due to JENKINS-32191... [Clang (LLVM based)] Parsing console log (workspace: '/Users/buildslave/jenkins/workspace/lldb-cmake-sanitized') [Pipeline] junit Recording test results [Pipeline] } [Pipeline] // stage [Pipeline] } [Pipeline] // withEnv [Pipeline] } [Pipeline] // node [Pipeline] End of Pipeline [BFA] Scanning build for known causes... [BFA] Found failure cause(s): [BFA] Regression test failed from category Test [BFA] Ninja target failed from category Compile [BFA] Done. 1s ERROR: script returned exit code 1 Finished: FAILURE