FailedConsole Output

Skipping 500 KB.. Full Log
PASS: lldb-Suite :: sanity/TestModuleCacheSanity.py (358 of 1727)
PASS: LLDB :: Modules/MachO/lc_build_version_notools.yaml (359 of 1727)
PASS: lldb-Suite :: python_api/default-constructor/TestDefaultConstructorForAPIObjects.py (360 of 1727)
PASS: lldb-Suite :: commands/target/create-no-such-arch/TestNoSuchArch.py (361 of 1727)
PASS: lldb-Suite :: lang/objc/rdar-11355592/TestRdar11355592.py (362 of 1727)
PASS: lldb-Suite :: python_api/lldbutil/process/TestPrintStackTraces.py (363 of 1727)
PASS: lldb-Suite :: lang/objc/radar-9691614/TestObjCMethodReturningBOOL.py (364 of 1727)
PASS: LLDB :: Modules/ELF/section-types-edgecases.yaml (365 of 1727)
PASS: lldb-Unit :: UnwindAssembly/x86/./UnwindAssemblyx86Tests/Testx86AssemblyInspectionEngine.TestPushR13 (366 of 1727)
PASS: lldb-Unit :: Core/./LLDBCoreTests/RichManglingContextTest.Basic (367 of 1727)
PASS: lldb-Unit :: Language/Highlighting/./HighlighterTests/HighlighterTest.Colons (368 of 1727)
PASS: LLDB :: Modules/ELF/base-address.yaml (369 of 1727)
PASS: lldb-Suite :: functionalities/thread/concurrent_events/TestConcurrentBreakpointsDelayedBreakpointOneWatchpoint.py (370 of 1727)
PASS: lldb-Suite :: functionalities/data-formatter/data-formatter-globals/TestDataFormatterGlobals.py (371 of 1727)
PASS: lldb-Unit :: ScriptInterpreter/Python/./ScriptInterpreterPythonTests/PythonDataObjectsTest.TestModuleNameResolutionNoDot (372 of 1727)
PASS: lldb-Unit :: Process/gdb-remote/./ProcessGdbRemoteTests/GDBRemoteCommunicationClientTest.TestPacketSpeedJSON (373 of 1727)
PASS: LLDB :: Modules/ELF/section-addresses.yaml (374 of 1727)
PASS: lldb-Suite :: commands/expression/import-std-module/sysroot/TestStdModuleSysroot.py (375 of 1727)
PASS: lldb-Suite :: functionalities/breakpoint/breakpoint_by_line_and_column/TestBreakpointByLineAndColumn.py (376 of 1727)
PASS: lldb-Unit :: Symbol/./SymbolTests/TestClangASTContext.TestRemoveFastQualifiers (377 of 1727)
PASS: lldb-Unit :: Utility/./UtilityTests/AnsiTerminal.Empty (378 of 1727)
PASS: lldb-Suite :: tools/lldb-server/TestGdbRemoteThreadsInStopReply.py (379 of 1727)
PASS: lldb-Unit :: Utility/./UtilityTests/StringListTest.GetMaxStringLengthEmpty (380 of 1727)
PASS: lldb-Suite :: functionalities/inferior-crashing/recursive-inferior/TestRecursiveInferior.py (381 of 1727)
PASS: lldb-Suite :: functionalities/thread/create_after_attach/TestCreateAfterAttach.py (382 of 1727)
PASS: lldb-Unit :: Utility/./UtilityTests/StringListTest.ShiftStdString (383 of 1727)
UNSUPPORTED: LLDB :: Register/x86-gp-read.test (384 of 1727)
PASS: LLDB :: SymbolFile/DWARF/find-inline-method.s (385 of 1727)
PASS: lldb-Suite :: commands/expression/save_jit_objects/TestSaveJITObjects.py (386 of 1727)
PASS: lldb-Unit :: UnwindAssembly/x86/./UnwindAssemblyx86Tests/Testx86AssemblyInspectionEngine.TestMovRSPtoRBP (387 of 1727)
PASS: lldb-Suite :: commands/expression/scoped_enums/TestScopedEnumType.py (388 of 1727)
PASS: lldb-Suite :: python_api/sbstructureddata/TestStructuredDataAPI.py (389 of 1727)
PASS: lldb-Unit :: Utility/./UtilityTests/VMRange.Ordering (390 of 1727)
PASS: lldb-Unit :: Process/gdb-remote/./ProcessGdbRemoteTests/GDBRemoteCommunicationClientTest.SaveRestoreRegistersNoSuffix (391 of 1727)
PASS: LLDB :: Driver/LocalLLDBInit.test (392 of 1727)
PASS: LLDB :: Breakpoint/case-sensitive.test (393 of 1727)
PASS: lldb-Unit :: Utility/./UtilityTests/ArgsTest.GetQuotedCommandString (394 of 1727)
PASS: LLDB :: Watchpoint/SetErrorCases.test (395 of 1727)
PASS: LLDB :: SymbolFile/NativePDB/s_constant.cpp (396 of 1727)
PASS: lldb-Unit :: Process/minidump/./LLDBMinidumpTests/MinidumpParserTest.GetMiscInfoWindows (397 of 1727)
PASS: lldb-Unit :: ScriptInterpreter/Python/./ScriptInterpreterPythonTests/PythonDataObjectsTest.TestPythonInteger (398 of 1727)
PASS: lldb-Unit :: Language/CPlusPlus/./LanguageCPlusPlusTests/CPlusPlusLanguage.ExtractContextAndIdentifier (399 of 1727)
PASS: lldb-Suite :: commands/disassemble/basic/TestFrameDisassemble.py (400 of 1727)
PASS: lldb-Suite :: python_api/debugger/TestDebuggerAPI.py (401 of 1727)
PASS: lldb-Unit :: Process/gdb-remote/./ProcessGdbRemoteTests/GDBRemoteCommunicationServerTest.SendErrorResponse_ErrorNumber (402 of 1727)
PASS: lldb-Unit :: Core/./LLDBCoreTests/RichManglingContextTest.FromCxxMethodName (403 of 1727)
PASS: lldb-Unit :: Expression/./ExpressionTests/DiagnosticManagerTest.PutStringSeverities (404 of 1727)
PASS: lldb-Unit :: Utility/./UtilityTests/StreamTest.ShiftOperatorInts (405 of 1727)
PASS: lldb-Suite :: benchmarks/expression/TestExpressionCmd.py (406 of 1727)
PASS: lldb-Suite :: iohandler/completion/TestIOHandlerCompletion.py (407 of 1727)
PASS: lldb-Unit :: UnwindAssembly/x86/./UnwindAssemblyx86Tests/Testx86AssemblyInspectionEngine.TestPushExtended (408 of 1727)
PASS: lldb-Suite :: commands/process/attach/TestProcessAttach.py (409 of 1727)
PASS: lldb-Suite :: functionalities/data-formatter/dump_dynamic/TestDumpDynamic.py (410 of 1727)
PASS: lldb-Suite :: functionalities/inferior-changed/TestInferiorChanged.py (411 of 1727)
PASS: lldb-Unit :: Utility/./UtilityTests/DataExtractorTest.PeekData (412 of 1727)
PASS: lldb-Suite :: functionalities/data-formatter/ostypeformatting/TestFormattersOsType.py (413 of 1727)
PASS: lldb-Unit :: Utility/./UtilityTests/ArchSpecTest.OperatorBool (414 of 1727)
PASS: lldb-Suite :: tools/lldb-server/TestGdbRemoteExitCode.py (415 of 1727)
PASS: lldb-Suite :: commands/log/basic/TestLogging.py (416 of 1727)
PASS: lldb-Suite :: python_api/watchpoint/watchlocation/TestSetWatchlocation.py (417 of 1727)
PASS: lldb-Suite :: functionalities/target_var/TestTargetVar.py (418 of 1727)
PASS: lldb-Suite :: commands/frame/diagnose/dereference-this/TestDiagnoseDereferenceThis.py (419 of 1727)
PASS: lldb-Unit :: Utility/./UtilityTests/BinaryStreamTest.PutSLEB128ThreeBytes (420 of 1727)
PASS: lldb-Suite :: lang/objc/global_ptrs/TestGlobalObjects.py (421 of 1727)
PASS: LLDB :: Modules/Breakpad/sections-trailing-func.test (422 of 1727)
PASS: lldb-Unit :: Process/minidump/./LLDBMinidumpTests/MinidumpParserTest.GetPid (423 of 1727)
PASS: LLDB :: Driver/TestSingleQuote.test (424 of 1727)
PASS: lldb-Unit :: Core/./LLDBCoreTests/RichManglingContextTest.IPDRealloc (425 of 1727)
PASS: lldb-Suite :: commands/expression/invalid-args/TestInvalidArgsExpression.py (426 of 1727)
XFAIL: LLDB :: Register/x86-64-ymm-write.test (427 of 1727)
PASS: lldb-Unit :: Utility/./UtilityTests/StreamTest.PutSLEB128 (428 of 1727)
PASS: lldb-Unit :: Utility/./UtilityTests/UriParserTest.Empty (429 of 1727)
PASS: lldb-Unit :: Host/./HostTests/FileSystemTest.Readable (430 of 1727)
PASS: lldb-Unit :: Utility/./UtilityTests/ScalarTest.Division (431 of 1727)
PASS: LLDB :: Driver/TestCore.test (432 of 1727)
PASS: LLDB :: Modules/ELF/aarch64-relocations.yaml (433 of 1727)
PASS: lldb-Unit :: tools/lldb-server/tests/./LLDBServerTests/TestBase.DebugserverEnv (434 of 1727)
PASS: lldb-Suite :: lang/objc/objc-baseclass-sbtype/TestObjCBaseClassSBType.py (435 of 1727)
PASS: lldb-Suite :: commands/watchpoints/hello_watchlocation/TestWatchLocation.py (436 of 1727)
PASS: lldb-Suite :: python_api/sbvalue_persist/TestSBValuePersist.py (437 of 1727)
PASS: lldb-Unit :: Utility/./UtilityTests/JSONTest.Dictionary (438 of 1727)
PASS: lldb-Unit :: Expression/./ExpressionTests/DiagnosticManagerTest.AppendMessageNoDiag (439 of 1727)
PASS: lldb-Unit :: Utility/./UtilityTests/LogChannelEnabledTest.LogVerboseThread (440 of 1727)
PASS: lldb-Unit :: Language/Highlighting/./HighlighterTests/HighlighterTest.ClangCursorPosBeforeOtherToken (441 of 1727)
PASS: lldb-Unit :: SymbolFile/NativePDB/./SymbolFileNativePDBTests/PDBFPOProgramToDWARFExpressionTests.InvalidOpUnary (442 of 1727)
PASS: lldb-Suite :: functionalities/thread/concurrent_events/TestConcurrentBreakpointDelayBreakpointOneSignal.py (443 of 1727)
PASS: lldb-Unit :: Utility/./UtilityTests/ConstStringTest.format_provider (444 of 1727)
PASS: lldb-Suite :: functionalities/data-formatter/summary-string-onfail/Test-rdar-9974002.py (445 of 1727)
PASS: lldb-Unit :: ScriptInterpreter/Python/./ScriptInterpreterPythonTests/PythonDataObjectsTest.TestTypeNameResolutionNoDot (446 of 1727)
PASS: lldb-Unit :: ObjectFile/ELF/./ObjectFileELFTests/ObjectFileELFTest.GetModuleSpecifications_EarlySectionHeaders (447 of 1727)
PASS: lldb-Suite :: functionalities/float-display/TestFloatDisplay.py (448 of 1727)
UNSUPPORTED: LLDB :: SymbolFile/PDB/ast-restore.test (449 of 1727)
PASS: lldb-Suite :: commands/frame/language/TestGuessLanguage.py (450 of 1727)
PASS: lldb-Suite :: tools/lldb-server/inferior-crash/TestGdbRemoteAbort.py (451 of 1727)
PASS: lldb-Unit :: Utility/./UtilityTests/TimeoutTest.Format (452 of 1727)
PASS: lldb-Unit :: Utility/./UtilityTests/StatusTest.ErrorConstructor (453 of 1727)
PASS: lldb-Unit :: Utility/./UtilityTests/StringListTest.SplitIntoLines (454 of 1727)
PASS: lldb-Suite :: functionalities/postmortem/netbsd-core/TestNetBSDCore.py (455 of 1727)
PASS: lldb-Suite :: functionalities/archives/TestBSDArchives.py (456 of 1727)
PASS: lldb-Suite :: functionalities/breakpoint/debugbreak/TestDebugBreak.py (457 of 1727)
PASS: lldb-Suite :: lang/cpp/function-template-parameter-pack/TestFunctionTemplateParameterPack.py (458 of 1727)
PASS: lldb-Unit :: Utility/./UtilityTests/VMRange.CollectionContains (459 of 1727)
PASS: LLDB :: Modules/Breakpad/sections.test (460 of 1727)
PASS: LLDB :: Quit/TestQuitExitCodeNonInt.test (461 of 1727)
PASS: lldb-Unit :: Utility/./UtilityTests/StreamTest.PutNHex8 (462 of 1727)
PASS: lldb-Unit :: Utility/./UtilityTests/RecordReplayTest.InstrumentedFooSameThis (463 of 1727)
PASS: lldb-Suite :: commands/watchpoints/watchpoint_on_vectors/TestValueOfVectorVariable.py (464 of 1727)
PASS: lldb-Unit :: Language/Highlighting/./HighlighterTests/HighlighterTest.ClangIdentifiers (465 of 1727)
PASS: lldb-Unit :: Utility/./UtilityTests/BroadcasterTest.EventTypeHasListeners (466 of 1727)
PASS: LLDB :: Python/crashlog.test (467 of 1727)
PASS: lldb-Suite :: lang/cpp/trivial_abi/TestTrivialABI.py (468 of 1727)
PASS: lldb-Unit :: Host/./HostTests/TaskPoolTest.AddTask (469 of 1727)
PASS: lldb-Unit :: UnwindAssembly/x86/./UnwindAssemblyx86Tests/Testx86AssemblyInspectionEngine.Testi386IgnoredRegisters (470 of 1727)
PASS: lldb-Unit :: Target/./TargetTests/ExecutionContextTest.GetByteOrderProcess (471 of 1727)
PASS: lldb-Unit :: SymbolFile/NativePDB/./SymbolFileNativePDBTests/PDBFPOProgramToDWARFExpressionTests.InvalidOpBinary (472 of 1727)
PASS: lldb-Suite :: functionalities/thread/state/TestThreadStates.py (473 of 1727)
PASS: lldb-Unit :: Utility/./UtilityTests/GeneratorTest.GetOrCreate (474 of 1727)
UNSUPPORTED: LLDB :: SymbolFile/PDB/calling-conventions.test (475 of 1727)
PASS: lldb-Suite :: functionalities/thread/concurrent_events/TestConcurrentCrashWithBreak.py (476 of 1727)
PASS: lldb-Suite :: commands/expression/issue_11588/Test11588.py (477 of 1727)
PASS: LLDB :: SymbolFile/DWARF/debug-types-line-tables.s (478 of 1727)
PASS: lldb-Unit :: Process/gdb-remote/./ProcessGdbRemoteTests/GDBRemoteCommunicationClientTest.WriteRegisterNoSuffix (479 of 1727)
PASS: lldb-Suite :: lang/objc/rdar-12408181/TestRdar12408181.py (480 of 1727)
PASS: lldb-Suite :: commands/expression/persistent_ptr_update/TestPersistentPtrUpdate.py (481 of 1727)
PASS: lldb-Unit :: Utility/./UtilityTests/StreamTest.PutULEB128 (482 of 1727)
PASS: lldb-Unit :: Target/./TargetTests/ModuleCacheTest.GetAndPutUuidExists (483 of 1727)
PASS: lldb-Suite :: commands/gui/invalid-args/TestInvalidArgsGui.py (484 of 1727)
PASS: lldb-Suite :: functionalities/data-formatter/compactvectors/TestCompactVectors.py (485 of 1727)
PASS: lldb-Unit :: Process/gdb-remote/./ProcessGdbRemoteTests/GDBRemoteCommunicationClientTest.SendSignalsToIgnore (486 of 1727)
PASS: lldb-Unit :: Utility/./UtilityTests/StreamTest.PutHex16ByteOrderLittle (487 of 1727)
PASS: lldb-Unit :: Symbol/./SymbolTests/SymbolsTest.TerminateLocateExecutableSymbolFileForUnknownExecutableAndUnknownSymbolFile (488 of 1727)
PASS: lldb-Suite :: commands/expression/import-std-module/stack/TestStack.py (489 of 1727)
PASS: lldb-Unit :: Utility/./UtilityTests/StringExtractorTest.DecodeHexU8_Exact (490 of 1727)
PASS: lldb-Suite :: lang/mixed/TestMixedLanguages.py (491 of 1727)
PASS: lldb-Suite :: functionalities/darwin_log/filter/regex/category/TestDarwinLogFilterRegexCategory.py (492 of 1727)
PASS: lldb-Unit :: Utility/./UtilityTests/LogTest.LLDB_LOG_nullptr (493 of 1727)
PASS: lldb-Suite :: commands/expression/test/TestExprs2.py (494 of 1727)
PASS: lldb-Suite :: lang/c/enum_types/TestEnumTypes.py (495 of 1727)
PASS: LLDB :: SymbolFile/DWARF/dwarf5_locations.s (496 of 1727)
PASS: lldb-Unit :: Utility/./UtilityTests/StringListTest.SetSize (497 of 1727)
PASS: lldb-Suite :: tools/lldb-server/TestGdbRemoteModuleInfo.py (498 of 1727)
PASS: lldb-Unit :: Utility/./UtilityTests/OptionsWithRawTest.EmptyInput (499 of 1727)
PASS: lldb-Suite :: source-manager/TestSourceManager.py (500 of 1727)
PASS: LLDB :: SymbolFile/Breakpad/stack-cfi-parsing.test (501 of 1727)
PASS: lldb-Suite :: lang/objc/modules-inline-functions/TestModulesInlineFunctions.py (502 of 1727)
PASS: lldb-Unit :: Utility/./UtilityTests/LogTest.Unregister (503 of 1727)
PASS: lldb-Suite :: functionalities/data-formatter/nsarraysynth/TestNSArraySynthetic.py (504 of 1727)
PASS: LLDB :: SymbolFile/DWARF/childless-compile-unit.s (505 of 1727)
PASS: lldb-Unit :: Utility/./UtilityTests/ArgsTest.AppendArguments (506 of 1727)
PASS: lldb-Unit :: Process/minidump/./LLDBMinidumpTests/MinidumpParserTest.GetPidWindows (507 of 1727)
PASS: lldb-Suite :: python_api/value/change_values/TestChangeValueAPI.py (508 of 1727)
XFAIL: LLDB :: Register/x86-mm-xmm-write.test (509 of 1727)
PASS: lldb-Unit :: Host/./HostTests/SocketTest.DecodeHostAndPort (510 of 1727)
PASS: LLDB :: SymbolFile/DWARF/find-basic-type.cpp (511 of 1727)
PASS: lldb-Unit :: Utility/./UtilityTests/BinaryStreamTest.PutULEB128FiveBytes (512 of 1727)
PASS: lldb-Suite :: functionalities/data-formatter/data-formatter-stl/libcxx/multimap/TestDataFormatterLibccMultiMap.py (513 of 1727)
PASS: lldb-Unit :: SymbolFile/DWARF/./SymbolFileDWARFTests/DWARFASTParserClangTests.TestGetDIEForDeclContextReturnsOnlyMatchingEntries (514 of 1727)
PASS: lldb-Unit :: Utility/./UtilityTests/OptionsWithRawTest.EmptySuffix (515 of 1727)
PASS: lldb-Unit :: Utility/./UtilityTests/StreamTest.PutHex16ByteOrderBig (516 of 1727)
PASS: lldb-Suite :: lang/cpp/wchar_t/TestCxxWCharT.py (517 of 1727)
PASS: lldb-Suite :: functionalities/tsan/thread_leak/TestTsanThreadLeak.py (518 of 1727)
PASS: lldb-Unit :: Utility/./UtilityTests/StringListTest.Join (519 of 1727)
PASS: lldb-Unit :: Utility/./UtilityTests/ScalarTest.Scalar_512 (520 of 1727)
PASS: lldb-Unit :: Utility/./UtilityTests/StringListTest.LongestCommonPrefixDuplicateElement (521 of 1727)
PASS: lldb-Unit :: Utility/./UtilityTests/UUIDTest.SetFromStringRef (522 of 1727)
PASS: lldb-Unit :: Core/./LLDBCoreTests/MangledTest.ResultForValidName (523 of 1727)
PASS: lldb-Suite :: commands/expression/unicode-in-variable/TestUnicodeInVariable.py (524 of 1727)
PASS: lldb-Suite :: lang/objc/exceptions/TestObjCExceptions.py (525 of 1727)
PASS: LLDB :: Modules/MachO/lc_version_min.yaml (526 of 1727)
PASS: lldb-Unit :: UnwindAssembly/x86/./UnwindAssemblyx86Tests/Testx86AssemblyInspectionEngine.TestSubRSP (527 of 1727)
PASS: lldb-Suite :: commands/expression/no-deadlock/TestExprDoesntBlock.py (528 of 1727)
PASS: lldb-Suite :: functionalities/thread/multi_break/TestMultipleBreakpoints.py (529 of 1727)
PASS: lldb-Suite :: functionalities/data-formatter/data-formatter-enum-format/TestDataFormatterEnumFormat.py (530 of 1727)
PASS: lldb-Unit :: Utility/./UtilityTests/ArgsTest.TestTrailingBackslash (531 of 1727)
PASS: lldb-Unit :: Utility/./UtilityTests/ScalarTest.CastOperations (532 of 1727)
PASS: lldb-Unit :: Utility/./UtilityTests/ConstStringTest.CompareStringRef (533 of 1727)
PASS: lldb-Unit :: Utility/./UtilityTests/ArgsTest.TestSingleQuotedArgWithSpace (534 of 1727)
PASS: lldb-Suite :: functionalities/breakpoint/cpp/TestCPPBreakpointLocations.py (535 of 1727)
PASS: lldb-Suite :: commands/expression/options/TestExprOptions.py (536 of 1727)
PASS: lldb-Unit :: Utility/./UtilityTests/StringExtractorTest.DecodeHexU8_Extra (537 of 1727)
PASS: lldb-Unit :: Utility/./UtilityTests/StreamTeeTest.CopyConstructor (538 of 1727)
PASS: LLDB :: SymbolFile/DWARF/debug-names-compressed.cpp (539 of 1727)
PASS: lldb-Suite :: functionalities/return-value/TestReturnValue.py (540 of 1727)
PASS: lldb-Suite :: lang/cpp/static_members/TestCPPStaticMembers.py (541 of 1727)
PASS: lldb-Unit :: ObjectFile/Breakpad/./ObjectFileBreakpadTests/StackCFIRecord.parse (542 of 1727)
PASS: lldb-Unit :: Symbol/./SymbolTests/DWARFCallFrameInfoTest.Basic_eh (543 of 1727)
PASS: lldb-Suite :: arm/breakpoint-thumb-codesection/TestBreakpointThumbCodesection.py (544 of 1727)
PASS: LLDB :: SymbolFile/DWARF/debug_ranges-missing-section.s (545 of 1727)
PASS: lldb-Suite :: python_api/process/io/TestProcessIO.py (546 of 1727)
PASS: LLDB :: Breakpoint/debug_rnglist_basic.test (547 of 1727)
PASS: lldb-Unit :: Utility/./UtilityTests/StreamTeeTest.Flush (548 of 1727)
PASS: lldb-Suite :: tools/lldb-vscode/breakpoint/TestVSCode_setBreakpoints.py (549 of 1727)
PASS: lldb-Suite :: functionalities/thread/concurrent_events/TestConcurrentSignalBreak.py (550 of 1727)
UNSUPPORTED: LLDB :: Register/x86-zmm-read.test (551 of 1727)
PASS: lldb-Suite :: commands/expression/import-std-module/no-std-module/TestMissingStdModule.py (552 of 1727)
PASS: LLDB :: Modules/PECOFF/dep-modules.yaml (553 of 1727)
PASS: lldb-Unit :: Utility/./UtilityTests/StreamTest.ShiftOperatorPtr (554 of 1727)
PASS: lldb-Suite :: python_api/hello_world/TestHelloWorld.py (555 of 1727)
PASS: lldb-Suite :: tools/lldb-vscode/breakpoint/TestVSCode_setExceptionBreakpoints.py (556 of 1727)
PASS: lldb-Unit :: Utility/./UtilityTests/RangeTest.ContainsRange (557 of 1727)
PASS: lldb-Unit :: ObjectFile/Breakpad/./ObjectFileBreakpadTests/ModuleRecord.parse (558 of 1727)
PASS: LLDB :: Reproducer/Modules/TestModuleCXX.test (559 of 1727)
PASS: lldb-Unit :: Process/minidump/./LLDBMinidumpTests/MinidumpParserTest.GetMiscInfo_no_stream (560 of 1727)
PASS: LLDB :: SymbolFile/DWARF/dir-separator-windows.s (561 of 1727)
PASS: lldb-Suite :: commands/expression/top-level/TestTopLevelExprs.py (562 of 1727)
PASS: LLDB :: Breakpoint/jitbp_elf.test (563 of 1727)
PASS: lldb-Unit :: Interpreter/./InterpreterTests/OptionArgParserTest.toChar (564 of 1727)
PASS: lldb-Suite :: lang/objc/foundation/TestObjectDescriptionAPI.py (565 of 1727)
PASS: lldb-Unit :: Utility/./UtilityTests/StringExtractorTest.GetU64BigEndian (566 of 1727)
PASS: lldb-Suite :: functionalities/asan/TestReportData.py (567 of 1727)
PASS: lldb-Unit :: Utility/./UtilityTests/ArgsTest.TestQuotedTrailingBackslash (568 of 1727)
PASS: lldb-Suite :: lang/cpp/global_operators/TestCppGlobalOperators.py (569 of 1727)
PASS: lldb-Unit :: Utility/./UtilityTests/VMRange.IsValid (570 of 1727)
PASS: lldb-Suite :: functionalities/tail_call_frames/ambiguous_tail_call_seq1/TestAmbiguousTailCallSeq1.py (571 of 1727)
PASS: lldb-Suite :: python_api/findvalue_duplist/TestSBFrameFindValue.py (572 of 1727)
PASS: lldb-Unit :: Utility/./UtilityTests/StreamTest.PutCharNull (573 of 1727)
PASS: lldb-Unit :: Utility/./UtilityTests/NameMatchesTest.Ignore (574 of 1727)
PASS: lldb-Unit :: Utility/./UtilityTests/ConstStringTest.CompareConstString (575 of 1727)
PASS: lldb-Unit :: Symbol/./SymbolTests/TestClangASTContext.TestIsClangType (576 of 1727)
PASS: lldb-Unit :: Utility/./UtilityTests/StatusTest.Formatv (577 of 1727)
PASS: lldb-Unit :: Platform/./LLDBPlatformTests/PlatformDarwinTest.TestParseVersionBuildDir (578 of 1727)
PASS: LLDB :: Reproducer/TestFileRepro.test (579 of 1727)
PASS: lldb-Unit :: Utility/./UtilityTests/FileSpecTest.EqualDotsWindows (580 of 1727)
PASS: lldb-Suite :: commands/expression/import-std-module/weak_ptr/TestWeakPtr.py (581 of 1727)
PASS: lldb-Suite :: commands/help/TestHelp.py (582 of 1727)
PASS: lldb-Suite :: functionalities/breakpoint/require_hw_breakpoints/TestRequireHWBreakpoints.py (583 of 1727)
PASS: LLDB :: Modules/Breakpad/breakpad-identification.test (584 of 1727)
PASS: LLDB :: SymbolFile/Breakpad/line-table-discontinuous-file-ids.test (585 of 1727)
PASS: lldb-Unit :: Utility/./UtilityTests/StringExtractorTest.GetHexBytes_Underflow (586 of 1727)
PASS: lldb-Unit :: Utility/./UtilityTests/TimerTest.CategoryTimesStats (587 of 1727)
PASS: lldb-Unit :: Utility/./UtilityTests/StringLexerTest.HasAtLeast (588 of 1727)
PASS: LLDB :: SymbolFile/DWARF/find-basic-variable.cpp (589 of 1727)
XFAIL: LLDB :: Register/x86-mm-xmm-read.test (590 of 1727)
PASS: lldb-Suite :: functionalities/data-formatter/parray/TestPrintArray.py (591 of 1727)
PASS: lldb-Unit :: Host/./HostTests/ConnectionFileDescriptorTest.TCPGetURIv6 (592 of 1727)
PASS: lldb-Suite :: commands/frame/select/TestFrameSelect.py (593 of 1727)
PASS: lldb-Unit :: UnwindAssembly/x86/./UnwindAssemblyx86Tests/Testx86AssemblyInspectionEngine.TestPush0 (594 of 1727)
PASS: lldb-Unit :: Utility/./UtilityTests/UUIDTest.StringConverion (595 of 1727)
PASS: LLDB :: SymbolFile/DWARF/debug-types-signature-loop.s (596 of 1727)
PASS: lldb-Unit :: Process/gdb-remote/./ProcessGdbRemoteTests/GDBRemoteClientBaseTest.SendContinueAndWait (597 of 1727)
PASS: lldb-Suite :: functionalities/signal/TestSendSignal.py (598 of 1727)
PASS: lldb-Unit :: Language/Highlighting/./HighlighterTests/HighlighterTest.ClangCursorPosEndOfLine (599 of 1727)
UNSUPPORTED: LLDB :: Register/x86-ymm-write.test (600 of 1727)
PASS: lldb-Suite :: tools/lldb-vscode/launch/TestVSCode_launch.py (601 of 1727)
PASS: lldb-Suite :: functionalities/breakpoint/global_constructor/TestBreakpointInGlobalConstructor.py (602 of 1727)
PASS: LLDB :: Breakpoint/split-dwarf-5-addrbase.test (603 of 1727)
PASS: lldb-Suite :: functionalities/data-formatter/typedef_array/TestTypedefArray.py (604 of 1727)
PASS: lldb-Suite :: commands/watchpoints/watchpoint_commands/command/TestWatchpointCommandLLDB.py (605 of 1727)
PASS: lldb-Unit :: Host/./HostTests/SocketTest.TCPListen0GetPort (606 of 1727)
PASS: lldb-Unit :: Editline/./EditlineTests/EditlineTestFixture.EditlineReceivesMultiLineText (607 of 1727)
PASS: LLDB :: SymbolFile/DWARF/debug-types-address-ranges.s (608 of 1727)
PASS: lldb-Suite :: functionalities/breakpoint/hardware_breakpoints/hardware_breakpoint_on_multiple_threads/TestHWBreakMultiThread.py (609 of 1727)
PASS: lldb-Suite :: functionalities/thread/concurrent_events/TestConcurrentCrashWithWatchpoint.py (610 of 1727)
PASS: lldb-Unit :: Utility/./UtilityTests/NameMatchesTest.StartsWith (611 of 1727)
PASS: lldb-Unit :: Utility/./UtilityTests/RangeTest.LessThan (612 of 1727)
PASS: lldb-Suite :: functionalities/var_path/TestVarPath.py (613 of 1727)
PASS: lldb-Unit :: Process/minidump/./LLDBMinidumpTests/MinidumpParserTest.GetArchitectureWindows (614 of 1727)
PASS: lldb-Suite :: commands/disassemble/basic/TestDisassembleBreakpoint.py (615 of 1727)
PASS: lldb-Unit :: Utility/./UtilityTests/BinaryStreamTest.PutULEB128SevenBytes (616 of 1727)
PASS: LLDB :: Minidump/breakpad-symbols.test (617 of 1727)
PASS: lldb-Unit :: Utility/./UtilityTests/FileSpecTest.EqualSeparator (618 of 1727)
PASS: lldb-Unit :: Utility/./UtilityTests/StructuredDataTest.StringDump (619 of 1727)
PASS: lldb-Suite :: functionalities/thread/concurrent_events/TestConcurrentBreakpointOneDelayBreakpointThreads.py (620 of 1727)
PASS: lldb-Unit :: Utility/./UtilityTests/StreamTeeTest.DefaultConstructor (621 of 1727)
PASS: lldb-Suite :: commands/expression/import-std-module/vector-bool/TestBoolVector.py (622 of 1727)
PASS: lldb-Suite :: commands/expression/completion-crash1/TestCompletionCrash1.py (623 of 1727)
PASS: lldb-Suite :: commands/expression/import-std-module/list-basic/TestBasicList.py (624 of 1727)
PASS: lldb-Suite :: functionalities/thread/crash_during_step/TestCrashDuringStep.py (625 of 1727)
PASS: lldb-Suite :: functionalities/breakpoint/breakpoint_options/TestBreakpointOptions.py (626 of 1727)
PASS: lldb-Unit :: Utility/./UtilityTests/SerializationRountripTest.SerializeDeserializePodReferences (627 of 1727)
PASS: lldb-Unit :: UnwindAssembly/x86/./UnwindAssemblyx86Tests/Testx86AssemblyInspectionEngine.TestPushR15 (628 of 1727)
PASS: lldb-Suite :: python_api/watchpoint/condition/TestWatchpointConditionAPI.py (629 of 1727)
PASS: lldb-Unit :: Process/minidump/./LLDBMinidumpTests/MinidumpParserTest.GetLinuxProcStatus_no_stream (630 of 1727)
PASS: lldb-Unit :: Utility/./UtilityTests/CompletionRequest.Constructor (631 of 1727)
PASS: lldb-Suite :: lang/objc/objc-ivar-protocols/TestIvarProtocols.py (632 of 1727)
PASS: lldb-Suite :: commands/watchpoints/watchpoint_commands/condition/TestWatchpointConditionCmd.py (633 of 1727)
PASS: lldb-Suite :: functionalities/dynamic_value_child_count/TestDynamicValueChildCount.py (634 of 1727)
UNSUPPORTED: LLDB :: Register/x86-64-ymm16-read.test (635 of 1727)
PASS: LLDB :: Modules/MachO/subsections.yaml (636 of 1727)
PASS: lldb-Unit :: Target/./TargetTests/ModuleCacheTest.GetAndPut (637 of 1727)
UNSUPPORTED: LLDB :: SymbolFile/PDB/expressions.test (638 of 1727)
PASS: LLDB :: SymbolFile/DWARF/find-method-local-struct.cpp (639 of 1727)
PASS: lldb-Suite :: lang/c/array_types/TestArrayTypes.py (640 of 1727)
PASS: lldb-Suite :: driver/batch_mode/TestBatchMode.py (641 of 1727)
PASS: lldb-Unit :: Utility/./UtilityTests/StreamTeeTest.Write (642 of 1727)
PASS: lldb-Unit :: Utility/./UtilityTests/RegularExpression.Invalid (643 of 1727)
PASS: lldb-Suite :: commands/register/register/register_command/TestRegisters.py (644 of 1727)
PASS: lldb-Unit :: Language/Highlighting/./HighlighterTests/HighlighterTest.ClangCursorPos (645 of 1727)
PASS: LLDB :: Breakpoint/implicit_const_form_support.test (646 of 1727)
PASS: lldb-Unit :: Utility/./UtilityTests/ScalarTest.Comparison (647 of 1727)
PASS: LLDB :: Modules/ELF/gnu-debuglink.yaml (648 of 1727)
PASS: lldb-Suite :: commands/expression/completion/TestExprCompletion.py (649 of 1727)
PASS: lldb-Suite :: tools/lldb-server/TestGdbRemoteRegisterState.py (650 of 1727)
PASS: lldb-Suite :: lang/objc/foundation/TestRuntimeTypes.py (651 of 1727)
PASS: lldb-Unit :: Utility/./UtilityTests/StreamTeeTest.GetStreamAtIndexOutOfBoundsEmpty (652 of 1727)
PASS: lldb-Suite :: functionalities/gdb_remote_client/TestTargetXMLArch.py (653 of 1727)
PASS: lldb-Suite :: python_api/value_var_update/TestValueVarUpdate.py (654 of 1727)
PASS: lldb-Unit :: UnwindAssembly/x86/./UnwindAssemblyx86Tests/Testx86AssemblyInspectionEngine.TestLEAVE (655 of 1727)
PASS: lldb-Suite :: commands/statistics/basic/TestStats.py (656 of 1727)
PASS: lldb-Suite :: commands/expression/call-function/TestCallStdStringFunction.py (657 of 1727)
PASS: lldb-Suite :: lang/cpp/auto/TestCPPAuto.py (658 of 1727)
PASS: lldb-Suite :: python_api/frame/inlines/TestInlinedFrame.py (659 of 1727)
FAIL: lldb-Suite :: functionalities/gdb_remote_client/TestGDBRemoteLoad.py (660 of 1727)
******************** TEST 'lldb-Suite :: functionalities/gdb_remote_client/TestGDBRemoteLoad.py' FAILED ********************
lldb version 10.0.99 (http://labmaster3.local/git/llvm-project.git revision a767a0688b096f4c8188a484f08a3f77bab0ce73)
  clang revision a767a0688b096f4c8188a484f08a3f77bab0ce73
  llvm revision a767a0688b096f4c8188a484f08a3f77bab0ce73
LLDB library dir: /Users/buildslave/jenkins/workspace/lldb-cmake-sanitized/lldb-build/bin
LLDB import library dir: /Users/buildslave/jenkins/workspace/lldb-cmake-sanitized/lldb-build/bin
libstdcxx tests will not be run because: Don't know how to build with libstdcxx on macosx
Skipping following debug info categories: ['dwo']

Session logs for test failures/errors/unexpected successes will go into directory '/Users/buildslave/jenkins/workspace/lldb-cmake-sanitized/test/logs'
Command invoked: /Users/buildslave/jenkins/workspace/lldb-cmake-sanitized/llvm-project/lldb/test/dotest.py --arch=x86_64 -s /Users/buildslave/jenkins/workspace/lldb-cmake-sanitized/lldb-build/lldb-test-traces -S nm -u CXXFLAGS -u CFLAGS --executable /Users/buildslave/jenkins/workspace/lldb-cmake-sanitized/lldb-build/./bin/lldb --dsymutil /Users/buildslave/jenkins/workspace/lldb-cmake-sanitized/lldb-build/./bin/dsymutil --filecheck /Users/buildslave/jenkins/workspace/lldb-cmake-sanitized/lldb-build/./bin/FileCheck -C /Users/buildslave/jenkins/workspace/lldb-cmake-sanitized/host-compiler/bin/clang --codesign-identity lldb_codesign --server /Users/buildslave/jenkins/workspace/lldb-cmake-sanitized/lldb-build/./bin/debugserver --arch x86_64 --build-dir /Users/buildslave/jenkins/workspace/lldb-cmake-sanitized/lldb-build/lldb-test-build.noindex -s=/Users/buildslave/jenkins/workspace/lldb-cmake-sanitized/test/logs -t --env TERM=vt100 --env LLVM_LIBS_DIR=/Users/buildslave/jenkins/workspace/lldb-cmake-sanitized/lldb-build/./lib --build-dir /Users/buildslave/jenkins/workspace/lldb-cmake-sanitized/lldb-build/tools/lldb/lldb-test-build.noindex --module-cache-dir /Users/buildslave/jenkins/workspace/lldb-cmake-sanitized/lldb-build/tools/lldb/lldb-test-build.noindex/module-cache-lldb /Users/buildslave/jenkins/workspace/lldb-cmake-sanitized/llvm-project/lldb/packages/Python/lldbsuite/test/functionalities/gdb_remote_client -p TestGDBRemoteLoad.py
Change dir to: /Users/buildslave/jenkins/workspace/lldb-cmake-sanitized/llvm-project/lldb/packages/Python/lldbsuite/test/functionalities/gdb_remote_client
runCmd: settings set symbols.enable-external-lookup false
output: 

runCmd: settings set plugin.process.gdb-remote.packet-timeout 60
output: 

runCmd: settings set symbols.clang-modules-cache-path "/Users/buildslave/jenkins/workspace/lldb-cmake-sanitized/lldb-build/tools/lldb/lldb-test-build.noindex/module-cache-lldb"
output: 

runCmd: settings set use-color false
output: 

FAIL: LLDB (/Users/buildslave/jenkins/workspace/lldb-cmake-sanitized/host-compiler/bin/clang-10-x86_64) :: test_flash_load (TestGDBRemoteLoad.TestGDBRemoteLoad)
<bound method SBProcess.Kill of <lldb.SBProcess; proxy of <Swig Object of type 'lldb::SBProcess *' at 0x11b245930> >>: success

runCmd: settings set symbols.enable-external-lookup false
output: 

runCmd: settings set plugin.process.gdb-remote.packet-timeout 60
output: 

runCmd: settings set symbols.clang-modules-cache-path "/Users/buildslave/jenkins/workspace/lldb-cmake-sanitized/lldb-build/tools/lldb/lldb-test-build.noindex/module-cache-lldb"
output: 

runCmd: settings set use-color false
output: 

FAIL: LLDB (/Users/buildslave/jenkins/workspace/lldb-cmake-sanitized/host-compiler/bin/clang-10-x86_64) :: test_module_load_address (TestGDBRemoteLoad.TestGDBRemoteLoad)
<bound method SBProcess.Kill of <lldb.SBProcess; proxy of <Swig Object of type 'lldb::SBProcess *' at 0x11b2458d0> >>: success

runCmd: settings set symbols.enable-external-lookup false
output: 

runCmd: settings set plugin.process.gdb-remote.packet-timeout 60
output: 

runCmd: settings set symbols.clang-modules-cache-path "/Users/buildslave/jenkins/workspace/lldb-cmake-sanitized/lldb-build/tools/lldb/lldb-test-build.noindex/module-cache-lldb"
output: 

runCmd: settings set use-color false
output: 

FAIL: LLDB (/Users/buildslave/jenkins/workspace/lldb-cmake-sanitized/host-compiler/bin/clang-10-x86_64) :: test_ram_load (TestGDBRemoteLoad.TestGDBRemoteLoad)
<bound method SBProcess.Kill of <lldb.SBProcess; proxy of <Swig Object of type 'lldb::SBProcess *' at 0x11b245930> >>: success

Restore dir to: /Users/buildslave/jenkins/workspace/lldb-cmake-sanitized/lldb-build/tools/lldb/lit
======================================================================
FAIL: test_flash_load (TestGDBRemoteLoad.TestGDBRemoteLoad)
   Test loading an object file to a target's flash memory
----------------------------------------------------------------------
Traceback (most recent call last):
  File "/Users/buildslave/jenkins/workspace/lldb-cmake-sanitized/llvm-project/lldb/packages/Python/lldbsuite/test/functionalities/gdb_remote_client/TestGDBRemoteLoad.py", line 73, in test_flash_load
    process = self.connect(target)
  File "/Users/buildslave/jenkins/workspace/lldb-cmake-sanitized/llvm-project/lldb/packages/Python/lldbsuite/test/functionalities/gdb_remote_client/gdbclientutils.py", line 479, in connect
    self.assertTrue(error.Success(), error.description)
AssertionError: False is not True : failed to get reply to handshake packet
Config=x86_64-/Users/buildslave/jenkins/workspace/lldb-cmake-sanitized/host-compiler/bin/clang-10
======================================================================
FAIL: test_module_load_address (TestGDBRemoteLoad.TestGDBRemoteLoad)
   Test that setting the load address of a module uses virtual addresses
----------------------------------------------------------------------
Traceback (most recent call last):
  File "/Users/buildslave/jenkins/workspace/lldb-cmake-sanitized/llvm-project/lldb/packages/Python/lldbsuite/test/functionalities/gdb_remote_client/TestGDBRemoteLoad.py", line 20, in test_module_load_address
    process = self.connect(target)
  File "/Users/buildslave/jenkins/workspace/lldb-cmake-sanitized/llvm-project/lldb/packages/Python/lldbsuite/test/functionalities/gdb_remote_client/gdbclientutils.py", line 479, in connect
    self.assertTrue(error.Success(), error.description)
AssertionError: False is not True : failed to get reply to handshake packet
Config=x86_64-/Users/buildslave/jenkins/workspace/lldb-cmake-sanitized/host-compiler/bin/clang-10
======================================================================
FAIL: test_ram_load (TestGDBRemoteLoad.TestGDBRemoteLoad)
   Test loading an object file to a target's ram
----------------------------------------------------------------------
Traceback (most recent call last):
  File "/Users/buildslave/jenkins/workspace/lldb-cmake-sanitized/llvm-project/lldb/packages/Python/lldbsuite/test/functionalities/gdb_remote_client/TestGDBRemoteLoad.py", line 31, in test_ram_load
    process = self.connect(target)
  File "/Users/buildslave/jenkins/workspace/lldb-cmake-sanitized/llvm-project/lldb/packages/Python/lldbsuite/test/functionalities/gdb_remote_client/gdbclientutils.py", line 479, in connect
    self.assertTrue(error.Success(), error.description)
AssertionError: False is not True : failed to get reply to handshake packet
Config=x86_64-/Users/buildslave/jenkins/workspace/lldb-cmake-sanitized/host-compiler/bin/clang-10
----------------------------------------------------------------------
Ran 3 tests in 189.782s

RESULT: FAILED (0 passes, 3 failures, 0 errors, 0 skipped, 0 expected failures, 0 unexpected successes)

********************
PASS: lldb-Unit :: Host/./HostTests/SocketTest.UDPConnect (661 of 1727)
PASS: lldb-Suite :: lang/objc/ivar-IMP/TestObjCiVarIMP.py (662 of 1727)
PASS: lldb-Unit :: Utility/./UtilityTests/StringExtractorTest.GetU64LittleEndian (663 of 1727)
UNSUPPORTED: LLDB :: Register/x86-64-zmm-read.test (664 of 1727)
PASS: lldb-Suite :: python_api/module_section/TestModuleAndSection.py (665 of 1727)
PASS: lldb-Unit :: UnwindAssembly/x86/./UnwindAssemblyx86Tests/Testx86AssemblyInspectionEngine.TestPushEBP (666 of 1727)
PASS: lldb-Suite :: functionalities/tsan/global_location/TestTsanGlobalLocation.py (667 of 1727)
PASS: lldb-Unit :: Language/Highlighting/./HighlighterTests/HighlighterTest.HighlighterSelectionPath (668 of 1727)
PASS: lldb-Unit :: Utility/./UtilityTests/FileSpecTest.AppendPathComponent (669 of 1727)
PASS: lldb-Unit :: Utility/./UtilityTests/StringExtractorTest.GetHexU8_Underflow2 (670 of 1727)
PASS: lldb-Unit :: Utility/./UtilityTests/ReproducerTest.SetCapture (671 of 1727)
PASS: LLDB :: Minidump/fb-dump.test (672 of 1727)
PASS: lldb-Suite :: functionalities/breakpoint/breakpoint_locations/TestBreakpointLocations.py (673 of 1727)
PASS: lldb-Suite :: lang/cpp/namespace/TestNamespaceLookup.py (674 of 1727)
PASS: lldb-Suite :: functionalities/plugins/python_os_plugin/TestPythonOSPlugin.py (675 of 1727)
PASS: lldb-Unit :: Utility/./UtilityTests/JSONTest.Newlines (676 of 1727)
PASS: lldb-Unit :: UnwindAssembly/x86/./UnwindAssemblyx86Tests/Testx86AssemblyInspectionEngine.TestPopRBP (677 of 1727)
PASS: lldb-Suite :: commands/frame/diagnose/local-variable/TestLocalVariable.py (678 of 1727)
PASS: lldb-Unit :: Utility/./UtilityTests/BinaryStreamTest.PutULEB128ThreeBytes (679 of 1727)
PASS: lldb-Suite :: lang/cpp/type_lookup/TestCppTypeLookup.py (680 of 1727)
PASS: lldb-Suite :: macosx/order/TestOrderFile.py (681 of 1727)
PASS: lldb-Suite :: commands/expression/radar_9531204/TestPrintfAfterUp.py (682 of 1727)
PASS: lldb-Unit :: ScriptInterpreter/Python/./ScriptInterpreterPythonTests/PythonDataObjectsTest.TestPythonDictionaryManipulation (683 of 1727)
PASS: lldb-Suite :: functionalities/postmortem/minidump-new/TestMiniDumpUUID.py (684 of 1727)
PASS: lldb-Unit :: Utility/./UtilityTests/StringExtractorTest.GetHexU8_Underflow_NoEof (685 of 1727)
PASS: lldb-Unit :: Language/Highlighting/./HighlighterTests/HighlighterTest.HighlighterSelectionType (686 of 1727)
PASS: lldb-Unit :: ScriptInterpreter/Python/./ScriptInterpreterPythonTests/PythonDataObjectsTest.TestGlobalNameResolutionNoDot (687 of 1727)
PASS: lldb-Unit :: Utility/./UtilityTests/VASprintfTest.BufferResize (688 of 1727)
PASS: lldb-Suite :: commands/log/invalid-args/TestInvalidArgsLog.py (689 of 1727)
PASS: LLDB :: SymbolFile/Breakpad/symtab-macho.test (690 of 1727)
PASS: lldb-Unit :: Utility/./UtilityTests/VASprintfTest.EncodingError (691 of 1727)
PASS: lldb-Suite :: functionalities/thread/concurrent_events/TestConcurrentNWatchNBreak.py (692 of 1727)
PASS: LLDB :: SymbolFile/DWARF/debug_ranges.s (693 of 1727)
PASS: lldb-Unit :: Utility/./UtilityTests/UriParserTest.BadPort (694 of 1727)
FAIL: lldb-Suite :: functionalities/gdb_remote_client/TestThreadSelectionBug.py (695 of 1727)
******************** TEST 'lldb-Suite :: functionalities/gdb_remote_client/TestThreadSelectionBug.py' FAILED ********************
lldb version 10.0.99 (http://labmaster3.local/git/llvm-project.git revision a767a0688b096f4c8188a484f08a3f77bab0ce73)
  clang revision a767a0688b096f4c8188a484f08a3f77bab0ce73
  llvm revision a767a0688b096f4c8188a484f08a3f77bab0ce73
LLDB library dir: /Users/buildslave/jenkins/workspace/lldb-cmake-sanitized/lldb-build/bin
LLDB import library dir: /Users/buildslave/jenkins/workspace/lldb-cmake-sanitized/lldb-build/bin
libstdcxx tests will not be run because: Don't know how to build with libstdcxx on macosx
Skipping following debug info categories: ['dwo']

Session logs for test failures/errors/unexpected successes will go into directory '/Users/buildslave/jenkins/workspace/lldb-cmake-sanitized/test/logs'
Command invoked: /Users/buildslave/jenkins/workspace/lldb-cmake-sanitized/llvm-project/lldb/test/dotest.py --arch=x86_64 -s /Users/buildslave/jenkins/workspace/lldb-cmake-sanitized/lldb-build/lldb-test-traces -S nm -u CXXFLAGS -u CFLAGS --executable /Users/buildslave/jenkins/workspace/lldb-cmake-sanitized/lldb-build/./bin/lldb --dsymutil /Users/buildslave/jenkins/workspace/lldb-cmake-sanitized/lldb-build/./bin/dsymutil --filecheck /Users/buildslave/jenkins/workspace/lldb-cmake-sanitized/lldb-build/./bin/FileCheck -C /Users/buildslave/jenkins/workspace/lldb-cmake-sanitized/host-compiler/bin/clang --codesign-identity lldb_codesign --server /Users/buildslave/jenkins/workspace/lldb-cmake-sanitized/lldb-build/./bin/debugserver --arch x86_64 --build-dir /Users/buildslave/jenkins/workspace/lldb-cmake-sanitized/lldb-build/lldb-test-build.noindex -s=/Users/buildslave/jenkins/workspace/lldb-cmake-sanitized/test/logs -t --env TERM=vt100 --env LLVM_LIBS_DIR=/Users/buildslave/jenkins/workspace/lldb-cmake-sanitized/lldb-build/./lib --build-dir /Users/buildslave/jenkins/workspace/lldb-cmake-sanitized/lldb-build/tools/lldb/lldb-test-build.noindex --module-cache-dir /Users/buildslave/jenkins/workspace/lldb-cmake-sanitized/lldb-build/tools/lldb/lldb-test-build.noindex/module-cache-lldb /Users/buildslave/jenkins/workspace/lldb-cmake-sanitized/llvm-project/lldb/packages/Python/lldbsuite/test/functionalities/gdb_remote_client -p TestThreadSelectionBug.py
Change dir to: /Users/buildslave/jenkins/workspace/lldb-cmake-sanitized/llvm-project/lldb/packages/Python/lldbsuite/test/functionalities/gdb_remote_client
runCmd: settings set symbols.enable-external-lookup false
output: 

runCmd: settings set plugin.process.gdb-remote.packet-timeout 60
output: 

runCmd: settings set symbols.clang-modules-cache-path "/Users/buildslave/jenkins/workspace/lldb-cmake-sanitized/lldb-build/tools/lldb/lldb-test-build.noindex/module-cache-lldb"
output: 

runCmd: settings set use-color false
output: 

FAIL: LLDB (/Users/buildslave/jenkins/workspace/lldb-cmake-sanitized/host-compiler/bin/clang-10-x86_64) :: test (TestThreadSelectionBug.TestThreadSelectionBug)
<bound method SBProcess.Kill of <lldb.SBProcess; proxy of <Swig Object of type 'lldb::SBProcess *' at 0x10b0a08a0> >>: success

Restore dir to: /Users/buildslave/jenkins/workspace/lldb-cmake-sanitized/lldb-build/tools/lldb/lit
======================================================================
FAIL: test (TestThreadSelectionBug.TestThreadSelectionBug)
----------------------------------------------------------------------
Traceback (most recent call last):
  File "/Users/buildslave/jenkins/workspace/lldb-cmake-sanitized/llvm-project/lldb/packages/Python/lldbsuite/test/functionalities/gdb_remote_client/TestThreadSelectionBug.py", line 17, in test
    process = self.connect(target)
  File "/Users/buildslave/jenkins/workspace/lldb-cmake-sanitized/llvm-project/lldb/packages/Python/lldbsuite/test/functionalities/gdb_remote_client/gdbclientutils.py", line 479, in connect
    self.assertTrue(error.Success(), error.description)
AssertionError: False is not True : failed to get reply to handshake packet
Config=x86_64-/Users/buildslave/jenkins/workspace/lldb-cmake-sanitized/host-compiler/bin/clang-10
----------------------------------------------------------------------
Ran 1 test in 63.179s

RESULT: FAILED (0 passes, 1 failures, 0 errors, 0 skipped, 0 expected failures, 0 unexpected successes)

********************
PASS: lldb-Unit :: SymbolFile/DWARF/./SymbolFileDWARFTests/SymbolFileDWARFTests.TestAbbrevValidAttrNullForm (696 of 1727)
PASS: lldb-Unit :: Process/minidump/./LLDBMinidumpTests/MinidumpParserTest.GetMemoryRegionInfoFromMemoryList (697 of 1727)
PASS: LLDB :: Reproducer/Functionalities/TestImageList.test (698 of 1727)
PASS: lldb-Suite :: functionalities/postmortem/minidump/TestMiniDump.py (699 of 1727)
PASS: lldb-Unit :: Process/gdb-remote/./ProcessGdbRemoteTests/GDBRemoteCommunicationServerTest.SendErrorResponse_ErrorList (700 of 1727)
XFAIL: LLDB :: SymbolFile/DWARF/find-type-in-function.cpp (701 of 1727)
PASS: LLDB :: Reproducer/Functionalities/TestStepping.test (702 of 1727)
PASS: lldb-Unit :: Utility/./UtilityTests/StringListTest.LongestCommonPrefix (703 of 1727)
PASS: lldb-Unit :: Utility/./UtilityTests/ArgsTest.BareSingleQuote (704 of 1727)
PASS: lldb-Suite :: commands/watchpoints/watchpoint_set_command/TestWatchLocationWithWatchSet.py (705 of 1727)
PASS: lldb-Unit :: Utility/./UtilityTests/StreamTeeTest.Constructor2Streams (706 of 1727)
PASS: lldb-Suite :: functionalities/thread/concurrent_events/TestConcurrentSignalDelayBreak.py (707 of 1727)
PASS: lldb-Suite :: python_api/interpreter/TestCommandInterpreterAPI.py (708 of 1727)
PASS: lldb-Suite :: python_api/disassemble-raw-data/TestDisassembleRawData.py (709 of 1727)
PASS: lldb-Suite :: commands/expression/macros/TestMacros.py (710 of 1727)
PASS: lldb-Unit :: Utility/./UtilityTests/StreamTest.PutPtr (711 of 1727)
PASS: lldb-Suite :: macosx/find-app-in-bundle/TestFindAppInBundle.py (712 of 1727)
PASS: lldb-Suite :: lang/cpp/overloaded-functions/TestOverloadedFunctions.py (713 of 1727)
PASS: lldb-Unit :: Host/./HostTests/SocketAddressTest.Set (714 of 1727)
PASS: lldb-Suite :: functionalities/testid/TestTestId.py (715 of 1727)
PASS: lldb-Suite :: lang/c/const_variables/TestConstVariables.py (716 of 1727)
PASS: LLDB :: Modules/ELF/PT_LOAD-overlap-PT_TLS.yaml (717 of 1727)
PASS: lldb-Unit :: Utility/./UtilityTests/StringListTest.JoinMultiCharSeparator (718 of 1727)
PASS: lldb-Suite :: functionalities/ubsan/basic/TestUbsanBasic.py (719 of 1727)
PASS: lldb-Suite :: tools/lldb-server/TestGdbRemoteSingleStep.py (720 of 1727)
PASS: lldb-Unit :: Symbol/./SymbolTests/LineEntryTest.GetSameLineContiguousAddressRangeNestedInline (721 of 1727)
PASS: lldb-Unit :: UnwindAssembly/x86/./UnwindAssemblyx86Tests/Testx86AssemblyInspectionEngine.TestPushESI (722 of 1727)
PASS: LLDB :: Unwind/trap_frame_sym_ctx.test (723 of 1727)
PASS: LLDB :: SymbolFile/NativePDB/tag-types.cpp (724 of 1727)
PASS: LLDB :: Settings/TestFrameFormatColor.test (725 of 1727)
PASS: lldb-Suite :: macosx/macabi/TestMacABImacOSFramework.py (726 of 1727)
PASS: LLDB :: SymbolFile/DWARF/split-dwarf-inlining.cpp (727 of 1727)
PASS: lldb-Suite :: functionalities/data-formatter/format-propagation/TestFormatPropagation.py (728 of 1727)
PASS: lldb-Unit :: Utility/./UtilityTests/RangeTest.ContainsAddrInvalid (729 of 1727)
PASS: lldb-Suite :: functionalities/breakpoint/breakpoint_ignore_count/TestBreakpointIgnoreCount.py (730 of 1727)
PASS: lldb-Unit :: Utility/./UtilityTests/CompletionRequest.TestCompletionOwnership (731 of 1727)
PASS: LLDB :: SymbolFile/DWARF/apple-index-is-used.cpp (732 of 1727)
PASS: lldb-Suite :: commands/command/script/import/rdar-12586188/TestRdar12586188.py (733 of 1727)
PASS: lldb-Unit :: Utility/./UtilityTests/BinaryStreamTest.PutSLEB128Zero (734 of 1727)
PASS: lldb-Unit :: SymbolFile/DWARF/./SymbolFileDWARFTests/SymbolFileDWARFTests.TestAbbrevInvalidNULLTag (735 of 1727)
PASS: lldb-Suite :: commands/expression/vector_of_enums/TestVectorOfEnums.py (736 of 1727)
PASS: lldb-Unit :: Utility/./UtilityTests/StringListTest.AppendListCStringArrayEmpty (737 of 1727)
PASS: lldb-Suite :: commands/expression/inline-namespace/TestInlineNamespace.py (738 of 1727)
PASS: LLDB :: SymbolFile/DWARF/find-basic-function.cpp (739 of 1727)
PASS: LLDB :: Driver/TestCommands.test (740 of 1727)
PASS: lldb-Unit :: Process/minidump/./LLDBMinidumpTests/MinidumpParserTest.InvalidMinidump (741 of 1727)
PASS: lldb-Suite :: functionalities/gdb_remote_client/TestWriteMemory.py (742 of 1727)
PASS: lldb-Unit :: debugserver/./debugserverTests/RNBSocket.LoopBackListenIPv4 (743 of 1727)
PASS: lldb-Suite :: python_api/value/linked_list/TestValueAPILinkedList.py (744 of 1727)
PASS: LLDB :: Quit/TestQuitExitCodeTooManyArgs.test (745 of 1727)
PASS: lldb-Unit :: Host/./HostTests/FileSystemTest.GetPermissions (746 of 1727)
PASS: lldb-Suite :: python_api/section/TestSectionAPI.py (747 of 1727)
PASS: lldb-Unit :: Utility/./UtilityTests/RecordReplayTest.InstrumentedBarRef (748 of 1727)
PASS: lldb-Unit :: Host/./HostTests/NativeProcessProtocolTest.SetBreakpointFailRead (749 of 1727)
PASS: lldb-Unit :: Utility/./UtilityTests/FileSpecTest.RemoveLastPathComponent (750 of 1727)
PASS: LLDB :: Modules/ELF/PT_LOAD-overlap-section.yaml (751 of 1727)
PASS: LLDB :: Modules/PECOFF/subsections.yaml (752 of 1727)
PASS: LLDB :: Settings/TestDisassemblyFormat.test (753 of 1727)
PASS: lldb-Suite :: functionalities/gdb_remote_client/TestArmRegisterDefinition.py (754 of 1727)
PASS: lldb-Suite :: tools/lldb-server/TestAppleSimulatorOSType.py (755 of 1727)
PASS: LLDB :: SymbolFile/DWARF/find-qualified-variable.cpp (756 of 1727)
PASS: lldb-Suite :: python_api/target/TestTargetAPI.py (757 of 1727)
PASS: lldb-Unit :: Language/Highlighting/./HighlighterTests/HighlighterTest.DefaultHighlighterWithCursor (758 of 1727)
PASS: lldb-Suite :: lang/cpp/unsigned_types/TestUnsignedTypes.py (759 of 1727)
PASS: lldb-Suite :: commands/expression/persistent_variables/TestPersistentVariables.py (760 of 1727)
PASS: lldb-Unit :: Utility/./UtilityTests/TimerTest.CategoryTimes (761 of 1727)
PASS: lldb-Suite :: functionalities/tail_call_frames/inlining_and_tail_calls/TestInliningAndTailCalls.py (762 of 1727)
PASS: lldb-Suite :: functionalities/darwin_log/filter/exact_match/activity-chain/TestDarwinLogFilterMatchActivityChain.py (763 of 1727)
PASS: lldb-Unit :: Utility/./UtilityTests/ScalarTest.ExtractBitfield (764 of 1727)
PASS: lldb-Unit :: Utility/./UtilityTests/UUIDTest.RelationalOperators (765 of 1727)
PASS: lldb-Unit :: UnwindAssembly/x86/./UnwindAssemblyx86Tests/Testx86AssemblyInspectionEngine.TestSpillRegToStackViaMOVi386 (766 of 1727)
PASS: lldb-Suite :: commands/expression/argument_passing_restrictions/TestArgumentPassingRestrictions.py (767 of 1727)
PASS: lldb-Unit :: Utility/./UtilityTests/BinaryStreamTest.PutSLEB128MaxValue (768 of 1727)
PASS: lldb-Unit :: Utility/./UtilityTests/NameMatchesTest.RegularExpression (769 of 1727)
PASS: lldb-Unit :: Utility/./UtilityTests/StringListTest.CopyList (770 of 1727)
PASS: lldb-Unit :: Language/Highlighting/./HighlighterTests/HighlighterTest.ClangStringLiterals (771 of 1727)
PASS: lldb-Suite :: functionalities/darwin_log/source/debug/TestDarwinLogSourceDebug.py (772 of 1727)
PASS: lldb-Unit :: Utility/./UtilityTests/FileSpecTest.CopyByAppendingPathComponent (773 of 1727)
PASS: lldb-Suite :: lang/cpp/static_methods/TestCPPStaticMethods.py (774 of 1727)
PASS: lldb-Suite :: functionalities/thread/num_threads/TestNumThreads.py (775 of 1727)
PASS: lldb-Suite :: commands/settings/TestSettings.py (776 of 1727)
PASS: lldb-Unit :: Utility/./UtilityTests/StringExtractorTest.DecodeHexU8_InvalidHex (777 of 1727)
PASS: lldb-Unit :: Utility/./UtilityTests/StreamTest.PutRawBytesToMixedEndian (778 of 1727)
PASS: lldb-Suite :: lang/objc/objc-ivar-stripped/TestObjCIvarStripped.py (779 of 1727)
PASS: lldb-Suite :: commands/expression/xvalue/TestXValuePrinting.py (780 of 1727)
PASS: lldb-Suite :: python_api/symbol-context/TestSymbolContext.py (781 of 1727)
PASS: lldb-Suite :: python_api/objc_type/TestObjCType.py (782 of 1727)
PASS: LLDB :: Breakpoint/split-dwarf5-debug-stroffsets.test (783 of 1727)
PASS: lldb-Suite :: functionalities/darwin_log/filter/exact_match/message/TestDarwinLogFilterMatchMessage.py (784 of 1727)
PASS: lldb-Unit :: ScriptInterpreter/Python/./ScriptInterpreterPythonTests/PythonExceptionStateTest.TestAcquisitionSemantics (785 of 1727)
PASS: lldb-Unit :: Utility/./UtilityTests/UriParserTest.SchemeHostSeparator3 (786 of 1727)
PASS: lldb-Unit :: Utility/./UtilityTests/StringExtractorTest.GetHexU8_Extra (787 of 1727)
PASS: lldb-Suite :: lang/c/stepping/TestThreadStepping.py (788 of 1727)
PASS: lldb-Unit :: UnwindAssembly/x86/./UnwindAssemblyx86Tests/Testx86AssemblyInspectionEngine.TestPushRBX (789 of 1727)
PASS: lldb-Unit :: Utility/./UtilityTests/Flags.Reset (790 of 1727)
PASS: LLDB :: SymbolFile/Breakpad/line-table.test (791 of 1727)
PASS: lldb-Unit :: Process/gdb-remote/./ProcessGdbRemoteTests/GDBRemoteCommunicationServerTest.SendErrorResponse_UnimplementedError (792 of 1727)
PASS: lldb-Unit :: Utility/./UtilityTests/BinaryStreamTest.PutULEB128SixBytes (793 of 1727)
PASS: lldb-Unit :: Utility/./UtilityTests/RangeTest.Equal (794 of 1727)
PASS: lldb-Suite :: lang/objc/foundation/TestObjCMethodsString.py (795 of 1727)
PASS: lldb-Suite :: lang/cpp/gmodules-templates/TestGModules.py (796 of 1727)
PASS: lldb-Unit :: Utility/./UtilityTests/GeneratorTest.Create (797 of 1727)
PASS: lldb-Suite :: lang/cpp/stl/TestSTL.py (798 of 1727)
PASS: LLDB :: Settings/TestEchoCommands.test (799 of 1727)
PASS: LLDB :: Settings/TestSettingsWrite.test (800 of 1727)
PASS: lldb-Unit :: ObjectFile/Breakpad/./ObjectFileBreakpadTests/LineRecord.parse (801 of 1727)
PASS: lldb-Suite :: functionalities/darwin_log/filter/regex/activity/TestDarwinLogFilterRegexActivity.py (802 of 1727)
PASS: lldb-Unit :: Process/gdb-remote/./ProcessGdbRemoteTests/GDBRemoteClientBaseTest.SendContinueAndLateInterrupt (803 of 1727)
PASS: LLDB :: Commands/command-regex-delete.test (804 of 1727)
PASS: lldb-Suite :: tools/lldb-vscode/breakpoint/TestVSCode_setFunctionBreakpoints.py (805 of 1727)
PASS: LLDB :: SymbolFile/Breakpad/line-table-edgecases.test (806 of 1727)
PASS: lldb-Unit :: Utility/./UtilityTests/StreamTeeTest.Constructor1Stream (807 of 1727)
PASS: lldb-Suite :: python_api/sbvalue_const_addrof/TestSBValueConstAddrOf.py (808 of 1727)
PASS: LLDB :: Settings/TestModuleCacheSanity.test (809 of 1727)
PASS: lldb-Suite :: commands/command/delete/TestCommandDelete.py (810 of 1727)
PASS: lldb-Unit :: ScriptInterpreter/Python/./ScriptInterpreterPythonTests/PythonDataObjectsTest.TestObjectAttributes (811 of 1727)
PASS: lldb-Unit :: Utility/./UtilityTests/UriParserTest.SchemeHostSeparator4 (812 of 1727)
PASS: lldb-Suite :: benchmarks/stepping/TestSteppingSpeed.py (813 of 1727)
PASS: lldb-Suite :: functionalities/data-formatter/pyobjsynthprovider/TestPyObjSynthProvider.py (814 of 1727)
PASS: lldb-Suite :: commands/watchpoints/multiple_hits/TestMultipleHits.py (815 of 1727)
PASS: LLDB :: SymbolFile/DWARF/debug_loc.s (816 of 1727)
PASS: lldb-Unit :: Utility/./UtilityTests/ArgsTest.TestQuotedUnknownEscape (817 of 1727)
PASS: lldb-Unit :: Utility/./UtilityTests/StringListTest.JoinThree (818 of 1727)
UNSUPPORTED: LLDB :: SymbolFile/NativePDB/typedefs.cpp (819 of 1727)
PASS: lldb-Unit :: Utility/./UtilityTests/StringLexerTest.NextIf (820 of 1727)
PASS: lldb-Suite :: commands/target/stop-hooks/TestStopHooks.py (821 of 1727)
PASS: LLDB :: Commands/command-source.test (822 of 1727)
PASS: lldb-Suite :: lang/objc/rdar-10967107/TestRdar10967107.py (823 of 1727)
PASS: lldb-Unit :: Utility/./UtilityTests/RegularExpression.Empty (824 of 1727)
PASS: lldb-Suite :: functionalities/data-formatter/nssetsynth/TestNSSetSynthetic.py (825 of 1727)
PASS: lldb-Unit :: Utility/./UtilityTests/SerializationRountripTest.SerializeDeserializeObjectPointer (826 of 1727)
PASS: lldb-Unit :: Host/./HostTests/ConnectionFileDescriptorTest.TCPGetURIv4 (827 of 1727)
PASS: lldb-Suite :: python_api/thread/TestThreadAPI.py (828 of 1727)
PASS: lldb-Suite :: lang/objc/objc-property/TestObjCProperty.py (829 of 1727)
PASS: lldb-Unit :: ScriptInterpreter/Python/./ScriptInterpreterPythonTests/PythonExceptionStateTest.TestAutoRestoreChanged (830 of 1727)
PASS: lldb-Suite :: lang/objc/objc-dyn-sbtype/TestObjCDynamicSBType.py (831 of 1727)
PASS: lldb-Unit :: Core/./LLDBCoreTests/MangledTest.NameIndexes_FindFunctionSymbols (832 of 1727)
PASS: lldb-Suite :: commands/watchpoints/step_over_watchpoint/TestStepOverWatchpoint.py (833 of 1727)
PASS: LLDB :: Breakpoint/debug_rnglist_offset_pair.test (834 of 1727)
PASS: lldb-Unit :: Expression/./ExpressionTests/DiagnosticManagerTest.FixedExpression (835 of 1727)
PASS: lldb-Suite :: functionalities/inferior-crashing/recursive-inferior/TestRecursiveInferiorStep.py (836 of 1727)
PASS: lldb-Suite :: commands/frame/diagnose/array/TestArray.py (837 of 1727)
PASS: lldb-Suite :: functionalities/signal/raise/TestRaise.py (838 of 1727)
PASS: lldb-Suite :: functionalities/thread/step_until/TestStepUntil.py (839 of 1727)
PASS: lldb-Suite :: lang/cpp/call-function/TestCallCPPFunction.py (840 of 1727)
PASS: lldb-Unit :: Utility/./UtilityTests/ProcessInstanceInfo.Dump (841 of 1727)
PASS: LLDB :: Driver/TestFile.test (842 of 1727)
PASS: lldb-Suite :: commands/command/script/TestCommandScript.py (843 of 1727)
PASS: LLDB :: SymbolFile/DWARF/deterministic-build.cpp (844 of 1727)
PASS: lldb-Suite :: lang/c/local_types/TestUseClosestType.py (845 of 1727)
PASS: lldb-Suite :: commands/process/launch/TestProcessLaunch.py (846 of 1727)
PASS: lldb-Suite :: functionalities/data-formatter/data-formatter-script/TestDataFormatterScript.py (847 of 1727)
PASS: lldb-Suite :: functionalities/tsan/cpp_global_location/TestTsanCPPGlobalLocation.py (848 of 1727)
PASS: lldb-Unit :: ScriptInterpreter/Python/./ScriptInterpreterPythonTests/PythonDataObjectsTest.TestBorrowedReferences (849 of 1727)
PASS: lldb-Suite :: linux/add-symbols/TestTargetSymbolsAddCommand.py (850 of 1727)
PASS: lldb-Unit :: UnwindAssembly/x86/./UnwindAssemblyx86Tests/Testx86AssemblyInspectionEngine.TestStackRealign32BitDisp_x86_64 (851 of 1727)
PASS: lldb-Unit :: Utility/./UtilityTests/StringExtractorTest.InitEmpty (852 of 1727)
PASS: lldb-Suite :: python_api/value/TestValueAPI.py (853 of 1727)
PASS: lldb-Suite :: commands/expression/import-std-module/weak_ptr-dbg-info-content/TestDbgInfoContentWeakPtr.py (854 of 1727)
PASS: LLDB :: SymbolFile/Breakpad/line-table-mixed-path-styles.test (855 of 1727)
PASS: lldb-Suite :: functionalities/darwin_log/source/info/TestDarwinLogSourceInfo.py (856 of 1727)
PASS: lldb-Suite :: python_api/process/TestProcessAPI.py (857 of 1727)
PASS: lldb-Suite :: commands/expression/dollar-in-variable/TestDollarInVariable.py (858 of 1727)
PASS: lldb-Unit :: Utility/./UtilityTests/StringExtractorTest.GetHexBytesAvail_Underflow (859 of 1727)
PASS: lldb-Suite :: lang/cpp/std-function-step-into-callable/TestStdFunctionStepIntoCallable.py (860 of 1727)
PASS: lldb-Unit :: Utility/./UtilityTests/StringListTest.ShiftCString (861 of 1727)
PASS: lldb-Unit :: Utility/./UtilityTests/StringListTest.AppendList (862 of 1727)
PASS: lldb-Suite :: commands/expression/persistent_types/TestPersistentTypes.py (863 of 1727)
PASS: lldb-Suite :: api/listeners/TestListener.py (864 of 1727)
PASS: lldb-Unit :: Expression/./ExpressionTests/DiagnosticManagerTest.GetStringSeverityLabels (865 of 1727)
PASS: lldb-Suite :: functionalities/thread/concurrent_events/TestConcurrentWatchpointDelayWatchpointOneBreakpoint.py (866 of 1727)
PASS: lldb-Suite :: functionalities/darwin_log/filter/regex/message/TestDarwinLogFilterRegexMessage.py (867 of 1727)
PASS: lldb-Unit :: Expression/./ExpressionTests/ClangHostTest.ComputeClangResourceDirectory (868 of 1727)
PASS: lldb-Unit :: Utility/./UtilityTests/FileSpecTest.FileAndDirectoryComponents (869 of 1727)
PASS: lldb-Suite :: functionalities/data-formatter/data-formatter-objc/nsstring/TestDataFormatterNSString.py (870 of 1727)
PASS: lldb-Unit :: Utility/./UtilityTests/StringExtractorTest.GetHexBytesAvail_Partial (871 of 1727)
UNSUPPORTED: LLDB :: Register/x86-zmm-write.test (872 of 1727)
PASS: lldb-Suite :: functionalities/data-formatter/data-formatter-objc/TestDataFormatterObjCCF.py (873 of 1727)
PASS: lldb-Unit :: Utility/./UtilityTests/UriParserTest.BracketedHostnameWithColon (874 of 1727)
PASS: lldb-Suite :: lang/c/unicode/TestUnicodeSymbols.py (875 of 1727)
PASS: lldb-Unit :: Process/minidump/./LLDBMinidumpTests/MinidumpParserTest.GetFilteredModuleList (876 of 1727)
PASS: lldb-Unit :: Host/./HostTests/SocketTest.TCPListen0ConnectAccept (877 of 1727)
PASS: LLDB :: SymbolFile/NativePDB/function-types-classes.cpp (878 of 1727)
PASS: lldb-Unit :: Target/./TargetTests/PathMappingListTest.RemapRoot (879 of 1727)
PASS: lldb-Unit :: Utility/./UtilityTests/EnvironmentTest.EnvpConversion (880 of 1727)
PASS: lldb-Suite :: lang/objc/objc++/TestObjCXX.py (881 of 1727)
PASS: lldb-Unit :: Utility/./UtilityTests/StringListTest.ShiftMove (882 of 1727)
PASS: lldb-Suite :: functionalities/data-formatter/data-formatter-synthtype/TestDataFormatterSynthType.py (883 of 1727)
PASS: LLDB :: ExecControl/StopHook/stop-hook.test (884 of 1727)
PASS: lldb-Unit :: Interpreter/./InterpreterTests/OptionArgParserTest.toScriptLanguage (885 of 1727)
PASS: lldb-Unit :: Utility/./UtilityTests/FileSpecTest.FormatFileSpec (886 of 1727)
PASS: lldb-Unit :: Utility/./UtilityTests/ProcessInstanceInfo.DumpTable_invalidUID (887 of 1727)
PASS: LLDB :: SymbolFile/DWARF/dir-separator-no-comp-dir.s (888 of 1727)
PASS: lldb-Suite :: functionalities/gdb_remote_client/TestRestartBug.py (889 of 1727)
PASS: lldb-Unit :: Utility/./UtilityTests/UserIDResolver.GetGroupName (890 of 1727)
PASS: lldb-Suite :: lang/objc/objc-runtime-ivars/TestRuntimeIvars.py (891 of 1727)
PASS: lldb-Suite :: commands/expression/entry-bp/TestExprEntryBP.py (892 of 1727)
PASS: lldb-Unit :: Utility/./UtilityTests/BroadcasterTest.BroadcastEvent (893 of 1727)
PASS: lldb-Suite :: functionalities/fat_archives/TestFatArchives.py (894 of 1727)
PASS: LLDB :: Quit/TestQuitExitCodeHex0.test (895 of 1727)
PASS: LLDB :: Modules/ELF/basic-info.yaml (896 of 1727)
PASS: LLDB :: Register/x86-64-gp-read.test (897 of 1727)
PASS: lldb-Unit :: Utility/./UtilityTests/StringExtractorTest.GetNameColonValueNoSemicolon (898 of 1727)
PASS: lldb-Suite :: functionalities/breakpoint/breakpoint_conditions/TestBreakpointConditions.py (899 of 1727)
PASS: lldb-Unit :: UnwindAssembly/x86/./UnwindAssemblyx86Tests/Testx86AssemblyInspectionEngine.TestReturnDetect (900 of 1727)
PASS: lldb-Unit :: Utility/./UtilityTests/DeserializerTest.HasData (901 of 1727)
PASS: lldb-Suite :: types/TestDoubleTypes.py (902 of 1727)
PASS: lldb-Suite :: functionalities/asan/TestMemoryHistory.py (903 of 1727)
PASS: lldb-Unit :: Utility/./UtilityTests/VMRange.Reset (904 of 1727)
PASS: lldb-Unit :: SymbolFile/NativePDB/./SymbolFileNativePDBTests/PDBFPOProgramToDWARFExpressionTests.UnknownOp (905 of 1727)
PASS: lldb-Unit :: SymbolFile/DWARF/./SymbolFileDWARFTests/SymbolFileDWARFTests.TestAbbrevOrder1Start1 (906 of 1727)
PASS: lldb-Unit :: Utility/./UtilityTests/DataExtractorTest.GetBitfield (907 of 1727)
PASS: lldb-Unit :: Utility/./UtilityTests/StreamTest.PutMaxHex64ByteOrderBig (908 of 1727)
PASS: lldb-Suite :: functionalities/step-avoids-no-debug/TestStepNoDebug.py (909 of 1727)
PASS: lldb-Unit :: SymbolFile/NativePDB/./SymbolFileNativePDBTests/PDBFPOProgramToDWARFExpressionTests.UnresolvedRegisterAssignmentReference (910 of 1727)
PASS: lldb-Suite :: functionalities/postmortem/wow64_minidump/TestWow64MiniDump.py (911 of 1727)
PASS: lldb-Unit :: Utility/./UtilityTests/StringExtractorTest.GetHexBytesAvail_FullString (912 of 1727)
PASS: lldb-Unit :: Utility/./UtilityTests/RangeTest.Constructor (913 of 1727)
PASS: lldb-Suite :: commands/frame/recognizer/TestFrameRecognizer.py (914 of 1727)
PASS: lldb-Unit :: Utility/./UtilityTests/OptionsWithRawTest.SingleWhitespaceInput (915 of 1727)
PASS: lldb-Suite :: commands/watchpoints/watchpoint_commands/command/TestWatchpointCommandPython.py (916 of 1727)
PASS: lldb-Unit :: ScriptInterpreter/Python/./ScriptInterpreterPythonTests/PythonDataObjectsTest.TestPythonFile (917 of 1727)
PASS: lldb-Unit :: UnwindAssembly/x86/./UnwindAssemblyx86Tests/Testx86AssemblyInspectionEngine.TestPushEDX (918 of 1727)
PASS: lldb-Suite :: python_api/function_symbol/TestSymbolAPI.py (919 of 1727)
PASS: lldb-Unit :: Symbol/./SymbolTests/DWARFCallFrameInfoTest.Basic_dwarf4 (920 of 1727)
PASS: lldb-Unit :: Utility/./UtilityTests/LogChannelTest.Disable (921 of 1727)
PASS: lldb-Suite :: lang/cpp/diamond/TestDiamond.py (922 of 1727)
PASS: lldb-Suite :: functionalities/data-formatter/data-formatter-stl/libcxx/unordered/TestDataFormatterUnordered.py (923 of 1727)
PASS: lldb-Suite :: functionalities/tail_call_frames/sbapi_support/TestTailCallFrameSBAPI.py (924 of 1727)
PASS: lldb-Suite :: functionalities/darwin_log/filter/regex/activity-chain/TestDarwinLogFilterRegexActivityChain.py (925 of 1727)
PASS: lldb-Suite :: python_api/breakpoint/TestBreakpointAPI.py (926 of 1727)
PASS: lldb-Suite :: commands/frame/diagnose/dereference-function-return/TestDiagnoseDereferenceFunctionReturn.py (927 of 1727)
PASS: LLDB :: SymbolFile/DWARF/array-sizes.s (928 of 1727)
PASS: lldb-Unit :: UnwindAssembly/x86/./UnwindAssemblyx86Tests/Testx86AssemblyInspectionEngine.TestPushEAX (929 of 1727)
PASS: LLDB :: Breakpoint/debug_rnglistx_rlex.test (930 of 1727)
PASS: lldb-Unit :: ObjectFile/Breakpad/./ObjectFileBreakpadTests/StackWinRecord.parse (931 of 1727)
PASS: lldb-Unit :: Utility/./UtilityTests/StringListTest.DefaultConstructor (932 of 1727)
PASS: lldb-Unit :: Utility/./UtilityTests/StringExtractorTest.GetHexBytesAvail_OddPair2 (933 of 1727)
PASS: lldb-Suite :: lang/objc/modules/TestObjCModules.py (934 of 1727)
PASS: lldb-Unit :: Utility/./UtilityTests/RegularExpression.Match (935 of 1727)
PASS: lldb-Unit :: Utility/./UtilityTests/Flags.Clear (936 of 1727)
PASS: lldb-Suite :: functionalities/thread/concurrent_events/TestConcurrentTwoBreakpointsOneDelaySignal.py (937 of 1727)
PASS: lldb-Unit :: Utility/./UtilityTests/BinaryStreamTest.PutULEB128EightBytes (938 of 1727)
PASS: lldb-Suite :: functionalities/thread/concurrent_events/TestConcurrentCrashWithWatchpointBreakpointSignal.py (939 of 1727)
PASS: lldb-Suite :: functionalities/wrong_commands/TestWrongCommands.py (940 of 1727)
UNSUPPORTED: LLDB :: Process/Windows/exception_access_violation.cpp (941 of 1727)
PASS: lldb-Suite :: python_api/lldbutil/frame/TestFrameUtils.py (942 of 1727)
PASS: lldb-Suite :: commands/expression/ir-interpreter/TestIRInterpreter.py (943 of 1727)
PASS: LLDB :: Minidump/disassemble-no-module.yaml (944 of 1727)
PASS: lldb-Unit :: Host/./HostTests/FileSystemTest.FileAndDirectoryComponents (945 of 1727)
PASS: lldb-Suite :: types/TestDoubleTypesExpr.py (946 of 1727)
PASS: lldb-Suite :: functionalities/data-formatter/data-formatter-smart-array/TestDataFormatterSmartArray.py (947 of 1727)
PASS: lldb-Unit :: UnwindAssembly/x86/./UnwindAssemblyx86Tests/Testx86AssemblyInspectionEngine.TestStackRealign8BitDisp_i386 (948 of 1727)
PASS: lldb-Unit :: Utility/./UtilityTests/UriParserTest.BadPort2 (949 of 1727)
PASS: lldb-Suite :: functionalities/thread/thread_exit/TestThreadExit.py (950 of 1727)
PASS: lldb-Suite :: functionalities/darwin_log/filter/exact_match/category/TestDarwinLogFilterMatchCategory.py (951 of 1727)
PASS: lldb-Suite :: lang/objc/objc-optimized/TestObjcOptimized.py (952 of 1727)
PASS: lldb-Suite :: commands/add-dsym/uuid/TestAddDsymCommand.py (953 of 1727)
PASS: lldb-Suite :: functionalities/object-file/TestImageListMultiArchitecture.py (954 of 1727)
PASS: lldb-Unit :: Utility/./UtilityTests/StreamTest.ShiftOperatorStrings (955 of 1727)
PASS: lldb-Unit :: Utility/./UtilityTests/BinaryStreamTest.PutULEB128MaxValue (956 of 1727)
PASS: lldb-Unit :: Process/minidump/./LLDBMinidumpTests/MinidumpParserTest.GetMemoryRegionInfoFromMemory64List (957 of 1727)
PASS: lldb-Unit :: Utility/./UtilityTests/StringListTest.JoinEmpty (958 of 1727)
PASS: lldb-Unit :: Process/minidump/./LLDBMinidumpTests/RegisterContextMinidump.ConvertMinidumpContext_x86_64 (959 of 1727)
PASS: lldb-Suite :: functionalities/data-formatter/var-in-aggregate-misuse/TestVarInAggregateMisuse.py (960 of 1727)
PASS: lldb-Unit :: Interpreter/./InterpreterTests/OptionArgParserTest.toBoolean (961 of 1727)
PASS: lldb-Suite :: python_api/sbtype_typeclass/TestSBTypeTypeClass.py (962 of 1727)
PASS: lldb-Suite :: functionalities/breakpoint/objc/TestObjCBreakpoints.py (963 of 1727)
PASS: lldb-Unit :: ScriptInterpreter/Python/./ScriptInterpreterPythonTests/PythonDataObjectsTest.TestPythonTupleInitializerList2 (964 of 1727)
PASS: lldb-Unit :: Utility/./UtilityTests/UriParserTest.MinimalPort (965 of 1727)
PASS: lldb-Unit :: Utility/./UtilityTests/ArgsTest.ReplaceArgumentAtIndexFarOutOfRange (966 of 1727)
UNSUPPORTED: LLDB :: SymbolFile/PDB/class-layout.test (967 of 1727)
PASS: lldb-Unit :: Utility/./UtilityTests/DataExtractorTest.GetMaxU64 (968 of 1727)
PASS: lldb-Suite :: functionalities/data-formatter/data-formatter-objc/TestDataFormatterObjCKVO.py (969 of 1727)
PASS: lldb-Unit :: Language/Highlighting/./HighlighterTests/HighlighterTest.DefaultHighlighter (970 of 1727)
PASS: lldb-Unit :: Utility/./UtilityTests/UriParserTest.Minimal (971 of 1727)
PASS: lldb-Unit :: Language/Highlighting/./HighlighterTests/HighlighterTest.ClangCursorPosAfterOtherToken (972 of 1727)
PASS: lldb-Unit :: UnwindAssembly/x86/./UnwindAssemblyx86Tests/Testx86AssemblyInspectionEngine.TestPushRBPWithREX (973 of 1727)
PASS: lldb-Unit :: Utility/./UtilityTests/BinaryStreamTest.PutSLEB128OneByte (974 of 1727)
PASS: LLDB :: SymbolFile/NativePDB/nested-types.cpp (975 of 1727)
PASS: LLDB :: SymbolFile/DWARF/dir-separator-no-comp-dir-relative-name.s (976 of 1727)
PASS: LLDB :: Register/x86-64-read.test (977 of 1727)
PASS: lldb-Suite :: commands/watchpoints/multiple_threads/TestWatchpointMultipleThreads.py (978 of 1727)
PASS: lldb-Unit :: Process/gdb-remote/./ProcessGdbRemoteTests/GDBRemoteCommunicationClientTest.WriteRegister (979 of 1727)
PASS: lldb-Unit :: ScriptInterpreter/Python/./ScriptInterpreterPythonTests/PythonDataObjectsTest.TestPythonBoolean (980 of 1727)
PASS: lldb-Unit :: Utility/./UtilityTests/LogChannelTest.EnableOptions (981 of 1727)
PASS: lldb-Unit :: Utility/./UtilityTests/StringExtractorTest.GetHexU8_Underflow2_NoEof (982 of 1727)
PASS: LLDB :: Quit/TestQuitExitCode0.test (983 of 1727)
PASS: lldb-Suite :: api/multithreaded/TestMultithreaded.py (984 of 1727)
PASS: LLDB :: Reproducer/Functionalities/TestDataFormatter.test (985 of 1727)
PASS: lldb-Unit :: UnwindAssembly/x86/./UnwindAssemblyx86Tests/Testx86AssemblyInspectionEngine.TestPushR14 (986 of 1727)
PASS: lldb-Suite :: functionalities/conditional_break/TestConditionalBreak.py (987 of 1727)
PASS: lldb-Suite :: lang/objc/single-entry-dictionary/TestObjCSingleEntryDictionary.py (988 of 1727)
PASS: lldb-Suite :: functionalities/gdb_remote_client/TestStopPCs.py (989 of 1727)
PASS: lldb-Suite :: functionalities/tsan/multiple/TestTsanMultiple.py (990 of 1727)
PASS: lldb-Unit :: Core/./LLDBCoreTests/StreamCallbackTest.Callback (991 of 1727)
PASS: LLDB :: SymbolFile/NativePDB/ast-types.cpp (992 of 1727)
PASS: LLDB :: SymbolFile/DWARF/debug-types-basic.test (993 of 1727)
PASS: LLDB :: Expr/TestTypeOfDeclTypeExpr.test (994 of 1727)
PASS: lldb-Unit :: Utility/./UtilityTests/OptionsWithRawTest.EmptySuffixSingleWhitespace (995 of 1727)
PASS: lldb-Unit :: Utility/./UtilityTests/StringExtractorTest.GetHexU8_Extra_NoEof (996 of 1727)
PASS: lldb-Unit :: Utility/./UtilityTests/ScalarTest.RightShiftOperator (997 of 1727)
PASS: lldb-Suite :: functionalities/gdb_remote_client/TestRecognizeBreakpoint.py (998 of 1727)
PASS: lldb-Suite :: lang/cpp/const_this/TestConstThis.py (999 of 1727)
PASS: lldb-Suite :: functionalities/tail_call_frames/disambiguate_tail_call_seq/TestDisambiguateTailCallSeq.py (1000 of 1727)
PASS: lldb-Suite :: functionalities/thread/concurrent_events/TestConcurrentCrashWithSignal.py (1001 of 1727)
PASS: lldb-Unit :: Utility/./UtilityTests/StringLexerTest.NextIfList (1002 of 1727)
PASS: lldb-Unit :: tools/lldb-server/tests/./LLDBServerTests/StandardStartupTest.TestStopReplyContainsThreadPcs (1003 of 1727)
PASS: lldb-Suite :: tools/lldb-server/TestGdbRemoteAuxvSupport.py (1004 of 1727)
PASS: LLDB :: Reproducer/TestSynchronous.test (1005 of 1727)
PASS: lldb-Suite :: commands/platform/basic/TestPlatformPython.py (1006 of 1727)
PASS: lldb-Suite :: functionalities/step_scripted/TestStepScripted.py (1007 of 1727)
PASS: lldb-Suite :: functionalities/breakpoint/comp_dir_symlink/TestCompDirSymLink.py (1008 of 1727)
PASS: lldb-Suite :: functionalities/data-formatter/data-formatter-stl/libstdcpp/smart_ptr/TestDataFormatterStdSmartPtr.py (1009 of 1727)
PASS: lldb-Suite :: sample_test/TestSampleInlineTest.py (1010 of 1727)
PASS: lldb-Unit :: Utility/./UtilityTests/StringListTest.AppendStringMove (1011 of 1727)
PASS: lldb-Suite :: commands/gui/basic/TestGuiBasic.py (1012 of 1727)
PASS: lldb-Unit :: Utility/./UtilityTests/ArchSpecTest.TestParseMachCPUDashSubtypeTripleExtra (1013 of 1727)
PASS: lldb-Suite :: lang/objcxx/cxx-bridged-po/TestObjCXXBridgedPO.py (1014 of 1727)
PASS: lldb-Unit :: Utility/./UtilityTests/AnsiTerminal.Incomplete (1015 of 1727)
PASS: lldb-Unit :: Utility/./UtilityTests/StreamTest.PutCStringWithStringRef (1016 of 1727)
PASS: lldb-Unit :: ScriptInterpreter/Python/./ScriptInterpreterPythonTests/PythonDataObjectsTest.TestPythonListValueEquality (1017 of 1727)
PASS: lldb-Suite :: commands/expression/calculator_mode/TestCalculatorMode.py (1018 of 1727)
PASS: lldb-Unit :: Utility/./UtilityTests/StringListTest.JoinSingle (1019 of 1727)
PASS: lldb-Unit :: Utility/./UtilityTests/OptionsWithRawTest.UnterminatedQuote (1020 of 1727)
PASS: lldb-Suite :: lang/cpp/chained-calls/TestCppChainedCalls.py (1021 of 1727)
UNSUPPORTED: LLDB :: SymbolFile/PDB/enums-layout.test (1022 of 1727)
PASS: lldb-Suite :: lang/cpp/template/TestTemplateArgs.py (1023 of 1727)
PASS: lldb-Suite :: tools/lldb-server/TestGdbRemoteKill.py (1024 of 1727)
UNSUPPORTED: LLDB :: SymbolFile/NativePDB/stack_unwinding01.cpp (1025 of 1727)
PASS: lldb-Unit :: Utility/./UtilityTests/BinaryStreamTest.PutSLEB128FiveBytes (1026 of 1727)
PASS: lldb-Suite :: functionalities/data-formatter/data-formatter-stl/libcxx/list/TestDataFormatterLibcxxList.py (1027 of 1727)
PASS: lldb-Unit :: ScriptInterpreter/Python/./ScriptInterpreterPythonTests/PythonDataObjectsTest.TestPythonBytes (1028 of 1727)
PASS: lldb-Suite :: functionalities/thread/concurrent_events/TestConcurrentTwoWatchpointsOneSignal.py (1029 of 1727)
PASS: lldb-Unit :: Utility/./UtilityTests/ArchSpecTest.TestParseMachCPUDashSubtypeTripleSimple (1030 of 1727)
PASS: lldb-Suite :: functionalities/data-formatter/vector-types/TestVectorTypesFormatting.py (1031 of 1727)
PASS: lldb-Suite :: functionalities/data-formatter/data-formatter-disabling/TestDataFormatterDisabling.py (1032 of 1727)
PASS: lldb-Suite :: lang/objc/objc-ivar-offsets/TestObjCIvarOffsets.py (1033 of 1727)
PASS: LLDB :: Modules/ELF/netbsd-exec-8.99.30-amd64.yaml (1034 of 1727)
PASS: lldb-Unit :: Host/./HostTests/FileSystemTest.Exists (1035 of 1727)
PASS: LLDB :: BuildScript/modes.test (1036 of 1727)
PASS: lldb-Suite :: functionalities/thread/concurrent_events/TestConcurrentManyWatchpoints.py (1037 of 1727)
PASS: lldb-Suite :: functionalities/source-map/TestTargetSourceMap.py (1038 of 1727)
PASS: lldb-Unit :: debugserver/./debugserverTests/RNBSocket.LoopBackConnectIPv4 (1039 of 1727)
PASS: lldb-Unit :: Utility/./UtilityTests/ArgsTest.EscapeLLDBCommandArgument (1040 of 1727)
PASS: lldb-Unit :: Language/Highlighting/./HighlighterTests/HighlighterTest.ClangEmptyInput (1041 of 1727)
PASS: lldb-Unit :: Utility/./UtilityTests/ArchSpecTest.TestSetTriple (1042 of 1727)
PASS: LLDB :: Expr/TestIRMemoryMap.test (1043 of 1727)
PASS: lldb-Suite :: tools/lldb-server/TestGdbRemoteProcessInfo.py (1044 of 1727)
PASS: lldb-Suite :: linux/mix-dwo-and-regular-objects/TestMixedDwarfBinary.py (1045 of 1727)
PASS: lldb-Unit :: Utility/./UtilityTests/ArgsTest.GetArgumentArrayRef (1046 of 1727)
PASS: lldb-Suite :: lang/objc/print-obj/TestPrintObj.py (1047 of 1727)
PASS: lldb-Unit :: Utility/./UtilityTests/StreamTest.ShiftOperatorChars (1048 of 1727)
PASS: lldb-Suite :: macosx/queues/TestQueues.py (1049 of 1727)
PASS: lldb-Suite :: functionalities/data-formatter/data-formatter-objc/TestDataFormatterObjCPlain.py (1050 of 1727)
PASS: lldb-Suite :: types/TestFloatTypes.py (1051 of 1727)
PASS: lldb-Suite :: lang/objc/modules-incomplete/TestIncompleteModules.py (1052 of 1727)
PASS: lldb-Unit :: Process/minidump/./LLDBMinidumpTests/MinidumpParserTest.GetExceptionStream (1053 of 1727)
PASS: lldb-Unit :: Utility/./UtilityTests/FileSpecTest.EqualDotsPosix (1054 of 1727)
PASS: lldb-Suite :: functionalities/thread/concurrent_events/TestConcurrentManyBreakpoints.py (1055 of 1727)
PASS: lldb-Unit :: Utility/./UtilityTests/StreamTest.ShiftOperatorUInts (1056 of 1727)
UNSUPPORTED: LLDB :: Register/x86-64-xmm16-write.test (1057 of 1727)
PASS: lldb-Unit :: Utility/./UtilityTests/FileSpecTest.PrependPathComponent (1058 of 1727)
PASS: lldb-Suite :: functionalities/tail_call_frames/unambiguous_sequence/TestUnambiguousTailCalls.py (1059 of 1727)
PASS: lldb-Suite :: python_api/function_symbol/TestDisasmAPI.py (1060 of 1727)
PASS: lldb-Suite :: python_api/frame/get-variables/TestGetVariables.py (1061 of 1727)
PASS: lldb-Suite :: functionalities/data-formatter/data-formatter-named-summaries/TestDataFormatterNamedSummaries.py (1062 of 1727)
PASS: lldb-Suite :: commands/expression/anonymous-struct/TestCallUserAnonTypedef.py (1063 of 1727)
PASS: LLDB :: SymbolFile/DWARF/debug-types-dwo-cross-reference.cpp (1064 of 1727)
PASS: lldb-Suite :: functionalities/data-formatter/data-formatter-stl/libstdcpp/unique_ptr/TestDataFormatterStdUniquePtr.py (1065 of 1727)
PASS: lldb-Suite :: commands/apropos/with-process/TestAproposWithProcess.py (1066 of 1727)
PASS: LLDB :: Modules/ELF/PT_LOAD.yaml (1067 of 1727)
PASS: lldb-Unit :: Signals/./SignalsTests/UnixSignalsTest.VersionChange (1068 of 1727)
PASS: lldb-Suite :: python_api/lldbutil/iter/TestRegistersIterator.py (1069 of 1727)
PASS: LLDB :: SymbolFile/DWARF/debug-line-basic.s (1070 of 1727)
PASS: lldb-Suite :: functionalities/data-formatter/boolreference/TestFormattersBoolRefPtr.py (1071 of 1727)
PASS: lldb-Unit :: Process/gdb-remote/./ProcessGdbRemoteTests/GDBRemoteCommunicationClientTest.SendStopTracePacket (1072 of 1727)
PASS: lldb-Unit :: Breakpoint/./LLDBBreakpointTests/BreakpointIDTest.StringIsBreakpointName (1073 of 1727)
PASS: lldb-Suite :: macosx/nslog/TestDarwinNSLogOutput.py (1074 of 1727)
PASS: lldb-Suite :: functionalities/load_using_paths/TestLoadUsingPaths.py (1075 of 1727)
PASS: lldb-Unit :: Language/Highlighting/./HighlighterTests/HighlighterTest.ClangUnterminatedString (1076 of 1727)
PASS: lldb-Suite :: python_api/event/TestEvents.py (1077 of 1727)
PASS: lldb-Unit :: Utility/./UtilityTests/RangeTest.ContainsAddr (1078 of 1727)
PASS: lldb-Unit :: Utility/./UtilityTests/ArgsTest.TestSingleArg (1079 of 1727)
PASS: lldb-Unit :: Process/minidump/./LLDBMinidumpTests/MinidumpParserTest.GetThreadContext_x86_32_wow64 (1080 of 1727)
PASS: lldb-Unit :: Utility/./UtilityTests/VMRange.ContainsRange (1081 of 1727)
PASS: lldb-Unit :: ScriptInterpreter/Python/./ScriptInterpreterPythonTests/PythonDataObjectsTest.TestPythonTupleSize (1082 of 1727)
PASS: lldb-Unit :: Utility/./UtilityTests/StringListTest.RemoveBlankLines (1083 of 1727)
PASS: lldb-Unit :: UnwindAssembly/x86/./UnwindAssemblyx86Tests/Testx86AssemblyInspectionEngine.Test64bitFramelessBigStackFrame (1084 of 1727)
PASS: lldb-Unit :: Expression/./ExpressionTests/DiagnosticManagerTest.GetStringBasic (1085 of 1727)
PASS: lldb-Suite :: commands/settings/quoting/TestQuoting.py (1086 of 1727)
PASS: lldb-Unit :: Utility/./UtilityTests/StreamTest.PutChar (1087 of 1727)
PASS: lldb-Suite :: python_api/type/TestTypeList.py (1088 of 1727)
PASS: lldb-Unit :: Utility/./UtilityTests/Predicate.WaitForValueNotEqualTo (1089 of 1727)
UNSUPPORTED: LLDB :: Unwind/unwind-plan-dwarf-dump.test (1090 of 1727)
PASS: lldb-Unit :: UnwindAssembly/x86/./UnwindAssemblyx86Tests/Testx86AssemblyInspectionEngine.TestPushECX (1091 of 1727)
PASS: lldb-Unit :: Symbol/./SymbolTests/PostfixExpression.ToDWARF (1092 of 1727)
PASS: lldb-Suite :: functionalities/data-formatter/type_summary_list_script/TestTypeSummaryListScript.py (1093 of 1727)
PASS: lldb-Unit :: Utility/./UtilityTests/SerializationRountripTest.SerializeDeserializeObjectReference (1094 of 1727)
PASS: lldb-Unit :: Utility/./UtilityTests/StreamTest.PutRawBytesToLittleEndian (1095 of 1727)
PASS: lldb-Unit :: Utility/./UtilityTests/StreamTeeTest.Assignment (1096 of 1727)
UNSUPPORTED: LLDB :: SymbolFile/PDB/pointers.test (1097 of 1727)
PASS: lldb-Suite :: functionalities/data-formatter/user-format-vs-summary/TestUserFormatVsSummary.py (1098 of 1727)
PASS: lldb-Unit :: Utility/./UtilityTests/OptionsWithRawTest.ArgsButNoDelimiter (1099 of 1727)
PASS: lldb-Suite :: functionalities/breakpoint/breakpoint_set_restart/TestBreakpointSetRestart.py (1100 of 1727)
PASS: LLDB :: SymbolFile/DWARF/debug_rnglists.s (1101 of 1727)
PASS: lldb-Suite :: commands/expression/timeout/TestCallWithTimeout.py (1102 of 1727)
PASS: lldb-Suite :: lang/cpp/bool/TestCPPBool.py (1103 of 1727)
PASS: lldb-Suite :: functionalities/data-formatter/data-formatter-stl/libstdcpp/unique_ptr/invalid/TestDataFormatterInvalidStdUniquePtr.py (1104 of 1727)
PASS: lldb-Suite :: commands/process/attach/attach_denied/TestAttachDenied.py (1105 of 1727)
PASS: lldb-Suite :: lang/c/modules/TestCModules.py (1106 of 1727)
PASS: lldb-Unit :: Utility/./UtilityTests/LogTest.Register (1107 of 1727)
PASS: lldb-Suite :: tools/lldb-server/platform-process-connect/TestPlatformProcessConnect.py (1108 of 1727)
PASS: lldb-Unit :: UnwindAssembly/x86/./UnwindAssemblyx86Tests/Testx86AssemblyInspectionEngine.TestPopRBPWithREX (1109 of 1727)
PASS: lldb-Suite :: commands/expression/call-function/TestCallBuiltinFunction.py (1110 of 1727)
PASS: lldb-Suite :: lang/cpp/char1632_t/TestChar1632T.py (1111 of 1727)
PASS: lldb-Unit :: Language/CPlusPlus/./LanguageCPlusPlusTests/CPlusPlusLanguage.FindAlternateFunctionManglings (1112 of 1727)
PASS: lldb-Unit :: Utility/./UtilityTests/NameMatchesTest.EndsWith (1113 of 1727)
PASS: LLDB :: SymbolFile/DWARF/forward-declarations.s (1114 of 1727)
PASS: lldb-Unit :: Process/minidump/./LLDBMinidumpTests/MinidumpParserTest.FindMemoryRangeWithFullMemoryMinidump (1115 of 1727)
PASS: lldb-Unit :: Utility/./UtilityTests/VMRange.Comparison (1116 of 1727)
PASS: lldb-Suite :: lang/cpp/signed_types/TestSignedTypes.py (1117 of 1727)
PASS: lldb-Suite :: functionalities/data-formatter/hexcaps/TestDataFormatterHexCaps.py (1118 of 1727)
PASS: lldb-Unit :: Utility/./UtilityTests/OptionsWithRawTest.LeadingSpaceArgs (1119 of 1727)
PASS: lldb-Suite :: functionalities/exec/TestExec.py (1120 of 1727)
UNSUPPORTED: LLDB :: Register/x86-ymm-read.test (1121 of 1727)
PASS: lldb-Suite :: functionalities/thread/thread_specific_break_plus_condition/TestThreadSpecificBpPlusCondition.py (1122 of 1727)
PASS: lldb-Unit :: Utility/./UtilityTests/BinaryStreamTest.PutULEB128TwoBytes (1123 of 1727)
PASS: lldb-Unit :: Utility/./UtilityTests/RangeDataVector.FindEntryThatContains (1124 of 1727)
PASS: lldb-Unit :: Utility/./UtilityTests/FileSpecTest.GuessPathStyle (1125 of 1727)
PASS: lldb-Unit :: Process/gdb-remote/./ProcessGdbRemoteTests/GDBRemoteClientBaseTest.SendContinueDelegateInterface (1126 of 1727)
PASS: lldb-Unit :: Host/./HostTests/HostInfoTest.GetAugmentedArchSpec (1127 of 1727)
PASS: lldb-Unit :: ScriptInterpreter/Python/./ScriptInterpreterPythonTests/PythonDataObjectsTest.TestPythonIntegerToStructuredInteger (1128 of 1727)
PASS: lldb-Suite :: functionalities/breakpoint/source_regexp/TestSourceRegexBreakpoints.py (1129 of 1727)
PASS: lldb-Suite :: lang/c/unions/TestUnionMembers.py (1130 of 1727)
PASS: lldb-Suite :: functionalities/pre_run_dylibs/TestPreRunDylibs.py (1131 of 1727)
PASS: lldb-Unit :: Interpreter/./InterpreterTests/CompletionTest.DirCompletionUsername (1132 of 1727)
PASS: lldb-Suite :: commands/expression/call-function/TestCallStopAndContinue.py (1133 of 1727)
PASS: lldb-Suite :: functionalities/thread/concurrent_events/TestConcurrentSignalDelayWatch.py (1134 of 1727)
PASS: LLDB :: Reproducer/TestDriverOptions.test (1135 of 1727)
PASS: lldb-Unit :: Expression/./ExpressionTests/DiagnosticManagerTest.GetStringMultipleDiags (1136 of 1727)
PASS: lldb-Suite :: functionalities/data-formatter/data-formatter-cpp/TestDataFormatterCpp.py (1137 of 1727)
PASS: lldb-Unit :: Process/minidump/./LLDBMinidumpTests/MinidumpParserTest.GetMemoryRegionInfoLinuxMaps (1138 of 1727)
PASS: lldb-Unit :: ObjectFile/Breakpad/./ObjectFileBreakpadTests/InfoRecord.parse (1139 of 1727)
PASS: lldb-Suite :: lang/cpp/breakpoint-commands/TestCPPBreakpointCommands.py (1140 of 1727)
PASS: lldb-Unit :: Utility/./UtilityTests/ArgsTest.ReplaceArgumentAtIndexEqual (1141 of 1727)
PASS: lldb-Suite :: functionalities/signal/handle-abrt/TestHandleAbort.py (1142 of 1727)
PASS: lldb-Suite :: benchmarks/continue/TestBenchmarkContinue.py (1143 of 1727)
PASS: LLDB :: Commands/command-backtrace.test (1144 of 1727)
PASS: lldb-Suite :: functionalities/breakpoint/breakpoint_command/TestRegexpBreakCommand.py (1145 of 1727)
PASS: lldb-Suite :: api/multiple-targets/TestMultipleTargets.py (1146 of 1727)
PASS: lldb-Suite :: macosx/universal/TestUniversal.py (1147 of 1727)
PASS: lldb-Unit :: Utility/./UtilityTests/RangeTest.NotEqual (1148 of 1727)
PASS: lldb-Suite :: tools/lldb-server/TestGdbRemote_qThreadStopInfo.py (1149 of 1727)
PASS: LLDB :: Modules/Breakpad/discontiguous-sections.test (1150 of 1727)
PASS: lldb-Unit :: Utility/./UtilityTests/AnsiTerminal.WhiteSpace (1151 of 1727)
PASS: lldb-Unit :: UnwindAssembly/x86/./UnwindAssemblyx86Tests/Testx86AssemblyInspectionEngine.TestSimplei386ugmented (1152 of 1727)
PASS: lldb-Unit :: Utility/./UtilityTests/StreamTest.PutCharWhitespace (1153 of 1727)
PASS: lldb-Unit :: Language/CPlusPlus/./LanguageCPlusPlusTests/CPlusPlusLanguage.MethodNameParsing (1154 of 1727)
FAIL: lldb-Suite :: commands/expression/multiline-completion/TestMultilineCompletion.py (1155 of 1727)
******************** TEST 'lldb-Suite :: commands/expression/multiline-completion/TestMultilineCompletion.py' FAILED ********************
lldb version 10.0.99 (http://labmaster3.local/git/llvm-project.git revision a767a0688b096f4c8188a484f08a3f77bab0ce73)
  clang revision a767a0688b096f4c8188a484f08a3f77bab0ce73
  llvm revision a767a0688b096f4c8188a484f08a3f77bab0ce73
LLDB library dir: /Users/buildslave/jenkins/workspace/lldb-cmake-sanitized/lldb-build/bin
LLDB import library dir: /Users/buildslave/jenkins/workspace/lldb-cmake-sanitized/lldb-build/bin
libstdcxx tests will not be run because: Don't know how to build with libstdcxx on macosx
Skipping following debug info categories: ['dwo']
(lldb) settings set symbols.enable-external-lookup false
(lldb) settings set plugin.process.gdb-remote.packet-timeout 60
(lldb) settings set symbols.clang-modules-cache-path "/Users/buildslave/jenkins/workspace/lldb-cmake-sanitized/lldb-build/tools/lldb/lldb-test-build.noindex/module-cache-lldb"
(lldb) settings set use-color false
(lldb) target create "/Users/buildslave/jenkins/workspace/lldb-cmake-sanitized/lldb-build/tools/lldb/lldb-test-build.noindex/commands/expression/multiline-completion/TestMultilineCompletion.test_basic_completion/a.out"
Current executable set to '/Users/buildslave/jenkins/workspace/lldb-cmake-sanitized/lldb-build/tools/lldb/lldb-test-build.noindex/commands/expression/multiline-completion/TestMultilineCompletion.test_basic_completion/a.out' (x86_64).
(lldb) b main
b main
Breakpoint 1: where = a.out`main + 18 at main.c:2:7, address = 0x0000000100000fa2
(lldb) run
run
Process 14811 launched: '/Users/buildslave/jenkins/workspace/lldb-cmake-sanitized/lldb-build/tools/lldb/lldb-test-build.noindex/commands/expression/multiline-completion/TestMultilineCompletion.test_basic_completion/a.out' (x86_64)
Process 14811 stopped
* thread #1, queue = 'com.apple.main-thread', stop reason = breakpoint 1.1
    frame #0: 0x0000000100000fa2 a.out`main(argc=1, argv=0x00007ffeefbff4d0) at main.c:2:7
   1   	int main(int argc, char **argv) {
-> 2   	  int to_complete = 0;
    	      ^
   3   	  return to_complete;
   4   	}
(lldb) expr
expr
Enter expressions, then terminate with an empty line to evaluate:
to_	  1:    1: to_	to_
  1: to_complete 

  1: to_complete  
  2:    2: 
(int) $0 = 0
(lldb) settings set interpreter.prompt-on-quit false

Session logs for test failures/errors/unexpected successes will go into directory '/Users/buildslave/jenkins/workspace/lldb-cmake-sanitized/test/logs'
Command invoked: /Users/buildslave/jenkins/workspace/lldb-cmake-sanitized/llvm-project/lldb/test/dotest.py --arch=x86_64 -s /Users/buildslave/jenkins/workspace/lldb-cmake-sanitized/lldb-build/lldb-test-traces -S nm -u CXXFLAGS -u CFLAGS --executable /Users/buildslave/jenkins/workspace/lldb-cmake-sanitized/lldb-build/./bin/lldb --dsymutil /Users/buildslave/jenkins/workspace/lldb-cmake-sanitized/lldb-build/./bin/dsymutil --filecheck /Users/buildslave/jenkins/workspace/lldb-cmake-sanitized/lldb-build/./bin/FileCheck -C /Users/buildslave/jenkins/workspace/lldb-cmake-sanitized/host-compiler/bin/clang --codesign-identity lldb_codesign --server /Users/buildslave/jenkins/workspace/lldb-cmake-sanitized/lldb-build/./bin/debugserver --arch x86_64 --build-dir /Users/buildslave/jenkins/workspace/lldb-cmake-sanitized/lldb-build/lldb-test-build.noindex -s=/Users/buildslave/jenkins/workspace/lldb-cmake-sanitized/test/logs -t --env TERM=vt100 --env LLVM_LIBS_DIR=/Users/buildslave/jenkins/workspace/lldb-cmake-sanitized/lldb-build/./lib --build-dir /Users/buildslave/jenkins/workspace/lldb-cmake-sanitized/lldb-build/tools/lldb/lldb-test-build.noindex --module-cache-dir /Users/buildslave/jenkins/workspace/lldb-cmake-sanitized/lldb-build/tools/lldb/lldb-test-build.noindex/module-cache-lldb /Users/buildslave/jenkins/workspace/lldb-cmake-sanitized/llvm-project/lldb/packages/Python/lldbsuite/test/commands/expression/multiline-completion -p TestMultilineCompletion.py
Change dir to: /Users/buildslave/jenkins/workspace/lldb-cmake-sanitized/llvm-project/lldb/packages/Python/lldbsuite/test/commands/expression/multiline-completion
runCmd: settings set symbols.enable-external-lookup false
output: 

runCmd: settings set plugin.process.gdb-remote.packet-timeout 60
output: 

runCmd: settings set symbols.clang-modules-cache-path "/Users/buildslave/jenkins/workspace/lldb-cmake-sanitized/lldb-build/tools/lldb/lldb-test-build.noindex/module-cache-lldb"
output: 

runCmd: settings set use-color false
output: 

FAIL: LLDB (/Users/buildslave/jenkins/workspace/lldb-cmake-sanitized/host-compiler/bin/clang-10-x86_64) :: test_basic_completion (TestMultilineCompletion.MultilineCompletionTest)
tearing down the child process....

CLEANUP ERROR: LLDB (/Users/buildslave/jenkins/workspace/lldb-cmake-sanitized/host-compiler/bin/clang-10-x86_64) :: test_basic_completion (TestMultilineCompletion.MultilineCompletionTest)
Restore dir to: /Users/buildslave/jenkins/workspace/lldb-cmake-sanitized/lldb-build/tools/lldb/lit
======================================================================
ERROR: test_basic_completion (TestMultilineCompletion.MultilineCompletionTest)
   Test that we can complete a simple multiline expression
----------------------------------------------------------------------
Traceback (most recent call last):
  File "/Users/buildslave/jenkins/workspace/lldb-cmake-sanitized/llvm-project/lldb/packages/Python/lldbsuite/test/commands/expression/multiline-completion/TestMultilineCompletion.py", line 30, in test_basic_completion
    self.quit()
  File "/Users/buildslave/jenkins/workspace/lldb-cmake-sanitized/llvm-project/lldb/packages/Python/lldbsuite/test/lldbpexpect.py", line 61, in quit
    self.child.close(force=not gracefully)
  File "/Users/buildslave/jenkins/workspace/lldb-cmake-sanitized/llvm-project/lldb/third_party/Python/module/pexpect-4.6/pexpect/pty_spawn.py", line 327, in close
    self.ptyproc.close(force=force)
  File "/System/Library/Frameworks/Python.framework/Versions/2.7/lib/python2.7/contextlib.py", line 35, in __exit__
    self.gen.throw(type, value, traceback)
  File "/Users/buildslave/jenkins/workspace/lldb-cmake-sanitized/llvm-project/lldb/third_party/Python/module/pexpect-4.6/pexpect/pty_spawn.py", line 25, in _wrap_ptyprocess_err
    raise ExceptionPexpect(*e.args)
ExceptionPexpect: Could not terminate the child.
Config=x86_64-/Users/buildslave/jenkins/workspace/lldb-cmake-sanitized/host-compiler/bin/clang-10
----------------------------------------------------------------------
Ran 1 test in 6.215s

RESULT: FAILED (0 passes, 0 failures, 1 errors, 0 skipped, 0 expected failures, 0 unexpected successes)

********************
PASS: lldb-Suite :: api/log/TestAPILog.py (1156 of 1727)
PASS: lldb-Suite :: tools/lldb-server/libraries-svr4/TestGdbRemoteLibrariesSvr4Support.py (1157 of 1727)
PASS: LLDB :: Settings/TestSettingsSet.test (1158 of 1727)
PASS: lldb-Unit :: Utility/./UtilityTests/StringListTest.InsertStringAtIndexOutOfBounds (1159 of 1727)
PASS: lldb-Suite :: macosx/duplicate-archive-members/TestDuplicateMembers.py (1160 of 1727)
PASS: LLDB :: Settings/TestStopCommandSourceOnError.test (1161 of 1727)
PASS: lldb-Unit :: Utility/./UtilityTests/StringLexerTest.AdvanceIf (1162 of 1727)
PASS: LLDB :: Driver/TestProcessAttach.test (1163 of 1727)
PASS: lldb-Unit :: Utility/./UtilityTests/UriParserTest.LongPath (1164 of 1727)
PASS: lldb-Unit :: Utility/./UtilityTests/AnsiTerminal.Unknown (1165 of 1727)
PASS: LLDB :: SymbolFile/DWARF/find-variable-dwo.cpp (1166 of 1727)
PASS: lldb-Suite :: functionalities/data-formatter/data-formatter-objc/TestDataFormatterObjCNSError.py (1167 of 1727)
PASS: lldb-Suite :: lang/c/blocks/TestBlocks.py (1168 of 1727)
PASS: lldb-Unit :: Utility/./UtilityTests/StreamTest.PutBytesAsRawHex8ToLittleEndian (1169 of 1727)
PASS: lldb-Suite :: lang/cpp/unicode-literals/TestUnicodeLiterals.py (1170 of 1727)
PASS: lldb-Suite :: lang/cpp/offsetof/TestOffsetofCpp.py (1171 of 1727)
PASS: lldb-Unit :: Language/Highlighting/./HighlighterTests/HighlighterTest.ClangCursorPosInOtherToken (1172 of 1727)
PASS: LLDB :: Driver/TestRepl.test (1173 of 1727)
PASS: lldb-Suite :: functionalities/thread/break_after_join/TestBreakAfterJoin.py (1174 of 1727)
PASS: lldb-Suite :: lang/objc/orderedset/TestOrderedSet.py (1175 of 1727)
PASS: lldb-Unit :: Utility/./UtilityTests/StringExtractorTest.GetHexU8_Underflow (1176 of 1727)
PASS: lldb-Suite :: lang/cpp/limit-debug-info/TestWithLimitDebugInfo.py (1177 of 1727)
PASS: LLDB :: SymbolFile/NativePDB/source-list.cpp (1178 of 1727)
PASS: lldb-Suite :: macosx/thread-names/TestInterruptThreadNames.py (1179 of 1727)
PASS: lldb-Suite :: functionalities/data-formatter/data-formatter-stl/libcxx/optional/TestDataFormatterLibcxxOptional.py (1180 of 1727)
PASS: lldb-Unit :: Utility/./UtilityTests/UriParserTest.SchemeHostSeparator (1181 of 1727)
PASS: lldb-Suite :: functionalities/tail_call_frames/thread_step_out_or_return/TestSteppingOutWithArtificialFrames.py (1182 of 1727)
PASS: lldb-Unit :: Utility/./UtilityTests/StreamTeeTest.SetStreamAtIndexOverwrite (1183 of 1727)
PASS: lldb-Unit :: Process/gdb-remote/./ProcessGdbRemoteTests/GDBRemoteClientBaseTest.InterruptNoResponse (1184 of 1727)
PASS: lldb-Suite :: commands/frame/diagnose/virtual-method-call/TestDiagnoseDereferenceVirtualMethodCall.py (1185 of 1727)
PASS: lldb-Suite :: functionalities/tail_call_frames/thread_step_out_message/TestArtificialFrameStepOutMessage.py (1186 of 1727)
PASS: LLDB :: SymbolFile/NativePDB/globals-bss.cpp (1187 of 1727)
PASS: lldb-Suite :: lang/objc/conflicting-definition/TestConflictingDefinition.py (1188 of 1727)
PASS: lldb-Suite :: functionalities/data-formatter/data-formatter-skip-summary/TestDataFormatterSkipSummary.py (1189 of 1727)
PASS: lldb-Suite :: functionalities/data-formatter/synthupdate/TestSyntheticFilterRecompute.py (1190 of 1727)
PASS: lldb-Suite :: commands/expression/completion-crash-incomplete-record/TestCompletionCrashIncompleteRecord.py (1191 of 1727)
PASS: lldb-Suite :: lang/cpp/printf/TestPrintf.py (1192 of 1727)
PASS: lldb-Suite :: functionalities/breakpoint/breakpoint_language/TestBreakpointLanguage.py (1193 of 1727)
PASS: LLDB :: SymbolFile/NativePDB/ast-methods.cpp (1194 of 1727)
PASS: lldb-Unit :: Utility/./UtilityTests/StringListTest.GetMaxStringLengthEqualSize (1195 of 1727)
PASS: lldb-Unit :: Utility/./UtilityTests/UriParserTest.TypicalPortPath (1196 of 1727)
PASS: lldb-Suite :: lang/cpp/virtual-overload/TestVirtualOverload.py (1197 of 1727)
PASS: lldb-Unit :: Host/./HostTests/HostInfoTest.GetHostname (1198 of 1727)
PASS: lldb-Unit :: Utility/./UtilityTests/StringExtractorTest.GetHexBytes_FullString (1199 of 1727)
PASS: lldb-Unit :: Utility/./UtilityTests/RangeTest.Slide (1200 of 1727)
PASS: lldb-Suite :: functionalities/thread/concurrent_events/TestConcurrentManySignals.py (1201 of 1727)
PASS: LLDB :: Modules/ELF/duplicate-section.yaml (1202 of 1727)
PASS: lldb-Suite :: commands/expression/import-std-module/forward_list-basic/TestBasicForwardList.py (1203 of 1727)
PASS: lldb-Unit :: Utility/./UtilityTests/StringExtractorTest.GetHexBytes_OddPair (1204 of 1727)
PASS: lldb-Unit :: ScriptInterpreter/Python/./ScriptInterpreterPythonTests/PythonDataObjectsTest.TestPythonStringToStr (1205 of 1727)
PASS: lldb-Suite :: functionalities/value_md5_crash/TestValueMD5Crash.py (1206 of 1727)
PASS: LLDB :: Heap/heap-cstr.test (1207 of 1727)
PASS: lldb-Unit :: Utility/./UtilityTests/OptionsWithRawTest.WhitespaceSuffix (1208 of 1727)
PASS: lldb-Suite :: functionalities/thread/concurrent_events/TestConcurrentWatchBreak.py (1209 of 1727)
PASS: lldb-Suite :: functionalities/data-formatter/data-formatter-stl/libstdcpp/map/TestDataFormatterStdMap.py (1210 of 1727)
UNSUPPORTED: LLDB :: ExecControl/StopHook/stop-hook-threads.test (1211 of 1727)
PASS: lldb-Suite :: functionalities/memory-region/TestMemoryRegion.py (1212 of 1727)
PASS: lldb-Unit :: Utility/./UtilityTests/StringExtractorTest.InitMisc (1213 of 1727)
PASS: lldb-Unit :: Symbol/./SymbolTests/TestClangASTContext.TestBuiltinTypeForEncodingAndBitSize (1214 of 1727)
PASS: lldb-Suite :: functionalities/tty/TestTerminal.py (1215 of 1727)
PASS: lldb-Unit :: Utility/./UtilityTests/StringListTest.GetSize (1216 of 1727)
PASS: lldb-Suite :: commands/command/script/import/TestImport.py (1217 of 1727)
PASS: lldb-Unit :: Language/Highlighting/./HighlighterTests/HighlighterTest.Keywords (1218 of 1727)
PASS: lldb-Unit :: Utility/./UtilityTests/StreamTest.PutBytesAsRawHex8ToBigEndian (1219 of 1727)
PASS: lldb-Unit :: ScriptInterpreter/Python/./ScriptInterpreterPythonTests/PythonDataObjectsTest.TestResetting (1220 of 1727)
PASS: lldb-Unit :: Host/./HostTests/ProcessLaunchInfoTest.Constructor (1221 of 1727)
PASS: lldb-Suite :: lang/objc/modules-auto-import/TestModulesAutoImport.py (1222 of 1727)
PASS: lldb-Unit :: Expression/./ExpressionTests/DiagnosticManagerTest.AddDiagnostic (1223 of 1727)
PASS: LLDB :: Modules/ELF/PT_LOAD-overlap-PT_INTERP.yaml (1224 of 1727)
PASS: LLDB :: Minidump/Windows/find-module.test (1225 of 1727)
PASS: lldb-Suite :: functionalities/thread/concurrent_events/TestConcurrentWatchBreakDelay.py (1226 of 1727)
PASS: lldb-Unit :: Utility/./UtilityTests/StringListTest.SplitIntoLinesEmpty (1227 of 1727)
PASS: lldb-Unit :: Language/Highlighting/./HighlighterTests/HighlighterTest.ClangCursorOutOfBounds (1228 of 1727)
PASS: lldb-Suite :: functionalities/thread/create_during_step/TestCreateDuringStep.py (1229 of 1727)
PASS: lldb-Unit :: Utility/./UtilityTests/ArgsTest.ReplaceArgumentAtIndexOutOfRange (1230 of 1727)
PASS: lldb-Suite :: tools/lldb-server/signal-filtering/TestGdbRemote_QPassSignals.py (1231 of 1727)
PASS: lldb-Suite :: python_api/exprpath_synthetic/TestExprPathSynthetic.py (1232 of 1727)
PASS: lldb-Suite :: functionalities/breakpoint/step_over_breakpoint/TestStepOverBreakpoint.py (1233 of 1727)
PASS: lldb-Unit :: Utility/./UtilityTests/StateTest.Formatv (1234 of 1727)
UNSUPPORTED: LLDB :: Register/x86-64-xmm16-read.test (1235 of 1727)
PASS: lldb-Suite :: commands/expression/dont_allow_jit/TestAllowJIT.py (1236 of 1727)
PASS: lldb-Suite :: lang/cpp/namespace_conflicts/TestNamespaceConflicts.py (1237 of 1727)
PASS: lldb-Unit :: Symbol/./SymbolTests/DWARFCallFrameInfoTest.Basic_dwarf3 (1238 of 1727)
PASS: lldb-Suite :: python_api/lldbutil/TestSwigVersion.py (1239 of 1727)
PASS: lldb-Suite :: functionalities/recursion/TestValueObjectRecursion.py (1240 of 1727)
PASS: lldb-Suite :: functionalities/data-formatter/data-formatter-objc/TestDataFormatterObjCNSURL.py (1241 of 1727)
PASS: lldb-Suite :: terminal/TestSTTYBeforeAndAfter.py (1242 of 1727)
PASS: lldb-Unit :: Utility/./UtilityTests/LogChannelEnabledTest.LogGetLogThread (1243 of 1727)
PASS: LLDB :: Breakpoint/debug_addrx.test (1244 of 1727)
PASS: lldb-Suite :: functionalities/thread/concurrent_events/TestConcurrentDelayedCrashWithBreakpointWatchpoint.py (1245 of 1727)
PASS: lldb-Unit :: Utility/./UtilityTests/ListenerTest.GetEventImmediate (1246 of 1727)
PASS: lldb-Suite :: tools/lldb-server/thread-name/TestGdbRemoteThreadName.py (1247 of 1727)
PASS: lldb-Suite :: lang/cpp/class_types/TestClassTypes.py (1248 of 1727)
PASS: lldb-Unit :: Utility/./UtilityTests/StringListTest.ForRangeEmpty (1249 of 1727)
PASS: lldb-Unit :: UnwindAssembly/x86/./UnwindAssemblyx86Tests/Testx86AssemblyInspectionEngine.TestStackRealignMSVC_i386 (1250 of 1727)
PASS: lldb-Unit :: Process/gdb-remote/./ProcessGdbRemoteTests/GDBRemoteClientBaseTest.SendContinueAndAsyncPacket (1251 of 1727)
PASS: lldb-Suite :: tools/lldb-server/TestGdbRemoteExpeditedRegisters.py (1252 of 1727)
PASS: LLDB :: SymbolFile/DWARF/find-basic-namespace.cpp (1253 of 1727)
PASS: lldb-Unit :: Core/./LLDBCoreTests/RichManglingContextTest.SwitchProvider (1254 of 1727)
PASS: lldb-Unit :: Process/gdb-remote/./ProcessGdbRemoteTests/GDBRemoteCommunicationClientTest.GetModulesInfo_UUID20 (1255 of 1727)
PASS: lldb-Unit :: UnwindAssembly/x86/./UnwindAssemblyx86Tests/Testx86AssemblyInspectionEngine.TestPopRBX (1256 of 1727)
PASS: lldb-Unit :: ScriptInterpreter/Python/./ScriptInterpreterPythonTests/PythonDataObjectsTest.TestPythonListToStructuredList (1257 of 1727)
PASS: lldb-Unit :: Utility/./UtilityTests/LogChannelTest.Enable (1258 of 1727)
PASS: lldb-Unit :: Utility/./UtilityTests/ArgsTest.TestAppendArg (1259 of 1727)
PASS: lldb-Suite :: lang/objc/objc-new-syntax/TestObjCNewSyntaxArray.py (1260 of 1727)
PASS: lldb-Suite :: functionalities/target-new-solib-notifications/TestModuleLoadedNotifys.py (1261 of 1727)
PASS: lldb-Unit :: Process/minidump/./LLDBMinidumpTests/MinidumpParserTest.GetMemoryRegionInfo (1262 of 1727)
PASS: lldb-Suite :: functionalities/type_lookup/TestTypeLookup.py (1263 of 1727)
PASS: lldb-Unit :: Utility/./UtilityTests/ReproducerTest.SetReplay (1264 of 1727)
PASS: lldb-Suite :: functionalities/data-formatter/ptr_ref_typedef/TestPtrRef2Typedef.py (1265 of 1727)
PASS: lldb-Unit :: Utility/./UtilityTests/OptionsWithRawTest.WhitespaceInput (1266 of 1727)
PASS: lldb-Unit :: Utility/./UtilityTests/ArgsTest.ReplaceArgumentAtIndexShort (1267 of 1727)
PASS: lldb-Unit :: Host/./HostTests/FileSystemTest.EnumerateDirectory (1268 of 1727)
PASS: lldb-Suite :: functionalities/thread/concurrent_events/TestConcurrentSignalNWatchNBreak.py (1269 of 1727)
PASS: lldb-Suite :: android/platform/TestDefaultCacheLineSize.py (1270 of 1727)
UNSUPPORTED: LLDB :: Breakpoint/ppc64-localentry.test (1271 of 1727)
PASS: lldb-Unit :: Signals/./SignalsTests/UnixSignalsTest.GetInfo (1272 of 1727)
PASS: lldb-Unit :: Process/gdb-remote/./ProcessGdbRemoteTests/GDBRemoteCommunicationServerTest.SendErrorResponse_Status (1273 of 1727)
PASS: lldb-Unit :: ObjectFile/ELF/./ObjectFileELFTests/ObjectFileELFTest.SectionsResolveConsistently (1274 of 1727)
PASS: lldb-Suite :: commands/expression/import-std-module/unique_ptr/TestUniquePtr.py (1275 of 1727)
PASS: lldb-Unit :: Process/gdb-remote/./ProcessGdbRemoteTests/GDBRemoteCommunicationClientTest.GetModulesInfoInvalidResponse (1276 of 1727)
PASS: lldb-Unit :: Utility/./UtilityTests/StringListTest.InsertStringAtIndexEnd (1277 of 1727)
PASS: lldb-Unit :: Utility/./UtilityTests/AnsiTerminal.AtStart (1278 of 1727)
PASS: lldb-Suite :: commands/expression/call-overridden-method/TestCallOverriddenMethod.py (1279 of 1727)
PASS: lldb-Unit :: Utility/./UtilityTests/VMRange.ContainsAddr (1280 of 1727)
PASS: lldb-Unit :: Utility/./UtilityTests/ArchSpecTest.Compatibility (1281 of 1727)
PASS: lldb-Suite :: python_api/frame/TestFrames.py (1282 of 1727)
PASS: lldb-Unit :: Target/./TargetTests/ExecutionContextTest.GetByteOrderTarget (1283 of 1727)
PASS: lldb-Suite :: lang/c/step-target/TestStepTarget.py (1284 of 1727)
PASS: lldb-Unit :: Target/./TargetTests/PathMappingListTest.RelativeTests (1285 of 1727)
PASS: lldb-Unit :: Utility/./UtilityTests/StringExtractorTest.GetHexU8_Exact (1286 of 1727)
PASS: lldb-Suite :: python_api/interpreter/TestRunCommandInterpreterAPI.py (1287 of 1727)
PASS: lldb-Unit :: Utility/./UtilityTests/BinaryStreamTest.PutULEB128One (1288 of 1727)
PASS: lldb-Unit :: Symbol/./SymbolTests/TestClangASTContext.TestGetBasicTypeFromEnum (1289 of 1727)
PASS: lldb-Suite :: commands/expression/import-std-module/deque-basic/TestBasicDeque.py (1290 of 1727)
PASS: lldb-Suite :: lang/c/function_types/TestFunctionTypes.py (1291 of 1727)
PASS: lldb-Unit :: SymbolFile/NativePDB/./SymbolFileNativePDBTests/PDBFPOProgramToDWARFExpressionTests.InvalidAssignmentSingle (1292 of 1727)
PASS: lldb-Unit :: Utility/./UtilityTests/SerializationRountripTest.SerializeDeserializeCString (1293 of 1727)
PASS: lldb-Suite :: lang/cpp/scope/TestCppScope.py (1294 of 1727)
PASS: lldb-Suite :: lang/cpp/unique-types/TestUniqueTypes.py (1295 of 1727)
PASS: lldb-Unit :: Host/./HostTests/SocketTest.DomainGetConnectURI (1296 of 1727)
PASS: lldb-Suite :: lang/cpp/namespace/TestNamespace.py (1297 of 1727)
PASS: lldb-Unit :: Utility/./UtilityTests/StatusTest.ErrorConversion (1298 of 1727)
PASS: lldb-Suite :: tools/lldb-vscode/step/TestVSCode_step.py (1299 of 1727)
PASS: lldb-Suite :: commands/process/launch-with-shellexpand/TestLaunchWithShellExpand.py (1300 of 1727)
PASS: lldb-Unit :: SymbolFile/NativePDB/./SymbolFileNativePDBTests/PDBFPOProgramToDWARFExpressionTests.MultipleDependentAssignments (1301 of 1727)
PASS: lldb-Suite :: lang/cpp/rvalue-references/TestRvalueReferences.py (1302 of 1727)
PASS: lldb-Suite :: commands/expression/import-std-module/conflicts/TestStdModuleWithConflicts.py (1303 of 1727)
PASS: lldb-Suite :: functionalities/thread/concurrent_events/TestConcurrentTwoWatchpointsOneBreakpoint.py (1304 of 1727)
PASS: LLDB :: SymbolFile/DWARF/compilercontext.ll (1305 of 1727)
PASS: lldb-Unit :: SymbolFile/NativePDB/./SymbolFileNativePDBTests/PDBFPOProgramToDWARFExpressionTests.UnresolvedDependentCyclicRegisterAssignmentReference (1306 of 1727)
PASS: lldb-Unit :: Utility/./UtilityTests/StreamTeeTest.GetStreamAtIndexOutOfBounds (1307 of 1727)
PASS: lldb-Suite :: commands/expression/import-std-module/vector-of-vectors/TestVectorOfVectors.py (1308 of 1727)
PASS: LLDB :: SymbolFile/Breakpad/symtab.test (1309 of 1727)
PASS: lldb-Unit :: Utility/./UtilityTests/StreamTeeTest.SetStreamAtIndexOutOfBounds (1310 of 1727)
PASS: lldb-Suite :: commands/expression/two-files/TestObjCTypeQueryFromOtherCompileUnit.py (1311 of 1727)
PASS: lldb-Unit :: Utility/./UtilityTests/RangeTest.SlideZero (1312 of 1727)
PASS: lldb-Suite :: lang/cpp/member-and-local-vars-with-same-name/TestMembersAndLocalsWithSameName.py (1313 of 1727)
PASS: lldb-Unit :: Utility/./UtilityTests/UserIDResolver.GetUserName (1314 of 1727)
PASS: lldb-Suite :: macosx/lc-note/kern-ver-str/TestKernVerStrLCNOTE.py (1315 of 1727)
PASS: LLDB :: Minidump/Windows/Sigsegv/sigsegv.test (1316 of 1727)
PASS: lldb-Suite :: functionalities/postmortem/minidump-new/TestMiniDumpNew.py (1317 of 1727)
PASS: lldb-Unit :: UnwindAssembly/x86/./UnwindAssemblyx86Tests/Testx86AssemblyInspectionEngine.Test32BitOnlyInstruction (1318 of 1727)
PASS: lldb-Suite :: tools/lldb-server/TestGdbRemote_vCont.py (1319 of 1727)
PASS: LLDB :: Quit/TestQuitExitCodeHexA.test (1320 of 1727)
PASS: lldb-Suite :: functionalities/thread/concurrent_events/TestConcurrentTwoBreakpointsOneWatchpoint.py (1321 of 1727)
PASS: lldb-Unit :: Symbol/./SymbolTests/Type.GetTypeScopeAndBasename (1322 of 1727)
PASS: lldb-Unit :: Utility/./UtilityTests/OptionsWithRawTest.QuotedSuffix (1323 of 1727)
PASS: lldb-Suite :: functionalities/data-formatter/data-formatter-ptr-to-array/TestPtrToArrayFormatting.py (1324 of 1727)
PASS: lldb-Unit :: Utility/./UtilityTests/StringListTest.SplitIntoLinesSingleTrailingCR (1325 of 1727)
PASS: lldb-Unit :: Utility/./UtilityTests/ProcessInfoTest.Constructor (1326 of 1727)
PASS: lldb-Suite :: functionalities/breakpoint/auto_continue/TestBreakpointAutoContinue.py (1327 of 1727)
PASS: lldb-Unit :: UnwindAssembly/x86/./UnwindAssemblyx86Tests/Testx86AssemblyInspectionEngine.TestSimplex86_64Augmented (1328 of 1727)
PASS: lldb-Suite :: python_api/formatters/TestFormattersSBAPI.py (1329 of 1727)
PASS: lldb-Suite :: commands/expression/import-std-module/basic/TestImportStdModule.py (1330 of 1727)
PASS: LLDB :: Settings/TestDisableColor.test (1331 of 1727)
PASS: lldb-Suite :: benchmarks/startup/TestStartupDelays.py (1332 of 1727)
PASS: lldb-Suite :: commands/watchpoints/variable_out_of_scope/TestWatchedVarHitWhenInScope.py (1333 of 1727)
PASS: lldb-Suite :: tools/lldb-vscode/stackTrace/TestVSCode_stackTrace.py (1334 of 1727)
PASS: lldb-Suite :: functionalities/unwind/sigtramp/TestSigtrampUnwind.py (1335 of 1727)
PASS: LLDB :: Modules/ELF/section-overlap.yaml (1336 of 1727)
PASS: lldb-Unit :: Utility/./UtilityTests/StringLexerTest.Next (1337 of 1727)
PASS: lldb-Unit :: Signals/./SignalsTests/UnixSignalsTest.Iteration (1338 of 1727)
PASS: lldb-Unit :: Target/./TargetTests/ModuleCacheTest.GetAndPutStrangeHostname (1339 of 1727)
PASS: lldb-Unit :: Utility/./UtilityTests/StreamTest.PutHex64ByteOrderBig (1340 of 1727)
PASS: lldb-Unit :: Utility/./UtilityTests/RangeDataVector.FindEntryThatContains_Overlap (1341 of 1727)
PASS: lldb-Suite :: tools/lldb-server/TestGdbRemoteHostInfo.py (1342 of 1727)
PASS: lldb-Suite :: commands/expression/import-std-module/deque-dbg-info-content/TestDbgInfoContentDeque.py (1343 of 1727)
PASS: lldb-Unit :: Utility/./UtilityTests/StringLexerTest.GetUnlexed (1344 of 1727)
PASS: lldb-Unit :: Utility/./UtilityTests/FileSpecTest.EqualDotsPosixRoot (1345 of 1727)
PASS: lldb-Unit :: Process/gdb-remote/./ProcessGdbRemoteTests/GDBRemoteCommunicationClientTest.SendGetDataPacket (1346 of 1727)
PASS: LLDB :: Modules/ELF/PT_LOAD-overlap.yaml (1347 of 1727)
PASS: lldb-Unit :: Utility/./UtilityTests/GeneratorTest.Get (1348 of 1727)
PASS: lldb-Suite :: lang/cpp/llvm-style/TestLLVMStyle.py (1349 of 1727)
PASS: lldb-Suite :: lang/c/local_variables/TestLocalVariables.py (1350 of 1727)
PASS: lldb-Suite :: lang/objc/objc-stepping/TestObjCStepping.py (1351 of 1727)
PASS: lldb-Suite :: functionalities/thread/thread_specific_break/TestThreadSpecificBreakpoint.py (1352 of 1727)
PASS: lldb-Suite :: functionalities/ptr_refs/TestPtrRefs.py (1353 of 1727)
PASS: lldb-Suite :: commands/expression/call-function/TestCallUserDefinedFunction.py (1354 of 1727)
PASS: lldb-Unit :: Utility/./UtilityTests/OptionsWithRawTest.SingleWordSuffix (1355 of 1727)
PASS: lldb-Suite :: lang/objc/foundation/TestSymbolTable.py (1356 of 1727)
PASS: lldb-Unit :: Host/./HostTests/FileActionTest.Open (1357 of 1727)
PASS: lldb-Suite :: commands/watchpoints/multi_watchpoint_slots/TestWatchpointMultipleSlots.py (1358 of 1727)
PASS: lldb-Suite :: macosx/safe-to-func-call/TestSafeFuncCalls.py (1359 of 1727)
PASS: LLDB :: Modules/PECOFF/sections-names.yaml (1360 of 1727)
PASS: lldb-Unit :: Utility/./UtilityTests/StringExtractorTest.GetHexBytesAvail_OddPair (1361 of 1727)
PASS: lldb-Unit :: Host/./HostTests/FileSystemTest.MakeAbsolute (1362 of 1727)
PASS: lldb-Unit :: Utility/./UtilityTests/LogChannelEnabledTest.LogThread (1363 of 1727)
PASS: lldb-Unit :: Expression/./ExpressionTests/DiagnosticManagerTest.AppendMessageAttachToLastDiag (1364 of 1727)
PASS: lldb-Suite :: commands/expression/pr35310/TestExprsBug35310.py (1365 of 1727)
PASS: lldb-Suite :: lang/cpp/operators/TestCppOperators.py (1366 of 1727)
PASS: lldb-Unit :: ScriptInterpreter/Python/./ScriptInterpreterPythonTests/PythonDataObjectsTest.TestPythonTupleInitializerList (1367 of 1727)
PASS: lldb-Suite :: lang/objc/ptr_refs/TestPtrRefsObjC.py (1368 of 1727)
PASS: lldb-Unit :: Utility/./UtilityTests/ArchSpecTest.TripleComponentsWereSpecified (1369 of 1727)
PASS: lldb-Suite :: lang/cpp/class_static/TestStaticVariables.py (1370 of 1727)
PASS: lldb-Unit :: Host/./HostTests/MainLoopTest.DetectsEOF (1371 of 1727)
PASS: lldb-Unit :: Host/./HostTests/FileSystemTest.GetByteSize (1372 of 1727)
PASS: lldb-Suite :: commands/apropos/basic/TestApropos.py (1373 of 1727)
PASS: lldb-Suite :: functionalities/data-formatter/data-formatter-stl/libstdcpp/vbool/TestDataFormatterStdVBool.py (1374 of 1727)
PASS: lldb-Suite :: functionalities/data-formatter/data-formatter-stl/libcxx/bitset/TestDataFormatterLibcxxBitset.py (1375 of 1727)
PASS: lldb-Unit :: Symbol/./SymbolTests/TestClangASTContext.TestUnifyAccessSpecifiers (1376 of 1727)
PASS: lldb-Suite :: functionalities/tail_call_frames/disambiguate_paths_to_common_sink/TestDisambiguatePathsToCommonSink.py (1377 of 1727)
PASS: lldb-Unit :: Utility/./UtilityTests/StringListTest.PopBack (1378 of 1727)
PASS: lldb-Suite :: functionalities/data-formatter/data-formatter-stl/libcxx/tuple/TestDataFormatterLibcxxTuple.py (1379 of 1727)
PASS: lldb-Suite :: functionalities/data-formatter/data-formatter-categories/TestDataFormatterCategories.py (1380 of 1727)
PASS: lldb-Unit :: UnwindAssembly/x86/./UnwindAssemblyx86Tests/Testx86AssemblyInspectionEngine.TestSubESP (1381 of 1727)
PASS: LLDB :: Unwind/eh-frame-dwarf-unwind.test (1382 of 1727)
PASS: lldb-Suite :: functionalities/breakpoint/breakpoint_command/TestBreakpointCommand.py (1383 of 1727)
PASS: lldb-Suite :: benchmarks/expression/TestRepeatedExprs.py (1384 of 1727)
PASS: lldb-Unit :: ObjectFile/Breakpad/./ObjectFileBreakpadTests/Record.classify (1385 of 1727)
PASS: lldb-Unit :: Utility/./UtilityTests/ArgsTest.TestSingleArgWithQuotedSpace (1386 of 1727)
PASS: lldb-Suite :: commands/expression/context-object/TestContextObject.py (1387 of 1727)
PASS: lldb-Suite :: commands/expression/namespace_local_var_same_name_obj_c/TestNamespaceLocalVarSameNameObjC.py (1388 of 1727)
PASS: lldb-Suite :: functionalities/inferior-assert/TestInferiorAssert.py (1389 of 1727)
PASS: lldb-Unit :: Expression/./ExpressionTests/DiagnosticManagerTest.PutString (1390 of 1727)
PASS: LLDB :: Breakpoint/single-file-split-dwarf.test (1391 of 1727)
PASS: lldb-Suite :: lang/cpp/modules-import/TestCXXModulesImport.py (1392 of 1727)
PASS: lldb-Suite :: lang/objc/forward-decl/TestForwardDecl.py (1393 of 1727)
PASS: lldb-Suite :: functionalities/completion/TestCompletion.py (1394 of 1727)
PASS: lldb-Unit :: UnwindAssembly/x86/./UnwindAssemblyx86Tests/Testx86AssemblyInspectionEngine.Test32bitFramelessBigStackFrame (1395 of 1727)
PASS: lldb-Unit :: Utility/./UtilityTests/StringExtractorTest.GetHexU8_InvalidHex_NoEof (1396 of 1727)
PASS: lldb-Suite :: commands/expression/radar_8638051/Test8638051.py (1397 of 1727)
PASS: lldb-Unit :: Expression/./ExpressionTests/DiagnosticManagerTest.AppendMessageSubsequentDiags (1398 of 1727)
PASS: lldb-Unit :: Utility/./UtilityTests/StringListTest.AppendStringStdString (1399 of 1727)
PASS: LLDB :: Driver/TestConvenienceVariables.test (1400 of 1727)
PASS: lldb-Suite :: commands/expression/persist_objc_pointeetype/TestPersistObjCPointeeType.py (1401 of 1727)
PASS: lldb-Suite :: commands/expression/completion-in-lambda-and-unnnamed-class/TestCompletionInLambdaAndUnnamedClass.py (1402 of 1727)
PASS: lldb-Unit :: Utility/./UtilityTests/ArgsTest.TestArgv (1403 of 1727)
PASS: lldb-Suite :: tools/lldb-server/register-reading/TestGdbRemoteGPacket.py (1404 of 1727)
PASS: lldb-Unit :: UnwindAssembly/x86/./UnwindAssemblyx86Tests/Testx86AssemblyInspectionEngine.TestPushR12 (1405 of 1727)
PASS: lldb-Suite :: functionalities/data-formatter/data-formatter-synthval/TestDataFormatterSynthVal.py (1406 of 1727)
PASS: lldb-Suite :: python_api/watchpoint/TestSetWatchpoint.py (1407 of 1727)
PASS: LLDB :: Modules/ELF/build-id-case.yaml (1408 of 1727)
PASS: lldb-Unit :: Utility/./UtilityTests/Flags.AnyClear (1409 of 1727)
PASS: lldb-Unit :: ScriptInterpreter/Python/./ScriptInterpreterPythonTests/PythonDataObjectsTest.TestPythonString (1410 of 1727)
PASS: lldb-Unit :: debugserver/./debugserverTests/RNBSocket.LoopBackListenIPv6 (1411 of 1727)
PASS: lldb-Suite :: functionalities/darwin_log/filter/regex/subsystem/TestDarwinLogFilterRegexSubsystem.py (1412 of 1727)
PASS: lldb-Unit :: Utility/./UtilityTests/ScalarTest.Equality (1413 of 1727)
PASS: lldb-Suite :: functionalities/tsan/basic/TestTsanBasic.py (1414 of 1727)
FAIL: lldb-Suite :: functionalities/gdb_remote_client/TestGDBRemoteClient.py (1415 of 1727)
******************** TEST 'lldb-Suite :: functionalities/gdb_remote_client/TestGDBRemoteClient.py' FAILED ********************
lldb version 10.0.99 (http://labmaster3.local/git/llvm-project.git revision a767a0688b096f4c8188a484f08a3f77bab0ce73)
  clang revision a767a0688b096f4c8188a484f08a3f77bab0ce73
  llvm revision a767a0688b096f4c8188a484f08a3f77bab0ce73
LLDB library dir: /Users/buildslave/jenkins/workspace/lldb-cmake-sanitized/lldb-build/bin
LLDB import library dir: /Users/buildslave/jenkins/workspace/lldb-cmake-sanitized/lldb-build/bin
libstdcxx tests will not be run because: Don't know how to build with libstdcxx on macosx
Skipping following debug info categories: ['dwo']

Session logs for test failures/errors/unexpected successes will go into directory '/Users/buildslave/jenkins/workspace/lldb-cmake-sanitized/test/logs'
Command invoked: /Users/buildslave/jenkins/workspace/lldb-cmake-sanitized/llvm-project/lldb/test/dotest.py --arch=x86_64 -s /Users/buildslave/jenkins/workspace/lldb-cmake-sanitized/lldb-build/lldb-test-traces -S nm -u CXXFLAGS -u CFLAGS --executable /Users/buildslave/jenkins/workspace/lldb-cmake-sanitized/lldb-build/./bin/lldb --dsymutil /Users/buildslave/jenkins/workspace/lldb-cmake-sanitized/lldb-build/./bin/dsymutil --filecheck /Users/buildslave/jenkins/workspace/lldb-cmake-sanitized/lldb-build/./bin/FileCheck -C /Users/buildslave/jenkins/workspace/lldb-cmake-sanitized/host-compiler/bin/clang --codesign-identity lldb_codesign --server /Users/buildslave/jenkins/workspace/lldb-cmake-sanitized/lldb-build/./bin/debugserver --arch x86_64 --build-dir /Users/buildslave/jenkins/workspace/lldb-cmake-sanitized/lldb-build/lldb-test-build.noindex -s=/Users/buildslave/jenkins/workspace/lldb-cmake-sanitized/test/logs -t --env TERM=vt100 --env LLVM_LIBS_DIR=/Users/buildslave/jenkins/workspace/lldb-cmake-sanitized/lldb-build/./lib --build-dir /Users/buildslave/jenkins/workspace/lldb-cmake-sanitized/lldb-build/tools/lldb/lldb-test-build.noindex --module-cache-dir /Users/buildslave/jenkins/workspace/lldb-cmake-sanitized/lldb-build/tools/lldb/lldb-test-build.noindex/module-cache-lldb /Users/buildslave/jenkins/workspace/lldb-cmake-sanitized/llvm-project/lldb/packages/Python/lldbsuite/test/functionalities/gdb_remote_client -p TestGDBRemoteClient.py
Change dir to: /Users/buildslave/jenkins/workspace/lldb-cmake-sanitized/llvm-project/lldb/packages/Python/lldbsuite/test/functionalities/gdb_remote_client
runCmd: settings set symbols.enable-external-lookup false
output: 

runCmd: settings set plugin.process.gdb-remote.packet-timeout 60
output: 

runCmd: settings set symbols.clang-modules-cache-path "/Users/buildslave/jenkins/workspace/lldb-cmake-sanitized/lldb-build/tools/lldb/lldb-test-build.noindex/module-cache-lldb"
output: 

runCmd: settings set use-color false
output: 

<bound method SBProcess.Kill of <lldb.SBProcess; proxy of <Swig Object of type 'lldb::SBProcess *' at 0x10d0ebb40> >>: success

PASS: LLDB (/Users/buildslave/jenkins/workspace/lldb-cmake-sanitized/host-compiler/bin/clang-10-x86_64) :: test_attach_fail (TestGDBRemoteClient.TestGDBRemoteClient)
runCmd: settings set symbols.enable-external-lookup false
output: 

runCmd: settings set plugin.process.gdb-remote.packet-timeout 60
output: 

runCmd: settings set symbols.clang-modules-cache-path "/Users/buildslave/jenkins/workspace/lldb-cmake-sanitized/lldb-build/tools/lldb/lldb-test-build.noindex/module-cache-lldb"
output: 

runCmd: settings set use-color false
output: 

FAIL: LLDB (/Users/buildslave/jenkins/workspace/lldb-cmake-sanitized/host-compiler/bin/clang-10-x86_64) :: test_connect (TestGDBRemoteClient.TestGDBRemoteClient)
<bound method SBProcess.Kill of <lldb.SBProcess; proxy of <Swig Object of type 'lldb::SBProcess *' at 0x10d0eb8a0> >>: success

Restore dir to: /Users/buildslave/jenkins/workspace/lldb-cmake-sanitized/lldb-build/tools/lldb/lit
======================================================================
FAIL: test_connect (TestGDBRemoteClient.TestGDBRemoteClient)
   Test connecting to a remote gdb server
----------------------------------------------------------------------
Traceback (most recent call last):
  File "/Users/buildslave/jenkins/workspace/lldb-cmake-sanitized/llvm-project/lldb/packages/Python/lldbsuite/test/functionalities/gdb_remote_client/TestGDBRemoteClient.py", line 13, in test_connect
    process = self.connect(target)
  File "/Users/buildslave/jenkins/workspace/lldb-cmake-sanitized/llvm-project/lldb/packages/Python/lldbsuite/test/functionalities/gdb_remote_client/gdbclientutils.py", line 479, in connect
    self.assertTrue(error.Success(), error.description)
AssertionError: False is not True : failed to get reply to handshake packet
Config=x86_64-/Users/buildslave/jenkins/workspace/lldb-cmake-sanitized/host-compiler/bin/clang-10
----------------------------------------------------------------------
Ran 2 tests in 62.695s

RESULT: FAILED (1 passes, 1 failures, 0 errors, 0 skipped, 0 expected failures, 0 unexpected successes)

********************
PASS: lldb-Suite :: lang/objcxx/hide-runtime-values/TestObjCXXHideRuntimeValues.py (1416 of 1727)
PASS: lldb-Unit :: Utility/./UtilityTests/FileSpecTest.IsRelative (1417 of 1727)
PASS: lldb-Suite :: commands/watchpoints/hello_watchpoint/TestMyFirstWatchpoint.py (1418 of 1727)
PASS: lldb-Suite :: commands/version/TestVersion.py (1419 of 1727)
PASS: LLDB :: Commands/command-regex-unalias.test (1420 of 1727)
PASS: lldb-Suite :: commands/target/basic/TestTargetCommand.py (1421 of 1727)
PASS: lldb-Unit :: Symbol/./SymbolTests/LineEntryTest.GetSameLineContiguousAddressRangeOneInline (1422 of 1727)
PASS: lldb-Unit :: Utility/./UtilityTests/ArgsTest.TestInsertArg (1423 of 1727)
PASS: LLDB :: Expr/TestMultilineExpr.test (1424 of 1727)
PASS: lldb-Suite :: commands/quit/TestQuit.py (1425 of 1727)
PASS: lldb-Suite :: functionalities/param_entry_vals/basic_entry_values_x86_64/TestBasicEntryValuesX86_64.py (1426 of 1727)
PASS: lldb-Unit :: SymbolFile/NativePDB/./SymbolFileNativePDBTests/PDBFPOProgramToDWARFExpressionTests.UnresolvedRegisterReference (1427 of 1727)
PASS: LLDB :: Modules/PECOFF/uuid.yaml (1428 of 1727)
PASS: lldb-Unit :: Utility/./UtilityTests/StringExtractorTest.DecodeHexU8_Underflow (1429 of 1727)
PASS: lldb-Unit :: Utility/./UtilityTests/AnsiTerminal.AtEnd (1430 of 1727)
PASS: LLDB :: SymbolFile/Breakpad/unwind-via-stack-cfi.test (1431 of 1727)
PASS: lldb-Suite :: commands/expression/context-object-objc/TestContextObjectObjc.py (1432 of 1727)
PASS: lldb-Unit :: Utility/./UtilityTests/RegisterValueTest.GetSet8 (1433 of 1727)
PASS: lldb-Unit :: Target/./TargetTests/MemoryRegionInfoTest.Formatv (1434 of 1727)
PASS: lldb-Suite :: functionalities/data-formatter/data-formatter-stl/libcxx/map/TestDataFormatterLibccMap.py (1435 of 1727)
PASS: lldb-Suite :: lang/cpp/this/TestCPPThis.py (1436 of 1727)
UNSUPPORTED: LLDB :: SymbolFile/NativePDB/local-variables.cpp (1437 of 1727)
PASS: lldb-Suite :: functionalities/thread/jump/TestThreadJump.py (1438 of 1727)
PASS: lldb-Suite :: tools/lldb-server/TestGdbRemoteAttach.py (1439 of 1727)
XFAIL: LLDB :: Register/x86-64-write.test (1440 of 1727)
PASS: lldb-Suite :: python_api/process/read-mem-cstring/TestReadMemCString.py (1441 of 1727)
PASS: lldb-Unit :: Utility/./UtilityTests/BinaryStreamTest.PutSLEB128FourBytes (1442 of 1727)
PASS: lldb-Unit :: Utility/./UtilityTests/StringListTest.GetMaxStringLengthDecreasingSize (1443 of 1727)
PASS: lldb-Unit :: Utility/./UtilityTests/StreamTest.ChangingByteOrder (1444 of 1727)
PASS: lldb-Unit :: Utility/./UtilityTests/StreamTest.PutCString (1445 of 1727)
PASS: lldb-Unit :: SymbolFile/NativePDB/./SymbolFileNativePDBTests/PDBFPOProgramToDWARFExpressionTests.InvalidAssignmentMultiple (1446 of 1727)
PASS: lldb-Unit :: Utility/./UtilityTests/BinaryStreamTest.PutSLEB128NineBytes (1447 of 1727)
PASS: lldb-Suite :: functionalities/data-formatter/data-formatter-objc/TestDataFormatterObjCNSDate.py (1448 of 1727)
PASS: lldb-Unit :: Utility/./UtilityTests/StringListTest.CopyListSingle (1449 of 1727)
PASS: lldb-Unit :: Utility/./UtilityTests/VMRange.SetEndAddress (1450 of 1727)
PASS: lldb-Unit :: Utility/./UtilityTests/StringListTest.AppendListCStringArray (1451 of 1727)
PASS: lldb-Suite :: functionalities/breakpoint/consecutive_breakpoints/TestConsecutiveBreakpoints.py (1452 of 1727)
PASS: lldb-Suite :: lang/c/conflicting-symbol/TestConflictingSymbol.py (1453 of 1727)
PASS: lldb-Suite :: lang/cpp/virtual/TestVirtual.py (1454 of 1727)
PASS: lldb-Unit :: ObjectFile/Breakpad/./ObjectFileBreakpadTests/FileRecord.parse (1455 of 1727)
PASS: lldb-Suite :: functionalities/data-formatter/data-formatter-proper-plurals/TestFormattersOneIsSingular.py (1456 of 1727)
PASS: lldb-Suite :: functionalities/load_unload/TestLoadUnload.py (1457 of 1727)
PASS: lldb-Unit :: Utility/./UtilityTests/ScalarTest.SetValueFromCString (1458 of 1727)
PASS: lldb-Unit :: Utility/./UtilityTests/LogChannelTest.List (1459 of 1727)
PASS: lldb-Suite :: functionalities/breakpoint/breakpoint_ids/TestBreakpointIDs.py (1460 of 1727)
PASS: lldb-Suite :: python_api/class_members/TestSBTypeClassMembers.py (1461 of 1727)
PASS: LLDB :: Quit/TestQuitExitCodeImplicit0.test (1462 of 1727)
PASS: lldb-Unit :: Process/minidump/./LLDBMinidumpTests/MinidumpParserTest.GetThreadContext_x86_32 (1463 of 1727)
PASS: lldb-Unit :: SymbolFile/NativePDB/./SymbolFileNativePDBTests/PDBFPOProgramToDWARFExpressionTests.UnresolvedCyclicRegisterAssignmentReference (1464 of 1727)
PASS: lldb-Unit :: Utility/./UtilityTests/BinaryStreamTest.PutULEB128FourBytes (1465 of 1727)
PASS: lldb-Suite :: functionalities/tail_call_frames/ambiguous_tail_call_seq2/TestAmbiguousTailCallSeq2.py (1466 of 1727)
PASS: lldb-Unit :: UnwindAssembly/x86/./UnwindAssemblyx86Tests/Testx86AssemblyInspectionEngine.TestPopR12 (1467 of 1727)
PASS: LLDB :: SymbolFile/NativePDB/break-by-function.cpp (1468 of 1727)
PASS: lldb-Suite :: functionalities/darwin_log/filter/exact_match/activity/TestDarwinLogFilterMatchActivity.py (1469 of 1727)
PASS: lldb-Suite :: lang/c/inlines/TestRedefinitionsInInlines.py (1470 of 1727)
PASS: lldb-Unit :: Utility/./UtilityTests/RangeTest.ContainsRangeStartingFromZero (1471 of 1727)
PASS: lldb-Unit :: ScriptInterpreter/Python/./ScriptInterpreterPythonTests/PythonDataObjectsTest.TestPythonIntegerToStr (1472 of 1727)
PASS: lldb-Unit :: Utility/./UtilityTests/DataExtractorTest.GetMaxS64 (1473 of 1727)
PASS: lldb-Unit :: Host/./HostTests/Host.GetEnvironment (1474 of 1727)
PASS: lldb-Suite :: lang/c/stepping/TestStepAndBreakpoints.py (1475 of 1727)
PASS: lldb-Unit :: Utility/./UtilityTests/EventTest.DumpEventDataBytes (1476 of 1727)
PASS: lldb-Suite :: lang/cpp/operator-overload/TestOperatorOverload.py (1477 of 1727)
PASS: lldb-Suite :: commands/expression/class_template_specialization_empty_pack/TestClassTemplateSpecializationParametersHandling.py (1478 of 1727)
PASS: lldb-Unit :: Utility/./UtilityTests/StreamTest.PutStringAsRawHex8 (1479 of 1727)
PASS: lldb-Unit :: Utility/./UtilityTests/RangeTest.ClearWithStarAddress (1480 of 1727)
PASS: lldb-Suite :: functionalities/data-formatter/data-formatter-python-synth/TestDataFormatterPythonSynth.py (1481 of 1727)
PASS: lldb-Unit :: Symbol/./SymbolTests/TestClangASTContext.TestGetBasicTypeFromName (1482 of 1727)
PASS: lldb-Suite :: commands/watchpoints/watchpoint_disable/TestWatchpointDisable.py (1483 of 1727)
PASS: lldb-Suite :: python_api/rdar-12481949/Test-rdar-12481949.py (1484 of 1727)
PASS: LLDB :: SymbolFile/NativePDB/function-types-calling-conv.cpp (1485 of 1727)
PASS: lldb-Suite :: functionalities/data-formatter/language_category_updates/TestDataFormatterLanguageCategoryUpdates.py (1486 of 1727)
PASS: lldb-Suite :: lang/objc/hidden-ivars/TestHiddenIvars.py (1487 of 1727)
UNSUPPORTED: LLDB :: Register/x86-64-zmm-write.test (1488 of 1727)
PASS: LLDB :: Modules/ELF/section-permissions.yaml (1489 of 1727)
PASS: lldb-Suite :: lang/objc/foundation/TestFoundationDisassembly.py (1490 of 1727)
PASS: lldb-Suite :: lang/objc/objc-class-method/TestObjCClassMethod.py (1491 of 1727)
PASS: lldb-Unit :: Utility/./UtilityTests/StringListTest.Clear (1492 of 1727)
PASS: LLDB :: Modules/PECOFF/basic-info.yaml (1493 of 1727)
PASS: lldb-Unit :: Utility/./UtilityTests/RegularExpression.CopyAssignment (1494 of 1727)
PASS: lldb-Unit :: Utility/./UtilityTests/StringListTest.Assignment (1495 of 1727)
PASS: lldb-Suite :: functionalities/tsan/thread_numbers/TestTsanThreadNumbers.py (1496 of 1727)
PASS: lldb-Suite :: functionalities/breakpoint/breakpoint_command/TestBreakpointCommandsFromPython.py (1497 of 1727)
PASS: lldb-Unit :: Process/gdb-remote/./ProcessGdbRemoteTests/GDBRemoteClientBaseTest.SendContinueAndInterrupt (1498 of 1727)
PASS: lldb-Suite :: functionalities/thread/concurrent_events/TestConcurrentDelaySignalWatch.py (1499 of 1727)
PASS: lldb-Unit :: Utility/./UtilityTests/BinaryStreamTest.PutSLEB128TwoBytes (1500 of 1727)
PASS: lldb-Suite :: commands/expression/completion-crash2/TestCompletionCrash2.py (1501 of 1727)
UNSUPPORTED: LLDB :: SymbolFile/target-symbols-add-unwind.test (1502 of 1727)
PASS: lldb-Unit :: Utility/./UtilityTests/StreamTest.PutHex32ByteOrderLittle (1503 of 1727)
PASS: lldb-Unit :: Utility/./UtilityTests/RangeTest.SizeTypes (1504 of 1727)
PASS: LLDB :: SymbolFile/sizeless-symbol.test (1505 of 1727)
PASS: lldb-Unit :: Language/Highlighting/./HighlighterTests/HighlighterTest.DefaultHighlighterWithCursorOutOfBounds (1506 of 1727)
PASS: lldb-Unit :: Utility/./UtilityTests/ScalarTest.GetBytes (1507 of 1727)
PASS: lldb-Suite :: functionalities/postmortem/elf-core/TestLinuxCore.py (1508 of 1727)
PASS: lldb-Suite :: functionalities/longjmp/TestLongjmp.py (1509 of 1727)
PASS: lldb-Unit :: Utility/./UtilityTests/Flags.AnySet (1510 of 1727)
PASS: lldb-Unit :: Utility/./UtilityTests/AnsiTerminal.KnownPrefix (1511 of 1727)
PASS: lldb-Suite :: lang/objc/objc-struct-argument/TestObjCStructArgument.py (1512 of 1727)
PASS: lldb-Unit :: ScriptInterpreter/Python/./ScriptInterpreterPythonTests/PythonDataObjectsTest.TestOwnedReferences (1513 of 1727)
PASS: lldb-Suite :: commands/frame/diagnose/inheritance/TestDiagnoseInheritance.py (1514 of 1727)
PASS: lldb-Suite :: python_api/symbol-context/two-files/TestSymbolContextTwoFiles.py (1515 of 1727)
PASS: lldb-Suite :: functionalities/data-formatter/data-formatter-stl/libcxx/vector/TestDataFormatterLibcxxVector.py (1516 of 1727)
PASS: lldb-Suite :: commands/expression/import_builtin_fileid/TestImportBuiltinFileID.py (1517 of 1727)
PASS: lldb-Unit :: Utility/./UtilityTests/RegularExpression.Valid (1518 of 1727)
PASS: lldb-Unit :: SymbolFile/DWARF/./SymbolFileDWARFTests/SymbolFileDWARFTests.TestAbilitiesForDWARF (1519 of 1727)
PASS: lldb-Unit :: Utility/./UtilityTests/Predicate.WaitForValueEqualTo (1520 of 1727)
PASS: lldb-Unit :: Utility/./UtilityTests/SerializationRountripTest.SerializeDeserializePod (1521 of 1727)
PASS: LLDB :: Modules/ELF/PT_TLS-overlap-PT_LOAD.yaml (1522 of 1727)
PASS: lldb-Unit :: Process/gdb-remote/./ProcessGdbRemoteTests/GDBRemoteCommunicationTest.ReadPacket_checksum (1523 of 1727)
PASS: lldb-Suite :: functionalities/data-formatter/data-formatter-synth/TestDataFormatterSynth.py (1524 of 1727)
PASS: lldb-Unit :: Target/./TargetTests/PathMappingListTest.AbsoluteTests (1525 of 1727)
PASS: lldb-Unit :: SymbolFile/NativePDB/./SymbolFileNativePDBTests/PDBFPOProgramToDWARFExpressionTests.UnsupportedRASearch (1526 of 1727)
PASS: lldb-Suite :: functionalities/data-formatter/data-formatter-stl/libcxx/iterator/TestDataFormatterLibccIterator.py (1527 of 1727)
PASS: lldb-Suite :: lang/c/anonymous/TestAnonymous.py (1528 of 1727)
PASS: lldb-Unit :: UnwindAssembly/x86/./UnwindAssemblyx86Tests/Testx86AssemblyInspectionEngine.TestCALLNextInsn (1529 of 1727)
PASS: lldb-Suite :: functionalities/data-formatter/data-formatter-stl/libcxx/multiset/TestDataFormatterLibcxxMultiSet.py (1530 of 1727)
PASS: lldb-Suite :: commands/expression/weak_symbols/TestWeakSymbols.py (1531 of 1727)
PASS: lldb-Unit :: ScriptInterpreter/Python/./ScriptInterpreterPythonTests/PythonDataObjectsTest.TestPythonDictionaryToStructuredDictionary (1532 of 1727)
PASS: lldb-Suite :: lang/cpp/incomplete-types/TestCppIncompleteTypes.py (1533 of 1727)
PASS: lldb-Suite :: functionalities/backticks/TestBackticksWithoutATarget.py (1534 of 1727)
PASS: lldb-Unit :: Utility/./UtilityTests/ConstStringTest.MangledCounterpart (1535 of 1727)
PASS: lldb-Suite :: lang/c/tls_globals/TestTlsGlobals.py (1536 of 1727)
PASS: lldb-Unit :: Utility/./UtilityTests/StringExtractorTest.GetHexBytes_OddPair2 (1537 of 1727)
PASS: lldb-Unit :: Utility/./UtilityTests/Flags.AllSet (1538 of 1727)
PASS: lldb-Suite :: functionalities/thread/concurrent_events/TestConcurrentSignalWatch.py (1539 of 1727)
PASS: lldb-Unit :: ScriptInterpreter/Python/./ScriptInterpreterPythonTests/PythonExceptionStateTest.TestResetSemantics (1540 of 1727)
PASS: lldb-Suite :: python_api/sblaunchinfo/TestSBLaunchInfo.py (1541 of 1727)
PASS: lldb-Unit :: Utility/./UtilityTests/RangeTest.DoesAdjoinOrIntersect (1542 of 1727)
PASS: lldb-Suite :: functionalities/data-formatter/data-formatter-stl/libcxx/string/TestDataFormatterLibcxxString.py (1543 of 1727)
PASS: lldb-Unit :: Utility/./UtilityTests/DataExtractorTest.GetMaxU64_unchecked (1544 of 1727)
PASS: LLDB :: SymbolFile/NativePDB/global-classes.cpp (1545 of 1727)
PASS: lldb-Suite :: functionalities/abbreviation/TestCommonShortSpellings.py (1546 of 1727)
PASS: lldb-Suite :: functionalities/non-overlapping-index-variable-i/TestIndexVariable.py (1547 of 1727)
PASS: lldb-Suite :: functionalities/inferior-crashing/TestInferiorCrashing.py (1548 of 1727)
PASS: lldb-Unit :: Host/./HostTests/NativeProcessProtocolTest.ReadCStringFromMemory_MaxSize (1549 of 1727)
UNSUPPORTED: LLDB :: SymbolFile/PDB/variables.test (1550 of 1727)
PASS: lldb-Suite :: functionalities/data-formatter/data-formatter-stl/libcxx/list/loop/TestDataFormatterLibcxxListLoop.py (1551 of 1727)
PASS: LLDB :: SymbolFile/DWARF/find-function-regex.cpp (1552 of 1727)
PASS: lldb-Unit :: Utility/./UtilityTests/UriParserTest.BracketedHostname (1553 of 1727)
PASS: lldb-Unit :: Utility/./UtilityTests/StreamTest.PutHex32ByteOrderBig (1554 of 1727)
PASS: lldb-Suite :: tools/lldb-vscode/attach/TestVSCode_attach.py (1555 of 1727)
PASS: lldb-Unit :: Utility/./UtilityTests/Flags.AllClear (1556 of 1727)
PASS: lldb-Suite :: functionalities/show_location/TestShowLocationDwarf5.py (1557 of 1727)
PASS: lldb-Suite :: tools/lldb-server/commandline/TestStubSetSID.py (1558 of 1727)
PASS: lldb-Suite :: functionalities/data-formatter/refpointer-recursion/TestDataFormatterRefPtrRecursion.py (1559 of 1727)
PASS: lldb-Suite :: functionalities/gdb_remote_client/TestNoWatchpointSupportInfo.py (1560 of 1727)
PASS: lldb-Unit :: Utility/./UtilityTests/StringListTest.InsertStringAtIndexStdString (1561 of 1727)
PASS: lldb-Unit :: Utility/./UtilityTests/RangeTest.Copy (1562 of 1727)
PASS: lldb-Unit :: Utility/./UtilityTests/ArgsTest.TestMultipleArgs (1563 of 1727)
PASS: lldb-Suite :: tools/lldb-vscode/variables/TestVSCode_variables.py (1564 of 1727)
PASS: lldb-Unit :: Host/./HostTests/SocketAddressTest.GetAddressInfo (1565 of 1727)
PASS: lldb-Unit :: SymbolFile/DWARF/./SymbolFileDWARFTests/SymbolFileDWARFTests.TestAbbrevNullAttrValidForm (1566 of 1727)
PASS: lldb-Suite :: lang/c/typedef/Testtypedef.py (1567 of 1727)
UNSUPPORTED: LLDB :: SymbolFile/PDB/compilands.test (1568 of 1727)
PASS: lldb-Unit :: Utility/./UtilityTests/ArgsTest.StringListConstructor (1569 of 1727)
PASS: lldb-Unit :: SymbolFile/NativePDB/./SymbolFileNativePDBTests/PDBFPOProgramToDWARFExpressionTests.DependencyChain (1570 of 1727)
PASS: lldb-Suite :: lang/c/register_variables/TestRegisterVariables.py (1571 of 1727)
PASS: lldb-Suite :: linux/thread/create_during_instruction_step/TestCreateDuringInstructionStep.py (1572 of 1727)
PASS: lldb-Suite :: macosx/load-kext/TestLoadKext.py (1573 of 1727)
PASS: LLDB :: Reproducer/TestGDBRemoteRepro.test (1574 of 1727)
PASS: lldb-Unit :: Utility/./UtilityTests/UriParserTest.SchemeHostSeparator2 (1575 of 1727)
PASS: lldb-Suite :: lang/objc/bitfield_ivars/TestBitfieldIvars.py (1576 of 1727)
PASS: lldb-Unit :: Utility/./UtilityTests/ListenerTest.GetEventWait (1577 of 1727)
PASS: lldb-Suite :: functionalities/unwind/noreturn/module-end/TestNoReturnModuleEnd.py (1578 of 1727)
UNSUPPORTED: LLDB :: Register/x86-64-gp-write.test (1579 of 1727)
PASS: lldb-Suite :: functionalities/memory/find/TestMemoryFind.py (1580 of 1727)
PASS: lldb-Unit :: ScriptInterpreter/Python/./ScriptInterpreterPythonTests/PythonDataObjectsTest.TestPythonDictionaryValueEquality (1581 of 1727)
PASS: LLDB :: Modules/ELF/PT_LOAD-empty.yaml (1582 of 1727)
PASS: lldb-Unit :: Process/minidump/./LLDBMinidumpTests/MinidumpParserTest.FindMemoryRange (1583 of 1727)
PASS: lldb-Unit :: UnwindAssembly/x86/./UnwindAssemblyx86Tests/Testx86AssemblyInspectionEngine.TestAddRSP (1584 of 1727)
PASS: lldb-Suite :: macosx/find-dsym/bundle-with-dot-in-filename/TestBundleWithDotInFilename.py (1585 of 1727)
PASS: lldb-Unit :: Process/gdb-remote/./ProcessGdbRemoteTests/GDBRemoteClientBaseTest.SendPacketAndReceiveResponseWithOutputSupport (1586 of 1727)
PASS: lldb-Suite :: commands/command/nested_alias/TestNestedAlias.py (1587 of 1727)
PASS: lldb-Suite :: lang/c/global_variables/TestGlobalVariables.py (1588 of 1727)
PASS: lldb-Unit :: Utility/./UtilityTests/StringExtractorTest.GetHexBytes (1589 of 1727)
UNSUPPORTED: LLDB :: SymbolFile/PDB/func-symbols.test (1590 of 1727)
PASS: lldb-Unit :: Utility/./UtilityTests/RangeTest.Union (1591 of 1727)
PASS: lldb-Unit :: UnwindAssembly/x86/./UnwindAssemblyx86Tests/Testx86AssemblyInspectionEngine.TestPopEBX (1592 of 1727)
PASS: lldb-Unit :: Utility/./UtilityTests/StringLexerTest.Peek (1593 of 1727)
PASS: lldb-Unit :: Host/./HostTests/MainLoopTest.ReadObject (1594 of 1727)
PASS: lldb-Suite :: lang/objc/real-definition/TestRealDefinition.py (1595 of 1727)
PASS: lldb-Suite :: api/check_public_api_headers/TestPublicAPIHeaders.py (1596 of 1727)
PASS: lldb-Suite :: functionalities/stats_api/TestStatisticsAPI.py (1597 of 1727)
PASS: lldb-Unit :: ObjectFile/Breakpad/./ObjectFileBreakpadTests/PublicRecord.parse (1598 of 1727)
PASS: LLDB :: Modules/ELF/compressed-sections.yaml (1599 of 1727)
PASS: lldb-Suite :: functionalities/breakpoint/scripted_bkpt/TestScriptedResolver.py (1600 of 1727)
PASS: LLDB :: Driver/TestNoUseColor.test (1601 of 1727)
PASS: lldb-Unit :: Utility/./UtilityTests/ConstStringTest.FromMidOfBufferStringRef (1602 of 1727)
PASS: LLDB :: SymbolFile/NativePDB/bitfields.cpp (1603 of 1727)
PASS: lldb-Unit :: Utility/./UtilityTests/StreamTest.QuotedCString (1604 of 1727)
PASS: lldb-Unit :: UnwindAssembly/x86/./UnwindAssemblyx86Tests/Testx86AssemblyInspectionEngine.TestSpillRegToStackViaMOVx86_64 (1605 of 1727)
PASS: lldb-Suite :: python_api/lldbutil/iter/TestLLDBIterator.py (1606 of 1727)
PASS: lldb-Suite :: functionalities/thread/concurrent_events/TestConcurrentWatchpointWithDelayWatchpointThreads.py (1607 of 1727)
PASS: lldb-Suite :: lang/objc/foundation/TestObjCMethodsNSError.py (1608 of 1727)
PASS: lldb-Unit :: Utility/./UtilityTests/StringExtractorTest.DecodeHexU8_Underflow2 (1609 of 1727)
UNSUPPORTED: LLDB :: SymbolFile/PDB/typedefs.test (1610 of 1727)
PASS: lldb-Suite :: functionalities/gdb_remote_client/TestNestedRegDefinitions.py (1611 of 1727)
UNSUPPORTED: LLDB :: Register/x86-gp-write.test (1612 of 1727)
PASS: lldb-Suite :: functionalities/thread/concurrent_events/TestConcurrentDelayedCrashWithBreakpointSignal.py (1613 of 1727)
PASS: lldb-Unit :: UnwindAssembly/x86/./UnwindAssemblyx86Tests/Testx86AssemblyInspectionEngine.TestSimple64bitFrameFunction (1614 of 1727)
PASS: lldb-Unit :: Process/gdb-remote/./ProcessGdbRemoteTests/GDBRemoteCommunicationClientTest.SendStartTracePacket (1615 of 1727)
PASS: lldb-Unit :: Utility/./UtilityTests/SerializationRountripTest.SerializeDeserializePodPointers (1616 of 1727)
PASS: lldb-Suite :: lang/objc/objc-static-method-stripped/TestObjCStaticMethodStripped.py (1617 of 1727)
PASS: LLDB :: Minidump/dump-all.test (1618 of 1727)
PASS: lldb-Suite :: functionalities/abbreviation/TestAbbreviations.py (1619 of 1727)
PASS: LLDB :: BuildScript/compiler-full-path.test (1620 of 1727)
PASS: lldb-Unit :: Utility/./UtilityTests/AnsiTerminal.Twice (1621 of 1727)
PASS: lldb-Unit :: Utility/./UtilityTests/StreamTest.PutBytesAsRawHex8ToMixedEndian (1622 of 1727)
PASS: LLDB :: SymbolFile/DWARF/debug_aranges-empty-section.s (1623 of 1727)
PASS: LLDB :: Commands/command-script-import.test (1624 of 1727)
PASS: lldb-Suite :: commands/register/register/intel_xtended_registers/TestMPXRegisters.py (1625 of 1727)
PASS: LLDB :: Driver/TestTarget.test (1626 of 1727)
PASS: LLDB :: SymbolFile/DWARF/find-method.cpp (1627 of 1727)
PASS: lldb-Unit :: Utility/./UtilityTests/StringExtractorTest.GetNameColonValueSuccess (1628 of 1727)
PASS: lldb-Unit :: Utility/./UtilityTests/RangeTest.SetRangeBase (1629 of 1727)
PASS: lldb-Suite :: commands/expression/call-throws/TestCallThatThrows.py (1630 of 1727)
PASS: lldb-Unit :: Host/./HostTests/NativeProcessProtocolTest.SetBreakpointFailVerify (1631 of 1727)
PASS: LLDB :: BuildScript/toolchain-clang.test (1632 of 1727)
PASS: lldb-Suite :: lang/c/vla/TestVLA.py (1633 of 1727)
PASS: lldb-Suite :: lang/objc/unicode-string/TestUnicodeString.py (1634 of 1727)
PASS: lldb-Unit :: Utility/./UtilityTests/StringExtractorTest.DecodeHexU8_InvalidHex2 (1635 of 1727)
PASS: LLDB :: Quit/TestQuitExitCode30.test (1636 of 1727)
PASS: lldb-Suite :: functionalities/signal/handle-segv/TestHandleSegv.py (1637 of 1727)
PASS: lldb-Suite :: functionalities/data-formatter/poarray/TestPrintObjectArray.py (1638 of 1727)
PASS: lldb-Suite :: functionalities/unwind/ehframe/TestEhFrameUnwind.py (1639 of 1727)
PASS: lldb-Suite :: lang/cpp/extern_c/TestExternCSymbols.py (1640 of 1727)
PASS: lldb-Unit :: Expression/./ExpressionTests/ClangHostTest.MacOSX (1641 of 1727)
PASS: LLDB :: Modules/ELF/many-sections.s (1642 of 1727)
PASS: lldb-Unit :: Utility/./UtilityTests/StringListTest.GetMaxStringLengthIncreasingSize (1643 of 1727)
PASS: lldb-Suite :: functionalities/thread/concurrent_events/TestConcurrentSignalWatchBreak.py (1644 of 1727)
PASS: lldb-Suite :: commands/expression/import-std-module/forward_list-dbg-info-content/TestDbgInfoContentForwardList.py (1645 of 1727)
PASS: lldb-Suite :: commands/expression/import-std-module/shared_ptr-dbg-info-content/TestSharedPtrDbgInfoContent.py (1646 of 1727)
UNSUPPORTED: LLDB :: SymbolFile/PDB/function-nested-block.test (1647 of 1727)
PASS: lldb-Unit :: Utility/./UtilityTests/BinaryStreamTest.PutSLEB128EightBytes (1648 of 1727)
PASS: lldb-Unit :: UnwindAssembly/x86/./UnwindAssemblyx86Tests/Testx86AssemblyInspectionEngine.TestPushEBX (1649 of 1727)
PASS: lldb-Suite :: commands/expression/import-std-module/vector-dbg-info-content/TestDbgInfoContentVector.py (1650 of 1727)
PASS: lldb-Suite :: commands/expression/import-std-module/unique_ptr-dbg-info-content/TestUniquePtrDbgInfoContent.py (1651 of 1727)
PASS: lldb-Suite :: commands/watchpoints/watchpoint_size/TestWatchpointSizes.py (1652 of 1727)
PASS: lldb-Unit :: ScriptInterpreter/Python/./ScriptInterpreterPythonTests/PythonDataObjectsTest.TestPythonCallableInvoke (1653 of 1727)
PASS: LLDB :: Commands/CommandScriptImmediateOutput/CommandScriptImmediateOutputConsole.test (1654 of 1727)
PASS: lldb-Unit :: Utility/./UtilityTests/ArgsTest.ReplaceArgumentAtIndexLonger (1655 of 1727)
PASS: lldb-Suite :: functionalities/data-formatter/data-formatter-stl/libstdcpp/vector/TestDataFormatterStdVector.py (1656 of 1727)
PASS: lldb-Unit :: UnwindAssembly/x86/./UnwindAssemblyx86Tests/Testx86AssemblyInspectionEngine.TestDisassemblyJunkBytes (1657 of 1727)
PASS: lldb-Unit :: Utility/./UtilityTests/StringListTest.GetMaxStringLengthMixed (1658 of 1727)
PASS: lldb-Suite :: lang/objc/objc-dynamic-value/TestObjCDynamicValue.py (1659 of 1727)
PASS: lldb-Suite :: commands/expression/namespace_local_var_same_name_cpp_and_c/TestNamespaceLocalVarSameNameCppAndC.py (1660 of 1727)
PASS: lldb-Unit :: Utility/./UtilityTests/FileSpecTest.GetNormalizedPath (1661 of 1727)
PASS: lldb-Unit :: Utility/./UtilityTests/BinaryStreamTest.PutULEB128OneByte (1662 of 1727)
PASS: LLDB :: Modules/MachO/lc_build_version.yaml (1663 of 1727)
PASS: lldb-Unit :: Utility/./UtilityTests/UriParserTest.BracketedHostnamePort (1664 of 1727)
PASS: lldb-Unit :: SymbolFile/NativePDB/./SymbolFileNativePDBTests/PDBFPOProgramToDWARFExpressionTests.SingleAssignmentRegisterRef (1665 of 1727)
PASS: lldb-Unit :: SymbolFile/NativePDB/./SymbolFileNativePDBTests/PDBFPOProgramToDWARFExpressionTests.MissingTargetRegister (1666 of 1727)
PASS: lldb-Unit :: UnwindAssembly/x86/./UnwindAssemblyx86Tests/Testx86AssemblyInspectionEngine.Test32bitFramelessSmallStackFrame (1667 of 1727)
PASS: lldb-Suite :: functionalities/thread/step_out/TestThreadStepOut.py (1668 of 1727)
PASS: lldb-Suite :: functionalities/data-formatter/varscript_formatting/TestDataFormatterVarScriptFormatting.py (1669 of 1727)
PASS: LLDB :: Register/x86-64-ymm-read.test (1670 of 1727)
PASS: lldb-Unit :: Language/Highlighting/./HighlighterTests/HighlighterTest.ClangCommas (1671 of 1727)
PASS: lldb-Unit :: Symbol/./SymbolTests/TestClangASTContext.TestConvertAccessTypeToAccessSpecifier (1672 of 1727)
PASS: lldb-Unit :: UnwindAssembly/x86/./UnwindAssemblyx86Tests/Testx86AssemblyInspectionEngine.TestPushRBP (1673 of 1727)
PASS: lldb-Suite :: lang/cpp/inlines/TestInlines.py (1674 of 1727)
PASS: lldb-Unit :: Utility/./UtilityTests/RangeTest.EqualInvalid (1675 of 1727)
PASS: lldb-Suite :: api/multiple-debuggers/TestMultipleDebuggers.py (1676 of 1727)
PASS: lldb-Suite :: functionalities/inferior-crashing/TestInferiorCrashingStep.py (1677 of 1727)
PASS: lldb-Unit :: Utility/./UtilityTests/BinaryStreamTest.PutULEB128NineBytes (1678 of 1727)
PASS: LLDB :: BuildScript/script-args.test (1679 of 1727)
PASS: LLDB :: SymbolFile/DWARF/find-variable-file.cpp (1680 of 1727)
PASS: lldb-Unit :: Utility/./UtilityTests/ArgsTest.TestOverwriteArgs (1681 of 1727)
PASS: lldb-Suite :: commands/command/script_alias/TestCommandScriptAlias.py (1682 of 1727)
PASS: lldb-Unit :: Utility/./UtilityTests/BinaryStreamTest.PutULEB128Zero (1683 of 1727)
PASS: lldb-Suite :: python_api/watchpoint/watchlocation/TestTargetWatchAddress.py (1684 of 1727)
PASS: lldb-Unit :: Symbol/./SymbolTests/TestClangASTContext.TemplateArguments (1685 of 1727)
PASS: lldb-Suite :: commands/expression/char/TestExprsChar.py (1686 of 1727)
UNSUPPORTED: LLDB :: Expr/TestIRMemoryMapWindows.test (1687 of 1727)
PASS: lldb-Suite :: functionalities/thread/concurrent_events/TestConcurrentTwoBreakpointThreads.py (1688 of 1727)
PASS: lldb-Suite :: functionalities/thread/exit_during_step/TestExitDuringStep.py (1689 of 1727)
PASS: lldb-Unit :: Language/Highlighting/./HighlighterTests/HighlighterTest.ClangComments (1690 of 1727)
PASS: lldb-Suite :: functionalities/data-formatter/synthcapping/TestSyntheticCapping.py (1691 of 1727)
PASS: lldb-Suite :: commands/expression/import-std-module/list-dbg-info-content/TestDbgInfoContentList.py (1692 of 1727)
PASS: LLDB :: SymbolFile/DWARF/dwarf5-partial-index.cpp (1693 of 1727)
PASS: lldb-Unit :: Utility/./UtilityTests/StringExtractorTest.GetU32BigEndian (1694 of 1727)
PASS: lldb-Unit :: Utility/./UtilityTests/StringExtractorTest.GetHexU8_Exact_NoEof (1695 of 1727)
PASS: lldb-Unit :: Utility/./UtilityTests/StringListTest.ForRange (1696 of 1727)
PASS: lldb-Suite :: functionalities/avoids-fd-leak/TestFdLeak.py (1697 of 1727)
PASS: lldb-Suite :: functionalities/thread/backtrace_all/TestBacktraceAll.py (1698 of 1727)
PASS: lldb-Unit :: Utility/./UtilityTests/StringExtractorTest.GetNameColonValueNoColon (1699 of 1727)
PASS: lldb-Suite :: functionalities/data-formatter/data-formatter-stl/libcxx/initializerlist/TestInitializerList.py (1700 of 1727)
PASS: lldb-Unit :: Utility/./UtilityTests/RangeTest.DefaultConstructor (1701 of 1727)
PASS: lldb-Suite :: commands/platform/basic/TestPlatformCommand.py (1702 of 1727)
PASS: lldb-Suite :: macosx/indirect_symbol/TestIndirectSymbols.py (1703 of 1727)
PASS: lldb-Suite :: functionalities/breakpoint/inlined_breakpoints/TestInlinedBreakpoints.py (1704 of 1727)
PASS: lldb-Unit :: Process/minidump/./LLDBMinidumpTests/MinidumpParserTest.GetMemory (1705 of 1727)
PASS: LLDB :: Reproducer/TestReuseDirectory.test (1706 of 1727)
PASS: lldb-Suite :: lang/objc/foundation/TestObjCMethods2.py (1707 of 1727)
PASS: lldb-Unit :: SymbolFile/DWARF/./SymbolFileDWARFTests/SymbolFileDWARFTests.TestAbbrevMissingTerminator (1708 of 1727)
PASS: lldb-Suite :: lang/objc/modules-cache/TestClangModulesCache.py (1709 of 1727)
PASS: lldb-Unit :: Utility/./UtilityTests/StreamTest.PutRawBytesToBigEndian (1710 of 1727)
PASS: lldb-Suite :: functionalities/data-formatter/stringprinter/TestStringPrinter.py (1711 of 1727)
UNSUPPORTED: LLDB :: SymbolFile/PDB/vbases.test (1712 of 1727)
PASS: LLDB :: SymbolFile/DWARF/parallel-indexing-stress.s (1713 of 1727)
PASS: lldb-Suite :: commands/frame/diagnose/complicated-expression/TestComplicatedExpression.py (1714 of 1727)
PASS: lldb-Suite :: commands/expression/import-std-module/queue/TestQueue.py (1715 of 1727)
PASS: lldb-Suite :: commands/expression/test/TestExprs.py (1716 of 1727)
PASS: lldb-Suite :: lang/objc/objc-new-syntax/TestObjCNewSyntaxDictionary.py (1717 of 1727)
PASS: lldb-Suite :: commands/target/create-deps/TestTargetCreateDeps.py (1718 of 1727)
PASS: lldb-Suite :: functionalities/data-formatter/nsdictionarysynth/TestNSDictionarySynthetic.py (1719 of 1727)
PASS: lldb-Suite :: lang/objc/objc-foundation-dictionary-empty/TestNSDictionary0.py (1720 of 1727)
PASS: lldb-Suite :: lang/cpp/template-function/TestTemplateFunctions.py (1721 of 1727)
PASS: lldb-Suite :: lang/objc/objc-struct-return/TestObjCStructReturn.py (1722 of 1727)
PASS: lldb-Suite :: commands/expression/po_verbosity/TestPoVerbosity.py (1723 of 1727)
PASS: lldb-Suite :: types/TestIntegerTypes.py (1724 of 1727)
PASS: lldb-Suite :: tools/lldb-server/TestLldbGdbServer.py (1725 of 1727)
PASS: lldb-Suite :: lang/cpp/enum_types/TestCPP11EnumTypes.py (1726 of 1727)
PASS: lldb-Suite :: types/TestIntegerTypesExpr.py (1727 of 1727)
Testing Time: 1613.30s
********************
Failing Tests (4):
    lldb-Suite :: functionalities/gdb_remote_client/TestGDBRemoteLoad.py
    lldb-Suite :: functionalities/gdb_remote_client/TestThreadSelectionBug.py
    lldb-Suite :: commands/expression/multiline-completion/TestMultilineCompletion.py
    lldb-Suite :: functionalities/gdb_remote_client/TestGDBRemoteClient.py

********************
Unresolved Tests (1):
    lldb-Suite :: commands/expression/diagnostics/TestExprDiagnostics.py


Slowest Tests:
--------------------------------------------------------------------------
113.21s: lldb-Suite :: functionalities/inferior-crashing/TestInferiorCrashingStep.py
114.72s: lldb-Suite :: lang/objc/foundation/TestObjCMethodsString.py
115.32s: lldb-Suite :: api/check_public_api_headers/TestPublicAPIHeaders.py
118.79s: lldb-Suite :: commands/target/basic/TestTargetCommand.py
119.31s: lldb-Suite :: python_api/target/TestTargetAPI.py
135.42s: lldb-Suite :: lang/objc/objc-new-syntax/TestObjCNewSyntaxArray.py
139.87s: lldb-Suite :: lang/objc/objc-new-syntax/TestObjCNewSyntaxDictionary.py
146.51s: lldb-Suite :: functionalities/recursion/TestValueObjectRecursion.py
168.34s: lldb-Suite :: lang/objc/objc-new-syntax/TestObjCNewSyntaxLiteral.py
170.54s: lldb-Suite :: functionalities/load_unload/TestLoadUnload.py
174.69s: lldb-Suite :: lang/objc/exceptions/TestObjCExceptions.py
189.19s: lldb-Suite :: lang/objc/foundation/TestObjCMethods.py
198.74s: lldb-Suite :: functionalities/gdb_remote_client/TestGDBRemoteLoad.py
207.37s: lldb-Suite :: lang/cpp/namespace/TestNamespaceLookup.py
221.30s: lldb-Suite :: functionalities/return-value/TestReturnValue.py
224.57s: lldb-Suite :: lang/objc/hidden-ivars/TestHiddenIvars.py
226.23s: lldb-Suite :: api/multithreaded/TestMultithreaded.py
274.34s: lldb-Suite :: types/TestIntegerTypes.py
372.97s: lldb-Suite :: types/TestIntegerTypesExpr.py
680.92s: lldb-Suite :: lang/objc/foundation/TestFoundationDisassembly.py

Tests Times:
--------------------------------------------------------------------------
[   Range   ] :: [               Percentage               ] :: [  Count  ]
--------------------------------------------------------------------------
[  0s, 50s) :: [*************************************   ] :: [1624/1727]
[ 50s,100s) :: [*                                       ] :: [  77/1727]
[100s,150s) :: [                                        ] :: [  13/1727]
[150s,200s) :: [                                        ] :: [   5/1727]
[200s,250s) :: [                                        ] :: [   5/1727]
[250s,300s) :: [                                        ] :: [   1/1727]
[300s,350s) :: [                                        ] :: [   0/1727]
[350s,400s) :: [                                        ] :: [   1/1727]
[400s,450s) :: [                                        ] :: [   0/1727]
[450s,500s) :: [                                        ] :: [   0/1727]
[500s,550s) :: [                                        ] :: [   0/1727]
[550s,600s) :: [                                        ] :: [   0/1727]
[600s,650s) :: [                                        ] :: [   0/1727]
[650s,700s) :: [                                        ] :: [   1/1727]
  Expected Passes    : 1672
  Expected Failures  : 6
  Unsupported Tests  : 44
  Unresolved Tests   : 1
  Unexpected Failures: 4
FAILED: tools/lldb/lit/CMakeFiles/check-lldb-lit 
cd /Users/buildslave/jenkins/workspace/lldb-cmake-sanitized/lldb-build/tools/lldb/lit && /usr/bin/python /Users/buildslave/jenkins/workspace/lldb-cmake-sanitized/lldb-build/./bin/llvm-lit -v --time-tests --shuffle --xunit-xml-output=/Users/buildslave/jenkins/workspace/lldb-cmake-sanitized/test/results.xml -v --timeout 1200 /Users/buildslave/jenkins/workspace/lldb-cmake-sanitized/lldb-build/tools/lldb/lit
ninja: build stopped: subcommand failed.
Command failed 
Command: ['/usr/bin/env', 'TERM=vt100', '/usr/local/bin/ninja', '-v', 'check-lldb']