FailedConsole Output

Skipping 8,129 KB.. Full Log
ange.CollectionContains (676 of 1727)
PASS: lldb-Unit :: Utility/./UtilityTests/TimerTest.CategoryTimes2 (677 of 1727)
PASS: LLDB :: Modules/ELF/many-sections.s (678 of 1727)
PASS: lldb-Unit :: Utility/./UtilityTests/StreamTest.PutBytesAsRawHex8ToMixedEndian (679 of 1727)
PASS: lldb-Suite :: lang/cpp/function_refs/TestFunctionRefs.py (680 of 1727)
PASS: lldb-Suite :: functionalities/data-formatter/data-formatter-stl/libstdcpp/list/TestDataFormatterStdList.py (681 of 1727)
PASS: LLDB :: SymbolFile/DWARF/find-basic-variable.cpp (682 of 1727)
PASS: lldb-Suite :: python_api/function_symbol/TestDisasmAPI.py (683 of 1727)
PASS: lldb-Unit :: Utility/./UtilityTests/RangeTest.Constructor (684 of 1727)
PASS: lldb-Unit :: Language/Highlighting/./HighlighterTests/HighlighterTest.ClangBraces (685 of 1727)
PASS: lldb-Suite :: functionalities/exec/TestExec.py (686 of 1727)
PASS: lldb-Unit :: Language/Highlighting/./HighlighterTests/HighlighterTest.ClangCursorPosBeforeOtherToken (687 of 1727)
PASS: lldb-Unit :: Utility/./UtilityTests/UriParserTest.BadPort2 (688 of 1727)
PASS: lldb-Suite :: functionalities/inline-stepping/TestInlineStepping.py (689 of 1727)
PASS: lldb-Suite :: lang/objc/objc-checker/TestObjCCheckers.py (690 of 1727)
PASS: lldb-Suite :: lang/cpp/char1632_t/TestChar1632T.py (691 of 1727)
PASS: lldb-Unit :: UnwindAssembly/x86/./UnwindAssemblyx86Tests/Testx86AssemblyInspectionEngine.TestPushRBPWithREX (692 of 1727)
PASS: lldb-Suite :: functionalities/thread/concurrent_events/TestConcurrentTwoWatchpointsOneBreakpoint.py (693 of 1727)
PASS: lldb-Suite :: commands/frame/diagnose/complicated-expression/TestComplicatedExpression.py (694 of 1727)
PASS: lldb-Suite :: functionalities/thread/concurrent_events/TestConcurrentWatchpointWithDelayWatchpointThreads.py (695 of 1727)
PASS: lldb-Unit :: UnwindAssembly/x86/./UnwindAssemblyx86Tests/Testx86AssemblyInspectionEngine.TestLEAVE (696 of 1727)
PASS: lldb-Suite :: functionalities/thread/concurrent_events/TestConcurrentTwoWatchpointThreads.py (697 of 1727)
PASS: lldb-Unit :: Utility/./UtilityTests/StringListTest.SplitIntoLinesSingleTrailingCR (698 of 1727)
PASS: lldb-Unit :: Utility/./UtilityTests/RegularExpression.Valid (699 of 1727)
PASS: LLDB :: SymbolFile/DWARF/find-basic-function.cpp (700 of 1727)
PASS: lldb-Unit :: UnwindAssembly/x86/./UnwindAssemblyx86Tests/Testx86AssemblyInspectionEngine.TestPushR15 (701 of 1727)
PASS: lldb-Suite :: functionalities/data-formatter/data-formatter-objc/TestDataFormatterObjCNSURL.py (702 of 1727)
PASS: lldb-Suite :: functionalities/step-avoids-no-debug/TestStepNoDebug.py (703 of 1727)
PASS: LLDB :: Quit/TestQuitExitCodeNonInt.test (704 of 1727)
PASS: lldb-Unit :: Host/./HostTests/NativeProcessProtocolTest.SetBreakpointFailRead (705 of 1727)
FAIL: lldb-Suite :: commands/expression/multiline-completion/TestMultilineCompletion.py (706 of 1727)
******************** TEST 'lldb-Suite :: commands/expression/multiline-completion/TestMultilineCompletion.py' FAILED ********************
lldb version 10.0.99 (http://labmaster3.local/git/llvm-project.git revision 466fb68fce10d34963c2fd651de32bd3a4ddcd1f)
  clang revision 466fb68fce10d34963c2fd651de32bd3a4ddcd1f
  llvm revision 466fb68fce10d34963c2fd651de32bd3a4ddcd1f
LLDB library dir: /Users/buildslave/jenkins/workspace/lldb-cmake-sanitized/lldb-build/bin
LLDB import library dir: /Users/buildslave/jenkins/workspace/lldb-cmake-sanitized/lldb-build/bin
libstdcxx tests will not be run because: Don't know how to build with libstdcxx on macosx
Skipping following debug info categories: ['dwo']
(lldb) settings set symbols.enable-external-lookup false
(lldb) settings set plugin.process.gdb-remote.packet-timeout 60
(lldb) settings set symbols.clang-modules-cache-path "/Users/buildslave/jenkins/workspace/lldb-cmake-sanitized/lldb-build/tools/lldb/lldb-test-build.noindex/module-cache-lldb"
(lldb) settings set use-color false
(lldb) target create "/Users/buildslave/jenkins/workspace/lldb-cmake-sanitized/lldb-build/tools/lldb/lldb-test-build.noindex/commands/expression/multiline-completion/TestMultilineCompletion.test_basic_completion/a.out"
Current executable set to '/Users/buildslave/jenkins/workspace/lldb-cmake-sanitized/lldb-build/tools/lldb/lldb-test-build.noindex/commands/expression/multiline-completion/TestMultilineCompletion.test_basic_completion/a.out' (x86_64).
(lldb) b main
b main
Breakpoint 1: where = a.out`main + 18 at main.c:2:7, address = 0x0000000100000fa2
(lldb) run
run
Process 15640 launched: '/Users/buildslave/jenkins/workspace/lldb-cmake-sanitized/lldb-build/tools/lldb/lldb-test-build.noindex/commands/expression/multiline-completion/TestMultilineCompletion.test_basic_completion/a.out' (x86_64)
Process 15640 stopped
* thread #1, queue = 'com.apple.main-thread', stop reason = breakpoint 1.1
    frame #0: 0x0000000100000fa2 a.out`main(argc=1, argv=0x00007ffeefbff4d0) at main.c:2:7
   1   	int main(int argc, char **argv) {
-> 2   	  int to_complete = 0;
    	      ^
   3   	  return to_complete;
   4   	}
(lldb) expr
expr
Enter expressions, then terminate with an empty line to evaluate:
to_	  1:    1: to_	to_
  1: to_complete 

Hide Details

 1: to_complete 2:  2:  (int) $0 = 0 (lldb) settings set interpreter.prompt-on-quit false

Hide Details

Session logs for test failures/errors/unexpected successes will go into directory '/Users/buildslave/jenkins/workspace/lldb-cmake-sanitized/test/logs' Command invoked: /Users/buildslave/jenkins/workspace/lldb-cmake-sanitized/llvm-project/lldb/test/dotest.py --arch=x86_64 -s /Users/buildslave/jenkins/workspace/lldb-cmake-sanitized/lldb-build/lldb-test-traces -S nm -u CXXFLAGS -u CFLAGS --executable /Users/buildslave/jenkins/workspace/lldb-cmake-sanitized/lldb-build/./bin/lldb --dsymutil /Users/buildslave/jenkins/workspace/lldb-cmake-sanitized/lldb-build/./bin/dsymutil --filecheck /Users/buildslave/jenkins/workspace/lldb-cmake-sanitized/lldb-build/./bin/FileCheck -C /Users/buildslave/jenkins/workspace/lldb-cmake-sanitized/host-compiler/bin/clang --codesign-identity lldb_codesign --server /Users/buildslave/jenkins/workspace/lldb-cmake-sanitized/lldb-build/./bin/debugserver --arch x86_64 --build-dir /Users/buildslave/jenkins/workspace/lldb-cmake-sanitized/lldb-build/lldb-test-build.noindex -s=/Users/buildslave/jenkins/workspace/lldb-cmake-sanitized/test/logs -t --env TERM=vt100 --env LLVM_LIBS_DIR=/Users/buildslave/jenkins/workspace/lldb-cmake-sanitized/lldb-build/./lib --build-dir /Users/buildslave/jenkins/workspace/lldb-cmake-sanitized/lldb-build/tools/lldb/lldb-test-build.noindex --module-cache-dir /Users/buildslave/jenkins/workspace/lldb-cmake-sanitized/lldb-build/tools/lldb/lldb-test-build.noindex/module-cache-lldb /Users/buildslave/jenkins/workspace/lldb-cmake-sanitized/llvm-project/lldb/packages/Python/lldbsuite/test/commands/expression/multiline-completion -p TestMultilineCompletion.py Change dir to: /Users/buildslave/jenkins/workspace/lldb-cmake-sanitized/llvm-project/lldb/packages/Python/lldbsuite/test/commands/expression/multiline-completion runCmd: settings set symbols.enable-external-lookup false output:

Hide Details

runCmd: settings set plugin.process.gdb-remote.packet-timeout 60 output:

Hide Details

runCmd: settings set symbols.clang-modules-cache-path "/Users/buildslave/jenkins/workspace/lldb-cmake-sanitized/lldb-build/tools/lldb/lldb-test-build.noindex/module-cache-lldb" output:

Hide Details

runCmd: settings set use-color false output:

Hide Details

FAIL: LLDB (/Users/buildslave/jenkins/workspace/lldb-cmake-sanitized/host-compiler/bin/clang-10-x86_64) :: test_basic_completion (TestMultilineCompletion.MultilineCompletionTest) tearing down the child process....

Hide Details

CLEANUP ERROR: LLDB (/Users/buildslave/jenkins/workspace/lldb-cmake-sanitized/host-compiler/bin/clang-10-x86_64) :: test_basic_completion (TestMultilineCompletion.MultilineCompletionTest) Restore dir to: /Users/buildslave/jenkins/workspace/lldb-cmake-sanitized/lldb-build/tools/lldb/lit ====================================================================== ERROR: test_basic_completion (TestMultilineCompletion.MultilineCompletionTest) Test that we can complete a simple multiline expression ---------------------------------------------------------------------- Traceback (most recent call last): File "/Users/buildslave/jenkins/workspace/lldb-cmake-sanitized/llvm-project/lldb/packages/Python/lldbsuite/test/commands/expression/multiline-completion/TestMultilineCompletion.py", line 30, in test_basic_completion self.quit() File "/Users/buildslave/jenkins/workspace/lldb-cmake-sanitized/llvm-project/lldb/packages/Python/lldbsuite/test/lldbpexpect.py", line 61, in quit self.child.close(force=not gracefully) File "/Users/buildslave/jenkins/workspace/lldb-cmake-sanitized/llvm-project/lldb/third_party/Python/module/pexpect-4.6/pexpect/pty_spawn.py", line 327, in close self.ptyproc.close(force=force) File "/System/Library/Frameworks/Python.framework/Versions/2.7/lib/python2.7/contextlib.py", line 35, in __exit__ self.gen.throw(type, value, traceback) File "/Users/buildslave/jenkins/workspace/lldb-cmake-sanitized/llvm-project/lldb/third_party/Python/module/pexpect-4.6/pexpect/pty_spawn.py", line 25, in _wrap_ptyprocess_err raise ExceptionPexpect(*e.args) ExceptionPexpect: Could not terminate the child. Config=x86_64-/Users/buildslave/jenkins/workspace/lldb-cmake-sanitized/host-compiler/bin/clang-10 ---------------------------------------------------------------------- Ran 1 test in 7.123s

Hide Details

RESULT: FAILED (0 passes, 0 failures, 1 errors, 0 skipped, 0 expected failures, 0 unexpected successes)

Hide Details

******************** PASS: lldb-Unit :: Utility/./UtilityTests/BinaryStreamTest.PutULEB128NineBytes (707 of 1727) PASS: lldb-Suite :: functionalities/signal/handle-segv/TestHandleSegv.py (708 of 1727) PASS: lldb-Suite :: functionalities/thread/thread_specific_break_plus_condition/TestThreadSpecificBpPlusCondition.py (709 of 1727) PASS: lldb-Unit :: Language/Highlighting/./HighlighterTests/HighlighterTest.ClangIdentifiers (710 of 1727) PASS: lldb-Suite :: lang/objc/objc-foundation-dictionary-empty/TestNSDictionary0.py (711 of 1727) PASS: lldb-Suite :: functionalities/show_location/TestShowLocationDwarf5.py (712 of 1727) PASS: lldb-Suite :: lang/objc/objc-struct-argument/TestObjCStructArgument.py (713 of 1727) PASS: lldb-Suite :: python_api/objc_type/TestObjCType.py (714 of 1727) PASS: lldb-Unit :: Utility/./UtilityTests/RegularExpression.Match (715 of 1727) PASS: lldb-Unit :: Utility/./UtilityTests/StringExtractorTest.GetHexU8_InvalidHex (716 of 1727) PASS: lldb-Suite :: functionalities/data-formatter/data-formatter-stl/libcxx/unordered/TestDataFormatterUnordered.py (717 of 1727) PASS: lldb-Unit :: Utility/./UtilityTests/DataExtractorTest.GetMaxU64 (718 of 1727) PASS: lldb-Suite :: functionalities/plugins/python_os_plugin/TestPythonOSPlugin.py (719 of 1727) PASS: lldb-Unit :: UnwindAssembly/x86/./UnwindAssemblyx86Tests/Testx86AssemblyInspectionEngine.TestDisassemblyMidFunctionEpilogues (720 of 1727) PASS: lldb-Unit :: Host/./HostTests/FileSystemTest.GetByteSize (721 of 1727) PASS: lldb-Unit :: UnwindAssembly/x86/./UnwindAssemblyx86Tests/Testx86AssemblyInspectionEngine.TestPushEDX (722 of 1727) PASS: lldb-Unit :: Host/./HostTests/Host.GetEnvironment (723 of 1727) PASS: lldb-Suite :: lang/objc/rdar-12408181/TestRdar12408181.py (724 of 1727) PASS: lldb-Unit :: Utility/./UtilityTests/StringExtractorTest.DecodeHexU8_Underflow (725 of 1727) PASS: lldb-Suite :: lang/objc/objc-optimized/TestObjcOptimized.py (726 of 1727) PASS: lldb-Suite :: commands/watchpoints/variable_out_of_scope/TestWatchedVarHitWhenInScope.py (727 of 1727) PASS: lldb-Suite :: functionalities/data-formatter/synthcapping/TestSyntheticCapping.py (728 of 1727) PASS: lldb-Unit :: UnwindAssembly/x86/./UnwindAssemblyx86Tests/Testx86AssemblyInspectionEngine.TestPushExtended (729 of 1727) UNSUPPORTED: LLDB :: SymbolFile/PDB/function-level-linking.test (730 of 1727) PASS: lldb-Suite :: lang/objc/objc-new-syntax/TestObjCNewSyntaxDictionary.py (731 of 1727) PASS: lldb-Unit :: Utility/./UtilityTests/CompletionRequest.Constructor (732 of 1727) PASS: lldb-Suite :: functionalities/darwin_log/format/TestDarwinLogMessageFormat.py (733 of 1727) PASS: lldb-Suite :: functionalities/inferior-crashing/TestInferiorCrashingStep.py (734 of 1727) PASS: lldb-Unit :: Core/./LLDBCoreTests/RichManglingContextTest.Basic (735 of 1727) UNSUPPORTED: LLDB :: SymbolFile/PDB/class-layout.test (736 of 1727) PASS: lldb-Suite :: lang/c/shared_lib_stripped_symbols/TestSharedLibStrippedSymbols.py (737 of 1727) PASS: lldb-Suite :: functionalities/postmortem/elf-core/gcore/TestGCore.py (738 of 1727) PASS: lldb-Suite :: commands/expression/xvalue/TestXValuePrinting.py (739 of 1727) PASS: lldb-Suite :: lang/cpp/virtual-overload/TestVirtualOverload.py (740 of 1727) PASS: lldb-Suite :: commands/expression/import-std-module/sysroot/TestStdModuleSysroot.py (741 of 1727) PASS: lldb-Unit :: Utility/./UtilityTests/RecordReplayTest.InstrumentedBar (742 of 1727) PASS: lldb-Suite :: commands/expression/import-std-module/shared_ptr/TestSharedPtr.py (743 of 1727) PASS: lldb-Unit :: Utility/./UtilityTests/AnsiTerminal.Unknown (744 of 1727) PASS: LLDB :: Driver/TestCommands.test (745 of 1727) PASS: lldb-Unit :: Process/minidump/./LLDBMinidumpTests/MinidumpParserTest.GetMiscInfo_no_stream (746 of 1727) PASS: LLDB :: Commands/command-backtrace.test (747 of 1727) PASS: lldb-Unit :: Utility/./UtilityTests/Flags.AnyClear (748 of 1727) PASS: lldb-Suite :: functionalities/set-data/TestSetData.py (749 of 1727) PASS: lldb-Unit :: Platform/./LLDBPlatformTests/PlatformDarwinTest.TestParseVersionBuildDir (750 of 1727) PASS: lldb-Suite :: lang/cpp/symbols/TestSymbols.py (751 of 1727) PASS: lldb-Suite :: tools/lldb-server/signal-filtering/TestGdbRemote_QPassSignals.py (752 of 1727) PASS: lldb-Unit :: ScriptInterpreter/Python/./ScriptInterpreterPythonTests/PythonDataObjectsTest.TestPythonInteger (753 of 1727) PASS: lldb-Unit :: Interpreter/./InterpreterTests/CompletionTest.DirCompletionUsername (754 of 1727) PASS: lldb-Suite :: commands/target/create-no-such-arch/TestNoSuchArch.py (755 of 1727) PASS: lldb-Unit :: Utility/./UtilityTests/StreamTest.PutCString (756 of 1727) PASS: lldb-Suite :: functionalities/thread/concurrent_events/TestConcurrentSignalDelayWatch.py (757 of 1727) UNSUPPORTED: LLDB :: Breakpoint/case-insensitive.test (758 of 1727) PASS: lldb-Suite :: functionalities/tail_call_frames/ambiguous_tail_call_seq1/TestAmbiguousTailCallSeq1.py (759 of 1727) PASS: lldb-Suite :: commands/watchpoints/watchpoint_commands/command/TestWatchpointCommandLLDB.py (760 of 1727) PASS: lldb-Unit :: Host/./HostTests/MainLoopTest.DetectsEOF (761 of 1727) PASS: lldb-Suite :: lang/objc/objc-dynamic-value/TestObjCDynamicValue.py (762 of 1727) PASS: lldb-Suite :: functionalities/backticks/TestBackticksWithoutATarget.py (763 of 1727) PASS: LLDB :: Modules/PECOFF/uuid.yaml (764 of 1727) PASS: lldb-Suite :: functionalities/data-formatter/data-formatter-objc/TestDataFormatterObjNSException.py (765 of 1727) PASS: lldb-Suite :: functionalities/thread/concurrent_events/TestConcurrentDelayedCrashWithBreakpointSignal.py (766 of 1727) PASS: lldb-Suite :: terminal/TestSTTYBeforeAndAfter.py (767 of 1727) UNSUPPORTED: LLDB :: Register/x86-64-zmm-read.test (768 of 1727) PASS: lldb-Suite :: functionalities/data-formatter/data-formatter-stl/libcxx/multimap/TestDataFormatterLibccMultiMap.py (769 of 1727) PASS: LLDB :: Modules/ELF/base-address.yaml (770 of 1727) PASS: LLDB :: SymbolFile/Breakpad/line-table.test (771 of 1727) PASS: lldb-Suite :: commands/frame/recognizer/TestFrameRecognizer.py (772 of 1727) PASS: lldb-Unit :: Process/gdb-remote/./ProcessGdbRemoteTests/GDBRemoteClientBaseTest.SendContinueAndInterrupt (773 of 1727) PASS: lldb-Suite :: functionalities/breakpoint/cpp_exception/TestCPPExceptionBreakpoint.py (774 of 1727) PASS: lldb-Suite :: commands/expression/persist_objc_pointeetype/TestPersistObjCPointeeType.py (775 of 1727) PASS: lldb-Suite :: commands/apropos/with-process/TestAproposWithProcess.py (776 of 1727) PASS: lldb-Suite :: commands/expression/completion/TestExprCompletion.py (777 of 1727) PASS: lldb-Suite :: commands/frame/var/TestFrameVar.py (778 of 1727) PASS: lldb-Unit :: Utility/./UtilityTests/ProcessInstanceInfo.DumpTable (779 of 1727) PASS: lldb-Suite :: functionalities/rerun/TestRerun.py (780 of 1727) PASS: lldb-Suite :: functionalities/value_md5_crash/TestValueMD5Crash.py (781 of 1727) PASS: lldb-Suite :: functionalities/thread/concurrent_events/TestConcurrentCrashWithWatchpoint.py (782 of 1727) PASS: lldb-Unit :: Utility/./UtilityTests/RangeTest.ContainsRangeStartingFromZero (783 of 1727) PASS: lldb-Unit :: Utility/./UtilityTests/ConstStringTest.CompareStringRef (784 of 1727) PASS: lldb-Suite :: functionalities/breakpoint/require_hw_breakpoints/TestRequireHWBreakpoints.py (785 of 1727) PASS: lldb-Suite :: commands/command/script/import/rdar-12586188/TestRdar12586188.py (786 of 1727) PASS: lldb-Suite :: commands/expression/import-std-module/deque-dbg-info-content/TestDbgInfoContentDeque.py (787 of 1727) PASS: lldb-Unit :: Utility/./UtilityTests/VASprintfTest.BufferResize (788 of 1727) PASS: lldb-Unit :: Host/./HostTests/SocketAddressTest.GetAddressInfo (789 of 1727) PASS: lldb-Unit :: Utility/./UtilityTests/ConstStringTest.CompareConstString (790 of 1727) PASS: lldb-Suite :: tools/lldb-server/platform-process-connect/TestPlatformProcessConnect.py (791 of 1727) PASS: lldb-Suite :: lang/cpp/this/TestCPPThis.py (792 of 1727) PASS: lldb-Unit :: Language/CPlusPlus/./LanguageCPlusPlusTests/CPlusPlusLanguage.CPlusPlusNameParser (793 of 1727) FAIL: lldb-Suite :: tools/lldb-server/TestAppleSimulatorOSType.py (794 of 1727) ******************** TEST 'lldb-Suite :: tools/lldb-server/TestAppleSimulatorOSType.py' FAILED ******************** lldb version 10.0.99 (http://labmaster3.local/git/llvm-project.git revision 466fb68fce10d34963c2fd651de32bd3a4ddcd1f) clang revision 466fb68fce10d34963c2fd651de32bd3a4ddcd1f llvm revision 466fb68fce10d34963c2fd651de32bd3a4ddcd1f LLDB library dir: /Users/buildslave/jenkins/workspace/lldb-cmake-sanitized/lldb-build/bin LLDB import library dir: /Users/buildslave/jenkins/workspace/lldb-cmake-sanitized/lldb-build/bin libstdcxx tests will not be run because: Don't know how to build with libstdcxx on macosx Skipping following debug info categories: ['dwo']

Hide Details

Session logs for test failures/errors/unexpected successes will go into directory '/Users/buildslave/jenkins/workspace/lldb-cmake-sanitized/test/logs' Command invoked: /Users/buildslave/jenkins/workspace/lldb-cmake-sanitized/llvm-project/lldb/test/dotest.py --arch=x86_64 -s /Users/buildslave/jenkins/workspace/lldb-cmake-sanitized/lldb-build/lldb-test-traces -S nm -u CXXFLAGS -u CFLAGS --executable /Users/buildslave/jenkins/workspace/lldb-cmake-sanitized/lldb-build/./bin/lldb --dsymutil /Users/buildslave/jenkins/workspace/lldb-cmake-sanitized/lldb-build/./bin/dsymutil --filecheck /Users/buildslave/jenkins/workspace/lldb-cmake-sanitized/lldb-build/./bin/FileCheck -C /Users/buildslave/jenkins/workspace/lldb-cmake-sanitized/host-compiler/bin/clang --codesign-identity lldb_codesign --server /Users/buildslave/jenkins/workspace/lldb-cmake-sanitized/lldb-build/./bin/debugserver --arch x86_64 --build-dir /Users/buildslave/jenkins/workspace/lldb-cmake-sanitized/lldb-build/lldb-test-build.noindex -s=/Users/buildslave/jenkins/workspace/lldb-cmake-sanitized/test/logs -t --env TERM=vt100 --env LLVM_LIBS_DIR=/Users/buildslave/jenkins/workspace/lldb-cmake-sanitized/lldb-build/./lib --build-dir /Users/buildslave/jenkins/workspace/lldb-cmake-sanitized/lldb-build/tools/lldb/lldb-test-build.noindex --module-cache-dir /Users/buildslave/jenkins/workspace/lldb-cmake-sanitized/lldb-build/tools/lldb/lldb-test-build.noindex/module-cache-lldb /Users/buildslave/jenkins/workspace/lldb-cmake-sanitized/llvm-project/lldb/packages/Python/lldbsuite/test/tools/lldb-server -p TestAppleSimulatorOSType.py Change dir to: /Users/buildslave/jenkins/workspace/lldb-cmake-sanitized/llvm-project/lldb/packages/Python/lldbsuite/test/tools/lldb-server runCmd: settings set symbols.enable-external-lookup false output:

Hide Details

runCmd: settings set plugin.process.gdb-remote.packet-timeout 60 output:

Hide Details

runCmd: settings set symbols.clang-modules-cache-path "/Users/buildslave/jenkins/workspace/lldb-cmake-sanitized/lldb-build/tools/lldb/lldb-test-build.noindex/module-cache-lldb" output:

Hide Details

runCmd: settings set use-color false output:

Hide Details

Adding tearDown hook: def shutdown_named_pipe(): # Close the pipe. try: named_pipe.close() except: print("failed to close named pipe") None

Hide Details

# Delete the pipe. try: os.remove(named_pipe_path) except: print("failed to delete named pipe: {}".format(named_pipe_path)) None

Hide Details

# Delete the temp directory. try: os.rmdir(temp_dir) except: print( "failed to delete temp dir: {}, directory contents: '{}'".format( temp_dir, os.listdir(temp_dir))) None

Hide Details

Hide Details

Adding tearDown hook: def cleanupSubprocesses(self): # Ensure any subprocesses are cleaned up for p in self.subprocesses: p.terminate() del p del self.subprocesses[:] # Ensure any forked processes are cleaned up for pid in self.forkedProcessPids: if os.path.exists("/proc/" + str(pid)): os.kill(pid, signal.SIGTERM)

Hide Details

Hide Details

FAIL: LLDB (/Users/buildslave/jenkins/workspace/lldb-cmake-sanitized/host-compiler/bin/clang-10-x86_64) :: test_simulator_ostype_ios (TestAppleSimulatorOSType.TestAppleSimulatorOSType) Executing tearDown hook: def cleanupSubprocesses(self): # Ensure any subprocesses are cleaned up for p in self.subprocesses: p.terminate() del p del self.subprocesses[:] # Ensure any forked processes are cleaned up for pid in self.forkedProcessPids: if os.path.exists("/proc/" + str(pid)): os.kill(pid, signal.SIGTERM)

Hide Details

Hide Details

Executing tearDown hook: def shutdown_named_pipe(): # Close the pipe. try: named_pipe.close() except: print("failed to close named pipe") None

Hide Details

# Delete the pipe. try: os.remove(named_pipe_path) except: print("failed to delete named pipe: {}".format(named_pipe_path)) None

Hide Details

# Delete the temp directory. try: os.rmdir(temp_dir) except: print( "failed to delete temp dir: {}, directory contents: '{}'".format( temp_dir, os.listdir(temp_dir))) None

Hide Details

Hide Details

runCmd: settings set symbols.enable-external-lookup false output:

Hide Details

runCmd: settings set plugin.process.gdb-remote.packet-timeout 60 output:

Hide Details

runCmd: settings set symbols.clang-modules-cache-path "/Users/buildslave/jenkins/workspace/lldb-cmake-sanitized/lldb-build/tools/lldb/lldb-test-build.noindex/module-cache-lldb" output:

Hide Details

runCmd: settings set use-color false output:

Hide Details

Adding tearDown hook: def shutdown_named_pipe(): # Close the pipe. try: named_pipe.close() except: print("failed to close named pipe") None

Hide Details

# Delete the pipe. try: os.remove(named_pipe_path) except: print("failed to delete named pipe: {}".format(named_pipe_path)) None

Hide Details

# Delete the temp directory. try: os.rmdir(temp_dir) except: print( "failed to delete temp dir: {}, directory contents: '{}'".format( temp_dir, os.listdir(temp_dir))) None

Hide Details

Hide Details

Adding tearDown hook: def cleanupSubprocesses(self): # Ensure any subprocesses are cleaned up for p in self.subprocesses: p.terminate() del p del self.subprocesses[:] # Ensure any forked processes are cleaned up for pid in self.forkedProcessPids: if os.path.exists("/proc/" + str(pid)): os.kill(pid, signal.SIGTERM)

Hide Details

Hide Details

Adding tearDown hook: def shutdown_debug_monitor(): try: server.terminate() except: logger.warning( "failed to terminate server for debug monitor: {}; ignoring".format( sys.exc_info()[0]))

Hide Details

Hide Details

Adding tearDown hook: def shutdown_socket(): if sock: try: # send the kill packet so lldb-server shuts down gracefully sock.sendall(GdbRemoteTestCaseBase._GDBREMOTE_KILL_PACKET) except: logger.warning( "failed to send kill packet to debug monitor: {}; ignoring".format( sys.exc_info()[0]))

Hide Details

try: sock.close() except: logger.warning( "failed to close socket to debug monitor: {}; ignoring".format( sys.exc_info()[0]))

Hide Details

Hide Details

Executing tearDown hook: def shutdown_socket(): if sock: try: # send the kill packet so lldb-server shuts down gracefully sock.sendall(GdbRemoteTestCaseBase._GDBREMOTE_KILL_PACKET) except: logger.warning( "failed to send kill packet to debug monitor: {}; ignoring".format( sys.exc_info()[0]))

Hide Details

try: sock.close() except: logger.warning( "failed to close socket to debug monitor: {}; ignoring".format( sys.exc_info()[0]))

Hide Details

Hide Details

Executing tearDown hook: def shutdown_debug_monitor(): try: server.terminate() except: logger.warning( "failed to terminate server for debug monitor: {}; ignoring".format( sys.exc_info()[0]))

Hide Details

Hide Details

Executing tearDown hook: def cleanupSubprocesses(self): # Ensure any subprocesses are cleaned up for p in self.subprocesses: p.terminate() del p del self.subprocesses[:] # Ensure any forked processes are cleaned up for pid in self.forkedProcessPids: if os.path.exists("/proc/" + str(pid)): os.kill(pid, signal.SIGTERM)

Hide Details

Hide Details

Executing tearDown hook: def shutdown_named_pipe(): # Close the pipe. try: named_pipe.close() except: print("failed to close named pipe") None

Hide Details

# Delete the pipe. try: os.remove(named_pipe_path) except: print("failed to delete named pipe: {}".format(named_pipe_path)) None

Hide Details

# Delete the temp directory. try: os.rmdir(temp_dir) except: print( "failed to delete temp dir: {}, directory contents: '{}'".format( temp_dir, os.listdir(temp_dir))) None

Hide Details

Hide Details

PASS: LLDB (/Users/buildslave/jenkins/workspace/lldb-cmake-sanitized/host-compiler/bin/clang-10-x86_64) :: test_simulator_ostype_tvos (TestAppleSimulatorOSType.TestAppleSimulatorOSType) runCmd: settings set symbols.enable-external-lookup false output:

Hide Details

runCmd: settings set plugin.process.gdb-remote.packet-timeout 60 output:

Hide Details

runCmd: settings set symbols.clang-modules-cache-path "/Users/buildslave/jenkins/workspace/lldb-cmake-sanitized/lldb-build/tools/lldb/lldb-test-build.noindex/module-cache-lldb" output:

Hide Details

runCmd: settings set use-color false output:

Hide Details

Adding tearDown hook: def shutdown_named_pipe(): # Close the pipe. try: named_pipe.close() except: print("failed to close named pipe") None

Hide Details

# Delete the pipe. try: os.remove(named_pipe_path) except: print("failed to delete named pipe: {}".format(named_pipe_path)) None

Hide Details

# Delete the temp directory. try: os.rmdir(temp_dir) except: print( "failed to delete temp dir: {}, directory contents: '{}'".format( temp_dir, os.listdir(temp_dir))) None

Hide Details

Hide Details

Adding tearDown hook: def cleanupSubprocesses(self): # Ensure any subprocesses are cleaned up for p in self.subprocesses: p.terminate() del p del self.subprocesses[:] # Ensure any forked processes are cleaned up for pid in self.forkedProcessPids: if os.path.exists("/proc/" + str(pid)): os.kill(pid, signal.SIGTERM)

Hide Details

Hide Details

Adding tearDown hook: def shutdown_debug_monitor(): try: server.terminate() except: logger.warning( "failed to terminate server for debug monitor: {}; ignoring".format( sys.exc_info()[0]))

Hide Details

Hide Details

Adding tearDown hook: def shutdown_socket(): if sock: try: # send the kill packet so lldb-server shuts down gracefully sock.sendall(GdbRemoteTestCaseBase._GDBREMOTE_KILL_PACKET) except: logger.warning( "failed to send kill packet to debug monitor: {}; ignoring".format( sys.exc_info()[0]))

Hide Details

try: sock.close() except: logger.warning( "failed to close socket to debug monitor: {}; ignoring".format( sys.exc_info()[0]))

Hide Details

Hide Details

Executing tearDown hook: def shutdown_socket(): if sock: try: # send the kill packet so lldb-server shuts down gracefully sock.sendall(GdbRemoteTestCaseBase._GDBREMOTE_KILL_PACKET) except: logger.warning( "failed to send kill packet to debug monitor: {}; ignoring".format( sys.exc_info()[0]))

Hide Details

try: sock.close() except: logger.warning( "failed to close socket to debug monitor: {}; ignoring".format( sys.exc_info()[0]))

Hide Details

Hide Details

Executing tearDown hook: def shutdown_debug_monitor(): try: server.terminate() except: logger.warning( "failed to terminate server for debug monitor: {}; ignoring".format( sys.exc_info()[0]))

Hide Details

Hide Details

Executing tearDown hook: def cleanupSubprocesses(self): # Ensure any subprocesses are cleaned up for p in self.subprocesses: p.terminate() del p del self.subprocesses[:] # Ensure any forked processes are cleaned up for pid in self.forkedProcessPids: if os.path.exists("/proc/" + str(pid)): os.kill(pid, signal.SIGTERM)

Hide Details

Hide Details

Executing tearDown hook: def shutdown_named_pipe(): # Close the pipe. try: named_pipe.close() except: print("failed to close named pipe") None

Hide Details

# Delete the pipe. try: os.remove(named_pipe_path) except: print("failed to delete named pipe: {}".format(named_pipe_path)) None

Hide Details

# Delete the temp directory. try: os.rmdir(temp_dir) except: print( "failed to delete temp dir: {}, directory contents: '{}'".format( temp_dir, os.listdir(temp_dir))) None

Hide Details

Hide Details

PASS: LLDB (/Users/buildslave/jenkins/workspace/lldb-cmake-sanitized/host-compiler/bin/clang-10-x86_64) :: test_simulator_ostype_watchos (TestAppleSimulatorOSType.TestAppleSimulatorOSType) Restore dir to: /Users/buildslave/jenkins/workspace/lldb-cmake-sanitized/lldb-build/tools/lldb/lit ====================================================================== FAIL: test_simulator_ostype_ios (TestAppleSimulatorOSType.TestAppleSimulatorOSType) ---------------------------------------------------------------------- Traceback (most recent call last): File "/Users/buildslave/jenkins/workspace/lldb-cmake-sanitized/llvm-project/lldb/packages/Python/lldbsuite/test/decorators.py", line 141, in wrapper func(*args, **kwargs) File "/Users/buildslave/jenkins/workspace/lldb-cmake-sanitized/llvm-project/lldb/packages/Python/lldbsuite/test/decorators.py", line 141, in wrapper func(*args, **kwargs) File "/Users/buildslave/jenkins/workspace/lldb-cmake-sanitized/llvm-project/lldb/packages/Python/lldbsuite/test/tools/lldb-server/TestAppleSimulatorOSType.py", line 109, in test_simulator_ostype_ios platform='ios') File "/Users/buildslave/jenkins/workspace/lldb-cmake-sanitized/llvm-project/lldb/packages/Python/lldbsuite/test/tools/lldb-server/TestAppleSimulatorOSType.py", line 65, in check_simulator_ostype server = self.connect_to_debug_monitor(attach_pid=pid) File "/Users/buildslave/jenkins/workspace/lldb-cmake-sanitized/llvm-project/lldb/packages/Python/lldbsuite/test/tools/lldb-server/gdbremote_testcase.py", line 415, in connect_to_debug_monitor server = self.launch_debug_monitor(attach_pid=attach_pid) File "/Users/buildslave/jenkins/workspace/lldb-cmake-sanitized/llvm-project/lldb/packages/Python/lldbsuite/test/tools/lldb-server/gdbremote_testcase.py", line 408, in launch_debug_monitor self.port = self.get_stub_port_from_named_socket() File "/Users/buildslave/jenkins/workspace/lldb-cmake-sanitized/llvm-project/lldb/packages/Python/lldbsuite/test/tools/lldb-server/gdbremote_testcase.py", line 214, in get_stub_port_from_named_socket "write side of pipe has not written anything - stub isn't writing to pipe.") AssertionError: 0 == 0 : write side of pipe has not written anything - stub isn't writing to pipe. Config=x86_64-/Users/buildslave/jenkins/workspace/lldb-cmake-sanitized/host-compiler/bin/clang-10 ---------------------------------------------------------------------- Ran 3 tests in 48.296s

Hide Details

RESULT: FAILED (2 passes, 1 failures, 0 errors, 0 skipped, 0 expected failures, 0 unexpected successes)

Hide Details

******************** PASS: lldb-Unit :: Utility/./UtilityTests/LogChannelTest.Disable (795 of 1727) UNSUPPORTED: LLDB :: SymbolFile/PDB/compilands.test (796 of 1727) PASS: lldb-Suite :: python_api/frame/TestFrames.py (797 of 1727) PASS: lldb-Unit :: Utility/./UtilityTests/UriParserTest.SchemeHostSeparator (798 of 1727) PASS: lldb-Suite :: lang/cpp/gmodules-templates/TestGModules.py (799 of 1727) PASS: LLDB :: Reproducer/TestFileRepro.test (800 of 1727) PASS: lldb-Unit :: Utility/./UtilityTests/IndexToObjectTest.ObjectForIndex (801 of 1727) PASS: lldb-Unit :: Process/minidump/./LLDBMinidumpTests/MinidumpParserTest.GetThreadsAndGetThreadContext (802 of 1727) PASS: lldb-Suite :: types/TestFloatTypes.py (803 of 1727) PASS: lldb-Suite :: lang/cpp/extern_c/TestExternCSymbols.py (804 of 1727) PASS: lldb-Suite :: arm/breakpoint-thumb-codesection/TestBreakpointThumbCodesection.py (805 of 1727) PASS: lldb-Suite :: functionalities/gdb_remote_client/TestNestedRegDefinitions.py (806 of 1727) PASS: lldb-Unit :: tools/lldb-server/tests/./LLDBServerTests/StandardStartupTest.TestStopReplyContainsThreadPcs (807 of 1727) PASS: LLDB :: Driver/TestSingleQuote.test (808 of 1727) PASS: lldb-Unit :: Utility/./UtilityTests/OptionsWithRawTest.ArgsButNoLeadingDash (809 of 1727) PASS: lldb-Unit :: Interpreter/./InterpreterTests/OptionArgParserTest.toChar (810 of 1727) UNSUPPORTED: LLDB :: Register/x86-zmm-write.test (811 of 1727) PASS: lldb-Unit :: Utility/./UtilityTests/StatusTest.Formatv (812 of 1727) PASS: lldb-Unit :: Language/CPlusPlus/./LanguageCPlusPlusTests/CPlusPlusLanguage.MethodNameParsing (813 of 1727) PASS: lldb-Suite :: commands/expression/import-std-module/weak_ptr-dbg-info-content/TestDbgInfoContentWeakPtr.py (814 of 1727) PASS: lldb-Suite :: lang/objc/modules-inline-functions/TestModulesInlineFunctions.py (815 of 1727) PASS: lldb-Suite :: python_api/sbtype_typeclass/TestSBTypeTypeClass.py (816 of 1727) PASS: lldb-Unit :: Utility/./UtilityTests/StreamTest.PutHex8 (817 of 1727) PASS: lldb-Unit :: ScriptInterpreter/Python/./ScriptInterpreterPythonTests/PythonDataObjectsTest.TestPythonTupleSize (818 of 1727) PASS: lldb-Suite :: functionalities/avoids-fd-leak/TestFdLeak.py (819 of 1727) PASS: lldb-Unit :: Utility/./UtilityTests/StatusTest.ErrorConversion (820 of 1727) PASS: lldb-Unit :: Utility/./UtilityTests/ConstStringTest.UpdateMangledCounterpart (821 of 1727) PASS: lldb-Suite :: lang/cpp/call-function/TestCallCPPFunction.py (822 of 1727) PASS: lldb-Suite :: python_api/value/TestValueAPI.py (823 of 1727) PASS: lldb-Unit :: Utility/./UtilityTests/StringExtractorTest.GetHexBytes_Underflow (824 of 1727) PASS: lldb-Suite :: tools/lldb-server/inferior-crash/TestGdbRemoteAbort.py (825 of 1727) PASS: lldb-Suite :: commands/expression/class_template_specialization_empty_pack/TestClassTemplateSpecializationParametersHandling.py (826 of 1727) PASS: LLDB :: Modules/ELF/aarch64-relocations.yaml (827 of 1727) PASS: lldb-Unit :: Utility/./UtilityTests/RangeTest.ContainsAddrInvalid (828 of 1727) PASS: lldb-Unit :: Utility/./UtilityTests/StreamTest.PutBytesAsRawHex8ToBigEndian (829 of 1727) PASS: lldb-Unit :: Utility/./UtilityTests/ArgsTest.StringListConstructor (830 of 1727) PASS: lldb-Unit :: Utility/./UtilityTests/StreamTest.PutStringAsRawHex8 (831 of 1727) PASS: lldb-Unit :: Utility/./UtilityTests/BinaryStreamTest.PutULEB128MaxValue (832 of 1727) PASS: lldb-Unit :: Process/gdb-remote/./ProcessGdbRemoteTests/GDBRemoteCommunicationServerTest.SendErrorResponse_StringError (833 of 1727) PASS: LLDB :: SymbolFile/DWARF/debug_rnglists.s (834 of 1727) PASS: lldb-Suite :: functionalities/breakpoint/breakpoint_by_line_and_column/TestBreakpointByLineAndColumn.py (835 of 1727) PASS: lldb-Unit :: Expression/./ExpressionTests/DWARFExpression.DW_OP_pick (836 of 1727) PASS: lldb-Suite :: commands/expression/weak_symbols/TestWeakSymbols.py (837 of 1727) PASS: lldb-Suite :: python_api/value/empty_class/TestValueAPIEmptyClass.py (838 of 1727) UNSUPPORTED: LLDB :: SymbolFile/PDB/expressions.test (839 of 1727) PASS: lldb-Unit :: UnwindAssembly/x86/./UnwindAssemblyx86Tests/Testx86AssemblyInspectionEngine.TestPushEDI (840 of 1727) PASS: lldb-Suite :: python_api/watchpoint/condition/TestWatchpointConditionAPI.py (841 of 1727) PASS: lldb-Suite :: lang/cpp/class-template-parameter-pack/TestClassTemplateParameterPack.py (842 of 1727) PASS: lldb-Unit :: Utility/./UtilityTests/ConstStringTest.NullAndEmptyStates (843 of 1727) PASS: lldb-Suite :: commands/command/script_alias/TestCommandScriptAlias.py (844 of 1727) PASS: lldb-Unit :: Utility/./UtilityTests/ArgsTest.DoubleQuotedItem (845 of 1727) PASS: LLDB :: Expr/TestIRMemoryMap.test (846 of 1727) PASS: lldb-Suite :: functionalities/data-formatter/data-formatter-stl/libstdcpp/vbool/TestDataFormatterStdVBool.py (847 of 1727) PASS: lldb-Unit :: Utility/./UtilityTests/StreamTeeTest.CopyConstructor (848 of 1727) PASS: lldb-Suite :: python_api/lldbutil/process/TestPrintStackTraces.py (849 of 1727) PASS: lldb-Suite :: functionalities/data-formatter/data-formatter-stl/libstdcpp/unique_ptr/TestDataFormatterStdUniquePtr.py (850 of 1727) PASS: lldb-Suite :: lang/cpp/nsimport/TestCppNsImport.py (851 of 1727) PASS: lldb-Unit :: Target/./TargetTests/PathMappingListTest.AbsoluteTests (852 of 1727) PASS: lldb-Unit :: Utility/./UtilityTests/LogTest.LLDB_LOG_nullptr (853 of 1727) PASS: lldb-Suite :: macosx/order/TestOrderFile.py (854 of 1727) PASS: lldb-Unit :: Utility/./UtilityTests/StringLexerTest.PutBack (855 of 1727) PASS: lldb-Suite :: functionalities/memory-region/TestMemoryRegion.py (856 of 1727) PASS: lldb-Suite :: lang/cpp/modules-import/TestCXXModulesImport.py (857 of 1727) PASS: lldb-Unit :: Target/./TargetTests/ExecutionContextTest.GetByteOrderProcess (858 of 1727) PASS: lldb-Unit :: Utility/./UtilityTests/RegisterValueTest.GetSet8 (859 of 1727) PASS: lldb-Suite :: lang/objc/modules/TestObjCModules.py (860 of 1727) PASS: lldb-Suite :: functionalities/ubsan/basic/TestUbsanBasic.py (861 of 1727) PASS: lldb-Suite :: python_api/debugger/TestDebuggerAPI.py (862 of 1727) PASS: lldb-Suite :: functionalities/ubsan/user-expression/TestUbsanUserExpression.py (863 of 1727) PASS: lldb-Unit :: Host/./HostTests/FileSystemTest.MakeAbsolute (864 of 1727) PASS: lldb-Suite :: commands/settings/TestSettings.py (865 of 1727) PASS: lldb-Unit :: Core/./LLDBCoreTests/StreamCallbackTest.Callback (866 of 1727) PASS: LLDB :: SymbolFile/DWARF/find-method-local-struct.cpp (867 of 1727) PASS: lldb-Suite :: commands/expression/import-std-module/list-basic/TestBasicList.py (868 of 1727) PASS: lldb-Suite :: macosx/duplicate-archive-members/TestDuplicateMembers.py (869 of 1727) PASS: lldb-Unit :: Utility/./UtilityTests/NameMatchesTest.Contains (870 of 1727) PASS: LLDB :: SymbolFile/NativePDB/globals-bss.cpp (871 of 1727) PASS: LLDB :: Driver/TestProcessAttach.test (872 of 1727) PASS: lldb-Unit :: Language/Highlighting/./HighlighterTests/HighlighterTest.ClangSquareBrackets (873 of 1727) PASS: lldb-Unit :: Process/minidump/./LLDBMinidumpTests/MinidumpParserTest.GetPid (874 of 1727) PASS: lldb-Unit :: Utility/./UtilityTests/VMRange.SetEndAddress (875 of 1727) PASS: lldb-Suite :: commands/expression/rdar42038760/TestScalarURem.py (876 of 1727) PASS: LLDB :: Breakpoint/debug_rnglist_basic.test (877 of 1727) PASS: lldb-Unit :: UnwindAssembly/x86/./UnwindAssemblyx86Tests/Testx86AssemblyInspectionEngine.TestPopEBP (878 of 1727) PASS: lldb-Unit :: Utility/./UtilityTests/BroadcasterTest.EventTypeHasListeners (879 of 1727) PASS: lldb-Unit :: Process/gdb-remote/./ProcessGdbRemoteTests/GDBRemoteCommunicationClientTest.SendGetMetaDataPacket (880 of 1727) PASS: lldb-Suite :: lang/c/conflicting-symbol/TestConflictingSymbol.py (881 of 1727) PASS: lldb-Unit :: Utility/./UtilityTests/StreamTest.PutNHex8 (882 of 1727) PASS: lldb-Suite :: lang/cpp/limit-debug-info/TestWithLimitDebugInfo.py (883 of 1727) PASS: lldb-Suite :: python_api/lldbutil/iter/TestRegistersIterator.py (884 of 1727) PASS: lldb-Suite :: functionalities/data-formatter/language_category_updates/TestDataFormatterLanguageCategoryUpdates.py (885 of 1727) PASS: lldb-Suite :: commands/expression/call-restarts/TestCallThatRestarts.py (886 of 1727) PASS: lldb-Unit :: Utility/./UtilityTests/StringListTest.CopyListSingle (887 of 1727) PASS: lldb-Unit :: Utility/./UtilityTests/ConstStringTest.format_provider (888 of 1727) PASS: lldb-Suite :: functionalities/data-formatter/varscript_formatting/TestDataFormatterVarScriptFormatting.py (889 of 1727) UNSUPPORTED: LLDB :: SymbolFile/NativePDB/typedefs.cpp (890 of 1727) PASS: lldb-Suite :: functionalities/data-formatter/data-formatter-objc/TestDataFormatterObjCCF.py (891 of 1727) PASS: lldb-Unit :: ScriptInterpreter/Python/./ScriptInterpreterPythonTests/PythonDataObjectsTest.TestPythonByteArray (892 of 1727) PASS: lldb-Suite :: functionalities/thread/concurrent_events/TestConcurrentCrashWithBreak.py (893 of 1727) PASS: lldb-Suite :: driver/batch_mode/TestBatchMode.py (894 of 1727) UNSUPPORTED: LLDB :: SymbolFile/PDB/ast-restore.test (895 of 1727) PASS: lldb-Unit :: UnwindAssembly/x86/./UnwindAssemblyx86Tests/Testx86AssemblyInspectionEngine.Test32bitFramelessBigStackFrame (896 of 1727) PASS: lldb-Suite :: functionalities/tsan/thread_numbers/TestTsanThreadNumbers.py (897 of 1727) PASS: lldb-Suite :: commands/expression/completion-crash1/TestCompletionCrash1.py (898 of 1727) PASS: lldb-Unit :: Utility/./UtilityTests/RangeTest.LessThanInvalid (899 of 1727) PASS: lldb-Suite :: lang/c/forward/TestForwardDeclaration.py (900 of 1727) PASS: lldb-Suite :: lang/cpp/namespace/TestNamespace.py (901 of 1727) PASS: lldb-Unit :: Host/./HostTests/SocketTest.DomainListenConnectAccept (902 of 1727) PASS: lldb-Unit :: Utility/./UtilityTests/OptionsWithRawTest.EmptySuffixSingleWhitespace (903 of 1727) PASS: lldb-Suite :: functionalities/gdb_remote_client/TestRecognizeBreakpoint.py (904 of 1727) PASS: lldb-Suite :: functionalities/thread/thread_specific_break/TestThreadSpecificBreakpoint.py (905 of 1727) PASS: lldb-Suite :: lang/cpp/dynamic-value-same-basename/TestDynamicValueSameBase.py (906 of 1727) PASS: lldb-Unit :: Process/minidump/./LLDBMinidumpTests/MinidumpParserTest.MinidumpModuleOrder (907 of 1727) PASS: lldb-Suite :: lang/cpp/unsigned_types/TestUnsignedTypes.py (908 of 1727) FAIL: lldb-Unit :: Utility/./UtilityTests/TimerTest.CategoryTimesStats (909 of 1727) ******************** TEST 'lldb-Unit :: Utility/./UtilityTests/TimerTest.CategoryTimesStats' FAILED ******************** Note: Google Test filter = TimerTest.CategoryTimesStats [==========] Running 1 test from 1 test case. [----------] Global test environment set-up. [----------] 1 test from TimerTest [ RUN ] TimerTest.CategoryTimesStats /Users/buildslave/jenkins/workspace/lldb-cmake-sanitized/llvm-project/lldb/unittests/Utility/TimerTest.cpp:102: Failure Expected: 6 To be equal to: sscanf(ss.GetData(), "%lf sec (total: %lfs; child: %lfs; count: %d) for CAT1%*[\n ]" "%lf sec (total: %*fs; child: %*fs; count: %d) for CAT2", &seconds1, &total1, &child1, &count1, &seconds2, &count2) Which is: 4 String: 0.149319265 sec (total: 0.149s; child: 0.000s; count: 2) for CAT2 0.105139578 sec (total: 0.254s; child: 0.149s; count: 1) for CAT1

Hide Details

[ FAILED ] TimerTest.CategoryTimesStats (255 ms) [----------] 1 test from TimerTest (255 ms total)

Hide Details

[----------] Global test environment tear-down [==========] 1 test from 1 test case ran. (255 ms total) [ PASSED ] 0 tests. [ FAILED ] 1 test, listed below: [ FAILED ] TimerTest.CategoryTimesStats

Hide Details

1 FAILED TEST

Hide Details

******************** PASS: lldb-Unit :: Utility/./UtilityTests/UriParserTest.BracketedHostnameWithColon (910 of 1727) PASS: lldb-Unit :: Language/Highlighting/./HighlighterTests/HighlighterTest.ClangCursorPosEndOfLine (911 of 1727) PASS: lldb-Suite :: commands/frame/diagnose/dereference-function-return/TestDiagnoseDereferenceFunctionReturn.py (912 of 1727) PASS: lldb-Suite :: lang/c/const_variables/TestConstVariables.py (913 of 1727) PASS: lldb-Suite :: functionalities/thread/concurrent_events/TestConcurrentWatchBreakDelay.py (914 of 1727) PASS: LLDB :: SymbolFile/DWARF/find-method.cpp (915 of 1727) PASS: lldb-Suite :: lang/objc/objc-ivar-offsets/TestObjCIvarOffsets.py (916 of 1727) PASS: lldb-Suite :: functionalities/darwin_log/source/info/TestDarwinLogSourceInfo.py (917 of 1727) PASS: lldb-Suite :: benchmarks/expression/TestRepeatedExprs.py (918 of 1727) PASS: lldb-Unit :: Utility/./UtilityTests/RecordReplayTest.InstrumentedFooSameThis (919 of 1727) PASS: lldb-Unit :: Utility/./UtilityTests/RangeDataVector.FindEntryThatContains_Overlap (920 of 1727) PASS: lldb-Suite :: commands/expression/cast_int_to_anonymous_enum/TestCastIntToAnonymousEnum.py (921 of 1727) PASS: lldb-Unit :: Utility/./UtilityTests/StringListTest.LongestCommonPrefixNoPrefix (922 of 1727) PASS: lldb-Suite :: functionalities/tail_call_frames/disambiguate_call_site/TestDisambiguateCallSite.py (923 of 1727) PASS: LLDB :: SymbolFile/DWARF/split-dwarf-inlining.cpp (924 of 1727) PASS: LLDB :: Settings/TestStopCommandSourceOnError.test (925 of 1727) PASS: lldb-Unit :: Utility/./UtilityTests/ProcessInstanceInfo.Dump (926 of 1727) PASS: lldb-Suite :: lang/objc/radar-9691614/TestObjCMethodReturningBOOL.py (927 of 1727) PASS: lldb-Suite :: lang/cpp/trivial_abi/TestTrivialABI.py (928 of 1727) PASS: lldb-Unit :: Utility/./UtilityTests/ArchSpecTest.OperatorBool (929 of 1727) PASS: LLDB :: SymbolFile/DWARF/debug-types-line-tables.s (930 of 1727) PASS: lldb-Suite :: functionalities/breakpoint/address_breakpoints/TestAddressBreakpoints.py (931 of 1727) PASS: lldb-Suite :: commands/frame/diagnose/inheritance/TestDiagnoseInheritance.py (932 of 1727) PASS: lldb-Unit :: ScriptInterpreter/Python/./ScriptInterpreterPythonTests/PythonDataObjectsTest.TestPythonStringToStructuredString (933 of 1727) PASS: lldb-Suite :: functionalities/tail_call_frames/thread_step_out_or_return/TestSteppingOutWithArtificialFrames.py (934 of 1727) PASS: lldb-Suite :: functionalities/data-formatter/vector-types/TestVectorTypesFormatting.py (935 of 1727) PASS: lldb-Suite :: lang/c/struct_types/TestStructTypes.py (936 of 1727) PASS: lldb-Suite :: functionalities/type_lookup/TestTypeLookup.py (937 of 1727) PASS: lldb-Unit :: ScriptInterpreter/Python/./ScriptInterpreterPythonTests/PythonDataObjectsTest.TestPythonTupleToStructuredList (938 of 1727) PASS: LLDB :: Driver/TestTarget.test (939 of 1727) PASS: lldb-Suite :: python_api/sbdata/TestSBData.py (940 of 1727) PASS: lldb-Suite :: commands/expression/function_template_specialization_temp_args/TestFunctionTemplateSpecializationTempArgs.py (941 of 1727) PASS: lldb-Suite :: functionalities/data-formatter/data-formatter-stl/libcxx/list/loop/TestDataFormatterLibcxxListLoop.py (942 of 1727) PASS: lldb-Unit :: Utility/./UtilityTests/UriParserTest.PortOverflow (943 of 1727) PASS: lldb-Suite :: commands/target/stop-hooks/TestStopHooks.py (944 of 1727) PASS: lldb-Unit :: Expression/./ExpressionTests/DiagnosticManagerTest.FixedExpression (945 of 1727) PASS: lldb-Unit :: Utility/./UtilityTests/RangeTest.ContainsEndInclusive (946 of 1727) PASS: lldb-Suite :: linux/sepdebugsymlink/TestTargetSymbolsSepDebugSymlink.py (947 of 1727) PASS: lldb-Suite :: functionalities/wrong_commands/TestWrongCommands.py (948 of 1727) PASS: lldb-Suite :: lang/objc/modules-incomplete/TestIncompleteModules.py (949 of 1727) PASS: LLDB :: Modules/ELF/PT_LOAD.yaml (950 of 1727) PASS: lldb-Suite :: functionalities/breakpoint/breakpoint_set_restart/TestBreakpointSetRestart.py (951 of 1727) PASS: lldb-Suite :: lang/cpp/member-and-local-vars-with-same-name/TestMembersAndLocalsWithSameName.py (952 of 1727) PASS: lldb-Suite :: functionalities/data-formatter/data-formatter-stl/libcxx/vbool/TestDataFormatterLibcxxVBool.py (953 of 1727) PASS: lldb-Unit :: Utility/./UtilityTests/FileSpecTest.RemoveLastPathComponent (954 of 1727) UNSUPPORTED: LLDB :: Register/x86-64-xmm16-write.test (955 of 1727) PASS: lldb-Unit :: ScriptInterpreter/Python/./ScriptInterpreterPythonTests/PythonDataObjectsTest.TestBorrowedReferences (956 of 1727) PASS: lldb-Unit :: ScriptInterpreter/Python/./ScriptInterpreterPythonTests/PythonDataObjectsTest.TestPythonListManipulation (957 of 1727) PASS: lldb-Suite :: commands/expression/import-std-module/unique_ptr-dbg-info-content/TestUniquePtrDbgInfoContent.py (958 of 1727) PASS: lldb-Suite :: commands/process/attach/TestProcessAttach.py (959 of 1727) PASS: lldb-Suite :: functionalities/data-formatter/data-formatter-objc/TestDataFormatterObjCNSData.py (960 of 1727) PASS: LLDB :: Reproducer/TestDump.test (961 of 1727) PASS: lldb-Unit :: Utility/./UtilityTests/OptionsWithRawTest.SingleWhitespaceInput (962 of 1727) PASS: lldb-Suite :: lang/cpp/gmodules/TestWithModuleDebugging.py (963 of 1727) PASS: lldb-Suite :: commands/expression/top-level/TestTopLevelExprs.py (964 of 1727) PASS: lldb-Suite :: tools/lldb-vscode/stackTrace/TestVSCode_stackTrace.py (965 of 1727) PASS: lldb-Unit :: Host/./HostTests/FileSystemTest.Resolve (966 of 1727) PASS: LLDB :: Modules/ELF/PT_LOAD-overlap.yaml (967 of 1727) PASS: lldb-Suite :: functionalities/dead-strip/TestDeadStrip.py (968 of 1727) PASS: lldb-Suite :: python_api/file_handle/TestFileHandle.py (969 of 1727) PASS: lldb-Suite :: lang/objc/global_ptrs/TestGlobalObjects.py (970 of 1727) PASS: lldb-Suite :: commands/log/basic/TestLogging.py (971 of 1727) XFAIL: LLDB :: Unwind/prefer-debug-over-eh-frame.test (972 of 1727) PASS: lldb-Suite :: lang/objc/hidden-ivars/TestHiddenIvars.py (973 of 1727) PASS: lldb-Suite :: functionalities/thread/concurrent_events/TestConcurrentSignalBreak.py (974 of 1727) PASS: lldb-Suite :: commands/frame/diagnose/dereference-argument/TestDiagnoseDereferenceArgument.py (975 of 1727) PASS: lldb-Suite :: commands/expression/dont_allow_jit/TestAllowJIT.py (976 of 1727) PASS: lldb-Suite :: commands/expression/ir-interpreter-phi-nodes/TestIRInterpreterPHINodes.py (977 of 1727) PASS: lldb-Suite :: lang/c/stepping/TestThreadStepping.py (978 of 1727) PASS: LLDB :: SymbolFile/DWARF/array-sizes.s (979 of 1727) PASS: lldb-Unit :: Utility/./UtilityTests/StreamTeeTest.Assignment (980 of 1727) PASS: lldb-Suite :: python_api/disassemble-raw-data/TestDisassemble_VST1_64.py (981 of 1727) PASS: lldb-Unit :: Utility/./UtilityTests/StructuredDataTest.StringDump (982 of 1727) PASS: lldb-Unit :: debugserver/./debugserverTests/RNBSocket.AnyListen (983 of 1727) PASS: lldb-Suite :: functionalities/data-formatter/data-formatter-stl/libcxx/map/TestDataFormatterLibccMap.py (984 of 1727) PASS: lldb-Unit :: ScriptInterpreter/Python/./ScriptInterpreterPythonTests/PythonExceptionStateTest.TestResetSemantics (985 of 1727) PASS: lldb-Suite :: commands/expression/macros/TestMacros.py (986 of 1727) PASS: lldb-Suite :: lang/cpp/breakpoint-commands/TestCPPBreakpointCommands.py (987 of 1727) PASS: LLDB :: Reproducer/TestGDBRemoteRepro.test (988 of 1727) PASS: lldb-Suite :: arm/breakpoint-it/TestBreakpointIt.py (989 of 1727) PASS: lldb-Suite :: functionalities/data-formatter/data-formatter-objc/TestDataFormatterObjCNSError.py (990 of 1727) PASS: LLDB :: SymbolFile/DWARF/forward-declarations.s (991 of 1727) PASS: lldb-Unit :: Language/Highlighting/./HighlighterTests/HighlighterTest.DefaultHighlighterWithCursor (992 of 1727) PASS: lldb-Unit :: Utility/./UtilityTests/SerializationRountripTest.SerializeDeserializePodPointers (993 of 1727) UNSUPPORTED: LLDB :: BuildScript/toolchain-clang-cl.test (994 of 1727) PASS: lldb-Unit :: Utility/./UtilityTests/StringExtractorTest.GetHexBytesAvail_Partial (995 of 1727) PASS: lldb-Unit :: SymbolFile/DWARF/./SymbolFileDWARFTests/SymbolFileDWARFTests.TestAbbrevInvalidNULLTag (996 of 1727) PASS: lldb-Unit :: Utility/./UtilityTests/UriParserTest.SchemeHostSeparator2 (997 of 1727) PASS: lldb-Suite :: lang/c/shared_lib/TestSharedLib.py (998 of 1727) PASS: lldb-Unit :: SymbolFile/NativePDB/./SymbolFileNativePDBTests/PDBFPOProgramToDWARFExpressionTests.UnresolvedRegisterAssignmentReference (999 of 1727) PASS: lldb-Suite :: commands/expression/import-std-module/queue/TestQueue.py (1000 of 1727) PASS: LLDB :: Quit/TestQuitExitCodeHexA.test (1001 of 1727) PASS: lldb-Unit :: SymbolFile/DWARF/./SymbolFileDWARFTests/SymbolFileDWARFTests.TestAbbrevOutOfOrder (1002 of 1727) PASS: lldb-Unit :: Expression/./ExpressionTests/DiagnosticManagerTest.PutStringMultiple (1003 of 1727) PASS: lldb-Unit :: Utility/./UtilityTests/StringListTest.ForRange (1004 of 1727) PASS: lldb-Unit :: Language/Highlighting/./HighlighterTests/HighlighterTest.HighlighterSelectionPath (1005 of 1727) PASS: lldb-Unit :: Utility/./UtilityTests/AnsiTerminal.Incomplete (1006 of 1727) PASS: lldb-Unit :: Utility/./UtilityTests/UriParserTest.MinimalPath (1007 of 1727) PASS: lldb-Suite :: lang/c/unicode/TestUnicodeSymbols.py (1008 of 1727) PASS: lldb-Suite :: commands/expression/timeout/TestCallWithTimeout.py (1009 of 1727) PASS: lldb-Unit :: UnwindAssembly/x86/./UnwindAssemblyx86Tests/Testx86AssemblyInspectionEngine.TestPushESI (1010 of 1727) PASS: lldb-Suite :: python_api/breakpoint/TestBreakpointAPI.py (1011 of 1727) PASS: lldb-Unit :: Expression/./ExpressionTests/DiagnosticManagerTest.GetStringBasic (1012 of 1727) PASS: lldb-Unit :: Utility/./UtilityTests/AnsiTerminal.WhiteSpace (1013 of 1727) PASS: lldb-Unit :: Utility/./UtilityTests/StreamTeeTest.Flush (1014 of 1727) PASS: lldb-Suite :: functionalities/gdb_remote_client/TestRestartBug.py (1015 of 1727) PASS: lldb-Suite :: commands/watchpoints/watchpoint_commands/command/TestWatchpointCommandPython.py (1016 of 1727) PASS: lldb-Suite :: macosx/load-kext/TestLoadKext.py (1017 of 1727) PASS: lldb-Unit :: Language/CPlusPlus/./LanguageCPlusPlusTests/CPlusPlusLanguage.ExtractContextAndIdentifier (1018 of 1727) PASS: lldb-Suite :: functionalities/thread/concurrent_events/TestConcurrentCrashWithSignal.py (1019 of 1727) PASS: lldb-Unit :: SymbolFile/DWARF/./SymbolFileDWARFTests/SymbolFileDWARFTests.TestAbbrevOrder1Start5 (1020 of 1727) PASS: lldb-Unit :: Utility/./UtilityTests/RangeTest.SetRangeBase (1021 of 1727) PASS: lldb-Unit :: Utility/./UtilityTests/StreamTest.PutCharNull (1022 of 1727) PASS: lldb-Unit :: Interpreter/./InterpreterTests/CompletionTest.FileCompletionAbsolute (1023 of 1727) PASS: lldb-Suite :: commands/watchpoints/watchpoint_set_command/TestWatchLocationWithWatchSet.py (1024 of 1727) PASS: lldb-Unit :: Core/./LLDBCoreTests/MangledTest.EmptyForInvalidName (1025 of 1727) PASS: lldb-Unit :: Utility/./UtilityTests/Flags.IsClear (1026 of 1727) PASS: lldb-Unit :: ScriptInterpreter/Python/./ScriptInterpreterPythonTests/PythonDataObjectsTest.TestPythonBytes (1027 of 1727) PASS: lldb-Unit :: UnwindAssembly/x86/./UnwindAssemblyx86Tests/Testx86AssemblyInspectionEngine.TestAddESP (1028 of 1727) PASS: lldb-Suite :: functionalities/inferior-crashing/TestInferiorCrashing.py (1029 of 1727) PASS: lldb-Unit :: Utility/./UtilityTests/ArgsTest.GetQuotedCommandString (1030 of 1727) PASS: LLDB :: SymbolFile/Breakpad/symtab.test (1031 of 1727) PASS: lldb-Suite :: functionalities/paths/TestPaths.py (1032 of 1727) PASS: lldb-Suite :: functionalities/data-formatter/data-formatter-stl/libcxx/list/TestDataFormatterLibcxxList.py (1033 of 1727) PASS: lldb-Suite :: benchmarks/expression/TestExpressionCmd.py (1034 of 1727) PASS: lldb-Unit :: Utility/./UtilityTests/SerializationRountripTest.SerializeDeserializeObjectReference (1035 of 1727) PASS: lldb-Suite :: functionalities/thread/concurrent_events/TestConcurrentBreakpointsDelayedBreakpointOneWatchpoint.py (1036 of 1727) PASS: lldb-Suite :: lang/cpp/thread_local/TestThreadLocal.py (1037 of 1727) PASS: lldb-Suite :: commands/watchpoints/multi_watchpoint_slots/TestWatchpointMultipleSlots.py (1038 of 1727) PASS: lldb-Unit :: Utility/./UtilityTests/ScalarTest.Comparison (1039 of 1727) PASS: lldb-Suite :: lang/c/unions/TestUnionMembers.py (1040 of 1727) PASS: lldb-Unit :: Core/./LLDBCoreTests/MangledTest.NameIndexes_FindFunctionSymbols (1041 of 1727) PASS: LLDB :: SymbolFile/DWARF/dir-separator-windows.s (1042 of 1727) PASS: lldb-Suite :: functionalities/data-formatter/data-formatter-objc/TestDataFormatterObjCExpr.py (1043 of 1727) PASS: lldb-Unit :: Interpreter/./InterpreterTests/OptionArgParserTest.toBoolean (1044 of 1727) PASS: lldb-Unit :: Expression/./ExpressionTests/DiagnosticManagerTest.AppendMessageNoDiag (1045 of 1727) PASS: lldb-Suite :: tools/lldb-server/TestGdbRemote_qThreadStopInfo.py (1046 of 1727) PASS: lldb-Unit :: Language/Highlighting/./HighlighterTests/HighlighterTest.FallbackHighlighter (1047 of 1727) PASS: LLDB :: Modules/ELF/PT_LOAD-overlap-section.yaml (1048 of 1727) PASS: lldb-Unit :: Utility/./UtilityTests/BinaryStreamTest.PutULEB128TwoBytes (1049 of 1727) PASS: LLDB :: Process/TestEnvironment.test (1050 of 1727) PASS: lldb-Suite :: functionalities/data-formatter/data-formatter-stl/libcxx/iterator/TestDataFormatterLibccIterator.py (1051 of 1727) PASS: lldb-Unit :: Language/Highlighting/./HighlighterTests/HighlighterTest.ClangCursorPosInOtherToken (1052 of 1727) PASS: lldb-Unit :: UnwindAssembly/x86/./UnwindAssemblyx86Tests/Testx86AssemblyInspectionEngine.TestCALLNextInsn (1053 of 1727) PASS: lldb-Unit :: Target/./TargetTests/PathMappingListTest.RelativeTests (1054 of 1727) PASS: lldb-Unit :: SymbolFile/NativePDB/./SymbolFileNativePDBTests/PDBFPOProgramToDWARFExpressionTests.MultipleDependentAssignments (1055 of 1727) PASS: lldb-Unit :: Utility/./UtilityTests/BinaryStreamTest.PutULEB128OneByte (1056 of 1727) PASS: LLDB :: SymbolFile/DWARF/debug_ranges-missing-section.s (1057 of 1727) PASS: lldb-Unit :: Host/./HostTests/NativeProcessProtocolTest.ReadCStringFromMemory (1058 of 1727) PASS: lldb-Unit :: Host/./HostTests/NativeProcessProtocolTest.SetBreakpointFailWrite (1059 of 1727) PASS: lldb-Unit :: Utility/./UtilityTests/ProcessInstanceInfo.DumpTable_invalidUID (1060 of 1727) PASS: lldb-Suite :: functionalities/thread/concurrent_events/TestConcurrentWatchpointDelayWatchpointOneBreakpoint.py (1061 of 1727) PASS: lldb-Suite :: lang/objc/blocks/TestObjCIvarsInBlocks.py (1062 of 1727) PASS: lldb-Suite :: functionalities/thread/concurrent_events/TestConcurrentTwoBreakpointThreads.py (1063 of 1727) PASS: lldb-Suite :: functionalities/thread/concurrent_events/TestConcurrentTwoBreakpointsOneSignal.py (1064 of 1727) PASS: lldb-Unit :: Utility/./UtilityTests/StringListTest.JoinThree (1065 of 1727) PASS: lldb-Suite :: functionalities/history/TestHistoryRecall.py (1066 of 1727) PASS: lldb-Unit :: Host/./HostTests/SocketTest.TCPListen0ConnectAccept (1067 of 1727) PASS: lldb-Suite :: python_api/interpreter/TestCommandInterpreterAPI.py (1068 of 1727) PASS: lldb-Suite :: commands/add-dsym/uuid/TestAddDsymCommand.py (1069 of 1727) PASS: lldb-Suite :: lang/cpp/unique-types/TestUniqueTypes.py (1070 of 1727) PASS: lldb-Unit :: Editline/./EditlineTests/EditlineTestFixture.EditlineReceivesMultiLineText (1071 of 1727) PASS: lldb-Suite :: lang/objc/conflicting-definition/TestConflictingDefinition.py (1072 of 1727) PASS: lldb-Suite :: functionalities/ptr_refs/TestPtrRefs.py (1073 of 1727) PASS: lldb-Suite :: lang/cpp/exceptions/TestCPPExceptionBreakpoints.py (1074 of 1727) PASS: lldb-Unit :: Utility/./UtilityTests/OptionsWithRawTest.WhitespaceInput (1075 of 1727) PASS: lldb-Unit :: Utility/./UtilityTests/StringExtractorTest.GetHexBytesAvail_OddPair (1076 of 1727) PASS: lldb-Suite :: functionalities/postmortem/mach-core/TestMachCore.py (1077 of 1727) PASS: lldb-Suite :: lang/objc/objc-new-syntax/TestObjCNewSyntaxLiteral.py (1078 of 1727) PASS: lldb-Suite :: functionalities/tsan/basic/TestTsanBasic.py (1079 of 1727) PASS: lldb-Suite :: functionalities/postmortem/netbsd-core/TestNetBSDCore.py (1080 of 1727) PASS: lldb-Suite :: lang/cpp/scope/TestCppScope.py (1081 of 1727) PASS: lldb-Suite :: functionalities/thread/thread_exit/TestThreadExit.py (1082 of 1727) PASS: lldb-Unit :: Process/minidump/./LLDBMinidumpTests/MinidumpParserTest.MinidumpDuplicateModuleMinAddress (1083 of 1727) PASS: lldb-Suite :: functionalities/tty/TestTerminal.py (1084 of 1727) PASS: lldb-Suite :: macosx/indirect_symbol/TestIndirectSymbols.py (1085 of 1727) PASS: lldb-Unit :: Language/Highlighting/./HighlighterTests/HighlighterTest.DefaultHighlighter (1086 of 1727) PASS: lldb-Unit :: Utility/./UtilityTests/LogChannelEnabledTest.log_options (1087 of 1727) PASS: lldb-Unit :: Utility/./UtilityTests/StringListTest.LongestCommonPrefixEmpty (1088 of 1727) PASS: lldb-Unit :: Utility/./UtilityTests/Predicate.WaitForValueNotEqualTo (1089 of 1727) PASS: lldb-Suite :: functionalities/breakpoint/scripted_bkpt/TestScriptedResolver.py (1090 of 1727) PASS: lldb-Suite :: functionalities/data-formatter/data-formatter-stl/libcxx/multiset/TestDataFormatterLibcxxMultiSet.py (1091 of 1727) PASS: lldb-Suite :: functionalities/darwin_log/filter/regex/subsystem/TestDarwinLogFilterRegexSubsystem.py (1092 of 1727) PASS: lldb-Suite :: commands/expression/import-std-module/vector-basic/TestBasicVector.py (1093 of 1727) PASS: lldb-Unit :: debugserver/./debugserverTests/RNBSocket.LoopBackConnectIPv6 (1094 of 1727) PASS: lldb-Unit :: Host/./HostTests/FileSystemTest.EnumerateDirectory (1095 of 1727) PASS: lldb-Suite :: commands/expression/pr35310/TestExprsBug35310.py (1096 of 1727) PASS: lldb-Unit :: Process/minidump/./LLDBMinidumpTests/MinidumpParserTest.GetLinuxProcStatus (1097 of 1727) PASS: lldb-Unit :: Utility/./UtilityTests/BinaryStreamTest.PutSLEB128SixBytes (1098 of 1727) PASS: LLDB :: Modules/Breakpad/uuid-matching-mac.test (1099 of 1727) PASS: lldb-Unit :: UnwindAssembly/x86/./UnwindAssemblyx86Tests/Testx86AssemblyInspectionEngine.TestSimplei386ugmented (1100 of 1727) PASS: lldb-Unit :: Utility/./UtilityTests/StringExtractorTest.GetHexU8_Underflow2_NoEof (1101 of 1727) PASS: lldb-Suite :: lang/objc/ptr_refs/TestPtrRefsObjC.py (1102 of 1727) PASS: LLDB :: SymbolFile/NativePDB/nested-types.cpp (1103 of 1727) PASS: lldb-Unit :: Process/minidump/./LLDBMinidumpTests/MinidumpParserTest.GetExceptionStream (1104 of 1727) PASS: lldb-Unit :: Expression/./ExpressionTests/DiagnosticManagerTest.GetStringSeverityLabels (1105 of 1727) PASS: LLDB :: Modules/ELF/compressed-sections.yaml (1106 of 1727) PASS: lldb-Suite :: lang/cpp/namespace_conflicts/TestNamespaceConflicts.py (1107 of 1727) PASS: lldb-Unit :: Utility/./UtilityTests/StringExtractorTest.InitEmpty (1108 of 1727) PASS: lldb-Unit :: Target/./TargetTests/ExecutionContextTest.GetByteOrderTarget (1109 of 1727) PASS: lldb-Unit :: Utility/./UtilityTests/VMRange.ContainsAddr (1110 of 1727) PASS: lldb-Suite :: commands/version/TestVersion.py (1111 of 1727) PASS: lldb-Unit :: Utility/./UtilityTests/JSONTest.Newlines (1112 of 1727) PASS: lldb-Suite :: functionalities/gdb_remote_client/TestStopPCs.py (1113 of 1727) PASS: lldb-Unit :: UnwindAssembly/x86/./UnwindAssemblyx86Tests/Testx86AssemblyInspectionEngine.Test64bitFramelessSmallStackFrame (1114 of 1727) PASS: lldb-Unit :: UnwindAssembly/x86/./UnwindAssemblyx86Tests/Testx86AssemblyInspectionEngine.TestPushEBP (1115 of 1727) PASS: lldb-Unit :: Utility/./UtilityTests/ArgsTest.TestOverwriteArgs (1116 of 1727) PASS: lldb-Unit :: Utility/./UtilityTests/StreamTest.PutChar (1117 of 1727) PASS: lldb-Suite :: api/listeners/TestListener.py (1118 of 1727) PASS: lldb-Suite :: functionalities/data-formatter/data-formatter-stl/libcxx/forward_list/TestDataFormatterLibcxxForwardList.py (1119 of 1727) PASS: lldb-Unit :: Utility/./UtilityTests/StreamTest.ChangingByteOrder (1120 of 1727) PASS: lldb-Unit :: Language/Highlighting/./HighlighterTests/HighlighterTest.ClangScalarLiterals (1121 of 1727) PASS: lldb-Suite :: types/TestFloatTypesExpr.py (1122 of 1727) PASS: lldb-Suite :: functionalities/thread/backtrace_limit/TestBacktraceLimit.py (1123 of 1727) PASS: lldb-Suite :: python_api/value/linked_list/TestValueAPILinkedList.py (1124 of 1727) UNSUPPORTED: LLDB :: Register/x86-64-xmm16-read.test (1125 of 1727) PASS: lldb-Suite :: functionalities/gdb_remote_client/TestNoWatchpointSupportInfo.py (1126 of 1727) PASS: lldb-Unit :: Utility/./UtilityTests/FileSpecTest.PrependPathComponent (1127 of 1727) UNSUPPORTED: LLDB :: SymbolFile/PDB/typedefs.test (1128 of 1727) PASS: lldb-Suite :: lang/objc/objc-new-syntax/TestObjCNewSyntaxArray.py (1129 of 1727) PASS: lldb-Unit :: Expression/./ExpressionTests/DiagnosticManagerTest.AddDiagnostic (1130 of 1727) PASS: lldb-Suite :: functionalities/breakpoint/breakpoint_language/TestBreakpointLanguage.py (1131 of 1727) PASS: lldb-Suite :: functionalities/inferior-crashing/recursive-inferior/TestRecursiveInferiorStep.py (1132 of 1727) PASS: lldb-Suite :: functionalities/data-formatter/data-formatter-stl/libstdcpp/map/TestDataFormatterStdMap.py (1133 of 1727) PASS: lldb-Suite :: commands/expression/call-function/TestCallStopAndContinue.py (1134 of 1727) PASS: lldb-Suite :: lang/c/set_values/TestSetValues.py (1135 of 1727) PASS: lldb-Unit :: Utility/./UtilityTests/StreamTest.PutSLEB128 (1136 of 1727) PASS: lldb-Suite :: commands/expression/call-overridden-method/TestCallOverriddenMethod.py (1137 of 1727) PASS: LLDB :: Modules/MachO/lc_build_version_notools.yaml (1138 of 1727) PASS: lldb-Suite :: functionalities/thread/concurrent_events/TestConcurrentTwoWatchpointsOneSignal.py (1139 of 1727) PASS: lldb-Unit :: Utility/./UtilityTests/ArgsTest.ReplaceArgumentAtIndexShort (1140 of 1727) PASS: lldb-Unit :: ObjectFile/Breakpad/./ObjectFileBreakpadTests/StackCFIRecord.parse (1141 of 1727) PASS: lldb-Suite :: functionalities/breakpoint/address_breakpoints/TestBadAddressBreakpoints.py (1142 of 1727) PASS: lldb-Unit :: ScriptInterpreter/Python/./ScriptInterpreterPythonTests/PythonDataObjectsTest.TestPythonTupleInitializerList (1143 of 1727) PASS: LLDB :: SymbolFile/NativePDB/ast-methods.cpp (1144 of 1727) PASS: lldb-Unit :: Utility/./UtilityTests/LogChannelEnabledTest.LogThread (1145 of 1727) PASS: lldb-Suite :: python_api/watchpoint/TestWatchpointIter.py (1146 of 1727) PASS: lldb-Suite :: functionalities/data-formatter/data-formatter-stl/libcxx/optional/TestDataFormatterLibcxxOptional.py (1147 of 1727) PASS: lldb-Suite :: functionalities/breakpoint/breakpoint_hit_count/TestBreakpointHitCount.py (1148 of 1727) PASS: lldb-Suite :: functionalities/process_save_core/TestProcessSaveCore.py (1149 of 1727) PASS: lldb-Suite :: functionalities/target_var/TestTargetVar.py (1150 of 1727) PASS: lldb-Unit :: Utility/./UtilityTests/StringExtractorTest.GetU32BigEndian (1151 of 1727) PASS: lldb-Unit :: SymbolFile/NativePDB/./SymbolFileNativePDBTests/PDBFPOProgramToDWARFExpressionTests.UnknownOp (1152 of 1727) UNSUPPORTED: LLDB :: SymbolFile/NativePDB/ast-functions-msvc.cpp (1153 of 1727) PASS: lldb-Suite :: lang/cpp/static_members/TestCPPStaticMembers.py (1154 of 1727) PASS: lldb-Unit :: Utility/./UtilityTests/StringExtractorTest.GetHexBytes_OddPair (1155 of 1727) PASS: lldb-Unit :: Language/Highlighting/./HighlighterTests/HighlighterTest.Keywords (1156 of 1727) PASS: LLDB :: BuildScript/script-args.test (1157 of 1727) PASS: lldb-Suite :: lang/objc/objc-ivar-stripped/TestObjCIvarStripped.py (1158 of 1727) PASS: lldb-Suite :: functionalities/thread/jump/TestThreadJump.py (1159 of 1727) PASS: lldb-Suite :: functionalities/dynamic_value_child_count/TestDynamicValueChildCount.py (1160 of 1727) PASS: lldb-Unit :: Utility/./UtilityTests/StreamTeeTest.AppendStream (1161 of 1727) PASS: lldb-Suite :: commands/expression/import-std-module/list-dbg-info-content/TestDbgInfoContentList.py (1162 of 1727) PASS: LLDB :: Breakpoint/debug_addrx.test (1163 of 1727) PASS: LLDB :: SymbolFile/DWARF/find-function-regex.cpp (1164 of 1727) PASS: lldb-Suite :: functionalities/darwin_log/filter/exact_match/activity-chain/TestDarwinLogFilterMatchActivityChain.py (1165 of 1727) PASS: lldb-Unit :: Utility/./UtilityTests/UUIDTest.StringConverion (1166 of 1727) PASS: lldb-Unit :: Utility/./UtilityTests/RangeTest.ClearWithStarAddress (1167 of 1727) PASS: lldb-Suite :: tools/lldb-server/TestGdbRemoteAttach.py (1168 of 1727) PASS: lldb-Unit :: Process/gdb-remote/./ProcessGdbRemoteTests/GDBRemoteClientBaseTest.SendContinueDelegateStructuredDataReceipt (1169 of 1727) PASS: lldb-Unit :: Utility/./UtilityTests/StringListTest.Assignment (1170 of 1727) PASS: lldb-Suite :: lang/objc/objc-class-method/TestObjCClassMethod.py (1171 of 1727) PASS: lldb-Suite :: commands/expression/rdar44436068/Test128BitsInteger.py (1172 of 1727) PASS: lldb-Unit :: Utility/./UtilityTests/LogTest.Register (1173 of 1727) PASS: lldb-Suite :: macosx/queues/TestQueues.py (1174 of 1727) PASS: lldb-Unit :: UnwindAssembly/x86/./UnwindAssemblyx86Tests/Testx86AssemblyInspectionEngine.TestPushR12 (1175 of 1727) PASS: LLDB :: SymbolFile/DWARF/debug_ranges.s (1176 of 1727) PASS: lldb-Unit :: ScriptInterpreter/Python/./ScriptInterpreterPythonTests/PythonDataObjectsTest.TestObjectAttributes (1177 of 1727) PASS: lldb-Suite :: functionalities/float-display/TestFloatDisplay.py (1178 of 1727) PASS: lldb-Unit :: ObjectFile/Breakpad/./ObjectFileBreakpadTests/FuncRecord.parse (1179 of 1727) PASS: lldb-Suite :: lang/mixed/TestMixedLanguages.py (1180 of 1727) PASS: lldb-Suite :: commands/frame/diagnose/virtual-method-call/TestDiagnoseDereferenceVirtualMethodCall.py (1181 of 1727) PASS: LLDB :: SymbolFile/DWARF/debug-types-signature-loop.s (1182 of 1727) PASS: lldb-Suite :: types/TestIntegerTypesExpr.py (1183 of 1727) UNSUPPORTED: LLDB :: SymbolFile/PDB/udt-layout.test (1184 of 1727) PASS: lldb-Suite :: functionalities/data-formatter/data-formatter-objc/nsindexpath/TestDataFormatterNSIndexPath.py (1185 of 1727) PASS: lldb-Unit :: Utility/./UtilityTests/StringListTest.ShiftCString (1186 of 1727) PASS: lldb-Unit :: Utility/./UtilityTests/ArchSpecTest.MergeFrom (1187 of 1727) PASS: lldb-Suite :: macosx/safe-to-func-call/TestSafeFuncCalls.py (1188 of 1727) PASS: lldb-Unit :: ObjectFile/Breakpad/./ObjectFileBreakpadTests/StackWinRecord.parse (1189 of 1727) PASS: lldb-Unit :: Utility/./UtilityTests/StringListTest.ShiftMove (1190 of 1727) PASS: lldb-Unit :: Language/Highlighting/./HighlighterTests/HighlighterTest.Colons (1191 of 1727) PASS: lldb-Suite :: functionalities/gdb_remote_client/TestTargetXMLArch.py (1192 of 1727) PASS: lldb-Unit :: Utility/./UtilityTests/StreamTest.ShiftOperatorInts (1193 of 1727) PASS: lldb-Suite :: functionalities/data-formatter/data-formatter-objc/TestDataFormatterObjCNSContainer.py (1194 of 1727) PASS: lldb-Suite :: lang/objcxx/cxx-bridged-po/TestObjCXXBridgedPO.py (1195 of 1727) PASS: lldb-Unit :: Utility/./UtilityTests/RecordReplayTest.InstrumentedBarPtr (1196 of 1727) PASS: lldb-Unit :: Utility/./UtilityTests/BinaryStreamTest.PutULEB128FiveBytes (1197 of 1727) PASS: lldb-Unit :: ScriptInterpreter/Python/./ScriptInterpreterPythonTests/PythonExceptionStateTest.TestExceptionStateChecking (1198 of 1727) PASS: lldb-Suite :: functionalities/completion/TestCompletion.py (1199 of 1727) PASS: lldb-Suite :: commands/expression/unicode-in-variable/TestUnicodeInVariable.py (1200 of 1727) PASS: lldb-Suite :: functionalities/unwind/sigtramp/TestSigtrampUnwind.py (1201 of 1727) PASS: lldb-Unit :: ScriptInterpreter/Python/./ScriptInterpreterPythonTests/PythonDataObjectsTest.TestPythonCallableInvoke (1202 of 1727) PASS: lldb-Unit :: ScriptInterpreter/Python/./ScriptInterpreterPythonTests/PythonDataObjectsTest.TestExtractingUInt64ThroughStructuredData (1203 of 1727) PASS: lldb-Suite :: python_api/type/TestTypeList.py (1204 of 1727) PASS: LLDB :: Modules/ELF/netbsd-core-amd64.test (1205 of 1727) PASS: lldb-Suite :: commands/command/delete/TestCommandDelete.py (1206 of 1727) PASS: lldb-Unit :: Utility/./UtilityTests/StreamTest.PutRawBytesToLittleEndian (1207 of 1727) PASS: lldb-Suite :: functionalities/data-formatter/data-formatter-stl/libcxx/atomic/TestLibCxxAtomic.py (1208 of 1727) PASS: lldb-Suite :: python_api/event/TestEvents.py (1209 of 1727) PASS: lldb-Suite :: lang/cpp/frame-var-anon-unions/TestFrameVariableAnonymousUnions.py (1210 of 1727) PASS: lldb-Unit :: UnwindAssembly/x86/./UnwindAssemblyx86Tests/Testx86AssemblyInspectionEngine.TestPopRBX (1211 of 1727) PASS: lldb-Unit :: Process/gdb-remote/./ProcessGdbRemoteTests/GDBRemoteClientBaseTest.SendContinueAndInterrupt2PacketBug (1212 of 1727) PASS: lldb-Suite :: commands/expression/context-object-objc/TestContextObjectObjc.py (1213 of 1727) PASS: lldb-Unit :: Process/gdb-remote/./ProcessGdbRemoteTests/GDBRemoteCommunicationClientTest.WriteRegisterNoSuffix (1214 of 1727) FAIL: lldb-Suite :: functionalities/gdb_remote_client/TestThreadSelectionBug.py (1215 of 1727) ******************** TEST 'lldb-Suite :: functionalities/gdb_remote_client/TestThreadSelectionBug.py' FAILED ******************** lldb version 10.0.99 (http://labmaster3.local/git/llvm-project.git revision 466fb68fce10d34963c2fd651de32bd3a4ddcd1f) clang revision 466fb68fce10d34963c2fd651de32bd3a4ddcd1f llvm revision 466fb68fce10d34963c2fd651de32bd3a4ddcd1f LLDB library dir: /Users/buildslave/jenkins/workspace/lldb-cmake-sanitized/lldb-build/bin LLDB import library dir: /Users/buildslave/jenkins/workspace/lldb-cmake-sanitized/lldb-build/bin libstdcxx tests will not be run because: Don't know how to build with libstdcxx on macosx Skipping following debug info categories: ['dwo']

Hide Details

Session logs for test failures/errors/unexpected successes will go into directory '/Users/buildslave/jenkins/workspace/lldb-cmake-sanitized/test/logs' Command invoked: /Users/buildslave/jenkins/workspace/lldb-cmake-sanitized/llvm-project/lldb/test/dotest.py --arch=x86_64 -s /Users/buildslave/jenkins/workspace/lldb-cmake-sanitized/lldb-build/lldb-test-traces -S nm -u CXXFLAGS -u CFLAGS --executable /Users/buildslave/jenkins/workspace/lldb-cmake-sanitized/lldb-build/./bin/lldb --dsymutil /Users/buildslave/jenkins/workspace/lldb-cmake-sanitized/lldb-build/./bin/dsymutil --filecheck /Users/buildslave/jenkins/workspace/lldb-cmake-sanitized/lldb-build/./bin/FileCheck -C /Users/buildslave/jenkins/workspace/lldb-cmake-sanitized/host-compiler/bin/clang --codesign-identity lldb_codesign --server /Users/buildslave/jenkins/workspace/lldb-cmake-sanitized/lldb-build/./bin/debugserver --arch x86_64 --build-dir /Users/buildslave/jenkins/workspace/lldb-cmake-sanitized/lldb-build/lldb-test-build.noindex -s=/Users/buildslave/jenkins/workspace/lldb-cmake-sanitized/test/logs -t --env TERM=vt100 --env LLVM_LIBS_DIR=/Users/buildslave/jenkins/workspace/lldb-cmake-sanitized/lldb-build/./lib --build-dir /Users/buildslave/jenkins/workspace/lldb-cmake-sanitized/lldb-build/tools/lldb/lldb-test-build.noindex --module-cache-dir /Users/buildslave/jenkins/workspace/lldb-cmake-sanitized/lldb-build/tools/lldb/lldb-test-build.noindex/module-cache-lldb /Users/buildslave/jenkins/workspace/lldb-cmake-sanitized/llvm-project/lldb/packages/Python/lldbsuite/test/functionalities/gdb_remote_client -p TestThreadSelectionBug.py Change dir to: /Users/buildslave/jenkins/workspace/lldb-cmake-sanitized/llvm-project/lldb/packages/Python/lldbsuite/test/functionalities/gdb_remote_client runCmd: settings set symbols.enable-external-lookup false output:

Hide Details

runCmd: settings set plugin.process.gdb-remote.packet-timeout 60 output:

Hide Details

runCmd: settings set symbols.clang-modules-cache-path "/Users/buildslave/jenkins/workspace/lldb-cmake-sanitized/lldb-build/tools/lldb/lldb-test-build.noindex/module-cache-lldb" output:

Hide Details

runCmd: settings set use-color false output:

Hide Details

FAIL: LLDB (/Users/buildslave/jenkins/workspace/lldb-cmake-sanitized/host-compiler/bin/clang-10-x86_64) :: test (TestThreadSelectionBug.TestThreadSelectionBug) <bound method SBProcess.Kill of <lldb.SBProcess; proxy of <Swig Object of type 'lldb::SBProcess *' at 0x121f7d8a0> >>: success

Hide Details

Restore dir to: /Users/buildslave/jenkins/workspace/lldb-cmake-sanitized/lldb-build/tools/lldb/lit ====================================================================== FAIL: test (TestThreadSelectionBug.TestThreadSelectionBug) ---------------------------------------------------------------------- Traceback (most recent call last): File "/Users/buildslave/jenkins/workspace/lldb-cmake-sanitized/llvm-project/lldb/packages/Python/lldbsuite/test/functionalities/gdb_remote_client/TestThreadSelectionBug.py", line 17, in test process = self.connect(target) File "/Users/buildslave/jenkins/workspace/lldb-cmake-sanitized/llvm-project/lldb/packages/Python/lldbsuite/test/functionalities/gdb_remote_client/gdbclientutils.py", line 479, in connect self.assertTrue(error.Success(), error.description) AssertionError: False is not True : failed to get reply to handshake packet Config=x86_64-/Users/buildslave/jenkins/workspace/lldb-cmake-sanitized/host-compiler/bin/clang-10 ---------------------------------------------------------------------- Ran 1 test in 62.895s

Hide Details

RESULT: FAILED (0 passes, 1 failures, 0 errors, 0 skipped, 0 expected failures, 0 unexpected successes)

Hide Details

******************** PASS: lldb-Unit :: Breakpoint/./LLDBBreakpointTests/BreakpointIDTest.StringIsBreakpointName (1216 of 1727) PASS: lldb-Unit :: ScriptInterpreter/Python/./ScriptInterpreterPythonTests/PythonDataObjectsTest.TestPythonDictionaryToStructuredDictionary (1217 of 1727) PASS: LLDB :: SymbolFile/DWARF/split-dwarf-multiple-cu.ll (1218 of 1727) PASS: lldb-Unit :: Utility/./UtilityTests/ArgsTest.ReplaceArgumentAtIndexLonger (1219 of 1727) PASS: lldb-Suite :: commands/watchpoints/watchpoint_commands/TestWatchpointCommands.py (1220 of 1727) PASS: lldb-Unit :: ScriptInterpreter/Python/./ScriptInterpreterPythonTests/PythonDataObjectsTest.TestPythonIntegerToStructuredInteger (1221 of 1727) PASS: lldb-Suite :: functionalities/thread/concurrent_events/TestConcurrentBreakpointDelayBreakpointOneSignal.py (1222 of 1727) PASS: LLDB :: Register/x86-64-ymm-read.test (1223 of 1727) PASS: lldb-Suite :: commands/expression/import-std-module/weak_ptr/TestWeakPtr.py (1224 of 1727) PASS: LLDB :: SymbolFile/DWARF/debug-types-dwarf5.s (1225 of 1727) PASS: lldb-Unit :: Utility/./UtilityTests/ScalarTest.APIntConstructor (1226 of 1727) PASS: lldb-Suite :: functionalities/breakpoint/hardware_breakpoints/hardware_breakpoint_on_multiple_threads/TestHWBreakMultiThread.py (1227 of 1727) PASS: lldb-Suite :: functionalities/data-formatter/data-formatter-synthtype/TestDataFormatterSynthType.py (1228 of 1727) PASS: lldb-Suite :: functionalities/darwin_log/filter/exact_match/subsystem/TestDarwinLogFilterMatchSubsystem.py (1229 of 1727) PASS: lldb-Suite :: functionalities/darwin_log/filter/regex/activity-chain/TestDarwinLogFilterRegexActivityChain.py (1230 of 1727) PASS: LLDB :: Minidump/disassemble-no-module.yaml (1231 of 1727) PASS: lldb-Suite :: functionalities/data-formatter/data-formatter-ptr-to-array/TestPtrToArrayFormatting.py (1232 of 1727) PASS: lldb-Unit :: Utility/./UtilityTests/ArchSpecTest.TestParseMachCPUDashSubtypeTripleSimple (1233 of 1727) PASS: LLDB :: Driver/TestCore.test (1234 of 1727) UNSUPPORTED: LLDB :: Register/x86-gp-read.test (1235 of 1727) PASS: lldb-Unit :: ScriptInterpreter/Python/./ScriptInterpreterPythonTests/PythonDataObjectsTest.TestPythonListValueEquality (1236 of 1727) PASS: lldb-Unit :: Interpreter/./InterpreterTests/OptionArgParserTest.toScriptLanguage (1237 of 1727) PASS: lldb-Unit :: Utility/./UtilityTests/StreamTest.PutHex16ByteOrderBig (1238 of 1727) PASS: lldb-Suite :: python_api/symbol-context/TestSymbolContext.py (1239 of 1727) PASS: LLDB :: Breakpoint/debug_rnglist_rlestartend.test (1240 of 1727) PASS: lldb-Unit :: Process/gdb-remote/./ProcessGdbRemoteTests/GDBRemoteClientBaseTest.SendContinueDelegateInterface (1241 of 1727) PASS: lldb-Unit :: UnwindAssembly/x86/./UnwindAssemblyx86Tests/Testx86AssemblyInspectionEngine.TestPopR15 (1242 of 1727) PASS: lldb-Suite :: commands/expression/persistent_types/TestPersistentTypes.py (1243 of 1727) PASS: lldb-Suite :: functionalities/breakpoint/breakpoint_conditions/TestBreakpointConditions.py (1244 of 1727) PASS: lldb-Unit :: Utility/./UtilityTests/StringExtractorTest.GetHexBytesAvail_FullString (1245 of 1727) PASS: lldb-Unit :: Utility/./UtilityTests/UriParserTest.MinimalPort (1246 of 1727) PASS: lldb-Suite :: commands/source/info/TestSourceInfo.py (1247 of 1727) PASS: lldb-Suite :: python_api/hello_world/TestHelloWorld.py (1248 of 1727) PASS: lldb-Unit :: Utility/./UtilityTests/BinaryStreamTest.PutSLEB128FiveBytes (1249 of 1727) PASS: lldb-Unit :: Process/minidump/./LLDBMinidumpTests/MinidumpParserTest.GetArchitectureWindows (1250 of 1727) PASS: lldb-Suite :: functionalities/data-formatter/data-formatter-named-summaries/TestDataFormatterNamedSummaries.py (1251 of 1727) PASS: lldb-Unit :: Utility/./UtilityTests/StringExtractorTest.GetHexBytes_OddPair2 (1252 of 1727) PASS: lldb-Unit :: Utility/./UtilityTests/RangeTest.Copy (1253 of 1727) PASS: lldb-Unit :: Utility/./UtilityTests/StreamTest.PutCStringWithStringRef (1254 of 1727) PASS: lldb-Suite :: functionalities/darwin_log/filter/regex/category/TestDarwinLogFilterRegexCategory.py (1255 of 1727) PASS: lldb-Unit :: UnwindAssembly/x86/./UnwindAssemblyx86Tests/Testx86AssemblyInspectionEngine.TestPushEAX (1256 of 1727) PASS: lldb-Suite :: lang/objc/objc-static-method/TestObjCStaticMethod.py (1257 of 1727) PASS: LLDB :: Settings/TestDisableColor.test (1258 of 1727) PASS: lldb-Suite :: lang/objc/foundation/TestObjectDescriptionAPI.py (1259 of 1727) PASS: lldb-Unit :: Language/Highlighting/./HighlighterTests/HighlighterTest.ClangEmptyInput (1260 of 1727) PASS: lldb-Unit :: ScriptInterpreter/Python/./ScriptInterpreterPythonTests/PythonExceptionStateTest.TestAcquisitionSemantics (1261 of 1727) PASS: lldb-Unit :: Utility/./UtilityTests/OptionsWithRawTest.TerminatedQuote (1262 of 1727) PASS: lldb-Suite :: functionalities/signal/handle-abrt/TestHandleAbort.py (1263 of 1727) PASS: LLDB :: Driver/LocalLLDBInit.test (1264 of 1727) PASS: lldb-Unit :: Utility/./UtilityTests/StringListTest.GetMaxStringLengthMixed (1265 of 1727) PASS: lldb-Suite :: functionalities/breakpoint/breakpoint_options/TestBreakpointOptions.py (1266 of 1727) PASS: lldb-Suite :: functionalities/data-formatter/data-formatter-objc/nsstring/TestDataFormatterNSString.py (1267 of 1727) PASS: lldb-Unit :: Utility/./UtilityTests/StreamTeeTest.Constructor1Stream (1268 of 1727) PASS: lldb-Unit :: ObjectFile/ELF/./ObjectFileELFTests/ObjectFileELFTest.GetModuleSpecifications_EarlySectionHeaders (1269 of 1727) PASS: lldb-Unit :: Utility/./UtilityTests/Flags.AnySet (1270 of 1727) PASS: lldb-Unit :: ScriptInterpreter/Python/./ScriptInterpreterPythonTests/PythonExceptionStateTest.TestManualRestoreSemantics (1271 of 1727) PASS: lldb-Suite :: functionalities/signal/TestSendSignal.py (1272 of 1727) PASS: lldb-Suite :: macosx/lc-note/kern-ver-str/TestKernVerStrLCNOTE.py (1273 of 1727) PASS: lldb-Unit :: UnwindAssembly/x86/./UnwindAssemblyx86Tests/Testx86AssemblyInspectionEngine.TestPushImm (1274 of 1727) XFAIL: LLDB :: Register/x86-mm-xmm-write.test (1275 of 1727) PASS: lldb-Unit :: Process/minidump/./LLDBMinidumpTests/RegisterContextMinidump.ConvertMinidumpContext_x86_64 (1276 of 1727) PASS: lldb-Unit :: Symbol/./SymbolTests/TestClangASTContext.TestIsClangType (1277 of 1727) PASS: lldb-Unit :: Utility/./UtilityTests/AnsiTerminal.AtEnd (1278 of 1727) PASS: lldb-Suite :: commands/command/nested_alias/TestNestedAlias.py (1279 of 1727) PASS: lldb-Suite :: commands/watchpoints/watchpoint_commands/condition/TestWatchpointConditionCmd.py (1280 of 1727) PASS: lldb-Unit :: Expression/./ExpressionTests/DiagnosticManagerTest.HasFixits (1281 of 1727) PASS: lldb-Unit :: Host/./HostTests/SocketTest.TCPListen0GetPort (1282 of 1727) PASS: lldb-Suite :: functionalities/data-formatter/data-formatter-stl/libstdcpp/smart_ptr/TestDataFormatterStdSmartPtr.py (1283 of 1727) PASS: lldb-Suite :: functionalities/archives/TestBSDArchives.py (1284 of 1727) PASS: lldb-Unit :: Utility/./UtilityTests/AnsiTerminal.Empty (1285 of 1727) PASS: lldb-Unit :: Language/Highlighting/./HighlighterTests/HighlighterTest.ClangOperators (1286 of 1727) PASS: lldb-Suite :: functionalities/data-formatter/frameformat_smallstruct/TestFrameFormatSmallStruct.py (1287 of 1727) PASS: LLDB :: SymbolFile/DWARF/childless-compile-unit.s (1288 of 1727) PASS: lldb-Unit :: UnwindAssembly/x86/./UnwindAssemblyx86Tests/Testx86AssemblyInspectionEngine.TestPushR13 (1289 of 1727) PASS: lldb-Unit :: Utility/./UtilityTests/VMRange.Clear (1290 of 1727) PASS: lldb-Suite :: python_api/watchpoint/watchlocation/TestTargetWatchAddress.py (1291 of 1727) PASS: lldb-Unit :: Utility/./UtilityTests/BinaryStreamTest.PutSLEB128EightBytes (1292 of 1727) PASS: lldb-Suite :: lang/objc/foundation/TestObjCMethodsNSError.py (1293 of 1727) PASS: lldb-Unit :: Utility/./UtilityTests/StringExtractorTest.GetU32LittleEndian (1294 of 1727) PASS: lldb-Unit :: Editline/./EditlineTests/EditlineTestFixture.EditlineReceivesSingleLineText (1295 of 1727) PASS: lldb-Suite :: functionalities/postmortem/minidump-new/TestMiniDumpNew.py (1296 of 1727) PASS: LLDB :: Commands/command-source.test (1297 of 1727) PASS: lldb-Suite :: commands/watchpoints/watchpoint_size/TestWatchpointSizes.py (1298 of 1727) PASS: LLDB :: SymbolFile/DWARF/debug_loc.s (1299 of 1727) PASS: LLDB :: Modules/PECOFF/export-dllfunc.yaml (1300 of 1727) PASS: lldb-Suite :: lang/cpp/template-function/TestTemplateFunctions.py (1301 of 1727) PASS: lldb-Unit :: ScriptInterpreter/Python/./ScriptInterpreterPythonTests/PythonExceptionStateTest.TestAutoRestoreChanged (1302 of 1727) PASS: lldb-Unit :: Signals/./SignalsTests/UnixSignalsTest.GetInfo (1303 of 1727) PASS: lldb-Suite :: api/multiple-debuggers/TestMultipleDebuggers.py (1304 of 1727) XFAIL: LLDB :: SymbolFile/DWARF/find-type-in-function.cpp (1305 of 1727) UNSUPPORTED: LLDB :: Register/x86-64-ymm16-write.test (1306 of 1727) PASS: LLDB :: Modules/ELF/section-types-edgecases.yaml (1307 of 1727) PASS: lldb-Unit :: ObjectFile/Breakpad/./ObjectFileBreakpadTests/ModuleRecord.parse (1308 of 1727) PASS: lldb-Unit :: Utility/./UtilityTests/BinaryStreamTest.PutSLEB128SevenBytes (1309 of 1727) PASS: lldb-Suite :: tools/lldb-server/TestGdbRemoteHostInfo.py (1310 of 1727) PASS: lldb-Suite :: tools/lldb-vscode/breakpoint/TestVSCode_setBreakpoints.py (1311 of 1727) PASS: lldb-Unit :: Utility/./UtilityTests/NameMatchesTest.EndsWith (1312 of 1727) PASS: lldb-Unit :: Utility/./UtilityTests/DataExtractorTest.GetBitfield (1313 of 1727) PASS: lldb-Suite :: functionalities/thread/exit_during_break/TestExitDuringBreak.py (1314 of 1727) PASS: lldb-Unit :: SymbolFile/NativePDB/./SymbolFileNativePDBTests/PDBFPOProgramToDWARFExpressionTests.InvalidAssignmentSingle (1315 of 1727) PASS: lldb-Suite :: functionalities/param_entry_vals/basic_entry_values_x86_64/TestBasicEntryValuesX86_64.py (1316 of 1727) PASS: lldb-Suite :: commands/expression/formatters/TestFormatters.py (1317 of 1727) PASS: LLDB :: Settings/TestModuleCacheSanity.test (1318 of 1727) PASS: lldb-Unit :: Utility/./UtilityTests/RangeTest.ContainsEndInclusiveInvalid (1319 of 1727) PASS: lldb-Unit :: Process/gdb-remote/./ProcessGdbRemoteTests/GDBRemoteCommunicationClientTest.ReadRegister (1320 of 1727) PASS: lldb-Unit :: Utility/./UtilityTests/FileSpecTest.GetNormalizedPath (1321 of 1727) PASS: lldb-Suite :: commands/expression/import-std-module/unique_ptr/TestUniquePtr.py (1322 of 1727) PASS: lldb-Unit :: Host/./HostTests/FileSystemTest.GetPermissions (1323 of 1727) PASS: lldb-Unit :: SymbolFile/NativePDB/./SymbolFileNativePDBTests/PDBFPOProgramToDWARFExpressionTests.UnresolvedCyclicRegisterAssignmentReference (1324 of 1727) PASS: lldb-Unit :: Utility/./UtilityTests/AnsiTerminal.AtStart (1325 of 1727) PASS: lldb-Unit :: Utility/./UtilityTests/FileSpecTest.IsRelative (1326 of 1727) PASS: lldb-Suite :: python_api/sblaunchinfo/TestSBLaunchInfo.py (1327 of 1727) PASS: lldb-Unit :: Symbol/./SymbolTests/TestClangASTContext.TestRecordHasFields (1328 of 1727) PASS: lldb-Suite :: lang/cpp/static_methods/TestCPPStaticMethods.py (1329 of 1727) PASS: lldb-Suite :: functionalities/tsan/cpp_global_location/TestTsanCPPGlobalLocation.py (1330 of 1727) PASS: lldb-Unit :: ScriptInterpreter/Python/./ScriptInterpreterPythonTests/PythonDataObjectsTest.TestGlobalNameResolutionWithDot (1331 of 1727) PASS: lldb-Unit :: UnwindAssembly/x86/./UnwindAssemblyx86Tests/Testx86AssemblyInspectionEngine.TestSimple32bitFrameFunction (1332 of 1727) PASS: LLDB :: SymbolFile/DWARF/deterministic-build.cpp (1333 of 1727) PASS: lldb-Suite :: tools/lldb-server/libraries-svr4/TestGdbRemoteLibrariesSvr4Support.py (1334 of 1727) PASS: LLDB :: Breakpoint/single-file-split-dwarf.test (1335 of 1727) PASS: lldb-Unit :: Process/gdb-remote/./ProcessGdbRemoteTests/GDBRemoteCommunicationClientTest.SyncThreadState (1336 of 1727) PASS: lldb-Suite :: functionalities/non-overlapping-index-variable-i/TestIndexVariable.py (1337 of 1727) UNSUPPORTED: LLDB :: SymbolFile/DWARF/debug-types-expressions.test (1338 of 1727) PASS: lldb-Unit :: Utility/./UtilityTests/StringListTest.JoinSingle (1339 of 1727) PASS: LLDB :: Breakpoint/debug_rnglistx_rlex.test (1340 of 1727) PASS: LLDB :: Modules/PECOFF/dep-modules.yaml (1341 of 1727) PASS: lldb-Suite :: benchmarks/libcxxmap/TestBenchmarkLibcxxMap.py (1342 of 1727) PASS: lldb-Unit :: Utility/./UtilityTests/StreamTest.PutMaxHex64ByteOrderBig (1343 of 1727) PASS: lldb-Suite :: lang/cpp/std-function-step-into-callable/TestStdFunctionStepIntoCallable.py (1344 of 1727) PASS: LLDB :: Reproducer/Modules/TestModuleCXX.test (1345 of 1727) PASS: lldb-Unit :: Utility/./UtilityTests/BinaryStreamTest.PutSLEB128Zero (1346 of 1727) PASS: lldb-Suite :: commands/watchpoints/multiple_threads/TestWatchpointMultipleThreads.py (1347 of 1727) PASS: lldb-Suite :: functionalities/tail_call_frames/disambiguate_tail_call_seq/TestDisambiguateTailCallSeq.py (1348 of 1727) PASS: lldb-Suite :: functionalities/data-formatter/data-formatter-categories/TestDataFormatterCategories.py (1349 of 1727) UNSUPPORTED: LLDB :: SymbolFile/PDB/func-symbols.test (1350 of 1727) PASS: lldb-Unit :: Utility/./UtilityTests/StringExtractorTest.DecodeHexU8_Extra (1351 of 1727) PASS: lldb-Suite :: lang/objc/single-entry-dictionary/TestObjCSingleEntryDictionary.py (1352 of 1727) PASS: lldb-Suite :: functionalities/darwin_log/filter/regex/message/TestDarwinLogFilterRegexMessage.py (1353 of 1727) PASS: lldb-Unit :: Process/gdb-remote/./ProcessGdbRemoteTests/GDBRemoteClientBaseTest.InterruptNoResponse (1354 of 1727) UNSUPPORTED: LLDB :: SymbolFile/NativePDB/local-variables.cpp (1355 of 1727) PASS: lldb-Unit :: Process/gdb-remote/./ProcessGdbRemoteTests/GDBRemoteCommunicationServerTest.SendErrorResponse_ErrorList (1356 of 1727) PASS: lldb-Suite :: lang/cpp/llvm-style/TestLLVMStyle.py (1357 of 1727) PASS: lldb-Suite :: lang/cpp/enum_types/TestCPP11EnumTypes.py (1358 of 1727) PASS: lldb-Suite :: commands/watchpoints/step_over_watchpoint/TestStepOverWatchpoint.py (1359 of 1727) PASS: lldb-Suite :: lang/objc/foundation/TestObjCMethods.py (1360 of 1727) PASS: lldb-Unit :: Process/minidump/./LLDBMinidumpTests/MinidumpParserTest.InvalidMinidump (1361 of 1727) PASS: lldb-Suite :: commands/register/register/register_command/TestRegisters.py (1362 of 1727) PASS: lldb-Unit :: Utility/./UtilityTests/GeneratorTest.Get (1363 of 1727) PASS: lldb-Unit :: Utility/./UtilityTests/VMRange.Comparison (1364 of 1727) PASS: lldb-Unit :: Utility/./UtilityTests/TimerTest.CategoryTimesNested (1365 of 1727) PASS: lldb-Unit :: Utility/./UtilityTests/RangeTest.Slide (1366 of 1727) PASS: lldb-Unit :: Utility/./UtilityTests/ArgsTest.AppendArguments (1367 of 1727) PASS: lldb-Unit :: Utility/./UtilityTests/StreamTest.PutRawBytesToBigEndian (1368 of 1727) PASS: lldb-Suite :: commands/expression/import-std-module/no-std-module/TestMissingStdModule.py (1369 of 1727) PASS: lldb-Unit :: Utility/./UtilityTests/FileSpecTest.EqualSeparator (1370 of 1727) UNSUPPORTED: LLDB :: Register/x86-ymm-read.test (1371 of 1727) PASS: lldb-Unit :: Utility/./UtilityTests/StringExtractorTest.GetHexU8_Underflow_NoEof (1372 of 1727) PASS: lldb-Suite :: lang/objc/objc-builtin-types/TestObjCBuiltinTypes.py (1373 of 1727) PASS: lldb-Unit :: Utility/./UtilityTests/ArgsTest.EscapeLLDBCommandArgument (1374 of 1727) PASS: lldb-Unit :: Utility/./UtilityTests/FileSpecTest.EqualDotsPosix (1375 of 1727) PASS: lldb-Unit :: Symbol/./SymbolTests/SymbolsTest.TerminateLocateExecutableSymbolFileForUnknownExecutableAndUnknownSymbolFile (1376 of 1727) PASS: lldb-Unit :: Utility/./UtilityTests/StringLexerTest.GetUnlexed (1377 of 1727) PASS: lldb-Unit :: Utility/./UtilityTests/StringExtractorTest.GetHexU8_InvalidHex_NoEof (1378 of 1727) PASS: lldb-Suite :: python_api/process/read-mem-cstring/TestReadMemCString.py (1379 of 1727) PASS: lldb-Unit :: Process/gdb-remote/./ProcessGdbRemoteTests/GDBRemoteCommunicationClientTest.SaveRestoreRegistersNoSuffix (1380 of 1727) PASS: lldb-Unit :: ScriptInterpreter/Python/./ScriptInterpreterPythonTests/PythonDataObjectsTest.TestGlobalNameResolutionNoDot (1381 of 1727) PASS: lldb-Suite :: tools/lldb-server/inferior-crash/TestGdbRemoteSegFault.py (1382 of 1727) PASS: lldb-Suite :: lang/c/step-target/TestStepTarget.py (1383 of 1727) PASS: LLDB :: Minidump/dump-all.test (1384 of 1727) PASS: LLDB :: BuildScript/compiler-full-path.test (1385 of 1727) PASS: lldb-Unit :: Utility/./UtilityTests/StringListTest.AppendStringStdString (1386 of 1727) PASS: lldb-Suite :: lang/c/enum_types/TestEnumTypes.py (1387 of 1727) PASS: LLDB :: Quit/TestQuitExitCode0.test (1388 of 1727) PASS: lldb-Suite :: commands/expression/test/TestExprs.py (1389 of 1727) PASS: lldb-Unit :: Expression/./ExpressionTests/DiagnosticManagerTest.PutString (1390 of 1727) PASS: lldb-Suite :: functionalities/data-formatter/data-formatter-stl/libstdcpp/unique_ptr/invalid/TestDataFormatterInvalidStdUniquePtr.py (1391 of 1727) PASS: lldb-Unit :: UnwindAssembly/x86/./UnwindAssemblyx86Tests/Testx86AssemblyInspectionEngine.TestReturnDetect (1392 of 1727) PASS: lldb-Suite :: lang/objcxx/hide-runtime-values/TestObjCXXHideRuntimeValues.py (1393 of 1727) PASS: lldb-Unit :: Process/gdb-remote/./ProcessGdbRemoteTests/GDBRemoteCommunicationClientTest.SendGetDataPacket (1394 of 1727) PASS: lldb-Suite :: lang/cpp/signed_types/TestSignedTypes.py (1395 of 1727) PASS: lldb-Unit :: Process/gdb-remote/./ProcessGdbRemoteTests/GDBRemoteCommunicationClientTest.SendSignalsToIgnore (1396 of 1727) PASS: lldb-Suite :: lang/objc/foundation/TestRuntimeTypes.py (1397 of 1727) PASS: lldb-Unit :: Utility/./UtilityTests/RangeTest.NotEqualInvalid (1398 of 1727) PASS: lldb-Suite :: sample_test/TestSampleInlineTest.py (1399 of 1727) PASS: lldb-Unit :: Utility/./UtilityTests/StreamTest.PutHex32ByteOrderBig (1400 of 1727) PASS: lldb-Suite :: commands/expression/test/TestExprs2.py (1401 of 1727) PASS: lldb-Unit :: Expression/./ExpressionTests/DiagnosticManagerTest.GetStringPreserveOrder (1402 of 1727) PASS: lldb-Unit :: Utility/./UtilityTests/RangeTest.NotEqual (1403 of 1727) PASS: lldb-Unit :: Utility/./UtilityTests/StringListTest.AppendListCStringArray (1404 of 1727) PASS: lldb-Suite :: functionalities/thread/concurrent_events/TestConcurrentManyBreakpoints.py (1405 of 1727) PASS: lldb-Unit :: ObjectFile/Breakpad/./ObjectFileBreakpadTests/PublicRecord.parse (1406 of 1727) PASS: lldb-Suite :: commands/register/register/intel_xtended_registers/TestMPXRegisters.py (1407 of 1727) UNSUPPORTED: LLDB :: Register/x86-gp-write.test (1408 of 1727) PASS: lldb-Unit :: ScriptInterpreter/Python/./ScriptInterpreterPythonTests/PythonExceptionStateTest.TestDiscardSemantics (1409 of 1727) PASS: lldb-Suite :: functionalities/data-formatter/data-formatter-synthval/TestDataFormatterSynthVal.py (1410 of 1727) PASS: LLDB :: SymbolFile/NativePDB/function-types-calling-conv.cpp (1411 of 1727) PASS: lldb-Unit :: Process/gdb-remote/./ProcessGdbRemoteTests/GDBRemoteCommunicationClientTest.SendGetTraceConfigPacket (1412 of 1727) PASS: lldb-Unit :: Host/./HostTests/FileActionTest.Open (1413 of 1727) PASS: lldb-Unit :: Host/./HostTests/SocketTest.UDPConnect (1414 of 1727) FAIL: lldb-Suite :: tools/lldb-server/commandline/TestStubSetSID.py (1415 of 1727) ******************** TEST 'lldb-Suite :: tools/lldb-server/commandline/TestStubSetSID.py' FAILED ******************** lldb version 10.0.99 (http://labmaster3.local/git/llvm-project.git revision 466fb68fce10d34963c2fd651de32bd3a4ddcd1f) clang revision 466fb68fce10d34963c2fd651de32bd3a4ddcd1f llvm revision 466fb68fce10d34963c2fd651de32bd3a4ddcd1f LLDB library dir: /Users/buildslave/jenkins/workspace/lldb-cmake-sanitized/lldb-build/bin LLDB import library dir: /Users/buildslave/jenkins/workspace/lldb-cmake-sanitized/lldb-build/bin libstdcxx tests will not be run because: Don't know how to build with libstdcxx on macosx Skipping following debug info categories: ['dwo']

Hide Details

Session logs for test failures/errors/unexpected successes will go into directory '/Users/buildslave/jenkins/workspace/lldb-cmake-sanitized/test/logs' Command invoked: /Users/buildslave/jenkins/workspace/lldb-cmake-sanitized/llvm-project/lldb/test/dotest.py --arch=x86_64 -s /Users/buildslave/jenkins/workspace/lldb-cmake-sanitized/lldb-build/lldb-test-traces -S nm -u CXXFLAGS -u CFLAGS --executable /Users/buildslave/jenkins/workspace/lldb-cmake-sanitized/lldb-build/./bin/lldb --dsymutil /Users/buildslave/jenkins/workspace/lldb-cmake-sanitized/lldb-build/./bin/dsymutil --filecheck /Users/buildslave/jenkins/workspace/lldb-cmake-sanitized/lldb-build/./bin/FileCheck -C /Users/buildslave/jenkins/workspace/lldb-cmake-sanitized/host-compiler/bin/clang --codesign-identity lldb_codesign --server /Users/buildslave/jenkins/workspace/lldb-cmake-sanitized/lldb-build/./bin/debugserver --arch x86_64 --build-dir /Users/buildslave/jenkins/workspace/lldb-cmake-sanitized/lldb-build/lldb-test-build.noindex -s=/Users/buildslave/jenkins/workspace/lldb-cmake-sanitized/test/logs -t --env TERM=vt100 --env LLVM_LIBS_DIR=/Users/buildslave/jenkins/workspace/lldb-cmake-sanitized/lldb-build/./lib --build-dir /Users/buildslave/jenkins/workspace/lldb-cmake-sanitized/lldb-build/tools/lldb/lldb-test-build.noindex --module-cache-dir /Users/buildslave/jenkins/workspace/lldb-cmake-sanitized/lldb-build/tools/lldb/lldb-test-build.noindex/module-cache-lldb /Users/buildslave/jenkins/workspace/lldb-cmake-sanitized/llvm-project/lldb/packages/Python/lldbsuite/test/tools/lldb-server/commandline -p TestStubSetSID.py Change dir to: /Users/buildslave/jenkins/workspace/lldb-cmake-sanitized/llvm-project/lldb/packages/Python/lldbsuite/test/tools/lldb-server/commandline runCmd: settings set symbols.enable-external-lookup false output:

Hide Details

runCmd: settings set plugin.process.gdb-remote.packet-timeout 60 output:

Hide Details

runCmd: settings set symbols.clang-modules-cache-path "/Users/buildslave/jenkins/workspace/lldb-cmake-sanitized/lldb-build/tools/lldb/lldb-test-build.noindex/module-cache-lldb" output:

Hide Details

runCmd: settings set use-color false output:

Hide Details

Adding tearDown hook: def shutdown_named_pipe(): # Close the pipe. try: named_pipe.close() except: print("failed to close named pipe") None

Hide Details

# Delete the pipe. try: os.remove(named_pipe_path) except: print("failed to delete named pipe: {}".format(named_pipe_path)) None

Hide Details

# Delete the temp directory. try: os.rmdir(temp_dir) except: print( "failed to delete temp dir: {}, directory contents: '{}'".format( temp_dir, os.listdir(temp_dir))) None

Hide Details

Hide Details

Adding tearDown hook: def cleanupSubprocesses(self): # Ensure any subprocesses are cleaned up for p in self.subprocesses: p.terminate() del p del self.subprocesses[:] # Ensure any forked processes are cleaned up for pid in self.forkedProcessPids: if os.path.exists("/proc/" + str(pid)): os.kill(pid, signal.SIGTERM)

Hide Details

Hide Details

FAIL: LLDB (/Users/buildslave/jenkins/workspace/lldb-cmake-sanitized/host-compiler/bin/clang-10-x86_64) :: test_sid_is_different_with_S_debugserver (TestStubSetSID.TestStubSetSIDTestCase) Executing tearDown hook: def cleanupSubprocesses(self): # Ensure any subprocesses are cleaned up for p in self.subprocesses: p.terminate() del p del self.subprocesses[:] # Ensure any forked processes are cleaned up for pid in self.forkedProcessPids: if os.path.exists("/proc/" + str(pid)): os.kill(pid, signal.SIGTERM)

Hide Details

Hide Details

Executing tearDown hook: def shutdown_named_pipe(): # Close the pipe. try: named_pipe.close() except: print("failed to close named pipe") None

Hide Details

# Delete the pipe. try: os.remove(named_pipe_path) except: print("failed to delete named pipe: {}".format(named_pipe_path)) None

Hide Details

# Delete the temp directory. try: os.rmdir(temp_dir) except: print( "failed to delete temp dir: {}, directory contents: '{}'".format( temp_dir, os.listdir(temp_dir))) None

Hide Details

Hide Details

runCmd: settings set symbols.enable-external-lookup false output:

Hide Details

runCmd: settings set plugin.process.gdb-remote.packet-timeout 60 output:

Hide Details

runCmd: settings set symbols.clang-modules-cache-path "/Users/buildslave/jenkins/workspace/lldb-cmake-sanitized/lldb-build/tools/lldb/lldb-test-build.noindex/module-cache-lldb" output:

Hide Details

runCmd: settings set use-color false output:

Hide Details

UNSUPPORTED: LLDB (/Users/buildslave/jenkins/workspace/lldb-cmake-sanitized/host-compiler/bin/clang-10-x86_64) :: test_sid_is_different_with_S_llgs (TestStubSetSID.TestStubSetSIDTestCase) (llgs tests) runCmd: settings set symbols.enable-external-lookup false output:

Hide Details

runCmd: settings set plugin.process.gdb-remote.packet-timeout 60 output:

Hide Details

runCmd: settings set symbols.clang-modules-cache-path "/Users/buildslave/jenkins/workspace/lldb-cmake-sanitized/lldb-build/tools/lldb/lldb-test-build.noindex/module-cache-lldb" output:

Hide Details

runCmd: settings set use-color false output:

Hide Details

Adding tearDown hook: def shutdown_named_pipe(): # Close the pipe. try: named_pipe.close() except: print("failed to close named pipe") None

Hide Details

# Delete the pipe. try: os.remove(named_pipe_path) except: print("failed to delete named pipe: {}".format(named_pipe_path)) None

Hide Details

# Delete the temp directory. try: os.rmdir(temp_dir) except: print( "failed to delete temp dir: {}, directory contents: '{}'".format( temp_dir, os.listdir(temp_dir))) None

Hide Details

Hide Details

Adding tearDown hook: def cleanupSubprocesses(self): # Ensure any subprocesses are cleaned up for p in self.subprocesses: p.terminate() del p del self.subprocesses[:] # Ensure any forked processes are cleaned up for pid in self.forkedProcessPids: if os.path.exists("/proc/" + str(pid)): os.kill(pid, signal.SIGTERM)

Hide Details

Hide Details

Executing tearDown hook: def cleanupSubprocesses(self): # Ensure any subprocesses are cleaned up for p in self.subprocesses: p.terminate() del p del self.subprocesses[:] # Ensure any forked processes are cleaned up for pid in self.forkedProcessPids: if os.path.exists("/proc/" + str(pid)): os.kill(pid, signal.SIGTERM)

Hide Details

Hide Details

Executing tearDown hook: def shutdown_named_pipe(): # Close the pipe. try: named_pipe.close() except: print("failed to close named pipe") None

Hide Details

# Delete the pipe. try: os.remove(named_pipe_path) except: print("failed to delete named pipe: {}".format(named_pipe_path)) None

Hide Details

# Delete the temp directory. try: os.rmdir(temp_dir) except: print( "failed to delete temp dir: {}, directory contents: '{}'".format( temp_dir, os.listdir(temp_dir))) None

Hide Details

Hide Details

PASS: LLDB (/Users/buildslave/jenkins/workspace/lldb-cmake-sanitized/host-compiler/bin/clang-10-x86_64) :: test_sid_is_different_with_setsid_debugserver (TestStubSetSID.TestStubSetSIDTestCase) runCmd: settings set symbols.enable-external-lookup false output:

Hide Details

runCmd: settings set plugin.process.gdb-remote.packet-timeout 60 output:

Hide Details

runCmd: settings set symbols.clang-modules-cache-path "/Users/buildslave/jenkins/workspace/lldb-cmake-sanitized/lldb-build/tools/lldb/lldb-test-build.noindex/module-cache-lldb" output:

Hide Details

runCmd: settings set use-color false output:

Hide Details

UNSUPPORTED: LLDB (/Users/buildslave/jenkins/workspace/lldb-cmake-sanitized/host-compiler/bin/clang-10-x86_64) :: test_sid_is_different_with_setsid_llgs (TestStubSetSID.TestStubSetSIDTestCase) (llgs tests) runCmd: settings set symbols.enable-external-lookup false output:

Hide Details

runCmd: settings set plugin.process.gdb-remote.packet-timeout 60 output:

Hide Details

runCmd: settings set symbols.clang-modules-cache-path "/Users/buildslave/jenkins/workspace/lldb-cmake-sanitized/lldb-build/tools/lldb/lldb-test-build.noindex/module-cache-lldb" output:

Hide Details

runCmd: settings set use-color false output:

Hide Details

Adding tearDown hook: def shutdown_named_pipe(): # Close the pipe. try: named_pipe.close() except: print("failed to close named pipe") None

Hide Details

# Delete the pipe. try: os.remove(named_pipe_path) except: print("failed to delete named pipe: {}".format(named_pipe_path)) None

Hide Details

# Delete the temp directory. try: os.rmdir(temp_dir) except: print( "failed to delete temp dir: {}, directory contents: '{}'".format( temp_dir, os.listdir(temp_dir))) None

Hide Details

Hide Details

Adding tearDown hook: def cleanupSubprocesses(self): # Ensure any subprocesses are cleaned up for p in self.subprocesses: p.terminate() del p del self.subprocesses[:] # Ensure any forked processes are cleaned up for pid in self.forkedProcessPids: if os.path.exists("/proc/" + str(pid)): os.kill(pid, signal.SIGTERM)

Hide Details

Hide Details

Executing tearDown hook: def cleanupSubprocesses(self): # Ensure any subprocesses are cleaned up for p in self.subprocesses: p.terminate() del p del self.subprocesses[:] # Ensure any forked processes are cleaned up for pid in self.forkedProcessPids: if os.path.exists("/proc/" + str(pid)): os.kill(pid, signal.SIGTERM)

Hide Details

Hide Details

Executing tearDown hook: def shutdown_named_pipe(): # Close the pipe. try: named_pipe.close() except: print("failed to close named pipe") None

Hide Details

# Delete the pipe. try: os.remove(named_pipe_path) except: print("failed to delete named pipe: {}".format(named_pipe_path)) None

Hide Details

# Delete the temp directory. try: os.rmdir(temp_dir) except: print( "failed to delete temp dir: {}, directory contents: '{}'".format( temp_dir, os.listdir(temp_dir))) None

Hide Details

Hide Details

PASS: LLDB (/Users/buildslave/jenkins/workspace/lldb-cmake-sanitized/host-compiler/bin/clang-10-x86_64) :: test_sid_is_same_without_setsid_debugserver (TestStubSetSID.TestStubSetSIDTestCase) runCmd: settings set symbols.enable-external-lookup false output:

Hide Details

runCmd: settings set plugin.process.gdb-remote.packet-timeout 60 output:

Hide Details

runCmd: settings set symbols.clang-modules-cache-path "/Users/buildslave/jenkins/workspace/lldb-cmake-sanitized/lldb-build/tools/lldb/lldb-test-build.noindex/module-cache-lldb" output:

Hide Details

runCmd: settings set use-color false output:

Hide Details

UNSUPPORTED: LLDB (/Users/buildslave/jenkins/workspace/lldb-cmake-sanitized/host-compiler/bin/clang-10-x86_64) :: test_sid_is_same_without_setsid_llgs (TestStubSetSID.TestStubSetSIDTestCase) (llgs tests) Restore dir to: /Users/buildslave/jenkins/workspace/lldb-cmake-sanitized/lldb-build/tools/lldb/lit ====================================================================== FAIL: test_sid_is_different_with_S_debugserver (TestStubSetSID.TestStubSetSIDTestCase) ---------------------------------------------------------------------- Traceback (most recent call last): File "/Users/buildslave/jenkins/workspace/lldb-cmake-sanitized/llvm-project/lldb/packages/Python/lldbsuite/test/decorators.py", line 141, in wrapper func(*args, **kwargs) File "/Users/buildslave/jenkins/workspace/lldb-cmake-sanitized/llvm-project/lldb/packages/Python/lldbsuite/test/decorators.py", line 141, in wrapper func(*args, **kwargs) File "/Users/buildslave/jenkins/workspace/lldb-cmake-sanitized/llvm-project/lldb/packages/Python/lldbsuite/test/tools/lldb-server/commandline/TestStubSetSID.py", line 79, in test_sid_is_different_with_S_debugserver self.sid_is_different_with_S() File "/Users/buildslave/jenkins/workspace/lldb-cmake-sanitized/llvm-project/lldb/packages/Python/lldbsuite/test/tools/lldb-server/commandline/TestStubSetSID.py", line 40, in sid_is_different_with_S stub_sid = self.get_stub_sid(["-S"]) File "/Users/buildslave/jenkins/workspace/lldb-cmake-sanitized/llvm-project/lldb/packages/Python/lldbsuite/test/tools/lldb-server/commandline/TestStubSetSID.py", line 26, in get_stub_sid server.pid, True)) AssertionError: False is not True Config=x86_64-/Users/buildslave/jenkins/workspace/lldb-cmake-sanitized/host-compiler/bin/clang-10 ---------------------------------------------------------------------- Ran 6 tests in 11.699s

Hide Details

RESULT: FAILED (2 passes, 1 failures, 0 errors, 3 skipped, 0 expected failures, 0 unexpected successes)

Hide Details

******************** PASS: lldb-Suite :: commands/help/TestHelp.py (1416 of 1727) PASS: lldb-Suite :: tools/lldb-server/TestGdbRemoteKill.py (1417 of 1727) UNSUPPORTED: LLDB :: Breakpoint/ppc64-localentry.test (1418 of 1727) UNSUPPORTED: LLDB :: SymbolFile/PDB/variables.test (1419 of 1727) PASS: lldb-Unit :: Process/minidump/./LLDBMinidumpTests/MinidumpParserTest.GetThreadContext_x86_64 (1420 of 1727) PASS: lldb-Suite :: lang/cpp/dynamic-value/TestDynamicValue.py (1421 of 1727) PASS: lldb-Suite :: commands/command/history/TestCommandHistory.py (1422 of 1727) PASS: lldb-Unit :: Utility/./UtilityTests/OptionsWithRawTest.EmptyArgsOnlySuffix (1423 of 1727) PASS: lldb-Suite :: functionalities/darwin_log/filter/exact_match/message/TestDarwinLogFilterMatchMessage.py (1424 of 1727) PASS: lldb-Suite :: functionalities/process_group/TestChangeProcessGroup.py (1425 of 1727) PASS: lldb-Unit :: Symbol/./SymbolTests/TestClangASTContext.TestGetBasicTypeFromEnum (1426 of 1727) PASS: lldb-Unit :: UnwindAssembly/x86/./UnwindAssemblyx86Tests/Testx86AssemblyInspectionEngine.TestSubESP (1427 of 1727) PASS: lldb-Unit :: Utility/./UtilityTests/StructuredDataTest.ParseJSONFromFile (1428 of 1727) PASS: lldb-Unit :: Utility/./UtilityTests/StringLexerTest.HasAtLeast (1429 of 1727) PASS: lldb-Suite :: functionalities/data-formatter/data-formatter-stl/libcxx/function/TestLibCxxFunction.py (1430 of 1727) PASS: lldb-Suite :: functionalities/unwind/standard/TestStandardUnwind.py (1431 of 1727) PASS: lldb-Unit :: Utility/./UtilityTests/BinaryStreamTest.PutULEB128One (1432 of 1727) PASS: lldb-Suite :: lang/objc/orderedset/TestOrderedSet.py (1433 of 1727) PASS: lldb-Suite :: functionalities/data-formatter/compactvectors/TestCompactVectors.py (1434 of 1727) PASS: LLDB :: Modules/MachO/lc_version_min.yaml (1435 of 1727) PASS: lldb-Unit :: Utility/./UtilityTests/RecordReplayTest.InstrumentedFoo (1436 of 1727) PASS: lldb-Unit :: ScriptInterpreter/Python/./ScriptInterpreterPythonTests/PythonDataObjectsTest.TestPythonListToStructuredList (1437 of 1727) PASS: lldb-Unit :: Utility/./UtilityTests/Flags.Reset (1438 of 1727) PASS: lldb-Suite :: functionalities/memory/cache/TestMemoryCache.py (1439 of 1727) PASS: lldb-Suite :: commands/watchpoints/hello_watchlocation/TestWatchLocation.py (1440 of 1727) PASS: lldb-Suite :: functionalities/darwin_log/filter/regex/activity/TestDarwinLogFilterRegexActivity.py (1441 of 1727) PASS: lldb-Unit :: UnwindAssembly/x86/./UnwindAssemblyx86Tests/Testx86AssemblyInspectionEngine.TestPopESI (1442 of 1727) PASS: lldb-Suite :: functionalities/source-map/TestTargetSourceMap.py (1443 of 1727) PASS: LLDB :: SymbolFile/DWARF/debug-types-missing-signature.test (1444 of 1727) PASS: lldb-Suite :: python_api/disassemble-raw-data/TestDisassembleRawData.py (1445 of 1727) PASS: lldb-Unit :: Utility/./UtilityTests/StringExtractorTest.GetHexBytesAvail_OddPair2 (1446 of 1727) PASS: lldb-Suite :: functionalities/data-formatter/ptr_ref_typedef/TestPtrRef2Typedef.py (1447 of 1727) PASS: lldb-Suite :: functionalities/data-formatter/ostypeformatting/TestFormattersOsType.py (1448 of 1727) PASS: lldb-Suite :: tools/lldb-server/TestGdbRemoteAuxvSupport.py (1449 of 1727) PASS: lldb-Suite :: python_api/thread/TestThreadAPI.py (1450 of 1727) PASS: lldb-Suite :: python_api/exprpath_synthetic/TestExprPathSynthetic.py (1451 of 1727) PASS: lldb-Unit :: Utility/./UtilityTests/LogChannelTest.Enable (1452 of 1727) PASS: LLDB :: Unwind/trap_frame_sym_ctx.test (1453 of 1727) PASS: lldb-Suite :: lang/c/modules/TestCModules.py (1454 of 1727) PASS: LLDB :: SymbolFile/DWARF/find-variable-dwo.cpp (1455 of 1727) UNSUPPORTED: LLDB :: Register/x86-zmm-read.test (1456 of 1727) PASS: lldb-Suite :: functionalities/thread/create_after_attach/TestCreateAfterAttach.py (1457 of 1727) PASS: lldb-Suite :: functionalities/var_path/TestVarPath.py (1458 of 1727) PASS: lldb-Suite :: commands/expression/radar_9531204/TestPrintfAfterUp.py (1459 of 1727) PASS: LLDB :: SymbolFile/Breakpad/unwind-via-stack-win.test (1460 of 1727) PASS: lldb-Unit :: Host/./HostTests/NativeProcessProtocolTest.SetBreakpoint (1461 of 1727) PASS: lldb-Suite :: benchmarks/stepping/TestSteppingSpeed.py (1462 of 1727) PASS: lldb-Unit :: Host/./HostTests/HostInfoTest.GetAugmentedArchSpec (1463 of 1727) PASS: lldb-Unit :: ObjectFile/Breakpad/./ObjectFileBreakpadTests/Record.classify (1464 of 1727) PASS: LLDB :: SymbolFile/Breakpad/unwind-via-stack-cfi.test (1465 of 1727) PASS: lldb-Suite :: functionalities/data-formatter/pyobjsynthprovider/TestPyObjSynthProvider.py (1466 of 1727) PASS: lldb-Unit :: Utility/./UtilityTests/StringListTest.AppendList (1467 of 1727) XFAIL: LLDB :: Register/x86-64-ymm-write.test (1468 of 1727) PASS: lldb-Unit :: Utility/./UtilityTests/StreamTeeTest.DefaultConstructor (1469 of 1727) PASS: lldb-Unit :: Utility/./UtilityTests/ScalarTest.GetBytes (1470 of 1727) PASS: lldb-Suite :: functionalities/data-formatter/data-formatter-enum-format/TestDataFormatterEnumFormat.py (1471 of 1727) PASS: lldb-Suite :: commands/expression/char/TestExprsChar.py (1472 of 1727) PASS: lldb-Unit :: UnwindAssembly/x86/./UnwindAssemblyx86Tests/Testx86AssemblyInspectionEngine.TestAddRSP (1473 of 1727) PASS: lldb-Unit :: Language/Highlighting/./HighlighterTests/HighlighterTest.ClangComments (1474 of 1727) PASS: lldb-Unit :: Utility/./UtilityTests/RangeTest.ContainsRange (1475 of 1727) PASS: lldb-Suite :: lang/cpp/type_lookup/TestCppTypeLookup.py (1476 of 1727) PASS: lldb-Suite :: lang/objc/bitfield_ivars/TestBitfieldIvars.py (1477 of 1727) PASS: lldb-Suite :: lang/cpp/chained-calls/TestCppChainedCalls.py (1478 of 1727) PASS: LLDB :: Modules/ELF/PT_LOAD-overlap-PT_INTERP.yaml (1479 of 1727) PASS: lldb-Suite :: functionalities/data-formatter/typedef_array/TestTypedefArray.py (1480 of 1727) PASS: lldb-Unit :: Utility/./UtilityTests/Flags.Test (1481 of 1727) PASS: lldb-Unit :: Utility/./UtilityTests/OptionsWithRawTest.EmptyInput (1482 of 1727) PASS: lldb-Unit :: Symbol/./SymbolTests/TestClangASTContext.TemplateArguments (1483 of 1727) PASS: lldb-Suite :: python_api/name_lookup/TestNameLookup.py (1484 of 1727) PASS: lldb-Suite :: functionalities/breakpoint/debugbreak/TestDebugBreak.py (1485 of 1727) PASS: lldb-Suite :: functionalities/breakpoint/global_constructor/TestBreakpointInGlobalConstructor.py (1486 of 1727) PASS: lldb-Suite :: python_api/sbvalue_persist/TestSBValuePersist.py (1487 of 1727) PASS: lldb-Suite :: lang/objc/ivar-IMP/TestObjCiVarIMP.py (1488 of 1727) PASS: lldb-Suite :: tools/lldb-server/TestGdbRemoteThreadsInStopReply.py (1489 of 1727) PASS: lldb-Suite :: commands/expression/persistent_variables/TestPersistentVariables.py (1490 of 1727) XFAIL: LLDB :: Register/x86-mm-xmm-read.test (1491 of 1727) PASS: lldb-Unit :: Utility/./UtilityTests/BinaryStreamTest.PutSLEB128NineBytes (1492 of 1727) PASS: lldb-Suite :: functionalities/postmortem/elf-core/thread_crash/TestLinuxCoreThreads.py (1493 of 1727) PASS: lldb-Suite :: tools/lldb-server/TestGdbRemoteProcessInfo.py (1494 of 1727) PASS: lldb-Unit :: Utility/./UtilityTests/ArchSpecTest.MergeFromMachOUnknown (1495 of 1727) PASS: lldb-Unit :: Utility/./UtilityTests/StringListTest.JoinNonSpace (1496 of 1727) PASS: lldb-Suite :: functionalities/data-formatter/stringprinter/TestStringPrinter.py (1497 of 1727) PASS: lldb-Unit :: Utility/./UtilityTests/StateTest.Formatv (1498 of 1727) PASS: lldb-Suite :: functionalities/data-formatter/data-formatter-stl/libcxx/initializerlist/TestInitializerList.py (1499 of 1727) PASS: lldb-Unit :: Process/minidump/./LLDBMinidumpTests/RegisterContextMinidump.ConvertMinidumpContext_x86_32 (1500 of 1727) PASS: lldb-Unit :: Utility/./UtilityTests/StringListTest.LongestCommonPrefixDuplicateElement (1501 of 1727) PASS: lldb-Suite :: python_api/default-constructor/TestDefaultConstructorForAPIObjects.py (1502 of 1727) PASS: lldb-Suite :: commands/expression/po_verbosity/TestPoVerbosity.py (1503 of 1727) PASS: lldb-Unit :: Utility/./UtilityTests/StringListTest.ForRangeEmpty (1504 of 1727) PASS: lldb-Suite :: functionalities/postmortem/minidump/TestMiniDump.py (1505 of 1727) PASS: lldb-Suite :: lang/objc/objc-ivar-protocols/TestIvarProtocols.py (1506 of 1727) PASS: lldb-Unit :: SymbolFile/NativePDB/./SymbolFileNativePDBTests/PDBFPOProgramToDWARFExpressionTests.UnresolvedRegisterReference (1507 of 1727) PASS: LLDB :: SymbolFile/DWARF/find-basic-type.cpp (1508 of 1727) PASS: lldb-Unit :: Utility/./UtilityTests/ConstStringTest.FromMidOfBufferStringRef (1509 of 1727) PASS: LLDB :: Modules/PECOFF/subsections.yaml (1510 of 1727) PASS: lldb-Unit :: Expression/./ExpressionTests/DiagnosticManagerTest.AppendMessageAttachToLastDiag (1511 of 1727) PASS: lldb-Suite :: python_api/frame/get-variables/TestGetVariables.py (1512 of 1727) UNSUPPORTED: LLDB :: Register/x86-64-ymm16-read.test (1513 of 1727) PASS: lldb-Suite :: functionalities/thread/concurrent_events/TestConcurrentManyWatchpoints.py (1514 of 1727) PASS: lldb-Suite :: functionalities/breakpoint/auto_continue/TestBreakpointAutoContinue.py (1515 of 1727) PASS: lldb-Unit :: Language/Highlighting/./HighlighterTests/HighlighterTest.ClangCursorPosAfterOtherToken (1516 of 1727) PASS: lldb-Unit :: Utility/./UtilityTests/ScalarTest.Scalar_512 (1517 of 1727) PASS: lldb-Unit :: Expression/./ExpressionTests/DiagnosticManagerTest.AppendMessageSubsequentDiags (1518 of 1727) PASS: lldb-Unit :: Host/./HostTests/SocketTest.TCPGetConnectURI (1519 of 1727) PASS: lldb-Suite :: functionalities/tail_call_frames/ambiguous_tail_call_seq2/TestAmbiguousTailCallSeq2.py (1520 of 1727) PASS: lldb-Suite :: commands/settings/quoting/TestQuoting.py (1521 of 1727) PASS: lldb-Unit :: Utility/./UtilityTests/StreamTest.PutMaxHex64ByteOrderLittle (1522 of 1727) PASS: LLDB :: Quit/TestQuitExitCode30.test (1523 of 1727) PASS: lldb-Unit :: Language/Highlighting/./HighlighterTests/HighlighterTest.ClangUnterminatedString (1524 of 1727) PASS: lldb-Suite :: functionalities/data-formatter/refpointer-recursion/TestDataFormatterRefPtrRecursion.py (1525 of 1727) PASS: lldb-Suite :: commands/expression/ir-interpreter/TestIRInterpreter.py (1526 of 1727) PASS: lldb-Unit :: Utility/./UtilityTests/SerializationRountripTest.SerializeDeserializePodReferences (1527 of 1727) PASS: lldb-Suite :: functionalities/thread/state/TestThreadStates.py (1528 of 1727) PASS: lldb-Unit :: Process/gdb-remote/./ProcessGdbRemoteTests/GDBRemoteCommunicationClientTest.WriteRegister (1529 of 1727) PASS: lldb-Suite :: commands/expression/import-std-module/forward_list-basic/TestBasicForwardList.py (1530 of 1727) PASS: lldb-Suite :: macosx/thread-names/TestInterruptThreadNames.py (1531 of 1727) PASS: lldb-Suite :: lang/cpp/unicode-literals/TestUnicodeLiterals.py (1532 of 1727) PASS: lldb-Suite :: api/multiple-targets/TestMultipleTargets.py (1533 of 1727) PASS: LLDB :: SymbolFile/DWARF/compilercontext.ll (1534 of 1727) PASS: lldb-Unit :: Utility/./UtilityTests/BinaryStreamTest.PutSLEB128ThreeBytes (1535 of 1727) PASS: lldb-Suite :: functionalities/type_completion/TestTypeCompletion.py (1536 of 1727) PASS: lldb-Suite :: commands/process/launch/TestProcessLaunch.py (1537 of 1727) PASS: lldb-Suite :: functionalities/data-formatter/data-formatter-disabling/TestDataFormatterDisabling.py (1538 of 1727) PASS: lldb-Unit :: UnwindAssembly/x86/./UnwindAssemblyx86Tests/Testx86AssemblyInspectionEngine.TestPush0 (1539 of 1727) PASS: lldb-Unit :: Utility/./UtilityTests/ScalarTest.GetValue (1540 of 1727) PASS: lldb-Suite :: functionalities/tail_call_frames/inlining_and_tail_calls/TestInliningAndTailCalls.py (1541 of 1727) PASS: lldb-Suite :: functionalities/return-value/TestReturnValue.py (1542 of 1727) PASS: lldb-Suite :: python_api/lldbutil/TestSwigVersion.py (1543 of 1727) PASS: lldb-Unit :: Utility/./UtilityTests/StringListTest.CopyList (1544 of 1727) PASS: lldb-Unit :: Utility/./UtilityTests/UriParserTest.Minimal (1545 of 1727) PASS: lldb-Unit :: Utility/./UtilityTests/StringExtractorTest.DecodeHexU8_Underflow2 (1546 of 1727) PASS: lldb-Suite :: commands/expression/argument_passing_restrictions/TestArgumentPassingRestrictions.py (1547 of 1727) PASS: lldb-Suite :: commands/expression/inline-namespace/TestInlineNamespace.py (1548 of 1727) PASS: LLDB :: Settings/TestSettingsSet.test (1549 of 1727) PASS: lldb-Unit :: UnwindAssembly/x86/./UnwindAssemblyx86Tests/Testx86AssemblyInspectionEngine.TestStackRealign32BitDisp_x86_64 (1550 of 1727) PASS: LLDB :: Modules/MachO/subsections.yaml (1551 of 1727) PASS: lldb-Suite :: commands/watchpoints/hello_watchpoint/TestMyFirstWatchpoint.py (1552 of 1727) PASS: lldb-Suite :: functionalities/breakpoint/breakpoint_ids/TestBreakpointIDs.py (1553 of 1727) PASS: lldb-Suite :: functionalities/thread/backtrace_all/TestBacktraceAll.py (1554 of 1727) PASS: lldb-Suite :: functionalities/data-formatter/synthupdate/TestSyntheticFilterRecompute.py (1555 of 1727) PASS: lldb-Unit :: Target/./TargetTests/ModuleCacheTest.GetAndPut (1556 of 1727) PASS: lldb-Unit :: Expression/./ExpressionTests/DiagnosticManagerTest.PutStringSeverities (1557 of 1727) PASS: lldb-Unit :: Utility/./UtilityTests/ListenerTest.GetEventWait (1558 of 1727) PASS: lldb-Suite :: commands/expression/scoped_enums/TestScopedEnumType.py (1559 of 1727) PASS: lldb-Unit :: SymbolFile/DWARF/./SymbolFileDWARFTests/SymbolFileDWARFTests.TestAbbrevValidAttrNullForm (1560 of 1727) PASS: LLDB :: Breakpoint/debug_rnglist_offset_pair.test (1561 of 1727) PASS: lldb-Unit :: Utility/./UtilityTests/UriParserTest.BadPort (1562 of 1727) PASS: lldb-Unit :: Utility/./UtilityTests/ArchSpecTest.Compatibility (1563 of 1727) PASS: lldb-Unit :: Process/minidump/./LLDBMinidumpTests/MinidumpParserTest.GetThreadContext_x86_32 (1564 of 1727) PASS: lldb-Suite :: python_api/watchpoint/TestWatchpointIgnoreCount.py (1565 of 1727) PASS: lldb-Suite :: python_api/sbstructureddata/TestStructuredDataAPI.py (1566 of 1727) UNSUPPORTED: LLDB :: Register/x86-ymm-write.test (1567 of 1727) PASS: lldb-Unit :: Utility/./UtilityTests/StringListTest.GetMaxStringLengthIncreasingSize (1568 of 1727) PASS: lldb-Suite :: tools/lldb-vscode/attach/TestVSCode_attach.py (1569 of 1727) PASS: lldb-Unit :: Language/Highlighting/./HighlighterTests/HighlighterTest.ClangPPDirectives (1570 of 1727) PASS: lldb-Unit :: Utility/./UtilityTests/ListenerTest.GetEventImmediate (1571 of 1727) PASS: lldb-Unit :: Process/gdb-remote/./ProcessGdbRemoteTests/GDBRemoteCommunicationClientTest.GetModulesInfo_UUID20 (1572 of 1727) PASS: lldb-Unit :: Host/./HostTests/SocketTest.TCPGetAddress (1573 of 1727) PASS: lldb-Unit :: Utility/./UtilityTests/StringExtractorTest.DecodeHexU8_InvalidHex (1574 of 1727) PASS: lldb-Unit :: Utility/./UtilityTests/ArgsTest.TestArgv (1575 of 1727) PASS: LLDB :: SymbolFile/NativePDB/break-by-function.cpp (1576 of 1727) PASS: lldb-Suite :: lang/objc/foundation/TestObjCMethods2.py (1577 of 1727) PASS: lldb-Unit :: Utility/./UtilityTests/ArgsTest.TestTrailingBackslash (1578 of 1727) PASS: lldb-Suite :: commands/command/invalid-args/TestInvalidArgsCommand.py (1579 of 1727) PASS: lldb-Unit :: Target/./TargetTests/PathMappingListTest.RemapRoot (1580 of 1727) PASS: lldb-Unit :: Process/minidump/./LLDBMinidumpTests/MinidumpParserTest.GetMiscInfoWindows (1581 of 1727) PASS: lldb-Unit :: Utility/./UtilityTests/StringListTest.SplitIntoLines (1582 of 1727) PASS: lldb-Suite :: commands/command/script/TestCommandScript.py (1583 of 1727) PASS: lldb-Unit :: Utility/./UtilityTests/StringListTest.GetSize (1584 of 1727) PASS: lldb-Suite :: commands/expression/import-std-module/conflicts/TestStdModuleWithConflicts.py (1585 of 1727) PASS: lldb-Suite :: python_api/sbvalue_const_addrof/TestSBValueConstAddrOf.py (1586 of 1727) PASS: lldb-Suite :: functionalities/darwin_log/filter/exact_match/activity/TestDarwinLogFilterMatchActivity.py (1587 of 1727) PASS: lldb-Suite :: commands/expression/issue_11588/Test11588.py (1588 of 1727) PASS: lldb-Unit :: Utility/./UtilityTests/StringListTest.InsertStringAtIndexStdString (1589 of 1727) PASS: lldb-Unit :: ScriptInterpreter/Python/./ScriptInterpreterPythonTests/PythonDataObjectsTest.TestPythonDictionaryManipulation (1590 of 1727) PASS: lldb-Unit :: Utility/./UtilityTests/Predicate.WaitForValueEqualTo (1591 of 1727) PASS: LLDB :: Quit/TestQuitExitCode-30.test (1592 of 1727) PASS: lldb-Suite :: commands/expression/import-std-module/vector-dbg-info-content/TestDbgInfoContentVector.py (1593 of 1727) PASS: lldb-Unit :: UnwindAssembly/x86/./UnwindAssemblyx86Tests/Testx86AssemblyInspectionEngine.TestPopR13 (1594 of 1727) PASS: lldb-Suite :: lang/objc/foundation/TestObjCMethodsString.py (1595 of 1727) PASS: lldb-Unit :: Utility/./UtilityTests/StringListTest.RemoveBlankLines (1596 of 1727) PASS: lldb-Suite :: commands/frame/diagnose/array/TestArray.py (1597 of 1727) PASS: lldb-Unit :: Language/CPlusPlus/./LanguageCPlusPlusTests/CPlusPlusLanguage.FindAlternateFunctionManglings (1598 of 1727) PASS: lldb-Suite :: functionalities/data-formatter/data-formatter-python-synth/TestDataFormatterPythonSynth.py (1599 of 1727) PASS: lldb-Unit :: debugserver/./debugserverTests/RNBSocket.LoopBackListenIPv6 (1600 of 1727) PASS: lldb-Suite :: functionalities/memory/read/TestMemoryRead.py (1601 of 1727) PASS: lldb-Unit :: debugserver/./debugserverTests/RNBSocket.LoopBackListenIPv4 (1602 of 1727) PASS: lldb-Unit :: Utility/./UtilityTests/StringExtractorTest.GetHexU8_Underflow (1603 of 1727) PASS: lldb-Suite :: functionalities/fat_archives/TestFatArchives.py (1604 of 1727) PASS: lldb-Unit :: UnwindAssembly/x86/./UnwindAssemblyx86Tests/Testx86AssemblyInspectionEngine.TestSimple64bitFrameFunction (1605 of 1727) PASS: lldb-Unit :: Symbol/./SymbolTests/DWARFCallFrameInfoTest.Basic_dwarf3 (1606 of 1727) PASS: lldb-Suite :: functionalities/gdb_remote_client/TestGDBRemoteLoad.py (1607 of 1727) PASS: lldb-Unit :: Utility/./UtilityTests/LogChannelTest.List (1608 of 1727) PASS: lldb-Suite :: python_api/signals/TestSignalsAPI.py (1609 of 1727) PASS: lldb-Unit :: Utility/./UtilityTests/CompletionRequest.TestCompletionOwnership (1610 of 1727) PASS: lldb-Unit :: Utility/./UtilityTests/TimerTest.CategoryTimes (1611 of 1727) PASS: lldb-Unit :: ObjectFile/Breakpad/./ObjectFileBreakpadTests/FileRecord.parse (1612 of 1727) PASS: lldb-Unit :: Utility/./UtilityTests/ScalarTest.CastOperations (1613 of 1727) PASS: lldb-Unit :: Utility/./UtilityTests/StringExtractorTest.GetU64LittleEndian (1614 of 1727) PASS: lldb-Unit :: UnwindAssembly/x86/./UnwindAssemblyx86Tests/Testx86AssemblyInspectionEngine.Test32bitFramelessSmallStackFrame (1615 of 1727) PASS: lldb-Suite :: functionalities/thread/concurrent_events/TestConcurrentWatchBreak.py (1616 of 1727) PASS: lldb-Suite :: functionalities/thread/concurrent_events/TestConcurrentNWatchNBreak.py (1617 of 1727) PASS: lldb-Suite :: lang/objc/real-definition/TestRealDefinition.py (1618 of 1727) PASS: lldb-Unit :: tools/lldb-server/tests/./LLDBServerTests/TestBase.DebugserverEnv (1619 of 1727) PASS: lldb-Suite :: functionalities/plugins/command_plugin/TestPluginCommands.py (1620 of 1727) PASS: lldb-Unit :: Utility/./UtilityTests/ArgsTest.TestQuotedUnknownEscape (1621 of 1727) PASS: lldb-Unit :: UnwindAssembly/x86/./UnwindAssemblyx86Tests/Testx86AssemblyInspectionEngine.TestPushR14 (1622 of 1727) PASS: lldb-Suite :: commands/watchpoints/watchpoint_disable/TestWatchpointDisable.py (1623 of 1727) PASS: lldb-Suite :: python_api/value_var_update/TestValueVarUpdate.py (1624 of 1727) PASS: lldb-Suite :: tools/lldb-server/thread-name/TestGdbRemoteThreadName.py (1625 of 1727) PASS: lldb-Suite :: functionalities/data-formatter/data-formatter-objc/TestDataFormatterObjCNSBundle.py (1626 of 1727) PASS: lldb-Suite :: lang/cpp/namespace_definitions/TestNamespaceDefinitions.py (1627 of 1727) PASS: lldb-Unit :: Utility/./UtilityTests/StreamTest.PutRawBytesToMixedEndian (1628 of 1727) PASS: lldb-Unit :: ScriptInterpreter/Python/./ScriptInterpreterPythonTests/PythonDataObjectsTest.TestPythonString (1629 of 1727) PASS: lldb-Unit :: Utility/./UtilityTests/FileSpecTest.EqualDotsWindows (1630 of 1727) PASS: lldb-Suite :: commands/process/launch-with-shellexpand/TestLaunchWithShellExpand.py (1631 of 1727) PASS: lldb-Suite :: benchmarks/continue/TestBenchmarkContinue.py (1632 of 1727) PASS: lldb-Unit :: Symbol/./SymbolTests/PostfixExpression.ParseOneExpression (1633 of 1727) PASS: lldb-Unit :: Utility/./UtilityTests/GeneratorTest.GetOrCreate (1634 of 1727) PASS: lldb-Suite :: commands/expression/vector_of_enums/TestVectorOfEnums.py (1635 of 1727) PASS: LLDB :: Breakpoint/split-dwarf-5-addrbase.test (1636 of 1727) PASS: lldb-Unit :: Signals/./SignalsTests/UnixSignalsTest.GetFilteredSignals (1637 of 1727) PASS: lldb-Unit :: Host/./HostTests/SocketAddressTest.Set (1638 of 1727) PASS: LLDB :: SymbolFile/DWARF/debug-types-dwo-cross-reference.cpp (1639 of 1727) PASS: LLDB :: Modules/ELF/basic-info.yaml (1640 of 1727) PASS: lldb-Unit :: Host/./HostTests/MainLoopTest.TerminatesImmediately (1641 of 1727) PASS: lldb-Suite :: arm/emulation/TestEmulations.py (1642 of 1727) PASS: lldb-Suite :: functionalities/breakpoint/breakpoint_locations/TestBreakpointLocations.py (1643 of 1727) PASS: lldb-Unit :: Utility/./UtilityTests/VASprintfTest.NoBufferResize (1644 of 1727) PASS: lldb-Suite :: lang/c/anonymous/TestAnonymous.py (1645 of 1727) PASS: lldb-Unit :: Utility/./UtilityTests/UriParserTest.SchemeHostSeparator4 (1646 of 1727) PASS: lldb-Suite :: lang/objc/exceptions/TestObjCExceptions.py (1647 of 1727) PASS: lldb-Suite :: lang/c/stepping/TestStepAndBreakpoints.py (1648 of 1727) PASS: lldb-Suite :: lang/objc/rdar-11355592/TestRdar11355592.py (1649 of 1727) PASS: lldb-Suite :: functionalities/data-formatter/data-formatter-script/TestDataFormatterScript.py (1650 of 1727) PASS: lldb-Suite :: commands/target/create-deps/TestTargetCreateDeps.py (1651 of 1727) PASS: lldb-Unit :: Symbol/./SymbolTests/PostfixExpression.ToDWARF (1652 of 1727) PASS: lldb-Unit :: Symbol/./SymbolTests/DWARFCallFrameInfoTest.Basic_eh (1653 of 1727) PASS: LLDB :: Breakpoint/split-dwarf5-debug-stroffsets.test (1654 of 1727) PASS: lldb-Unit :: Utility/./UtilityTests/StringListTest.InsertStringAtIndexEnd (1655 of 1727) PASS: lldb-Suite :: commands/command/script/import/TestImport.py (1656 of 1727) PASS: lldb-Suite :: commands/expression/completion-crash2/TestCompletionCrash2.py (1657 of 1727) PASS: lldb-Suite :: functionalities/data-formatter/data-formatter-stl/libcxx/vector/TestDataFormatterLibcxxVector.py (1658 of 1727) PASS: lldb-Suite :: lang/cpp/operators/TestCppOperators.py (1659 of 1727) PASS: lldb-Suite :: functionalities/data-formatter/data-formatter-cpp/TestDataFormatterCpp.py (1660 of 1727) PASS: lldb-Suite :: lang/c/function_types/TestFunctionTypes.py (1661 of 1727) PASS: lldb-Unit :: Utility/./UtilityTests/OptionsWithRawTest.ArgsButNoDelimiter (1662 of 1727) PASS: lldb-Suite :: python_api/class_members/TestSBTypeClassMembers.py (1663 of 1727) PASS: lldb-Suite :: functionalities/darwin_log/filter/exact_match/category/TestDarwinLogFilterMatchCategory.py (1664 of 1727) PASS: lldb-Suite :: tools/lldb-vscode/step/TestVSCode_step.py (1665 of 1727) PASS: lldb-Unit :: SymbolFile/NativePDB/./SymbolFileNativePDBTests/PDBFPOProgramToDWARFExpressionTests.SingleAssignmentRegisterRef (1666 of 1727) PASS: lldb-Suite :: lang/objc/print-obj/TestPrintObj.py (1667 of 1727) PASS: LLDB :: SymbolFile/Breakpad/stack-cfi-parsing.test (1668 of 1727) PASS: lldb-Unit :: Utility/./UtilityTests/UserIDResolver.GetGroupName (1669 of 1727) PASS: lldb-Unit :: Symbol/./SymbolTests/TestClangASTContext.TestRemoveFastQualifiers (1670 of 1727) PASS: lldb-Suite :: functionalities/thread/concurrent_events/TestConcurrentDelayWatchBreak.py (1671 of 1727) PASS: lldb-Unit :: debugserver/./debugserverTests/RNBSocket.LoopBackConnectIPv4 (1672 of 1727) PASS: lldb-Unit :: Utility/./UtilityTests/ArchSpecTest.TripleComponentsWereSpecified (1673 of 1727) PASS: lldb-Unit :: Process/minidump/./LLDBMinidumpTests/MinidumpParserTest.GetMemoryRegionInfoFromMemoryList (1674 of 1727) PASS: LLDB :: SymbolFile/NativePDB/s_constant.cpp (1675 of 1727) PASS: LLDB :: Modules/Breakpad/sections.test (1676 of 1727) PASS: lldb-Suite :: commands/register/register/intel_xtended_registers/mpx_bound_violation/TestBoundViolation.py (1677 of 1727) PASS: lldb-Unit :: Utility/./UtilityTests/Flags.AllClear (1678 of 1727) PASS: lldb-Unit :: Utility/./UtilityTests/AnsiTerminal.Twice (1679 of 1727) PASS: LLDB :: SymbolFile/DWARF/dir-separator-no-comp-dir-relative-name.s (1680 of 1727) PASS: lldb-Unit :: Utility/./UtilityTests/StringExtractorTest.GetHexBytes_FullString (1681 of 1727) PASS: lldb-Suite :: sanity/TestModuleCacheSanity.py (1682 of 1727) PASS: lldb-Suite :: lang/objc/foundation/TestSymbolTable.py (1683 of 1727) PASS: lldb-Suite :: lang/cpp/char8_t/TestCxxChar8_t.py (1684 of 1727) PASS: lldb-Unit :: Utility/./UtilityTests/RegularExpression.Invalid (1685 of 1727) PASS: lldb-Unit :: UnwindAssembly/x86/./UnwindAssemblyx86Tests/Testx86AssemblyInspectionEngine.TestStackRealignMSVC_i386 (1686 of 1727) PASS: lldb-Unit :: Symbol/./SymbolTests/TestClangASTContext.TestConvertAccessTypeToAccessSpecifier (1687 of 1727) PASS: lldb-Unit :: ScriptInterpreter/Python/./ScriptInterpreterPythonTests/PythonDataObjectsTest.TestInstanceNameResolutionNoDot (1688 of 1727) PASS: lldb-Unit :: Symbol/./SymbolTests/SymbolsTest.LocateExecutableSymbolFileForUnknownExecutableAndMissingSymbolFile (1689 of 1727) PASS: LLDB :: SymbolFile/DWARF/find-basic-namespace.cpp (1690 of 1727) PASS: lldb-Unit :: Utility/./UtilityTests/ArgsTest.TestAppendArg (1691 of 1727) PASS: lldb-Suite :: lang/cpp/printf/TestPrintf.py (1692 of 1727) PASS: lldb-Suite :: lang/cpp/lambdas/TestLambdas.py (1693 of 1727) PASS: lldb-Suite :: functionalities/step_scripted/TestStepScripted.py (1694 of 1727) PASS: lldb-Unit :: Utility/./UtilityTests/UUIDTest.Validity (1695 of 1727) PASS: lldb-Unit :: Utility/./UtilityTests/GeneratorTest.Create (1696 of 1727) PASS: LLDB :: SymbolFile/DWARF/debug-line-basic.s (1697 of 1727) UNSUPPORTED: LLDB :: Unwind/eh-frame-small-fde.test (1698 of 1727) PASS: LLDB :: SymbolFile/NativePDB/function-types-classes.cpp (1699 of 1727) PASS: lldb-Unit :: Utility/./UtilityTests/RangeTest.DefaultConstructor (1700 of 1727) PASS: LLDB :: Modules/PECOFF/basic-info.yaml (1701 of 1727) PASS: lldb-Unit :: Symbol/./SymbolTests/TestClangASTContext.TestBuiltinTypeForEncodingAndBitSize (1702 of 1727) PASS: lldb-Suite :: functionalities/breakpoint/dummy_target_breakpoints/TestBreakpointsWithNoTargets.py (1703 of 1727) PASS: lldb-Unit :: Process/minidump/./LLDBMinidumpTests/MinidumpParserTest.GetLinuxProcStatus_no_stream (1704 of 1727) PASS: lldb-Suite :: benchmarks/frame_variable/TestFrameVariableResponse.py (1705 of 1727) PASS: lldb-Suite :: lang/cpp/breakpoint_in_member_func_w_non_primitive_params/TestBreakpointInMemberFuncWNonPrimitiveParams.py (1706 of 1727) PASS: lldb-Suite :: functionalities/thread/concurrent_events/TestConcurrentDelayedCrashWithBreakpointWatchpoint.py (1707 of 1727) PASS: LLDB :: Register/x86-64-gp-read.test (1708 of 1727) PASS: lldb-Unit :: Utility/./UtilityTests/DataExtractorTest.PeekData (1709 of 1727) PASS: lldb-Suite :: commands/disassemble/basic/TestDisassembleBreakpoint.py (1710 of 1727) PASS: LLDB :: SymbolFile/DWARF/parallel-indexing-stress.s (1711 of 1727) PASS: lldb-Unit :: Utility/./UtilityTests/StringListTest.LongestCommonPrefix (1712 of 1727) PASS: lldb-Suite :: android/platform/TestDefaultCacheLineSize.py (1713 of 1727) PASS: lldb-Suite :: functionalities/breakpoint/consecutive_breakpoints/TestConsecutiveBreakpoints.py (1714 of 1727) PASS: lldb-Suite :: functionalities/longjmp/TestLongjmp.py (1715 of 1727) PASS: lldb-Suite :: commands/expression/namespace_local_var_same_name_cpp_and_c/TestNamespaceLocalVarSameNameCppAndC.py (1716 of 1727) PASS: lldb-Suite :: functionalities/breakpoint/cpp/TestCPPBreakpointLocations.py (1717 of 1727) PASS: lldb-Suite :: functionalities/breakpoint/breakpoint_in_delayslot/TestAvoidBreakpointInDelaySlot.py (1718 of 1727) PASS: lldb-Suite :: functionalities/data-formatter/parray/TestPrintArray.py (1719 of 1727) PASS: lldb-Suite :: lang/cpp/stl/TestStdCXXDisassembly.py (1720 of 1727) PASS: lldb-Suite :: lang/objc/objc-baseclass-sbtype/TestObjCBaseClassSBType.py (1721 of 1727) PASS: lldb-Suite :: functionalities/thread/concurrent_events/TestConcurrentSignalWatchBreak.py (1722 of 1727) PASS: lldb-Suite :: functionalities/thread/concurrent_events/TestConcurrentCrashWithWatchpointBreakpointSignal.py (1723 of 1727) PASS: lldb-Suite :: lang/c/strings/TestCStrings.py (1724 of 1727) PASS: lldb-Suite :: api/multithreaded/TestMultithreaded.py (1725 of 1727) PASS: lldb-Suite :: types/TestIntegerTypes.py (1726 of 1727) PASS: lldb-Suite :: lang/objc/foundation/TestFoundationDisassembly.py (1727 of 1727) Testing Time: 1762.90s ******************** Failing Tests (6): lldb-Suite :: commands/gui/basic/TestGuiBasic.py lldb-Suite :: commands/expression/multiline-completion/TestMultilineCompletion.py lldb-Suite :: tools/lldb-server/TestAppleSimulatorOSType.py lldb-Unit :: Utility/./UtilityTests/TimerTest.CategoryTimesStats lldb-Suite :: functionalities/gdb_remote_client/TestThreadSelectionBug.py lldb-Suite :: tools/lldb-server/commandline/TestStubSetSID.py

Hide Details

******************** Unresolved Tests (1): lldb-Suite :: commands/expression/diagnostics/TestExprDiagnostics.py

Hide Details

Hide Details

Slowest Tests: -------------------------------------------------------------------------- 114.61s: lldb-Suite :: lang/objc/real-definition/TestRealDefinition.py 117.29s: lldb-Suite :: functionalities/inferior-crashing/TestInferiorCrashingStep.py 124.67s: lldb-Suite :: api/check_public_api_headers/TestPublicAPIHeaders.py 129.93s: lldb-Suite :: commands/target/basic/TestTargetCommand.py 137.37s: lldb-Suite :: lang/objc/objc-new-syntax/TestObjCNewSyntaxArray.py 138.48s: lldb-Suite :: lang/objc/objc-new-syntax/TestObjCNewSyntaxDictionary.py 138.60s: lldb-Suite :: functionalities/recursion/TestValueObjectRecursion.py 159.04s: lldb-Suite :: lang/objc/exceptions/TestObjCExceptions.py 162.58s: lldb-Suite :: functionalities/return-value/TestReturnValue.py 172.57s: lldb-Suite :: functionalities/load_unload/TestLoadUnload.py 181.35s: lldb-Suite :: lang/objc/objc-new-syntax/TestObjCNewSyntaxLiteral.py 184.78s: lldb-Suite :: api/multithreaded/TestMultithreaded.py 187.20s: lldb-Suite :: lang/cpp/namespace/TestNamespaceLookup.py 206.25s: lldb-Suite :: tools/lldb-server/TestLldbGdbServer.py 215.98s: lldb-Suite :: lang/objc/foundation/TestObjCMethods.py 226.24s: lldb-Suite :: lang/cpp/enum_types/TestCPP11EnumTypes.py 239.11s: lldb-Suite :: lang/objc/hidden-ivars/TestHiddenIvars.py 302.01s: lldb-Suite :: types/TestIntegerTypes.py 514.30s: lldb-Suite :: lang/objc/foundation/TestFoundationDisassembly.py 545.51s: lldb-Suite :: types/TestIntegerTypesExpr.py

Hide Details

Tests Times: -------------------------------------------------------------------------- [ Range ] :: [ Percentage ] :: [ Count ] -------------------------------------------------------------------------- [ 0s, 50s) :: [************************************* ] :: [1604/1727] [ 50s,100s) :: [** ] :: [ 99/1727] [100s,150s) :: [ ] :: [ 11/1727] [150s,200s) :: [ ] :: [ 6/1727] [200s,250s) :: [ ] :: [ 4/1727] [250s,300s) :: [ ] :: [ 0/1727] [300s,350s) :: [ ] :: [ 1/1727] [350s,400s) :: [ ] :: [ 0/1727] [400s,450s) :: [ ] :: [ 0/1727] [450s,500s) :: [ ] :: [ 0/1727] [500s,550s) :: [ ] :: [ 2/1727] Expected Passes : 1670 Expected Failures : 6 Unsupported Tests : 44 Unresolved Tests : 1 Unexpected Failures: 6 FAILED: tools/lldb/lit/CMakeFiles/check-lldb-lit cd /Users/buildslave/jenkins/workspace/lldb-cmake-sanitized/lldb-build/tools/lldb/lit && /usr/bin/python /Users/buildslave/jenkins/workspace/lldb-cmake-sanitized/lldb-build/./bin/llvm-lit -v --time-tests --shuffle --xunit-xml-output=/Users/buildslave/jenkins/workspace/lldb-cmake-sanitized/test/results.xml -v --timeout 1200 /Users/buildslave/jenkins/workspace/lldb-cmake-sanitized/lldb-build/tools/lldb/lit ninja: build stopped: subcommand failed. Command failed Command: ['/usr/bin/env', 'TERM=vt100', '/usr/local/bin/ninja', '-v', 'check-lldb'] [Pipeline] } [Pipeline] // timeout [Pipeline] } [Pipeline] // stage [Pipeline] stage [Pipeline] { (Declarative: Post Actions) [Pipeline] scanForIssues No credentials specified [Clang (LLVM based)] Sleeping for 5 seconds due to JENKINS-32191... [Clang (LLVM based)] Parsing console log (workspace: '/Users/buildslave/jenkins/workspace/lldb-cmake-sanitized') [Clang (LLVM based)] [-ERROR-] Git blame errors: [Clang (LLVM based)] [-ERROR-] - no blame results for request <llvm-project/lldb/source/Plugins/ExpressionParser/Clang/ClangUserExpression.cpp - [584]>.

Hide Details

[Clang (LLVM based)] Post processing issues on 'green-dragon-23' with source code encoding 'UTF-8' [Clang (LLVM based)] Resolving absolute file names for all issues in workspace '/Users/buildslave/jenkins/workspace/lldb-cmake-sanitized' [Clang (LLVM based)] -> 0 resolved, 0 unresolved, 1 already resolved [Clang (LLVM based)] Copying affected files to Jenkins' build folder '/Users/Shared/Jenkins/Home/jobs/lldb-cmake-sanitized/builds/173/files-with-issues' [Clang (LLVM based)] -> 1 copied, 0 not in workspace, 0 not-found, 0 with I/O error [Clang (LLVM based)] Resolving module names from module definitions (build.xml, pom.xml, or Manifest.mf files) [Clang (LLVM based)] -> resolved module names for 1 issues [Clang (LLVM based)] Resolving package names (or namespaces) by parsing the affected files [Clang (LLVM based)] -> resolved package names of 1 affected files [Clang (LLVM based)] No filter has been set, publishing all 1 issues [Clang (LLVM based)] Creating fingerprints for all affected code blocks to track issues over different builds [Clang (LLVM based)] -> created fingerprints for 1 issues [Clang (LLVM based)] Invoking Git blamer to create author and commit information for all affected files [Clang (LLVM based)] GIT_COMMIT env = 'HEAD' [Clang (LLVM based)] Git working tree = '/Users/buildslave/jenkins/workspace/lldb-cmake-sanitized' [Clang (LLVM based)] Git commit ID = '447a47d472e9ad0a529c0920a0db6231506d3e91' [Clang (LLVM based)] Job workspace = '/Users/buildslave/jenkins/workspace/lldb-cmake-sanitized' [Clang (LLVM based)] Created blame requests for 1 files - invoking Git blame on agent for each of the requests [Clang (LLVM based)] -> blamed authors of issues in 1 files
[Pipeline] junit Recording test results [Pipeline] } [Pipeline] // stage [Pipeline] } [Pipeline] // withEnv [Pipeline] } [Pipeline] // node [Pipeline] End of Pipeline [BFA] Scanning build for known causes... > git rev-parse HEAD^{commit} # timeout=10 [BFA] Found failure cause(s): [BFA] Ninja target failed from category Compile [BFA] Regression test failed from category Test [BFA] Done. 1s ERROR: script returned exit code 1 Finished: FAILURE