FailedConsole Output

Skipping 2,895 KB.. Full Log
unCmd: settings set use-color false
output: 

Hide Details

FAIL: LLDB (/Users/buildslave/jenkins/workspace/lldb-cmake-sanitized/host-compiler/bin/clang-10-x86_64) :: test_dsym (lldbsuite.test.lldbtest.TestGModules) <bound method SBProcess.Kill of <lldb.SBProcess; proxy of <Swig Object of type 'lldb::SBProcess *' at 0x11f3b4150> >>: success

Hide Details

runCmd: settings set symbols.enable-external-lookup false output:

Hide Details

runCmd: settings set plugin.process.gdb-remote.packet-timeout 60 output:

Hide Details

runCmd: settings set symbols.clang-modules-cache-path "/Users/buildslave/jenkins/workspace/lldb-cmake-sanitized/lldb-build/tools/lldb/lldb-test-build.noindex/module-cache-lldb" output:

Hide Details

runCmd: settings set use-color false output:

Hide Details

FAIL: LLDB (/Users/buildslave/jenkins/workspace/lldb-cmake-sanitized/host-compiler/bin/clang-10-x86_64) :: test_dwarf (lldbsuite.test.lldbtest.TestGModules) <bound method SBProcess.Kill of <lldb.SBProcess; proxy of <Swig Object of type 'lldb::SBProcess *' at 0x11efbc540> >>: success

Hide Details

UNSUPPORTED: LLDB (/Users/buildslave/jenkins/workspace/lldb-cmake-sanitized/host-compiler/bin/clang-10-x86_64) :: test_dwo (lldbsuite.test.lldbtest.TestGModules) (test case does not fall in any category of interest for this run) runCmd: settings set symbols.enable-external-lookup false output:

Hide Details

runCmd: settings set plugin.process.gdb-remote.packet-timeout 60 output:

Hide Details

runCmd: settings set symbols.clang-modules-cache-path "/Users/buildslave/jenkins/workspace/lldb-cmake-sanitized/lldb-build/tools/lldb/lldb-test-build.noindex/module-cache-lldb" output:

Hide Details

runCmd: settings set use-color false output:

Hide Details

FAIL: LLDB (/Users/buildslave/jenkins/workspace/lldb-cmake-sanitized/host-compiler/bin/clang-10-x86_64) :: test_gmodules (lldbsuite.test.lldbtest.TestGModules) <bound method SBProcess.Kill of <lldb.SBProcess; proxy of <Swig Object of type 'lldb::SBProcess *' at 0x11f17acf0> >>: success

Hide Details

Restore dir to: /Users/buildslave/jenkins/workspace/lldb-cmake-sanitized/lldb-build/tools/lldb/lit ====================================================================== FAIL: test_dsym (lldbsuite.test.lldbtest.TestGModules) ---------------------------------------------------------------------- Traceback (most recent call last): File "/Users/buildslave/jenkins/workspace/lldb-cmake-sanitized/llvm-project/lldb/packages/Python/lldbsuite/test/lldbtest.py", line 1748, in test_method return attrvalue(self) File "/Users/buildslave/jenkins/workspace/lldb-cmake-sanitized/llvm-project/lldb/packages/Python/lldbsuite/test/decorators.py", line 111, in wrapper func(*args, **kwargs) File "/Users/buildslave/jenkins/workspace/lldb-cmake-sanitized/llvm-project/lldb/packages/Python/lldbsuite/test/lldbinline.py", line 124, in _test self.do_test() File "/Users/buildslave/jenkins/workspace/lldb-cmake-sanitized/llvm-project/lldb/packages/Python/lldbsuite/test/lldbinline.py", line 151, in do_test "inline test did not hit a single breakpoint") AssertionError: False is not True : inline test did not hit a single breakpoint Config=x86_64-/Users/buildslave/jenkins/workspace/lldb-cmake-sanitized/host-compiler/bin/clang-10 ====================================================================== FAIL: test_dwarf (lldbsuite.test.lldbtest.TestGModules) ---------------------------------------------------------------------- Traceback (most recent call last): File "/Users/buildslave/jenkins/workspace/lldb-cmake-sanitized/llvm-project/lldb/packages/Python/lldbsuite/test/lldbtest.py", line 1748, in test_method return attrvalue(self) File "/Users/buildslave/jenkins/workspace/lldb-cmake-sanitized/llvm-project/lldb/packages/Python/lldbsuite/test/decorators.py", line 111, in wrapper func(*args, **kwargs) File "/Users/buildslave/jenkins/workspace/lldb-cmake-sanitized/llvm-project/lldb/packages/Python/lldbsuite/test/lldbinline.py", line 124, in _test self.do_test() File "/Users/buildslave/jenkins/workspace/lldb-cmake-sanitized/llvm-project/lldb/packages/Python/lldbsuite/test/lldbinline.py", line 151, in do_test "inline test did not hit a single breakpoint") AssertionError: False is not True : inline test did not hit a single breakpoint Config=x86_64-/Users/buildslave/jenkins/workspace/lldb-cmake-sanitized/host-compiler/bin/clang-10 ====================================================================== FAIL: test_gmodules (lldbsuite.test.lldbtest.TestGModules) ---------------------------------------------------------------------- Traceback (most recent call last): File "/Users/buildslave/jenkins/workspace/lldb-cmake-sanitized/llvm-project/lldb/packages/Python/lldbsuite/test/lldbtest.py", line 1748, in test_method return attrvalue(self) File "/Users/buildslave/jenkins/workspace/lldb-cmake-sanitized/llvm-project/lldb/packages/Python/lldbsuite/test/decorators.py", line 111, in wrapper func(*args, **kwargs) File "/Users/buildslave/jenkins/workspace/lldb-cmake-sanitized/llvm-project/lldb/packages/Python/lldbsuite/test/lldbinline.py", line 124, in _test self.do_test() File "/Users/buildslave/jenkins/workspace/lldb-cmake-sanitized/llvm-project/lldb/packages/Python/lldbsuite/test/lldbinline.py", line 151, in do_test "inline test did not hit a single breakpoint") AssertionError: False is not True : inline test did not hit a single breakpoint Config=x86_64-/Users/buildslave/jenkins/workspace/lldb-cmake-sanitized/host-compiler/bin/clang-10 ---------------------------------------------------------------------- Ran 4 tests in 3.898s

Hide Details

RESULT: FAILED (0 passes, 3 failures, 0 errors, 1 skipped, 0 expected failures, 0 unexpected successes)

Hide Details

******************** PASS: lldb-Unit :: Utility/./UtilityTests/OptionsWithRawTest.EmptyInput (1671 of 1727) FAIL: lldb-Suite :: functionalities/data-formatter/data-formatter-cpp/TestDataFormatterCpp.py (1672 of 1727) ******************** TEST 'lldb-Suite :: functionalities/data-formatter/data-formatter-cpp/TestDataFormatterCpp.py' FAILED ******************** lldb version 10.0.99 (http://labmaster3.local/git/llvm-project.git revision 466fb68fce10d34963c2fd651de32bd3a4ddcd1f) clang revision a34f13f2bab3bb3a25ce999defb616558cbc3f4f llvm revision a34f13f2bab3bb3a25ce999defb616558cbc3f4f LLDB library dir: /Users/buildslave/jenkins/workspace/lldb-cmake-sanitized/lldb-build/bin LLDB import library dir: /Users/buildslave/jenkins/workspace/lldb-cmake-sanitized/lldb-build/bin libstdcxx tests will not be run because: Don't know how to build with libstdcxx on macosx Skipping following debug info categories: ['dwo']

Hide Details

Session logs for test failures/errors/unexpected successes will go into directory '/Users/buildslave/jenkins/workspace/lldb-cmake-sanitized/test/logs' Command invoked: /Users/buildslave/jenkins/workspace/lldb-cmake-sanitized/llvm-project/lldb/test/dotest.py --arch=x86_64 -s /Users/buildslave/jenkins/workspace/lldb-cmake-sanitized/lldb-build/lldb-test-traces -S nm -u CXXFLAGS -u CFLAGS --executable /Users/buildslave/jenkins/workspace/lldb-cmake-sanitized/lldb-build/./bin/lldb --dsymutil /Users/buildslave/jenkins/workspace/lldb-cmake-sanitized/lldb-build/./bin/dsymutil --filecheck /Users/buildslave/jenkins/workspace/lldb-cmake-sanitized/lldb-build/./bin/FileCheck -C /Users/buildslave/jenkins/workspace/lldb-cmake-sanitized/host-compiler/bin/clang --codesign-identity lldb_codesign --server /Users/buildslave/jenkins/workspace/lldb-cmake-sanitized/lldb-build/./bin/debugserver --arch x86_64 --build-dir /Users/buildslave/jenkins/workspace/lldb-cmake-sanitized/lldb-build/lldb-test-build.noindex -s=/Users/buildslave/jenkins/workspace/lldb-cmake-sanitized/test/logs -t --env TERM=vt100 --env LLVM_LIBS_DIR=/Users/buildslave/jenkins/workspace/lldb-cmake-sanitized/lldb-build/./lib --build-dir /Users/buildslave/jenkins/workspace/lldb-cmake-sanitized/lldb-build/tools/lldb/lldb-test-build.noindex --module-cache-dir /Users/buildslave/jenkins/workspace/lldb-cmake-sanitized/lldb-build/tools/lldb/lldb-test-build.noindex/module-cache-lldb /Users/buildslave/jenkins/workspace/lldb-cmake-sanitized/llvm-project/lldb/packages/Python/lldbsuite/test/functionalities/data-formatter/data-formatter-cpp -p TestDataFormatterCpp.py Change dir to: /Users/buildslave/jenkins/workspace/lldb-cmake-sanitized/llvm-project/lldb/packages/Python/lldbsuite/test/functionalities/data-formatter/data-formatter-cpp runCmd: settings set symbols.enable-external-lookup false output:

Hide Details

runCmd: settings set plugin.process.gdb-remote.packet-timeout 60 output:

Hide Details

runCmd: settings set symbols.clang-modules-cache-path "/Users/buildslave/jenkins/workspace/lldb-cmake-sanitized/lldb-build/tools/lldb/lldb-test-build.noindex/module-cache-lldb" output:

Hide Details

runCmd: settings set use-color false output:

Hide Details

runCmd: file /Users/buildslave/jenkins/workspace/lldb-cmake-sanitized/lldb-build/tools/lldb/lldb-test-build.noindex/functionalities/data-formatter/data-formatter-cpp/TestDataFormatterCpp.test_with_run_command_dsym/a.out output: Current executable set to '/Users/buildslave/jenkins/workspace/lldb-cmake-sanitized/lldb-build/tools/lldb/lldb-test-build.noindex/functionalities/data-formatter/data-formatter-cpp/TestDataFormatterCpp.test_with_run_command_dsym/a.out' (x86_64).

Hide Details

Hide Details

runCmd: breakpoint set -f "main.cpp" -l 118 output: Breakpoint 1: where = a.out`main + 798 at main.cpp:118:5, address = 0x0000000100000cae

Hide Details

Hide Details

Expecting pattern: ^Breakpoint (?P<bpno>[0-9]+): (?P<num_locations>[0-9]+) locations\.$ Not matched

Hide Details

Expecting pattern: ^Breakpoint (?P<bpno>[0-9]+): (?P<num_locations>no) locations \(pending\)\. Not matched

Hide Details

Expecting pattern: ^Breakpoint (?P<bpno>[0-9]+): where = (?P<module>.*)`(?P<symbol>[+\-]{0,1}[^+]+)( \+ (?P<offset>[0-9]+)){0,1}( \[inlined\] (?P<inline_symbol>.*)){0,1} at (?P<file>[^:]+):(?P<line_no>[0-9]+)(?P<column>(:[0-9]+)?), address = (?P<address>0x[0-9a-fA-F]+)$ Matched

Hide Details

runCmd: run runCmd failed! error: process exited with status -1 (Error 1)

Hide Details

Hide Details

Command 'run' failed!

Hide Details

FAIL: LLDB (/Users/buildslave/jenkins/workspace/lldb-cmake-sanitized/host-compiler/bin/clang-10-x86_64) :: test_with_run_command_dsym (TestDataFormatterCpp.CppDataFormatterTestCase) <bound method SBProcess.Kill of <lldb.SBProcess; proxy of <Swig Object of type 'lldb::SBProcess *' at 0x10ee98180> >>: success

Hide Details

runCmd: settings set symbols.enable-external-lookup false output:

Hide Details

runCmd: settings set plugin.process.gdb-remote.packet-timeout 60 output:

Hide Details

runCmd: settings set symbols.clang-modules-cache-path "/Users/buildslave/jenkins/workspace/lldb-cmake-sanitized/lldb-build/tools/lldb/lldb-test-build.noindex/module-cache-lldb" output:

Hide Details

runCmd: settings set use-color false output:

Hide Details

FAIL: LLDB (/Users/buildslave/jenkins/workspace/lldb-cmake-sanitized/host-compiler/bin/clang-10-x86_64) :: test_with_run_command_dwarf (TestDataFormatterCpp.CppDataFormatterTestCase) UNSUPPORTED: LLDB (/Users/buildslave/jenkins/workspace/lldb-cmake-sanitized/host-compiler/bin/clang-10-x86_64) :: test_with_run_command_dwo (TestDataFormatterCpp.CppDataFormatterTestCase) (test case does not fall in any category of interest for this run) runCmd: settings set symbols.enable-external-lookup false output:

Hide Details

runCmd: settings set plugin.process.gdb-remote.packet-timeout 60 output:

Hide Details

runCmd: settings set symbols.clang-modules-cache-path "/Users/buildslave/jenkins/workspace/lldb-cmake-sanitized/lldb-build/tools/lldb/lldb-test-build.noindex/module-cache-lldb" output:

Hide Details

runCmd: settings set use-color false output:

Hide Details

UNSUPPORTED: LLDB (/Users/buildslave/jenkins/workspace/lldb-cmake-sanitized/host-compiler/bin/clang-10-x86_64) :: test_with_run_command_gmodules (TestDataFormatterCpp.CppDataFormatterTestCase) (skipping due to the following parameter(s): debug info format [https://bugs.llvm.org/show_bug.cgi?id=36048]) Restore dir to: /Users/buildslave/jenkins/workspace/lldb-cmake-sanitized/lldb-build/tools/lldb/lit ====================================================================== ERROR: test_with_run_command_dwarf (TestDataFormatterCpp.CppDataFormatterTestCase) Test that that file and class static variables display correctly. ---------------------------------------------------------------------- Error when building test subject.

Hide Details

Build Command: make VPATH=/Users/buildslave/jenkins/workspace/lldb-cmake-sanitized/llvm-project/lldb/packages/Python/lldbsuite/test/functionalities/data-formatter/data-formatter-cpp -C /Users/buildslave/jenkins/workspace/lldb-cmake-sanitized/lldb-build/tools/lldb/lldb-test-build.noindex/functionalities/data-formatter/data-formatter-cpp/TestDataFormatterCpp.test_with_run_command_dwarf -I /Users/buildslave/jenkins/workspace/lldb-cmake-sanitized/llvm-project/lldb/packages/Python/lldbsuite/test/functionalities/data-formatter/data-formatter-cpp -I /Users/buildslave/jenkins/workspace/lldb-cmake-sanitized/llvm-project/lldb/packages/Python/lldbsuite/test/make -f /Users/buildslave/jenkins/workspace/lldb-cmake-sanitized/llvm-project/lldb/packages/Python/lldbsuite/test/functionalities/data-formatter/data-formatter-cpp/Makefile MAKE_DSYM=NO ARCH=x86_64 CC="/Users/buildslave/jenkins/workspace/lldb-cmake-sanitized/host-compiler/bin/clang-10"

Hide Details

Build Command Output: make: *** [main.o] Killed: 9

Hide Details

Test Directory: /Users/buildslave/jenkins/workspace/lldb-cmake-sanitized/llvm-project/lldb/packages/Python/lldbsuite/test/functionalities/data-formatter/data-formatter-cpp ====================================================================== FAIL: test_with_run_command_dsym (TestDataFormatterCpp.CppDataFormatterTestCase) Test that that file and class static variables display correctly. ---------------------------------------------------------------------- Traceback (most recent call last): File "/Users/buildslave/jenkins/workspace/lldb-cmake-sanitized/llvm-project/lldb/packages/Python/lldbsuite/test/lldbtest.py", line 1748, in test_method return attrvalue(self) File "/Users/buildslave/jenkins/workspace/lldb-cmake-sanitized/llvm-project/lldb/packages/Python/lldbsuite/test/decorators.py", line 141, in wrapper func(*args, **kwargs) File "/Users/buildslave/jenkins/workspace/lldb-cmake-sanitized/llvm-project/lldb/packages/Python/lldbsuite/test/functionalities/data-formatter/data-formatter-cpp/TestDataFormatterCpp.py", line 34, in test_with_run_command self.runCmd("run", RUN_SUCCEEDED) File "/Users/buildslave/jenkins/workspace/lldb-cmake-sanitized/llvm-project/lldb/packages/Python/lldbsuite/test/lldbtest.py", line 2068, in runCmd msg if (msg) else CMD_MSG(cmd)) AssertionError: False is not True : Process is launched successfully Error output: error: process exited with status -1 (Error 1)

Hide Details

Config=x86_64-/Users/buildslave/jenkins/workspace/lldb-cmake-sanitized/host-compiler/bin/clang-10 ---------------------------------------------------------------------- Ran 4 tests in 3.343s

Hide Details

RESULT: FAILED (0 passes, 1 failures, 1 errors, 2 skipped, 0 expected failures, 0 unexpected successes)

Hide Details

******************** PASS: LLDB :: BuildScript/modes.test (1673 of 1727) PASS: lldb-Unit :: Process/minidump/./LLDBMinidumpTests/MinidumpParserTest.GetThreadContext_x86_64 (1674 of 1727) PASS: lldb-Unit :: Utility/./UtilityTests/ArgsTest.StringListConstructor (1675 of 1727) PASS: lldb-Suite :: functionalities/postmortem/wow64_minidump/TestWow64MiniDump.py (1676 of 1727) FAIL: lldb-Suite :: lang/cpp/call-function/TestCallCPPFunction.py (1677 of 1727) ******************** TEST 'lldb-Suite :: lang/cpp/call-function/TestCallCPPFunction.py' FAILED ******************** lldb version 10.0.99 (http://labmaster3.local/git/llvm-project.git revision 466fb68fce10d34963c2fd651de32bd3a4ddcd1f) clang revision a34f13f2bab3bb3a25ce999defb616558cbc3f4f llvm revision a34f13f2bab3bb3a25ce999defb616558cbc3f4f LLDB library dir: /Users/buildslave/jenkins/workspace/lldb-cmake-sanitized/lldb-build/bin LLDB import library dir: /Users/buildslave/jenkins/workspace/lldb-cmake-sanitized/lldb-build/bin libstdcxx tests will not be run because: Don't know how to build with libstdcxx on macosx Skipping following debug info categories: ['dwo']

Hide Details

Session logs for test failures/errors/unexpected successes will go into directory '/Users/buildslave/jenkins/workspace/lldb-cmake-sanitized/test/logs' Command invoked: /Users/buildslave/jenkins/workspace/lldb-cmake-sanitized/llvm-project/lldb/test/dotest.py --arch=x86_64 -s /Users/buildslave/jenkins/workspace/lldb-cmake-sanitized/lldb-build/lldb-test-traces -S nm -u CXXFLAGS -u CFLAGS --executable /Users/buildslave/jenkins/workspace/lldb-cmake-sanitized/lldb-build/./bin/lldb --dsymutil /Users/buildslave/jenkins/workspace/lldb-cmake-sanitized/lldb-build/./bin/dsymutil --filecheck /Users/buildslave/jenkins/workspace/lldb-cmake-sanitized/lldb-build/./bin/FileCheck -C /Users/buildslave/jenkins/workspace/lldb-cmake-sanitized/host-compiler/bin/clang --codesign-identity lldb_codesign --server /Users/buildslave/jenkins/workspace/lldb-cmake-sanitized/lldb-build/./bin/debugserver --arch x86_64 --build-dir /Users/buildslave/jenkins/workspace/lldb-cmake-sanitized/lldb-build/lldb-test-build.noindex -s=/Users/buildslave/jenkins/workspace/lldb-cmake-sanitized/test/logs -t --env TERM=vt100 --env LLVM_LIBS_DIR=/Users/buildslave/jenkins/workspace/lldb-cmake-sanitized/lldb-build/./lib --build-dir /Users/buildslave/jenkins/workspace/lldb-cmake-sanitized/lldb-build/tools/lldb/lldb-test-build.noindex --module-cache-dir /Users/buildslave/jenkins/workspace/lldb-cmake-sanitized/lldb-build/tools/lldb/lldb-test-build.noindex/module-cache-lldb /Users/buildslave/jenkins/workspace/lldb-cmake-sanitized/llvm-project/lldb/packages/Python/lldbsuite/test/lang/cpp/call-function -p TestCallCPPFunction.py Change dir to: /Users/buildslave/jenkins/workspace/lldb-cmake-sanitized/llvm-project/lldb/packages/Python/lldbsuite/test/lang/cpp/call-function runCmd: settings set symbols.enable-external-lookup false output:

Hide Details

runCmd: settings set plugin.process.gdb-remote.packet-timeout 60 output:

Hide Details

runCmd: settings set symbols.clang-modules-cache-path "/Users/buildslave/jenkins/workspace/lldb-cmake-sanitized/lldb-build/tools/lldb/lldb-test-build.noindex/module-cache-lldb" output:

Hide Details

runCmd: settings set use-color false output:

Hide Details

runCmd: file /Users/buildslave/jenkins/workspace/lldb-cmake-sanitized/lldb-build/tools/lldb/lldb-test-build.noindex/lang/cpp/call-function/TestCallCPPFunction.test_with_run_command_dsym/a.out output: Current executable set to '/Users/buildslave/jenkins/workspace/lldb-cmake-sanitized/lldb-build/tools/lldb/lldb-test-build.noindex/lang/cpp/call-function/TestCallCPPFunction.test_with_run_command_dsym/a.out' (x86_64).

Hide Details

Hide Details

runCmd: breakpoint set -f "main.cpp" -l 10 output: Breakpoint 1: where = a.out`main + 8 at main.cpp:10:20, address = 0x0000000100000f68

Hide Details

Hide Details

Expecting pattern: ^Breakpoint (?P<bpno>[0-9]+): (?P<num_locations>[0-9]+) locations\.$ Not matched

Hide Details

Expecting pattern: ^Breakpoint (?P<bpno>[0-9]+): (?P<num_locations>no) locations \(pending\)\. Not matched

Hide Details

Expecting pattern: ^Breakpoint (?P<bpno>[0-9]+): where = (?P<module>.*)`(?P<symbol>[+\-]{0,1}[^+]+)( \+ (?P<offset>[0-9]+)){0,1}( \[inlined\] (?P<inline_symbol>.*)){0,1} at (?P<file>[^:]+):(?P<line_no>[0-9]+)(?P<column>(:[0-9]+)?), address = (?P<address>0x[0-9a-fA-F]+)$ Matched

Hide Details

runCmd: process launch runCmd failed! error: process exited with status -1 (Error 1)

Hide Details

Hide Details

Command 'process launch' failed!

Hide Details

FAIL: LLDB (/Users/buildslave/jenkins/workspace/lldb-cmake-sanitized/host-compiler/bin/clang-10-x86_64) :: test_with_run_command_dsym (TestCallCPPFunction.CallCPPFunctionTestCase) <bound method SBProcess.Kill of <lldb.SBProcess; proxy of <Swig Object of type 'lldb::SBProcess *' at 0x1059cacf0> >>: success

Hide Details

runCmd: settings set symbols.enable-external-lookup false output:

Hide Details

runCmd: settings set plugin.process.gdb-remote.packet-timeout 60 output:

Hide Details

runCmd: settings set symbols.clang-modules-cache-path "/Users/buildslave/jenkins/workspace/lldb-cmake-sanitized/lldb-build/tools/lldb/lldb-test-build.noindex/module-cache-lldb" output:

Hide Details

runCmd: settings set use-color false output:

Hide Details

runCmd: file /Users/buildslave/jenkins/workspace/lldb-cmake-sanitized/lldb-build/tools/lldb/lldb-test-build.noindex/lang/cpp/call-function/TestCallCPPFunction.test_with_run_command_dwarf/a.out output: Current executable set to '/Users/buildslave/jenkins/workspace/lldb-cmake-sanitized/lldb-build/tools/lldb/lldb-test-build.noindex/lang/cpp/call-function/TestCallCPPFunction.test_with_run_command_dwarf/a.out' (x86_64).

Hide Details

Hide Details

runCmd: breakpoint set -f "main.cpp" -l 10 output: Breakpoint 1: where = a.out`main + 8 at main.cpp:10:20, address = 0x0000000100000f68

Hide Details

Hide Details

Expecting pattern: ^Breakpoint (?P<bpno>[0-9]+): (?P<num_locations>[0-9]+) locations\.$ Not matched

Hide Details

Expecting pattern: ^Breakpoint (?P<bpno>[0-9]+): (?P<num_locations>no) locations \(pending\)\. Not matched

Hide Details

Expecting pattern: ^Breakpoint (?P<bpno>[0-9]+): where = (?P<module>.*)`(?P<symbol>[+\-]{0,1}[^+]+)( \+ (?P<offset>[0-9]+)){0,1}( \[inlined\] (?P<inline_symbol>.*)){0,1} at (?P<file>[^:]+):(?P<line_no>[0-9]+)(?P<column>(:[0-9]+)?), address = (?P<address>0x[0-9a-fA-F]+)$ Matched

Hide Details

runCmd: process launch runCmd failed! error: process exited with status -1 (Error 1)

Hide Details

Hide Details

Command 'process launch' failed!

Hide Details

FAIL: LLDB (/Users/buildslave/jenkins/workspace/lldb-cmake-sanitized/host-compiler/bin/clang-10-x86_64) :: test_with_run_command_dwarf (TestCallCPPFunction.CallCPPFunctionTestCase) <bound method SBProcess.Kill of <lldb.SBProcess; proxy of <Swig Object of type 'lldb::SBProcess *' at 0x1059cab70> >>: success

Hide Details

UNSUPPORTED: LLDB (/Users/buildslave/jenkins/workspace/lldb-cmake-sanitized/host-compiler/bin/clang-10-x86_64) :: test_with_run_command_dwo (TestCallCPPFunction.CallCPPFunctionTestCase) (test case does not fall in any category of interest for this run) runCmd: settings set symbols.enable-external-lookup false output:

Hide Details

runCmd: settings set plugin.process.gdb-remote.packet-timeout 60 output:

Hide Details

runCmd: settings set symbols.clang-modules-cache-path "/Users/buildslave/jenkins/workspace/lldb-cmake-sanitized/lldb-build/tools/lldb/lldb-test-build.noindex/module-cache-lldb" output:

Hide Details

runCmd: settings set use-color false output:

Hide Details

runCmd: file /Users/buildslave/jenkins/workspace/lldb-cmake-sanitized/lldb-build/tools/lldb/lldb-test-build.noindex/lang/cpp/call-function/TestCallCPPFunction.test_with_run_command_gmodules/a.out output: Current executable set to '/Users/buildslave/jenkins/workspace/lldb-cmake-sanitized/lldb-build/tools/lldb/lldb-test-build.noindex/lang/cpp/call-function/TestCallCPPFunction.test_with_run_command_gmodules/a.out' (x86_64).

Hide Details

Hide Details

runCmd: breakpoint set -f "main.cpp" -l 10 output: Breakpoint 1: where = a.out`main + 8 at main.cpp:10:20, address = 0x0000000100000f68

Hide Details

Hide Details

Expecting pattern: ^Breakpoint (?P<bpno>[0-9]+): (?P<num_locations>[0-9]+) locations\.$ Not matched

Hide Details

Expecting pattern: ^Breakpoint (?P<bpno>[0-9]+): (?P<num_locations>no) locations \(pending\)\. Not matched

Hide Details

Expecting pattern: ^Breakpoint (?P<bpno>[0-9]+): where = (?P<module>.*)`(?P<symbol>[+\-]{0,1}[^+]+)( \+ (?P<offset>[0-9]+)){0,1}( \[inlined\] (?P<inline_symbol>.*)){0,1} at (?P<file>[^:]+):(?P<line_no>[0-9]+)(?P<column>(:[0-9]+)?), address = (?P<address>0x[0-9a-fA-F]+)$ Matched

Hide Details

runCmd: process launch runCmd failed! error: process exited with status -1 (Error 1)

Hide Details

Hide Details

Command 'process launch' failed!

Hide Details

FAIL: LLDB (/Users/buildslave/jenkins/workspace/lldb-cmake-sanitized/host-compiler/bin/clang-10-x86_64) :: test_with_run_command_gmodules (TestCallCPPFunction.CallCPPFunctionTestCase) <bound method SBProcess.Kill of <lldb.SBProcess; proxy of <Swig Object of type 'lldb::SBProcess *' at 0x1059cad20> >>: success

Hide Details

Restore dir to: /Users/buildslave/jenkins/workspace/lldb-cmake-sanitized/lldb-build/tools/lldb/lit ====================================================================== FAIL: test_with_run_command_dsym (TestCallCPPFunction.CallCPPFunctionTestCase) Test calling a function by basename ---------------------------------------------------------------------- Traceback (most recent call last): File "/Users/buildslave/jenkins/workspace/lldb-cmake-sanitized/llvm-project/lldb/packages/Python/lldbsuite/test/lldbtest.py", line 1748, in test_method return attrvalue(self) File "/Users/buildslave/jenkins/workspace/lldb-cmake-sanitized/llvm-project/lldb/packages/Python/lldbsuite/test/lang/cpp/call-function/TestCallCPPFunction.py", line 27, in test_with_run_command self.runCmd("process launch", RUN_SUCCEEDED) File "/Users/buildslave/jenkins/workspace/lldb-cmake-sanitized/llvm-project/lldb/packages/Python/lldbsuite/test/lldbtest.py", line 2068, in runCmd msg if (msg) else CMD_MSG(cmd)) AssertionError: False is not True : Process is launched successfully Error output: error: process exited with status -1 (Error 1)

Hide Details

Config=x86_64-/Users/buildslave/jenkins/workspace/lldb-cmake-sanitized/host-compiler/bin/clang-10 ====================================================================== FAIL: test_with_run_command_dwarf (TestCallCPPFunction.CallCPPFunctionTestCase) Test calling a function by basename ---------------------------------------------------------------------- Traceback (most recent call last): File "/Users/buildslave/jenkins/workspace/lldb-cmake-sanitized/llvm-project/lldb/packages/Python/lldbsuite/test/lldbtest.py", line 1748, in test_method return attrvalue(self) File "/Users/buildslave/jenkins/workspace/lldb-cmake-sanitized/llvm-project/lldb/packages/Python/lldbsuite/test/lang/cpp/call-function/TestCallCPPFunction.py", line 27, in test_with_run_command self.runCmd("process launch", RUN_SUCCEEDED) File "/Users/buildslave/jenkins/workspace/lldb-cmake-sanitized/llvm-project/lldb/packages/Python/lldbsuite/test/lldbtest.py", line 2068, in runCmd msg if (msg) else CMD_MSG(cmd)) AssertionError: False is not True : Process is launched successfully Error output: error: process exited with status -1 (Error 1)

Hide Details

Config=x86_64-/Users/buildslave/jenkins/workspace/lldb-cmake-sanitized/host-compiler/bin/clang-10 ====================================================================== FAIL: test_with_run_command_gmodules (TestCallCPPFunction.CallCPPFunctionTestCase) Test calling a function by basename ---------------------------------------------------------------------- Traceback (most recent call last): File "/Users/buildslave/jenkins/workspace/lldb-cmake-sanitized/llvm-project/lldb/packages/Python/lldbsuite/test/lldbtest.py", line 1748, in test_method return attrvalue(self) File "/Users/buildslave/jenkins/workspace/lldb-cmake-sanitized/llvm-project/lldb/packages/Python/lldbsuite/test/lang/cpp/call-function/TestCallCPPFunction.py", line 27, in test_with_run_command self.runCmd("process launch", RUN_SUCCEEDED) File "/Users/buildslave/jenkins/workspace/lldb-cmake-sanitized/llvm-project/lldb/packages/Python/lldbsuite/test/lldbtest.py", line 2068, in runCmd msg if (msg) else CMD_MSG(cmd)) AssertionError: False is not True : Process is launched successfully Error output: error: process exited with status -1 (Error 1)

Hide Details

Config=x86_64-/Users/buildslave/jenkins/workspace/lldb-cmake-sanitized/host-compiler/bin/clang-10 ---------------------------------------------------------------------- Ran 4 tests in 7.085s

Hide Details

RESULT: FAILED (0 passes, 3 failures, 0 errors, 1 skipped, 0 expected failures, 0 unexpected successes)

Hide Details

******************** PASS: lldb-Unit :: Utility/./UtilityTests/AnsiTerminal.Basic (1678 of 1727) PASS: lldb-Unit :: Utility/./UtilityTests/StringListTest.GetMaxStringLengthEmpty (1679 of 1727) PASS: lldb-Unit :: Interpreter/./InterpreterTests/CompletionTest.DirCompletionUsername (1680 of 1727) PASS: lldb-Unit :: Utility/./UtilityTests/NameMatchesTest.RegularExpression (1681 of 1727) PASS: lldb-Unit :: SymbolFile/DWARF/./SymbolFileDWARFTests/SymbolFileDWARFTests.TestAbbrevOrder1Start5 (1682 of 1727) PASS: lldb-Unit :: Expression/./ExpressionTests/DiagnosticManagerTest.PutStringMultiple (1683 of 1727) FAIL: lldb-Suite :: lang/cpp/class_types/TestClassTypesDisassembly.py (1684 of 1727) ******************** TEST 'lldb-Suite :: lang/cpp/class_types/TestClassTypesDisassembly.py' FAILED ******************** lldb version 10.0.99 (http://labmaster3.local/git/llvm-project.git revision 466fb68fce10d34963c2fd651de32bd3a4ddcd1f) clang revision a34f13f2bab3bb3a25ce999defb616558cbc3f4f llvm revision a34f13f2bab3bb3a25ce999defb616558cbc3f4f LLDB library dir: /Users/buildslave/jenkins/workspace/lldb-cmake-sanitized/lldb-build/bin LLDB import library dir: /Users/buildslave/jenkins/workspace/lldb-cmake-sanitized/lldb-build/bin libstdcxx tests will not be run because: Don't know how to build with libstdcxx on macosx Skipping following debug info categories: ['dwo']

Hide Details

Session logs for test failures/errors/unexpected successes will go into directory '/Users/buildslave/jenkins/workspace/lldb-cmake-sanitized/test/logs' Command invoked: /Users/buildslave/jenkins/workspace/lldb-cmake-sanitized/llvm-project/lldb/test/dotest.py --arch=x86_64 -s /Users/buildslave/jenkins/workspace/lldb-cmake-sanitized/lldb-build/lldb-test-traces -S nm -u CXXFLAGS -u CFLAGS --executable /Users/buildslave/jenkins/workspace/lldb-cmake-sanitized/lldb-build/./bin/lldb --dsymutil /Users/buildslave/jenkins/workspace/lldb-cmake-sanitized/lldb-build/./bin/dsymutil --filecheck /Users/buildslave/jenkins/workspace/lldb-cmake-sanitized/lldb-build/./bin/FileCheck -C /Users/buildslave/jenkins/workspace/lldb-cmake-sanitized/host-compiler/bin/clang --codesign-identity lldb_codesign --server /Users/buildslave/jenkins/workspace/lldb-cmake-sanitized/lldb-build/./bin/debugserver --arch x86_64 --build-dir /Users/buildslave/jenkins/workspace/lldb-cmake-sanitized/lldb-build/lldb-test-build.noindex -s=/Users/buildslave/jenkins/workspace/lldb-cmake-sanitized/test/logs -t --env TERM=vt100 --env LLVM_LIBS_DIR=/Users/buildslave/jenkins/workspace/lldb-cmake-sanitized/lldb-build/./lib --build-dir /Users/buildslave/jenkins/workspace/lldb-cmake-sanitized/lldb-build/tools/lldb/lldb-test-build.noindex --module-cache-dir /Users/buildslave/jenkins/workspace/lldb-cmake-sanitized/lldb-build/tools/lldb/lldb-test-build.noindex/module-cache-lldb /Users/buildslave/jenkins/workspace/lldb-cmake-sanitized/llvm-project/lldb/packages/Python/lldbsuite/test/lang/cpp/class_types -p TestClassTypesDisassembly.py Change dir to: /Users/buildslave/jenkins/workspace/lldb-cmake-sanitized/llvm-project/lldb/packages/Python/lldbsuite/test/lang/cpp/class_types runCmd: settings set symbols.enable-external-lookup false output:

Hide Details

runCmd: settings set plugin.process.gdb-remote.packet-timeout 60 output:

Hide Details

runCmd: settings set symbols.clang-modules-cache-path "/Users/buildslave/jenkins/workspace/lldb-cmake-sanitized/lldb-build/tools/lldb/lldb-test-build.noindex/module-cache-lldb" output:

Hide Details

runCmd: settings set use-color false output:

Hide Details

runCmd: file /Users/buildslave/jenkins/workspace/lldb-cmake-sanitized/lldb-build/tools/lldb/lldb-test-build.noindex/lang/cpp/class_types/TestClassTypesDisassembly.test_and_python_api_dsym/a.out output: Current executable set to '/Users/buildslave/jenkins/workspace/lldb-cmake-sanitized/lldb-build/tools/lldb/lldb-test-build.noindex/lang/cpp/class_types/TestClassTypesDisassembly.test_and_python_api_dsym/a.out' (x86_64).

Hide Details

Hide Details

runCmd: breakpoint set -f "main.cpp" -l 92 output: Breakpoint 1: where = a.out`C::C(int, int, int) + 53 at main.cpp:92:52, address = 0x0000000100000e45

Hide Details

Hide Details

Expecting pattern: ^Breakpoint (?P<bpno>[0-9]+): (?P<num_locations>[0-9]+) locations\.$ Not matched

Hide Details

Expecting pattern: ^Breakpoint (?P<bpno>[0-9]+): (?P<num_locations>no) locations \(pending\)\. Not matched

Hide Details

Expecting pattern: ^Breakpoint (?P<bpno>[0-9]+): where = (?P<module>.*)`(?P<symbol>[+\-]{0,1}[^+]+)( \+ (?P<offset>[0-9]+)){0,1}( \[inlined\] (?P<inline_symbol>.*)){0,1} at (?P<file>[^:]+):(?P<line_no>[0-9]+)(?P<column>(:[0-9]+)?), address = (?P<address>0x[0-9a-fA-F]+)$ Matched

Hide Details

runCmd: run runCmd failed! error: process exited with status -1 (Error 1)

Hide Details

Hide Details

Command 'run' failed!

Hide Details

FAIL: LLDB (/Users/buildslave/jenkins/workspace/lldb-cmake-sanitized/host-compiler/bin/clang-10-x86_64) :: test_and_python_api_dsym (TestClassTypesDisassembly.IterateFrameAndDisassembleTestCase) <bound method SBProcess.Kill of <lldb.SBProcess; proxy of <Swig Object of type 'lldb::SBProcess *' at 0x10f338de0> >>: success

Hide Details

runCmd: settings set symbols.enable-external-lookup false output:

Hide Details

runCmd: settings set plugin.process.gdb-remote.packet-timeout 60 output:

Hide Details

runCmd: settings set symbols.clang-modules-cache-path "/Users/buildslave/jenkins/workspace/lldb-cmake-sanitized/lldb-build/tools/lldb/lldb-test-build.noindex/module-cache-lldb" output:

Hide Details

runCmd: settings set use-color false output:

Hide Details

runCmd: file /Users/buildslave/jenkins/workspace/lldb-cmake-sanitized/lldb-build/tools/lldb/lldb-test-build.noindex/lang/cpp/class_types/TestClassTypesDisassembly.test_and_python_api_dwarf/a.out output: Current executable set to '/Users/buildslave/jenkins/workspace/lldb-cmake-sanitized/lldb-build/tools/lldb/lldb-test-build.noindex/lang/cpp/class_types/TestClassTypesDisassembly.test_and_python_api_dwarf/a.out' (x86_64).

Hide Details

Hide Details

runCmd: breakpoint set -f "main.cpp" -l 92 output: Breakpoint 1: where = a.out`C::C(int, int, int) + 53 at main.cpp:92:52, address = 0x0000000100000e45

Hide Details

Hide Details

Expecting pattern: ^Breakpoint (?P<bpno>[0-9]+): (?P<num_locations>[0-9]+) locations\.$ Not matched

Hide Details

Expecting pattern: ^Breakpoint (?P<bpno>[0-9]+): (?P<num_locations>no) locations \(pending\)\. Not matched

Hide Details

Expecting pattern: ^Breakpoint (?P<bpno>[0-9]+): where = (?P<module>.*)`(?P<symbol>[+\-]{0,1}[^+]+)( \+ (?P<offset>[0-9]+)){0,1}( \[inlined\] (?P<inline_symbol>.*)){0,1} at (?P<file>[^:]+):(?P<line_no>[0-9]+)(?P<column>(:[0-9]+)?), address = (?P<address>0x[0-9a-fA-F]+)$ Matched

Hide Details

runCmd: run runCmd failed! error: process exited with status -1 (Error 1)

Hide Details

Hide Details

Command 'run' failed!

Hide Details

FAIL: LLDB (/Users/buildslave/jenkins/workspace/lldb-cmake-sanitized/host-compiler/bin/clang-10-x86_64) :: test_and_python_api_dwarf (TestClassTypesDisassembly.IterateFrameAndDisassembleTestCase) <bound method SBProcess.Kill of <lldb.SBProcess; proxy of <Swig Object of type 'lldb::SBProcess *' at 0x10f338c60> >>: success

Hide Details

UNSUPPORTED: LLDB (/Users/buildslave/jenkins/workspace/lldb-cmake-sanitized/host-compiler/bin/clang-10-x86_64) :: test_and_python_api_dwo (TestClassTypesDisassembly.IterateFrameAndDisassembleTestCase) (test case does not fall in any category of interest for this run) runCmd: settings set symbols.enable-external-lookup false output:

Hide Details

runCmd: settings set plugin.process.gdb-remote.packet-timeout 60 output:

Hide Details

runCmd: settings set symbols.clang-modules-cache-path "/Users/buildslave/jenkins/workspace/lldb-cmake-sanitized/lldb-build/tools/lldb/lldb-test-build.noindex/module-cache-lldb" output:

Hide Details

runCmd: settings set use-color false output:

Hide Details

runCmd: file /Users/buildslave/jenkins/workspace/lldb-cmake-sanitized/lldb-build/tools/lldb/lldb-test-build.noindex/lang/cpp/class_types/TestClassTypesDisassembly.test_and_python_api_gmodules/a.out output: Current executable set to '/Users/buildslave/jenkins/workspace/lldb-cmake-sanitized/lldb-build/tools/lldb/lldb-test-build.noindex/lang/cpp/class_types/TestClassTypesDisassembly.test_and_python_api_gmodules/a.out' (x86_64).

Hide Details

Hide Details

runCmd: breakpoint set -f "main.cpp" -l 92 output: Breakpoint 1: where = a.out`C::C(int, int, int) + 53 at main.cpp:92:52, address = 0x0000000100000e45

Hide Details

Hide Details

Expecting pattern: ^Breakpoint (?P<bpno>[0-9]+): (?P<num_locations>[0-9]+) locations\.$ Not matched

Hide Details

Expecting pattern: ^Breakpoint (?P<bpno>[0-9]+): (?P<num_locations>no) locations \(pending\)\. Not matched

Hide Details

Expecting pattern: ^Breakpoint (?P<bpno>[0-9]+): where = (?P<module>.*)`(?P<symbol>[+\-]{0,1}[^+]+)( \+ (?P<offset>[0-9]+)){0,1}( \[inlined\] (?P<inline_symbol>.*)){0,1} at (?P<file>[^:]+):(?P<line_no>[0-9]+)(?P<column>(:[0-9]+)?), address = (?P<address>0x[0-9a-fA-F]+)$ Matched

Hide Details

runCmd: run runCmd failed! error: process exited with status -1 (Error 1)

Hide Details

Hide Details

Command 'run' failed!

Hide Details

FAIL: LLDB (/Users/buildslave/jenkins/workspace/lldb-cmake-sanitized/host-compiler/bin/clang-10-x86_64) :: test_and_python_api_gmodules (TestClassTypesDisassembly.IterateFrameAndDisassembleTestCase) <bound method SBProcess.Kill of <lldb.SBProcess; proxy of <Swig Object of type 'lldb::SBProcess *' at 0x10f338e10> >>: success

Hide Details

runCmd: settings set symbols.enable-external-lookup false output:

Hide Details

runCmd: settings set plugin.process.gdb-remote.packet-timeout 60 output:

Hide Details

runCmd: settings set symbols.clang-modules-cache-path "/Users/buildslave/jenkins/workspace/lldb-cmake-sanitized/lldb-build/tools/lldb/lldb-test-build.noindex/module-cache-lldb" output:

Hide Details

runCmd: settings set use-color false output:

Hide Details

runCmd: file /Users/buildslave/jenkins/workspace/lldb-cmake-sanitized/lldb-build/tools/lldb/lldb-test-build.noindex/lang/cpp/class_types/TestClassTypesDisassembly.test_and_run_command_dsym/a.out output: Current executable set to '/Users/buildslave/jenkins/workspace/lldb-cmake-sanitized/lldb-build/tools/lldb/lldb-test-build.noindex/lang/cpp/class_types/TestClassTypesDisassembly.test_and_run_command_dsym/a.out' (x86_64).

Hide Details

Hide Details

runCmd: breakpoint set -f "main.cpp" -l 92 output: Breakpoint 1: where = a.out`C::C(int, int, int) + 53 at main.cpp:92:52, address = 0x0000000100000e45

Hide Details

Hide Details

Expecting pattern: ^Breakpoint (?P<bpno>[0-9]+): (?P<num_locations>[0-9]+) locations\.$ Not matched

Hide Details

Expecting pattern: ^Breakpoint (?P<bpno>[0-9]+): (?P<num_locations>no) locations \(pending\)\. Not matched

Hide Details

Expecting pattern: ^Breakpoint (?P<bpno>[0-9]+): where = (?P<module>.*)`(?P<symbol>[+\-]{0,1}[^+]+)( \+ (?P<offset>[0-9]+)){0,1}( \[inlined\] (?P<inline_symbol>.*)){0,1} at (?P<file>[^:]+):(?P<line_no>[0-9]+)(?P<column>(:[0-9]+)?), address = (?P<address>0x[0-9a-fA-F]+)$ Matched

Hide Details

runCmd: run runCmd failed! error: process exited with status -1 (Error 1)

Hide Details

Hide Details

Command 'run' failed!

Hide Details

FAIL: LLDB (/Users/buildslave/jenkins/workspace/lldb-cmake-sanitized/host-compiler/bin/clang-10-x86_64) :: test_and_run_command_dsym (TestClassTypesDisassembly.IterateFrameAndDisassembleTestCase) <bound method SBProcess.Kill of <lldb.SBProcess; proxy of <Swig Object of type 'lldb::SBProcess *' at 0x10f338c30> >>: success

Hide Details

runCmd: settings set symbols.enable-external-lookup false output:

Hide Details

runCmd: settings set plugin.process.gdb-remote.packet-timeout 60 output:

Hide Details

runCmd: settings set symbols.clang-modules-cache-path "/Users/buildslave/jenkins/workspace/lldb-cmake-sanitized/lldb-build/tools/lldb/lldb-test-build.noindex/module-cache-lldb" output:

Hide Details

runCmd: settings set use-color false output:

Hide Details

runCmd: file /Users/buildslave/jenkins/workspace/lldb-cmake-sanitized/lldb-build/tools/lldb/lldb-test-build.noindex/lang/cpp/class_types/TestClassTypesDisassembly.test_and_run_command_dwarf/a.out output: Current executable set to '/Users/buildslave/jenkins/workspace/lldb-cmake-sanitized/lldb-build/tools/lldb/lldb-test-build.noindex/lang/cpp/class_types/TestClassTypesDisassembly.test_and_run_command_dwarf/a.out' (x86_64).

Hide Details

Hide Details

runCmd: breakpoint set -f "main.cpp" -l 92 output: Breakpoint 1: where = a.out`C::C(int, int, int) + 53 at main.cpp:92:52, address = 0x0000000100000e45

Hide Details

Hide Details

Expecting pattern: ^Breakpoint (?P<bpno>[0-9]+): (?P<num_locations>[0-9]+) locations\.$ Not matched

Hide Details

Expecting pattern: ^Breakpoint (?P<bpno>[0-9]+): (?P<num_locations>no) locations \(pending\)\. Not matched

Hide Details

Expecting pattern: ^Breakpoint (?P<bpno>[0-9]+): where = (?P<module>.*)`(?P<symbol>[+\-]{0,1}[^+]+)( \+ (?P<offset>[0-9]+)){0,1}( \[inlined\] (?P<inline_symbol>.*)){0,1} at (?P<file>[^:]+):(?P<line_no>[0-9]+)(?P<column>(:[0-9]+)?), address = (?P<address>0x[0-9a-fA-F]+)$ Matched

Hide Details

runCmd: run runCmd failed! error: process exited with status -1 (Error 1)

Hide Details

Hide Details

Command 'run' failed!

Hide Details

FAIL: LLDB (/Users/buildslave/jenkins/workspace/lldb-cmake-sanitized/host-compiler/bin/clang-10-x86_64) :: test_and_run_command_dwarf (TestClassTypesDisassembly.IterateFrameAndDisassembleTestCase) <bound method SBProcess.Kill of <lldb.SBProcess; proxy of <Swig Object of type 'lldb::SBProcess *' at 0x10f338c90> >>: success

Hide Details

UNSUPPORTED: LLDB (/Users/buildslave/jenkins/workspace/lldb-cmake-sanitized/host-compiler/bin/clang-10-x86_64) :: test_and_run_command_dwo (TestClassTypesDisassembly.IterateFrameAndDisassembleTestCase) (test case does not fall in any category of interest for this run) runCmd: settings set symbols.enable-external-lookup false output:

Hide Details

runCmd: settings set plugin.process.gdb-remote.packet-timeout 60 output:

Hide Details

runCmd: settings set symbols.clang-modules-cache-path "/Users/buildslave/jenkins/workspace/lldb-cmake-sanitized/lldb-build/tools/lldb/lldb-test-build.noindex/module-cache-lldb" output:

Hide Details

runCmd: settings set use-color false output:

Hide Details

runCmd: file /Users/buildslave/jenkins/workspace/lldb-cmake-sanitized/lldb-build/tools/lldb/lldb-test-build.noindex/lang/cpp/class_types/TestClassTypesDisassembly.test_and_run_command_gmodules/a.out output: Current executable set to '/Users/buildslave/jenkins/workspace/lldb-cmake-sanitized/lldb-build/tools/lldb/lldb-test-build.noindex/lang/cpp/class_types/TestClassTypesDisassembly.test_and_run_command_gmodules/a.out' (x86_64).

Hide Details

Hide Details

runCmd: breakpoint set -f "main.cpp" -l 92 output: Breakpoint 1: where = a.out`C::C(int, int, int) + 53 at main.cpp:92:52, address = 0x0000000100000e45

Hide Details

Hide Details

Expecting pattern: ^Breakpoint (?P<bpno>[0-9]+): (?P<num_locations>[0-9]+) locations\.$ Not matched

Hide Details

Expecting pattern: ^Breakpoint (?P<bpno>[0-9]+): (?P<num_locations>no) locations \(pending\)\. Not matched

Hide Details

Expecting pattern: ^Breakpoint (?P<bpno>[0-9]+): where = (?P<module>.*)`(?P<symbol>[+\-]{0,1}[^+]+)( \+ (?P<offset>[0-9]+)){0,1}( \[inlined\] (?P<inline_symbol>.*)){0,1} at (?P<file>[^:]+):(?P<line_no>[0-9]+)(?P<column>(:[0-9]+)?), address = (?P<address>0x[0-9a-fA-F]+)$ Matched

Hide Details

runCmd: run output: Process 37356 stopped * thread #1, queue = 'com.apple.main-thread', stop reason = breakpoint 1.1 frame #0: 0x0000000100000e45 a.out`C::C(this=0x00007ffeefbff478, ai=44, bi=55, ci=66) at main.cpp:92:52 89 B(ai, bi), 90 m_c_int(ci) 91 { -> 92 std::printf("Within C::ctor() m_c_int=%d\n", m_c_int); // Set break point at this line. ^ 93 } 94 95 //virtual

Hide Details

Process 37356 launched: '/Users/buildslave/jenkins/workspace/lldb-cmake-sanitized/lldb-build/tools/lldb/lldb-test-build.noindex/lang/cpp/class_types/TestClassTypesDisassembly.test_and_run_command_gmodules/a.out' (x86_64)

Hide Details

Hide Details

runCmd: thread list output: Process 37356 stopped * thread #1: tid = 0x1439070, 0x0000000100000e45 a.out`C::C(this=0x00007ffeefbff478, ai=44, bi=55, ci=66) at main.cpp:92:52, queue = 'com.apple.main-thread', stop reason = breakpoint 1.1

Hide Details

Hide Details

Expecting sub string: stopped Matched

Hide Details

Expecting sub string: stop reason = breakpoint 1. Matched

Hide Details

<bound method SBProcess.Kill of <lldb.SBProcess; proxy of <Swig Object of type 'lldb::SBProcess *' at 0x10f756ba0> >>: success

Hide Details

PASS: LLDB (/Users/buildslave/jenkins/workspace/lldb-cmake-sanitized/host-compiler/bin/clang-10-x86_64) :: test_and_run_command_gmodules (TestClassTypesDisassembly.IterateFrameAndDisassembleTestCase) Restore dir to: /Users/buildslave/jenkins/workspace/lldb-cmake-sanitized/lldb-build/tools/lldb/lit ====================================================================== FAIL: test_and_python_api_dsym (TestClassTypesDisassembly.IterateFrameAndDisassembleTestCase) Disassemble each call frame when stopped on C's constructor. ---------------------------------------------------------------------- Traceback (most recent call last): File "/Users/buildslave/jenkins/workspace/lldb-cmake-sanitized/llvm-project/lldb/packages/Python/lldbsuite/test/lldbtest.py", line 1748, in test_method return attrvalue(self) File "/Users/buildslave/jenkins/workspace/lldb-cmake-sanitized/llvm-project/lldb/packages/Python/lldbsuite/test/lang/cpp/class_types/TestClassTypesDisassembly.py", line 44, in test_and_python_api self.breakOnCtor() File "/Users/buildslave/jenkins/workspace/lldb-cmake-sanitized/llvm-project/lldb/packages/Python/lldbsuite/test/lang/cpp/class_types/TestClassTypesDisassembly.py", line 87, in breakOnCtor self.runCmd("run", RUN_SUCCEEDED) File "/Users/buildslave/jenkins/workspace/lldb-cmake-sanitized/llvm-project/lldb/packages/Python/lldbsuite/test/lldbtest.py", line 2068, in runCmd msg if (msg) else CMD_MSG(cmd)) AssertionError: False is not True : Process is launched successfully Error output: error: process exited with status -1 (Error 1)

Hide Details

Config=x86_64-/Users/buildslave/jenkins/workspace/lldb-cmake-sanitized/host-compiler/bin/clang-10 ====================================================================== FAIL: test_and_python_api_dwarf (TestClassTypesDisassembly.IterateFrameAndDisassembleTestCase) Disassemble each call frame when stopped on C's constructor. ---------------------------------------------------------------------- Traceback (most recent call last): File "/Users/buildslave/jenkins/workspace/lldb-cmake-sanitized/llvm-project/lldb/packages/Python/lldbsuite/test/lldbtest.py", line 1748, in test_method return attrvalue(self) File "/Users/buildslave/jenkins/workspace/lldb-cmake-sanitized/llvm-project/lldb/packages/Python/lldbsuite/test/lang/cpp/class_types/TestClassTypesDisassembly.py", line 44, in test_and_python_api self.breakOnCtor() File "/Users/buildslave/jenkins/workspace/lldb-cmake-sanitized/llvm-project/lldb/packages/Python/lldbsuite/test/lang/cpp/class_types/TestClassTypesDisassembly.py", line 87, in breakOnCtor self.runCmd("run", RUN_SUCCEEDED) File "/Users/buildslave/jenkins/workspace/lldb-cmake-sanitized/llvm-project/lldb/packages/Python/lldbsuite/test/lldbtest.py", line 2068, in runCmd msg if (msg) else CMD_MSG(cmd)) AssertionError: False is not True : Process is launched successfully Error output: error: process exited with status -1 (Error 1)

Hide Details

Config=x86_64-/Users/buildslave/jenkins/workspace/lldb-cmake-sanitized/host-compiler/bin/clang-10 ====================================================================== FAIL: test_and_python_api_gmodules (TestClassTypesDisassembly.IterateFrameAndDisassembleTestCase) Disassemble each call frame when stopped on C's constructor. ---------------------------------------------------------------------- Traceback (most recent call last): File "/Users/buildslave/jenkins/workspace/lldb-cmake-sanitized/llvm-project/lldb/packages/Python/lldbsuite/test/lldbtest.py", line 1748, in test_method return attrvalue(self) File "/Users/buildslave/jenkins/workspace/lldb-cmake-sanitized/llvm-project/lldb/packages/Python/lldbsuite/test/lang/cpp/class_types/TestClassTypesDisassembly.py", line 44, in test_and_python_api self.breakOnCtor() File "/Users/buildslave/jenkins/workspace/lldb-cmake-sanitized/llvm-project/lldb/packages/Python/lldbsuite/test/lang/cpp/class_types/TestClassTypesDisassembly.py", line 87, in breakOnCtor self.runCmd("run", RUN_SUCCEEDED) File "/Users/buildslave/jenkins/workspace/lldb-cmake-sanitized/llvm-project/lldb/packages/Python/lldbsuite/test/lldbtest.py", line 2068, in runCmd msg if (msg) else CMD_MSG(cmd)) AssertionError: False is not True : Process is launched successfully Error output: error: process exited with status -1 (Error 1)

Hide Details

Config=x86_64-/Users/buildslave/jenkins/workspace/lldb-cmake-sanitized/host-compiler/bin/clang-10 ====================================================================== FAIL: test_and_run_command_dsym (TestClassTypesDisassembly.IterateFrameAndDisassembleTestCase) Disassemble each call frame when stopped on C's constructor. ---------------------------------------------------------------------- Traceback (most recent call last): File "/Users/buildslave/jenkins/workspace/lldb-cmake-sanitized/llvm-project/lldb/packages/Python/lldbsuite/test/lldbtest.py", line 1748, in test_method return attrvalue(self) File "/Users/buildslave/jenkins/workspace/lldb-cmake-sanitized/llvm-project/lldb/packages/Python/lldbsuite/test/lang/cpp/class_types/TestClassTypesDisassembly.py", line 22, in test_and_run_command self.breakOnCtor() File "/Users/buildslave/jenkins/workspace/lldb-cmake-sanitized/llvm-project/lldb/packages/Python/lldbsuite/test/lang/cpp/class_types/TestClassTypesDisassembly.py", line 87, in breakOnCtor self.runCmd("run", RUN_SUCCEEDED) File "/Users/buildslave/jenkins/workspace/lldb-cmake-sanitized/llvm-project/lldb/packages/Python/lldbsuite/test/lldbtest.py", line 2068, in runCmd msg if (msg) else CMD_MSG(cmd)) AssertionError: False is not True : Process is launched successfully Error output: error: process exited with status -1 (Error 1)

Hide Details

Config=x86_64-/Users/buildslave/jenkins/workspace/lldb-cmake-sanitized/host-compiler/bin/clang-10 ====================================================================== FAIL: test_and_run_command_dwarf (TestClassTypesDisassembly.IterateFrameAndDisassembleTestCase) Disassemble each call frame when stopped on C's constructor. ---------------------------------------------------------------------- Traceback (most recent call last): File "/Users/buildslave/jenkins/workspace/lldb-cmake-sanitized/llvm-project/lldb/packages/Python/lldbsuite/test/lldbtest.py", line 1748, in test_method return attrvalue(self) File "/Users/buildslave/jenkins/workspace/lldb-cmake-sanitized/llvm-project/lldb/packages/Python/lldbsuite/test/lang/cpp/class_types/TestClassTypesDisassembly.py", line 22, in test_and_run_command self.breakOnCtor() File "/Users/buildslave/jenkins/workspace/lldb-cmake-sanitized/llvm-project/lldb/packages/Python/lldbsuite/test/lang/cpp/class_types/TestClassTypesDisassembly.py", line 87, in breakOnCtor self.runCmd("run", RUN_SUCCEEDED) File "/Users/buildslave/jenkins/workspace/lldb-cmake-sanitized/llvm-project/lldb/packages/Python/lldbsuite/test/lldbtest.py", line 2068, in runCmd msg if (msg) else CMD_MSG(cmd)) AssertionError: False is not True : Process is launched successfully Error output: error: process exited with status -1 (Error 1)

Hide Details

Config=x86_64-/Users/buildslave/jenkins/workspace/lldb-cmake-sanitized/host-compiler/bin/clang-10 ---------------------------------------------------------------------- Ran 8 tests in 15.074s

Hide Details

RESULT: FAILED (1 passes, 5 failures, 0 errors, 2 skipped, 0 expected failures, 0 unexpected successes)

Hide Details

******************** PASS: lldb-Unit :: Language/Highlighting/./HighlighterTests/HighlighterTest.ClangStringLiterals (1685 of 1727) PASS: lldb-Unit :: Utility/./UtilityTests/OptionsWithRawTest.WhitespaceSuffix (1686 of 1727) PASS: lldb-Unit :: UnwindAssembly/x86/./UnwindAssemblyx86Tests/Testx86AssemblyInspectionEngine.TestSubRSP (1687 of 1727) PASS: lldb-Unit :: Interpreter/./InterpreterTests/OptionArgParserTest.toScriptLanguage (1688 of 1727) PASS: lldb-Unit :: Host/./HostTests/MainLoopTest.UnmonitoredSignal (1689 of 1727) PASS: LLDB :: Commands/command-backtrace.test (1690 of 1727) PASS: lldb-Unit :: UnwindAssembly/x86/./UnwindAssemblyx86Tests/Testx86AssemblyInspectionEngine.Test64bitFramelessBigStackFrame (1691 of 1727) PASS: lldb-Unit :: UnwindAssembly/x86/./UnwindAssemblyx86Tests/Testx86AssemblyInspectionEngine.TestPushESI (1692 of 1727) PASS: LLDB :: SymbolFile/DWARF/debug-types-dwo-cross-reference.cpp (1693 of 1727) PASS: LLDB :: Modules/ELF/netbsd-core-amd64.test (1694 of 1727) PASS: lldb-Unit :: ScriptInterpreter/Python/./ScriptInterpreterPythonTests/PythonDataObjectsTest.TestGlobalNameResolutionNoDot (1695 of 1727) PASS: lldb-Suite :: benchmarks/stepping/TestSteppingSpeed.py (1696 of 1727) PASS: lldb-Unit :: Utility/./UtilityTests/ArgsTest.ReplaceArgumentAtIndexEqual (1697 of 1727) PASS: lldb-Suite :: functionalities/breakpoint/comp_dir_symlink/TestCompDirSymLink.py (1698 of 1727) PASS: lldb-Unit :: Expression/./ExpressionTests/DiagnosticManagerTest.GetStringNoDiags (1699 of 1727) FAIL: lldb-Suite :: lang/objc/unicode-string/TestUnicodeString.py (1700 of 1727) ******************** TEST 'lldb-Suite :: lang/objc/unicode-string/TestUnicodeString.py' FAILED ******************** lldb version 10.0.99 (http://labmaster3.local/git/llvm-project.git revision 466fb68fce10d34963c2fd651de32bd3a4ddcd1f) clang revision a34f13f2bab3bb3a25ce999defb616558cbc3f4f llvm revision a34f13f2bab3bb3a25ce999defb616558cbc3f4f LLDB library dir: /Users/buildslave/jenkins/workspace/lldb-cmake-sanitized/lldb-build/bin LLDB import library dir: /Users/buildslave/jenkins/workspace/lldb-cmake-sanitized/lldb-build/bin libstdcxx tests will not be run because: Don't know how to build with libstdcxx on macosx Skipping following debug info categories: ['dwo']

Hide Details

Session logs for test failures/errors/unexpected successes will go into directory '/Users/buildslave/jenkins/workspace/lldb-cmake-sanitized/test/logs' Command invoked: /Users/buildslave/jenkins/workspace/lldb-cmake-sanitized/llvm-project/lldb/test/dotest.py --arch=x86_64 -s /Users/buildslave/jenkins/workspace/lldb-cmake-sanitized/lldb-build/lldb-test-traces -S nm -u CXXFLAGS -u CFLAGS --executable /Users/buildslave/jenkins/workspace/lldb-cmake-sanitized/lldb-build/./bin/lldb --dsymutil /Users/buildslave/jenkins/workspace/lldb-cmake-sanitized/lldb-build/./bin/dsymutil --filecheck /Users/buildslave/jenkins/workspace/lldb-cmake-sanitized/lldb-build/./bin/FileCheck -C /Users/buildslave/jenkins/workspace/lldb-cmake-sanitized/host-compiler/bin/clang --codesign-identity lldb_codesign --server /Users/buildslave/jenkins/workspace/lldb-cmake-sanitized/lldb-build/./bin/debugserver --arch x86_64 --build-dir /Users/buildslave/jenkins/workspace/lldb-cmake-sanitized/lldb-build/lldb-test-build.noindex -s=/Users/buildslave/jenkins/workspace/lldb-cmake-sanitized/test/logs -t --env TERM=vt100 --env LLVM_LIBS_DIR=/Users/buildslave/jenkins/workspace/lldb-cmake-sanitized/lldb-build/./lib --build-dir /Users/buildslave/jenkins/workspace/lldb-cmake-sanitized/lldb-build/tools/lldb/lldb-test-build.noindex --module-cache-dir /Users/buildslave/jenkins/workspace/lldb-cmake-sanitized/lldb-build/tools/lldb/lldb-test-build.noindex/module-cache-lldb /Users/buildslave/jenkins/workspace/lldb-cmake-sanitized/llvm-project/lldb/packages/Python/lldbsuite/test/lang/objc/unicode-string -p TestUnicodeString.py Change dir to: /Users/buildslave/jenkins/workspace/lldb-cmake-sanitized/llvm-project/lldb/packages/Python/lldbsuite/test/lang/objc/unicode-string runCmd: settings set symbols.enable-external-lookup false output:

Hide Details

runCmd: settings set plugin.process.gdb-remote.packet-timeout 60 output:

Hide Details

runCmd: settings set symbols.clang-modules-cache-path "/Users/buildslave/jenkins/workspace/lldb-cmake-sanitized/lldb-build/tools/lldb/lldb-test-build.noindex/module-cache-lldb" output:

Hide Details

runCmd: settings set use-color false output:

Hide Details

runCmd: po @"凹" output: 凹

Hide Details

Hide Details

Hide Details

Expecting sub string: 凹 Matched

Hide Details

<bound method SBProcess.Kill of <lldb.SBProcess; proxy of <Swig Object of type 'lldb::SBProcess *' at 0x124437c60> >>: success

Hide Details

PASS: LLDB (/Users/buildslave/jenkins/workspace/lldb-cmake-sanitized/host-compiler/bin/clang-10-x86_64) :: test_dsym (lldbsuite.test.lldbtest.TestUnicodeString) runCmd: settings set symbols.enable-external-lookup false output:

Hide Details

runCmd: settings set plugin.process.gdb-remote.packet-timeout 60 output:

Hide Details

runCmd: settings set symbols.clang-modules-cache-path "/Users/buildslave/jenkins/workspace/lldb-cmake-sanitized/lldb-build/tools/lldb/lldb-test-build.noindex/module-cache-lldb" output:

Hide Details

runCmd: settings set use-color false output:

Hide Details

FAIL: LLDB (/Users/buildslave/jenkins/workspace/lldb-cmake-sanitized/host-compiler/bin/clang-10-x86_64) :: test_dwarf (lldbsuite.test.lldbtest.TestUnicodeString) UNSUPPORTED: LLDB (/Users/buildslave/jenkins/workspace/lldb-cmake-sanitized/host-compiler/bin/clang-10-x86_64) :: test_dwo (lldbsuite.test.lldbtest.TestUnicodeString) (test case does not fall in any category of interest for this run) runCmd: settings set symbols.enable-external-lookup false output:

Hide Details

runCmd: settings set plugin.process.gdb-remote.packet-timeout 60 output:

Hide Details

runCmd: settings set symbols.clang-modules-cache-path "/Users/buildslave/jenkins/workspace/lldb-cmake-sanitized/lldb-build/tools/lldb/lldb-test-build.noindex/module-cache-lldb" output:

Hide Details

runCmd: settings set use-color false output:

Hide Details

FAIL: LLDB (/Users/buildslave/jenkins/workspace/lldb-cmake-sanitized/host-compiler/bin/clang-10-x86_64) :: test_gmodules (lldbsuite.test.lldbtest.TestUnicodeString) <bound method SBProcess.Kill of <lldb.SBProcess; proxy of <Swig Object of type 'lldb::SBProcess *' at 0x124620cc0> >>: success

Hide Details

Restore dir to: /Users/buildslave/jenkins/workspace/lldb-cmake-sanitized/lldb-build/tools/lldb/lit ====================================================================== ERROR: test_dwarf (lldbsuite.test.lldbtest.TestUnicodeString) ---------------------------------------------------------------------- Error when building test subject.

Hide Details

Build Command: make VPATH=/Users/buildslave/jenkins/workspace/lldb-cmake-sanitized/llvm-project/lldb/packages/Python/lldbsuite/test/lang/objc/unicode-string -C /Users/buildslave/jenkins/workspace/lldb-cmake-sanitized/lldb-build/tools/lldb/lldb-test-build.noindex/lang/objc/unicode-string/lldbsuite.test.lldbtest.test_dwarf -I /Users/buildslave/jenkins/workspace/lldb-cmake-sanitized/llvm-project/lldb/packages/Python/lldbsuite/test/lang/objc/unicode-string -I /Users/buildslave/jenkins/workspace/lldb-cmake-sanitized/llvm-project/lldb/packages/Python/lldbsuite/test/make -f /Users/buildslave/jenkins/workspace/lldb-cmake-sanitized/lldb-build/tools/lldb/lldb-test-build.noindex/lang/objc/unicode-string/lldbsuite.test.lldbtest.test_dwarf/Makefile MAKE_DSYM=NO ARCH=x86_64 CC="/Users/buildslave/jenkins/workspace/lldb-cmake-sanitized/host-compiler/bin/clang-10"

Hide Details

Build Command Output: make: *** [main.o] Killed: 9

Hide Details

Test Directory: /Users/buildslave/jenkins/workspace/lldb-cmake-sanitized/llvm-project/lldb/packages/Python/lldbsuite/test/lang/objc/unicode-string ====================================================================== FAIL: test_gmodules (lldbsuite.test.lldbtest.TestUnicodeString) ---------------------------------------------------------------------- Traceback (most recent call last): File "/Users/buildslave/jenkins/workspace/lldb-cmake-sanitized/llvm-project/lldb/packages/Python/lldbsuite/test/lldbtest.py", line 1748, in test_method return attrvalue(self) File "/Users/buildslave/jenkins/workspace/lldb-cmake-sanitized/llvm-project/lldb/packages/Python/lldbsuite/test/lldbinline.py", line 124, in _test self.do_test() File "/Users/buildslave/jenkins/workspace/lldb-cmake-sanitized/llvm-project/lldb/packages/Python/lldbsuite/test/lldbinline.py", line 151, in do_test "inline test did not hit a single breakpoint") AssertionError: False is not True : inline test did not hit a single breakpoint Config=x86_64-/Users/buildslave/jenkins/workspace/lldb-cmake-sanitized/host-compiler/bin/clang-10 ---------------------------------------------------------------------- Ran 4 tests in 19.677s

Hide Details

RESULT: FAILED (1 passes, 1 failures, 1 errors, 1 skipped, 0 expected failures, 0 unexpected successes)

Hide Details

******************** PASS: lldb-Unit :: Utility/./UtilityTests/TimerTest.CategoryTimesNested (1701 of 1727) PASS: LLDB :: Modules/PECOFF/basic-info.yaml (1702 of 1727) FAIL: lldb-Suite :: lang/cpp/type_lookup/TestCppTypeLookup.py (1703 of 1727) ******************** TEST 'lldb-Suite :: lang/cpp/type_lookup/TestCppTypeLookup.py' FAILED ******************** lldb version 10.0.99 (http://labmaster3.local/git/llvm-project.git revision 466fb68fce10d34963c2fd651de32bd3a4ddcd1f) clang revision a34f13f2bab3bb3a25ce999defb616558cbc3f4f llvm revision a34f13f2bab3bb3a25ce999defb616558cbc3f4f LLDB library dir: /Users/buildslave/jenkins/workspace/lldb-cmake-sanitized/lldb-build/bin LLDB import library dir: /Users/buildslave/jenkins/workspace/lldb-cmake-sanitized/lldb-build/bin libstdcxx tests will not be run because: Don't know how to build with libstdcxx on macosx Skipping following debug info categories: ['dwo']

Hide Details

Session logs for test failures/errors/unexpected successes will go into directory '/Users/buildslave/jenkins/workspace/lldb-cmake-sanitized/test/logs' Command invoked: /Users/buildslave/jenkins/workspace/lldb-cmake-sanitized/llvm-project/lldb/test/dotest.py --arch=x86_64 -s /Users/buildslave/jenkins/workspace/lldb-cmake-sanitized/lldb-build/lldb-test-traces -S nm -u CXXFLAGS -u CFLAGS --executable /Users/buildslave/jenkins/workspace/lldb-cmake-sanitized/lldb-build/./bin/lldb --dsymutil /Users/buildslave/jenkins/workspace/lldb-cmake-sanitized/lldb-build/./bin/dsymutil --filecheck /Users/buildslave/jenkins/workspace/lldb-cmake-sanitized/lldb-build/./bin/FileCheck -C /Users/buildslave/jenkins/workspace/lldb-cmake-sanitized/host-compiler/bin/clang --codesign-identity lldb_codesign --server /Users/buildslave/jenkins/workspace/lldb-cmake-sanitized/lldb-build/./bin/debugserver --arch x86_64 --build-dir /Users/buildslave/jenkins/workspace/lldb-cmake-sanitized/lldb-build/lldb-test-build.noindex -s=/Users/buildslave/jenkins/workspace/lldb-cmake-sanitized/test/logs -t --env TERM=vt100 --env LLVM_LIBS_DIR=/Users/buildslave/jenkins/workspace/lldb-cmake-sanitized/lldb-build/./lib --build-dir /Users/buildslave/jenkins/workspace/lldb-cmake-sanitized/lldb-build/tools/lldb/lldb-test-build.noindex --module-cache-dir /Users/buildslave/jenkins/workspace/lldb-cmake-sanitized/lldb-build/tools/lldb/lldb-test-build.noindex/module-cache-lldb /Users/buildslave/jenkins/workspace/lldb-cmake-sanitized/llvm-project/lldb/packages/Python/lldbsuite/test/lang/cpp/type_lookup -p TestCppTypeLookup.py Change dir to: /Users/buildslave/jenkins/workspace/lldb-cmake-sanitized/llvm-project/lldb/packages/Python/lldbsuite/test/lang/cpp/type_lookup runCmd: settings set symbols.enable-external-lookup false output:

Hide Details

runCmd: settings set plugin.process.gdb-remote.packet-timeout 60 output:

Hide Details

runCmd: settings set symbols.clang-modules-cache-path "/Users/buildslave/jenkins/workspace/lldb-cmake-sanitized/lldb-build/tools/lldb/lldb-test-build.noindex/module-cache-lldb" output:

Hide Details

runCmd: settings set use-color false output:

Hide Details

FAIL: LLDB (/Users/buildslave/jenkins/workspace/lldb-cmake-sanitized/host-compiler/bin/clang-10-x86_64) :: test_namespace_only_dsym (TestCppTypeLookup.TestCppTypeLookup) <bound method SBProcess.Kill of <lldb.SBProcess; proxy of <Swig Object of type 'lldb::SBProcess *' at 0x10ededba0> >>: success

Hide Details

runCmd: settings set symbols.enable-external-lookup false output:

Hide Details

runCmd: settings set plugin.process.gdb-remote.packet-timeout 60 output:

Hide Details

runCmd: settings set symbols.clang-modules-cache-path "/Users/buildslave/jenkins/workspace/lldb-cmake-sanitized/lldb-build/tools/lldb/lldb-test-build.noindex/module-cache-lldb" output:

Hide Details

runCmd: settings set use-color false output:

Hide Details

FAIL: LLDB (/Users/buildslave/jenkins/workspace/lldb-cmake-sanitized/host-compiler/bin/clang-10-x86_64) :: test_namespace_only_dwarf (TestCppTypeLookup.TestCppTypeLookup) <bound method SBProcess.Kill of <lldb.SBProcess; proxy of <Swig Object of type 'lldb::SBProcess *' at 0x10ea66b70> >>: success

Hide Details

UNSUPPORTED: LLDB (/Users/buildslave/jenkins/workspace/lldb-cmake-sanitized/host-compiler/bin/clang-10-x86_64) :: test_namespace_only_dwo (TestCppTypeLookup.TestCppTypeLookup) (test case does not fall in any category of interest for this run) runCmd: settings set symbols.enable-external-lookup false output:

Hide Details

runCmd: settings set plugin.process.gdb-remote.packet-timeout 60 output:

Hide Details

runCmd: settings set symbols.clang-modules-cache-path "/Users/buildslave/jenkins/workspace/lldb-cmake-sanitized/lldb-build/tools/lldb/lldb-test-build.noindex/module-cache-lldb" output:

Hide Details

runCmd: settings set use-color false output:

Hide Details

FAIL: LLDB (/Users/buildslave/jenkins/workspace/lldb-cmake-sanitized/host-compiler/bin/clang-10-x86_64) :: test_namespace_only_gmodules (TestCppTypeLookup.TestCppTypeLookup) <bound method SBProcess.Kill of <lldb.SBProcess; proxy of <Swig Object of type 'lldb::SBProcess *' at 0x10ec8b930> >>: success

Hide Details

Restore dir to: /Users/buildslave/jenkins/workspace/lldb-cmake-sanitized/lldb-build/tools/lldb/lit ====================================================================== FAIL: test_namespace_only_dsym (TestCppTypeLookup.TestCppTypeLookup) ---------------------------------------------------------------------- Traceback (most recent call last): File "/Users/buildslave/jenkins/workspace/lldb-cmake-sanitized/llvm-project/lldb/packages/Python/lldbsuite/test/lldbtest.py", line 1748, in test_method return attrvalue(self) File "/Users/buildslave/jenkins/workspace/lldb-cmake-sanitized/llvm-project/lldb/packages/Python/lldbsuite/test/lang/cpp/type_lookup/TestCppTypeLookup.py", line 36, in test_namespace_only self, "Set a breakpoint here", self.main_source_file) File "/Users/buildslave/jenkins/workspace/lldb-cmake-sanitized/llvm-project/lldb/packages/Python/lldbsuite/test/lldbutil.py", line 838, in run_to_source_breakpoint return run_to_breakpoint_do_run(test, target, breakpoint, launch_info) File "/Users/buildslave/jenkins/workspace/lldb-cmake-sanitized/llvm-project/lldb/packages/Python/lldbsuite/test/lldbutil.py", line 781, in run_to_breakpoint_do_run test.assertTrue(len(threads) == 1, "Expected 1 thread to stop at breakpoint, %d did."%(len(threads))) AssertionError: False is not True : Expected 1 thread to stop at breakpoint, 0 did. Config=x86_64-/Users/buildslave/jenkins/workspace/lldb-cmake-sanitized/host-compiler/bin/clang-10 ====================================================================== FAIL: test_namespace_only_dwarf (TestCppTypeLookup.TestCppTypeLookup) ---------------------------------------------------------------------- Traceback (most recent call last): File "/Users/buildslave/jenkins/workspace/lldb-cmake-sanitized/llvm-project/lldb/packages/Python/lldbsuite/test/lldbtest.py", line 1748, in test_method return attrvalue(self) File "/Users/buildslave/jenkins/workspace/lldb-cmake-sanitized/llvm-project/lldb/packages/Python/lldbsuite/test/lang/cpp/type_lookup/TestCppTypeLookup.py", line 36, in test_namespace_only self, "Set a breakpoint here", self.main_source_file) File "/Users/buildslave/jenkins/workspace/lldb-cmake-sanitized/llvm-project/lldb/packages/Python/lldbsuite/test/lldbutil.py", line 838, in run_to_source_breakpoint return run_to_breakpoint_do_run(test, target, breakpoint, launch_info) File "/Users/buildslave/jenkins/workspace/lldb-cmake-sanitized/llvm-project/lldb/packages/Python/lldbsuite/test/lldbutil.py", line 781, in run_to_breakpoint_do_run test.assertTrue(len(threads) == 1, "Expected 1 thread to stop at breakpoint, %d did."%(len(threads))) AssertionError: False is not True : Expected 1 thread to stop at breakpoint, 0 did. Config=x86_64-/Users/buildslave/jenkins/workspace/lldb-cmake-sanitized/host-compiler/bin/clang-10 ====================================================================== FAIL: test_namespace_only_gmodules (TestCppTypeLookup.TestCppTypeLookup) ---------------------------------------------------------------------- Traceback (most recent call last): File "/Users/buildslave/jenkins/workspace/lldb-cmake-sanitized/llvm-project/lldb/packages/Python/lldbsuite/test/lldbtest.py", line 1748, in test_method return attrvalue(self) File "/Users/buildslave/jenkins/workspace/lldb-cmake-sanitized/llvm-project/lldb/packages/Python/lldbsuite/test/lang/cpp/type_lookup/TestCppTypeLookup.py", line 36, in test_namespace_only self, "Set a breakpoint here", self.main_source_file) File "/Users/buildslave/jenkins/workspace/lldb-cmake-sanitized/llvm-project/lldb/packages/Python/lldbsuite/test/lldbutil.py", line 838, in run_to_source_breakpoint return run_to_breakpoint_do_run(test, target, breakpoint, launch_info) File "/Users/buildslave/jenkins/workspace/lldb-cmake-sanitized/llvm-project/lldb/packages/Python/lldbsuite/test/lldbutil.py", line 781, in run_to_breakpoint_do_run test.assertTrue(len(threads) == 1, "Expected 1 thread to stop at breakpoint, %d did."%(len(threads))) AssertionError: False is not True : Expected 1 thread to stop at breakpoint, 0 did. Config=x86_64-/Users/buildslave/jenkins/workspace/lldb-cmake-sanitized/host-compiler/bin/clang-10 ---------------------------------------------------------------------- Ran 4 tests in 3.704s

Hide Details

RESULT: FAILED (0 passes, 3 failures, 0 errors, 1 skipped, 0 expected failures, 0 unexpected successes)

Hide Details

******************** FAIL: lldb-Suite :: lang/objc/objc-static-method/TestObjCStaticMethod.py (1704 of 1727) ******************** TEST 'lldb-Suite :: lang/objc/objc-static-method/TestObjCStaticMethod.py' FAILED ******************** lldb version 10.0.99 (http://labmaster3.local/git/llvm-project.git revision 466fb68fce10d34963c2fd651de32bd3a4ddcd1f) clang revision a34f13f2bab3bb3a25ce999defb616558cbc3f4f llvm revision a34f13f2bab3bb3a25ce999defb616558cbc3f4f LLDB library dir: /Users/buildslave/jenkins/workspace/lldb-cmake-sanitized/lldb-build/bin LLDB import library dir: /Users/buildslave/jenkins/workspace/lldb-cmake-sanitized/lldb-build/bin libstdcxx tests will not be run because: Don't know how to build with libstdcxx on macosx Skipping following debug info categories: ['dwo']

Hide Details

Session logs for test failures/errors/unexpected successes will go into directory '/Users/buildslave/jenkins/workspace/lldb-cmake-sanitized/test/logs' Command invoked: /Users/buildslave/jenkins/workspace/lldb-cmake-sanitized/llvm-project/lldb/test/dotest.py --arch=x86_64 -s /Users/buildslave/jenkins/workspace/lldb-cmake-sanitized/lldb-build/lldb-test-traces -S nm -u CXXFLAGS -u CFLAGS --executable /Users/buildslave/jenkins/workspace/lldb-cmake-sanitized/lldb-build/./bin/lldb --dsymutil /Users/buildslave/jenkins/workspace/lldb-cmake-sanitized/lldb-build/./bin/dsymutil --filecheck /Users/buildslave/jenkins/workspace/lldb-cmake-sanitized/lldb-build/./bin/FileCheck -C /Users/buildslave/jenkins/workspace/lldb-cmake-sanitized/host-compiler/bin/clang --codesign-identity lldb_codesign --server /Users/buildslave/jenkins/workspace/lldb-cmake-sanitized/lldb-build/./bin/debugserver --arch x86_64 --build-dir /Users/buildslave/jenkins/workspace/lldb-cmake-sanitized/lldb-build/lldb-test-build.noindex -s=/Users/buildslave/jenkins/workspace/lldb-cmake-sanitized/test/logs -t --env TERM=vt100 --env LLVM_LIBS_DIR=/Users/buildslave/jenkins/workspace/lldb-cmake-sanitized/lldb-build/./lib --build-dir /Users/buildslave/jenkins/workspace/lldb-cmake-sanitized/lldb-build/tools/lldb/lldb-test-build.noindex --module-cache-dir /Users/buildslave/jenkins/workspace/lldb-cmake-sanitized/lldb-build/tools/lldb/lldb-test-build.noindex/module-cache-lldb /Users/buildslave/jenkins/workspace/lldb-cmake-sanitized/llvm-project/lldb/packages/Python/lldbsuite/test/lang/objc/objc-static-method -p TestObjCStaticMethod.py Change dir to: /Users/buildslave/jenkins/workspace/lldb-cmake-sanitized/llvm-project/lldb/packages/Python/lldbsuite/test/lang/objc/objc-static-method runCmd: settings set symbols.enable-external-lookup false output:

Hide Details

runCmd: settings set plugin.process.gdb-remote.packet-timeout 60 output:

Hide Details

runCmd: settings set symbols.clang-modules-cache-path "/Users/buildslave/jenkins/workspace/lldb-cmake-sanitized/lldb-build/tools/lldb/lldb-test-build.noindex/module-cache-lldb" output:

Hide Details

runCmd: settings set use-color false output:

Hide Details

FAIL: LLDB (/Users/buildslave/jenkins/workspace/lldb-cmake-sanitized/host-compiler/bin/clang-10-x86_64) :: test_with_python_api_dsym (TestObjCStaticMethod.TestObjCStaticMethod) <bound method SBProcess.Kill of <lldb.SBProcess; proxy of <Swig Object of type 'lldb::SBProcess *' at 0x112a99d50> >>: success

Hide Details

runCmd: settings set symbols.enable-external-lookup false output:

Hide Details

runCmd: settings set plugin.process.gdb-remote.packet-timeout 60 output:

Hide Details

runCmd: settings set symbols.clang-modules-cache-path "/Users/buildslave/jenkins/workspace/lldb-cmake-sanitized/lldb-build/tools/lldb/lldb-test-build.noindex/module-cache-lldb" output:

Hide Details

runCmd: settings set use-color false output:

Hide Details

FAIL: LLDB (/Users/buildslave/jenkins/workspace/lldb-cmake-sanitized/host-compiler/bin/clang-10-x86_64) :: test_with_python_api_dwarf (TestObjCStaticMethod.TestObjCStaticMethod) <bound method SBProcess.Kill of <lldb.SBProcess; proxy of <Swig Object of type 'lldb::SBProcess *' at 0x112a99d20> >>: success

Hide Details

UNSUPPORTED: LLDB (/Users/buildslave/jenkins/workspace/lldb-cmake-sanitized/host-compiler/bin/clang-10-x86_64) :: test_with_python_api_dwo (TestObjCStaticMethod.TestObjCStaticMethod) (test case does not fall in any category of interest for this run) runCmd: settings set symbols.enable-external-lookup false output:

Hide Details

runCmd: settings set plugin.process.gdb-remote.packet-timeout 60 output:

Hide Details

runCmd: settings set symbols.clang-modules-cache-path "/Users/buildslave/jenkins/workspace/lldb-cmake-sanitized/lldb-build/tools/lldb/lldb-test-build.noindex/module-cache-lldb" output:

Hide Details

runCmd: settings set use-color false output:

Hide Details

FAIL: LLDB (/Users/buildslave/jenkins/workspace/lldb-cmake-sanitized/host-compiler/bin/clang-10-x86_64) :: test_with_python_api_gmodules (TestObjCStaticMethod.TestObjCStaticMethod) <bound method SBProcess.Kill of <lldb.SBProcess; proxy of <Swig Object of type 'lldb::SBProcess *' at 0x112a99d50> >>: success

Hide Details

Restore dir to: /Users/buildslave/jenkins/workspace/lldb-cmake-sanitized/lldb-build/tools/lldb/lit ====================================================================== FAIL: test_with_python_api_dsym (TestObjCStaticMethod.TestObjCStaticMethod) Test calling functions in static methods. ---------------------------------------------------------------------- Traceback (most recent call last): File "/Users/buildslave/jenkins/workspace/lldb-cmake-sanitized/llvm-project/lldb/packages/Python/lldbsuite/test/lldbtest.py", line 1748, in test_method return attrvalue(self) File "/Users/buildslave/jenkins/workspace/lldb-cmake-sanitized/llvm-project/lldb/packages/Python/lldbsuite/test/lang/objc/objc-static-method/TestObjCStaticMethod.py", line 51, in test_with_python_api "No thread stopped at our breakpoint.") AssertionError: False is not True : No thread stopped at our breakpoint. Config=x86_64-/Users/buildslave/jenkins/workspace/lldb-cmake-sanitized/host-compiler/bin/clang-10 ====================================================================== FAIL: test_with_python_api_dwarf (TestObjCStaticMethod.TestObjCStaticMethod) Test calling functions in static methods. ---------------------------------------------------------------------- Traceback (most recent call last): File "/Users/buildslave/jenkins/workspace/lldb-cmake-sanitized/llvm-project/lldb/packages/Python/lldbsuite/test/lldbtest.py", line 1748, in test_method return attrvalue(self) File "/Users/buildslave/jenkins/workspace/lldb-cmake-sanitized/llvm-project/lldb/packages/Python/lldbsuite/test/lang/objc/objc-static-method/TestObjCStaticMethod.py", line 51, in test_with_python_api "No thread stopped at our breakpoint.") AssertionError: False is not True : No thread stopped at our breakpoint. Config=x86_64-/Users/buildslave/jenkins/workspace/lldb-cmake-sanitized/host-compiler/bin/clang-10 ====================================================================== FAIL: test_with_python_api_gmodules (TestObjCStaticMethod.TestObjCStaticMethod) Test calling functions in static methods. ---------------------------------------------------------------------- Traceback (most recent call last): File "/Users/buildslave/jenkins/workspace/lldb-cmake-sanitized/llvm-project/lldb/packages/Python/lldbsuite/test/lldbtest.py", line 1748, in test_method return attrvalue(self) File "/Users/buildslave/jenkins/workspace/lldb-cmake-sanitized/llvm-project/lldb/packages/Python/lldbsuite/test/lang/objc/objc-static-method/TestObjCStaticMethod.py", line 51, in test_with_python_api "No thread stopped at our breakpoint.") AssertionError: False is not True : No thread stopped at our breakpoint. Config=x86_64-/Users/buildslave/jenkins/workspace/lldb-cmake-sanitized/host-compiler/bin/clang-10 ---------------------------------------------------------------------- Ran 4 tests in 25.463s

Hide Details

RESULT: FAILED (0 passes, 3 failures, 0 errors, 1 skipped, 0 expected failures, 0 unexpected successes)

Hide Details

******************** PASS: lldb-Unit :: ObjectFile/Breakpad/./ObjectFileBreakpadTests/PublicRecord.parse (1705 of 1727) FAIL: lldb-Suite :: lang/cpp/scope/TestCppScope.py (1706 of 1727) ******************** TEST 'lldb-Suite :: lang/cpp/scope/TestCppScope.py' FAILED ******************** lldb version 10.0.99 (http://labmaster3.local/git/llvm-project.git revision 466fb68fce10d34963c2fd651de32bd3a4ddcd1f) clang revision a34f13f2bab3bb3a25ce999defb616558cbc3f4f llvm revision a34f13f2bab3bb3a25ce999defb616558cbc3f4f LLDB library dir: /Users/buildslave/jenkins/workspace/lldb-cmake-sanitized/lldb-build/bin LLDB import library dir: /Users/buildslave/jenkins/workspace/lldb-cmake-sanitized/lldb-build/bin libstdcxx tests will not be run because: Don't know how to build with libstdcxx on macosx Skipping following debug info categories: ['dwo']

Hide Details

Session logs for test failures/errors/unexpected successes will go into directory '/Users/buildslave/jenkins/workspace/lldb-cmake-sanitized/test/logs' Command invoked: /Users/buildslave/jenkins/workspace/lldb-cmake-sanitized/llvm-project/lldb/test/dotest.py --arch=x86_64 -s /Users/buildslave/jenkins/workspace/lldb-cmake-sanitized/lldb-build/lldb-test-traces -S nm -u CXXFLAGS -u CFLAGS --executable /Users/buildslave/jenkins/workspace/lldb-cmake-sanitized/lldb-build/./bin/lldb --dsymutil /Users/buildslave/jenkins/workspace/lldb-cmake-sanitized/lldb-build/./bin/dsymutil --filecheck /Users/buildslave/jenkins/workspace/lldb-cmake-sanitized/lldb-build/./bin/FileCheck -C /Users/buildslave/jenkins/workspace/lldb-cmake-sanitized/host-compiler/bin/clang --codesign-identity lldb_codesign --server /Users/buildslave/jenkins/workspace/lldb-cmake-sanitized/lldb-build/./bin/debugserver --arch x86_64 --build-dir /Users/buildslave/jenkins/workspace/lldb-cmake-sanitized/lldb-build/lldb-test-build.noindex -s=/Users/buildslave/jenkins/workspace/lldb-cmake-sanitized/test/logs -t --env TERM=vt100 --env LLVM_LIBS_DIR=/Users/buildslave/jenkins/workspace/lldb-cmake-sanitized/lldb-build/./lib --build-dir /Users/buildslave/jenkins/workspace/lldb-cmake-sanitized/lldb-build/tools/lldb/lldb-test-build.noindex --module-cache-dir /Users/buildslave/jenkins/workspace/lldb-cmake-sanitized/lldb-build/tools/lldb/lldb-test-build.noindex/module-cache-lldb /Users/buildslave/jenkins/workspace/lldb-cmake-sanitized/llvm-project/lldb/packages/Python/lldbsuite/test/lang/cpp/scope -p TestCppScope.py Change dir to: /Users/buildslave/jenkins/workspace/lldb-cmake-sanitized/llvm-project/lldb/packages/Python/lldbsuite/test/lang/cpp/scope runCmd: settings set symbols.enable-external-lookup false output:

Hide Details

runCmd: settings set plugin.process.gdb-remote.packet-timeout 60 output:

Hide Details

runCmd: settings set symbols.clang-modules-cache-path "/Users/buildslave/jenkins/workspace/lldb-cmake-sanitized/lldb-build/tools/lldb/lldb-test-build.noindex/module-cache-lldb" output:

Hide Details

runCmd: settings set use-color false output:

Hide Details

FAIL: LLDB (/Users/buildslave/jenkins/workspace/lldb-cmake-sanitized/host-compiler/bin/clang-10-x86_64) :: test_all_but_c_dsym (TestCppScope.TestCppScopes) <bound method SBProcess.Kill of <lldb.SBProcess; proxy of <Swig Object of type 'lldb::SBProcess *' at 0x10f0f3480> >>: success

Hide Details

runCmd: settings set symbols.enable-external-lookup false output:

Hide Details

runCmd: settings set plugin.process.gdb-remote.packet-timeout 60 output:

Hide Details

runCmd: settings set symbols.clang-modules-cache-path "/Users/buildslave/jenkins/workspace/lldb-cmake-sanitized/lldb-build/tools/lldb/lldb-test-build.noindex/module-cache-lldb" output:

Hide Details

runCmd: settings set use-color false output:

Hide Details

FAIL: LLDB (/Users/buildslave/jenkins/workspace/lldb-cmake-sanitized/host-compiler/bin/clang-10-x86_64) :: test_all_but_c_dwarf (TestCppScope.TestCppScopes) <bound method SBProcess.Kill of <lldb.SBProcess; proxy of <Swig Object of type 'lldb::SBProcess *' at 0x10eec2c30> >>: success

Hide Details

UNSUPPORTED: LLDB (/Users/buildslave/jenkins/workspace/lldb-cmake-sanitized/host-compiler/bin/clang-10-x86_64) :: test_all_but_c_dwo (TestCppScope.TestCppScopes) (test case does not fall in any category of interest for this run) runCmd: settings set symbols.enable-external-lookup false output:

Hide Details

runCmd: settings set plugin.process.gdb-remote.packet-timeout 60 output:

Hide Details

runCmd: settings set symbols.clang-modules-cache-path "/Users/buildslave/jenkins/workspace/lldb-cmake-sanitized/lldb-build/tools/lldb/lldb-test-build.noindex/module-cache-lldb" output:

Hide Details

runCmd: settings set use-color false output:

Hide Details

FAIL: LLDB (/Users/buildslave/jenkins/workspace/lldb-cmake-sanitized/host-compiler/bin/clang-10-x86_64) :: test_all_but_c_gmodules (TestCppScope.TestCppScopes) <bound method SBProcess.Kill of <lldb.SBProcess; proxy of <Swig Object of type 'lldb::SBProcess *' at 0x10f0f3450> >>: success

Hide Details

runCmd: settings set symbols.enable-external-lookup false output:

Hide Details

runCmd: settings set plugin.process.gdb-remote.packet-timeout 60 output:

Hide Details

runCmd: settings set symbols.clang-modules-cache-path "/Users/buildslave/jenkins/workspace/lldb-cmake-sanitized/lldb-build/tools/lldb/lldb-test-build.noindex/module-cache-lldb" output:

Hide Details

runCmd: settings set use-color false output:

Hide Details

FAIL: LLDB (/Users/buildslave/jenkins/workspace/lldb-cmake-sanitized/host-compiler/bin/clang-10-x86_64) :: test_c_dsym (TestCppScope.TestCppScopes) <bound method SBProcess.Kill of <lldb.SBProcess; proxy of <Swig Object of type 'lldb::SBProcess *' at 0x10eec2bd0> >>: success

Hide Details

runCmd: settings set symbols.enable-external-lookup false output:

Hide Details

runCmd: settings set plugin.process.gdb-remote.packet-timeout 60 output:

Hide Details

runCmd: settings set symbols.clang-modules-cache-path "/Users/buildslave/jenkins/workspace/lldb-cmake-sanitized/lldb-build/tools/lldb/lldb-test-build.noindex/module-cache-lldb" output:

Hide Details

runCmd: settings set use-color false output:

Hide Details

FAIL: LLDB (/Users/buildslave/jenkins/workspace/lldb-cmake-sanitized/host-compiler/bin/clang-10-x86_64) :: test_c_dwarf (TestCppScope.TestCppScopes) <bound method SBProcess.Kill of <lldb.SBProcess; proxy of <Swig Object of type 'lldb::SBProcess *' at 0x10f0f3450> >>: success

Hide Details

UNSUPPORTED: LLDB (/Users/buildslave/jenkins/workspace/lldb-cmake-sanitized/host-compiler/bin/clang-10-x86_64) :: test_c_dwo (TestCppScope.TestCppScopes) (test case does not fall in any category of interest for this run) runCmd: settings set symbols.enable-external-lookup false output:

Hide Details

runCmd: settings set plugin.process.gdb-remote.packet-timeout 60 output:

Hide Details

runCmd: settings set symbols.clang-modules-cache-path "/Users/buildslave/jenkins/workspace/lldb-cmake-sanitized/lldb-build/tools/lldb/lldb-test-build.noindex/module-cache-lldb" output:

Hide Details

runCmd: settings set use-color false output:

Hide Details

FAIL: LLDB (/Users/buildslave/jenkins/workspace/lldb-cmake-sanitized/host-compiler/bin/clang-10-x86_64) :: test_c_gmodules (TestCppScope.TestCppScopes) <bound method SBProcess.Kill of <lldb.SBProcess; proxy of <Swig Object of type 'lldb::SBProcess *' at 0x10eec2c30> >>: success

Hide Details

Restore dir to: /Users/buildslave/jenkins/workspace/lldb-cmake-sanitized/lldb-build/tools/lldb/lit ====================================================================== FAIL: test_all_but_c_dsym (TestCppScope.TestCppScopes) ---------------------------------------------------------------------- Traceback (most recent call last): File "/Users/buildslave/jenkins/workspace/lldb-cmake-sanitized/llvm-project/lldb/packages/Python/lldbsuite/test/lldbtest.py", line 1748, in test_method return attrvalue(self) File "/Users/buildslave/jenkins/workspace/lldb-cmake-sanitized/llvm-project/lldb/packages/Python/lldbsuite/test/decorators.py", line 111, in wrapper func(*args, **kwargs) File "/Users/buildslave/jenkins/workspace/lldb-cmake-sanitized/llvm-project/lldb/packages/Python/lldbsuite/test/lang/cpp/scope/TestCppScope.py", line 16, in test_all_but_c self.do_test(False) File "/Users/buildslave/jenkins/workspace/lldb-cmake-sanitized/llvm-project/lldb/packages/Python/lldbsuite/test/lang/cpp/scope/TestCppScope.py", line 54, in do_test PROCESS_STOPPED) AssertionError: False is not True : Process status should be stopped Config=x86_64-/Users/buildslave/jenkins/workspace/lldb-cmake-sanitized/host-compiler/bin/clang-10 ====================================================================== FAIL: test_all_but_c_dwarf (TestCppScope.TestCppScopes) ---------------------------------------------------------------------- Traceback (most recent call last): File "/Users/buildslave/jenkins/workspace/lldb-cmake-sanitized/llvm-project/lldb/packages/Python/lldbsuite/test/lldbtest.py", line 1748, in test_method return attrvalue(self) File "/Users/buildslave/jenkins/workspace/lldb-cmake-sanitized/llvm-project/lldb/packages/Python/lldbsuite/test/decorators.py", line 111, in wrapper func(*args, **kwargs) File "/Users/buildslave/jenkins/workspace/lldb-cmake-sanitized/llvm-project/lldb/packages/Python/lldbsuite/test/lang/cpp/scope/TestCppScope.py", line 16, in test_all_but_c self.do_test(False) File "/Users/buildslave/jenkins/workspace/lldb-cmake-sanitized/llvm-project/lldb/packages/Python/lldbsuite/test/lang/cpp/scope/TestCppScope.py", line 54, in do_test PROCESS_STOPPED) AssertionError: False is not True : Process status should be stopped Config=x86_64-/Users/buildslave/jenkins/workspace/lldb-cmake-sanitized/host-compiler/bin/clang-10 ====================================================================== FAIL: test_all_but_c_gmodules (TestCppScope.TestCppScopes) ---------------------------------------------------------------------- Traceback (most recent call last): File "/Users/buildslave/jenkins/workspace/lldb-cmake-sanitized/llvm-project/lldb/packages/Python/lldbsuite/test/lldbtest.py", line 1748, in test_method return attrvalue(self) File "/Users/buildslave/jenkins/workspace/lldb-cmake-sanitized/llvm-project/lldb/packages/Python/lldbsuite/test/decorators.py", line 111, in wrapper func(*args, **kwargs) File "/Users/buildslave/jenkins/workspace/lldb-cmake-sanitized/llvm-project/lldb/packages/Python/lldbsuite/test/lang/cpp/scope/TestCppScope.py", line 16, in test_all_but_c self.do_test(False) File "/Users/buildslave/jenkins/workspace/lldb-cmake-sanitized/llvm-project/lldb/packages/Python/lldbsuite/test/lang/cpp/scope/TestCppScope.py", line 54, in do_test PROCESS_STOPPED) AssertionError: False is not True : Process status should be stopped Config=x86_64-/Users/buildslave/jenkins/workspace/lldb-cmake-sanitized/host-compiler/bin/clang-10 ====================================================================== FAIL: test_c_dsym (TestCppScope.TestCppScopes) ---------------------------------------------------------------------- Traceback (most recent call last): File "/Users/buildslave/jenkins/workspace/lldb-cmake-sanitized/llvm-project/lldb/packages/Python/lldbsuite/test/lldbtest.py", line 1748, in test_method return attrvalue(self) File "/Users/buildslave/jenkins/workspace/lldb-cmake-sanitized/llvm-project/lldb/packages/Python/lldbsuite/test/decorators.py", line 111, in wrapper func(*args, **kwargs) File "/Users/buildslave/jenkins/workspace/lldb-cmake-sanitized/llvm-project/lldb/packages/Python/lldbsuite/test/lang/cpp/scope/TestCppScope.py", line 20, in test_c self.do_test(True) File "/Users/buildslave/jenkins/workspace/lldb-cmake-sanitized/llvm-project/lldb/packages/Python/lldbsuite/test/lang/cpp/scope/TestCppScope.py", line 54, in do_test PROCESS_STOPPED) AssertionError: False is not True : Process status should be stopped Config=x86_64-/Users/buildslave/jenkins/workspace/lldb-cmake-sanitized/host-compiler/bin/clang-10 ====================================================================== FAIL: test_c_dwarf (TestCppScope.TestCppScopes) ---------------------------------------------------------------------- Traceback (most recent call last): File "/Users/buildslave/jenkins/workspace/lldb-cmake-sanitized/llvm-project/lldb/packages/Python/lldbsuite/test/lldbtest.py", line 1748, in test_method return attrvalue(self) File "/Users/buildslave/jenkins/workspace/lldb-cmake-sanitized/llvm-project/lldb/packages/Python/lldbsuite/test/decorators.py", line 111, in wrapper func(*args, **kwargs) File "/Users/buildslave/jenkins/workspace/lldb-cmake-sanitized/llvm-project/lldb/packages/Python/lldbsuite/test/lang/cpp/scope/TestCppScope.py", line 20, in test_c self.do_test(True) File "/Users/buildslave/jenkins/workspace/lldb-cmake-sanitized/llvm-project/lldb/packages/Python/lldbsuite/test/lang/cpp/scope/TestCppScope.py", line 54, in do_test PROCESS_STOPPED) AssertionError: False is not True : Process status should be stopped Config=x86_64-/Users/buildslave/jenkins/workspace/lldb-cmake-sanitized/host-compiler/bin/clang-10 ====================================================================== FAIL: test_c_gmodules (TestCppScope.TestCppScopes) ---------------------------------------------------------------------- Traceback (most recent call last): File "/Users/buildslave/jenkins/workspace/lldb-cmake-sanitized/llvm-project/lldb/packages/Python/lldbsuite/test/lldbtest.py", line 1748, in test_method return attrvalue(self) File "/Users/buildslave/jenkins/workspace/lldb-cmake-sanitized/llvm-project/lldb/packages/Python/lldbsuite/test/decorators.py", line 111, in wrapper func(*args, **kwargs) File "/Users/buildslave/jenkins/workspace/lldb-cmake-sanitized/llvm-project/lldb/packages/Python/lldbsuite/test/lang/cpp/scope/TestCppScope.py", line 20, in test_c self.do_test(True) File "/Users/buildslave/jenkins/workspace/lldb-cmake-sanitized/llvm-project/lldb/packages/Python/lldbsuite/test/lang/cpp/scope/TestCppScope.py", line 54, in do_test PROCESS_STOPPED) AssertionError: False is not True : Process status should be stopped Config=x86_64-/Users/buildslave/jenkins/workspace/lldb-cmake-sanitized/host-compiler/bin/clang-10 ---------------------------------------------------------------------- Ran 8 tests in 7.146s

Hide Details

RESULT: FAILED (0 passes, 6 failures, 0 errors, 2 skipped, 0 expected failures, 0 unexpected successes)

Hide Details

******************** PASS: LLDB :: SymbolFile/NativePDB/global-classes.cpp (1707 of 1727) PASS: lldb-Unit :: Utility/./UtilityTests/AnsiTerminal.Empty (1708 of 1727) PASS: LLDB :: Modules/ELF/PT_LOAD-overlap-section.yaml (1709 of 1727) PASS: lldb-Suite :: commands/expression/import-std-module/vector-basic/TestBasicVector.py (1710 of 1727) PASS: lldb-Unit :: Utility/./UtilityTests/StreamTeeTest.AppendStream (1711 of 1727) PASS: lldb-Unit :: Expression/./ExpressionTests/DiagnosticManagerTest.GetStringMultipleDiags (1712 of 1727) FAIL: lldb-Suite :: lang/objc/blocks/TestObjCIvarsInBlocks.py (1713 of 1727) ******************** TEST 'lldb-Suite :: lang/objc/blocks/TestObjCIvarsInBlocks.py' FAILED ******************** lldb version 10.0.99 (http://labmaster3.local/git/llvm-project.git revision 466fb68fce10d34963c2fd651de32bd3a4ddcd1f) clang revision a34f13f2bab3bb3a25ce999defb616558cbc3f4f llvm revision a34f13f2bab3bb3a25ce999defb616558cbc3f4f LLDB library dir: /Users/buildslave/jenkins/workspace/lldb-cmake-sanitized/lldb-build/bin LLDB import library dir: /Users/buildslave/jenkins/workspace/lldb-cmake-sanitized/lldb-build/bin libstdcxx tests will not be run because: Don't know how to build with libstdcxx on macosx Skipping following debug info categories: ['dwo']

Hide Details

Session logs for test failures/errors/unexpected successes will go into directory '/Users/buildslave/jenkins/workspace/lldb-cmake-sanitized/test/logs' Command invoked: /Users/buildslave/jenkins/workspace/lldb-cmake-sanitized/llvm-project/lldb/test/dotest.py --arch=x86_64 -s /Users/buildslave/jenkins/workspace/lldb-cmake-sanitized/lldb-build/lldb-test-traces -S nm -u CXXFLAGS -u CFLAGS --executable /Users/buildslave/jenkins/workspace/lldb-cmake-sanitized/lldb-build/./bin/lldb --dsymutil /Users/buildslave/jenkins/workspace/lldb-cmake-sanitized/lldb-build/./bin/dsymutil --filecheck /Users/buildslave/jenkins/workspace/lldb-cmake-sanitized/lldb-build/./bin/FileCheck -C /Users/buildslave/jenkins/workspace/lldb-cmake-sanitized/host-compiler/bin/clang --codesign-identity lldb_codesign --server /Users/buildslave/jenkins/workspace/lldb-cmake-sanitized/lldb-build/./bin/debugserver --arch x86_64 --build-dir /Users/buildslave/jenkins/workspace/lldb-cmake-sanitized/lldb-build/lldb-test-build.noindex -s=/Users/buildslave/jenkins/workspace/lldb-cmake-sanitized/test/logs -t --env TERM=vt100 --env LLVM_LIBS_DIR=/Users/buildslave/jenkins/workspace/lldb-cmake-sanitized/lldb-build/./lib --build-dir /Users/buildslave/jenkins/workspace/lldb-cmake-sanitized/lldb-build/tools/lldb/lldb-test-build.noindex --module-cache-dir /Users/buildslave/jenkins/workspace/lldb-cmake-sanitized/lldb-build/tools/lldb/lldb-test-build.noindex/module-cache-lldb /Users/buildslave/jenkins/workspace/lldb-cmake-sanitized/llvm-project/lldb/packages/Python/lldbsuite/test/lang/objc/blocks -p TestObjCIvarsInBlocks.py Change dir to: /Users/buildslave/jenkins/workspace/lldb-cmake-sanitized/llvm-project/lldb/packages/Python/lldbsuite/test/lang/objc/blocks runCmd: settings set symbols.enable-external-lookup false output:

Hide Details

runCmd: settings set plugin.process.gdb-remote.packet-timeout 60 output:

Hide Details

runCmd: settings set symbols.clang-modules-cache-path "/Users/buildslave/jenkins/workspace/lldb-cmake-sanitized/lldb-build/tools/lldb/lldb-test-build.noindex/module-cache-lldb" output:

Hide Details

runCmd: settings set use-color false output:

Hide Details

FAIL: LLDB (/Users/buildslave/jenkins/workspace/lldb-cmake-sanitized/host-compiler/bin/clang-10-x86_64) :: test_with_python_api_dsym (TestObjCIvarsInBlocks.TestObjCIvarsInBlocks) <bound method SBProcess.Kill of <lldb.SBProcess; proxy of <Swig Object of type 'lldb::SBProcess *' at 0x1137e62d0> >>: success

Hide Details

runCmd: settings set symbols.enable-external-lookup false output:

Hide Details

runCmd: settings set plugin.process.gdb-remote.packet-timeout 60 output:

Hide Details

runCmd: settings set symbols.clang-modules-cache-path "/Users/buildslave/jenkins/workspace/lldb-cmake-sanitized/lldb-build/tools/lldb/lldb-test-build.noindex/module-cache-lldb" output:

Hide Details

runCmd: settings set use-color false output:

Hide Details

FAIL: LLDB (/Users/buildslave/jenkins/workspace/lldb-cmake-sanitized/host-compiler/bin/clang-10-x86_64) :: test_with_python_api_dwarf (TestObjCIvarsInBlocks.TestObjCIvarsInBlocks) <bound method SBProcess.Kill of <lldb.SBProcess; proxy of <Swig Object of type 'lldb::SBProcess *' at 0x113ae1540> >>: success

Hide Details

UNSUPPORTED: LLDB (/Users/buildslave/jenkins/workspace/lldb-cmake-sanitized/host-compiler/bin/clang-10-x86_64) :: test_with_python_api_dwo (TestObjCIvarsInBlocks.TestObjCIvarsInBlocks) (test case does not fall in any category of interest for this run) runCmd: settings set symbols.enable-external-lookup false output:

Hide Details

runCmd: settings set plugin.process.gdb-remote.packet-timeout 60 output:

Hide Details

runCmd: settings set symbols.clang-modules-cache-path "/Users/buildslave/jenkins/workspace/lldb-cmake-sanitized/lldb-build/tools/lldb/lldb-test-build.noindex/module-cache-lldb" output:

Hide Details

runCmd: settings set use-color false output:

Hide Details

FAIL: LLDB (/Users/buildslave/jenkins/workspace/lldb-cmake-sanitized/host-compiler/bin/clang-10-x86_64) :: test_with_python_api_gmodules (TestObjCIvarsInBlocks.TestObjCIvarsInBlocks) <bound method SBProcess.Kill of <lldb.SBProcess; proxy of <Swig Object of type 'lldb::SBProcess *' at 0x1137e62d0> >>: success

Hide Details

Restore dir to: /Users/buildslave/jenkins/workspace/lldb-cmake-sanitized/lldb-build/tools/lldb/lit ====================================================================== FAIL: test_with_python_api_dsym (TestObjCIvarsInBlocks.TestObjCIvarsInBlocks) Test printing the ivars of the self when captured in blocks ---------------------------------------------------------------------- Traceback (most recent call last): File "/Users/buildslave/jenkins/workspace/lldb-cmake-sanitized/llvm-project/lldb/packages/Python/lldbsuite/test/lldbtest.py", line 1748, in test_method return attrvalue(self) File "/Users/buildslave/jenkins/workspace/lldb-cmake-sanitized/llvm-project/lldb/packages/Python/lldbsuite/test/decorators.py", line 141, in wrapper func(*args, **kwargs) File "/Users/buildslave/jenkins/workspace/lldb-cmake-sanitized/llvm-project/lldb/packages/Python/lldbsuite/test/decorators.py", line 111, in wrapper func(*args, **kwargs) File "/Users/buildslave/jenkins/workspace/lldb-cmake-sanitized/llvm-project/lldb/packages/Python/lldbsuite/test/lang/objc/blocks/TestObjCIvarsInBlocks.py", line 51, in test_with_python_api "Stopped it too.") AssertionError: False is not True : Stopped it too. Config=x86_64-/Users/buildslave/jenkins/workspace/lldb-cmake-sanitized/host-compiler/bin/clang-10 ====================================================================== FAIL: test_with_python_api_dwarf (TestObjCIvarsInBlocks.TestObjCIvarsInBlocks) Test printing the ivars of the self when captured in blocks ---------------------------------------------------------------------- Traceback (most recent call last): File "/Users/buildslave/jenkins/workspace/lldb-cmake-sanitized/llvm-project/lldb/packages/Python/lldbsuite/test/lldbtest.py", line 1748, in test_method return attrvalue(self) File "/Users/buildslave/jenkins/workspace/lldb-cmake-sanitized/llvm-project/lldb/packages/Python/lldbsuite/test/decorators.py", line 141, in wrapper func(*args, **kwargs) File "/Users/buildslave/jenkins/workspace/lldb-cmake-sanitized/llvm-project/lldb/packages/Python/lldbsuite/test/decorators.py", line 111, in wrapper func(*args, **kwargs) File "/Users/buildslave/jenkins/workspace/lldb-cmake-sanitized/llvm-project/lldb/packages/Python/lldbsuite/test/lang/objc/blocks/TestObjCIvarsInBlocks.py", line 51, in test_with_python_api "Stopped it too.") AssertionError: False is not True : Stopped it too. Config=x86_64-/Users/buildslave/jenkins/workspace/lldb-cmake-sanitized/host-compiler/bin/clang-10 ====================================================================== FAIL: test_with_python_api_gmodules (TestObjCIvarsInBlocks.TestObjCIvarsInBlocks) Test printing the ivars of the self when captured in blocks ---------------------------------------------------------------------- Traceback (most recent call last): File "/Users/buildslave/jenkins/workspace/lldb-cmake-sanitized/llvm-project/lldb/packages/Python/lldbsuite/test/lldbtest.py", line 1748, in test_method return attrvalue(self) File "/Users/buildslave/jenkins/workspace/lldb-cmake-sanitized/llvm-project/lldb/packages/Python/lldbsuite/test/decorators.py", line 141, in wrapper func(*args, **kwargs) File "/Users/buildslave/jenkins/workspace/lldb-cmake-sanitized/llvm-project/lldb/packages/Python/lldbsuite/test/decorators.py", line 111, in wrapper func(*args, **kwargs) File "/Users/buildslave/jenkins/workspace/lldb-cmake-sanitized/llvm-project/lldb/packages/Python/lldbsuite/test/lang/objc/blocks/TestObjCIvarsInBlocks.py", line 51, in test_with_python_api "Stopped it too.") AssertionError: False is not True : Stopped it too. Config=x86_64-/Users/buildslave/jenkins/workspace/lldb-cmake-sanitized/host-compiler/bin/clang-10 ---------------------------------------------------------------------- Ran 4 tests in 29.598s

Hide Details

RESULT: FAILED (0 passes, 3 failures, 0 errors, 1 skipped, 0 expected failures, 0 unexpected successes)

Hide Details

******************** TIMEOUT: LLDB :: Reproducer/Modules/TestModuleCXX.test (1714 of 1727) ******************** TEST 'LLDB :: Reproducer/Modules/TestModuleCXX.test' FAILED ******************** Script: -- : 'RUN: at line 4'; rm -rf /Users/buildslave/jenkins/workspace/lldb-cmake-sanitized/lldb-build/tools/lldb/lit/Reproducer/Modules/Output/TestModuleCXX.test.tmp.repro : 'RUN: at line 5'; rm -rf /Users/buildslave/jenkins/workspace/lldb-cmake-sanitized/lldb-build/tools/lldb/lit/Reproducer/Modules/Output/TestModuleCXX.test.tmp.root : 'RUN: at line 6'; rm -rf /Users/buildslave/jenkins/workspace/lldb-cmake-sanitized/lldb-build/tools/lldb/lit/Reproducer/Modules/Output/TestModuleCXX.test.tmp.clang-cache : 'RUN: at line 7'; rm -rf /Users/buildslave/jenkins/workspace/lldb-cmake-sanitized/lldb-build/tools/lldb/lit/Reproducer/Modules/Output/TestModuleCXX.test.tmp.lldb-cache : 'RUN: at line 10'; mkdir -p /Users/buildslave/jenkins/workspace/lldb-cmake-sanitized/lldb-build/tools/lldb/lit/Reproducer/Modules/Output/TestModuleCXX.test.tmp.root : 'RUN: at line 11'; mkdir -p /Users/buildslave/jenkins/workspace/lldb-cmake-sanitized/lldb-build/tools/lldb/lit/Reproducer/Modules/Output/TestModuleCXX.test.tmp.clang-cache : 'RUN: at line 12'; mkdir -p /Users/buildslave/jenkins/workspace/lldb-cmake-sanitized/lldb-build/tools/lldb/lit/Reproducer/Modules/Output/TestModuleCXX.test.tmp.lldb-cache : 'RUN: at line 13'; cp /Users/buildslave/jenkins/workspace/lldb-cmake-sanitized/llvm-project/lldb/lit/Reproducer/Modules/Inputs/main.cpp /Users/buildslave/jenkins/workspace/lldb-cmake-sanitized/lldb-build/tools/lldb/lit/Reproducer/Modules/Output/TestModuleCXX.test.tmp.root : 'RUN: at line 14'; cp /Users/buildslave/jenkins/workspace/lldb-cmake-sanitized/llvm-project/lldb/lit/Reproducer/Modules/Inputs/Foo.h /Users/buildslave/jenkins/workspace/lldb-cmake-sanitized/lldb-build/tools/lldb/lit/Reproducer/Modules/Output/TestModuleCXX.test.tmp.root : 'RUN: at line 15'; cp /Users/buildslave/jenkins/workspace/lldb-cmake-sanitized/llvm-project/lldb/lit/Reproducer/Modules/Inputs/Bar.h /Users/buildslave/jenkins/workspace/lldb-cmake-sanitized/lldb-build/tools/lldb/lit/Reproducer/Modules/Output/TestModuleCXX.test.tmp.root : 'RUN: at line 16'; cp /Users/buildslave/jenkins/workspace/lldb-cmake-sanitized/llvm-project/lldb/lit/Reproducer/Modules/Inputs/module.modulemap /Users/buildslave/jenkins/workspace/lldb-cmake-sanitized/lldb-build/tools/lldb/lit/Reproducer/Modules/Output/TestModuleCXX.test.tmp.root : 'RUN: at line 19'; /Users/buildslave/jenkins/workspace/lldb-cmake-sanitized/lldb-build/bin/clang -isysroot /Applications/Xcode.app/Contents/Developer/Platforms/MacOSX.platform/Developer/SDKs/MacOSX.sdk -fmodules-cache-path=/Users/buildslave/jenkins/workspace/lldb-cmake-sanitized/lldb-build/tools/lldb/lldb-test-build.noindex/module-cache-clang /Users/buildslave/jenkins/workspace/lldb-cmake-sanitized/lldb-build/tools/lldb/lit/Reproducer/Modules/Output/TestModuleCXX.test.tmp.root/main.cpp -g -fmodules -fcxx-modules -fmodules-cache-path=/Users/buildslave/jenkins/workspace/lldb-cmake-sanitized/lldb-build/tools/lldb/lit/Reproducer/Modules/Output/TestModuleCXX.test.tmp.clang-cache -o /Users/buildslave/jenkins/workspace/lldb-cmake-sanitized/lldb-build/tools/lldb/lit/Reproducer/Modules/Output/TestModuleCXX.test.tmp.root/a.out : 'RUN: at line 22'; /Users/buildslave/jenkins/workspace/lldb-cmake-sanitized/lldb-build/bin/lldb --no-lldbinit -S /Users/buildslave/jenkins/workspace/lldb-cmake-sanitized/lldb-build/tools/lldb/lit/lit-lldb-init -x -b -o 'settings set symbols.clang-modules-cache-path /Users/buildslave/jenkins/workspace/lldb-cmake-sanitized/lldb-build/tools/lldb/lit/Reproducer/Modules/Output/TestModuleCXX.test.tmp.lldb-cache' -s /Users/buildslave/jenkins/workspace/lldb-cmake-sanitized/llvm-project/lldb/lit/Reproducer/Modules/Inputs/ModuleCXX.in --capture --capture-path /Users/buildslave/jenkins/workspace/lldb-cmake-sanitized/lldb-build/tools/lldb/lit/Reproducer/Modules/Output/TestModuleCXX.test.tmp.repro /Users/buildslave/jenkins/workspace/lldb-cmake-sanitized/lldb-build/tools/lldb/lit/Reproducer/Modules/Output/TestModuleCXX.test.tmp.root/a.out | /Users/buildslave/jenkins/workspace/lldb-cmake-sanitized/lldb-build/bin/FileCheck /Users/buildslave/jenkins/workspace/lldb-cmake-sanitized/llvm-project/lldb/lit/Reproducer/Modules/TestModuleCXX.test --check-prefix CAPTURE : 'RUN: at line 25'; cat /Users/buildslave/jenkins/workspace/lldb-cmake-sanitized/lldb-build/tools/lldb/lit/Reproducer/Modules/Output/TestModuleCXX.test.tmp.repro/files.yaml | /Users/buildslave/jenkins/workspace/lldb-cmake-sanitized/lldb-build/bin/FileCheck /Users/buildslave/jenkins/workspace/lldb-cmake-sanitized/llvm-project/lldb/lit/Reproducer/Modules/TestModuleCXX.test --check-prefix YAML : 'RUN: at line 31'; rm -rf /Users/buildslave/jenkins/workspace/lldb-cmake-sanitized/lldb-build/tools/lldb/lit/Reproducer/Modules/Output/TestModuleCXX.test.tmp.root : 'RUN: at line 32'; rm -rf /Users/buildslave/jenkins/workspace/lldb-cmake-sanitized/lldb-build/tools/lldb/lit/Reproducer/Modules/Output/TestModuleCXX.test.tmp.clang-cache : 'RUN: at line 33'; rm -rf /Users/buildslave/jenkins/workspace/lldb-cmake-sanitized/lldb-build/tools/lldb/lit/Reproducer/Modules/Output/TestModuleCXX.test.tmp.lldb-cache : 'RUN: at line 36'; /Users/buildslave/jenkins/workspace/lldb-cmake-sanitized/lldb-build/bin/lldb --no-lldbinit -S /Users/buildslave/jenkins/workspace/lldb-cmake-sanitized/lldb-build/tools/lldb/lit/lit-lldb-init -x -b -o 'settings set symbols.clang-modules-cache-path /Users/buildslave/jenkins/workspace/lldb-cmake-sanitized/lldb-build/tools/lldb/lit/Reproducer/Modules/Output/TestModuleCXX.test.tmp.lldb-cache' -s /Users/buildslave/jenkins/workspace/lldb-cmake-sanitized/llvm-project/lldb/lit/Reproducer/Modules/Inputs/ModuleCXX.in --replay /Users/buildslave/jenkins/workspace/lldb-cmake-sanitized/lldb-build/tools/lldb/lit/Reproducer/Modules/Output/TestModuleCXX.test.tmp.repro /Users/buildslave/jenkins/workspace/lldb-cmake-sanitized/lldb-build/tools/lldb/lit/Reproducer/Modules/Output/TestModuleCXX.test.tmp.root/a.out | /Users/buildslave/jenkins/workspace/lldb-cmake-sanitized/lldb-build/bin/FileCheck /Users/buildslave/jenkins/workspace/lldb-cmake-sanitized/llvm-project/lldb/lit/Reproducer/Modules/TestModuleCXX.test --check-prefix REPLAY -- Exit Code: -9 Timeout: Reached timeout of 1200 seconds

Hide Details

Hide Details

******************** TIMEOUT: LLDB :: Settings/TestFrameFormatColor.test (1715 of 1727) ******************** TEST 'LLDB :: Settings/TestFrameFormatColor.test' FAILED ******************** Script: -- : 'RUN: at line 1'; /Users/buildslave/jenkins/workspace/lldb-cmake-sanitized/lldb-build/bin/clang -isysroot /Applications/Xcode.app/Contents/Developer/Platforms/MacOSX.platform/Developer/SDKs/MacOSX.sdk -fmodules-cache-path=/Users/buildslave/jenkins/workspace/lldb-cmake-sanitized/lldb-build/tools/lldb/lldb-test-build.noindex/module-cache-clang -g -O0 /Users/buildslave/jenkins/workspace/lldb-cmake-sanitized/llvm-project/lldb/lit/Settings/Inputs/main.c -o /Users/buildslave/jenkins/workspace/lldb-cmake-sanitized/lldb-build/tools/lldb/lit/Settings/Output/TestFrameFormatColor.test.tmp.out : 'RUN: at line 2'; /Users/buildslave/jenkins/workspace/lldb-cmake-sanitized/lldb-build/bin/lldb --no-lldbinit -S /Users/buildslave/jenkins/workspace/lldb-cmake-sanitized/lldb-build/tools/lldb/lit/lit-lldb-init -x -b -s /Users/buildslave/jenkins/workspace/lldb-cmake-sanitized/llvm-project/lldb/lit/Settings/TestFrameFormatColor.test /Users/buildslave/jenkins/workspace/lldb-cmake-sanitized/lldb-build/tools/lldb/lit/Settings/Output/TestFrameFormatColor.test.tmp.out | /Users/buildslave/jenkins/workspace/lldb-cmake-sanitized/lldb-build/bin/FileCheck /Users/buildslave/jenkins/workspace/lldb-cmake-sanitized/llvm-project/lldb/lit/Settings/TestFrameFormatColor.test -- Exit Code: -9 Timeout: Reached timeout of 1200 seconds

Hide Details

Command Output (stderr): -- clang-10: warning: argument unused during compilation: '-fmodules-cache-path=/Users/buildslave/jenkins/workspace/lldb-cmake-sanitized/lldb-build/tools/lldb/lldb-test-build.noindex/module-cache-clang' [-Wunused-command-line-argument]

Hide Details

--

Hide Details

******************** TIMEOUT: LLDB :: Process/TestEnvironment.test (1716 of 1727) ******************** TEST 'LLDB :: Process/TestEnvironment.test' FAILED ******************** Script: -- : 'RUN: at line 5'; /Users/buildslave/jenkins/workspace/lldb-cmake-sanitized/lldb-build/bin/clang --driver-mode=g++ -isysroot /Applications/Xcode.app/Contents/Developer/Platforms/MacOSX.platform/Developer/SDKs/MacOSX.sdk -fmodules-cache-path=/Users/buildslave/jenkins/workspace/lldb-cmake-sanitized/lldb-build/tools/lldb/lldb-test-build.noindex/module-cache-clang -std=c++11 /Users/buildslave/jenkins/workspace/lldb-cmake-sanitized/llvm-project/lldb/lit/Process/Inputs/env.cpp -o /Users/buildslave/jenkins/workspace/lldb-cmake-sanitized/lldb-build/tools/lldb/lit/Process/Output/TestEnvironment.test.tmp : 'RUN: at line 6'; /Users/buildslave/jenkins/workspace/lldb-cmake-sanitized/lldb-build/bin/lldb --no-lldbinit -S /Users/buildslave/jenkins/workspace/lldb-cmake-sanitized/lldb-build/tools/lldb/lit/lit-lldb-init /Users/buildslave/jenkins/workspace/lldb-cmake-sanitized/lldb-build/tools/lldb/lit/Process/Output/TestEnvironment.test.tmp -o 'process launch --environment FOO="BAR"' | /Users/buildslave/jenkins/workspace/lldb-cmake-sanitized/lldb-build/bin/FileCheck /Users/buildslave/jenkins/workspace/lldb-cmake-sanitized/llvm-project/lldb/lit/Process/TestEnvironment.test : 'RUN: at line 7'; /Users/buildslave/jenkins/workspace/lldb-cmake-sanitized/lldb-build/bin/lldb --no-lldbinit -S /Users/buildslave/jenkins/workspace/lldb-cmake-sanitized/lldb-build/tools/lldb/lit/lit-lldb-init /Users/buildslave/jenkins/workspace/lldb-cmake-sanitized/lldb-build/tools/lldb/lit/Process/Output/TestEnvironment.test.tmp -o 'env FOO="BAR"' -o 'process launch' | /Users/buildslave/jenkins/workspace/lldb-cmake-sanitized/lldb-build/bin/FileCheck /Users/buildslave/jenkins/workspace/lldb-cmake-sanitized/llvm-project/lldb/lit/Process/TestEnvironment.test -- Exit Code: -9 Timeout: Reached timeout of 1200 seconds

Hide Details

Command Output (stderr): -- clang-10: warning: argument unused during compilation: '-fmodules-cache-path=/Users/buildslave/jenkins/workspace/lldb-cmake-sanitized/lldb-build/tools/lldb/lldb-test-build.noindex/module-cache-clang' [-Wunused-command-line-argument]

Hide Details

--

Hide Details

******************** TIMEOUT: LLDB :: SymbolFile/Breakpad/line-table-edgecases.test (1717 of 1727) ******************** TEST 'LLDB :: SymbolFile/Breakpad/line-table-edgecases.test' FAILED ******************** Script: -- : 'RUN: at line 5'; /Users/buildslave/jenkins/workspace/lldb-cmake-sanitized/lldb-build/bin/yaml2obj /Users/buildslave/jenkins/workspace/lldb-cmake-sanitized/llvm-project/lldb/lit/SymbolFile/Breakpad/Inputs/basic-elf.yaml > /Users/buildslave/jenkins/workspace/lldb-cmake-sanitized/lldb-build/tools/lldb/lit/SymbolFile/Breakpad/Output/line-table-edgecases.out : 'RUN: at line 6'; /Users/buildslave/jenkins/workspace/lldb-cmake-sanitized/lldb-build/bin/lldb --no-lldbinit -S /Users/buildslave/jenkins/workspace/lldb-cmake-sanitized/lldb-build/tools/lldb/lit/lit-lldb-init /Users/buildslave/jenkins/workspace/lldb-cmake-sanitized/lldb-build/tools/lldb/lit/SymbolFile/Breakpad/Output/line-table-edgecases.out -o "target symbols add -s line-table-edgecases.out /Users/buildslave/jenkins/workspace/lldb-cmake-sanitized/llvm-project/lldb/lit/SymbolFile/Breakpad/Inputs/line-table-edgecases.syms" -s /Users/buildslave/jenkins/workspace/lldb-cmake-sanitized/llvm-project/lldb/lit/SymbolFile/Breakpad/line-table-edgecases.test -o exit | /Users/buildslave/jenkins/workspace/lldb-cmake-sanitized/lldb-build/bin/FileCheck /Users/buildslave/jenkins/workspace/lldb-cmake-sanitized/llvm-project/lldb/lit/SymbolFile/Breakpad/line-table-edgecases.test -- Exit Code: -9 Timeout: Reached timeout of 1200 seconds

Hide Details

Hide Details

******************** TIMEOUT: LLDB :: Settings/TestStopCommandSourceOnError.test (1718 of 1727) ******************** TEST 'LLDB :: Settings/TestStopCommandSourceOnError.test' FAILED ******************** Script: -- : 'RUN: at line 12'; /Users/buildslave/jenkins/workspace/lldb-cmake-sanitized/lldb-build/bin/lldb --no-lldbinit -S /Users/buildslave/jenkins/workspace/lldb-cmake-sanitized/lldb-build/tools/lldb/lit/lit-lldb-init -b -o 'settings set interpreter.stop-command-source-on-error false' -s /Users/buildslave/jenkins/workspace/lldb-cmake-sanitized/llvm-project/lldb/lit/Settings/Inputs/StopCommandSource.in | /Users/buildslave/jenkins/workspace/lldb-cmake-sanitized/lldb-build/bin/FileCheck /Users/buildslave/jenkins/workspace/lldb-cmake-sanitized/llvm-project/lldb/lit/Settings/TestStopCommandSourceOnError.test --check-prefix CONTINUE : 'RUN: at line 15'; /Users/buildslave/jenkins/workspace/lldb-cmake-sanitized/lldb-build/bin/lldb --no-lldbinit -S /Users/buildslave/jenkins/workspace/lldb-cmake-sanitized/lldb-build/tools/lldb/lit/lit-lldb-init -b -s /Users/buildslave/jenkins/workspace/lldb-cmake-sanitized/llvm-project/lldb/lit/Settings/Inputs/DontStopCommandSource.in -o 'bogus' -o 'print 111100000 + 11111' | /Users/buildslave/jenkins/workspace/lldb-cmake-sanitized/lldb-build/bin/FileCheck /Users/buildslave/jenkins/workspace/lldb-cmake-sanitized/llvm-project/lldb/lit/Settings/TestStopCommandSourceOnError.test --check-prefix STOP : 'RUN: at line 18'; /Users/buildslave/jenkins/workspace/lldb-cmake-sanitized/lldb-build/bin/lldb --no-lldbinit -S /Users/buildslave/jenkins/workspace/lldb-cmake-sanitized/lldb-build/tools/lldb/lit/lit-lldb-init -b -o 'settings set interpreter.stop-command-source-on-error false' -o 'bogus' -o 'print 123400000 + 56789' | /Users/buildslave/jenkins/workspace/lldb-cmake-sanitized/lldb-build/bin/FileCheck /Users/buildslave/jenkins/workspace/lldb-cmake-sanitized/llvm-project/lldb/lit/Settings/TestStopCommandSourceOnError.test --check-prefix STOP : 'RUN: at line 21'; /Users/buildslave/jenkins/workspace/lldb-cmake-sanitized/lldb-build/bin/lldb --no-lldbinit -S /Users/buildslave/jenkins/workspace/lldb-cmake-sanitized/lldb-build/tools/lldb/lit/lit-lldb-init -b -s /Users/buildslave/jenkins/workspace/lldb-cmake-sanitized/llvm-project/lldb/lit/Settings/Inputs/DontStopCommandSource.in | /Users/buildslave/jenkins/workspace/lldb-cmake-sanitized/lldb-build/bin/FileCheck /Users/buildslave/jenkins/workspace/lldb-cmake-sanitized/llvm-project/lldb/lit/Settings/TestStopCommandSourceOnError.test --check-prefix STOP : 'RUN: at line 24'; /Users/buildslave/jenkins/workspace/lldb-cmake-sanitized/lldb-build/bin/lldb --no-lldbinit -S /Users/buildslave/jenkins/workspace/lldb-cmake-sanitized/lldb-build/tools/lldb/lit/lit-lldb-init -b -o 'settings set interpreter.stop-command-source-on-error true' -s /Users/buildslave/jenkins/workspace/lldb-cmake-sanitized/llvm-project/lldb/lit/Settings/Inputs/DontStopCommandSource.in | /Users/buildslave/jenkins/workspace/lldb-cmake-sanitized/lldb-build/bin/FileCheck /Users/buildslave/jenkins/workspace/lldb-cmake-sanitized/llvm-project/lldb/lit/Settings/TestStopCommandSourceOnError.test --check-prefix STOP -- Exit Code: -9 Timeout: Reached timeout of 1200 seconds

Hide Details

Command Output (stderr): -- error: 'bogus' is not a valid command.

Hide Details

--

Hide Details

******************** TIMEOUT: LLDB :: Settings/TestModuleCacheSanity.test (1719 of 1727) ******************** TEST 'LLDB :: Settings/TestModuleCacheSanity.test' FAILED ******************** Script: -- : 'RUN: at line 3'; /Users/buildslave/jenkins/workspace/lldb-cmake-sanitized/lldb-build/bin/lldb --no-lldbinit -S /Users/buildslave/jenkins/workspace/lldb-cmake-sanitized/lldb-build/tools/lldb/lit/lit-lldb-init -o 'settings show symbols.clang-modules-cache-path' | /Users/buildslave/jenkins/workspace/lldb-cmake-sanitized/lldb-build/bin/FileCheck /Users/buildslave/jenkins/workspace/lldb-cmake-sanitized/llvm-project/lldb/lit/Settings/TestModuleCacheSanity.test -- Exit Code: -9 Timeout: Reached timeout of 1200 seconds

Hide Details

Hide Details

******************** TIMEOUT: LLDB :: SymbolFile/DWARF/dir-separator-no-comp-dir-relative-name.s (1720 of 1727) ******************** TEST 'LLDB :: SymbolFile/DWARF/dir-separator-no-comp-dir-relative-name.s' FAILED ******************** Script: -- : 'RUN: at line 7'; /Users/buildslave/jenkins/workspace/lldb-cmake-sanitized/lldb-build/bin/llvm-mc -triple x86_64-pc-linux /Users/buildslave/jenkins/workspace/lldb-cmake-sanitized/llvm-project/lldb/lit/SymbolFile/DWARF/dir-separator-no-comp-dir-relative-name.s -filetype=obj > /Users/buildslave/jenkins/workspace/lldb-cmake-sanitized/lldb-build/tools/lldb/lit/SymbolFile/DWARF/Output/dir-separator-no-comp-dir-relative-name.s.tmp.o : 'RUN: at line 8'; /Users/buildslave/jenkins/workspace/lldb-cmake-sanitized/lldb-build/bin/ld.lld /Users/buildslave/jenkins/workspace/lldb-cmake-sanitized/lldb-build/tools/lldb/lit/SymbolFile/DWARF/Output/dir-separator-no-comp-dir-relative-name.s.tmp.o -o /Users/buildslave/jenkins/workspace/lldb-cmake-sanitized/lldb-build/tools/lldb/lit/SymbolFile/DWARF/Output/dir-separator-no-comp-dir-relative-name.s.tmp -z separate-code : 'RUN: at line 9'; /Users/buildslave/jenkins/workspace/lldb-cmake-sanitized/lldb-build/bin/lldb --no-lldbinit -S /Users/buildslave/jenkins/workspace/lldb-cmake-sanitized/lldb-build/tools/lldb/lit/lit-lldb-init /Users/buildslave/jenkins/workspace/lldb-cmake-sanitized/lldb-build/tools/lldb/lit/SymbolFile/DWARF/Output/dir-separator-no-comp-dir-relative-name.s.tmp -s /Users/buildslave/jenkins/workspace/lldb-cmake-sanitized/llvm-project/lldb/lit/SymbolFile/DWARF/Inputs/dir-separator-no-comp-dir-relative-name.lldbinit -o exit | /Users/buildslave/jenkins/workspace/lldb-cmake-sanitized/lldb-build/bin/FileCheck /Users/buildslave/jenkins/workspace/lldb-cmake-sanitized/llvm-project/lldb/lit/SymbolFile/DWARF/dir-separator-no-comp-dir-relative-name.s -- Exit Code: -9 Timeout: Reached timeout of 1200 seconds

Hide Details

Hide Details

******************** TIMEOUT: LLDB :: SymbolFile/Breakpad/line-table-discontinuous-file-ids.test (1721 of 1727) ******************** TEST 'LLDB :: SymbolFile/Breakpad/line-table-discontinuous-file-ids.test' FAILED ******************** Script: -- : 'RUN: at line 3'; /Users/buildslave/jenkins/workspace/lldb-cmake-sanitized/lldb-build/bin/yaml2obj /Users/buildslave/jenkins/workspace/lldb-cmake-sanitized/llvm-project/lldb/lit/SymbolFile/Breakpad/Inputs/basic-elf.yaml > /Users/buildslave/jenkins/workspace/lldb-cmake-sanitized/lldb-build/tools/lldb/lit/SymbolFile/Breakpad/Output/line-table-discontinuous-file-ids.out : 'RUN: at line 4'; /Users/buildslave/jenkins/workspace/lldb-cmake-sanitized/lldb-build/bin/lldb --no-lldbinit -S /Users/buildslave/jenkins/workspace/lldb-cmake-sanitized/lldb-build/tools/lldb/lit/lit-lldb-init /Users/buildslave/jenkins/workspace/lldb-cmake-sanitized/lldb-build/tools/lldb/lit/SymbolFile/Breakpad/Output/line-table-discontinuous-file-ids.out -o "target symbols add -s line-table-discontinuous-file-ids.out /Users/buildslave/jenkins/workspace/lldb-cmake-sanitized/llvm-project/lldb/lit/SymbolFile/Breakpad/Inputs/line-table-discontinuous-file-ids.syms" -s /Users/buildslave/jenkins/workspace/lldb-cmake-sanitized/llvm-project/lldb/lit/SymbolFile/Breakpad/line-table-discontinuous-file-ids.test -o exit | /Users/buildslave/jenkins/workspace/lldb-cmake-sanitized/lldb-build/bin/FileCheck /Users/buildslave/jenkins/workspace/lldb-cmake-sanitized/llvm-project/lldb/lit/SymbolFile/Breakpad/line-table-discontinuous-file-ids.test -- Exit Code: -9 Timeout: Reached timeout of 1200 seconds

Hide Details

Hide Details

******************** TIMEOUT: LLDB :: SymbolFile/DWARF/debug_rnglists.s (1722 of 1727) ******************** TEST 'LLDB :: SymbolFile/DWARF/debug_rnglists.s' FAILED ******************** Script: -- : 'RUN: at line 3'; /Users/buildslave/jenkins/workspace/lldb-cmake-sanitized/lldb-build/bin/llvm-mc -triple=x86_64-pc-linux -filetype=obj /Users/buildslave/jenkins/workspace/lldb-cmake-sanitized/llvm-project/lldb/lit/SymbolFile/DWARF/debug_rnglists.s > /Users/buildslave/jenkins/workspace/lldb-cmake-sanitized/lldb-build/tools/lldb/lit/SymbolFile/DWARF/Output/debug_rnglists.s.tmp : 'RUN: at line 4'; /Users/buildslave/jenkins/workspace/lldb-cmake-sanitized/lldb-build/bin/lldb --no-lldbinit -S /Users/buildslave/jenkins/workspace/lldb-cmake-sanitized/lldb-build/tools/lldb/lit/lit-lldb-init /Users/buildslave/jenkins/workspace/lldb-cmake-sanitized/lldb-build/tools/lldb/lit/SymbolFile/DWARF/Output/debug_rnglists.s.tmp -o "image lookup -v -s lookup_rnglists" -o exit | /Users/buildslave/jenkins/workspace/lldb-cmake-sanitized/lldb-build/bin/FileCheck /Users/buildslave/jenkins/workspace/lldb-cmake-sanitized/llvm-project/lldb/lit/SymbolFile/DWARF/debug_rnglists.s -- Exit Code: -9 Timeout: Reached timeout of 1200 seconds

Hide Details

Hide Details

******************** TIMEOUT: LLDB :: SymbolFile/DWARF/debug-types-missing-signature.test (1723 of 1727) ******************** TEST 'LLDB :: SymbolFile/DWARF/debug-types-missing-signature.test' FAILED ******************** Script: -- : 'RUN: at line 3'; /Users/buildslave/jenkins/workspace/lldb-cmake-sanitized/lldb-build/bin/clang --driver-mode=g++ -isysroot /Applications/Xcode.app/Contents/Developer/Platforms/MacOSX.platform/Developer/SDKs/MacOSX.sdk -fmodules-cache-path=/Users/buildslave/jenkins/workspace/lldb-cmake-sanitized/lldb-build/tools/lldb/lldb-test-build.noindex/module-cache-clang -target x86_64-pc-linux /Users/buildslave/jenkins/workspace/lldb-cmake-sanitized/llvm-project/lldb/lit/SymbolFile/DWARF/Inputs/debug-types-basic.cpp -g -gdwarf-4 -fdebug-types-section -c -o /Users/buildslave/jenkins/workspace/lldb-cmake-sanitized/lldb-build/tools/lldb/lit/SymbolFile/DWARF/Output/debug-types-missing-signature.test.tmp.o : 'RUN: at line 5'; /Users/buildslave/jenkins/workspace/lldb-cmake-sanitized/lldb-build/bin/llvm-objcopy --remove-section=.debug_types /Users/buildslave/jenkins/workspace/lldb-cmake-sanitized/lldb-build/tools/lldb/lit/SymbolFile/DWARF/Output/debug-types-missing-signature.test.tmp.o /Users/buildslave/jenkins/workspace/lldb-cmake-sanitized/lldb-build/tools/lldb/lit/SymbolFile/DWARF/Output/debug-types-missing-signature.test.tmp : 'RUN: at line 8'; /Users/buildslave/jenkins/workspace/lldb-cmake-sanitized/lldb-build/bin/lldb --no-lldbinit -S /Users/buildslave/jenkins/workspace/lldb-cmake-sanitized/lldb-build/tools/lldb/lit/lit-lldb-init /Users/buildslave/jenkins/workspace/lldb-cmake-sanitized/lldb-build/tools/lldb/lit/SymbolFile/DWARF/Output/debug-types-missing-signature.test.tmp -b -o "type lookup A" | /Users/buildslave/jenkins/workspace/lldb-cmake-sanitized/lldb-build/bin/FileCheck --check-prefix=LOOKUPA /Users/buildslave/jenkins/workspace/lldb-cmake-sanitized/llvm-project/lldb/lit/SymbolFile/DWARF/debug-types-missing-signature.test : 'RUN: at line 11'; /Users/buildslave/jenkins/workspace/lldb-cmake-sanitized/lldb-build/bin/lldb --no-lldbinit -S /Users/buildslave/jenkins/workspace/lldb-cmake-sanitized/lldb-build/tools/lldb/lit/lit-lldb-init /Users/buildslave/jenkins/workspace/lldb-cmake-sanitized/lldb-build/tools/lldb/lit/SymbolFile/DWARF/Output/debug-types-missing-signature.test.tmp -b -o "type lookup E" | /Users/buildslave/jenkins/workspace/lldb-cmake-sanitized/lldb-build/bin/FileCheck --check-prefix=LOOKUPE /Users/buildslave/jenkins/workspace/lldb-cmake-sanitized/llvm-project/lldb/lit/SymbolFile/DWARF/debug-types-missing-signature.test : 'RUN: at line 14'; /Users/buildslave/jenkins/workspace/lldb-cmake-sanitized/lldb-build/bin/lldb --no-lldbinit -S /Users/buildslave/jenkins/workspace/lldb-cmake-sanitized/lldb-build/tools/lldb/lit/lit-lldb-init /Users/buildslave/jenkins/workspace/lldb-cmake-sanitized/lldb-build/tools/lldb/lit/SymbolFile/DWARF/Output/debug-types-missing-signature.test.tmp -b -o "type lookup EC" | /Users/buildslave/jenkins/workspace/lldb-cmake-sanitized/lldb-build/bin/FileCheck --check-prefix=LOOKUPEC /Users/buildslave/jenkins/workspace/lldb-cmake-sanitized/llvm-project/lldb/lit/SymbolFile/DWARF/debug-types-missing-signature.test : 'RUN: at line 17'; /Users/buildslave/jenkins/workspace/lldb-cmake-sanitized/lldb-build/bin/lldb --no-lldbinit -S /Users/buildslave/jenkins/workspace/lldb-cmake-sanitized/lldb-build/tools/lldb/lit/lit-lldb-init /Users/buildslave/jenkins/workspace/lldb-cmake-sanitized/lldb-build/tools/lldb/lit/SymbolFile/DWARF/Output/debug-types-missing-signature.test.tmp -b -o "print (E) 1" 2>&1 | /Users/buildslave/jenkins/workspace/lldb-cmake-sanitized/lldb-build/bin/FileCheck --check-prefix=PRINTE /Users/buildslave/jenkins/workspace/lldb-cmake-sanitized/llvm-project/lldb/lit/SymbolFile/DWARF/debug-types-missing-signature.test : 'RUN: at line 20'; /Users/buildslave/jenkins/workspace/lldb-cmake-sanitized/lldb-build/bin/lldb --no-lldbinit -S /Users/buildslave/jenkins/workspace/lldb-cmake-sanitized/lldb-build/tools/lldb/lit/lit-lldb-init /Users/buildslave/jenkins/workspace/lldb-cmake-sanitized/lldb-build/tools/lldb/lit/SymbolFile/DWARF/Output/debug-types-missing-signature.test.tmp -b -o "print (EC) 1" 2>&1 | /Users/buildslave/jenkins/workspace/lldb-cmake-sanitized/lldb-build/bin/FileCheck --check-prefix=PRINTEC /Users/buildslave/jenkins/workspace/lldb-cmake-sanitized/llvm-project/lldb/lit/SymbolFile/DWARF/debug-types-missing-signature.test : 'RUN: at line 23'; /Users/buildslave/jenkins/workspace/lldb-cmake-sanitized/lldb-build/bin/lldb --no-lldbinit -S /Users/buildslave/jenkins/workspace/lldb-cmake-sanitized/lldb-build/tools/lldb/lit/lit-lldb-init /Users/buildslave/jenkins/workspace/lldb-cmake-sanitized/lldb-build/tools/lldb/lit/SymbolFile/DWARF/Output/debug-types-missing-signature.test.tmp -b -o "target variable a e ec" | /Users/buildslave/jenkins/workspace/lldb-cmake-sanitized/lldb-build/bin/FileCheck --check-prefix=VARS /Users/buildslave/jenkins/workspace/lldb-cmake-sanitized/llvm-project/lldb/lit/SymbolFile/DWARF/debug-types-missing-signature.test -- Exit Code: -9 Timeout: Reached timeout of 1200 seconds

Hide Details

Command Output (stderr): -- clang-10: warning: argument unused during compilation: '-fmodules-cache-path=/Users/buildslave/jenkins/workspace/lldb-cmake-sanitized/lldb-build/tools/lldb/lldb-test-build.noindex/module-cache-clang' [-Wunused-command-line-argument]

Hide Details

--

Hide Details

******************** TIMEOUT: LLDB :: Settings/TestDisableColor.test (1724 of 1727) ******************** TEST 'LLDB :: Settings/TestDisableColor.test' FAILED ******************** Script: -- : 'RUN: at line 1'; /Users/buildslave/jenkins/workspace/lldb-cmake-sanitized/lldb-build/bin/lldb --no-lldbinit -S /Users/buildslave/jenkins/workspace/lldb-cmake-sanitized/lldb-build/tools/lldb/lit/lit-lldb-init -x -b -s /Users/buildslave/jenkins/workspace/lldb-cmake-sanitized/llvm-project/lldb/lit/Settings/TestDisableColor.test | /Users/buildslave/jenkins/workspace/lldb-cmake-sanitized/lldb-build/bin/FileCheck /Users/buildslave/jenkins/workspace/lldb-cmake-sanitized/llvm-project/lldb/lit/Settings/TestDisableColor.test -- Exit Code: -9 Timeout: Reached timeout of 1200 seconds

Hide Details

Hide Details

******************** TIMEOUT: LLDB :: SymbolFile/Breakpad/unwind-via-stack-win.test (1725 of 1727) ******************** TEST 'LLDB :: SymbolFile/Breakpad/unwind-via-stack-win.test' FAILED ******************** Script: -- : 'RUN: at line 1'; /Users/buildslave/jenkins/workspace/lldb-cmake-sanitized/lldb-build/bin/yaml2obj /Users/buildslave/jenkins/workspace/lldb-cmake-sanitized/llvm-project/lldb/lit/SymbolFile/Breakpad/Inputs/unwind-via-stack-win.yaml > /Users/buildslave/jenkins/workspace/lldb-cmake-sanitized/lldb-build/tools/lldb/lit/SymbolFile/Breakpad/Output/unwind-via-stack-win.test.tmp : 'RUN: at line 2'; /Users/buildslave/jenkins/workspace/lldb-cmake-sanitized/lldb-build/bin/lldb --no-lldbinit -S /Users/buildslave/jenkins/workspace/lldb-cmake-sanitized/lldb-build/tools/lldb/lit/lit-lldb-init -c /Users/buildslave/jenkins/workspace/lldb-cmake-sanitized/lldb-build/tools/lldb/lit/SymbolFile/Breakpad/Output/unwind-via-stack-win.test.tmp -o "target symbols add /Users/buildslave/jenkins/workspace/lldb-cmake-sanitized/llvm-project/lldb/lit/SymbolFile/Breakpad/Inputs/unwind-via-stack-win.syms" -s /Users/buildslave/jenkins/workspace/lldb-cmake-sanitized/llvm-project/lldb/lit/SymbolFile/Breakpad/unwind-via-stack-win.test -b | /Users/buildslave/jenkins/workspace/lldb-cmake-sanitized/lldb-build/bin/FileCheck /Users/buildslave/jenkins/workspace/lldb-cmake-sanitized/llvm-project/lldb/lit/SymbolFile/Breakpad/unwind-via-stack-win.test -- Exit Code: -9 Timeout: Reached timeout of 1200 seconds

Hide Details

Hide Details

******************** TIMEOUT: LLDB :: SymbolFile/Breakpad/unwind-via-stack-cfi.test (1726 of 1727) ******************** TEST 'LLDB :: SymbolFile/Breakpad/unwind-via-stack-cfi.test' FAILED ******************** Script: -- : 'RUN: at line 1'; /Users/buildslave/jenkins/workspace/lldb-cmake-sanitized/lldb-build/bin/yaml2obj /Users/buildslave/jenkins/workspace/lldb-cmake-sanitized/llvm-project/lldb/lit/SymbolFile/Breakpad/Inputs/unwind-via-stack-cfi.yaml > /Users/buildslave/jenkins/workspace/lldb-cmake-sanitized/lldb-build/tools/lldb/lit/SymbolFile/Breakpad/Output/unwind-via-stack-cfi.test.tmp : 'RUN: at line 2'; /Users/buildslave/jenkins/workspace/lldb-cmake-sanitized/lldb-build/bin/lldb --no-lldbinit -S /Users/buildslave/jenkins/workspace/lldb-cmake-sanitized/lldb-build/tools/lldb/lit/lit-lldb-init -c /Users/buildslave/jenkins/workspace/lldb-cmake-sanitized/lldb-build/tools/lldb/lit/SymbolFile/Breakpad/Output/unwind-via-stack-cfi.test.tmp -o "target symbols add /Users/buildslave/jenkins/workspace/lldb-cmake-sanitized/llvm-project/lldb/lit/SymbolFile/Breakpad/Inputs/unwind-via-stack-cfi.syms" -s /Users/buildslave/jenkins/workspace/lldb-cmake-sanitized/llvm-project/lldb/lit/SymbolFile/Breakpad/unwind-via-stack-cfi.test -b | /Users/buildslave/jenkins/workspace/lldb-cmake-sanitized/lldb-build/bin/FileCheck /Users/buildslave/jenkins/workspace/lldb-cmake-sanitized/llvm-project/lldb/lit/SymbolFile/Breakpad/unwind-via-stack-cfi.test -- Exit Code: -9 Timeout: Reached timeout of 1200 seconds

Hide Details

Hide Details

******************** TIMEOUT: LLDB :: Driver/TestNoUseColor.test (1727 of 1727) ******************** TEST 'LLDB :: Driver/TestNoUseColor.test' FAILED ******************** Script: -- : 'RUN: at line 1'; /Users/buildslave/jenkins/workspace/lldb-cmake-sanitized/lldb-build/bin/lldb --no-lldbinit -S /Users/buildslave/jenkins/workspace/lldb-cmake-sanitized/lldb-build/tools/lldb/lit/lit-lldb-init --no-use-color -s /Users/buildslave/jenkins/workspace/lldb-cmake-sanitized/llvm-project/lldb/lit/Driver/TestNoUseColor.test | /Users/buildslave/jenkins/workspace/lldb-cmake-sanitized/lldb-build/bin/FileCheck /Users/buildslave/jenkins/workspace/lldb-cmake-sanitized/llvm-project/lldb/lit/Driver/TestNoUseColor.test -- Exit Code: -9 Timeout: Reached timeout of 1200 seconds

Hide Details

Command Output (stderr): -- warning: ignoring unknown option: --no-use-color

Hide Details

--

Hide Details

******************** Testing Time: 2723.19s ******************** Failing Tests (140): lldb-Suite :: tools/lldb-server/commandline/TestStubSetSID.py lldb-Suite :: tools/lldb-server/TestLldbGdbServer.py lldb-Suite :: iohandler/completion/TestIOHandlerCompletion.py lldb-Suite :: lang/objc/objc-new-syntax/TestObjCNewSyntaxLiteral.py lldb-Suite :: lang/c/anonymous/TestAnonymous.py lldb-Suite :: commands/gui/basic/TestGuiBasic.py lldb-Suite :: types/TestIntegerTypesExpr.py lldb-Suite :: functionalities/inline-stepping/TestInlineStepping.py lldb-Suite :: functionalities/data-formatter/nsarraysynth/TestNSArraySynthetic.py LLDB :: Expr/TestIRMemoryMap.test lldb-Suite :: functionalities/gdb_remote_client/TestGDBRemoteLoad.py lldb-Suite :: lang/objc/modules-auto-import/TestModulesAutoImport.py lldb-Suite :: commands/expression/xvalue/TestXValuePrinting.py lldb-Suite :: commands/expression/test/TestExprs.py lldb-Suite :: functionalities/tail_call_frames/thread_step_out_message/TestArtificialFrameStepOutMessage.py lldb-Suite :: functionalities/dead-strip/TestDeadStrip.py lldb-Suite :: python_api/type/TestTypeList.py lldb-Suite :: lang/c/array_types/TestArrayTypes.py LLDB :: Minidump/fb-dump.test lldb-Suite :: lang/cpp/auto/TestCPPAuto.py lldb-Suite :: lang/objcxx/class-name-clash/TestNameClash.py lldb-Suite :: functionalities/gdb_remote_client/TestGDBRemoteClient.py lldb-Suite :: lang/objc/orderedset/TestOrderedSet.py lldb-Suite :: functionalities/data-formatter/data-formatter-objc/TestDataFormatterObjCExpr.py lldb-Suite :: lang/cpp/breakpoint-commands/TestCPPBreakpointCommands.py lldb-Suite :: lang/c/struct_types/TestStructTypes.py lldb-Suite :: functionalities/data-formatter/data-formatter-objc/TestDataFormatterObjCNSData.py lldb-Suite :: commands/command/script/TestCommandScript.py LLDB :: Commands/CommandScriptImmediateOutput/CommandScriptImmediateOutputConsole.test lldb-Suite :: functionalities/ubsan/basic/TestUbsanBasic.py lldb-Suite :: commands/expression/call-function/TestCallBuiltinFunction.py lldb-Suite :: lang/cpp/unique-types/TestUniqueTypes.py lldb-Unit :: Utility/./UtilityTests/StringListTest.SetSize lldb-Suite :: lang/objc/foundation/TestObjCMethodsString.py lldb-Suite :: tools/lldb-server/TestGdbRemoteThreadsInStopReply.py lldb-Suite :: types/TestDoubleTypes.py lldb-Suite :: python_api/lldbutil/iter/TestRegistersIterator.py lldb-Suite :: functionalities/data-formatter/data-formatter-stl/libcxx/optional/TestDataFormatterLibcxxOptional.py lldb-Suite :: functionalities/data-formatter/data-formatter-stl/libcxx/vbool/TestDataFormatterLibcxxVBool.py lldb-Suite :: python_api/function_symbol/TestDisasmAPI.py lldb-Suite :: functionalities/thread/concurrent_events/TestConcurrentCrashWithWatchpoint.py lldb-Suite :: lang/cpp/this/TestCPPThis.py lldb-Suite :: lang/objc/objc-property/TestObjCProperty.py lldb-Suite :: python_api/frame/TestFrames.py lldb-Suite :: lang/objc/modules-inline-functions/TestModulesInlineFunctions.py lldb-Suite :: python_api/process/TestProcessAPI.py lldb-Suite :: functionalities/breakpoint/move_nearest/TestMoveNearest.py lldb-Suite :: functionalities/data-formatter/data-formatter-stl/libcxx/atomic/TestLibCxxAtomic.py lldb-Suite :: commands/expression/radar_8638051/Test8638051.py LLDB :: Reproducer/TestDriverOptions.test lldb-Suite :: lang/cpp/inlines/TestInlines.py lldb-Suite :: functionalities/thread/concurrent_events/TestConcurrentTwoBreakpointsOneWatchpoint.py LLDB :: SymbolFile/DWARF/debug_loc.s lldb-Suite :: functionalities/breakpoint/step_over_breakpoint/TestStepOverBreakpoint.py lldb-Suite :: functionalities/data-formatter/data-formatter-stl/libcxx/list/loop/TestDataFormatterLibcxxListLoop.py LLDB :: Modules/ELF/PT_LOAD-overlap-PT_TLS.yaml lldb-Suite :: commands/process/attach/TestProcessAttach.py lldb-Suite :: python_api/breakpoint/TestBreakpointAPI.py lldb-Suite :: lang/cpp/wchar_t/TestCxxWCharT.py lldb-Suite :: lang/objc/objc-dyn-sbtype/TestObjCDynamicSBType.py lldb-Suite :: functionalities/data-formatter/data-formatter-objc/TestDataFormatterObjCKVO.py lldb-Suite :: commands/expression/import_builtin_fileid/TestImportBuiltinFileID.py lldb-Suite :: commands/expression/call-throws/TestCallThatThrows.py lldb-Suite :: functionalities/data-formatter/data-formatter-objc/TestDataFormatterObjCNSBundle.py lldb-Suite :: commands/watchpoints/watchpoint_events/TestWatchpointEvents.py lldb-Suite :: functionalities/asan/TestMemoryHistory.py lldb-Suite :: lang/objcxx/objcxx-ivar-vector/TestIvarVector.py lldb-Suite :: functionalities/float-display/TestFloatDisplay.py lldb-Suite :: macosx/thread-names/TestInterruptThreadNames.py lldb-Suite :: types/TestFloatTypesExpr.py lldb-Suite :: types/TestFloatTypes.py lldb-Suite :: commands/expression/persistent_ptr_update/TestPersistentPtrUpdate.py lldb-Suite :: lang/objc/rdar-10967107/TestRdar10967107.py lldb-Suite :: lang/objc/variadic_methods/TestVariadicMethods.py lldb-Suite :: lang/cpp/breakpoint_in_member_func_w_non_primitive_params/TestBreakpointInMemberFuncWNonPrimitiveParams.py lldb-Suite :: python_api/sbvalue_persist/TestSBValuePersist.py lldb-Unit :: Utility/./UtilityTests/FileSpecTest.FileAndDirectoryComponents lldb-Suite :: lang/cpp/modules-import/TestCXXModulesImport.py LLDB :: Driver/TestSingleQuote.test lldb-Suite :: python_api/objc_type/TestObjCType.py lldb-Suite :: functionalities/target_var/TestTargetVar.py LLDB :: SymbolFile/DWARF/split-dwarf-inlining.cpp lldb-Suite :: api/multiple-targets/TestMultipleTargets.py lldb-Suite :: lang/objc/objc-static-method-stripped/TestObjCStaticMethodStripped.py lldb-Suite :: commands/expression/unwind_expression/TestUnwindExpression.py lldb-Suite :: python_api/watchpoint/TestWatchpointIter.py lldb-Suite :: functionalities/thread/concurrent_events/TestConcurrentDelaySignalBreak.py lldb-Suite :: commands/expression/top-level/TestTopLevelExprs.py lldb-Suite :: commands/watchpoints/watchpoint_commands/command/TestWatchpointCommandLLDB.py lldb-Suite :: functionalities/param_entry_vals/basic_entry_values_x86_64/TestBasicEntryValuesX86_64.py lldb-Suite :: functionalities/type_completion/TestTypeCompletion.py lldb-Suite :: commands/expression/persistent_types/TestNestedPersistentTypes.py lldb-Suite :: commands/target/create-no-such-arch/TestNoSuchArch.py lldb-Suite :: commands/expression/call-overridden-method/TestCallOverriddenMethod.py lldb-Unit :: Utility/./UtilityTests/VMRange.CollectionContains lldb-Suite :: commands/frame/diagnose/complicated-expression/TestComplicatedExpression.py lldb-Suite :: functionalities/thread/concurrent_events/TestConcurrentNWatchNBreak.py lldb-Suite :: python_api/function_symbol/TestSymbolAPI.py LLDB :: SymbolFile/DWARF/find-variable-dwo.cpp lldb-Suite :: functionalities/step-avoids-no-debug/TestStepNoDebug.py lldb-Suite :: tools/lldb-server/TestGdbRemoteExpeditedRegisters.py lldb-Suite :: lang/cpp/class_static/TestStaticVariables.py lldb-Suite :: functionalities/breakpoint/breakpoint_locations/TestBreakpointLocations.py lldb-Suite :: functionalities/target-new-solib-notifications/TestModuleLoadedNotifys.py lldb-Suite :: functionalities/thread/concurrent_events/TestConcurrentDelayedCrashWithBreakpointSignal.py lldb-Suite :: functionalities/data-formatter/varscript_formatting/TestDataFormatterVarScriptFormatting.py lldb-Suite :: commands/watchpoints/watchpoint_set_command/TestWatchLocationWithWatchSet.py lldb-Suite :: functionalities/data-formatter/data-formatter-objc/TestDataFormatterObjCCF.py lldb-Suite :: functionalities/tail_call_frames/thread_step_out_or_return/TestSteppingOutWithArtificialFrames.py lldb-Suite :: functionalities/inferior-crashing/TestInferiorCrashing.py lldb-Suite :: functionalities/inferior-changed/TestInferiorChanged.py lldb-Suite :: commands/watchpoints/multiple_hits/TestMultipleHits.py lldb-Suite :: macosx/add-dsym/TestAddDsymMidExecutionCommand.py lldb-Suite :: commands/frame/diagnose/virtual-method-call/TestDiagnoseDereferenceVirtualMethodCall.py lldb-Suite :: python_api/class_members/TestSBTypeClassMembers.py lldb-Suite :: functionalities/data-formatter/data-formatter-stl/libcxx/multiset/TestDataFormatterLibcxxMultiSet.py lldb-Suite :: commands/command/nested_alias/TestNestedAlias.py lldb-Suite :: functionalities/tail_call_frames/ambiguous_tail_call_seq1/TestAmbiguousTailCallSeq1.py lldb-Suite :: commands/expression/rdar44436068/Test128BitsInteger.py lldb-Suite :: commands/expression/weak_symbols/TestWeakSymbols.py lldb-Suite :: functionalities/thread/concurrent_events/TestConcurrentSignalNWatchNBreak.py lldb-Suite :: types/TestDoubleTypesExpr.py lldb-Suite :: lang/c/local_variables/TestLocalVariables.py lldb-Suite :: functionalities/asan/TestReportData.py lldb-Suite :: lang/cpp/bool/TestCPPBool.py lldb-Suite :: functionalities/jitloader_gdb/TestJITLoaderGDB.py lldb-Suite :: functionalities/data-formatter/data-formatter-python-synth/TestDataFormatterPythonSynth.py lldb-Suite :: lang/objc/objc-ivar-protocols/TestIvarProtocols.py lldb-Suite :: functionalities/tsan/thread_leak/TestTsanThreadLeak.py lldb-Suite :: python_api/lldbutil/process/TestPrintStackTraces.py lldb-Suite :: lang/cpp/class_types/TestClassTypesDisassembly.py lldb-Suite :: lang/cpp/gmodules-templates/TestGModules.py lldb-Suite :: tools/lldb-server/register-reading/TestGdbRemoteGPacket.py lldb-Suite :: lang/cpp/call-function/TestCallCPPFunction.py lldb-Suite :: functionalities/data-formatter/data-formatter-cpp/TestDataFormatterCpp.py lldb-Suite :: lang/objc/unicode-string/TestUnicodeString.py lldb-Suite :: lang/objc/objc-static-method/TestObjCStaticMethod.py lldb-Suite :: lang/cpp/type_lookup/TestCppTypeLookup.py lldb-Suite :: lang/cpp/scope/TestCppScope.py lldb-Suite :: lang/objc/blocks/TestObjCIvarsInBlocks.py

Hide Details

******************** Unresolved Tests (9): lldb-Suite :: commands/expression/diagnostics/TestExprDiagnostics.py lldb-Suite :: lang/objc/foundation/TestObjCMethods2.py lldb-Suite :: functionalities/breakpoint/address_breakpoints/TestAddressBreakpoints.py lldb-Suite :: commands/register/register/intel_xtended_registers/mpx_bound_violation/TestBoundViolation.py lldb-Suite :: functionalities/darwin_log/filter/exact_match/category/TestDarwinLogFilterMatchCategory.py lldb-Suite :: functionalities/data-formatter/data-formatter-stl/libcxx/multimap/TestDataFormatterLibccMultiMap.py lldb-Suite :: functionalities/data-formatter/dump_dynamic/TestDumpDynamic.py lldb-Suite :: functionalities/thread/step_until/TestStepUntil.py lldb-Suite :: benchmarks/turnaround/TestCompileRunToBreakpointTurnaround.py

Hide Details

******************** Timed Out Tests (14): LLDB :: Reproducer/Modules/TestModuleCXX.test LLDB :: Settings/TestFrameFormatColor.test LLDB :: Process/TestEnvironment.test LLDB :: SymbolFile/Breakpad/line-table-edgecases.test LLDB :: Settings/TestStopCommandSourceOnError.test LLDB :: Settings/TestModuleCacheSanity.test LLDB :: SymbolFile/DWARF/dir-separator-no-comp-dir-relative-name.s LLDB :: SymbolFile/Breakpad/line-table-discontinuous-file-ids.test LLDB :: SymbolFile/DWARF/debug_rnglists.s LLDB :: SymbolFile/DWARF/debug-types-missing-signature.test LLDB :: Settings/TestDisableColor.test LLDB :: SymbolFile/Breakpad/unwind-via-stack-win.test LLDB :: SymbolFile/Breakpad/unwind-via-stack-cfi.test LLDB :: Driver/TestNoUseColor.test

Hide Details

Hide Details

Slowest Tests: -------------------------------------------------------------------------- 228.55s: lldb-Suite :: tools/lldb-server/TestLldbGdbServer.py 230.03s: lldb-Suite :: lang/cpp/enum_types/TestCPP11EnumTypes.py 231.22s: lldb-Suite :: api/multithreaded/TestMultithreaded.py 234.25s: lldb-Suite :: types/TestIntegerTypesExpr.py 388.20s: lldb-Suite :: types/TestIntegerTypes.py 694.13s: lldb-Suite :: lang/objc/foundation/TestFoundationDisassembly.py 1200.06s: LLDB :: Driver/TestNoUseColor.test 1200.06s: LLDB :: SymbolFile/Breakpad/unwind-via-stack-cfi.test 1200.07s: LLDB :: SymbolFile/Breakpad/unwind-via-stack-win.test 1200.07s: LLDB :: Settings/TestDisableColor.test 1200.07s: LLDB :: SymbolFile/DWARF/debug-types-missing-signature.test 1200.07s: LLDB :: SymbolFile/DWARF/debug_rnglists.s 1200.08s: LLDB :: SymbolFile/DWARF/dir-separator-no-comp-dir-relative-name.s 1200.08s: LLDB :: SymbolFile/Breakpad/line-table-discontinuous-file-ids.test 1200.08s: LLDB :: Settings/TestModuleCacheSanity.test 1200.09s: LLDB :: Process/TestEnvironment.test 1200.09s: LLDB :: SymbolFile/Breakpad/line-table-edgecases.test 1200.09s: LLDB :: Settings/TestStopCommandSourceOnError.test 1200.09s: LLDB :: Settings/TestFrameFormatColor.test 1200.10s: LLDB :: Reproducer/Modules/TestModuleCXX.test

Hide Details

Tests Times: -------------------------------------------------------------------------- [ Range ] :: [ Percentage ] :: [ Count ] -------------------------------------------------------------------------- [ 0s, 100s) :: [*************************************** ] :: [1686/1727] [ 100s, 200s) :: [ ] :: [ 19/1727] [ 200s, 300s) :: [ ] :: [ 6/1727] [ 300s, 400s) :: [ ] :: [ 0/1727] [ 400s, 500s) :: [ ] :: [ 1/1727] [ 500s, 600s) :: [ ] :: [ 0/1727] [ 600s, 700s) :: [ ] :: [ 0/1727] [ 700s, 800s) :: [ ] :: [ 1/1727] [ 800s, 900s) :: [ ] :: [ 0/1727] [ 900s,1000s) :: [ ] :: [ 0/1727] [1000s,1100s) :: [ ] :: [ 0/1727] [1100s,1200s) :: [ ] :: [ 0/1727] [1200s,1300s) :: [ ] :: [ 14/1727] Expected Passes : 1514 Expected Failures : 6 Unsupported Tests : 44 Unresolved Tests : 9 Unexpected Failures: 140 Individual Timeouts: 14 FAILED: tools/lldb/lit/CMakeFiles/check-lldb-lit cd /Users/buildslave/jenkins/workspace/lldb-cmake-sanitized/lldb-build/tools/lldb/lit && /usr/bin/python /Users/buildslave/jenkins/workspace/lldb-cmake-sanitized/lldb-build/./bin/llvm-lit -v --time-tests --shuffle --xunit-xml-output=/Users/buildslave/jenkins/workspace/lldb-cmake-sanitized/test/results.xml -v --timeout 1200 /Users/buildslave/jenkins/workspace/lldb-cmake-sanitized/lldb-build/tools/lldb/lit ninja: build stopped: subcommand failed. Command failed Command: ['/usr/bin/env', 'TERM=vt100', '/usr/local/bin/ninja', '-v', 'check-lldb'] [Pipeline] } [Pipeline] // timeout [Pipeline] } [Pipeline] // stage [Pipeline] stage [Pipeline] { (Declarative: Post Actions) [Pipeline] scanForIssues No credentials specified [Clang (LLVM based)] Sleeping for 5 seconds due to JENKINS-32191... [Clang (LLVM based)] Parsing console log (workspace: '/Users/buildslave/jenkins/workspace/lldb-cmake-sanitized') [Clang (LLVM based)] [-ERROR-] Can't resolve absolute paths for some files: [Clang (LLVM based)] [-ERROR-] - /Users/buildslave/jenkins/workspace/lldb-cmake-sanitized/lldb-build/Makefile.rules [Clang (LLVM based)] [-ERROR-] Can't create fingerprints for some files: [Clang (LLVM based)] [-ERROR-] - '/Users/buildslave/jenkins/workspace/lldb-cmake-sanitized/lldb-build/Makefile.rules', IO exception has been thrown: java.nio.file.NoSuchFileException: /Users/buildslave/jenkins/workspace/lldb-cmake-sanitized/lldb-build/Makefile.rules [Clang (LLVM based)] [-ERROR-] Git blame errors: [Clang (LLVM based)] [-ERROR-] - no blame results for request <lldb-build/Makefile.rules - [606]>.

Hide Details

[Clang (LLVM based)] [-ERROR-] Git blame errors: [Clang (LLVM based)] [-ERROR-] - no blame results for request <llvm-project/lldb/source/Plugins/ExpressionParser/Clang/ClangUserExpression.cpp - [584]>.

Hide Details

[Clang (LLVM based)] [-ERROR-] Git blame errors: [Clang (LLVM based)] [-ERROR-] - no blame results for request <llvm-project/lldb/packages/Python/lldbsuite/test/commands/expression/weak_symbols/Makefile - [15]>.

Hide Details

[Clang (LLVM based)] Post processing issues on 'green-dragon-23' with source code encoding 'UTF-8' [Clang (LLVM based)] Resolving absolute file names for all issues in workspace '/Users/buildslave/jenkins/workspace/lldb-cmake-sanitized' [Clang (LLVM based)] -> 0 resolved, 1 unresolved, 2 already resolved [Clang (LLVM based)] Copying affected files to Jenkins' build folder '/Users/Shared/Jenkins/Home/jobs/lldb-cmake-sanitized/builds/176/files-with-issues' [Clang (LLVM based)] -> 2 copied, 0 not in workspace, 1 not-found, 0 with I/O error [Clang (LLVM based)] Resolving module names from module definitions (build.xml, pom.xml, or Manifest.mf files) [Clang (LLVM based)] -> resolved module names for 3 issues [Clang (LLVM based)] Resolving package names (or namespaces) by parsing the affected files [Clang (LLVM based)] -> resolved package names of 3 affected files [Clang (LLVM based)] No filter has been set, publishing all 3 issues [Clang (LLVM based)] Creating fingerprints for all affected code blocks to track issues over different builds [Clang (LLVM based)] -> created fingerprints for 2 issues [Clang (LLVM based)] Invoking Git blamer to create author and commit information for all affected files [Clang (LLVM based)] GIT_COMMIT env = 'HEAD' [Clang (LLVM based)] Git working tree = '/Users/buildslave/jenkins/workspace/lldb-cmake-sanitized' [Clang (LLVM based)] Git commit ID = '447a47d472e9ad0a529c0920a0db6231506d3e91' [Clang (LLVM based)] Job workspace = '/Users/buildslave/jenkins/workspace/lldb-cmake-sanitized' [Clang (LLVM based)] Created blame requests for 3 files - invoking Git blame on agent for each of the requests [Clang (LLVM based)] -> blamed authors of issues in 3 files
[Pipeline] junit Recording test results [Pipeline] } [Pipeline] // stage [Pipeline] } [Pipeline] // withEnv [Pipeline] } [Pipeline] // node [Pipeline] End of Pipeline [BFA] Scanning build for known causes... > git rev-parse HEAD^{commit} # timeout=10 [BFA] Found failure cause(s): [BFA] Ninja target failed from category Compile [BFA] Regression test failed from category Test [BFA] Compile Error from category Compile [BFA] Done. 0s ERROR: script returned exit code 1 Finished: FAILURE