FailedConsole Output

Skipping 4,236 KB.. Full Log
5483138e9aabc204
LLDB library dir: /Users/buildslave/jenkins/workspace/lldb-cmake-sanitized/lldb-build/bin
LLDB import library dir: /Users/buildslave/jenkins/workspace/lldb-cmake-sanitized/lldb-build/bin
libstdcxx tests will not be run because: Don't know how to build with libstdcxx on macosx
Skipping following debug info categories: ['dwo']

Hide Details

Session logs for test failures/errors/unexpected successes will go into directory '/Users/buildslave/jenkins/workspace/lldb-cmake-sanitized/test/logs' Command invoked: /Users/buildslave/jenkins/workspace/lldb-cmake-sanitized/llvm-project/lldb/test/dotest.py --arch=x86_64 -s /Users/buildslave/jenkins/workspace/lldb-cmake-sanitized/lldb-build/lldb-test-traces -S nm -u CXXFLAGS -u CFLAGS --executable /Users/buildslave/jenkins/workspace/lldb-cmake-sanitized/lldb-build/./bin/lldb --dsymutil /Users/buildslave/jenkins/workspace/lldb-cmake-sanitized/lldb-build/./bin/dsymutil --filecheck /Users/buildslave/jenkins/workspace/lldb-cmake-sanitized/lldb-build/./bin/FileCheck -C /Users/buildslave/jenkins/workspace/lldb-cmake-sanitized/host-compiler/bin/clang --codesign-identity lldb_codesign --server /Users/buildslave/jenkins/workspace/lldb-cmake-sanitized/lldb-build/./bin/debugserver --arch x86_64 --build-dir /Users/buildslave/jenkins/workspace/lldb-cmake-sanitized/lldb-build/lldb-test-build.noindex -s=/Users/buildslave/jenkins/workspace/lldb-cmake-sanitized/test/logs -t --env TERM=vt100 --env LLVM_LIBS_DIR=/Users/buildslave/jenkins/workspace/lldb-cmake-sanitized/lldb-build/./lib --build-dir /Users/buildslave/jenkins/workspace/lldb-cmake-sanitized/lldb-build/tools/lldb/lldb-test-build.noindex --module-cache-dir /Users/buildslave/jenkins/workspace/lldb-cmake-sanitized/lldb-build/tools/lldb/lldb-test-build.noindex/module-cache-lldb /Users/buildslave/jenkins/workspace/lldb-cmake-sanitized/llvm-project/lldb/packages/Python/lldbsuite/test/tools/lldb-server/commandline -p TestStubSetSID.py Change dir to: /Users/buildslave/jenkins/workspace/lldb-cmake-sanitized/llvm-project/lldb/packages/Python/lldbsuite/test/tools/lldb-server/commandline runCmd: settings set symbols.enable-external-lookup false output:

Hide Details

runCmd: settings set plugin.process.gdb-remote.packet-timeout 60 output:

Hide Details

runCmd: settings set symbols.clang-modules-cache-path "/Users/buildslave/jenkins/workspace/lldb-cmake-sanitized/lldb-build/tools/lldb/lldb-test-build.noindex/module-cache-lldb" output:

Hide Details

runCmd: settings set use-color false output:

Hide Details

Adding tearDown hook: def shutdown_named_pipe(): # Close the pipe. try: named_pipe.close() except: print("failed to close named pipe") None

Hide Details

# Delete the pipe. try: os.remove(named_pipe_path) except: print("failed to delete named pipe: {}".format(named_pipe_path)) None

Hide Details

# Delete the temp directory. try: os.rmdir(temp_dir) except: print( "failed to delete temp dir: {}, directory contents: '{}'".format( temp_dir, os.listdir(temp_dir))) None

Hide Details

Hide Details

Adding tearDown hook: def cleanupSubprocesses(self): # Ensure any subprocesses are cleaned up for p in self.subprocesses: p.terminate() del p del self.subprocesses[:] # Ensure any forked processes are cleaned up for pid in self.forkedProcessPids: if os.path.exists("/proc/" + str(pid)): os.kill(pid, signal.SIGTERM)

Hide Details

Hide Details

Executing tearDown hook: def cleanupSubprocesses(self): # Ensure any subprocesses are cleaned up for p in self.subprocesses: p.terminate() del p del self.subprocesses[:] # Ensure any forked processes are cleaned up for pid in self.forkedProcessPids: if os.path.exists("/proc/" + str(pid)): os.kill(pid, signal.SIGTERM)

Hide Details

Hide Details

Executing tearDown hook: def shutdown_named_pipe(): # Close the pipe. try: named_pipe.close() except: print("failed to close named pipe") None

Hide Details

# Delete the pipe. try: os.remove(named_pipe_path) except: print("failed to delete named pipe: {}".format(named_pipe_path)) None

Hide Details

# Delete the temp directory. try: os.rmdir(temp_dir) except: print( "failed to delete temp dir: {}, directory contents: '{}'".format( temp_dir, os.listdir(temp_dir))) None

Hide Details

Hide Details

PASS: LLDB (/Users/buildslave/jenkins/workspace/lldb-cmake-sanitized/host-compiler/bin/clang-10-x86_64) :: test_sid_is_different_with_S_debugserver (TestStubSetSID.TestStubSetSIDTestCase) runCmd: settings set symbols.enable-external-lookup false output:

Hide Details

runCmd: settings set plugin.process.gdb-remote.packet-timeout 60 output:

Hide Details

runCmd: settings set symbols.clang-modules-cache-path "/Users/buildslave/jenkins/workspace/lldb-cmake-sanitized/lldb-build/tools/lldb/lldb-test-build.noindex/module-cache-lldb" output:

Hide Details

runCmd: settings set use-color false output:

Hide Details

UNSUPPORTED: LLDB (/Users/buildslave/jenkins/workspace/lldb-cmake-sanitized/host-compiler/bin/clang-10-x86_64) :: test_sid_is_different_with_S_llgs (TestStubSetSID.TestStubSetSIDTestCase) (llgs tests) runCmd: settings set symbols.enable-external-lookup false output:

Hide Details

runCmd: settings set plugin.process.gdb-remote.packet-timeout 60 output:

Hide Details

runCmd: settings set symbols.clang-modules-cache-path "/Users/buildslave/jenkins/workspace/lldb-cmake-sanitized/lldb-build/tools/lldb/lldb-test-build.noindex/module-cache-lldb" output:

Hide Details

runCmd: settings set use-color false output:

Hide Details

Adding tearDown hook: def shutdown_named_pipe(): # Close the pipe. try: named_pipe.close() except: print("failed to close named pipe") None

Hide Details

# Delete the pipe. try: os.remove(named_pipe_path) except: print("failed to delete named pipe: {}".format(named_pipe_path)) None

Hide Details

# Delete the temp directory. try: os.rmdir(temp_dir) except: print( "failed to delete temp dir: {}, directory contents: '{}'".format( temp_dir, os.listdir(temp_dir))) None

Hide Details

Hide Details

Adding tearDown hook: def cleanupSubprocesses(self): # Ensure any subprocesses are cleaned up for p in self.subprocesses: p.terminate() del p del self.subprocesses[:] # Ensure any forked processes are cleaned up for pid in self.forkedProcessPids: if os.path.exists("/proc/" + str(pid)): os.kill(pid, signal.SIGTERM)

Hide Details

Hide Details

Executing tearDown hook: def cleanupSubprocesses(self): # Ensure any subprocesses are cleaned up for p in self.subprocesses: p.terminate() del p del self.subprocesses[:] # Ensure any forked processes are cleaned up for pid in self.forkedProcessPids: if os.path.exists("/proc/" + str(pid)): os.kill(pid, signal.SIGTERM)

Hide Details

Hide Details

Executing tearDown hook: def shutdown_named_pipe(): # Close the pipe. try: named_pipe.close() except: print("failed to close named pipe") None

Hide Details

# Delete the pipe. try: os.remove(named_pipe_path) except: print("failed to delete named pipe: {}".format(named_pipe_path)) None

Hide Details

# Delete the temp directory. try: os.rmdir(temp_dir) except: print( "failed to delete temp dir: {}, directory contents: '{}'".format( temp_dir, os.listdir(temp_dir))) None

Hide Details

Hide Details

PASS: LLDB (/Users/buildslave/jenkins/workspace/lldb-cmake-sanitized/host-compiler/bin/clang-10-x86_64) :: test_sid_is_different_with_setsid_debugserver (TestStubSetSID.TestStubSetSIDTestCase) runCmd: settings set symbols.enable-external-lookup false output:

Hide Details

runCmd: settings set plugin.process.gdb-remote.packet-timeout 60 output:

Hide Details

runCmd: settings set symbols.clang-modules-cache-path "/Users/buildslave/jenkins/workspace/lldb-cmake-sanitized/lldb-build/tools/lldb/lldb-test-build.noindex/module-cache-lldb" output:

Hide Details

runCmd: settings set use-color false output:

Hide Details

UNSUPPORTED: LLDB (/Users/buildslave/jenkins/workspace/lldb-cmake-sanitized/host-compiler/bin/clang-10-x86_64) :: test_sid_is_different_with_setsid_llgs (TestStubSetSID.TestStubSetSIDTestCase) (llgs tests) runCmd: settings set symbols.enable-external-lookup false output:

Hide Details

runCmd: settings set plugin.process.gdb-remote.packet-timeout 60 output:

Hide Details

runCmd: settings set symbols.clang-modules-cache-path "/Users/buildslave/jenkins/workspace/lldb-cmake-sanitized/lldb-build/tools/lldb/lldb-test-build.noindex/module-cache-lldb" output:

Hide Details

runCmd: settings set use-color false output:

Hide Details

Adding tearDown hook: def shutdown_named_pipe(): # Close the pipe. try: named_pipe.close() except: print("failed to close named pipe") None

Hide Details

# Delete the pipe. try: os.remove(named_pipe_path) except: print("failed to delete named pipe: {}".format(named_pipe_path)) None

Hide Details

# Delete the temp directory. try: os.rmdir(temp_dir) except: print( "failed to delete temp dir: {}, directory contents: '{}'".format( temp_dir, os.listdir(temp_dir))) None

Hide Details

Hide Details

Adding tearDown hook: def cleanupSubprocesses(self): # Ensure any subprocesses are cleaned up for p in self.subprocesses: p.terminate() del p del self.subprocesses[:] # Ensure any forked processes are cleaned up for pid in self.forkedProcessPids: if os.path.exists("/proc/" + str(pid)): os.kill(pid, signal.SIGTERM)

Hide Details

Hide Details

FAIL: LLDB (/Users/buildslave/jenkins/workspace/lldb-cmake-sanitized/host-compiler/bin/clang-10-x86_64) :: test_sid_is_same_without_setsid_debugserver (TestStubSetSID.TestStubSetSIDTestCase) Executing tearDown hook: def cleanupSubprocesses(self): # Ensure any subprocesses are cleaned up for p in self.subprocesses: p.terminate() del p del self.subprocesses[:] # Ensure any forked processes are cleaned up for pid in self.forkedProcessPids: if os.path.exists("/proc/" + str(pid)): os.kill(pid, signal.SIGTERM)

Hide Details

Hide Details

Executing tearDown hook: def shutdown_named_pipe(): # Close the pipe. try: named_pipe.close() except: print("failed to close named pipe") None

Hide Details

# Delete the pipe. try: os.remove(named_pipe_path) except: print("failed to delete named pipe: {}".format(named_pipe_path)) None

Hide Details

# Delete the temp directory. try: os.rmdir(temp_dir) except: print( "failed to delete temp dir: {}, directory contents: '{}'".format( temp_dir, os.listdir(temp_dir))) None

Hide Details

Hide Details

runCmd: settings set symbols.enable-external-lookup false output:

Hide Details

runCmd: settings set plugin.process.gdb-remote.packet-timeout 60 output:

Hide Details

runCmd: settings set symbols.clang-modules-cache-path "/Users/buildslave/jenkins/workspace/lldb-cmake-sanitized/lldb-build/tools/lldb/lldb-test-build.noindex/module-cache-lldb" output:

Hide Details

runCmd: settings set use-color false output:

Hide Details

UNSUPPORTED: LLDB (/Users/buildslave/jenkins/workspace/lldb-cmake-sanitized/host-compiler/bin/clang-10-x86_64) :: test_sid_is_same_without_setsid_llgs (TestStubSetSID.TestStubSetSIDTestCase) (llgs tests) Restore dir to: /Users/buildslave/jenkins/workspace/lldb-cmake-sanitized/lldb-build/tools/lldb/lit ====================================================================== FAIL: test_sid_is_same_without_setsid_debugserver (TestStubSetSID.TestStubSetSIDTestCase) ---------------------------------------------------------------------- Traceback (most recent call last): File "/Users/buildslave/jenkins/workspace/lldb-cmake-sanitized/llvm-project/lldb/packages/Python/lldbsuite/test/decorators.py", line 141, in wrapper func(*args, **kwargs) File "/Users/buildslave/jenkins/workspace/lldb-cmake-sanitized/llvm-project/lldb/packages/Python/lldbsuite/test/decorators.py", line 141, in wrapper func(*args, **kwargs) File "/Users/buildslave/jenkins/workspace/lldb-cmake-sanitized/llvm-project/lldb/packages/Python/lldbsuite/test/tools/lldb-server/commandline/TestStubSetSID.py", line 48, in test_sid_is_same_without_setsid_debugserver self.sid_is_same_without_setsid() File "/Users/buildslave/jenkins/workspace/lldb-cmake-sanitized/llvm-project/lldb/packages/Python/lldbsuite/test/tools/lldb-server/commandline/TestStubSetSID.py", line 32, in sid_is_same_without_setsid stub_sid = self.get_stub_sid() File "/Users/buildslave/jenkins/workspace/lldb-cmake-sanitized/llvm-project/lldb/packages/Python/lldbsuite/test/tools/lldb-server/commandline/TestStubSetSID.py", line 26, in get_stub_sid server.pid, True)) AssertionError: False is not True Config=x86_64-/Users/buildslave/jenkins/workspace/lldb-cmake-sanitized/host-compiler/bin/clang-10 ---------------------------------------------------------------------- Ran 6 tests in 17.649s

Hide Details

RESULT: FAILED (2 passes, 1 failures, 0 errors, 3 skipped, 0 expected failures, 0 unexpected successes)

Hide Details

******************** PASS: lldb-Unit :: Utility/./UtilityTests/StringListTest.GetMaxStringLengthEqualSize (602 of 1727) PASS: lldb-Suite :: python_api/value/change_values/TestChangeValueAPI.py (603 of 1727) PASS: lldb-Suite :: python_api/hello_world/TestHelloWorld.py (604 of 1727) PASS: LLDB :: SymbolFile/DWARF/debug-types-dwarf5.s (605 of 1727) PASS: LLDB :: SymbolFile/DWARF/debug_ranges.s (606 of 1727) PASS: lldb-Unit :: Utility/./UtilityTests/UriParserTest.BracketedHostname (607 of 1727) PASS: lldb-Unit :: Host/./HostTests/NativeProcessProtocolTest.ReadMemoryWithoutTrap (608 of 1727) PASS: lldb-Unit :: ObjectFile/Breakpad/./ObjectFileBreakpadTests/Record.classify (609 of 1727) PASS: lldb-Unit :: Host/./HostTests/Host.WaitStatusFormat (610 of 1727) PASS: lldb-Unit :: Language/Highlighting/./HighlighterTests/HighlighterTest.ClangPPDirectives (611 of 1727) PASS: lldb-Suite :: commands/frame/select/TestFrameSelect.py (612 of 1727) PASS: lldb-Suite :: sample_test/TestSampleInlineTest.py (613 of 1727) PASS: lldb-Unit :: ScriptInterpreter/Python/./ScriptInterpreterPythonTests/PythonDataObjectsTest.TestInstanceNameResolutionNoDot (614 of 1727) PASS: lldb-Unit :: Utility/./UtilityTests/RangeTest.Copy (615 of 1727) PASS: lldb-Suite :: python_api/module_section/TestModuleAndSection.py (616 of 1727) PASS: LLDB :: SymbolFile/DWARF/debug-line-basic.s (617 of 1727) PASS: lldb-Unit :: Utility/./UtilityTests/StringExtractorTest.GetHexU8_Extra (618 of 1727) PASS: lldb-Suite :: functionalities/data-formatter/data-formatter-stl/libstdcpp/vector/TestDataFormatterStdVector.py (619 of 1727) PASS: lldb-Unit :: Utility/./UtilityTests/ReproducerTest.SetCapture (620 of 1727) PASS: lldb-Suite :: arm/emulation/TestEmulations.py (621 of 1727) PASS: LLDB :: SymbolFile/DWARF/dir-separator-no-comp-dir.s (622 of 1727) PASS: lldb-Unit :: Utility/./UtilityTests/StringListTest.AppendStringMove (623 of 1727) PASS: lldb-Suite :: lang/cpp/limit-debug-info/TestWithLimitDebugInfo.py (624 of 1727) PASS: lldb-Suite :: commands/expression/top-level/TestTopLevelExprs.py (625 of 1727) PASS: lldb-Unit :: ScriptInterpreter/Python/./ScriptInterpreterPythonTests/PythonDataObjectsTest.TestModuleNameResolutionNoDot (626 of 1727) PASS: LLDB :: Modules/ELF/netbsd-core-amd64.test (627 of 1727) PASS: lldb-Suite :: functionalities/unwind/sigtramp/TestSigtrampUnwind.py (628 of 1727) PASS: lldb-Suite :: functionalities/data-formatter/data-formatter-objc/TestDataFormatterObjCPlain.py (629 of 1727) PASS: lldb-Unit :: Utility/./UtilityTests/RegularExpression.CopyAssignment (630 of 1727) PASS: lldb-Unit :: UnwindAssembly/x86/./UnwindAssemblyx86Tests/Testx86AssemblyInspectionEngine.Testi386IgnoredRegisters (631 of 1727) PASS: lldb-Unit :: ScriptInterpreter/Python/./ScriptInterpreterPythonTests/PythonDataObjectsTest.TestPythonBoolean (632 of 1727) PASS: lldb-Suite :: lang/cpp/class-template-parameter-pack/TestClassTemplateParameterPack.py (633 of 1727) PASS: lldb-Suite :: functionalities/gdb_remote_client/TestNestedRegDefinitions.py (634 of 1727) PASS: lldb-Unit :: Utility/./UtilityTests/SerializationRountripTest.SerializeDeserializeCString (635 of 1727) PASS: LLDB :: SymbolFile/Breakpad/line-table-edgecases.test (636 of 1727) PASS: LLDB :: Settings/TestSettingsSet.test (637 of 1727) PASS: lldb-Unit :: Utility/./UtilityTests/AnsiTerminal.AtEnd (638 of 1727) PASS: lldb-Suite :: functionalities/inferior-changed/TestInferiorChanged.py (639 of 1727) PASS: lldb-Unit :: Utility/./UtilityTests/BinaryStreamTest.PutULEB128OneByte (640 of 1727) PASS: lldb-Unit :: Process/gdb-remote/./ProcessGdbRemoteTests/GDBRemoteCommunicationServerTest.SendErrorResponse_Status (641 of 1727) PASS: lldb-Suite :: functionalities/inline-stepping/TestInlineStepping.py (642 of 1727) UNSUPPORTED: LLDB :: SymbolFile/PDB/pointers.test (643 of 1727) PASS: lldb-Unit :: ObjectFile/Breakpad/./ObjectFileBreakpadTests/LineRecord.parse (644 of 1727) PASS: lldb-Unit :: Utility/./UtilityTests/StringExtractorTest.GetHexBytes (645 of 1727) PASS: lldb-Unit :: Utility/./UtilityTests/SerializationRountripTest.SerializeDeserializePod (646 of 1727) PASS: lldb-Unit :: Platform/./LLDBPlatformTests/PlatformDarwinTest.TestParseVersionBuildDir (647 of 1727) PASS: lldb-Unit :: Expression/./ExpressionTests/DiagnosticManagerTest.FixedExpression (648 of 1727) PASS: lldb-Unit :: Utility/./UtilityTests/OptionsWithRawTest.ArgsButNoLeadingDash (649 of 1727) PASS: lldb-Unit :: SymbolFile/NativePDB/./SymbolFileNativePDBTests/PDBFPOProgramToDWARFExpressionTests.UnsupportedRASearch (650 of 1727) PASS: lldb-Unit :: UnwindAssembly/x86/./UnwindAssemblyx86Tests/Testx86AssemblyInspectionEngine.TestPush0 (651 of 1727) PASS: lldb-Unit :: Process/minidump/./LLDBMinidumpTests/MinidumpParserTest.GetMemoryRegionInfoLinuxMaps (652 of 1727) PASS: LLDB :: Modules/ELF/PT_TLS-overlap-PT_LOAD.yaml (653 of 1727) PASS: lldb-Unit :: UnwindAssembly/x86/./UnwindAssemblyx86Tests/Testx86AssemblyInspectionEngine.Test32bitFramelessBigStackFrame (654 of 1727) PASS: lldb-Unit :: Utility/./UtilityTests/StringListTest.SplitIntoLinesSingleTrailingCR (655 of 1727) PASS: lldb-Suite :: commands/expression/import-std-module/shared_ptr-dbg-info-content/TestSharedPtrDbgInfoContent.py (656 of 1727) PASS: lldb-Unit :: Utility/./UtilityTests/Flags.AllSet (657 of 1727) PASS: lldb-Suite :: lang/objc/global_ptrs/TestGlobalObjects.py (658 of 1727) PASS: lldb-Unit :: Core/./LLDBCoreTests/UniqueCStringMap.NoDefaultConstructor (659 of 1727) PASS: lldb-Suite :: commands/process/attach/attach_denied/TestAttachDenied.py (660 of 1727) PASS: lldb-Suite :: commands/expression/completion/TestExprCompletion.py (661 of 1727) PASS: lldb-Unit :: Utility/./UtilityTests/StreamTest.ShiftOperatorStrings (662 of 1727) PASS: lldb-Suite :: functionalities/archives/TestBSDArchives.py (663 of 1727) PASS: lldb-Unit :: Host/./HostTests/FileSystemTest.Readable (664 of 1727) PASS: LLDB :: Modules/ELF/aarch64-relocations.yaml (665 of 1727) PASS: lldb-Suite :: functionalities/signal/TestSendSignal.py (666 of 1727) PASS: lldb-Suite :: lang/cpp/printf/TestPrintf.py (667 of 1727) PASS: lldb-Unit :: Utility/./UtilityTests/UriParserTest.Minimal (668 of 1727) PASS: lldb-Unit :: Utility/./UtilityTests/TimerTest.CategoryTimes2 (669 of 1727) PASS: lldb-Suite :: commands/expression/import-std-module/vector-basic/TestBasicVector.py (670 of 1727) PASS: lldb-Unit :: UnwindAssembly/x86/./UnwindAssemblyx86Tests/Testx86AssemblyInspectionEngine.TestPopR14 (671 of 1727) PASS: lldb-Unit :: Utility/./UtilityTests/StringListTest.InsertStringAtIndexStart (672 of 1727) PASS: lldb-Suite :: functionalities/darwin_log/filter/regex/activity-chain/TestDarwinLogFilterRegexActivityChain.py (673 of 1727) PASS: lldb-Unit :: Host/./HostTests/SocketTest.UDPGetConnectURI (674 of 1727) PASS: lldb-Suite :: commands/expression/issue_11588/Test11588.py (675 of 1727) PASS: lldb-Suite :: lang/cpp/call-function/TestCallCPPFunction.py (676 of 1727) PASS: LLDB :: Settings/TestFrameFormatColor.test (677 of 1727) PASS: lldb-Unit :: Target/./TargetTests/ModuleCacheTest.GetAndPutUuidExists (678 of 1727) PASS: lldb-Suite :: lang/c/const_variables/TestConstVariables.py (679 of 1727) PASS: LLDB :: SymbolFile/NativePDB/nested-types.cpp (680 of 1727) PASS: lldb-Suite :: commands/expression/vector_of_enums/TestVectorOfEnums.py (681 of 1727) PASS: LLDB :: SymbolFile/NativePDB/function-types-calling-conv.cpp (682 of 1727) PASS: lldb-Unit :: Utility/./UtilityTests/AnsiTerminal.WhiteSpace (683 of 1727) PASS: lldb-Unit :: Utility/./UtilityTests/StreamTest.ShiftOperatorPtr (684 of 1727) PASS: lldb-Unit :: Host/./HostTests/NativeProcessProtocolTest.SetBreakpointFailRead (685 of 1727) PASS: lldb-Unit :: UnwindAssembly/x86/./UnwindAssemblyx86Tests/Testx86AssemblyInspectionEngine.TestPopEDI (686 of 1727) PASS: lldb-Suite :: functionalities/tsan/thread_numbers/TestTsanThreadNumbers.py (687 of 1727) PASS: lldb-Suite :: lang/objc/modules-cache/TestClangModulesCache.py (688 of 1727) PASS: LLDB :: Modules/MachO/subsections.yaml (689 of 1727) PASS: LLDB :: Commands/CommandScriptImmediateOutput/CommandScriptImmediateOutputFile.test (690 of 1727) PASS: lldb-Unit :: Utility/./UtilityTests/ArgsTest.ReplaceArgumentAtIndexShort (691 of 1727) PASS: lldb-Unit :: UnwindAssembly/x86/./UnwindAssemblyx86Tests/Testx86AssemblyInspectionEngine.TestPushEAX (692 of 1727) PASS: lldb-Suite :: functionalities/data-formatter/data-formatter-stl/libcxx/list/TestDataFormatterLibcxxList.py (693 of 1727) PASS: lldb-Unit :: Utility/./UtilityTests/OptionsWithRawTest.EmptySuffix (694 of 1727) PASS: lldb-Suite :: lang/c/tls_globals/TestTlsGlobals.py (695 of 1727) PASS: lldb-Unit :: Utility/./UtilityTests/StreamTest.PutHex64ByteOrderBig (696 of 1727) PASS: lldb-Suite :: functionalities/breakpoint/debugbreak/TestDebugBreak.py (697 of 1727) PASS: lldb-Unit :: Utility/./UtilityTests/StreamTeeTest.Constructor2Streams (698 of 1727) PASS: LLDB :: SymbolFile/DWARF/debug_ranges-missing-section.s (699 of 1727) PASS: lldb-Suite :: functionalities/data-formatter/data-formatter-proper-plurals/TestFormattersOneIsSingular.py (700 of 1727) PASS: lldb-Unit :: Utility/./UtilityTests/RangeTest.Clear (701 of 1727) PASS: lldb-Suite :: functionalities/non-overlapping-index-variable-i/TestIndexVariable.py (702 of 1727) PASS: LLDB :: Driver/TestRepl.test (703 of 1727) PASS: lldb-Suite :: tools/lldb-server/TestGdbRemoteAuxvSupport.py (704 of 1727) PASS: LLDB :: SymbolFile/DWARF/debug-types-address-ranges.s (705 of 1727) PASS: lldb-Unit :: Utility/./UtilityTests/VMRange.ContainsAddr (706 of 1727) PASS: lldb-Unit :: Utility/./UtilityTests/ArgsTest.AppendArguments (707 of 1727) PASS: lldb-Suite :: python_api/interpreter/TestRunCommandInterpreterAPI.py (708 of 1727) PASS: lldb-Suite :: functionalities/fat_archives/TestFatArchives.py (709 of 1727) PASS: lldb-Suite :: commands/expression/import-std-module/deque-basic/TestBasicDeque.py (710 of 1727) PASS: lldb-Suite :: functionalities/breakpoint/breakpoint_names/TestBreakpointNames.py (711 of 1727) PASS: lldb-Suite :: lang/c/bitfields/TestBitfields.py (712 of 1727) PASS: lldb-Suite :: lang/cpp/const_this/TestConstThis.py (713 of 1727) PASS: lldb-Suite :: lang/objc/foundation/TestObjCMethodsNSArray.py (714 of 1727) PASS: lldb-Unit :: Utility/./UtilityTests/AnsiTerminal.Twice (715 of 1727) PASS: lldb-Unit :: Language/Highlighting/./HighlighterTests/HighlighterTest.ClangCursorPosBeforeOtherToken (716 of 1727) PASS: lldb-Suite :: lang/cpp/overloaded-functions/TestOverloadedFunctions.py (717 of 1727) PASS: lldb-Unit :: Utility/./UtilityTests/StringListTest.ForRangeEmpty (718 of 1727) PASS: lldb-Unit :: ScriptInterpreter/Python/./ScriptInterpreterPythonTests/PythonDataObjectsTest.TestPythonTupleToStructuredList (719 of 1727) PASS: lldb-Unit :: Core/./LLDBCoreTests/RichManglingContextTest.FromCxxMethodName (720 of 1727) PASS: lldb-Unit :: Utility/./UtilityTests/UriParserTest.SchemeHostSeparator4 (721 of 1727) PASS: lldb-Unit :: Utility/./UtilityTests/StringListTest.JoinEmpty (722 of 1727) PASS: LLDB :: Commands/CommandScriptImmediateOutput/CommandScriptImmediateOutputConsole.test (723 of 1727) PASS: lldb-Suite :: functionalities/target-new-solib-notifications/TestModuleLoadedNotifys.py (724 of 1727) PASS: lldb-Suite :: commands/expression/call-function/TestCallStdStringFunction.py (725 of 1727) PASS: LLDB :: SymbolFile/NativePDB/function-types-builtins.cpp (726 of 1727) PASS: lldb-Suite :: functionalities/signal/handle-segv/TestHandleSegv.py (727 of 1727) PASS: lldb-Suite :: commands/disassemble/basic/TestDisassembleBreakpoint.py (728 of 1727) PASS: lldb-Suite :: lang/objc/objc-struct-return/TestObjCStructReturn.py (729 of 1727) PASS: lldb-Unit :: Utility/./UtilityTests/StringExtractorTest.GetU32BigEndian (730 of 1727) PASS: lldb-Unit :: Utility/./UtilityTests/ScalarTest.ExtractBitfield (731 of 1727) PASS: lldb-Suite :: functionalities/data-formatter/data-formatter-stl/libstdcpp/unique_ptr/TestDataFormatterStdUniquePtr.py (732 of 1727) PASS: lldb-Unit :: Utility/./UtilityTests/Flags.AnyClear (733 of 1727) UNSUPPORTED: LLDB :: SymbolFile/PDB/class-layout.test (734 of 1727) PASS: lldb-Suite :: commands/expression/unicode-in-variable/TestUnicodeInVariable.py (735 of 1727) PASS: lldb-Unit :: Utility/./UtilityTests/RangeTest.Constructor (736 of 1727) PASS: lldb-Suite :: functionalities/step_scripted/TestStepScripted.py (737 of 1727) PASS: lldb-Suite :: functionalities/data-formatter/boolreference/TestFormattersBoolRefPtr.py (738 of 1727) PASS: lldb-Unit :: Utility/./UtilityTests/ArgsTest.TestTrailingBackslash (739 of 1727) PASS: LLDB :: SymbolFile/DWARF/find-basic-variable.cpp (740 of 1727) PASS: lldb-Suite :: functionalities/ubsan/basic/TestUbsanBasic.py (741 of 1727) PASS: lldb-Suite :: tools/lldb-server/commandline/TestStubReverseConnect.py (742 of 1727) PASS: lldb-Suite :: functionalities/data-formatter/user-format-vs-summary/TestUserFormatVsSummary.py (743 of 1727) PASS: lldb-Suite :: python_api/debugger/TestDebuggerAPI.py (744 of 1727) PASS: lldb-Unit :: Utility/./UtilityTests/StringLexerTest.Peek (745 of 1727) PASS: lldb-Suite :: lang/objc/objc-static-method-stripped/TestObjCStaticMethodStripped.py (746 of 1727) PASS: lldb-Suite :: functionalities/gdb_remote_client/TestRecognizeBreakpoint.py (747 of 1727) PASS: lldb-Unit :: Utility/./UtilityTests/OptionsWithRawTest.MultiWordSuffix (748 of 1727) PASS: lldb-Unit :: Utility/./UtilityTests/LogChannelEnabledTest.LogGetLogThread (749 of 1727) PASS: lldb-Suite :: commands/frame/diagnose/complicated-expression/TestComplicatedExpression.py (750 of 1727) PASS: lldb-Suite :: lang/objc/foundation/TestObjCMethodsString.py (751 of 1727) PASS: LLDB :: BuildScript/script-args.test (752 of 1727) PASS: lldb-Unit :: Process/minidump/./LLDBMinidumpTests/MinidumpParserTest.GetPidWindows (753 of 1727) PASS: lldb-Unit :: SymbolFile/NativePDB/./SymbolFileNativePDBTests/PDBFPOProgramToDWARFExpressionTests.InvalidAssignmentSingle (754 of 1727) PASS: lldb-Unit :: ScriptInterpreter/Python/./ScriptInterpreterPythonTests/PythonDataObjectsTest.TestPythonByteArray (755 of 1727) PASS: lldb-Unit :: Utility/./UtilityTests/FileSpecTest.EqualSeparator (756 of 1727) PASS: lldb-Unit :: Utility/./UtilityTests/StringExtractorTest.GetHexU8_Underflow2_NoEof (757 of 1727) PASS: lldb-Suite :: python_api/watchpoint/watchlocation/TestSetWatchlocation.py (758 of 1727) PASS: LLDB :: Reproducer/TestReuseDirectory.test (759 of 1727) PASS: lldb-Suite :: commands/apropos/basic/TestApropos.py (760 of 1727) PASS: lldb-Unit :: SymbolFile/NativePDB/./SymbolFileNativePDBTests/PDBFPOProgramToDWARFExpressionTests.UnresolvedRegisterReference (761 of 1727) PASS: lldb-Unit :: Utility/./UtilityTests/BinaryStreamTest.PutULEB128FiveBytes (762 of 1727) PASS: lldb-Suite :: types/TestFloatTypes.py (763 of 1727) PASS: lldb-Unit :: Utility/./UtilityTests/ScalarTest.Comparison (764 of 1727) PASS: lldb-Unit :: ScriptInterpreter/Python/./ScriptInterpreterPythonTests/PythonDataObjectsTest.TestPythonTupleValues (765 of 1727) PASS: lldb-Suite :: tools/lldb-server/TestGdbRemoteExpeditedRegisters.py (766 of 1727) PASS: lldb-Suite :: lang/objc/single-entry-dictionary/TestObjCSingleEntryDictionary.py (767 of 1727) PASS: lldb-Unit :: UnwindAssembly/x86/./UnwindAssemblyx86Tests/Testx86AssemblyInspectionEngine.TestSimplei386ugmented (768 of 1727) PASS: lldb-Unit :: Host/./HostTests/FileSystemTest.Exists (769 of 1727) PASS: lldb-Suite :: lang/objc/print-obj/TestPrintObj.py (770 of 1727) PASS: lldb-Unit :: Utility/./UtilityTests/StringListTest.PopBack (771 of 1727) PASS: lldb-Suite :: functionalities/darwin_log/format/TestDarwinLogMessageFormat.py (772 of 1727) PASS: lldb-Unit :: Utility/./UtilityTests/StringLexerTest.Next (773 of 1727) PASS: lldb-Suite :: lang/cpp/rvalue-references/TestRvalueReferences.py (774 of 1727) PASS: lldb-Unit :: UnwindAssembly/x86/./UnwindAssemblyx86Tests/Testx86AssemblyInspectionEngine.TestPushExtended (775 of 1727) PASS: lldb-Unit :: Host/./HostTests/NativeProcessProtocolTest.SetBreakpointFailWrite (776 of 1727) PASS: lldb-Unit :: Utility/./UtilityTests/StreamTeeTest.Write (777 of 1727) PASS: lldb-Suite :: python_api/watchpoint/TestWatchpointIgnoreCount.py (778 of 1727) PASS: lldb-Suite :: functionalities/data-formatter/compactvectors/TestCompactVectors.py (779 of 1727) PASS: lldb-Suite :: lang/cpp/nsimport/TestCppNsImport.py (780 of 1727) PASS: lldb-Unit :: Utility/./UtilityTests/RecordReplayTest.InstrumentedBarRef (781 of 1727) PASS: lldb-Unit :: Utility/./UtilityTests/UUIDTest.Validity (782 of 1727) PASS: lldb-Suite :: functionalities/data-formatter/data-formatter-stl/libstdcpp/string/TestDataFormatterStdString.py (783 of 1727) PASS: lldb-Unit :: SymbolFile/DWARF/./SymbolFileDWARFTests/SymbolFileDWARFTests.TestAbbrevOrder1Start5 (784 of 1727) PASS: LLDB :: Minidump/Windows/find-module.test (785 of 1727) PASS: lldb-Unit :: Host/./HostTests/SocketTest.TCPGetAddress (786 of 1727) PASS: lldb-Unit :: Utility/./UtilityTests/StreamTeeTest.GetStreamAtIndexOutOfBounds (787 of 1727) PASS: lldb-Suite :: functionalities/longjmp/TestLongjmp.py (788 of 1727) PASS: lldb-Unit :: Host/./HostTests/FileSystemTest.FileAndDirectoryComponents (789 of 1727) PASS: lldb-Unit :: ScriptInterpreter/Python/./ScriptInterpreterPythonTests/PythonExceptionStateTest.TestAutoRestoreChanged (790 of 1727) PASS: lldb-Unit :: Utility/./UtilityTests/TimerTest.CategoryTimesNested (791 of 1727) PASS: LLDB :: Quit/TestQuitExitCodeHex0.test (792 of 1727) UNSUPPORTED: LLDB :: BuildScript/toolchain-msvc.test (793 of 1727) PASS: lldb-Suite :: functionalities/ubsan/user-expression/TestUbsanUserExpression.py (794 of 1727) PASS: lldb-Suite :: functionalities/conditional_break/TestConditionalBreak.py (795 of 1727) PASS: lldb-Unit :: Utility/./UtilityTests/ArgsTest.TestUnknownEscape (796 of 1727) PASS: lldb-Suite :: lang/cpp/std-function-step-into-callable/TestStdFunctionStepIntoCallable.py (797 of 1727) PASS: lldb-Unit :: Utility/./UtilityTests/StatusTest.ErrorConversion (798 of 1727) PASS: lldb-Unit :: Utility/./UtilityTests/StreamTeeTest.Constructor1Stream (799 of 1727) PASS: LLDB :: SymbolFile/NativePDB/ast-types.cpp (800 of 1727) PASS: lldb-Suite :: functionalities/inferior-crashing/recursive-inferior/TestRecursiveInferior.py (801 of 1727) PASS: lldb-Suite :: lang/objc/modules-auto-import/TestModulesAutoImport.py (802 of 1727) PASS: lldb-Suite :: lang/cpp/extern_c/TestExternCSymbols.py (803 of 1727) PASS: lldb-Suite :: functionalities/data-formatter/data-formatter-synthtype/TestDataFormatterSynthType.py (804 of 1727) PASS: lldb-Suite :: lang/objc/objc-foundation-dictionary-empty/TestNSDictionary0.py (805 of 1727) PASS: LLDB :: Driver/TestFile.test (806 of 1727) PASS: lldb-Suite :: functionalities/thread/concurrent_events/TestConcurrentTwoBreakpointsOneDelaySignal.py (807 of 1727) PASS: lldb-Suite :: lang/c/stepping/TestStepAndBreakpoints.py (808 of 1727) PASS: lldb-Suite :: commands/source/info/TestSourceInfo.py (809 of 1727) PASS: lldb-Unit :: Utility/./UtilityTests/ConstStringTest.UpdateMangledCounterpart (810 of 1727) PASS: lldb-Suite :: lang/objc/blocks/TestObjCIvarsInBlocks.py (811 of 1727) PASS: lldb-Suite :: commands/expression/options/TestExprOptions.py (812 of 1727) PASS: lldb-Unit :: Symbol/./SymbolTests/TestClangASTContext.TestRemoveFastQualifiers (813 of 1727) PASS: lldb-Unit :: Utility/./UtilityTests/UUIDTest.RelationalOperators (814 of 1727) PASS: lldb-Unit :: UnwindAssembly/x86/./UnwindAssemblyx86Tests/Testx86AssemblyInspectionEngine.TestSimple32bitFrameFunction (815 of 1727) PASS: lldb-Suite :: functionalities/thread/step_out/TestThreadStepOut.py (816 of 1727) PASS: lldb-Unit :: SymbolFile/NativePDB/./SymbolFileNativePDBTests/PDBFPOProgramToDWARFExpressionTests.UnresolvedRegisterAssignmentReference (817 of 1727) UNSUPPORTED: LLDB :: SymbolFile/PDB/compilands.test (818 of 1727) PASS: lldb-Unit :: Utility/./UtilityTests/StringExtractorTest.GetHexU8_Exact (819 of 1727) PASS: lldb-Unit :: Target/./TargetTests/ExecutionContextTest.GetByteOrderProcess (820 of 1727) PASS: lldb-Suite :: lang/objcxx/hide-runtime-values/TestObjCXXHideRuntimeValues.py (821 of 1727) PASS: lldb-Unit :: Utility/./UtilityTests/ProcessInstanceInfo.Dump (822 of 1727) PASS: lldb-Unit :: Symbol/./SymbolTests/PostfixExpression.ParseFPOProgram (823 of 1727) PASS: lldb-Suite :: functionalities/type_lookup/TestTypeLookup.py (824 of 1727) PASS: lldb-Suite :: functionalities/thread/concurrent_events/TestConcurrentTwoBreakpointsOneSignal.py (825 of 1727) PASS: lldb-Suite :: tools/lldb-vscode/attach/TestVSCode_attach.py (826 of 1727) PASS: lldb-Unit :: Utility/./UtilityTests/ArgsTest.TestSingleArg (827 of 1727) PASS: LLDB :: SymbolFile/DWARF/debug-types-basic.test (828 of 1727) PASS: lldb-Suite :: commands/expression/import-std-module/vector-bool/TestBoolVector.py (829 of 1727) PASS: lldb-Unit :: UnwindAssembly/x86/./UnwindAssemblyx86Tests/Testx86AssemblyInspectionEngine.TestStackRealign32BitDisp_x86_64 (830 of 1727) PASS: lldb-Unit :: Host/./HostTests/HostInfoTest.GetHostname (831 of 1727) UNSUPPORTED: LLDB :: Unwind/unwind-plan-dwarf-dump.test (832 of 1727) PASS: lldb-Suite :: functionalities/thread/concurrent_events/TestConcurrentTwoBreakpointThreads.py (833 of 1727) PASS: lldb-Suite :: tools/lldb-server/TestGdbRemoteSingleStep.py (834 of 1727) PASS: lldb-Unit :: Utility/./UtilityTests/StringListTest.CopyListEmpty (835 of 1727) UNSUPPORTED: LLDB :: Register/x86-64-xmm16-write.test (836 of 1727) PASS: lldb-Unit :: Utility/./UtilityTests/ScalarTest.RightShiftOperator (837 of 1727) PASS: lldb-Suite :: commands/expression/import-std-module/unique_ptr-dbg-info-content/TestUniquePtrDbgInfoContent.py (838 of 1727) PASS: lldb-Unit :: Utility/./UtilityTests/ArchSpecTest.TestParseMachCPUDashSubtypeTripleExtra (839 of 1727) UNSUPPORTED: LLDB :: SymbolFile/NativePDB/typedefs.cpp (840 of 1727) PASS: LLDB :: Breakpoint/debug_rnglistx_rlex.test (841 of 1727) UNSUPPORTED: LLDB :: SymbolFile/PDB/type-quals.test (842 of 1727) PASS: lldb-Unit :: ObjectFile/ELF/./ObjectFileELFTests/ObjectFileELFTest.SectionsResolveConsistently (843 of 1727) PASS: lldb-Unit :: Utility/./UtilityTests/StreamTeeTest.SetStreamAtIndexOutOfBounds (844 of 1727) PASS: lldb-Unit :: Utility/./UtilityTests/StringListTest.JoinNonSpace (845 of 1727) PASS: lldb-Suite :: lang/cpp/chained-calls/TestCppChainedCalls.py (846 of 1727) PASS: lldb-Unit :: Process/minidump/./LLDBMinidumpTests/MinidumpParserTest.GetArchitecture (847 of 1727) PASS: lldb-Unit :: tools/lldb-server/tests/./LLDBServerTests/TestBase.DebugserverEnv (848 of 1727) PASS: LLDB :: SymbolFile/NativePDB/disassembly.cpp (849 of 1727) PASS: lldb-Unit :: Utility/./UtilityTests/RecordReplayTest.InstrumentedBarPtr (850 of 1727) UNSUPPORTED: LLDB :: SymbolFile/PDB/variables.test (851 of 1727) PASS: LLDB :: Commands/command-backtrace.test (852 of 1727) PASS: lldb-Unit :: Utility/./UtilityTests/Predicate.WaitForValueNotEqualTo (853 of 1727) PASS: lldb-Unit :: Interpreter/./InterpreterTests/OptionArgParserTest.toChar (854 of 1727) PASS: lldb-Suite :: python_api/sbvalue_const_addrof/TestSBValueConstAddrOf.py (855 of 1727) PASS: lldb-Unit :: UnwindAssembly/x86/./UnwindAssemblyx86Tests/Testx86AssemblyInspectionEngine.TestPushR14 (856 of 1727) UNSUPPORTED: LLDB :: SymbolFile/PDB/func-symbols.test (857 of 1727) PASS: lldb-Suite :: commands/watchpoints/watchpoint_size/TestWatchpointSizes.py (858 of 1727) PASS: lldb-Unit :: Core/./LLDBCoreTests/RichManglingContextTest.Basic (859 of 1727) PASS: lldb-Suite :: lang/cpp/frame-var-anon-unions/TestFrameVariableAnonymousUnions.py (860 of 1727) PASS: lldb-Suite :: commands/expression/pr35310/TestExprsBug35310.py (861 of 1727) PASS: LLDB :: Modules/PECOFF/uuid.yaml (862 of 1727) PASS: LLDB :: Modules/ELF/section-overlap.yaml (863 of 1727) PASS: lldb-Suite :: functionalities/postmortem/wow64_minidump/TestWow64MiniDump.py (864 of 1727) PASS: LLDB :: Modules/MachO/lc_build_version.yaml (865 of 1727) PASS: lldb-Unit :: Utility/./UtilityTests/CompletionRequest.Constructor (866 of 1727) PASS: lldb-Suite :: functionalities/abbreviation/TestCommonShortSpellings.py (867 of 1727) PASS: lldb-Unit :: Utility/./UtilityTests/TimerTest.CategoryTimes (868 of 1727) PASS: lldb-Suite :: linux/thread/create_during_instruction_step/TestCreateDuringInstructionStep.py (869 of 1727) PASS: lldb-Suite :: lang/cpp/exceptions/TestCPPExceptionBreakpoints.py (870 of 1727) PASS: lldb-Suite :: commands/frame/diagnose/virtual-method-call/TestDiagnoseDereferenceVirtualMethodCall.py (871 of 1727) PASS: lldb-Suite :: commands/frame/diagnose/dereference-this/TestDiagnoseDereferenceThis.py (872 of 1727) PASS: LLDB :: Settings/TestFrameFormatNoColor.test (873 of 1727) PASS: lldb-Unit :: Expression/./ExpressionTests/DWARFExpression.DW_OP_convert (874 of 1727) PASS: lldb-Suite :: functionalities/darwin_log/filter/regex/subsystem/TestDarwinLogFilterRegexSubsystem.py (875 of 1727) PASS: lldb-Unit :: Utility/./UtilityTests/ConstStringTest.MangledCounterpart (876 of 1727) PASS: lldb-Unit :: Host/./HostTests/MainLoopTest.ReadObject (877 of 1727) PASS: lldb-Suite :: lang/objc/exceptions/TestObjCExceptions.py (878 of 1727) PASS: lldb-Unit :: Utility/./UtilityTests/ProcessInstanceInfo.DumpTable (879 of 1727) PASS: lldb-Unit :: Utility/./UtilityTests/StringListTest.ShiftCString (880 of 1727) PASS: lldb-Unit :: Utility/./UtilityTests/TimeoutTest.Construction (881 of 1727) PASS: lldb-Suite :: commands/expression/radar_9531204/TestPrintfAfterUp.py (882 of 1727) PASS: lldb-Suite :: lang/c/local_variables/TestLocalVariables.py (883 of 1727) PASS: lldb-Unit :: Utility/./UtilityTests/StringExtractorTest.GetHexBytes_FullString (884 of 1727) PASS: lldb-Suite :: macosx/add-dsym/TestAddDsymMidExecutionCommand.py (885 of 1727) PASS: lldb-Unit :: Utility/./UtilityTests/VMRange.IsValid (886 of 1727) PASS: lldb-Unit :: Utility/./UtilityTests/StreamTest.PutULEB128 (887 of 1727) PASS: lldb-Suite :: lang/objc/rdar-11355592/TestRdar11355592.py (888 of 1727) PASS: lldb-Suite :: functionalities/data-formatter/data-formatter-stl/libcxx/vector/TestDataFormatterLibcxxVector.py (889 of 1727) PASS: lldb-Suite :: functionalities/value_md5_crash/TestValueMD5Crash.py (890 of 1727) PASS: lldb-Unit :: Utility/./UtilityTests/ScalarTest.CastOperations (891 of 1727) PASS: lldb-Unit :: ScriptInterpreter/Python/./ScriptInterpreterPythonTests/PythonDataObjectsTest.TestPythonBytes (892 of 1727) PASS: lldb-Suite :: lang/cpp/member-and-local-vars-with-same-name/TestMembersAndLocalsWithSameName.py (893 of 1727) PASS: lldb-Suite :: commands/expression/namespace_local_var_same_name_obj_c/TestNamespaceLocalVarSameNameObjC.py (894 of 1727) PASS: lldb-Unit :: ScriptInterpreter/Python/./ScriptInterpreterPythonTests/PythonExceptionStateTest.TestExceptionStateChecking (895 of 1727) PASS: lldb-Suite :: functionalities/breakpoint/breakpoint_ignore_count/TestBreakpointIgnoreCount.py (896 of 1727) PASS: lldb-Unit :: Language/Highlighting/./HighlighterTests/HighlighterTest.Colons (897 of 1727) PASS: lldb-Suite :: lang/objc/forward-decl/TestForwardDecl.py (898 of 1727) PASS: lldb-Suite :: commands/expression/ir-interpreter/TestIRInterpreter.py (899 of 1727) PASS: lldb-Unit :: Utility/./UtilityTests/FileSpecTest.FileAndDirectoryComponents (900 of 1727) PASS: lldb-Suite :: functionalities/tail_call_frames/thread_step_out_message/TestArtificialFrameStepOutMessage.py (901 of 1727) PASS: lldb-Unit :: Utility/./UtilityTests/StringListTest.Clear (902 of 1727) PASS: lldb-Unit :: Host/./HostTests/ConnectionFileDescriptorTest.TCPGetURIv4 (903 of 1727) PASS: lldb-Suite :: functionalities/breakpoint/inlined_breakpoints/TestInlinedBreakpoints.py (904 of 1727) PASS: lldb-Unit :: Utility/./UtilityTests/StringExtractorTest.GetHexBytesAvail_OddPair2 (905 of 1727) PASS: lldb-Unit :: Utility/./UtilityTests/RecordReplayTest.InstrumentedFoo (906 of 1727) PASS: lldb-Unit :: Utility/./UtilityTests/StringListTest.JoinSingle (907 of 1727) PASS: lldb-Suite :: functionalities/mtc/simple/TestMTCSimple.py (908 of 1727) PASS: lldb-Suite :: commands/disassemble/basic/TestFrameDisassemble.py (909 of 1727) PASS: lldb-Suite :: functionalities/data-formatter/nsarraysynth/TestNSArraySynthetic.py (910 of 1727) PASS: lldb-Unit :: ObjectFile/Breakpad/./ObjectFileBreakpadTests/ModuleRecord.parse (911 of 1727) PASS: lldb-Suite :: functionalities/thread/concurrent_events/TestConcurrentWatchpointDelayWatchpointOneBreakpoint.py (912 of 1727) PASS: lldb-Suite :: lang/cpp/gmodules/TestWithModuleDebugging.py (913 of 1727) PASS: lldb-Unit :: Utility/./UtilityTests/AnsiTerminal.Basic (914 of 1727) PASS: lldb-Suite :: functionalities/postmortem/mach-core/TestMachCore.py (915 of 1727) PASS: lldb-Suite :: tools/lldb-vscode/launch/TestVSCode_launch.py (916 of 1727) PASS: LLDB :: Modules/MachO/lc_build_version_notools.yaml (917 of 1727) PASS: lldb-Suite :: commands/expression/radar_8638051/Test8638051.py (918 of 1727) PASS: LLDB :: Modules/ELF/PT_LOAD-empty.yaml (919 of 1727) PASS: lldb-Unit :: Utility/./UtilityTests/Flags.Reset (920 of 1727) PASS: lldb-Unit :: ScriptInterpreter/Python/./ScriptInterpreterPythonTests/PythonDataObjectsTest.TestPythonIntegerToStructuredInteger (921 of 1727) PASS: lldb-Suite :: functionalities/memory/cache/TestMemoryCache.py (922 of 1727) PASS: lldb-Unit :: Utility/./UtilityTests/StreamTest.PutCharWhitespace (923 of 1727) PASS: lldb-Suite :: functionalities/data-formatter/data-formatter-stl/libcxx/list/loop/TestDataFormatterLibcxxListLoop.py (924 of 1727) PASS: lldb-Suite :: python_api/symbol-context/two-files/TestSymbolContextTwoFiles.py (925 of 1727) PASS: lldb-Unit :: Expression/./ExpressionTests/DiagnosticManagerTest.GetStringPreserveOrder (926 of 1727) PASS: LLDB :: Quit/TestQuitExitCode-30.test (927 of 1727) PASS: lldb-Unit :: Utility/./UtilityTests/ArgsTest.ReplaceArgumentAtIndexLonger (928 of 1727) PASS: LLDB :: Reproducer/Modules/TestModuleCXX.test (929 of 1727) PASS: lldb-Suite :: functionalities/testid/TestTestId.py (930 of 1727) PASS: lldb-Unit :: Process/minidump/./LLDBMinidumpTests/MinidumpParserTest.FindMemoryRangeWithFullMemoryMinidump (931 of 1727) PASS: lldb-Suite :: lang/c/blocks/TestBlocks.py (932 of 1727) PASS: lldb-Unit :: Utility/./UtilityTests/BinaryStreamTest.PutSLEB128One (933 of 1727) PASS: lldb-Suite :: functionalities/data-formatter/summary-string-onfail/Test-rdar-9974002.py (934 of 1727) PASS: lldb-Suite :: functionalities/data-formatter/data-formatter-objc/TestDataFormatterObjCNSURL.py (935 of 1727) PASS: lldb-Unit :: Process/gdb-remote/./ProcessGdbRemoteTests/GDBRemoteClientBaseTest.SendContinueAndAsyncPacket (936 of 1727) PASS: lldb-Unit :: Utility/./UtilityTests/AnsiTerminal.AtStart (937 of 1727) PASS: lldb-Unit :: SymbolFile/NativePDB/./SymbolFileNativePDBTests/PDBFPOProgramToDWARFExpressionTests.SingleAssignmentRegisterRef (938 of 1727) PASS: lldb-Unit :: Language/Highlighting/./HighlighterTests/HighlighterTest.HighlighterSelectionType (939 of 1727) PASS: lldb-Unit :: Utility/./UtilityTests/UserIDResolver.GetGroupName (940 of 1727) PASS: lldb-Unit :: UnwindAssembly/x86/./UnwindAssemblyx86Tests/Testx86AssemblyInspectionEngine.TestSpillRegToStackViaMOVx86_64 (941 of 1727) PASS: lldb-Suite :: lang/objc/foundation/TestSymbolTable.py (942 of 1727) PASS: lldb-Suite :: commands/process/launch-with-shellexpand/TestLaunchWithShellExpand.py (943 of 1727) PASS: lldb-Unit :: Utility/./UtilityTests/StatusTest.ErrorConstructor (944 of 1727) PASS: lldb-Unit :: Utility/./UtilityTests/UUIDTest.StringConverion (945 of 1727) PASS: lldb-Unit :: Utility/./UtilityTests/StringListTest.GetMaxStringLengthDecreasingSize (946 of 1727) PASS: lldb-Unit :: Utility/./UtilityTests/RangeDataVector.FindEntryThatContains (947 of 1727) PASS: lldb-Unit :: Utility/./UtilityTests/BinaryStreamTest.PutULEB128One (948 of 1727) PASS: lldb-Unit :: Utility/./UtilityTests/VMRange.Reset (949 of 1727) PASS: lldb-Unit :: Language/Highlighting/./HighlighterTests/HighlighterTest.ClangCursorPosEndOfLine (950 of 1727) PASS: lldb-Suite :: lang/cpp/breakpoint-commands/TestCPPBreakpointCommands.py (951 of 1727) PASS: lldb-Unit :: Utility/./UtilityTests/RangeTest.Equal (952 of 1727) PASS: LLDB :: Modules/ELF/PT_LOAD-overlap-section.yaml (953 of 1727) PASS: lldb-Suite :: functionalities/breakpoint/address_breakpoints/TestAddressBreakpoints.py (954 of 1727) PASS: lldb-Suite :: commands/expression/import-std-module/forward_list-dbg-info-content/TestDbgInfoContentForwardList.py (955 of 1727) PASS: lldb-Unit :: Utility/./UtilityTests/BinaryStreamTest.PutSLEB128SevenBytes (956 of 1727) PASS: LLDB :: Breakpoint/debug_rnglist_offset_pair.test (957 of 1727) PASS: lldb-Suite :: lang/c/shared_lib_stripped_symbols/TestSharedLibStrippedSymbols.py (958 of 1727) UNSUPPORTED: LLDB :: Breakpoint/ppc64-localentry.test (959 of 1727) PASS: lldb-Unit :: Utility/./UtilityTests/ReproducerTest.SetReplay (960 of 1727) PASS: lldb-Suite :: python_api/process/io/TestProcessIO.py (961 of 1727) PASS: lldb-Unit :: Utility/./UtilityTests/StringExtractorTest.DecodeHexU8_Underflow (962 of 1727) PASS: lldb-Unit :: Utility/./UtilityTests/BinaryStreamTest.PutSLEB128TwoBytes (963 of 1727) PASS: lldb-Unit :: Utility/./UtilityTests/StructuredDataTest.StringDump (964 of 1727) PASS: lldb-Unit :: Language/CPlusPlus/./LanguageCPlusPlusTests/CPlusPlusLanguage.CPlusPlusNameParser (965 of 1727) PASS: lldb-Suite :: lang/cpp/char1632_t/TestChar1632T.py (966 of 1727) PASS: lldb-Suite :: lang/cpp/unsigned_types/TestUnsignedTypes.py (967 of 1727) PASS: lldb-Unit :: SymbolFile/NativePDB/./SymbolFileNativePDBTests/PDBFPOProgramToDWARFExpressionTests.InvalidAssignmentMultiple (968 of 1727) PASS: lldb-Suite :: functionalities/breakpoint/breakpoint_conditions/TestBreakpointConditions.py (969 of 1727) PASS: lldb-Unit :: Utility/./UtilityTests/FileSpecTest.GetNormalizedPath (970 of 1727) PASS: lldb-Suite :: functionalities/thread/state/TestThreadStates.py (971 of 1727) PASS: lldb-Unit :: UnwindAssembly/x86/./UnwindAssemblyx86Tests/Testx86AssemblyInspectionEngine.TestAddRSP (972 of 1727) PASS: lldb-Suite :: benchmarks/continue/TestBenchmarkContinue.py (973 of 1727) PASS: lldb-Unit :: Utility/./UtilityTests/ArgsTest.TestSingleQuotedArgWithSpace (974 of 1727) PASS: lldb-Suite :: macosx/safe-to-func-call/TestSafeFuncCalls.py (975 of 1727) PASS: lldb-Suite :: lang/cpp/this/TestCPPThis.py (976 of 1727) PASS: lldb-Suite :: functionalities/thread/concurrent_events/TestConcurrentBreakpointDelayBreakpointOneSignal.py (977 of 1727) PASS: lldb-Unit :: Process/minidump/./LLDBMinidumpTests/MinidumpParserTest.GetArchitectureWindows (978 of 1727) PASS: lldb-Unit :: Host/./HostTests/FileSystemTest.MakeAbsolute (979 of 1727) PASS: lldb-Unit :: Utility/./UtilityTests/LogChannelTest.Disable (980 of 1727) PASS: lldb-Unit :: Process/gdb-remote/./ProcessGdbRemoteTests/GDBRemoteCommunicationClientTest.WriteRegister (981 of 1727) PASS: lldb-Suite :: functionalities/dead-strip/TestDeadStrip.py (982 of 1727) PASS: lldb-Unit :: Utility/./UtilityTests/StringListTest.SplitIntoLinesEmpty (983 of 1727) PASS: LLDB :: Reproducer/TestFileRepro.test (984 of 1727) PASS: lldb-Unit :: Interpreter/./InterpreterTests/CompletionTest.DirCompletionAbsolute (985 of 1727) PASS: LLDB :: Modules/ELF/short-build-id.yaml (986 of 1727) PASS: lldb-Unit :: Utility/./UtilityTests/VASprintfTest.EncodingError (987 of 1727) PASS: lldb-Suite :: lang/c/array_types/TestArrayTypes.py (988 of 1727) PASS: lldb-Suite :: terminal/TestSTTYBeforeAndAfter.py (989 of 1727) PASS: lldb-Unit :: Utility/./UtilityTests/RegularExpression.Valid (990 of 1727) PASS: lldb-Suite :: lang/cpp/static_methods/TestCPPStaticMethods.py (991 of 1727) PASS: lldb-Unit :: Utility/./UtilityTests/StringExtractorTest.GetHexBytes_Partial (992 of 1727) PASS: lldb-Unit :: Utility/./UtilityTests/VMRange.Clear (993 of 1727) PASS: lldb-Suite :: functionalities/breakpoint/address_breakpoints/TestBadAddressBreakpoints.py (994 of 1727) PASS: LLDB :: Modules/ELF/many-sections.s (995 of 1727) PASS: lldb-Suite :: lang/cpp/enum_types/TestCPP11EnumTypes.py (996 of 1727) PASS: lldb-Suite :: commands/command/script/TestCommandScript.py (997 of 1727) PASS: lldb-Suite :: python_api/event/TestEvents.py (998 of 1727) PASS: lldb-Unit :: ScriptInterpreter/Python/./ScriptInterpreterPythonTests/PythonDataObjectsTest.TestResetting (999 of 1727) PASS: lldb-Unit :: ScriptInterpreter/Python/./ScriptInterpreterPythonTests/PythonDataObjectsTest.TestPythonTupleInitializerList2 (1000 of 1727) PASS: lldb-Unit :: Utility/./UtilityTests/RangeTest.ContainsEndInclusiveInvalid (1001 of 1727) PASS: LLDB :: Reproducer/TestSynchronous.test (1002 of 1727) PASS: lldb-Suite :: commands/frame/diagnose/bad-reference/TestBadReference.py (1003 of 1727) PASS: lldb-Suite :: python_api/value/TestValueAPI.py (1004 of 1727) PASS: lldb-Unit :: Utility/./UtilityTests/CompletionRequest.DuplicateFilteringWithComments (1005 of 1727) PASS: lldb-Suite :: functionalities/data-formatter/data-formatter-stl/libcxx/bitset/TestDataFormatterLibcxxBitset.py (1006 of 1727) PASS: lldb-Suite :: lang/cpp/operator-overload/TestOperatorOverload.py (1007 of 1727) PASS: lldb-Suite :: functionalities/darwin_log/filter/exact_match/activity-chain/TestDarwinLogFilterMatchActivityChain.py (1008 of 1727) PASS: lldb-Suite :: functionalities/tail_call_frames/disambiguate_call_site/TestDisambiguateCallSite.py (1009 of 1727) PASS: lldb-Suite :: functionalities/thread/backtrace_all/TestBacktraceAll.py (1010 of 1727) PASS: lldb-Unit :: Utility/./UtilityTests/ArchSpecTest.MergeFromMachOUnknown (1011 of 1727) PASS: lldb-Unit :: Core/./LLDBCoreTests/RichManglingContextTest.SwitchProvider (1012 of 1727) PASS: lldb-Suite :: lang/objc/foundation/TestObjCMethods.py (1013 of 1727) PASS: lldb-Suite :: lang/objc/bitfield_ivars/TestBitfieldIvars.py (1014 of 1727) PASS: lldb-Suite :: lang/cpp/auto/TestCPPAuto.py (1015 of 1727) PASS: lldb-Suite :: python_api/frame/get-variables/TestGetVariables.py (1016 of 1727) PASS: lldb-Suite :: functionalities/data-formatter/synthupdate/TestSyntheticFilterRecompute.py (1017 of 1727) PASS: lldb-Unit :: Utility/./UtilityTests/NameMatchesTest.Ignore (1018 of 1727) PASS: lldb-Suite :: functionalities/tail_call_frames/thread_step_out_or_return/TestSteppingOutWithArtificialFrames.py (1019 of 1727) PASS: lldb-Suite :: functionalities/data-formatter/typedef_array/TestTypedefArray.py (1020 of 1727) PASS: lldb-Unit :: Symbol/./SymbolTests/DWARFCallFrameInfoTest.Basic_dwarf3 (1021 of 1727) PASS: lldb-Suite :: tools/lldb-server/TestGdbRemoteKill.py (1022 of 1727) PASS: LLDB :: Reproducer/Functionalities/TestDataFormatter.test (1023 of 1727) PASS: lldb-Suite :: lang/objc/objc-new-syntax/TestObjCNewSyntaxLiteral.py (1024 of 1727) PASS: lldb-Unit :: Utility/./UtilityTests/StringListTest.LongestCommonPrefixNoPrefix (1025 of 1727) PASS: lldb-Suite :: commands/expression/xvalue/TestXValuePrinting.py (1026 of 1727) PASS: lldb-Unit :: Utility/./UtilityTests/ArgsTest.GetQuotedCommandString (1027 of 1727) PASS: lldb-Suite :: functionalities/abbreviation/TestAbbreviations.py (1028 of 1727) PASS: LLDB :: SymbolFile/DWARF/dir-separator-no-comp-dir-relative-name.s (1029 of 1727) PASS: lldb-Suite :: functionalities/pre_run_dylibs/TestPreRunDylibs.py (1030 of 1727) PASS: lldb-Suite :: functionalities/gdb_remote_client/TestTargetXMLArch.py (1031 of 1727) PASS: LLDB :: Modules/ELF/netbsd-exec-8.99.30-amd64.yaml (1032 of 1727) PASS: lldb-Suite :: commands/expression/completion-in-lambda-and-unnnamed-class/TestCompletionInLambdaAndUnnamedClass.py (1033 of 1727) PASS: lldb-Unit :: Core/./LLDBCoreTests/MangledTest.NameIndexes_FindFunctionSymbols (1034 of 1727) PASS: LLDB :: SymbolFile/DWARF/childless-compile-unit.s (1035 of 1727) PASS: lldb-Suite :: functionalities/breakpoint/scripted_bkpt/TestScriptedResolver.py (1036 of 1727) PASS: lldb-Unit :: Utility/./UtilityTests/StringListTest.CopyList (1037 of 1727) PASS: LLDB :: Modules/ELF/compressed-sections.yaml (1038 of 1727) PASS: lldb-Unit :: Utility/./UtilityTests/RangeTest.ContainsEndInclusive (1039 of 1727) PASS: lldb-Suite :: commands/frame/language/TestGuessLanguage.py (1040 of 1727) PASS: lldb-Unit :: ScriptInterpreter/Python/./ScriptInterpreterPythonTests/PythonDataObjectsTest.TestPythonTupleSize (1041 of 1727) PASS: lldb-Suite :: python_api/formatters/TestFormattersSBAPI.py (1042 of 1727) PASS: lldb-Unit :: Utility/./UtilityTests/DataExtractorTest.GetBitfield (1043 of 1727) PASS: LLDB :: SymbolFile/NativePDB/break-by-line.cpp (1044 of 1727) PASS: LLDB :: SymbolFile/DWARF/debug-types-dwo-cross-reference.cpp (1045 of 1727) PASS: lldb-Unit :: Utility/./UtilityTests/BinaryStreamTest.PutSLEB128NineBytes (1046 of 1727) PASS: lldb-Suite :: python_api/frame/inlines/TestInlinedFrame.py (1047 of 1727) PASS: lldb-Suite :: functionalities/exec/TestExec.py (1048 of 1727) PASS: lldb-Unit :: UnwindAssembly/x86/./UnwindAssemblyx86Tests/Testx86AssemblyInspectionEngine.TestPushEBX (1049 of 1727) PASS: LLDB :: SymbolFile/DWARF/find-method.cpp (1050 of 1727) PASS: lldb-Suite :: commands/expression/calculator_mode/TestCalculatorMode.py (1051 of 1727) PASS: lldb-Suite :: macosx/load-kext/TestLoadKext.py (1052 of 1727) PASS: lldb-Unit :: Editline/./EditlineTests/EditlineTestFixture.EditlineReceivesSingleLineText (1053 of 1727) PASS: LLDB :: Breakpoint/single-file-split-dwarf.test (1054 of 1727) PASS: lldb-Suite :: functionalities/breakpoint/source_regexp/TestSourceRegexBreakpoints.py (1055 of 1727) PASS: lldb-Suite :: commands/expression/fixits/TestFixIts.py (1056 of 1727) PASS: lldb-Unit :: Symbol/./SymbolTests/LineEntryTest.GetSameLineContiguousAddressRangeNestedInline (1057 of 1727) PASS: lldb-Unit :: Utility/./UtilityTests/VASprintfTest.BufferResize (1058 of 1727) PASS: lldb-Suite :: lang/c/find_struct_type/TestFindStructTypes.py (1059 of 1727) PASS: lldb-Suite :: functionalities/thread/concurrent_events/TestConcurrentManyCrash.py (1060 of 1727) PASS: lldb-Unit :: Utility/./UtilityTests/StringListTest.GetMaxStringLengthIncreasingSize (1061 of 1727) PASS: lldb-Unit :: Utility/./UtilityTests/BinaryStreamTest.PutULEB128MaxValue (1062 of 1727) PASS: lldb-Unit :: Editline/./EditlineTests/EditlineTestFixture.EditlineReceivesMultiLineText (1063 of 1727) PASS: lldb-Suite :: functionalities/gdb_remote_client/TestNoWatchpointSupportInfo.py (1064 of 1727) PASS: lldb-Suite :: lang/objc/unicode-string/TestUnicodeString.py (1065 of 1727) PASS: lldb-Unit :: Utility/./UtilityTests/LogChannelTest.List (1066 of 1727) PASS: lldb-Unit :: Utility/./UtilityTests/ArchSpecTest.TestParseMachCPUDashSubtypeTripleSimple (1067 of 1727) PASS: lldb-Suite :: types/TestDoubleTypes.py (1068 of 1727) PASS: lldb-Suite :: functionalities/thread/concurrent_events/TestConcurrentSignalNWatchNBreak.py (1069 of 1727) PASS: lldb-Unit :: Utility/./UtilityTests/StringListTest.AppendList (1070 of 1727) PASS: lldb-Suite :: functionalities/avoids-fd-leak/TestFdLeak.py (1071 of 1727) PASS: lldb-Suite :: functionalities/thread/concurrent_events/TestConcurrentManyWatchpoints.py (1072 of 1727) PASS: lldb-Suite :: functionalities/breakpoint/breakpoint_command/TestBreakpointCommand.py (1073 of 1727) PASS: lldb-Suite :: lang/objc/foundation/TestObjectDescriptionAPI.py (1074 of 1727) PASS: lldb-Suite :: lang/objc/objc-optimized/TestObjcOptimized.py (1075 of 1727) PASS: lldb-Unit :: Expression/./ExpressionTests/DiagnosticManagerTest.GetStringNoDiags (1076 of 1727) PASS: lldb-Suite :: functionalities/data-formatter/format-propagation/TestFormatPropagation.py (1077 of 1727) PASS: lldb-Unit :: Utility/./UtilityTests/RangeTest.DefaultConstructor (1078 of 1727) PASS: LLDB :: SymbolFile/DWARF/gnu-style-compression.cpp (1079 of 1727) PASS: lldb-Unit :: Process/gdb-remote/./ProcessGdbRemoteTests/GDBRemoteCommunicationClientTest.GetModulesInfoInvalidResponse (1080 of 1727) PASS: lldb-Suite :: lang/c/conflicting-symbol/TestConflictingSymbol.py (1081 of 1727) PASS: LLDB :: SymbolFile/NativePDB/bitfields.cpp (1082 of 1727) PASS: lldb-Suite :: functionalities/unwind/noreturn/TestNoreturnUnwind.py (1083 of 1727) PASS: lldb-Unit :: Utility/./UtilityTests/StringListTest.Join (1084 of 1727) PASS: lldb-Suite :: lang/cpp/thread_local/TestThreadLocal.py (1085 of 1727) PASS: lldb-Suite :: commands/help/TestHelp.py (1086 of 1727) PASS: lldb-Suite :: functionalities/data-formatter/data-formatter-stl/libcxx/set/TestDataFormatterLibcxxSet.py (1087 of 1727) PASS: lldb-Unit :: ScriptInterpreter/Python/./ScriptInterpreterPythonTests/PythonExceptionStateTest.TestAutoRestoreSemantics (1088 of 1727) PASS: lldb-Suite :: api/listeners/TestListener.py (1089 of 1727) PASS: lldb-Suite :: commands/expression/formatters/TestFormatters.py (1090 of 1727) PASS: LLDB :: SymbolFile/NativePDB/s_constant.cpp (1091 of 1727) PASS: lldb-Suite :: commands/expression/no-deadlock/TestExprDoesntBlock.py (1092 of 1727) PASS: lldb-Unit :: Host/./HostTests/TaskPoolTest.AddTask (1093 of 1727) PASS: lldb-Suite :: commands/quit/TestQuit.py (1094 of 1727) PASS: lldb-Unit :: Expression/./ExpressionTests/DiagnosticManagerTest.PutStringMultiple (1095 of 1727) PASS: lldb-Unit :: Target/./TargetTests/PathMappingListTest.AbsoluteTests (1096 of 1727) PASS: lldb-Suite :: commands/expression/context-object-objc/TestContextObjectObjc.py (1097 of 1727) PASS: lldb-Suite :: python_api/disassemble-raw-data/TestDisassembleRawData.py (1098 of 1727) PASS: LLDB :: SymbolFile/DWARF/dir-separator-posix.s (1099 of 1727) PASS: lldb-Suite :: functionalities/data-formatter/data-formatter-disabling/TestDataFormatterDisabling.py (1100 of 1727) PASS: lldb-Suite :: lang/objc/objc-class-method/TestObjCClassMethod.py (1101 of 1727) PASS: lldb-Unit :: Utility/./UtilityTests/StringExtractorTest.InitEmpty (1102 of 1727) PASS: lldb-Unit :: Utility/./UtilityTests/ListenerTest.GetEventImmediate (1103 of 1727) PASS: lldb-Unit :: Utility/./UtilityTests/RangeTest.ContainsAddr (1104 of 1727) PASS: lldb-Unit :: Utility/./UtilityTests/RegularExpression.Match (1105 of 1727) PASS: lldb-Suite :: lang/cpp/class_static/TestStaticVariables.py (1106 of 1727) PASS: LLDB :: Driver/TestCommands.test (1107 of 1727) PASS: lldb-Suite :: functionalities/breakpoint/breakpoint_command/TestRegexpBreakCommand.py (1108 of 1727) PASS: LLDB :: Quit/TestQuitExitCode0.test (1109 of 1727) PASS: lldb-Suite :: lang/objcxx/class-name-clash/TestNameClash.py (1110 of 1727) PASS: lldb-Unit :: Expression/./ExpressionTests/DiagnosticManagerTest.PutStringSeverities (1111 of 1727) PASS: lldb-Unit :: Utility/./UtilityTests/UriParserTest.MinimalPath (1112 of 1727) PASS: lldb-Suite :: macosx/find-dsym/bundle-with-dot-in-filename/TestBundleWithDotInFilename.py (1113 of 1727) PASS: lldb-Unit :: Symbol/./SymbolTests/SymbolsTest.TerminateLocateExecutableSymbolFileForUnknownExecutableAndUnknownSymbolFile (1114 of 1727) PASS: lldb-Suite :: lang/objc/objc-baseclass-sbtype/TestObjCBaseClassSBType.py (1115 of 1727) PASS: lldb-Suite :: lang/cpp/class_types/TestClassTypesDisassembly.py (1116 of 1727) PASS: LLDB :: Unwind/trap_frame_sym_ctx.test (1117 of 1727) PASS: lldb-Unit :: Utility/./UtilityTests/StreamTest.PutHex16ByteOrderLittle (1118 of 1727) PASS: lldb-Unit :: Utility/./UtilityTests/StringExtractorTest.GetHexBytesAvail_Partial (1119 of 1727) PASS: lldb-Unit :: ScriptInterpreter/Python/./ScriptInterpreterPythonTests/PythonDataObjectsTest.TestExtractingUInt64ThroughStructuredData (1120 of 1727) PASS: lldb-Suite :: sanity/TestModuleCacheSanity.py (1121 of 1727) PASS: lldb-Unit :: Utility/./UtilityTests/StreamTest.PutBytesAsRawHex8ToLittleEndian (1122 of 1727) PASS: lldb-Suite :: lang/cpp/stl/TestStdCXXDisassembly.py (1123 of 1727) PASS: lldb-Suite :: functionalities/thread/concurrent_events/TestConcurrentSignalDelayBreak.py (1124 of 1727) PASS: lldb-Unit :: Utility/./UtilityTests/StringExtractorTest.GetNameColonValueContainsColon (1125 of 1727) PASS: lldb-Unit :: Utility/./UtilityTests/StreamTeeTest.GetStreamAtIndexOutOfBoundsEmpty (1126 of 1727) PASS: lldb-Suite :: commands/watchpoints/step_over_watchpoint/TestStepOverWatchpoint.py (1127 of 1727) PASS: lldb-Suite :: lang/objc/objc-ivar-protocols/TestIvarProtocols.py (1128 of 1727) PASS: lldb-Unit :: Utility/./UtilityTests/ArgsTest.TestSingleArgWithQuotedSpace (1129 of 1727) PASS: lldb-Suite :: benchmarks/libcxxmap/TestBenchmarkLibcxxMap.py (1130 of 1727) PASS: lldb-Unit :: Utility/./UtilityTests/BinaryStreamTest.PutSLEB128OneByte (1131 of 1727) PASS: lldb-Suite :: commands/expression/call-function/TestCallStopAndContinue.py (1132 of 1727) PASS: LLDB :: Breakpoint/implicit_const_form_support.test (1133 of 1727) PASS: lldb-Suite :: lang/cpp/diamond/TestDiamond.py (1134 of 1727) PASS: lldb-Unit :: UnwindAssembly/x86/./UnwindAssemblyx86Tests/Testx86AssemblyInspectionEngine.TestSpillRegToStackViaMOVi386 (1135 of 1727) PASS: lldb-Unit :: UnwindAssembly/x86/./UnwindAssemblyx86Tests/Testx86AssemblyInspectionEngine.TestPopRBP (1136 of 1727) PASS: lldb-Suite :: python_api/watchpoint/TestSetWatchpoint.py (1137 of 1727) PASS: lldb-Suite :: functionalities/data-formatter/data-formatter-categories/TestDataFormatterCategories.py (1138 of 1727) PASS: lldb-Suite :: commands/watchpoints/watchpoint_events/TestWatchpointEvents.py (1139 of 1727) PASS: lldb-Suite :: python_api/frame/TestFrames.py (1140 of 1727) PASS: lldb-Unit :: Utility/./UtilityTests/StringLexerTest.AdvanceIf (1141 of 1727) PASS: lldb-Unit :: SymbolFile/DWARF/./SymbolFileDWARFTests/SymbolFileDWARFTests.TestAbbrevValidAttrNullForm (1142 of 1727) PASS: lldb-Unit :: Utility/./UtilityTests/ArchSpecTest.Compatibility (1143 of 1727) PASS: lldb-Unit :: Utility/./UtilityTests/OptionsWithRawTest.SingleWhitespaceInput (1144 of 1727) PASS: lldb-Suite :: commands/expression/expr-in-syscall/TestExpressionInSyscall.py (1145 of 1727) PASS: lldb-Suite :: functionalities/data-formatter/ostypeformatting/TestFormattersOsType.py (1146 of 1727) PASS: lldb-Suite :: lang/cpp/namespace_definitions/TestNamespaceDefinitions.py (1147 of 1727) PASS: LLDB :: SymbolFile/NativePDB/globals-fundamental.cpp (1148 of 1727) PASS: lldb-Suite :: macosx/version_zero/TestGetVersionZeroVersion.py (1149 of 1727) UNSUPPORTED: LLDB :: SymbolFile/NativePDB/stack_unwinding01.cpp (1150 of 1727) PASS: lldb-Unit :: Process/minidump/./LLDBMinidumpTests/MinidumpParserTest.GetThreadContext_x86_64 (1151 of 1727) PASS: lldb-Suite :: python_api/sbtype_typeclass/TestSBTypeTypeClass.py (1152 of 1727) PASS: LLDB :: SymbolFile/NativePDB/function-types-classes.cpp (1153 of 1727) PASS: lldb-Unit :: Utility/./UtilityTests/ArgsTest.DoubleQuotedItem (1154 of 1727) PASS: lldb-Suite :: lang/c/function_types/TestFunctionTypes.py (1155 of 1727) PASS: lldb-Suite :: commands/register/register/intel_xtended_registers/mpx_bound_violation/TestBoundViolation.py (1156 of 1727) PASS: lldb-Suite :: functionalities/data-formatter/data-formatter-ptr-to-array/TestPtrToArrayFormatting.py (1157 of 1727) PASS: lldb-Unit :: Utility/./UtilityTests/RangeTest.SlideZero (1158 of 1727) PASS: lldb-Unit :: Interpreter/./InterpreterTests/CompletionTest.DirCompletionUsername (1159 of 1727) PASS: lldb-Unit :: Utility/./UtilityTests/OptionsWithRawTest.SingleWordSuffix (1160 of 1727) PASS: LLDB :: SymbolFile/DWARF/debug_loc.s (1161 of 1727) PASS: lldb-Unit :: SymbolFile/DWARF/./SymbolFileDWARFTests/SymbolFileDWARFTests.TestAbbrevNullAttrValidForm (1162 of 1727) PASS: LLDB :: SymbolFile/NativePDB/source-list.cpp (1163 of 1727) PASS: LLDB :: Modules/PECOFF/export-dllfunc.yaml (1164 of 1727) PASS: LLDB :: Commands/command-regex-delete.test (1165 of 1727) PASS: lldb-Suite :: arm/breakpoint-thumb-codesection/TestBreakpointThumbCodesection.py (1166 of 1727) PASS: lldb-Suite :: functionalities/data-formatter/refpointer-recursion/TestDataFormatterRefPtrRecursion.py (1167 of 1727) PASS: lldb-Suite :: commands/expression/import-std-module/basic/TestImportStdModule.py (1168 of 1727) UNSUPPORTED: LLDB :: Register/x86-ymm-write.test (1169 of 1727) PASS: lldb-Suite :: functionalities/data-formatter/type_summary_list_script/TestTypeSummaryListScript.py (1170 of 1727) PASS: lldb-Suite :: commands/expression/persistent_types/TestNestedPersistentTypes.py (1171 of 1727) PASS: LLDB :: SymbolFile/DWARF/debug_aranges-empty-section.s (1172 of 1727) PASS: LLDB :: Settings/TestSettingsWrite.test (1173 of 1727) PASS: lldb-Suite :: commands/expression/persist_objc_pointeetype/TestPersistObjCPointeeType.py (1174 of 1727) PASS: lldb-Unit :: Utility/./UtilityTests/FileSpecTest.AppendPathComponent (1175 of 1727) PASS: lldb-Suite :: lang/cpp/namespace/TestNamespaceLookup.py (1176 of 1727) PASS: lldb-Unit :: UnwindAssembly/x86/./UnwindAssemblyx86Tests/Testx86AssemblyInspectionEngine.Test32BitOnlyInstruction (1177 of 1727) PASS: lldb-Suite :: functionalities/postmortem/elf-core/thread_crash/TestLinuxCoreThreads.py (1178 of 1727) PASS: lldb-Unit :: ScriptInterpreter/Python/./ScriptInterpreterPythonTests/PythonExceptionStateTest.TestAcquisitionSemantics (1179 of 1727) PASS: LLDB :: SymbolFile/DWARF/split-dwarf-multiple-cu.ll (1180 of 1727) PASS: LLDB :: SymbolFile/Breakpad/symtab.test (1181 of 1727) PASS: lldb-Suite :: functionalities/gdb_remote_client/TestArmRegisterDefinition.py (1182 of 1727) PASS: lldb-Unit :: Signals/./SignalsTests/UnixSignalsTest.Iteration (1183 of 1727) PASS: lldb-Unit :: Utility/./UtilityTests/BinaryStreamTest.PutSLEB128EightBytes (1184 of 1727) FAIL: lldb-Suite :: functionalities/gdb_remote_client/TestGDBRemoteClient.py (1185 of 1727) ******************** TEST 'lldb-Suite :: functionalities/gdb_remote_client/TestGDBRemoteClient.py' FAILED ******************** lldb version 10.0.99 (http://labmaster3.local/git/llvm-project.git revision ae685e7aab7f278cf197b8b1b1ccf76a6e884682) clang revision 172e8a7a5de1c5aa110272da5483138e9aabc204 llvm revision 172e8a7a5de1c5aa110272da5483138e9aabc204 LLDB library dir: /Users/buildslave/jenkins/workspace/lldb-cmake-sanitized/lldb-build/bin LLDB import library dir: /Users/buildslave/jenkins/workspace/lldb-cmake-sanitized/lldb-build/bin libstdcxx tests will not be run because: Don't know how to build with libstdcxx on macosx Skipping following debug info categories: ['dwo']

Hide Details

Session logs for test failures/errors/unexpected successes will go into directory '/Users/buildslave/jenkins/workspace/lldb-cmake-sanitized/test/logs' Command invoked: /Users/buildslave/jenkins/workspace/lldb-cmake-sanitized/llvm-project/lldb/test/dotest.py --arch=x86_64 -s /Users/buildslave/jenkins/workspace/lldb-cmake-sanitized/lldb-build/lldb-test-traces -S nm -u CXXFLAGS -u CFLAGS --executable /Users/buildslave/jenkins/workspace/lldb-cmake-sanitized/lldb-build/./bin/lldb --dsymutil /Users/buildslave/jenkins/workspace/lldb-cmake-sanitized/lldb-build/./bin/dsymutil --filecheck /Users/buildslave/jenkins/workspace/lldb-cmake-sanitized/lldb-build/./bin/FileCheck -C /Users/buildslave/jenkins/workspace/lldb-cmake-sanitized/host-compiler/bin/clang --codesign-identity lldb_codesign --server /Users/buildslave/jenkins/workspace/lldb-cmake-sanitized/lldb-build/./bin/debugserver --arch x86_64 --build-dir /Users/buildslave/jenkins/workspace/lldb-cmake-sanitized/lldb-build/lldb-test-build.noindex -s=/Users/buildslave/jenkins/workspace/lldb-cmake-sanitized/test/logs -t --env TERM=vt100 --env LLVM_LIBS_DIR=/Users/buildslave/jenkins/workspace/lldb-cmake-sanitized/lldb-build/./lib --build-dir /Users/buildslave/jenkins/workspace/lldb-cmake-sanitized/lldb-build/tools/lldb/lldb-test-build.noindex --module-cache-dir /Users/buildslave/jenkins/workspace/lldb-cmake-sanitized/lldb-build/tools/lldb/lldb-test-build.noindex/module-cache-lldb /Users/buildslave/jenkins/workspace/lldb-cmake-sanitized/llvm-project/lldb/packages/Python/lldbsuite/test/functionalities/gdb_remote_client -p TestGDBRemoteClient.py Change dir to: /Users/buildslave/jenkins/workspace/lldb-cmake-sanitized/llvm-project/lldb/packages/Python/lldbsuite/test/functionalities/gdb_remote_client runCmd: settings set symbols.enable-external-lookup false output:

Hide Details

runCmd: settings set plugin.process.gdb-remote.packet-timeout 60 output:

Hide Details

runCmd: settings set symbols.clang-modules-cache-path "/Users/buildslave/jenkins/workspace/lldb-cmake-sanitized/lldb-build/tools/lldb/lldb-test-build.noindex/module-cache-lldb" output:

Hide Details

runCmd: settings set use-color false output:

Hide Details

<bound method SBProcess.Kill of <lldb.SBProcess; proxy of <Swig Object of type 'lldb::SBProcess *' at 0x106e01ba0> >>: success

Hide Details

PASS: LLDB (/Users/buildslave/jenkins/workspace/lldb-cmake-sanitized/host-compiler/bin/clang-10-x86_64) :: test_attach_fail (TestGDBRemoteClient.TestGDBRemoteClient) runCmd: settings set symbols.enable-external-lookup false output:

Hide Details

runCmd: settings set plugin.process.gdb-remote.packet-timeout 60 output:

Hide Details

runCmd: settings set symbols.clang-modules-cache-path "/Users/buildslave/jenkins/workspace/lldb-cmake-sanitized/lldb-build/tools/lldb/lldb-test-build.noindex/module-cache-lldb" output:

Hide Details

runCmd: settings set use-color false output:

Hide Details

FAIL: LLDB (/Users/buildslave/jenkins/workspace/lldb-cmake-sanitized/host-compiler/bin/clang-10-x86_64) :: test_connect (TestGDBRemoteClient.TestGDBRemoteClient) <bound method SBProcess.Kill of <lldb.SBProcess; proxy of <Swig Object of type 'lldb::SBProcess *' at 0x106e01900> >>: success

Hide Details

Restore dir to: /Users/buildslave/jenkins/workspace/lldb-cmake-sanitized/lldb-build/tools/lldb/lit ====================================================================== FAIL: test_connect (TestGDBRemoteClient.TestGDBRemoteClient) Test connecting to a remote gdb server ---------------------------------------------------------------------- Traceback (most recent call last): File "/Users/buildslave/jenkins/workspace/lldb-cmake-sanitized/llvm-project/lldb/packages/Python/lldbsuite/test/functionalities/gdb_remote_client/TestGDBRemoteClient.py", line 13, in test_connect process = self.connect(target) File "/Users/buildslave/jenkins/workspace/lldb-cmake-sanitized/llvm-project/lldb/packages/Python/lldbsuite/test/functionalities/gdb_remote_client/gdbclientutils.py", line 479, in connect self.assertTrue(error.Success(), error.description) AssertionError: False is not True : failed to get reply to handshake packet Config=x86_64-/Users/buildslave/jenkins/workspace/lldb-cmake-sanitized/host-compiler/bin/clang-10 ---------------------------------------------------------------------- Ran 2 tests in 62.337s

Hide Details

RESULT: FAILED (1 passes, 1 failures, 0 errors, 0 skipped, 0 expected failures, 0 unexpected successes)

Hide Details

******************** PASS: lldb-Unit :: debugserver/./debugserverTests/RNBSocket.LoopBackConnectIPv4 (1186 of 1727) PASS: lldb-Unit :: Utility/./UtilityTests/ArgsTest.TestAppendArg (1187 of 1727) PASS: lldb-Unit :: Process/minidump/./LLDBMinidumpTests/MinidumpParserTest.GetLinuxProcStatus_no_stream (1188 of 1727) PASS: lldb-Suite :: functionalities/data-formatter/data-formatter-stl/libcxx/initializerlist/TestInitializerList.py (1189 of 1727) PASS: lldb-Suite :: functionalities/breakpoint/require_hw_breakpoints/TestRequireHWBreakpoints.py (1190 of 1727) PASS: lldb-Unit :: Process/minidump/./LLDBMinidumpTests/RegisterContextMinidump.ConvertMinidumpContext_x86_64 (1191 of 1727) PASS: lldb-Unit :: Utility/./UtilityTests/StringListTest.GetSize (1192 of 1727) PASS: lldb-Suite :: commands/expression/macros/TestMacros.py (1193 of 1727) PASS: lldb-Unit :: Utility/./UtilityTests/ArgsTest.ReplaceArgumentAtIndexEqual (1194 of 1727) PASS: lldb-Unit :: Host/./HostTests/ProcessLaunchInfoTest.Constructor (1195 of 1727) PASS: lldb-Unit :: Process/gdb-remote/./ProcessGdbRemoteTests/GDBRemoteCommunicationClientTest.GetMemoryRegionInfo (1196 of 1727) PASS: lldb-Suite :: tools/lldb-vscode/breakpoint/TestVSCode_setExceptionBreakpoints.py (1197 of 1727) PASS: lldb-Suite :: commands/log/invalid-args/TestInvalidArgsLog.py (1198 of 1727) PASS: lldb-Suite :: lang/objc/real-definition/TestRealDefinition.py (1199 of 1727) PASS: lldb-Suite :: driver/batch_mode/TestBatchMode.py (1200 of 1727) PASS: lldb-Unit :: ScriptInterpreter/Python/./ScriptInterpreterPythonTests/PythonDataObjectsTest.TestOwnedReferences (1201 of 1727) PASS: lldb-Unit :: Language/Highlighting/./HighlighterTests/HighlighterTest.HighlighterSelectionPath (1202 of 1727) PASS: lldb-Suite :: lang/cpp/template-function/TestTemplateFunctions.py (1203 of 1727) PASS: lldb-Suite :: linux/builtin_trap/TestBuiltinTrap.py (1204 of 1727) PASS: lldb-Unit :: Utility/./UtilityTests/StreamTest.PutNHex8 (1205 of 1727) PASS: lldb-Suite :: lang/c/set_values/TestSetValues.py (1206 of 1727) PASS: lldb-Unit :: Process/gdb-remote/./ProcessGdbRemoteTests/GDBRemoteClientBaseTest.SendContinueAndInterrupt2PacketBug (1207 of 1727) PASS: lldb-Suite :: functionalities/thread/concurrent_events/TestConcurrentBreakpointsDelayedBreakpointOneWatchpoint.py (1208 of 1727) PASS: lldb-Suite :: commands/platform/basic/TestPlatformPython.py (1209 of 1727) PASS: lldb-Suite :: lang/objc/foundation/TestObjCMethodsNSError.py (1210 of 1727) PASS: lldb-Unit :: Utility/./UtilityTests/StringListTest.InsertStringAtIndexStdString (1211 of 1727) PASS: LLDB :: SymbolFile/DWARF/array-sizes.s (1212 of 1727) PASS: lldb-Suite :: python_api/process/read-mem-cstring/TestReadMemCString.py (1213 of 1727) PASS: LLDB :: Commands/command-regex-unalias.test (1214 of 1727) PASS: lldb-Unit :: Utility/./UtilityTests/ScalarTest.GetBytes (1215 of 1727) PASS: lldb-Suite :: commands/expression/radar_9673664/TestExprHelpExamples.py (1216 of 1727) PASS: lldb-Suite :: commands/expression/import-std-module/vector-of-vectors/TestVectorOfVectors.py (1217 of 1727) PASS: lldb-Suite :: lang/objc/objc-checker/TestObjCCheckers.py (1218 of 1727) PASS: lldb-Unit :: Language/Highlighting/./HighlighterTests/HighlighterTest.ClangBraces (1219 of 1727) PASS: lldb-Suite :: commands/expression/ir-interpreter-phi-nodes/TestIRInterpreterPHINodes.py (1220 of 1727) PASS: lldb-Unit :: Utility/./UtilityTests/IndexToObjectTest.ObjectForIndex (1221 of 1727) PASS: lldb-Unit :: Utility/./UtilityTests/VMRange.CollectionContains (1222 of 1727) PASS: lldb-Suite :: functionalities/data-formatter/type_summary_list_arg/TestTypeSummaryListArg.py (1223 of 1727) PASS: lldb-Suite :: python_api/default-constructor/TestDefaultConstructorForAPIObjects.py (1224 of 1727) PASS: lldb-Suite :: python_api/type/TestTypeList.py (1225 of 1727) PASS: lldb-Unit :: Utility/./UtilityTests/StringListTest.ShiftMove (1226 of 1727) PASS: lldb-Unit :: Utility/./UtilityTests/StreamTeeTest.Assignment (1227 of 1727) PASS: lldb-Suite :: python_api/sbstructureddata/TestStructuredDataAPI.py (1228 of 1727) PASS: lldb-Suite :: commands/expression/function_template_specialization_temp_args/TestFunctionTemplateSpecializationTempArgs.py (1229 of 1727) UNSUPPORTED: LLDB :: SymbolFile/PDB/expressions.test (1230 of 1727) PASS: lldb-Suite :: functionalities/inferior-crashing/TestInferiorCrashingStep.py (1231 of 1727) UNSUPPORTED: LLDB :: SymbolFile/DWARF/debug-types-expressions.test (1232 of 1727) PASS: lldb-Unit :: Process/minidump/./LLDBMinidumpTests/MinidumpParserTest.GetLinuxProcStatus (1233 of 1727) PASS: lldb-Unit :: UnwindAssembly/x86/./UnwindAssemblyx86Tests/Testx86AssemblyInspectionEngine.TestPushR15 (1234 of 1727) PASS: lldb-Unit :: Process/minidump/./LLDBMinidumpTests/MinidumpParserTest.GetThreadsAndGetThreadContext (1235 of 1727) PASS: lldb-Suite :: tools/lldb-server/TestAppleSimulatorOSType.py (1236 of 1727) PASS: LLDB :: SymbolFile/NativePDB/ast-methods.cpp (1237 of 1727) PASS: lldb-Unit :: Process/minidump/./LLDBMinidumpTests/MinidumpParserTest.GetThreadContext_x86_32_wow64 (1238 of 1727) PASS: lldb-Unit :: Utility/./UtilityTests/ArgsTest.BareSingleQuote (1239 of 1727) PASS: lldb-Unit :: Utility/./UtilityTests/ConstStringTest.NullAndEmptyStates (1240 of 1727) PASS: lldb-Unit :: Utility/./UtilityTests/FileSpecTest.FormatFileSpec (1241 of 1727) PASS: lldb-Unit :: Utility/./UtilityTests/BinaryStreamTest.PutSLEB128FiveBytes (1242 of 1727) PASS: lldb-Suite :: functionalities/data-formatter/data-formatter-globals/TestDataFormatterGlobals.py (1243 of 1727) UNSUPPORTED: LLDB :: SymbolFile/PDB/vbases.test (1244 of 1727) PASS: lldb-Unit :: Process/minidump/./LLDBMinidumpTests/MinidumpParserTest.GetMemoryRegionInfoFromMemoryList (1245 of 1727) PASS: LLDB :: SymbolFile/DWARF/debug-types-missing-signature.test (1246 of 1727) PASS: lldb-Unit :: Utility/./UtilityTests/ScalarTest.APIntConstructor (1247 of 1727) PASS: lldb-Unit :: Utility/./UtilityTests/FileSpecTest.IsRelative (1248 of 1727) PASS: lldb-Suite :: lang/objc/objc-runtime-ivars/TestRuntimeIvars.py (1249 of 1727) PASS: lldb-Unit :: Utility/./UtilityTests/NameMatchesTest.Contains (1250 of 1727) PASS: LLDB :: Expr/TestMultilineExpr.test (1251 of 1727) PASS: lldb-Unit :: Utility/./UtilityTests/StreamTest.PutRawBytesToMixedEndian (1252 of 1727) PASS: lldb-Unit :: Process/gdb-remote/./ProcessGdbRemoteTests/GDBRemoteCommunicationClientTest.SendGetDataPacket (1253 of 1727) PASS: lldb-Unit :: SymbolFile/NativePDB/./SymbolFileNativePDBTests/PDBFPOProgramToDWARFExpressionTests.UnknownOp (1254 of 1727) PASS: lldb-Suite :: commands/expression/class_template_specialization_empty_pack/TestClassTemplateSpecializationParametersHandling.py (1255 of 1727) PASS: lldb-Unit :: Utility/./UtilityTests/StreamTeeTest.DefaultConstructor (1256 of 1727) PASS: lldb-Unit :: Host/./HostTests/SocketTest.DomainListenConnectAccept (1257 of 1727) PASS: lldb-Unit :: Utility/./UtilityTests/StreamTest.PutHex8 (1258 of 1727) PASS: LLDB :: Breakpoint/split-dwarf5-debug-stroffsets.test (1259 of 1727) PASS: lldb-Unit :: Language/Highlighting/./HighlighterTests/HighlighterTest.ClangCommas (1260 of 1727) PASS: lldb-Suite :: functionalities/plugins/python_os_plugin/TestPythonOSPlugin.py (1261 of 1727) PASS: lldb-Suite :: functionalities/thread/concurrent_events/TestConcurrentManySignals.py (1262 of 1727) PASS: LLDB :: SymbolFile/Breakpad/unwind-via-stack-win.test (1263 of 1727) PASS: lldb-Unit :: Utility/./UtilityTests/ScalarTest.Promotion (1264 of 1727) PASS: lldb-Unit :: Utility/./UtilityTests/StringListTest.InsertStringAtIndexMove (1265 of 1727) PASS: lldb-Unit :: Utility/./UtilityTests/BinaryStreamTest.PutULEB128FourBytes (1266 of 1727) PASS: lldb-Unit :: Utility/./UtilityTests/StringListTest.DefaultConstructor (1267 of 1727) PASS: lldb-Suite :: api/multiple-debuggers/TestMultipleDebuggers.py (1268 of 1727) UNSUPPORTED: LLDB :: Register/x86-gp-write.test (1269 of 1727) PASS: lldb-Suite :: commands/target/stop-hooks/TestStopHooks.py (1270 of 1727) PASS: lldb-Suite :: functionalities/breakpoint/breakpoint_set_restart/TestBreakpointSetRestart.py (1271 of 1727) UNSUPPORTED: LLDB :: Expr/TestIRMemoryMapWindows.test (1272 of 1727) PASS: lldb-Unit :: Utility/./UtilityTests/StringExtractorTest.GetHexU8_Underflow2 (1273 of 1727) PASS: lldb-Suite :: lang/cpp/gmodules-templates/TestGModules.py (1274 of 1727) PASS: lldb-Suite :: functionalities/tsan/thread_leak/TestTsanThreadLeak.py (1275 of 1727) PASS: lldb-Unit :: Utility/./UtilityTests/UriParserTest.BadPort (1276 of 1727) PASS: lldb-Suite :: functionalities/data-formatter/data-formatter-stl/libstdcpp/map/TestDataFormatterStdMap.py (1277 of 1727) PASS: lldb-Unit :: Language/Highlighting/./HighlighterTests/HighlighterTest.DefaultHighlighterWithCursor (1278 of 1727) PASS: lldb-Suite :: lang/cpp/virtual-overload/TestVirtualOverload.py (1279 of 1727) PASS: lldb-Unit :: Utility/./UtilityTests/EnvironmentTest.EnvpConversion (1280 of 1727) PASS: lldb-Suite :: functionalities/data-formatter/data-formatter-enum-format/TestDataFormatterEnumFormat.py (1281 of 1727) PASS: lldb-Unit :: Host/./HostTests/FileSystemTest.Resolve (1282 of 1727) PASS: lldb-Suite :: lang/c/global_variables/TestGlobalVariables.py (1283 of 1727) PASS: lldb-Suite :: functionalities/tsan/global_location/TestTsanGlobalLocation.py (1284 of 1727) PASS: lldb-Suite :: functionalities/thread/create_during_step/TestCreateDuringStep.py (1285 of 1727) PASS: lldb-Unit :: Utility/./UtilityTests/StringExtractorTest.DecodeHexU8_InvalidHex (1286 of 1727) PASS: lldb-Unit :: Utility/./UtilityTests/StringListTest.ShiftStdString (1287 of 1727) PASS: lldb-Suite :: functionalities/tail_call_frames/inlining_and_tail_calls/TestInliningAndTailCalls.py (1288 of 1727) PASS: LLDB :: Minidump/breakpad-symbols.test (1289 of 1727) PASS: lldb-Suite :: commands/expression/import-std-module/deque-dbg-info-content/TestDbgInfoContentDeque.py (1290 of 1727) PASS: lldb-Suite :: functionalities/show_location/TestShowLocationDwarf5.py (1291 of 1727) PASS: lldb-Unit :: Utility/./UtilityTests/ArgsTest.EscapeLLDBCommandArgument (1292 of 1727) PASS: lldb-Suite :: functionalities/breakpoint/dummy_target_breakpoints/TestBreakpointsWithNoTargets.py (1293 of 1727) PASS: lldb-Unit :: Utility/./UtilityTests/BinaryStreamTest.PutULEB128NineBytes (1294 of 1727) PASS: lldb-Unit :: Language/Highlighting/./HighlighterTests/HighlighterTest.ClangUnterminatedString (1295 of 1727) PASS: lldb-Unit :: Utility/./UtilityTests/StreamTest.PutRawBytesToBigEndian (1296 of 1727) PASS: lldb-Suite :: functionalities/thread/create_after_attach/TestCreateAfterAttach.py (1297 of 1727) PASS: lldb-Unit :: Utility/./UtilityTests/UUIDTest.SetFromStringRef (1298 of 1727) PASS: lldb-Unit :: Utility/./UtilityTests/StringListTest.RemoveBlankLines (1299 of 1727) PASS: lldb-Suite :: functionalities/postmortem/elf-core/TestLinuxCore.py (1300 of 1727) PASS: lldb-Unit :: Utility/./UtilityTests/StringListTest.AppendListCStringArray (1301 of 1727) PASS: lldb-Suite :: macosx/indirect_symbol/TestIndirectSymbols.py (1302 of 1727) PASS: lldb-Suite :: lang/c/unicode/TestUnicodeSymbols.py (1303 of 1727) PASS: LLDB :: Modules/ELF/duplicate-section.yaml (1304 of 1727) PASS: lldb-Suite :: lang/c/strings/TestCStrings.py (1305 of 1727) PASS: lldb-Unit :: Utility/./UtilityTests/RangeTest.SizeTypes (1306 of 1727) PASS: LLDB :: SymbolFile/DWARF/find-method-local-struct.cpp (1307 of 1727) PASS: lldb-Suite :: functionalities/data-formatter/data-formatter-stl/libstdcpp/tuple/TestDataFormatterStdTuple.py (1308 of 1727) PASS: lldb-Unit :: ObjectFile/Breakpad/./ObjectFileBreakpadTests/InfoRecord.parse (1309 of 1727) PASS: LLDB :: Reproducer/Functionalities/TestStepping.test (1310 of 1727) PASS: lldb-Suite :: commands/expression/completion-crash1/TestCompletionCrash1.py (1311 of 1727) PASS: lldb-Unit :: Utility/./UtilityTests/NameMatchesTest.EndsWith (1312 of 1727) PASS: LLDB :: SymbolFile/Breakpad/line-table-discontinuous-file-ids.test (1313 of 1727) PASS: lldb-Suite :: python_api/process/TestProcessAPI.py (1314 of 1727) PASS: lldb-Suite :: functionalities/thread/concurrent_events/TestConcurrentDelayedCrashWithBreakpointSignal.py (1315 of 1727) PASS: lldb-Suite :: tools/lldb-server/thread-name/TestGdbRemoteThreadName.py (1316 of 1727) PASS: lldb-Unit :: Utility/./UtilityTests/NameMatchesTest.Equals (1317 of 1727) PASS: lldb-Unit :: Process/gdb-remote/./ProcessGdbRemoteTests/GDBRemoteCommunicationClientTest.SendStartTracePacket (1318 of 1727) PASS: lldb-Unit :: Signals/./SignalsTests/UnixSignalsTest.VersionChange (1319 of 1727) PASS: lldb-Suite :: functionalities/data-formatter/data-formatter-stl/libstdcpp/unique_ptr/invalid/TestDataFormatterInvalidStdUniquePtr.py (1320 of 1727) PASS: lldb-Suite :: lang/objc/objc-ivar-stripped/TestObjCIvarStripped.py (1321 of 1727) PASS: lldb-Suite :: arm/breakpoint-it/TestBreakpointIt.py (1322 of 1727) PASS: lldb-Suite :: python_api/target/TestTargetAPI.py (1323 of 1727) PASS: lldb-Unit :: Utility/./UtilityTests/ScalarTest.SetValueFromCString (1324 of 1727) PASS: lldb-Unit :: UnwindAssembly/x86/./UnwindAssemblyx86Tests/Testx86AssemblyInspectionEngine.TestPopEBP (1325 of 1727) PASS: lldb-Suite :: lang/objc/objc-new-syntax/TestObjCNewSyntaxArray.py (1326 of 1727) PASS: lldb-Unit :: ScriptInterpreter/Python/./ScriptInterpreterPythonTests/PythonExceptionStateTest.TestManualRestoreSemantics (1327 of 1727) PASS: lldb-Unit :: Language/Highlighting/./HighlighterTests/HighlighterTest.ClangScalarLiterals (1328 of 1727) PASS: lldb-Unit :: Utility/./UtilityTests/FileSpecTest.RemoveLastPathComponent (1329 of 1727) PASS: lldb-Unit :: Utility/./UtilityTests/StringExtractorTest.DecodeHexU8_Underflow2 (1330 of 1727) PASS: lldb-Suite :: lang/cpp/incomplete-types/TestCppIncompleteTypes.py (1331 of 1727) PASS: lldb-Unit :: Host/./HostTests/SocketTest.TCPGetConnectURI (1332 of 1727) PASS: lldb-Suite :: python_api/objc_type/TestObjCType.py (1333 of 1727) PASS: lldb-Suite :: python_api/lldbutil/iter/TestLLDBIterator.py (1334 of 1727) PASS: lldb-Suite :: lang/objc/objc-new-syntax/TestObjCNewSyntaxDictionary.py (1335 of 1727) PASS: lldb-Unit :: SymbolFile/DWARF/./SymbolFileDWARFTests/SymbolFileDWARFTests.TestAbbrevMissingTerminator (1336 of 1727) PASS: lldb-Suite :: functionalities/backticks/TestBackticksWithoutATarget.py (1337 of 1727) PASS: LLDB :: SymbolFile/DWARF/find-basic-function.cpp (1338 of 1727) PASS: lldb-Suite :: functionalities/tsan/basic/TestTsanBasic.py (1339 of 1727) PASS: lldb-Suite :: lang/c/vla/TestVLA.py (1340 of 1727) PASS: LLDB :: Reproducer/TestDriverOptions.test (1341 of 1727) PASS: lldb-Unit :: Utility/./UtilityTests/LogChannelEnabledTest.LLDB_LOG_ERROR (1342 of 1727) PASS: LLDB :: SymbolFile/DWARF/dir-separator-windows.s (1343 of 1727) UNSUPPORTED: LLDB :: SymbolFile/PDB/typedefs.test (1344 of 1727) PASS: LLDB :: Breakpoint/split-dwarf-5-addrbase.test (1345 of 1727) PASS: lldb-Suite :: functionalities/breakpoint/serialize/TestBreakpointSerialization.py (1346 of 1727) PASS: lldb-Suite :: python_api/file_handle/TestFileHandle.py (1347 of 1727) PASS: lldb-Unit :: Utility/./UtilityTests/StreamTest.PutMaxHex64ByteOrderBig (1348 of 1727) PASS: lldb-Suite :: python_api/findvalue_duplist/TestSBFrameFindValue.py (1349 of 1727) PASS: lldb-Suite :: commands/register/register/register_command/TestRegisters.py (1350 of 1727) PASS: lldb-Suite :: commands/expression/import-std-module/shared_ptr/TestSharedPtr.py (1351 of 1727) PASS: lldb-Unit :: Utility/./UtilityTests/UriParserTest.MinimalPortPath (1352 of 1727) PASS: lldb-Suite :: commands/expression/unwind_expression/TestUnwindExpression.py (1353 of 1727) PASS: lldb-Suite :: commands/watchpoints/watchpoint_set_command/TestWatchLocationWithWatchSet.py (1354 of 1727) PASS: lldb-Suite :: commands/watchpoints/watchpoint_commands/condition/TestWatchpointConditionCmd.py (1355 of 1727) PASS: LLDB :: Modules/ELF/section-types.yaml (1356 of 1727) PASS: lldb-Suite :: functionalities/unwind/standard/TestStandardUnwind.py (1357 of 1727) PASS: lldb-Suite :: commands/platform/basic/TestPlatformCommand.py (1358 of 1727) PASS: lldb-Suite :: functionalities/data-formatter/data-formatter-synth/TestDataFormatterSynth.py (1359 of 1727) PASS: lldb-Unit :: Utility/./UtilityTests/ListenerTest.GetEventWait (1360 of 1727) PASS: lldb-Suite :: python_api/lldbutil/process/TestPrintStackTraces.py (1361 of 1727) PASS: LLDB :: Expr/TestIRMemoryMap.test (1362 of 1727) PASS: lldb-Unit :: Utility/./UtilityTests/ArgsTest.TestMultipleArgs (1363 of 1727) PASS: lldb-Suite :: commands/command/script/import/TestImport.py (1364 of 1727) PASS: lldb-Suite :: functionalities/thread/concurrent_events/TestConcurrentCrashWithSignal.py (1365 of 1727) PASS: lldb-Suite :: lang/cpp/dynamic-value-same-basename/TestDynamicValueSameBase.py (1366 of 1727) PASS: lldb-Suite :: functionalities/thread/concurrent_events/TestConcurrentDelaySignalWatch.py (1367 of 1727) PASS: lldb-Unit :: Host/./HostTests/NativeProcessProtocolTest.ReadCStringFromMemory (1368 of 1727) PASS: lldb-Suite :: functionalities/data-formatter/vector-types/TestVectorTypesFormatting.py (1369 of 1727) PASS: lldb-Unit :: Process/gdb-remote/./ProcessGdbRemoteTests/GDBRemoteCommunicationClientTest.SendSignalsToIgnore (1370 of 1727) PASS: lldb-Suite :: functionalities/data-formatter/data-formatter-smart-array/TestDataFormatterSmartArray.py (1371 of 1727) PASS: lldb-Suite :: functionalities/data-formatter/data-formatter-stl/libstdcpp/vbool/TestDataFormatterStdVBool.py (1372 of 1727) PASS: lldb-Suite :: functionalities/breakpoint/move_nearest/TestMoveNearest.py (1373 of 1727) PASS: lldb-Suite :: lang/c/shared_lib/TestSharedLib.py (1374 of 1727) PASS: lldb-Unit :: ScriptInterpreter/Python/./ScriptInterpreterPythonTests/PythonDataObjectsTest.TestPythonInteger (1375 of 1727) PASS: lldb-Suite :: lang/objc/objc-struct-argument/TestObjCStructArgument.py (1376 of 1727) XFAIL: LLDB :: Register/x86-64-ymm-write.test (1377 of 1727) PASS: LLDB :: Modules/ELF/PT_LOAD-overlap-PT_INTERP.yaml (1378 of 1727) PASS: lldb-Suite :: linux/add-symbols/TestTargetSymbolsAddCommand.py (1379 of 1727) PASS: lldb-Suite :: functionalities/data-formatter/data-formatter-stl/libcxx/tuple/TestDataFormatterLibcxxTuple.py (1380 of 1727) PASS: lldb-Unit :: Utility/./UtilityTests/GeneratorTest.Create (1381 of 1727) PASS: lldb-Suite :: python_api/class_members/TestSBTypeClassMembers.py (1382 of 1727) PASS: lldb-Suite :: commands/expression/import-std-module/sysroot/TestStdModuleSysroot.py (1383 of 1727) PASS: lldb-Suite :: functionalities/data-formatter/data-formatter-objc/TestDataFormatterObjCKVO.py (1384 of 1727) PASS: lldb-Suite :: functionalities/breakpoint/step_over_breakpoint/TestStepOverBreakpoint.py (1385 of 1727) PASS: lldb-Suite :: lang/cpp/modules-import/TestCXXModulesImport.py (1386 of 1727) PASS: lldb-Unit :: Utility/./UtilityTests/VMRange.SetEndAddress (1387 of 1727) PASS: lldb-Unit :: Utility/./UtilityTests/StreamTest.PutHex16ByteOrderBig (1388 of 1727) PASS: lldb-Suite :: functionalities/tail_call_frames/sbapi_support/TestTailCallFrameSBAPI.py (1389 of 1727) PASS: lldb-Unit :: ObjectFile/Breakpad/./ObjectFileBreakpadTests/FileRecord.parse (1390 of 1727) PASS: lldb-Suite :: lang/cpp/template/TestTemplateArgs.py (1391 of 1727) PASS: LLDB :: Modules/PECOFF/basic-info.yaml (1392 of 1727) PASS: lldb-Suite :: functionalities/stats_api/TestStatisticsAPI.py (1393 of 1727) PASS: lldb-Suite :: macosx/lc-note/kern-ver-str/TestKernVerStrLCNOTE.py (1394 of 1727) PASS: LLDB :: SymbolFile/NativePDB/break-by-function.cpp (1395 of 1727) PASS: lldb-Suite :: commands/expression/context-object/TestContextObject.py (1396 of 1727) PASS: lldb-Suite :: functionalities/asan/TestMemoryHistory.py (1397 of 1727) PASS: lldb-Unit :: UnwindAssembly/x86/./UnwindAssemblyx86Tests/Testx86AssemblyInspectionEngine.TestPushRBP (1398 of 1727) PASS: lldb-Suite :: python_api/sblaunchinfo/TestSBLaunchInfo.py (1399 of 1727) PASS: lldb-Unit :: Host/./HostTests/MainLoopTest.Signal (1400 of 1727) PASS: lldb-Suite :: functionalities/thread/concurrent_events/TestConcurrentBreakpointOneDelayBreakpointThreads.py (1401 of 1727) PASS: LLDB :: SymbolFile/DWARF/debug-types-line-tables.s (1402 of 1727) PASS: lldb-Suite :: tools/lldb-server/platform-process-connect/TestPlatformProcessConnect.py (1403 of 1727) PASS: lldb-Suite :: tools/lldb-server/TestLldbGdbServer.py (1404 of 1727) PASS: LLDB :: Driver/TestProcessAttach.test (1405 of 1727) PASS: lldb-Unit :: Target/./TargetTests/ExecutionContextTest.GetByteOrderTarget (1406 of 1727) PASS: lldb-Unit :: Host/./HostTests/NativeProcessProtocolTest.ReadCStringFromMemory_CrossPageBoundary (1407 of 1727) PASS: lldb-Suite :: functionalities/wrong_commands/TestWrongCommands.py (1408 of 1727) PASS: lldb-Suite :: functionalities/ptr_refs/TestPtrRefs.py (1409 of 1727) PASS: lldb-Unit :: Host/./HostTests/MainLoopTest.UnmonitoredSignal (1410 of 1727) PASS: lldb-Suite :: macosx/universal/TestUniversal.py (1411 of 1727) PASS: lldb-Suite :: functionalities/data-formatter/varscript_formatting/TestDataFormatterVarScriptFormatting.py (1412 of 1727) PASS: lldb-Unit :: ScriptInterpreter/Python/./ScriptInterpreterPythonTests/PythonDataObjectsTest.TestPythonString (1413 of 1727) PASS: lldb-Suite :: macosx/function-starts/TestFunctionStarts.py (1414 of 1727) PASS: LLDB :: SymbolFile/DWARF/dwarf5-index-is-used.cpp (1415 of 1727) PASS: lldb-Suite :: functionalities/darwin_log/source/info/TestDarwinLogSourceInfo.py (1416 of 1727) PASS: lldb-Suite :: commands/frame/diagnose/array/TestArray.py (1417 of 1727) PASS: LLDB :: SymbolFile/Breakpad/stack-cfi-parsing.test (1418 of 1727) PASS: LLDB :: SymbolFile/DWARF/find-variable-file.cpp (1419 of 1727) PASS: lldb-Suite :: python_api/value/linked_list/TestValueAPILinkedList.py (1420 of 1727) PASS: lldb-Suite :: functionalities/thread/concurrent_events/TestConcurrentTwoBreakpointsOneWatchpoint.py (1421 of 1727) PASS: lldb-Unit :: ScriptInterpreter/Python/./ScriptInterpreterPythonTests/PythonDataObjectsTest.TestObjectAttributes (1422 of 1727) PASS: lldb-Unit :: Utility/./UtilityTests/ArgsTest.TestArgv (1423 of 1727) PASS: lldb-Suite :: functionalities/data-formatter/nssetsynth/TestNSSetSynthetic.py (1424 of 1727) PASS: lldb-Unit :: Utility/./UtilityTests/ScalarTest.Equality (1425 of 1727) PASS: lldb-Suite :: commands/expression/import-std-module/weak_ptr/TestWeakPtr.py (1426 of 1727) PASS: lldb-Suite :: types/TestDoubleTypesExpr.py (1427 of 1727) PASS: lldb-Unit :: Symbol/./SymbolTests/DWARFCallFrameInfoTest.Basic_dwarf4 (1428 of 1727) PASS: lldb-Unit :: ScriptInterpreter/Python/./ScriptInterpreterPythonTests/PythonExceptionStateTest.TestResetSemantics (1429 of 1727) PASS: lldb-Suite :: functionalities/data-formatter/setvaluefromcstring/TestSetValueFromCString.py (1430 of 1727) PASS: lldb-Suite :: functionalities/breakpoint/breakpoint_ids/TestBreakpointIDs.py (1431 of 1727) PASS: lldb-Suite :: functionalities/thread/concurrent_events/TestConcurrentTwoWatchpointsOneSignal.py (1432 of 1727) PASS: lldb-Suite :: lang/objc/objc-builtin-types/TestObjCBuiltinTypes.py (1433 of 1727) PASS: lldb-Unit :: Expression/./ExpressionTests/DiagnosticManagerTest.AddDiagnostic (1434 of 1727) UNSUPPORTED: LLDB :: SymbolFile/NativePDB/ast-functions-msvc.cpp (1435 of 1727) PASS: lldb-Suite :: python_api/watchpoint/watchlocation/TestTargetWatchAddress.py (1436 of 1727) PASS: lldb-Suite :: functionalities/memory-region/TestMemoryRegion.py (1437 of 1727) PASS: LLDB :: Driver/TestTarget.test (1438 of 1727) PASS: lldb-Suite :: commands/expression/import-std-module/unique_ptr/TestUniquePtr.py (1439 of 1727) PASS: lldb-Suite :: commands/frame/diagnose/inheritance/TestDiagnoseInheritance.py (1440 of 1727) PASS: lldb-Unit :: Utility/./UtilityTests/ProcessInfoTest.Constructor (1441 of 1727) PASS: lldb-Suite :: functionalities/source-map/TestTargetSourceMap.py (1442 of 1727) PASS: lldb-Suite :: types/TestFloatTypesExpr.py (1443 of 1727) UNSUPPORTED: LLDB :: SymbolFile/PDB/udt-layout.test (1444 of 1727) PASS: lldb-Unit :: Language/Highlighting/./HighlighterTests/HighlighterTest.ClangCursorPos (1445 of 1727) PASS: lldb-Unit :: Expression/./ExpressionTests/DiagnosticManagerTest.PutString (1446 of 1727) PASS: lldb-Suite :: functionalities/thread/concurrent_events/TestConcurrentCrashWithWatchpointBreakpointSignal.py (1447 of 1727) PASS: lldb-Suite :: functionalities/data-formatter/data-formatter-objc/TestDataFormatterObjCNSError.py (1448 of 1727) PASS: lldb-Suite :: lang/c/inlines/TestRedefinitionsInInlines.py (1449 of 1727) PASS: lldb-Unit :: Utility/./UtilityTests/StringExtractorTest.GetHexBytes_Underflow (1450 of 1727) PASS: lldb-Suite :: tools/lldb-vscode/breakpoint/TestVSCode_setBreakpoints.py (1451 of 1727) PASS: lldb-Suite :: commands/expression/import-std-module/stack/TestStack.py (1452 of 1727) PASS: lldb-Suite :: functionalities/deleted-executable/TestDeletedExecutable.py (1453 of 1727) PASS: LLDB :: Modules/PECOFF/sections-names.yaml (1454 of 1727) PASS: lldb-Suite :: lang/cpp/offsetof/TestOffsetofCpp.py (1455 of 1727) PASS: lldb-Suite :: commands/watchpoints/hello_watchlocation/TestWatchLocation.py (1456 of 1727) PASS: lldb-Unit :: Utility/./UtilityTests/StreamTest.PutPtr (1457 of 1727) PASS: lldb-Unit :: Utility/./UtilityTests/StreamTest.PutCString (1458 of 1727) PASS: lldb-Unit :: Utility/./UtilityTests/BroadcasterTest.BroadcastEvent (1459 of 1727) PASS: lldb-Unit :: Utility/./UtilityTests/DataExtractorTest.GetMaxS64 (1460 of 1727) PASS: lldb-Unit :: Utility/./UtilityTests/JSONTest.Newlines (1461 of 1727) PASS: lldb-Unit :: Process/minidump/./LLDBMinidumpTests/MinidumpParserTest.GetMemory (1462 of 1727) PASS: lldb-Suite :: commands/expression/dollar-in-variable/TestDollarInVariable.py (1463 of 1727) PASS: lldb-Unit :: Host/./HostTests/NativeProcessProtocolTest.SetBreakpointFailVerify (1464 of 1727) PASS: lldb-Unit :: Utility/./UtilityTests/StreamTeeTest.AppendStream (1465 of 1727) PASS: lldb-Unit :: Expression/./ExpressionTests/DiagnosticManagerTest.GetStringMultiline (1466 of 1727) PASS: lldb-Unit :: Utility/./UtilityTests/StringExtractorTest.GetNameColonValueNoColon (1467 of 1727) PASS: lldb-Suite :: functionalities/thread/concurrent_events/TestConcurrentWatchBreak.py (1468 of 1727) PASS: LLDB :: Modules/Breakpad/uuid-matching-mac.test (1469 of 1727) PASS: lldb-Unit :: ScriptInterpreter/Python/./ScriptInterpreterPythonTests/PythonDataObjectsTest.TestPythonCallableCheck (1470 of 1727) PASS: lldb-Unit :: UnwindAssembly/x86/./UnwindAssemblyx86Tests/Testx86AssemblyInspectionEngine.TestReturnDetect (1471 of 1727) PASS: lldb-Suite :: functionalities/load_using_paths/TestLoadUsingPaths.py (1472 of 1727) PASS: lldb-Unit :: Utility/./UtilityTests/ConstStringTest.CompareStringRef (1473 of 1727) PASS: lldb-Suite :: functionalities/thread/multi_break/TestMultipleBreakpoints.py (1474 of 1727) PASS: LLDB :: Modules/ELF/gnu-debuglink.yaml (1475 of 1727) PASS: lldb-Suite :: python_api/lldbutil/TestSwigVersion.py (1476 of 1727) PASS: lldb-Unit :: UnwindAssembly/x86/./UnwindAssemblyx86Tests/Testx86AssemblyInspectionEngine.Test32bitFramelessSmallStackFrame (1477 of 1727) PASS: lldb-Unit :: UnwindAssembly/x86/./UnwindAssemblyx86Tests/Testx86AssemblyInspectionEngine.TestStackRealign8BitDisp_i386 (1478 of 1727) PASS: lldb-Suite :: commands/expression/persistent_variables/TestPersistentVariables.py (1479 of 1727) PASS: lldb-Unit :: Expression/./ExpressionTests/DiagnosticManagerTest.HasFixits (1480 of 1727) PASS: lldb-Unit :: ObjectFile/ELF/./ObjectFileELFTests/ObjectFileELFTest.GetModuleSpecifications_EarlySectionHeaders (1481 of 1727) PASS: lldb-Suite :: tools/lldb-server/TestGdbRemoteHostInfo.py (1482 of 1727) PASS: lldb-Unit :: Target/./TargetTests/ExecutionContextTest.GetByteOrder (1483 of 1727) PASS: lldb-Unit :: ScriptInterpreter/Python/./ScriptInterpreterPythonTests/PythonDataObjectsTest.TestPythonStringToStr (1484 of 1727) PASS: lldb-Suite :: functionalities/postmortem/minidump/TestMiniDump.py (1485 of 1727) UNSUPPORTED: LLDB :: SymbolFile/PDB/calling-conventions.test (1486 of 1727) PASS: lldb-Unit :: ScriptInterpreter/Python/./ScriptInterpreterPythonTests/PythonDataObjectsTest.TestDictionaryResolutionWithDot (1487 of 1727) PASS: lldb-Unit :: Utility/./UtilityTests/DataExtractorTest.GetMaxU64_unchecked (1488 of 1727) PASS: lldb-Unit :: UnwindAssembly/x86/./UnwindAssemblyx86Tests/Testx86AssemblyInspectionEngine.TestPopR13 (1489 of 1727) PASS: lldb-Suite :: lang/cpp/virtual/TestVirtual.py (1490 of 1727) PASS: lldb-Suite :: functionalities/gdb_remote_client/TestRestartBug.py (1491 of 1727) PASS: lldb-Unit :: Language/CPlusPlus/./LanguageCPlusPlusTests/CPlusPlusLanguage.FindAlternateFunctionManglings (1492 of 1727) PASS: lldb-Unit :: UnwindAssembly/x86/./UnwindAssemblyx86Tests/Testx86AssemblyInspectionEngine.TestPushRBPWithREX (1493 of 1727) PASS: lldb-Suite :: functionalities/data-formatter/data-formatter-objc/TestDataFormatterObjCCF.py (1494 of 1727) PASS: lldb-Suite :: functionalities/thread/concurrent_events/TestConcurrentCrashWithBreak.py (1495 of 1727) PASS: lldb-Suite :: functionalities/data-formatter/parray/TestPrintArray.py (1496 of 1727) PASS: lldb-Unit :: Host/./HostTests/NativeProcessProtocolTest.ReadCStringFromMemory_MaxSize (1497 of 1727) PASS: lldb-Suite :: functionalities/breakpoint/breakpoint_options/TestBreakpointOptions.py (1498 of 1727) PASS: LLDB :: SymbolFile/NativePDB/ast-functions.cpp (1499 of 1727) PASS: lldb-Unit :: Utility/./UtilityTests/FileSpecTest.EqualDotsPosix (1500 of 1727) PASS: LLDB :: Quit/TestQuitExitCodeNonInt.test (1501 of 1727) PASS: LLDB :: Unwind/eh-frame-dwarf-unwind.test (1502 of 1727) PASS: lldb-Suite :: lang/cpp/static_members/TestCPPStaticMembers.py (1503 of 1727) PASS: lldb-Unit :: Utility/./UtilityTests/StringExtractorTest.GetHexBytes_OddPair (1504 of 1727) PASS: lldb-Unit :: Utility/./UtilityTests/StreamTest.PutHex64ByteOrderLittle (1505 of 1727) PASS: lldb-Suite :: lang/objc/objc++/TestObjCXX.py (1506 of 1727) PASS: lldb-Suite :: tools/lldb-server/TestGdbRemoteProcessInfo.py (1507 of 1727) PASS: lldb-Unit :: Utility/./UtilityTests/StringListTest.LongestCommonPrefixDuplicateElement (1508 of 1727) PASS: lldb-Unit :: UnwindAssembly/x86/./UnwindAssemblyx86Tests/Testx86AssemblyInspectionEngine.Test64bitFramelessSmallStackFrame (1509 of 1727) PASS: lldb-Suite :: macosx/nslog/TestDarwinNSLogOutput.py (1510 of 1727) PASS: lldb-Unit :: Utility/./UtilityTests/LogChannelEnabledTest.log_options (1511 of 1727) PASS: lldb-Unit :: UnwindAssembly/x86/./UnwindAssemblyx86Tests/Testx86AssemblyInspectionEngine.TestPopRBPWithREX (1512 of 1727) PASS: lldb-Unit :: Utility/./UtilityTests/FileSpecTest.EqualDotsWindows (1513 of 1727) PASS: lldb-Suite :: functionalities/thread/exit_during_step/TestExitDuringStep.py (1514 of 1727) PASS: LLDB :: Modules/ELF/base-address.yaml (1515 of 1727) PASS: lldb-Unit :: Process/minidump/./LLDBMinidumpTests/MinidumpParserTest.GetThreadContext_x86_32 (1516 of 1727) PASS: lldb-Suite :: functionalities/data-formatter/data-formatter-stl/libcxx/iterator/TestDataFormatterLibccIterator.py (1517 of 1727) UNSUPPORTED: LLDB :: Register/x86-gp-read.test (1518 of 1727) PASS: lldb-Unit :: SymbolFile/NativePDB/./SymbolFileNativePDBTests/PDBFPOProgramToDWARFExpressionTests.DependencyChain (1519 of 1727) PASS: lldb-Unit :: Utility/./UtilityTests/StringExtractorTest.DecodeHexU8_Exact (1520 of 1727) PASS: lldb-Suite :: lang/c/offsetof/TestOffsetof.py (1521 of 1727) PASS: lldb-Suite :: functionalities/thread/concurrent_events/TestConcurrentTwoWatchpointThreads.py (1522 of 1727) UNSUPPORTED: LLDB :: Register/x86-64-zmm-read.test (1523 of 1727) PASS: lldb-Unit :: UnwindAssembly/x86/./UnwindAssemblyx86Tests/Testx86AssemblyInspectionEngine.TestSubRSP (1524 of 1727) PASS: lldb-Suite :: functionalities/memory/read/TestMemoryRead.py (1525 of 1727) PASS: LLDB :: SymbolFile/sizeless-symbol.test (1526 of 1727) PASS: lldb-Unit :: Utility/./UtilityTests/TimeoutTest.Format (1527 of 1727) PASS: lldb-Suite :: commands/expression/inline-namespace/TestInlineNamespace.py (1528 of 1727) PASS: lldb-Suite :: functionalities/darwin_log/filter/regex/message/TestDarwinLogFilterRegexMessage.py (1529 of 1727) PASS: lldb-Suite :: android/platform/TestDefaultCacheLineSize.py (1530 of 1727) PASS: lldb-Suite :: functionalities/data-formatter/data-formatter-objc/nsindexpath/TestDataFormatterNSIndexPath.py (1531 of 1727) PASS: lldb-Suite :: functionalities/data-formatter/ptr_ref_typedef/TestPtrRef2Typedef.py (1532 of 1727) PASS: lldb-Unit :: Symbol/./SymbolTests/DWARFCallFrameInfoTest.Basic_eh (1533 of 1727) PASS: lldb-Suite :: types/TestRecursiveTypes.py (1534 of 1727) PASS: lldb-Suite :: commands/expression/timeout/TestCallWithTimeout.py (1535 of 1727) PASS: lldb-Unit :: Utility/./UtilityTests/StructuredDataTest.ParseJSONFromFile (1536 of 1727) PASS: LLDB :: SymbolFile/Breakpad/line-table-missing-file.test (1537 of 1727) PASS: lldb-Suite :: api/log/TestAPILog.py (1538 of 1727) PASS: LLDB :: SymbolFile/DWARF/debug-names-compressed.cpp (1539 of 1727) PASS: lldb-Suite :: functionalities/data-formatter/data-formatter-stl/libcxx/string/TestDataFormatterLibcxxString.py (1540 of 1727) PASS: lldb-Suite :: functionalities/load_unload/TestLoadUnload.py (1541 of 1727) PASS: lldb-Suite :: functionalities/darwin_log/filter/exact_match/category/TestDarwinLogFilterMatchCategory.py (1542 of 1727) PASS: lldb-Unit :: Language/Highlighting/./HighlighterTests/HighlighterTest.ClangIdentifiers (1543 of 1727) PASS: lldb-Unit :: Utility/./UtilityTests/BinaryStreamTest.PutULEB128SevenBytes (1544 of 1727) PASS: lldb-Suite :: tools/lldb-server/TestGdbRemoteRegisterState.py (1545 of 1727) PASS: lldb-Suite :: lang/cpp/dynamic-value/TestCppValueCast.py (1546 of 1727) PASS: lldb-Suite :: lang/c/unions/TestUnionMembers.py (1547 of 1727) PASS: lldb-Unit :: Utility/./UtilityTests/RegularExpression.Invalid (1548 of 1727) PASS: lldb-Unit :: Process/gdb-remote/./ProcessGdbRemoteTests/GDBRemoteCommunicationTest.ReadPacket_checksum (1549 of 1727) PASS: lldb-Unit :: Utility/./UtilityTests/StringExtractorTest.GetU64LittleEndian (1550 of 1727) PASS: lldb-Suite :: functionalities/breakpoint/comp_dir_symlink/TestCompDirSymLink.py (1551 of 1727) PASS: lldb-Suite :: python_api/signals/TestSignalsAPI.py (1552 of 1727) PASS: lldb-Suite :: functionalities/breakpoint/hardware_breakpoints/hardware_breakpoint_on_multiple_threads/TestHWBreakMultiThread.py (1553 of 1727) PASS: LLDB :: SymbolFile/DWARF/find-basic-namespace.cpp (1554 of 1727) PASS: lldb-Unit :: ObjectFile/Breakpad/./ObjectFileBreakpadTests/StackWinRecord.parse (1555 of 1727) PASS: lldb-Suite :: lang/cpp/signed_types/TestSignedTypes.py (1556 of 1727) PASS: lldb-Unit :: Language/Highlighting/./HighlighterTests/HighlighterTest.ClangStringLiterals (1557 of 1727) PASS: lldb-Suite :: commands/reproducer/invalid-args/TestInvalidArgsReproducer.py (1558 of 1727) PASS: lldb-Suite :: commands/apropos/with-process/TestAproposWithProcess.py (1559 of 1727) PASS: lldb-Unit :: Utility/./UtilityTests/RecordReplayTest.InstrumentedBar (1560 of 1727) PASS: lldb-Suite :: tools/lldb-server/register-reading/TestGdbRemoteGPacket.py (1561 of 1727) PASS: lldb-Unit :: Language/Highlighting/./HighlighterTests/HighlighterTest.ClangSquareBrackets (1562 of 1727) PASS: lldb-Unit :: UnwindAssembly/x86/./UnwindAssemblyx86Tests/Testx86AssemblyInspectionEngine.TestAddESP (1563 of 1727) PASS: lldb-Unit :: Utility/./UtilityTests/AnsiTerminal.Unknown (1564 of 1727) PASS: lldb-Unit :: Utility/./UtilityTests/StringExtractorTest.GetU64BigEndian (1565 of 1727) PASS: lldb-Unit :: Utility/./UtilityTests/ArgsTest.ReplaceArgumentAtIndexFarOutOfRange (1566 of 1727) PASS: lldb-Suite :: lang/c/enum_types/TestEnumTypes.py (1567 of 1727) PASS: lldb-Unit :: SymbolFile/DWARF/./SymbolFileDWARFTests/SymbolFileDWARFTests.TestAbbrevInvalidNULLTag (1568 of 1727) PASS: lldb-Suite :: lang/cpp/unique-types/TestUniqueTypes.py (1569 of 1727) PASS: lldb-Suite :: functionalities/process_save_core/TestProcessSaveCore.py (1570 of 1727) PASS: lldb-Unit :: Utility/./UtilityTests/RangeTest.LessThanInvalid (1571 of 1727) PASS: lldb-Unit :: Target/./TargetTests/ModuleCacheTest.GetAndPut (1572 of 1727) PASS: lldb-Suite :: lang/objc/hidden-ivars/TestHiddenIvars.py (1573 of 1727) PASS: lldb-Unit :: Utility/./UtilityTests/DataExtractorTest.GetMaxU64 (1574 of 1727) PASS: lldb-Unit :: Process/minidump/./LLDBMinidumpTests/MinidumpParserTest.MinidumpDuplicateModuleMinAddress (1575 of 1727) PASS: lldb-Suite :: tools/lldb-server/signal-filtering/TestGdbRemote_QPassSignals.py (1576 of 1727) PASS: LLDB :: Modules/Breakpad/sections.test (1577 of 1727) PASS: lldb-Unit :: Utility/./UtilityTests/BroadcasterTest.EventTypeHasListeners (1578 of 1727) PASS: lldb-Unit :: ScriptInterpreter/Python/./ScriptInterpreterPythonTests/PythonDataObjectsTest.TestTypeNameResolutionNoDot (1579 of 1727) PASS: LLDB :: Modules/ELF/section-addresses.yaml (1580 of 1727) PASS: lldb-Unit :: Breakpoint/./LLDBBreakpointTests/BreakpointIDTest.StringIsBreakpointName (1581 of 1727) PASS: lldb-Unit :: Utility/./UtilityTests/StreamTest.PutBytesAsRawHex8ToMixedEndian (1582 of 1727) PASS: lldb-Unit :: Language/CPlusPlus/./LanguageCPlusPlusTests/CPlusPlusLanguage.MethodNameParsing (1583 of 1727) PASS: lldb-Unit :: Utility/./UtilityTests/BinaryStreamTest.PutSLEB128ThreeBytes (1584 of 1727) PASS: lldb-Suite :: functionalities/darwin_log/filter/exact_match/activity/TestDarwinLogFilterMatchActivity.py (1585 of 1727) PASS: LLDB :: SymbolFile/NativePDB/tag-types.cpp (1586 of 1727) PASS: lldb-Unit :: Utility/./UtilityTests/RangeTest.ClearWithStarAddress (1587 of 1727) PASS: lldb-Suite :: lang/objc/foundation/TestObjCMethods2.py (1588 of 1727) PASS: lldb-Suite :: tools/lldb-server/libraries-svr4/TestGdbRemoteLibrariesSvr4Support.py (1589 of 1727) PASS: lldb-Suite :: functionalities/unwind/ehframe/TestEhFrameUnwind.py (1590 of 1727) PASS: lldb-Unit :: Symbol/./SymbolTests/SymbolsTest.LocateExecutableSymbolFileForUnknownExecutableAndMissingSymbolFile (1591 of 1727) PASS: lldb-Suite :: functionalities/data-formatter/data-formatter-script/TestDataFormatterScript.py (1592 of 1727) PASS: lldb-Unit :: ScriptInterpreter/Python/./ScriptInterpreterPythonTests/PythonDataObjectsTest.TestPythonCallableInvoke (1593 of 1727) PASS: lldb-Suite :: functionalities/data-formatter/var-in-aggregate-misuse/TestVarInAggregateMisuse.py (1594 of 1727) PASS: LLDB :: SymbolFile/DWARF/debug_rnglists.s (1595 of 1727) PASS: lldb-Unit :: Symbol/./SymbolTests/TestClangASTContext.TestRecordHasFields (1596 of 1727) PASS: lldb-Unit :: Utility/./UtilityTests/Flags.Clear (1597 of 1727) PASS: lldb-Suite :: lang/cpp/char8_t/TestCxxChar8_t.py (1598 of 1727) PASS: lldb-Suite :: lang/objc/objc-super/TestObjCSuper.py (1599 of 1727) PASS: lldb-Suite :: functionalities/signal/handle-abrt/TestHandleAbort.py (1600 of 1727) PASS: LLDB :: Modules/MachO/lc_version_min.yaml (1601 of 1727) PASS: lldb-Suite :: functionalities/thread/concurrent_events/TestConcurrentManyBreakpoints.py (1602 of 1727) PASS: lldb-Suite :: functionalities/data-formatter/data-formatter-objc/TestDataFormatterObjCNSDate.py (1603 of 1727) PASS: lldb-Suite :: commands/expression/scoped_enums/TestScopedEnumType.py (1604 of 1727) PASS: lldb-Unit :: Core/./LLDBCoreTests/StreamCallbackTest.Callback (1605 of 1727) UNSUPPORTED: LLDB :: Register/x86-64-xmm16-read.test (1606 of 1727) PASS: lldb-Suite :: commands/expression/argument_passing_restrictions/TestArgumentPassingRestrictions.py (1607 of 1727) PASS: lldb-Suite :: functionalities/tail_call_frames/ambiguous_tail_call_seq2/TestAmbiguousTailCallSeq2.py (1608 of 1727) PASS: lldb-Unit :: Utility/./UtilityTests/SerializationRountripTest.SerializeDeserializeObjectPointer (1609 of 1727) PASS: lldb-Suite :: lang/objc/ivar-IMP/TestObjCiVarIMP.py (1610 of 1727) PASS: lldb-Suite :: commands/expression/import_builtin_fileid/TestImportBuiltinFileID.py (1611 of 1727) PASS: LLDB :: SymbolFile/Breakpad/line-table.test (1612 of 1727) PASS: lldb-Unit :: UnwindAssembly/x86/./UnwindAssemblyx86Tests/Testx86AssemblyInspectionEngine.TestPushEBP (1613 of 1727) UNSUPPORTED: LLDB :: SymbolFile/NativePDB/local-variables.cpp (1614 of 1727) PASS: lldb-Unit :: Core/./LLDBCoreTests/MangledTest.ResultForValidName (1615 of 1727) PASS: lldb-Suite :: linux/sepdebugsymlink/TestTargetSymbolsSepDebugSymlink.py (1616 of 1727) PASS: lldb-Unit :: Utility/./UtilityTests/StringExtractorTest.GetNameColonValueNoSemicolon (1617 of 1727) PASS: lldb-Unit :: Process/minidump/./LLDBMinidumpTests/MinidumpParserTest.GetMiscInfoWindows (1618 of 1727) PASS: lldb-Suite :: functionalities/thread/concurrent_events/TestConcurrentSignalWatch.py (1619 of 1727) PASS: lldb-Unit :: Utility/./UtilityTests/StringExtractorTest.GetHexBytesAvail_OddPair (1620 of 1727) PASS: LLDB :: Settings/TestModuleCacheSanity.test (1621 of 1727) PASS: lldb-Unit :: ScriptInterpreter/Python/./ScriptInterpreterPythonTests/PythonDataObjectsTest.TestPythonStringToStructuredString (1622 of 1727) PASS: lldb-Suite :: functionalities/data-formatter/frameformat_smallstruct/TestFrameFormatSmallStruct.py (1623 of 1727) FAIL: lldb-Suite :: commands/expression/multiline-completion/TestMultilineCompletion.py (1624 of 1727) ******************** TEST 'lldb-Suite :: commands/expression/multiline-completion/TestMultilineCompletion.py' FAILED ******************** lldb version 10.0.99 (http://labmaster3.local/git/llvm-project.git revision ae685e7aab7f278cf197b8b1b1ccf76a6e884682) clang revision 172e8a7a5de1c5aa110272da5483138e9aabc204 llvm revision 172e8a7a5de1c5aa110272da5483138e9aabc204 LLDB library dir: /Users/buildslave/jenkins/workspace/lldb-cmake-sanitized/lldb-build/bin LLDB import library dir: /Users/buildslave/jenkins/workspace/lldb-cmake-sanitized/lldb-build/bin libstdcxx tests will not be run because: Don't know how to build with libstdcxx on macosx Skipping following debug info categories: ['dwo'] (lldb) settings set symbols.enable-external-lookup false (lldb) settings set plugin.process.gdb-remote.packet-timeout 60 (lldb) settings set symbols.clang-modules-cache-path "/Users/buildslave/jenkins/workspace/lldb-cmake-sanitized/lldb-build/tools/lldb/lldb-test-build.noindex/module-cache-lldb" (lldb) settings set use-color false (lldb) target create "/Users/buildslave/jenkins/workspace/lldb-cmake-sanitized/lldb-build/tools/lldb/lldb-test-build.noindex/commands/expression/multiline-completion/TestMultilineCompletion.test_basic_completion/a.out" Current executable set to '/Users/buildslave/jenkins/workspace/lldb-cmake-sanitized/lldb-build/tools/lldb/lldb-test-build.noindex/commands/expression/multiline-completion/TestMultilineCompletion.test_basic_completion/a.out' (x86_64). (lldb) b main b main Breakpoint 1: where = a.out`main + 18 at main.c:2:7, address = 0x0000000100000fa2 (lldb) run run Process 70356 launched: '/Users/buildslave/jenkins/workspace/lldb-cmake-sanitized/lldb-build/tools/lldb/lldb-test-build.noindex/commands/expression/multiline-completion/TestMultilineCompletion.test_basic_completion/a.out' (x86_64) Process 70356 stopped * thread #1, queue = 'com.apple.main-thread', stop reason = breakpoint 1.1 frame #0: 0x0000000100000fa2 a.out`main(argc=1, argv=0x00007ffeefbff4d0) at main.c:2:7 1 int main(int argc, char **argv) { -> 2 int to_complete = 0; ^ 3 return to_complete; 4 } (lldb) expr expr Enter expressions, then terminate with an empty line to evaluate: to_  1:  1: to_ to_  1: to_complete

Hide Details

 1: to_complete 2:  2:  (int) $0 = 0 (lldb) settings set interpreter.prompt-on-quit false

Hide Details

Session logs for test failures/errors/unexpected successes will go into directory '/Users/buildslave/jenkins/workspace/lldb-cmake-sanitized/test/logs' Command invoked: /Users/buildslave/jenkins/workspace/lldb-cmake-sanitized/llvm-project/lldb/test/dotest.py --arch=x86_64 -s /Users/buildslave/jenkins/workspace/lldb-cmake-sanitized/lldb-build/lldb-test-traces -S nm -u CXXFLAGS -u CFLAGS --executable /Users/buildslave/jenkins/workspace/lldb-cmake-sanitized/lldb-build/./bin/lldb --dsymutil /Users/buildslave/jenkins/workspace/lldb-cmake-sanitized/lldb-build/./bin/dsymutil --filecheck /Users/buildslave/jenkins/workspace/lldb-cmake-sanitized/lldb-build/./bin/FileCheck -C /Users/buildslave/jenkins/workspace/lldb-cmake-sanitized/host-compiler/bin/clang --codesign-identity lldb_codesign --server /Users/buildslave/jenkins/workspace/lldb-cmake-sanitized/lldb-build/./bin/debugserver --arch x86_64 --build-dir /Users/buildslave/jenkins/workspace/lldb-cmake-sanitized/lldb-build/lldb-test-build.noindex -s=/Users/buildslave/jenkins/workspace/lldb-cmake-sanitized/test/logs -t --env TERM=vt100 --env LLVM_LIBS_DIR=/Users/buildslave/jenkins/workspace/lldb-cmake-sanitized/lldb-build/./lib --build-dir /Users/buildslave/jenkins/workspace/lldb-cmake-sanitized/lldb-build/tools/lldb/lldb-test-build.noindex --module-cache-dir /Users/buildslave/jenkins/workspace/lldb-cmake-sanitized/lldb-build/tools/lldb/lldb-test-build.noindex/module-cache-lldb /Users/buildslave/jenkins/workspace/lldb-cmake-sanitized/llvm-project/lldb/packages/Python/lldbsuite/test/commands/expression/multiline-completion -p TestMultilineCompletion.py Change dir to: /Users/buildslave/jenkins/workspace/lldb-cmake-sanitized/llvm-project/lldb/packages/Python/lldbsuite/test/commands/expression/multiline-completion runCmd: settings set symbols.enable-external-lookup false output:

Hide Details

runCmd: settings set plugin.process.gdb-remote.packet-timeout 60 output:

Hide Details

runCmd: settings set symbols.clang-modules-cache-path "/Users/buildslave/jenkins/workspace/lldb-cmake-sanitized/lldb-build/tools/lldb/lldb-test-build.noindex/module-cache-lldb" output:

Hide Details

runCmd: settings set use-color false output:

Hide Details

FAIL: LLDB (/Users/buildslave/jenkins/workspace/lldb-cmake-sanitized/host-compiler/bin/clang-10-x86_64) :: test_basic_completion (TestMultilineCompletion.MultilineCompletionTest) tearing down the child process....

Hide Details

CLEANUP ERROR: LLDB (/Users/buildslave/jenkins/workspace/lldb-cmake-sanitized/host-compiler/bin/clang-10-x86_64) :: test_basic_completion (TestMultilineCompletion.MultilineCompletionTest) Restore dir to: /Users/buildslave/jenkins/workspace/lldb-cmake-sanitized/lldb-build/tools/lldb/lit ====================================================================== ERROR: test_basic_completion (TestMultilineCompletion.MultilineCompletionTest) Test that we can complete a simple multiline expression ---------------------------------------------------------------------- Traceback (most recent call last): File "/Users/buildslave/jenkins/workspace/lldb-cmake-sanitized/llvm-project/lldb/packages/Python/lldbsuite/test/commands/expression/multiline-completion/TestMultilineCompletion.py", line 30, in test_basic_completion self.quit() File "/Users/buildslave/jenkins/workspace/lldb-cmake-sanitized/llvm-project/lldb/packages/Python/lldbsuite/test/lldbpexpect.py", line 61, in quit self.child.close(force=not gracefully) File "/Users/buildslave/jenkins/workspace/lldb-cmake-sanitized/llvm-project/lldb/third_party/Python/module/pexpect-4.6/pexpect/pty_spawn.py", line 327, in close self.ptyproc.close(force=force) File "/System/Library/Frameworks/Python.framework/Versions/2.7/lib/python2.7/contextlib.py", line 35, in __exit__ self.gen.throw(type, value, traceback) File "/Users/buildslave/jenkins/workspace/lldb-cmake-sanitized/llvm-project/lldb/third_party/Python/module/pexpect-4.6/pexpect/pty_spawn.py", line 25, in _wrap_ptyprocess_err raise ExceptionPexpect(*e.args) ExceptionPexpect: Could not terminate the child. Config=x86_64-/Users/buildslave/jenkins/workspace/lldb-cmake-sanitized/host-compiler/bin/clang-10 ---------------------------------------------------------------------- Ran 1 test in 7.096s

Hide Details

RESULT: FAILED (0 passes, 0 failures, 1 errors, 0 skipped, 0 expected failures, 0 unexpected successes)

Hide Details

******************** PASS: lldb-Unit :: Utility/./UtilityTests/UriParserTest.MinimalPort (1625 of 1727) PASS: lldb-Suite :: tools/lldb-server/TestGdbRemote_qThreadStopInfo.py (1626 of 1727) XFAIL: LLDB :: SymbolFile/DWARF/find-type-in-function.cpp (1627 of 1727) PASS: lldb-Unit :: Target/./TargetTests/MemoryRegionInfoTest.Formatv (1628 of 1727) PASS: lldb-Unit :: Utility/./UtilityTests/StringExtractorTest.GetHexU8_Underflow (1629 of 1727) PASS: lldb-Unit :: Interpreter/./InterpreterTests/OptionArgParserTest.toBoolean (1630 of 1727) PASS: LLDB :: BuildScript/toolchain-clang.test (1631 of 1727) PASS: lldb-Unit :: Utility/./UtilityTests/StringExtractorTest.GetU32LittleEndian (1632 of 1727) UNSUPPORTED: LLDB :: Register/x86-64-ymm16-read.test (1633 of 1727) PASS: lldb-Suite :: commands/expression/call-function/TestCallUserDefinedFunction.py (1634 of 1727) PASS: lldb-Suite :: functionalities/breakpoint/consecutive_breakpoints/TestConsecutiveBreakpoints.py (1635 of 1727) PASS: lldb-Suite :: lang/objc/radar-9691614/TestObjCMethodReturningBOOL.py (1636 of 1727) PASS: lldb-Suite :: python_api/lldbutil/iter/TestRegistersIterator.py (1637 of 1727) PASS: lldb-Unit :: Utility/./UtilityTests/StringListTest.SplitIntoLines (1638 of 1727) PASS: lldb-Suite :: functionalities/thread/backtrace_limit/TestBacktraceLimit.py (1639 of 1727) PASS: lldb-Suite :: functionalities/thread/concurrent_events/TestConcurrentDelayWatchBreak.py (1640 of 1727) PASS: lldb-Unit :: Utility/./UtilityTests/StringLexerTest.NextIf (1641 of 1727) PASS: lldb-Unit :: Utility/./UtilityTests/TildeExpressionResolver.ResolveFullPath (1642 of 1727) PASS: lldb-Suite :: types/TestIntegerTypes.py (1643 of 1727) PASS: lldb-Unit :: Utility/./UtilityTests/RangeTest.EqualInvalid (1644 of 1727) PASS: lldb-Unit :: SymbolFile/NativePDB/./SymbolFileNativePDBTests/PDBFPOProgramToDWARFExpressionTests.MissingTargetRegister (1645 of 1727) XFAIL: LLDB :: Register/x86-mm-xmm-write.test (1646 of 1727) PASS: lldb-Unit :: Utility/./UtilityTests/CompletionRequest.TestCompletionOwnership (1647 of 1727) PASS: LLDB :: Modules/PECOFF/subsections.yaml (1648 of 1727) PASS: lldb-Suite :: functionalities/data-formatter/data-formatter-stl/libcxx/function/TestLibCxxFunction.py (1649 of 1727) PASS: lldb-Suite :: commands/process/attach/TestProcessAttach.py (1650 of 1727) PASS: lldb-Suite :: benchmarks/turnaround/TestCompileRunToBreakpointTurnaround.py (1651 of 1727) PASS: lldb-Unit :: Symbol/./SymbolTests/TestClangASTContext.TemplateArguments (1652 of 1727) PASS: lldb-Unit :: UnwindAssembly/x86/./UnwindAssemblyx86Tests/Testx86AssemblyInspectionEngine.TestSimple64bitFrameFunction (1653 of 1727) PASS: lldb-Suite :: functionalities/data-formatter/data-formatter-stl/libcxx/map/TestDataFormatterLibccMap.py (1654 of 1727) PASS: lldb-Suite :: benchmarks/stepping/TestSteppingSpeed.py (1655 of 1727) PASS: lldb-Unit :: Utility/./UtilityTests/RegularExpression.Empty (1656 of 1727) PASS: lldb-Suite :: benchmarks/libcxxlist/TestBenchmarkLibcxxList.py (1657 of 1727) PASS: lldb-Suite :: commands/command/history/TestCommandHistory.py (1658 of 1727) PASS: lldb-Unit :: UnwindAssembly/x86/./UnwindAssemblyx86Tests/Testx86AssemblyInspectionEngine.TestPopR15 (1659 of 1727) PASS: lldb-Unit :: Utility/./UtilityTests/UriParserTest.SchemeHostSeparator3 (1660 of 1727) PASS: lldb-Suite :: lang/objc/modules/TestObjCModules.py (1661 of 1727) PASS: LLDB :: SymbolFile/DWARF/find-inline-method.s (1662 of 1727) PASS: lldb-Unit :: Utility/./UtilityTests/StringListTest.AppendListCStringArrayEmpty (1663 of 1727) UNSUPPORTED: LLDB :: SymbolFile/PDB/variables-locations.test (1664 of 1727) PASS: lldb-Suite :: functionalities/data-formatter/data-formatter-stl/libcxx/optional/TestDataFormatterLibcxxOptional.py (1665 of 1727) PASS: lldb-Unit :: Utility/./UtilityTests/RangeTest.Union (1666 of 1727) PASS: lldb-Unit :: Language/Highlighting/./HighlighterTests/HighlighterTest.ClangOperators (1667 of 1727) PASS: lldb-Unit :: SymbolFile/DWARF/./SymbolFileDWARFTests/DWARFASTParserClangTests.TestGetDIEForDeclContextReturnsOnlyMatchingEntries (1668 of 1727) PASS: lldb-Unit :: Utility/./UtilityTests/OptionsWithRawTest.TerminatedQuote (1669 of 1727) PASS: lldb-Suite :: python_api/section/TestSectionAPI.py (1670 of 1727) PASS: lldb-Unit :: ObjectFile/Breakpad/./ObjectFileBreakpadTests/FuncRecord.parse (1671 of 1727) PASS: lldb-Suite :: functionalities/completion/TestCompletion.py (1672 of 1727) PASS: lldb-Unit :: Utility/./UtilityTests/UriParserTest.SchemeHostSeparator2 (1673 of 1727) PASS: lldb-Suite :: functionalities/data-formatter/data-formatter-stl/libstdcpp/list/TestDataFormatterStdList.py (1674 of 1727) PASS: lldb-Suite :: functionalities/breakpoint/objc/TestObjCBreakpoints.py (1675 of 1727) PASS: lldb-Suite :: functionalities/thread/concurrent_events/TestConcurrentWatchBreakDelay.py (1676 of 1727) PASS: lldb-Unit :: Core/./LLDBCoreTests/MangledTest.EmptyForInvalidName (1677 of 1727) PASS: lldb-Suite :: tools/lldb-server/TestGdbRemoteModuleInfo.py (1678 of 1727) PASS: lldb-Unit :: debugserver/./debugserverTests/RNBSocket.LoopBackConnectIPv6 (1679 of 1727) FAIL: lldb-Suite :: functionalities/gdb_remote_client/TestThreadSelectionBug.py (1680 of 1727) ******************** TEST 'lldb-Suite :: functionalities/gdb_remote_client/TestThreadSelectionBug.py' FAILED ******************** lldb version 10.0.99 (http://labmaster3.local/git/llvm-project.git revision ae685e7aab7f278cf197b8b1b1ccf76a6e884682) clang revision 172e8a7a5de1c5aa110272da5483138e9aabc204 llvm revision 172e8a7a5de1c5aa110272da5483138e9aabc204 LLDB library dir: /Users/buildslave/jenkins/workspace/lldb-cmake-sanitized/lldb-build/bin LLDB import library dir: /Users/buildslave/jenkins/workspace/lldb-cmake-sanitized/lldb-build/bin libstdcxx tests will not be run because: Don't know how to build with libstdcxx on macosx Skipping following debug info categories: ['dwo']

Hide Details

Session logs for test failures/errors/unexpected successes will go into directory '/Users/buildslave/jenkins/workspace/lldb-cmake-sanitized/test/logs' Command invoked: /Users/buildslave/jenkins/workspace/lldb-cmake-sanitized/llvm-project/lldb/test/dotest.py --arch=x86_64 -s /Users/buildslave/jenkins/workspace/lldb-cmake-sanitized/lldb-build/lldb-test-traces -S nm -u CXXFLAGS -u CFLAGS --executable /Users/buildslave/jenkins/workspace/lldb-cmake-sanitized/lldb-build/./bin/lldb --dsymutil /Users/buildslave/jenkins/workspace/lldb-cmake-sanitized/lldb-build/./bin/dsymutil --filecheck /Users/buildslave/jenkins/workspace/lldb-cmake-sanitized/lldb-build/./bin/FileCheck -C /Users/buildslave/jenkins/workspace/lldb-cmake-sanitized/host-compiler/bin/clang --codesign-identity lldb_codesign --server /Users/buildslave/jenkins/workspace/lldb-cmake-sanitized/lldb-build/./bin/debugserver --arch x86_64 --build-dir /Users/buildslave/jenkins/workspace/lldb-cmake-sanitized/lldb-build/lldb-test-build.noindex -s=/Users/buildslave/jenkins/workspace/lldb-cmake-sanitized/test/logs -t --env TERM=vt100 --env LLVM_LIBS_DIR=/Users/buildslave/jenkins/workspace/lldb-cmake-sanitized/lldb-build/./lib --build-dir /Users/buildslave/jenkins/workspace/lldb-cmake-sanitized/lldb-build/tools/lldb/lldb-test-build.noindex --module-cache-dir /Users/buildslave/jenkins/workspace/lldb-cmake-sanitized/lldb-build/tools/lldb/lldb-test-build.noindex/module-cache-lldb /Users/buildslave/jenkins/workspace/lldb-cmake-sanitized/llvm-project/lldb/packages/Python/lldbsuite/test/functionalities/gdb_remote_client -p TestThreadSelectionBug.py Change dir to: /Users/buildslave/jenkins/workspace/lldb-cmake-sanitized/llvm-project/lldb/packages/Python/lldbsuite/test/functionalities/gdb_remote_client runCmd: settings set symbols.enable-external-lookup false output:

Hide Details

runCmd: settings set plugin.process.gdb-remote.packet-timeout 60 output:

Hide Details

runCmd: settings set symbols.clang-modules-cache-path "/Users/buildslave/jenkins/workspace/lldb-cmake-sanitized/lldb-build/tools/lldb/lldb-test-build.noindex/module-cache-lldb" output:

Hide Details

runCmd: settings set use-color false output:

Hide Details

FAIL: LLDB (/Users/buildslave/jenkins/workspace/lldb-cmake-sanitized/host-compiler/bin/clang-10-x86_64) :: test (TestThreadSelectionBug.TestThreadSelectionBug) <bound method SBProcess.Kill of <lldb.SBProcess; proxy of <Swig Object of type 'lldb::SBProcess *' at 0x1067d08a0> >>: success

Hide Details

Restore dir to: /Users/buildslave/jenkins/workspace/lldb-cmake-sanitized/lldb-build/tools/lldb/lit ====================================================================== FAIL: test (TestThreadSelectionBug.TestThreadSelectionBug) ---------------------------------------------------------------------- Traceback (most recent call last): File "/Users/buildslave/jenkins/workspace/lldb-cmake-sanitized/llvm-project/lldb/packages/Python/lldbsuite/test/functionalities/gdb_remote_client/TestThreadSelectionBug.py", line 17, in test process = self.connect(target) File "/Users/buildslave/jenkins/workspace/lldb-cmake-sanitized/llvm-project/lldb/packages/Python/lldbsuite/test/functionalities/gdb_remote_client/gdbclientutils.py", line 479, in connect self.assertTrue(error.Success(), error.description) AssertionError: False is not True : failed to get reply to handshake packet Config=x86_64-/Users/buildslave/jenkins/workspace/lldb-cmake-sanitized/host-compiler/bin/clang-10 ---------------------------------------------------------------------- Ran 1 test in 62.057s

Hide Details

RESULT: FAILED (0 passes, 1 failures, 0 errors, 0 skipped, 0 expected failures, 0 unexpected successes)

Hide Details

******************** PASS: lldb-Unit :: Utility/./UtilityTests/StreamTeeTest.CopyConstructor (1681 of 1727) PASS: lldb-Suite :: macosx/find-app-in-bundle/TestFindAppInBundle.py (1682 of 1727) PASS: lldb-Suite :: functionalities/postmortem/minidump-new/TestMiniDumpNew.py (1683 of 1727) PASS: LLDB :: Breakpoint/jitbp_elf.test (1684 of 1727) PASS: lldb-Suite :: functionalities/set-data/TestSetData.py (1685 of 1727) PASS: lldb-Unit :: Expression/./ExpressionTests/DiagnosticManagerTest.AppendMessageSubsequentDiags (1686 of 1727) PASS: lldb-Unit :: Utility/./UtilityTests/OptionsWithRawTest.WhitespaceInput (1687 of 1727) PASS: lldb-Suite :: commands/expression/import-std-module/forward_list-basic/TestBasicForwardList.py (1688 of 1727) PASS: lldb-Suite :: functionalities/data-formatter/data-formatter-stl/libcxx/multimap/TestDataFormatterLibccMultiMap.py (1689 of 1727) PASS: lldb-Unit :: Utility/./UtilityTests/BinaryStreamTest.PutULEB128ThreeBytes (1690 of 1727) PASS: lldb-Unit :: UnwindAssembly/x86/./UnwindAssemblyx86Tests/Testx86AssemblyInspectionEngine.TestLEAVE (1691 of 1727) PASS: lldb-Unit :: ObjectFile/Breakpad/./ObjectFileBreakpadTests/PublicRecord.parse (1692 of 1727) PASS: lldb-Suite :: tools/lldb-server/TestGdbRemoteAttach.py (1693 of 1727) PASS: lldb-Unit :: Utility/./UtilityTests/StringListTest.AppendStringCString (1694 of 1727) PASS: lldb-Suite :: lang/cpp/function-template-parameter-pack/TestFunctionTemplateParameterPack.py (1695 of 1727) PASS: lldb-Unit :: ScriptInterpreter/Python/./ScriptInterpreterPythonTests/PythonDataObjectsTest.TestPythonDictionaryToStructuredDictionary (1696 of 1727) PASS: LLDB :: SymbolFile/DWARF/find-variable-dwo.cpp (1697 of 1727) PASS: lldb-Suite :: lang/objcxx/objcxx-ivar-vector/TestIvarVector.py (1698 of 1727) PASS: lldb-Unit :: Utility/./UtilityTests/ScalarTest.GetValue (1699 of 1727) PASS: lldb-Suite :: lang/objc/objc-stepping/TestObjCStepping.py (1700 of 1727) PASS: LLDB :: Register/x86-64-read.test (1701 of 1727) PASS: lldb-Unit :: Host/./HostTests/NativeProcessProtocolTest.SetBreakpoint (1702 of 1727) PASS: lldb-Suite :: lang/objcxx/cxx-bridged-po/TestObjCXXBridgedPO.py (1703 of 1727) PASS: lldb-Suite :: functionalities/data-formatter/data-formatter-cpp/TestDataFormatterCpp.py (1704 of 1727) PASS: lldb-Suite :: functionalities/tail_call_frames/ambiguous_tail_call_seq1/TestAmbiguousTailCallSeq1.py (1705 of 1727) PASS: lldb-Unit :: Utility/./UtilityTests/UriParserTest.PortOverflow (1706 of 1727) PASS: lldb-Unit :: Host/./HostTests/SocketTest.TCPListen0ConnectAccept (1707 of 1727) PASS: lldb-Suite :: source-manager/TestSourceManager.py (1708 of 1727) PASS: lldb-Unit :: Utility/./UtilityTests/StringLexerTest.PutBack (1709 of 1727) PASS: lldb-Unit :: Utility/./UtilityTests/StringExtractorTest.GetHexBytesAvail_Underflow (1710 of 1727) PASS: lldb-Suite :: functionalities/darwin_log/basic/TestDarwinLogBasic.py (1711 of 1727) PASS: lldb-Unit :: Utility/./UtilityTests/ArgsTest.TestInsertArg (1712 of 1727) PASS: lldb-Suite :: commands/command/script/import/rdar-12586188/TestRdar12586188.py (1713 of 1727) PASS: LLDB :: Settings/TestEchoCommands.test (1714 of 1727) FAIL: lldb-Suite :: functionalities/gdb_remote_client/TestGDBRemoteLoad.py (1715 of 1727) ******************** TEST 'lldb-Suite :: functionalities/gdb_remote_client/TestGDBRemoteLoad.py' FAILED ******************** lldb version 10.0.99 (http://labmaster3.local/git/llvm-project.git revision ae685e7aab7f278cf197b8b1b1ccf76a6e884682) clang revision 172e8a7a5de1c5aa110272da5483138e9aabc204 llvm revision 172e8a7a5de1c5aa110272da5483138e9aabc204 LLDB library dir: /Users/buildslave/jenkins/workspace/lldb-cmake-sanitized/lldb-build/bin LLDB import library dir: /Users/buildslave/jenkins/workspace/lldb-cmake-sanitized/lldb-build/bin libstdcxx tests will not be run because: Don't know how to build with libstdcxx on macosx Skipping following debug info categories: ['dwo']

Hide Details

Session logs for test failures/errors/unexpected successes will go into directory '/Users/buildslave/jenkins/workspace/lldb-cmake-sanitized/test/logs' Command invoked: /Users/buildslave/jenkins/workspace/lldb-cmake-sanitized/llvm-project/lldb/test/dotest.py --arch=x86_64 -s /Users/buildslave/jenkins/workspace/lldb-cmake-sanitized/lldb-build/lldb-test-traces -S nm -u CXXFLAGS -u CFLAGS --executable /Users/buildslave/jenkins/workspace/lldb-cmake-sanitized/lldb-build/./bin/lldb --dsymutil /Users/buildslave/jenkins/workspace/lldb-cmake-sanitized/lldb-build/./bin/dsymutil --filecheck /Users/buildslave/jenkins/workspace/lldb-cmake-sanitized/lldb-build/./bin/FileCheck -C /Users/buildslave/jenkins/workspace/lldb-cmake-sanitized/host-compiler/bin/clang --codesign-identity lldb_codesign --server /Users/buildslave/jenkins/workspace/lldb-cmake-sanitized/lldb-build/./bin/debugserver --arch x86_64 --build-dir /Users/buildslave/jenkins/workspace/lldb-cmake-sanitized/lldb-build/lldb-test-build.noindex -s=/Users/buildslave/jenkins/workspace/lldb-cmake-sanitized/test/logs -t --env TERM=vt100 --env LLVM_LIBS_DIR=/Users/buildslave/jenkins/workspace/lldb-cmake-sanitized/lldb-build/./lib --build-dir /Users/buildslave/jenkins/workspace/lldb-cmake-sanitized/lldb-build/tools/lldb/lldb-test-build.noindex --module-cache-dir /Users/buildslave/jenkins/workspace/lldb-cmake-sanitized/lldb-build/tools/lldb/lldb-test-build.noindex/module-cache-lldb /Users/buildslave/jenkins/workspace/lldb-cmake-sanitized/llvm-project/lldb/packages/Python/lldbsuite/test/functionalities/gdb_remote_client -p TestGDBRemoteLoad.py Change dir to: /Users/buildslave/jenkins/workspace/lldb-cmake-sanitized/llvm-project/lldb/packages/Python/lldbsuite/test/functionalities/gdb_remote_client runCmd: settings set symbols.enable-external-lookup false output:

Hide Details

runCmd: settings set plugin.process.gdb-remote.packet-timeout 60 output:

Hide Details

runCmd: settings set symbols.clang-modules-cache-path "/Users/buildslave/jenkins/workspace/lldb-cmake-sanitized/lldb-build/tools/lldb/lldb-test-build.noindex/module-cache-lldb" output:

Hide Details

runCmd: settings set use-color false output:

Hide Details

FAIL: LLDB (/Users/buildslave/jenkins/workspace/lldb-cmake-sanitized/host-compiler/bin/clang-10-x86_64) :: test_flash_load (TestGDBRemoteLoad.TestGDBRemoteLoad) <bound method SBProcess.Kill of <lldb.SBProcess; proxy of <Swig Object of type 'lldb::SBProcess *' at 0x1233dfae0> >>: success

Hide Details

runCmd: settings set symbols.enable-external-lookup false output:

Hide Details

runCmd: settings set plugin.process.gdb-remote.packet-timeout 60 output:

Hide Details

runCmd: settings set symbols.clang-modules-cache-path "/Users/buildslave/jenkins/workspace/lldb-cmake-sanitized/lldb-build/tools/lldb/lldb-test-build.noindex/module-cache-lldb" output:

Hide Details

runCmd: settings set use-color false output:

Hide Details

FAIL: LLDB (/Users/buildslave/jenkins/workspace/lldb-cmake-sanitized/host-compiler/bin/clang-10-x86_64) :: test_module_load_address (TestGDBRemoteLoad.TestGDBRemoteLoad) <bound method SBProcess.Kill of <lldb.SBProcess; proxy of <Swig Object of type 'lldb::SBProcess *' at 0x1233dfa80> >>: success

Hide Details

runCmd: settings set symbols.enable-external-lookup false output:

Hide Details

runCmd: settings set plugin.process.gdb-remote.packet-timeout 60 output:

Hide Details

runCmd: settings set symbols.clang-modules-cache-path "/Users/buildslave/jenkins/workspace/lldb-cmake-sanitized/lldb-build/tools/lldb/lldb-test-build.noindex/module-cache-lldb" output:

Hide Details

runCmd: settings set use-color false output:

Hide Details

FAIL: LLDB (/Users/buildslave/jenkins/workspace/lldb-cmake-sanitized/host-compiler/bin/clang-10-x86_64) :: test_ram_load (TestGDBRemoteLoad.TestGDBRemoteLoad) <bound method SBProcess.Kill of <lldb.SBProcess; proxy of <Swig Object of type 'lldb::SBProcess *' at 0x1233dfae0> >>: success

Hide Details

Restore dir to: /Users/buildslave/jenkins/workspace/lldb-cmake-sanitized/lldb-build/tools/lldb/lit ====================================================================== FAIL: test_flash_load (TestGDBRemoteLoad.TestGDBRemoteLoad) Test loading an object file to a target's flash memory ---------------------------------------------------------------------- Traceback (most recent call last): File "/Users/buildslave/jenkins/workspace/lldb-cmake-sanitized/llvm-project/lldb/packages/Python/lldbsuite/test/functionalities/gdb_remote_client/TestGDBRemoteLoad.py", line 73, in test_flash_load process = self.connect(target) File "/Users/buildslave/jenkins/workspace/lldb-cmake-sanitized/llvm-project/lldb/packages/Python/lldbsuite/test/functionalities/gdb_remote_client/gdbclientutils.py", line 479, in connect self.assertTrue(error.Success(), error.description) AssertionError: False is not True : failed to get reply to handshake packet Config=x86_64-/Users/buildslave/jenkins/workspace/lldb-cmake-sanitized/host-compiler/bin/clang-10 ====================================================================== FAIL: test_module_load_address (TestGDBRemoteLoad.TestGDBRemoteLoad) Test that setting the load address of a module uses virtual addresses ---------------------------------------------------------------------- Traceback (most recent call last): File "/Users/buildslave/jenkins/workspace/lldb-cmake-sanitized/llvm-project/lldb/packages/Python/lldbsuite/test/functionalities/gdb_remote_client/TestGDBRemoteLoad.py", line 20, in test_module_load_address process = self.connect(target) File "/Users/buildslave/jenkins/workspace/lldb-cmake-sanitized/llvm-project/lldb/packages/Python/lldbsuite/test/functionalities/gdb_remote_client/gdbclientutils.py", line 479, in connect self.assertTrue(error.Success(), error.description) AssertionError: False is not True : failed to get reply to handshake packet Config=x86_64-/Users/buildslave/jenkins/workspace/lldb-cmake-sanitized/host-compiler/bin/clang-10 ====================================================================== FAIL: test_ram_load (TestGDBRemoteLoad.TestGDBRemoteLoad) Test loading an object file to a target's ram ---------------------------------------------------------------------- Traceback (most recent call last): File "/Users/buildslave/jenkins/workspace/lldb-cmake-sanitized/llvm-project/lldb/packages/Python/lldbsuite/test/functionalities/gdb_remote_client/TestGDBRemoteLoad.py", line 31, in test_ram_load process = self.connect(target) File "/Users/buildslave/jenkins/workspace/lldb-cmake-sanitized/llvm-project/lldb/packages/Python/lldbsuite/test/functionalities/gdb_remote_client/gdbclientutils.py", line 479, in connect self.assertTrue(error.Success(), error.description) AssertionError: False is not True : failed to get reply to handshake packet Config=x86_64-/Users/buildslave/jenkins/workspace/lldb-cmake-sanitized/host-compiler/bin/clang-10 ---------------------------------------------------------------------- Ran 3 tests in 187.963s

Hide Details

RESULT: FAILED (0 passes, 3 failures, 0 errors, 0 skipped, 0 expected failures, 0 unexpected successes)

Hide Details

******************** PASS: lldb-Suite :: functionalities/data-formatter/data-formatter-named-summaries/TestDataFormatterNamedSummaries.py (1716 of 1727) PASS: lldb-Suite :: functionalities/thread/crash_during_step/TestCrashDuringStep.py (1717 of 1727) PASS: lldb-Suite :: macosx/find-dsym/deep-bundle/TestDeepBundle.py (1718 of 1727) PASS: lldb-Suite :: python_api/sbvalue_persist/TestSBValuePersist.py (1719 of 1727) PASS: lldb-Suite :: commands/watchpoints/watchpoint_commands/command/TestWatchpointCommandLLDB.py (1720 of 1727) PASS: lldb-Suite :: python_api/thread/TestThreadAPI.py (1721 of 1727) PASS: lldb-Suite :: lang/objc/objc-property/TestObjCProperty.py (1722 of 1727) PASS: lldb-Suite :: api/multithreaded/TestMultithreaded.py (1723 of 1727) PASS: lldb-Suite :: api/check_public_api_headers/TestPublicAPIHeaders.py (1724 of 1727) PASS: lldb-Suite :: functionalities/recursion/TestValueObjectRecursion.py (1725 of 1727) PASS: lldb-Suite :: types/TestIntegerTypesExpr.py (1726 of 1727) PASS: lldb-Suite :: lang/objc/foundation/TestFoundationDisassembly.py (1727 of 1727) Testing Time: 1876.75s ******************** Failing Tests (7): lldb-Suite :: commands/gui/basic/TestGuiBasic.py lldb-Suite :: iohandler/completion/TestIOHandlerCompletion.py lldb-Suite :: tools/lldb-server/commandline/TestStubSetSID.py lldb-Suite :: functionalities/gdb_remote_client/TestGDBRemoteClient.py lldb-Suite :: functionalities/gdb_remote_client/TestGDBRemoteLoad.py lldb-Suite :: functionalities/gdb_remote_client/TestThreadSelectionBug.py lldb-Suite :: commands/expression/multiline-completion/TestMultilineCompletion.py

Hide Details

******************** Unresolved Tests (1): lldb-Suite :: commands/expression/diagnostics/TestExprDiagnostics.py

Hide Details

Hide Details

Slowest Tests: -------------------------------------------------------------------------- 118.50s: lldb-Suite :: python_api/target/TestTargetAPI.py 125.05s: lldb-Suite :: functionalities/inferior-assert/TestInferiorAssert.py 136.37s: lldb-Suite :: lang/c/anonymous/TestAnonymous.py 151.17s: lldb-Suite :: lang/objc/objc-new-syntax/TestObjCNewSyntaxArray.py 152.02s: lldb-Suite :: lang/objc/objc-new-syntax/TestObjCNewSyntaxDictionary.py 152.60s: lldb-Suite :: lang/objc/exceptions/TestObjCExceptions.py 171.49s: lldb-Suite :: api/multithreaded/TestMultithreaded.py 175.61s: lldb-Suite :: commands/target/basic/TestTargetCommand.py 178.61s: lldb-Suite :: lang/objc/objc-new-syntax/TestObjCNewSyntaxLiteral.py 183.59s: lldb-Suite :: lang/cpp/namespace/TestNamespaceLookup.py 185.83s: lldb-Suite :: lang/cpp/enum_types/TestCPP11EnumTypes.py 193.09s: lldb-Suite :: functionalities/gdb_remote_client/TestGDBRemoteLoad.py 194.47s: lldb-Suite :: functionalities/load_unload/TestLoadUnload.py 196.74s: lldb-Suite :: lang/objc/foundation/TestObjCMethods.py 225.64s: lldb-Suite :: lang/objc/hidden-ivars/TestHiddenIvars.py 236.47s: lldb-Suite :: tools/lldb-server/TestLldbGdbServer.py 238.95s: lldb-Suite :: functionalities/return-value/TestReturnValue.py 281.67s: lldb-Suite :: types/TestIntegerTypesExpr.py 377.38s: lldb-Suite :: lang/objc/foundation/TestFoundationDisassembly.py 398.10s: lldb-Suite :: types/TestIntegerTypes.py

Hide Details

Tests Times: -------------------------------------------------------------------------- [ Range ] :: [ Percentage ] :: [ Count ] -------------------------------------------------------------------------- [ 0s, 20s) :: [***************************** ] :: [1291/1727] [ 20s, 40s) :: [****** ] :: [ 261/1727] [ 40s, 60s) :: [** ] :: [ 103/1727] [ 60s, 80s) :: [ ] :: [ 37/1727] [ 80s,100s) :: [ ] :: [ 9/1727] [100s,120s) :: [ ] :: [ 7/1727] [120s,140s) :: [ ] :: [ 2/1727] [140s,160s) :: [ ] :: [ 3/1727] [160s,180s) :: [ ] :: [ 3/1727] [180s,200s) :: [ ] :: [ 5/1727] [200s,220s) :: [ ] :: [ 0/1727] [220s,240s) :: [ ] :: [ 2/1727] [240s,260s) :: [ ] :: [ 1/1727] [260s,280s) :: [ ] :: [ 0/1727] [280s,300s) :: [ ] :: [ 1/1727] [300s,320s) :: [ ] :: [ 0/1727] [320s,340s) :: [ ] :: [ 0/1727] [340s,360s) :: [ ] :: [ 0/1727] [360s,380s) :: [ ] :: [ 1/1727] [380s,400s) :: [ ] :: [ 1/1727] Expected Passes : 1669 Expected Failures : 6 Unsupported Tests : 44 Unresolved Tests : 1 Unexpected Failures: 7 FAILED: tools/lldb/lit/CMakeFiles/check-lldb-lit cd /Users/buildslave/jenkins/workspace/lldb-cmake-sanitized/lldb-build/tools/lldb/lit && /usr/bin/python /Users/buildslave/jenkins/workspace/lldb-cmake-sanitized/lldb-build/./bin/llvm-lit -v --time-tests --shuffle --xunit-xml-output=/Users/buildslave/jenkins/workspace/lldb-cmake-sanitized/test/results.xml -v --timeout 1200 /Users/buildslave/jenkins/workspace/lldb-cmake-sanitized/lldb-build/tools/lldb/lit ninja: build stopped: subcommand failed. Command failed Command: ['/usr/bin/env', 'TERM=vt100', '/usr/local/bin/ninja', '-v', 'check-lldb'] [Pipeline] } [Pipeline] // timeout [Pipeline] } [Pipeline] // stage [Pipeline] stage [Pipeline] { (Declarative: Post Actions) [Pipeline] scanForIssues No credentials specified [Clang (LLVM based)] Sleeping for 5 seconds due to JENKINS-32191... [Clang (LLVM based)] Parsing console log (workspace: '/Users/buildslave/jenkins/workspace/lldb-cmake-sanitized') [Clang (LLVM based)] [-ERROR-] Git blame errors: [Clang (LLVM based)] [-ERROR-] - no blame results for request <llvm-project/lldb/source/Plugins/ExpressionParser/Clang/ClangUserExpression.cpp - [584]>.

Hide Details

[Clang (LLVM based)] Post processing issues on 'green-dragon-23' with source code encoding 'UTF-8' [Clang (LLVM based)] Resolving absolute file names for all issues in workspace '/Users/buildslave/jenkins/workspace/lldb-cmake-sanitized' [Clang (LLVM based)] -> 0 resolved, 0 unresolved, 1 already resolved [Clang (LLVM based)] Copying affected files to Jenkins' build folder '/Users/Shared/Jenkins/Home/jobs/lldb-cmake-sanitized/builds/181/files-with-issues' [Clang (LLVM based)] -> 1 copied, 0 not in workspace, 0 not-found, 0 with I/O error [Clang (LLVM based)] Resolving module names from module definitions (build.xml, pom.xml, or Manifest.mf files) [Clang (LLVM based)] -> resolved module names for 1 issues [Clang (LLVM based)] Resolving package names (or namespaces) by parsing the affected files [Clang (LLVM based)] -> resolved package names of 1 affected files [Clang (LLVM based)] No filter has been set, publishing all 1 issues [Clang (LLVM based)] Creating fingerprints for all affected code blocks to track issues over different builds [Clang (LLVM based)] -> created fingerprints for 1 issues [Clang (LLVM based)] Invoking Git blamer to create author and commit information for all affected files [Clang (LLVM based)] GIT_COMMIT env = 'HEAD' [Clang (LLVM based)] Git working tree = '/Users/buildslave/jenkins/workspace/lldb-cmake-sanitized' [Clang (LLVM based)] Git commit ID = '6bb7e35484f3bf593235bab263dfe0946301e2c9' [Clang (LLVM based)] Job workspace = '/Users/buildslave/jenkins/workspace/lldb-cmake-sanitized' [Clang (LLVM based)] Created blame requests for 1 files - invoking Git blame on agent for each of the requests [Clang (LLVM based)] -> blamed authors of issues in 1 files
[Pipeline] junit Recording test results [Pipeline] } [Pipeline] // stage [Pipeline] } [Pipeline] // withEnv [Pipeline] } [Pipeline] // node [Pipeline] End of Pipeline [BFA] Scanning build for known causes... [BFA] Found failure cause(s): [BFA] Ninja target failed from category Compile [BFA] Regression test failed from category Test [BFA] Done. 0s ERROR: script returned exit code 1 Finished: FAILURE