FailedConsole Output

Skipping 3,787 KB.. Full Log
stIOHandler
(lldb) file /Users/buildslave/jenkins/workspace/lldb-cmake-sanitized/llvm-project/lldb/packages/Python/lldbsuite/test/iohandler/completion/TestIOHandlerCompletion.py

Hide Details

error: '/Users/buildslave/jenkins/workspace/lldb-cmake-sanitized/llvm-project/lldb/packages/Python/lldbsuite/test/iohandler/completion/TestIOHandlerCompletion.py' doesn't contain any 'host' platform architectures: x86_64, i386 (lldb) Available completions: _regexp-attach -- Attach to process by ID or name. _regexp-break -- Set a breakpoint using one of several shorthand formats. _regexp-bt -- Show the current thread's call stack. Any numeric argument displays at most that many frames. The argument 'all' displays all threads. Use 'settings set frame-format' to customize the printing of individual frames and 'settings set thread-format' to customize the thread header. _regexp-display -- Evaluate an expression at every stop (see 'help target stop-hook'.) _regexp-down -- Select a newer stack frame. Defaults to moving one frame, a numeric argument can specify an arbitrary number. _regexp-env -- Shorthand for viewing and setting environment variables. _regexp-jump -- Set the program counter to a new address. _regexp-list -- List relevant source code using one of several shorthand formats. _regexp-tbreak -- Set a one-shot breakpoint using one of several shorthand formats. _regexp-undisplay -- Stop displaying expression at every stop (specified by stop-hook index.) _regexp-up -- Select an older stack frame. Defaults to moving one frame, a numeric argument can specify an arbitrary number. apropos -- List debugger commands related to a word or subject. breakpoint -- Commands for operating on breakpoints (see 'help b' for shorthand.) command -- Commands for managing custom LLDB commands. disassemble -- Disassemble specified instructions in the current target. Defaults to the current function for the current thread and stack frame. expression -- Evaluate an expression on the current thread. Displays any returned value with LLDB's default formatting. frame -- Commands for selecting and examing the current thread's stack frames. gdb-remote -- Connect to a process via remote GDB server. If no host is specifed, localhost is assumed. gui -- Switch into the curses based GUI mode. help -- Show a list of all debugger commands, or give details about a specific command. kdp-remote -- Connect to a process via remote KDP server. If no UDP port is specified, port 41139 is assumed. language -- Commands specific to a source language. log -- Commands controlling LLDB internal logging. memory -- Commands for operating on memory in the current target process. platform -- Commands to manage and create platforms. plugin -- Commands for managing LLDB plugins. process -- Commands for interacting with processes on the current platform. quit -- Quit the LLDB debugger. register -- Commands to access registers for the current thread and stack frame. reproducer -- Commands for manipulating reproducers. Reproducers make it possible to capture full debug sessions with all its dependencies. The resulting reproducer is used to replay the debug session while debugging the debugger. Because reproducers need the whole the debug session from beginning to end, you need to launch the debugger in capture or replay mode, commonly though the command line driver. Reproducers are unrelated record-replay debugging, as you cannot interact with the debugger during replay.

Hide Details

script -- Invoke the script interpreter with provided code and display any results. Start the interactive interpreter if no code is supplied. settings -- Commands for managing LLDB settings. source -- Commands for examining source code described by debug information for the current target process. statistics -- Print statistics about a debugging session target -- Commands for operating on debugger targets. thread -- Commands for operating on one or more threads in the current process. type -- Commands for operating on the type system. version -- Show the LLDB debugger version. watchpoint -- Commands for operating on watchpoints. add-dsym -- Add a debug symbol file to one of the target's current modules by specifying a path to a debug symbols file, or using the options to specify a module to download symbols for. More (Y/n/a): n (lldb)  regoinvalid [K(lldb) regosettings set interpreter.prompt-on-quit false

Hide Details

Session logs for test failures/errors/unexpected successes will go into directory '/Users/buildslave/jenkins/workspace/lldb-cmake-sanitized/test/logs' Command invoked: /Users/buildslave/jenkins/workspace/lldb-cmake-sanitized/llvm-project/lldb/test/API/dotest.py --arch=x86_64 -s /Users/buildslave/jenkins/workspace/lldb-cmake-sanitized/lldb-build/lldb-test-traces -S nm -u CXXFLAGS -u CFLAGS --executable /Users/buildslave/jenkins/workspace/lldb-cmake-sanitized/lldb-build/./bin/lldb --dsymutil /Users/buildslave/jenkins/workspace/lldb-cmake-sanitized/lldb-build/./bin/dsymutil --filecheck /Users/buildslave/jenkins/workspace/lldb-cmake-sanitized/lldb-build/./bin/FileCheck -C /Users/buildslave/jenkins/workspace/lldb-cmake-sanitized/host-compiler/bin/clang --codesign-identity lldb_codesign --server /Users/buildslave/jenkins/workspace/lldb-cmake-sanitized/lldb-build/./bin/debugserver --arch x86_64 --build-dir /Users/buildslave/jenkins/workspace/lldb-cmake-sanitized/lldb-build/lldb-test-build.noindex -s=/Users/buildslave/jenkins/workspace/lldb-cmake-sanitized/test/logs -t --env TERM=vt100 --env LLVM_LIBS_DIR=/Users/buildslave/jenkins/workspace/lldb-cmake-sanitized/lldb-build/./lib --build-dir /Users/buildslave/jenkins/workspace/lldb-cmake-sanitized/lldb-build/tools/lldb/lldb-test-build.noindex --lldb-module-cache-dir /Users/buildslave/jenkins/workspace/lldb-cmake-sanitized/lldb-build/tools/lldb/lldb-test-build.noindex/module-cache-lldb/lldb-api --clang-module-cache-dir /Users/buildslave/jenkins/workspace/lldb-cmake-sanitized/lldb-build/tools/lldb/lldb-test-build.noindex/module-cache-clang/lldb-api /Users/buildslave/jenkins/workspace/lldb-cmake-sanitized/llvm-project/lldb/packages/Python/lldbsuite/test/iohandler/completion -p TestIOHandlerCompletion.py Change dir to: /Users/buildslave/jenkins/workspace/lldb-cmake-sanitized/llvm-project/lldb/packages/Python/lldbsuite/test/iohandler/completion runCmd: settings set symbols.enable-external-lookup false output:

Hide Details

runCmd: settings set plugin.process.gdb-remote.packet-timeout 60 output:

Hide Details

runCmd: settings set symbols.clang-modules-cache-path "/Users/buildslave/jenkins/workspace/lldb-cmake-sanitized/lldb-build/tools/lldb/lldb-test-build.noindex/module-cache-lldb/lldb-api" output:

Hide Details

runCmd: settings set use-color false output:

Hide Details

FAIL: LLDB (/Users/buildslave/jenkins/workspace/lldb-cmake-sanitized/host-compiler/bin/clang-10-x86_64) :: test_completion (TestIOHandlerCompletion.IOHandlerCompletionTest) tearing down the child process....

Hide Details

CLEANUP ERROR: LLDB (/Users/buildslave/jenkins/workspace/lldb-cmake-sanitized/host-compiler/bin/clang-10-x86_64) :: test_completion (TestIOHandlerCompletion.IOHandlerCompletionTest) Restore dir to: /Users/buildslave/jenkins/workspace/lldb-cmake-sanitized/lldb-build/tools/lldb/test ====================================================================== ERROR: test_completion (TestIOHandlerCompletion.IOHandlerCompletionTest) ---------------------------------------------------------------------- Traceback (most recent call last): File "/Users/buildslave/jenkins/workspace/lldb-cmake-sanitized/llvm-project/lldb/packages/Python/lldbsuite/test/iohandler/completion/TestIOHandlerCompletion.py", line 52, in test_completion self.quit() File "/Users/buildslave/jenkins/workspace/lldb-cmake-sanitized/llvm-project/lldb/packages/Python/lldbsuite/test/lldbpexpect.py", line 61, in quit self.child.close(force=not gracefully) File "/Users/buildslave/jenkins/workspace/lldb-cmake-sanitized/llvm-project/lldb/third_party/Python/module/pexpect-4.6/pexpect/pty_spawn.py", line 327, in close self.ptyproc.close(force=force) File "/System/Library/Frameworks/Python.framework/Versions/2.7/lib/python2.7/contextlib.py", line 35, in __exit__ self.gen.throw(type, value, traceback) File "/Users/buildslave/jenkins/workspace/lldb-cmake-sanitized/llvm-project/lldb/third_party/Python/module/pexpect-4.6/pexpect/pty_spawn.py", line 25, in _wrap_ptyprocess_err raise ExceptionPexpect(*e.args) ExceptionPexpect: Could not terminate the child. Config=x86_64-/Users/buildslave/jenkins/workspace/lldb-cmake-sanitized/host-compiler/bin/clang-10 ---------------------------------------------------------------------- Ran 1 test in 4.354s

Hide Details

RESULT: FAILED (0 passes, 0 failures, 1 errors, 0 skipped, 0 expected failures, 0 unexpected successes)

Hide Details

******************** PASS: lldb-api :: lang/c/modules/TestCModules.py (320 of 1785) PASS: lldb-unit :: Utility/./UtilityTests/ScalarTest.Promotion (321 of 1785) PASS: lldb-api :: commands/frame/diagnose/local-variable/TestLocalVariable.py (322 of 1785) PASS: lldb-api :: functionalities/thread/concurrent_events/TestConcurrentTwoBreakpointsOneWatchpoint.py (323 of 1785) PASS: lldb-unit :: ScriptInterpreter/Python/./ScriptInterpreterPythonTests/PythonDataObjectsTest.TestCallable (324 of 1785) PASS: lldb-shell :: ObjectFile/ELF/gnu-debuglink.yaml (325 of 1785) PASS: lldb-api :: python_api/watchpoint/condition/TestWatchpointConditionAPI.py (326 of 1785) PASS: lldb-api :: lang/cpp/lambdas/TestLambdas.py (327 of 1785) PASS: lldb-unit :: Utility/./UtilityTests/AnsiTerminal.AtStart (328 of 1785) PASS: lldb-shell :: SymbolFile/Breakpad/symtab.test (329 of 1785) PASS: lldb-api :: python_api/value_var_update/TestValueVarUpdate.py (330 of 1785) PASS: lldb-unit :: Utility/./UtilityTests/StringExtractorTest.GetU64LittleEndian (331 of 1785) PASS: lldb-api :: commands/target/create-deps/TestTargetCreateDeps.py (332 of 1785) PASS: lldb-api :: commands/expression/import-std-module/weak_ptr/TestWeakPtr.py (333 of 1785) PASS: lldb-api :: commands/command/source/TestCommandSource.py (334 of 1785) PASS: lldb-unit :: Utility/./UtilityTests/StreamTest.PutCString (335 of 1785) PASS: lldb-unit :: Utility/./UtilityTests/RangeTest.ClearWithStarAddress (336 of 1785) PASS: lldb-api :: lang/objc/objc-optimized/TestObjcOptimized.py (337 of 1785) PASS: lldb-api :: functionalities/gdb_remote_client/TestTargetXMLArch.py (338 of 1785) PASS: lldb-api :: lang/cpp/namespace/TestNamespaceLookup.py (339 of 1785) PASS: lldb-api :: functionalities/thread/concurrent_events/TestConcurrentTwoBreakpointThreads.py (340 of 1785) PASS: lldb-unit :: Editline/./EditlineTests/EditlineTestFixture.EditlineReceivesSingleLineText (341 of 1785) PASS: lldb-unit :: UnwindAssembly/x86/./UnwindAssemblyx86Tests/Testx86AssemblyInspectionEngine.TestPushR13 (342 of 1785) PASS: lldb-unit :: Utility/./UtilityTests/TimeoutTest.Format (343 of 1785) PASS: lldb-api :: lang/cpp/type_lookup/TestCppTypeLookup.py (344 of 1785) PASS: lldb-api :: functionalities/thread/concurrent_events/TestConcurrentManyCrash.py (345 of 1785) UNSUPPORTED: lldb-api :: commands/expression/completion-crash-incomplete-record/TestCompletionCrashIncompleteRecord.py (346 of 1785) PASS: lldb-unit :: Language/Highlighting/./HighlighterTests/HighlighterTest.ClangCursorPos (347 of 1785) PASS: lldb-api :: python_api/breakpoint/TestBreakpointAPI.py (348 of 1785) PASS: lldb-unit :: Host/./HostTests/FileSystemTest.Exists (349 of 1785) PASS: lldb-api :: tools/lldb-server/TestAppleSimulatorOSType.py (350 of 1785) PASS: lldb-api :: functionalities/postmortem/minidump-new/TestMiniDumpNew.py (351 of 1785) PASS: lldb-unit :: ScriptInterpreter/Python/./ScriptInterpreterPythonTests/PythonDataObjectsTest.TestPythonCallableInvoke (352 of 1785) PASS: lldb-unit :: Utility/./UtilityTests/FileSpecTest.EqualDotsWindows (353 of 1785) PASS: lldb-unit :: Language/Highlighting/./HighlighterTests/HighlighterTest.ClangCursorPosInOtherToken (354 of 1785) PASS: lldb-unit :: Utility/./UtilityTests/DataExtractorTest.GetMaxU64_unchecked (355 of 1785) PASS: lldb-unit :: Process/minidump/./LLDBMinidumpTests/RegisterContextMinidump.CheckRegisterContextMinidump_ARM (356 of 1785) PASS: lldb-shell :: ObjectFile/ELF/PT_TLS-overlap-PT_LOAD.yaml (357 of 1785) PASS: lldb-unit :: Utility/./UtilityTests/ArgsTest.DoubleQuotedItem (358 of 1785) PASS: lldb-unit :: ScriptInterpreter/Python/./ScriptInterpreterPythonTests/PythonExceptionStateTest.TestManualRestoreSemantics (359 of 1785) PASS: lldb-shell :: Reproducer/Functionalities/TestDataFormatter.test (360 of 1785) PASS: lldb-unit :: Utility/./UtilityTests/OptionsWithRawTest.QuotedSuffix (361 of 1785) PASS: lldb-api :: functionalities/thread/exit_during_break/TestExitDuringBreak.py (362 of 1785) UNSUPPORTED: lldb-api :: tools/lldb-server/thread-name/TestGdbRemoteThreadName.py (363 of 1785) PASS: lldb-unit :: Utility/./UtilityTests/StringListTest.LongestCommonPrefixDuplicateElement (364 of 1785) PASS: lldb-api :: functionalities/param_entry_vals/basic_entry_values_x86_64/TestBasicEntryValuesX86_64.py (365 of 1785) PASS: lldb-unit :: Utility/./UtilityTests/FileSpecTest.EqualDotsPosixRoot (366 of 1785) PASS: lldb-api :: lang/c/local_variables/TestLocalVariables.py (367 of 1785) PASS: lldb-api :: functionalities/data-formatter/data-formatter-objc/TestDataFormatterObjCNSData.py (368 of 1785) PASS: lldb-api :: lang/objc/unicode-string/TestUnicodeString.py (369 of 1785) PASS: lldb-api :: python_api/watchpoint/TestWatchpointIter.py (370 of 1785) UNSUPPORTED: lldb-api :: benchmarks/frame_variable/TestFrameVariableResponse.py (371 of 1785) PASS: lldb-api :: python_api/target/TestTargetAPI.py (372 of 1785) PASS: lldb-api :: python_api/thread/TestThreadAPI.py (373 of 1785) PASS: lldb-api :: functionalities/signal/raise/TestRaise.py (374 of 1785) PASS: lldb-unit :: Utility/./UtilityTests/StreamTest.PutNHex8 (375 of 1785) PASS: lldb-unit :: Expression/./ExpressionTests/DWARFExpression.DW_OP_pick (376 of 1785) PASS: lldb-unit :: Utility/./UtilityTests/StringListTest.AppendStringStdString (377 of 1785) PASS: lldb-shell :: Settings/TestSettingsSet.test (378 of 1785) PASS: lldb-unit :: ScriptInterpreter/Python/./ScriptInterpreterPythonTests/PythonDataObjectsTest.TestTypeNameResolutionNoDot (379 of 1785) PASS: lldb-unit :: Utility/./UtilityTests/ScalarTest.APIntConstructor (380 of 1785) PASS: lldb-api :: tools/lldb-server/inferior-crash/TestGdbRemoteSegFault.py (381 of 1785) PASS: lldb-api :: functionalities/tail_call_frames/disambiguate_call_site/TestDisambiguateCallSite.py (382 of 1785) PASS: lldb-unit :: Host/./HostTests/ConnectionFileDescriptorTest.TCPGetURIv4 (383 of 1785) PASS: lldb-unit :: Utility/./UtilityTests/ReproducerTest.SetReplay (384 of 1785) PASS: lldb-shell :: ObjectFile/ELF/aarch64-relocations.yaml (385 of 1785) PASS: lldb-unit :: Utility/./UtilityTests/StreamTest.PutBytesAsRawHex8ToBigEndian (386 of 1785) PASS: lldb-api :: commands/target/basic/TestTargetCommand.py (387 of 1785) PASS: lldb-api :: python_api/watchpoint/TestSetWatchpoint.py (388 of 1785) PASS: lldb-api :: functionalities/recursion/TestValueObjectRecursion.py (389 of 1785) PASS: lldb-unit :: Utility/./UtilityTests/Predicate.WaitForValueNotEqualTo (390 of 1785) UNSUPPORTED: lldb-shell :: SymbolFile/PDB/variables-locations.test (391 of 1785) PASS: lldb-api :: commands/log/basic/TestLogging.py (392 of 1785) PASS: lldb-shell :: Breakpoint/debug_rnglist_rlestartend.test (393 of 1785) UNSUPPORTED: lldb-api :: functionalities/breakpoint/breakpoint_in_delayslot/TestAvoidBreakpointInDelaySlot.py (394 of 1785) PASS: lldb-api :: functionalities/data-formatter/boolreference/TestFormattersBoolRefPtr.py (395 of 1785) PASS: lldb-api :: lang/cpp/function_refs/TestFunctionRefs.py (396 of 1785) PASS: lldb-api :: macosx/function-starts/TestFunctionStarts.py (397 of 1785) PASS: lldb-api :: macosx/load-kext/TestLoadKext.py (398 of 1785) PASS: lldb-unit :: ScriptInterpreter/Python/./ScriptInterpreterPythonTests/PythonDataObjectsTest.TestGlobalNameResolutionWithDot (399 of 1785) PASS: lldb-shell :: ExecControl/StopHook/stop-hook.test (400 of 1785) PASS: lldb-unit :: Utility/./UtilityTests/UriParserTest.SchemeHostSeparator4 (401 of 1785) PASS: lldb-api :: functionalities/type_lookup/TestTypeLookup.py (402 of 1785) UNSUPPORTED: lldb-shell :: Register/x86-64-zmm-read.test (403 of 1785) PASS: lldb-unit :: Utility/./UtilityTests/GeneratorTest.Get (404 of 1785) PASS: lldb-unit :: Utility/./UtilityTests/UriParserTest.BadPort (405 of 1785) PASS: lldb-unit :: Symbol/./SymbolTests/LineEntryTest.GetSameLineContiguousAddressRangeNestedInline (406 of 1785) PASS: lldb-shell :: Breakpoint/jitbp_elf.test (407 of 1785) PASS: lldb-unit :: Utility/./UtilityTests/EventTest.DumpEventDataBytes (408 of 1785) UNSUPPORTED: lldb-api :: functionalities/darwin_log/basic/TestDarwinLogBasic.py (409 of 1785) PASS: lldb-api :: functionalities/return-value/TestReturnValue.py (410 of 1785) PASS: lldb-unit :: Process/minidump/./LLDBMinidumpTests/MinidumpParserTest.GetMemory (411 of 1785) PASS: lldb-unit :: Symbol/./SymbolTests/Type.CompilerContextPattern (412 of 1785) PASS: lldb-api :: commands/expression/fixits/TestFixIts.py (413 of 1785) PASS: lldb-unit :: Utility/./UtilityTests/FileSpecTest.IsRelative (414 of 1785) PASS: lldb-unit :: Language/Highlighting/./HighlighterTests/HighlighterTest.ClangStringLiterals (415 of 1785) PASS: lldb-unit :: ScriptInterpreter/Python/./ScriptInterpreterPythonTests/PythonDataObjectsTest.TestPythonBoolean (416 of 1785) PASS: lldb-shell :: Driver/TestTarget.test (417 of 1785) PASS: lldb-unit :: Expression/./ExpressionTests/CppModuleConfigurationTest.LinuxLocalLibCpp (418 of 1785) PASS: lldb-api :: lang/objc/ptr_refs/TestPtrRefsObjC.py (419 of 1785) PASS: lldb-unit :: Utility/./UtilityTests/StringListTest.SplitIntoLines (420 of 1785) PASS: lldb-shell :: Unwind/trap_frame_sym_ctx.test (421 of 1785) PASS: lldb-unit :: Utility/./UtilityTests/StreamTest.ShiftOperatorUInts (422 of 1785) PASS: lldb-api :: python_api/objc_type/TestObjCType.py (423 of 1785) PASS: lldb-unit :: Host/./HostTests/File.GetStreamFromDescriptor (424 of 1785) PASS: lldb-unit :: Utility/./UtilityTests/ProcessInstanceInfoMatch.Name (425 of 1785) PASS: lldb-api :: functionalities/breakpoint/breakpoint_locations/TestBreakpointLocations.py (426 of 1785) PASS: lldb-api :: linux/builtin_trap/TestBuiltinTrap.py (427 of 1785) PASS: lldb-shell :: Process/TestEnvironment.test (428 of 1785) PASS: lldb-unit :: Symbol/./SymbolTests/DWARFCallFrameInfoTest.Basic_eh (429 of 1785) PASS: lldb-unit :: Expression/./ExpressionTests/CppModuleConfigurationTest.MissingLibCpp (430 of 1785) PASS: lldb-unit :: ScriptInterpreter/Python/./ScriptInterpreterPythonTests/PythonDataObjectsTest.TestPythonDictionaryValueEquality (431 of 1785) PASS: lldb-api :: functionalities/thread/concurrent_events/TestConcurrentNWatchNBreak.py (432 of 1785) PASS: lldb-shell :: Breakpoint/debug_rnglist_offset_pair.test (433 of 1785) PASS: lldb-unit :: ScriptInterpreter/Python/./ScriptInterpreterPythonTests/PythonDataObjectsTest.TestPythonListManipulation (434 of 1785) PASS: lldb-unit :: ObjectFile/ELF/./ObjectFileELFTests/ObjectFileELFTest.GetSymtab_NoSymEntryPointArmThumbAddressClass (435 of 1785) PASS: lldb-unit :: UnwindAssembly/x86/./UnwindAssemblyx86Tests/Testx86AssemblyInspectionEngine.Test32bitFramelessBigStackFrame (436 of 1785) PASS: lldb-unit :: Host/./HostTests/NativeProcessProtocolTest.SetBreakpoint (437 of 1785) PASS: lldb-api :: functionalities/breakpoint/breakpoint_command/TestRegexpBreakCommand.py (438 of 1785) PASS: lldb-api :: lang/cpp/member-and-local-vars-with-same-name/TestMembersAndLocalsWithSameName.py (439 of 1785) PASS: lldb-api :: functionalities/plugins/python_os_plugin/TestPythonOSPlugin.py (440 of 1785) PASS: lldb-unit :: Expression/./ExpressionTests/DiagnosticManagerTest.GetStringPreserveOrder (441 of 1785) PASS: lldb-unit :: Utility/./UtilityTests/UriParserTest.SchemeHostSeparator (442 of 1785) UNSUPPORTED: lldb-shell :: Register/x86-gp-write.test (443 of 1785) PASS: lldb-unit :: Utility/./UtilityTests/AnsiTerminal.Empty (444 of 1785) PASS: lldb-api :: functionalities/conditional_break/TestConditionalBreak.py (445 of 1785) PASS: lldb-unit :: Expression/./ExpressionTests/DiagnosticManagerTest.GetStringBasic (446 of 1785) PASS: lldb-api :: python_api/sblaunchinfo/TestSBLaunchInfo.py (447 of 1785) PASS: lldb-unit :: Process/gdb-remote/./ProcessGdbRemoteTests/GDBRemoteCommunicationClientTest.SendGetTraceConfigPacket (448 of 1785) UNSUPPORTED: lldb-api :: commands/gui/basic/TestGuiBasic.py (449 of 1785) PASS: lldb-unit :: Utility/./UtilityTests/ConstStringTest.UpdateMangledCounterpart (450 of 1785) PASS: lldb-unit :: Symbol/./SymbolTests/LineEntryTest.GetSameLineContiguousAddressRangeNoInlines (451 of 1785) UNSUPPORTED: lldb-shell :: Unwind/unwind-plan-dwarf-dump.test (452 of 1785) PASS: lldb-shell :: Settings/TestSettingsWrite.test (453 of 1785) PASS: lldb-api :: commands/frame/diagnose/inheritance/TestDiagnoseInheritance.py (454 of 1785) PASS: lldb-api :: functionalities/data-formatter/data-formatter-stl/libstdcpp/unique_ptr/invalid/TestDataFormatterInvalidStdUniquePtr.py (455 of 1785) PASS: lldb-unit :: ScriptInterpreter/Python/./ScriptInterpreterPythonTests/PythonDataObjectsTest.TestPythonListToStructuredList (456 of 1785) PASS: lldb-api :: functionalities/breakpoint/breakpoint_names/TestBreakpointNames.py (457 of 1785) PASS: lldb-api :: lang/objc/foundation/TestSymbolTable.py (458 of 1785) PASS: lldb-unit :: Utility/./UtilityTests/ProcessInstanceInfo.Dump (459 of 1785) PASS: lldb-shell :: Breakpoint/debug_rnglistx_rlex.test (460 of 1785) PASS: lldb-unit :: Utility/./UtilityTests/UserIDResolver.GetUserName (461 of 1785) PASS: lldb-unit :: Host/./HostTests/Host.WaitStatusFormat (462 of 1785) PASS: lldb-shell :: ObjectFile/MachO/subsections.yaml (463 of 1785) PASS: lldb-unit :: Utility/./UtilityTests/SerializationRountripTest.SerializeDeserializeObjectReference (464 of 1785) PASS: lldb-unit :: Utility/./UtilityTests/StringExtractorTest.InitMisc (465 of 1785) PASS: lldb-unit :: Expression/./ExpressionTests/DiagnosticManagerTest.GetStringMultipleDiags (466 of 1785) PASS: lldb-unit :: Utility/./UtilityTests/LogChannelTest.Enable (467 of 1785) PASS: lldb-api :: functionalities/data-formatter/compactvectors/TestCompactVectors.py (468 of 1785) PASS: lldb-api :: functionalities/thread/backtrace_all/TestBacktraceAll.py (469 of 1785) PASS: lldb-unit :: Utility/./UtilityTests/ArgsTest.TestArgv (470 of 1785) PASS: lldb-api :: functionalities/thread/concurrent_events/TestConcurrentBreakpointDelayBreakpointOneSignal.py (471 of 1785) PASS: lldb-api :: commands/frame/diagnose/dereference-this/TestDiagnoseDereferenceThis.py (472 of 1785) UNSUPPORTED: lldb-shell :: Register/aarch64-gp-read.test (473 of 1785) PASS: lldb-api :: functionalities/wrong_commands/TestWrongCommands.py (474 of 1785) PASS: lldb-api :: functionalities/postmortem/wow64_minidump/TestWow64MiniDump.py (475 of 1785) PASS: lldb-api :: functionalities/data-formatter/stringprinter/TestStringPrinter.py (476 of 1785) PASS: lldb-unit :: Process/gdb-remote/./ProcessGdbRemoteTests/GDBRemoteCommunicationClientTest.GetMemoryRegionInfoInvalidResponse (477 of 1785) PASS: lldb-unit :: Interpreter/./InterpreterTests/OptionArgParserTest.toChar (478 of 1785) PASS: lldb-unit :: Utility/./UtilityTests/RangeDataVector.FindEntryThatContains (479 of 1785) PASS: lldb-api :: sample_test/TestSampleInlineTest.py (480 of 1785) PASS: lldb-api :: functionalities/completion/TestCompletion.py (481 of 1785) PASS: lldb-unit :: Utility/./UtilityTests/RecordReplayTest.InstrumentedBarPtr (482 of 1785) PASS: lldb-unit :: Editline/./EditlineTests/EditlineTestFixture.EditlineReceivesMultiLineText (483 of 1785) PASS: lldb-unit :: Process/minidump/./LLDBMinidumpTests/MinidumpParserTest.MinidumpModuleOrder (484 of 1785) PASS: lldb-api :: functionalities/gdb_remote_client/TestArmRegisterDefinition.py (485 of 1785) PASS: lldb-unit :: Utility/./UtilityTests/LogTest.Register (486 of 1785) PASS: lldb-unit :: Utility/./UtilityTests/LogChannelEnabledTest.LogGetLogThread (487 of 1785) PASS: lldb-api :: python_api/lldbutil/frame/TestFrameUtils.py (488 of 1785) PASS: lldb-api :: functionalities/tail_call_frames/thread_step_out_message/TestArtificialFrameStepOutMessage.py (489 of 1785) PASS: lldb-api :: macosx/thread-names/TestInterruptThreadNames.py (490 of 1785) PASS: lldb-api :: lang/cpp/unicode-literals/TestUnicodeLiterals.py (491 of 1785) PASS: lldb-unit :: Host/./HostTests/HostInfoTest.GetHostname (492 of 1785) PASS: lldb-shell :: SymbolFile/DWARF/find-basic-function.cpp (493 of 1785) PASS: lldb-api :: commands/frame/select/TestFrameSelect.py (494 of 1785) PASS: lldb-api :: functionalities/abbreviation/TestAbbreviations.py (495 of 1785) PASS: lldb-unit :: Utility/./UtilityTests/StringListTest.AppendListCStringArray (496 of 1785) PASS: lldb-unit :: Utility/./UtilityTests/StringListTest.ShiftMove (497 of 1785) PASS: lldb-api :: commands/frame/diagnose/array/TestArray.py (498 of 1785) PASS: lldb-api :: lang/c/const_variables/TestConstVariables.py (499 of 1785) PASS: lldb-api :: lang/cpp/template-function/TestTemplateFunctions.py (500 of 1785) PASS: lldb-unit :: Utility/./UtilityTests/RecordReplayTest.InstrumentedFoo (501 of 1785) UNSUPPORTED: lldb-shell :: SymbolFile/PDB/ast-restore.test (502 of 1785) PASS: lldb-shell :: Driver/TestNoUseColor.test (503 of 1785) PASS: lldb-unit :: Process/gdb-remote/./ProcessGdbRemoteTests/GDBRemoteCommunicationServerTest.SendErrorResponse_ErrorList (504 of 1785) PASS: lldb-api :: functionalities/data-formatter/dump_dynamic/TestDumpDynamic.py (505 of 1785) PASS: lldb-unit :: Host/./HostTests/MainLoopTest.ReadObject (506 of 1785) PASS: lldb-api :: commands/watchpoints/watchpoint_commands/TestWatchpointCommands.py (507 of 1785) PASS: lldb-api :: functionalities/thread/concurrent_events/TestConcurrentBreakpointOneDelayBreakpointThreads.py (508 of 1785) PASS: lldb-api :: commands/expression/calculator_mode/TestCalculatorMode.py (509 of 1785) PASS: lldb-api :: functionalities/breakpoint/address_breakpoints/TestBadAddressBreakpoints.py (510 of 1785) PASS: lldb-shell :: Reproducer/TestDriverOptions.test (511 of 1785) PASS: lldb-unit :: UnwindAssembly/x86/./UnwindAssemblyx86Tests/Testx86AssemblyInspectionEngine.TestSpillRegToStackViaMOVx86_64 (512 of 1785) UNSUPPORTED: lldb-shell :: ObjectFile/ELF/minidebuginfo-no-lzma.yaml (513 of 1785) PASS: lldb-api :: commands/watchpoints/watchpoint_on_vectors/TestValueOfVectorVariable.py (514 of 1785) PASS: lldb-unit :: Utility/./UtilityTests/ArgsTest.TestQuotedTrailingBackslash (515 of 1785) PASS: lldb-unit :: Symbol/./SymbolTests/DWARFCallFrameInfoTest.Basic_dwarf4 (516 of 1785) PASS: lldb-api :: functionalities/breakpoint/step_over_breakpoint/TestStepOverBreakpoint.py (517 of 1785) XFAIL: lldb-shell :: Register/x86-64-write.test (518 of 1785) PASS: lldb-api :: functionalities/breakpoint/inlined_breakpoints/TestInlinedBreakpoints.py (519 of 1785) PASS: lldb-unit :: Utility/./UtilityTests/StringListTest.InsertStringAtIndexEnd (520 of 1785) PASS: lldb-unit :: Utility/./UtilityTests/Predicate.WaitForValueEqualTo (521 of 1785) PASS: lldb-unit :: Process/gdb-remote/./ProcessGdbRemoteTests/GDBRemoteClientBaseTest.SendContinueAndLateInterrupt (522 of 1785) PASS: lldb-shell :: BuildScript/modes.test (523 of 1785) PASS: lldb-unit :: Utility/./UtilityTests/ArchSpecTest.MergeFrom (524 of 1785) PASS: lldb-unit :: Utility/./UtilityTests/RangeTest.Equal (525 of 1785) PASS: lldb-api :: functionalities/data-formatter/data-formatter-objc/TestDataFormatterObjCCF.py (526 of 1785) PASS: lldb-unit :: debugserver/./debugserverTests/RNBSocket.LoopBackConnectIPv4 (527 of 1785) PASS: lldb-api :: commands/expression/call-function/TestCallStopAndContinue.py (528 of 1785) PASS: lldb-unit :: Utility/./UtilityTests/RangeTest.DoesIntersect (529 of 1785) PASS: lldb-api :: commands/expression/import-std-module/vector-basic/TestBasicVector.py (530 of 1785) PASS: lldb-api :: functionalities/tail_call_frames/inlining_and_tail_calls/TestInliningAndTailCalls.py (531 of 1785) UNSUPPORTED: lldb-shell :: SymbolFile/dissassemble-entry-point.s (532 of 1785) PASS: lldb-unit :: Utility/./UtilityTests/StringListTest.SetSize (533 of 1785) UNSUPPORTED: lldb-api :: functionalities/thread/concurrent_events/TestConcurrentManySignals.py (534 of 1785) PASS: lldb-api :: lang/c/struct_types/TestStructTypes.py (535 of 1785) PASS: lldb-api :: lang/objc/objc-ivar-stripped/TestObjCIvarStripped.py (536 of 1785) PASS: lldb-api :: functionalities/tail_call_frames/disambiguate_tail_call_seq/TestDisambiguateTailCallSeq.py (537 of 1785) PASS: lldb-api :: functionalities/thread/create_after_attach/TestCreateAfterAttach.py (538 of 1785) PASS: lldb-unit :: Utility/./UtilityTests/StreamTeeTest.AppendStream (539 of 1785) PASS: lldb-api :: lang/c/inlines/TestRedefinitionsInInlines.py (540 of 1785) UNSUPPORTED: lldb-shell :: SymbolFile/PDB/pointers.test (541 of 1785) PASS: lldb-unit :: UnwindAssembly/x86/./UnwindAssemblyx86Tests/Testx86AssemblyInspectionEngine.TestPopRBPWithREX (542 of 1785) PASS: lldb-api :: lang/c/enum_types/TestEnumTypes.py (543 of 1785) PASS: lldb-unit :: UnwindAssembly/x86/./UnwindAssemblyx86Tests/Testx86AssemblyInspectionEngine.TestPushESI (544 of 1785) PASS: lldb-unit :: Utility/./UtilityTests/BinaryStreamTest.PutULEB128EightBytes (545 of 1785) PASS: lldb-api :: commands/expression/namespace_local_var_same_name_obj_c/TestNamespaceLocalVarSameNameObjC.py (546 of 1785) PASS: lldb-shell :: Breakpoint/split-dwarf-5-addrbase.test (547 of 1785) PASS: lldb-unit :: Process/minidump/./LLDBMinidumpTests/MinidumpParserTest.GetFilteredModuleList (548 of 1785) PASS: lldb-unit :: Host/./HostTests/NativeProcessProtocolTest.SetBreakpointFailWrite (549 of 1785) PASS: lldb-api :: lang/cpp/dynamic-value-same-basename/TestDynamicValueSameBase.py (550 of 1785) UNSUPPORTED: lldb-api :: functionalities/thread/state/TestThreadStates.py (551 of 1785) PASS: lldb-api :: lang/objc/real-definition/TestRealDefinition.py (552 of 1785) PASS: lldb-api :: lang/objc/objc-struct-argument/TestObjCStructArgument.py (553 of 1785) PASS: lldb-unit :: ScriptInterpreter/Python/./ScriptInterpreterPythonTests/PythonDataObjectsTest.TestDictionaryResolutionWithDot (554 of 1785) PASS: lldb-unit :: Process/minidump/./LLDBMinidumpTests/MinidumpParserTest.GetMemoryRegionInfo (555 of 1785) PASS: lldb-api :: lang/c/find_struct_type/TestFindStructTypes.py (556 of 1785) PASS: lldb-api :: functionalities/multiword-commands/TestMultiWordCommands.py (557 of 1785) PASS: lldb-unit :: Host/./HostTests/FileSystemTest.OpenErrno (558 of 1785) PASS: lldb-unit :: Utility/./UtilityTests/StreamTest.ShiftOperatorChars (559 of 1785) PASS: lldb-shell :: ObjectFile/MachO/lc_build_version.yaml (560 of 1785) PASS: lldb-unit :: ScriptInterpreter/Python/./ScriptInterpreterPythonTests/PythonDataObjectsTest.TestPythonByteArray (561 of 1785) PASS: lldb-api :: lang/cpp/class_static/TestStaticVariables.py (562 of 1785) PASS: lldb-shell :: Quit/TestQuitExitCodeHexA.test (563 of 1785) PASS: lldb-unit :: Utility/./UtilityTests/OptionsWithRawTest.MultiWordSuffix (564 of 1785) PASS: lldb-unit :: Utility/./UtilityTests/UUIDTest.Validity (565 of 1785) PASS: lldb-api :: lang/cpp/gmodules/TestWithModuleDebugging.py (566 of 1785) PASS: lldb-api :: functionalities/data-formatter/data-formatter-objc/TestDataFormatterObjCNSDate.py (567 of 1785) PASS: lldb-shell :: Driver/TestConvenienceVariables.test (568 of 1785) PASS: lldb-api :: functionalities/jitloader_gdb/TestJITLoaderGDB.py (569 of 1785) PASS: lldb-shell :: SymbolFile/DWARF/debug-types-basic.test (570 of 1785) PASS: lldb-unit :: Expression/./ExpressionTests/CppModuleConfigurationTest.UnrelatedLibrary (571 of 1785) PASS: lldb-api :: functionalities/data-formatter/pyobjsynthprovider/TestPyObjSynthProvider.py (572 of 1785) PASS: lldb-api :: commands/frame/diagnose/virtual-method-call/TestDiagnoseDereferenceVirtualMethodCall.py (573 of 1785) PASS: lldb-unit :: Interpreter/./InterpreterTests/OptionArgParserTest.toScriptLanguage (574 of 1785) PASS: lldb-shell :: ObjectFile/Breakpad/sections-trailing-func.test (575 of 1785) PASS: lldb-unit :: UnwindAssembly/x86/./UnwindAssemblyx86Tests/Testx86AssemblyInspectionEngine.TestAddRSP (576 of 1785) PASS: lldb-unit :: debugserver/./debugserverTests/RNBSocket.LoopBackListenIPv4 (577 of 1785) PASS: lldb-api :: tools/lldb-server/inferior-crash/TestGdbRemoteAbort.py (578 of 1785) PASS: lldb-api :: lang/objcxx/objcxx-ivar-vector/TestIvarVector.py (579 of 1785) PASS: lldb-unit :: Host/./HostTests/SocketTest.DomainListenConnectAccept (580 of 1785) PASS: lldb-unit :: Utility/./UtilityTests/StreamTeeTest.Flush (581 of 1785) PASS: lldb-api :: python_api/value/change_values/TestChangeValueAPI.py (582 of 1785) PASS: lldb-unit :: Utility/./UtilityTests/OptionsWithRawTest.TerminatedQuote (583 of 1785) PASS: lldb-unit :: Utility/./UtilityTests/BinaryStreamTest.PutSLEB128SevenBytes (584 of 1785) PASS: lldb-unit :: Utility/./UtilityTests/StringListTest.GetMaxStringLengthIncreasingSize (585 of 1785) PASS: lldb-unit :: Utility/./UtilityTests/ArgsTest.TestSingleArg (586 of 1785) PASS: lldb-api :: commands/expression/import-std-module/unique_ptr/TestUniquePtr.py (587 of 1785) UNSUPPORTED: lldb-api :: lang/objc/bitfield_ivars/TestBitfieldIvars.py (588 of 1785) PASS: lldb-api :: functionalities/postmortem/elf-core/TestLinuxCore.py (589 of 1785) PASS: lldb-api :: commands/expression/context-object-objc/TestContextObjectObjc.py (590 of 1785) PASS: lldb-unit :: ScriptInterpreter/Python/./ScriptInterpreterPythonTests/PythonDataObjectsTest.TestPythonIntegerToStr (591 of 1785) PASS: lldb-shell :: Driver/TestRepl.test (592 of 1785) PASS: lldb-unit :: Host/./HostTests/MainLoopTest.UnmonitoredSignal (593 of 1785) PASS: lldb-api :: lang/cpp/breakpoint-commands/TestCPPBreakpointCommands.py (594 of 1785) PASS: lldb-unit :: Utility/./UtilityTests/LogChannelTest.EnableOptions (595 of 1785) PASS: lldb-api :: functionalities/breakpoint/consecutive_breakpoints/TestConsecutiveBreakpoints.py (596 of 1785) PASS: lldb-api :: types/TestFloatTypesExpr.py (597 of 1785) PASS: lldb-shell :: Breakpoint/debug_rnglist_basic.test (598 of 1785) PASS: lldb-unit :: Process/minidump/./LLDBMinidumpTests/MinidumpParserTest.GetMemoryRegionInfoLinuxMaps (599 of 1785) UNSUPPORTED: lldb-api :: benchmarks/libcxxlist/TestBenchmarkLibcxxList.py (600 of 1785) PASS: lldb-unit :: Utility/./UtilityTests/UriParserTest.SchemeHostSeparator3 (601 of 1785) PASS: lldb-unit :: UnwindAssembly/x86/./UnwindAssemblyx86Tests/Testx86AssemblyInspectionEngine.TestPushEAX (602 of 1785) PASS: lldb-api :: commands/expression/import-std-module/conflicts/TestStdModuleWithConflicts.py (603 of 1785) PASS: lldb-unit :: Utility/./UtilityTests/BinaryStreamTest.PutSLEB128ThreeBytes (604 of 1785) UNSUPPORTED: lldb-api :: lang/objc/objc-dynamic-value/TestObjCDynamicValue.py (605 of 1785) PASS: lldb-api :: functionalities/tail_call_frames/ambiguous_tail_call_seq2/TestAmbiguousTailCallSeq2.py (606 of 1785) PASS: lldb-unit :: Target/./TargetTests/ExecutionContextTest.GetByteOrder (607 of 1785) PASS: lldb-api :: commands/expression/invalid-args/TestInvalidArgsExpression.py (608 of 1785) PASS: lldb-shell :: Driver/TestSingleQuote.test (609 of 1785) PASS: lldb-api :: functionalities/data-formatter/hexcaps/TestDataFormatterHexCaps.py (610 of 1785) PASS: lldb-api :: functionalities/breakpoint/cpp/TestCPPBreakpointLocations.py (611 of 1785) UNSUPPORTED: lldb-api :: tools/lldb-vscode/breakpoint/TestVSCode_setFunctionBreakpoints.py (612 of 1785) PASS: lldb-unit :: Host/./HostTests/HostInfoTest.GetAugmentedArchSpec (613 of 1785) PASS: lldb-api :: functionalities/unwind/noreturn/TestNoreturnUnwind.py (614 of 1785) PASS: lldb-unit :: UnwindAssembly/x86/./UnwindAssemblyx86Tests/Testx86AssemblyInspectionEngine.TestStackRealign8BitDisp_i386 (615 of 1785) PASS: lldb-api :: functionalities/data-formatter/frameformat_smallstruct/TestFrameFormatSmallStruct.py (616 of 1785) PASS: lldb-api :: tools/lldb-server/TestGdbRemoteSingleStep.py (617 of 1785) PASS: lldb-unit :: Utility/./UtilityTests/RegularExpression.Empty (618 of 1785) PASS: lldb-api :: commands/expression/import-std-module/unique_ptr-dbg-info-content/TestUniquePtrDbgInfoContent.py (619 of 1785) PASS: lldb-api :: functionalities/tail_call_frames/unambiguous_sequence/TestUnambiguousTailCalls.py (620 of 1785) PASS: lldb-api :: driver/batch_mode/TestBatchMode.py (621 of 1785) PASS: lldb-api :: lang/cpp/virtual/TestVirtual.py (622 of 1785) PASS: lldb-api :: functionalities/gdb_remote_client/TestRecognizeBreakpoint.py (623 of 1785) PASS: lldb-api :: lang/cpp/class-template-parameter-pack/TestClassTemplateParameterPack.py (624 of 1785) PASS: lldb-unit :: Utility/./UtilityTests/ArgsTest.TestAppendArg (625 of 1785) PASS: lldb-api :: functionalities/data-formatter/typedef_array/TestTypedefArray.py (626 of 1785) PASS: lldb-unit :: Expression/./ExpressionTests/CppModuleConfigurationTest.Sysroot (627 of 1785) UNSUPPORTED: lldb-api :: python_api/disassemble-raw-data/TestDisassemble_VST1_64.py (628 of 1785) PASS: lldb-unit :: Process/gdb-remote/./ProcessGdbRemoteTests/GDBRemoteCommunicationServerTest.SendErrorResponse_Status (629 of 1785) PASS: lldb-api :: commands/frame/language/TestGuessLanguage.py (630 of 1785) PASS: lldb-api :: functionalities/thread/thread_exit/TestThreadExit.py (631 of 1785) PASS: lldb-unit :: Utility/./UtilityTests/RangeTest.SetRangeBase (632 of 1785) PASS: lldb-unit :: Utility/./UtilityTests/AnsiTerminal.Incomplete (633 of 1785) PASS: lldb-api :: lang/objc/objc-struct-return/TestObjCStructReturn.py (634 of 1785) PASS: lldb-unit :: Utility/./UtilityTests/StringListTest.JoinEmpty (635 of 1785) PASS: lldb-unit :: Utility/./UtilityTests/DataExtractorTest.PeekData (636 of 1785) PASS: lldb-api :: lang/objc/exceptions/TestObjCExceptions.py (637 of 1785) PASS: lldb-unit :: SymbolFile/DWARF/./SymbolFileDWARFTests/SymbolFileDWARFTests.TestAbbrevOrder1Start1 (638 of 1785) PASS: lldb-api :: commands/expression/no-deadlock/TestExprDoesntBlock.py (639 of 1785) PASS: lldb-api :: commands/expression/unwind_expression/TestUnwindExpression.py (640 of 1785) PASS: lldb-api :: python_api/symbol-context/TestSymbolContext.py (641 of 1785) PASS: lldb-unit :: SymbolFile/DWARF/./SymbolFileDWARFTests/SymbolFileDWARFTests.TestAbbrevValidAttrNullForm (642 of 1785) UNSUPPORTED: lldb-api :: tools/lldb-vscode/variables/TestVSCode_variables.py (643 of 1785) PASS: lldb-api :: functionalities/data-formatter/language_category_updates/TestDataFormatterLanguageCategoryUpdates.py (644 of 1785) UNSUPPORTED: lldb-api :: functionalities/darwin_log/filter/exact_match/subsystem/TestDarwinLogFilterMatchSubsystem.py (645 of 1785) PASS: lldb-unit :: Utility/./UtilityTests/RegisterValueTest.GetSet8 (646 of 1785) PASS: lldb-unit :: Utility/./UtilityTests/EnvironmentTest.EnvpConstruction (647 of 1785) PASS: lldb-api :: lang/c/stepping/TestStepAndBreakpoints.py (648 of 1785) PASS: lldb-unit :: Utility/./UtilityTests/RecordReplayTest.InstrumentedBarRef (649 of 1785) PASS: lldb-unit :: Utility/./UtilityTests/BinaryStreamTest.PutULEB128Zero (650 of 1785) PASS: lldb-unit :: Utility/./UtilityTests/BinaryStreamTest.PutULEB128ThreeBytes (651 of 1785) PASS: lldb-unit :: Utility/./UtilityTests/StringListTest.AppendList (652 of 1785) PASS: lldb-api :: python_api/symbol-context/two-files/TestSymbolContextTwoFiles.py (653 of 1785) PASS: lldb-unit :: UnwindAssembly/x86/./UnwindAssemblyx86Tests/Testx86AssemblyInspectionEngine.TestAddESP (654 of 1785) PASS: lldb-api :: functionalities/unwind/sigtramp/TestSigtrampUnwind.py (655 of 1785) PASS: lldb-api :: lang/objc/objc-super/TestObjCSuper.py (656 of 1785) PASS: lldb-unit :: Language/Highlighting/./HighlighterTests/HighlighterTest.ClangComments (657 of 1785) PASS: lldb-unit :: Process/gdb-remote/./ProcessGdbRemoteTests/GDBRemoteClientBaseTest.InterruptNoResponse (658 of 1785) PASS: lldb-api :: functionalities/inferior-crashing/recursive-inferior/TestRecursiveInferior.py (659 of 1785) PASS: lldb-unit :: Utility/./UtilityTests/StringListTest.GetMaxStringLengthEmpty (660 of 1785) PASS: lldb-unit :: Utility/./UtilityTests/UriParserTest.TypicalPortPath (661 of 1785) PASS: lldb-unit :: Utility/./UtilityTests/UriParserTest.SchemeHostSeparator2 (662 of 1785) PASS: lldb-unit :: Process/gdb-remote/./ProcessGdbRemoteTests/GDBRemoteCommunicationClientTest.TestPacketSpeedJSON (663 of 1785) PASS: lldb-unit :: Utility/./UtilityTests/StringExtractorTest.DecodeHexU8_Underflow2 (664 of 1785) PASS: lldb-unit :: Utility/./UtilityTests/CompletionRequest.Constructor (665 of 1785) PASS: lldb-shell :: SymbolFile/DWARF/find-qualified-variable.cpp (666 of 1785) PASS: lldb-shell :: Reproducer/Modules/TestModuleCXX.test (667 of 1785) PASS: lldb-api :: functionalities/breakpoint/serialize/TestBreakpointSerialization.py (668 of 1785) PASS: lldb-unit :: Host/./HostTests/SocketTest.TCPGetConnectURI (669 of 1785) PASS: lldb-unit :: Utility/./UtilityTests/RegularExpression.Invalid (670 of 1785) PASS: lldb-unit :: Symbol/./SymbolTests/TestClangASTContext.TestIsClangType (671 of 1785) PASS: lldb-api :: lang/cpp/static_methods/TestCPPStaticMethods.py (672 of 1785) PASS: lldb-api :: functionalities/memory-region/TestMemoryRegion.py (673 of 1785) PASS: lldb-api :: lang/c/strings/TestCStrings.py (674 of 1785) PASS: lldb-unit :: Utility/./UtilityTests/RangeTest.NotEqualInvalid (675 of 1785) PASS: lldb-unit :: Expression/./ExpressionTests/CppModuleConfigurationTest.MissingUsrInclude (676 of 1785) PASS: lldb-api :: lang/c/stepping/TestThreadStepping.py (677 of 1785) PASS: lldb-unit :: Process/minidump/./LLDBMinidumpTests/MinidumpParserTest.FindMemoryRangeWithFullMemoryMinidump (678 of 1785) PASS: lldb-unit :: Expression/./ExpressionTests/DiagnosticManagerTest.PutStringMultiple (679 of 1785) PASS: lldb-api :: commands/expression/persistent_types/TestPersistentTypes.py (680 of 1785) PASS: lldb-unit :: Expression/./ExpressionTests/DiagnosticManagerTest.GetStringSeverityLabels (681 of 1785) UNSUPPORTED: lldb-api :: commands/expression/multiline-completion/TestMultilineCompletion.py (682 of 1785) PASS: lldb-shell :: Settings/TestFrameFormatColor.test (683 of 1785) PASS: lldb-api :: types/TestIntegerTypes.py (684 of 1785) PASS: lldb-shell :: Unwind/eh-frame-dwarf-unwind.test (685 of 1785) PASS: lldb-unit :: UnwindAssembly/x86/./UnwindAssemblyx86Tests/Testx86AssemblyInspectionEngine.TestSimple32bitFrameFunction (686 of 1785) PASS: lldb-api :: commands/target/stop-hooks/TestStopHooks.py (687 of 1785) UNSUPPORTED: lldb-shell :: SymbolFile/PDB/function-level-linking.test (688 of 1785) PASS: lldb-api :: functionalities/data-formatter/data-formatter-python-synth/TestDataFormatterPythonSynth.py (689 of 1785) PASS: lldb-api :: functionalities/data-formatter/data-formatter-stl/libcxx/list/TestDataFormatterLibcxxList.py (690 of 1785) UNSUPPORTED: lldb-api :: tools/lldb-vscode/launch/TestVSCode_launch.py (691 of 1785) PASS: lldb-api :: commands/expression/import_builtin_fileid/TestImportBuiltinFileID.py (692 of 1785) PASS: lldb-shell :: Register/x86-64-ymm-read.test (693 of 1785) PASS: lldb-unit :: debugserver/./debugserverTests/RNBSocket.LoopBackListenIPv6 (694 of 1785) PASS: lldb-shell :: SymbolFile/NativePDB/function-types-calling-conv.cpp (695 of 1785) PASS: lldb-shell :: SymbolFile/DWARF/dir-separator-windows.s (696 of 1785) PASS: lldb-unit :: Utility/./UtilityTests/ArgsTest.TestOverwriteArgs (697 of 1785) PASS: lldb-unit :: Process/minidump/./LLDBMinidumpTests/MinidumpParserTest.MinidumpDuplicateModuleMinAddress (698 of 1785) UNSUPPORTED: lldb-shell :: SymbolFile/PDB/vbases.test (699 of 1785) PASS: lldb-api :: commands/expression/call-function/TestCallUserDefinedFunction.py (700 of 1785) PASS: lldb-unit :: Utility/./UtilityTests/StreamTest.PutBytesAsRawHex8ToLittleEndian (701 of 1785) PASS: lldb-api :: functionalities/thread/concurrent_events/TestConcurrentCrashWithBreak.py (702 of 1785) UNSUPPORTED: lldb-api :: linux/mix-dwo-and-regular-objects/TestMixedDwarfBinary.py (703 of 1785) PASS: lldb-shell :: SymbolFile/DWARF/debug_ranges-missing-section.s (704 of 1785) PASS: lldb-unit :: SymbolFile/DWARF/./SymbolFileDWARFTests/SymbolFileDWARFTests.TestAbbrevOrder1Start5 (705 of 1785) PASS: lldb-api :: functionalities/thread/concurrent_events/TestConcurrentTwoBreakpointsOneDelaySignal.py (706 of 1785) PASS: lldb-api :: lang/objcxx/cxx-bridged-po/TestObjCXXBridgedPO.py (707 of 1785) PASS: lldb-unit :: Language/CPlusPlus/./LanguageCPlusPlusTests/CPlusPlusLanguage.CPlusPlusNameParser (708 of 1785) PASS: lldb-api :: functionalities/breakpoint/require_hw_breakpoints/TestRequireHWBreakpoints.py (709 of 1785) PASS: lldb-shell :: SymbolFile/DWARF/debug_aranges-empty-section.s (710 of 1785) PASS: lldb-shell :: ObjectFile/ELF/PT_LOAD-overlap-PT_TLS.yaml (711 of 1785) PASS: lldb-unit :: Utility/./UtilityTests/ArgsTest.BareSingleQuote (712 of 1785) PASS: lldb-api :: lang/objc/variadic_methods/TestVariadicMethods.py (713 of 1785) PASS: lldb-unit :: ObjectFile/Breakpad/./ObjectFileBreakpadTests/StackWinRecord.parse (714 of 1785) PASS: lldb-api :: functionalities/tsan/multiple/TestTsanMultiple.py (715 of 1785) PASS: lldb-unit :: Utility/./UtilityTests/AnsiTerminal.KnownPrefix (716 of 1785) PASS: lldb-api :: functionalities/data-formatter/data-formatter-stl/libcxx/tuple/TestDataFormatterLibcxxTuple.py (717 of 1785) PASS: lldb-api :: functionalities/memory/find/TestMemoryFind.py (718 of 1785) PASS: lldb-unit :: Utility/./UtilityTests/StreamTest.PutHex64ByteOrderBig (719 of 1785) PASS: lldb-unit :: Utility/./UtilityTests/ScalarTest.Division (720 of 1785) PASS: lldb-api :: functionalities/signal/TestSendSignal.py (721 of 1785) PASS: lldb-api :: lang/objc/hidden-ivars/TestHiddenIvars.py (722 of 1785) PASS: lldb-unit :: ScriptInterpreter/Python/./ScriptInterpreterPythonTests/PythonDataObjectsTest.TestPythonBytes (723 of 1785) PASS: lldb-unit :: Utility/./UtilityTests/StreamTeeTest.GetStreamAtIndexOutOfBounds (724 of 1785) PASS: lldb-unit :: Utility/./UtilityTests/StringExtractorTest.GetHexU8_Extra (725 of 1785) PASS: lldb-unit :: Language/Highlighting/./HighlighterTests/HighlighterTest.ClangUnterminatedString (726 of 1785) PASS: lldb-unit :: ScriptInterpreter/Python/./ScriptInterpreterPythonTests/PythonDataObjectsTest.TestPythonInteger (727 of 1785) PASS: lldb-unit :: Language/Highlighting/./HighlighterTests/HighlighterTest.ClangCursorPosAfterOtherToken (728 of 1785) UNSUPPORTED: lldb-api :: commands/register/register/intel_xtended_registers/TestMPXRegisters.py (729 of 1785) PASS: lldb-unit :: Utility/./UtilityTests/StringExtractorTest.GetNameColonValueNoSemicolon (730 of 1785) PASS: lldb-api :: functionalities/postmortem/elf-core/thread_crash/TestLinuxCoreThreads.py (731 of 1785) PASS: lldb-api :: commands/expression/expr-in-syscall/TestExpressionInSyscall.py (732 of 1785) PASS: lldb-api :: commands/watchpoints/hello_watchpoint/TestMyFirstWatchpoint.py (733 of 1785) PASS: lldb-api :: types/TestDoubleTypes.py (734 of 1785) PASS: lldb-unit :: Utility/./UtilityTests/StreamTeeTest.Write (735 of 1785) PASS: lldb-api :: functionalities/data-formatter/data-formatter-proper-plurals/TestFormattersOneIsSingular.py (736 of 1785) PASS: lldb-api :: commands/apropos/with-process/TestAproposWithProcess.py (737 of 1785) UNSUPPORTED: lldb-api :: commands/watchpoints/variable_out_of_scope/TestWatchedVarHitWhenInScope.py (738 of 1785) PASS: lldb-api :: functionalities/data-formatter/data-formatter-categories/TestDataFormatterCategories.py (739 of 1785) UNSUPPORTED: lldb-api :: functionalities/thread/multi_break/TestMultipleBreakpoints.py (740 of 1785) PASS: lldb-unit :: Utility/./UtilityTests/StringListTest.InsertStringAtIndexMove (741 of 1785) PASS: lldb-api :: commands/expression/weak_symbols/TestWeakSymbols.py (742 of 1785) PASS: lldb-unit :: Language/Highlighting/./HighlighterTests/HighlighterTest.ClangCommas (743 of 1785) PASS: lldb-api :: arm/emulation/TestEmulations.py (744 of 1785) PASS: lldb-shell :: Reproducer/TestGDBRemoteRepro.test (745 of 1785) PASS: lldb-shell :: Reproducer/TestRelativePath.test (746 of 1785) PASS: lldb-unit :: Utility/./UtilityTests/RangeTest.ContainsEndInclusive (747 of 1785) PASS: lldb-api :: lang/objc/modules-cache/TestClangModulesCache.py (748 of 1785) PASS: lldb-shell :: ObjectFile/PECOFF/sections-names.yaml (749 of 1785) PASS: lldb-api :: api/multithreaded/TestMultithreaded.py (750 of 1785) PASS: lldb-unit :: Utility/./UtilityTests/ListenerTest.GetEventWait (751 of 1785) PASS: lldb-unit :: Process/minidump/./LLDBMinidumpTests/MinidumpParserTest.GetThreadsAndGetThreadContext (752 of 1785) PASS: lldb-unit :: Utility/./UtilityTests/CompletionRequest.TryCompleteCurrentArgBad (753 of 1785) PASS: lldb-shell :: Commands/CommandScriptImmediateOutput/CommandScriptImmediateOutputConsole.test (754 of 1785) PASS: lldb-shell :: Settings/TestDisableColor.test (755 of 1785) PASS: lldb-api :: commands/expression/dont_allow_jit/TestAllowJIT.py (756 of 1785) PASS: lldb-unit :: Utility/./UtilityTests/RangeTest.ContainsAddr (757 of 1785) PASS: lldb-api :: functionalities/breakpoint/cpp_exception/TestCPPExceptionBreakpoint.py (758 of 1785) UNSUPPORTED: lldb-shell :: Register/x86-64-xmm16-write.test (759 of 1785) PASS: lldb-unit :: Utility/./UtilityTests/OptionsWithRawTest.ArgsButNoDelimiter (760 of 1785) PASS: lldb-unit :: SymbolFile/NativePDB/./SymbolFileNativePDBTests/PDBFPOProgramToDWARFExpressionTests.MultipleDependentAssignments (761 of 1785) UNSUPPORTED: lldb-shell :: SymbolFile/NativePDB/stack_unwinding01.cpp (762 of 1785) PASS: lldb-unit :: Utility/./UtilityTests/StringLexerTest.PutBack (763 of 1785) PASS: lldb-api :: lang/cpp/enum_types/TestCPP11EnumTypes.py (764 of 1785) PASS: lldb-unit :: Utility/./UtilityTests/NameMatchesTest.Ignore (765 of 1785) PASS: lldb-api :: functionalities/data-formatter/var-in-aggregate-misuse/TestVarInAggregateMisuse.py (766 of 1785) PASS: lldb-api :: terminal/TestSTTYBeforeAndAfter.py (767 of 1785) PASS: lldb-unit :: ScriptInterpreter/Python/./ScriptInterpreterPythonTests/PythonDataObjectsTest.TestPythonTupleInitializerList (768 of 1785) PASS: lldb-api :: lang/cpp/signed_types/TestSignedTypes.py (769 of 1785) PASS: lldb-api :: commands/version/TestVersion.py (770 of 1785) PASS: lldb-api :: commands/expression/ir-interpreter/TestIRInterpreter.py (771 of 1785) PASS: lldb-unit :: ObjectFile/Breakpad/./ObjectFileBreakpadTests/PublicRecord.parse (772 of 1785) PASS: lldb-unit :: Utility/./UtilityTests/OptionsWithRawTest.WhitespaceSuffix (773 of 1785) PASS: lldb-api :: commands/expression/import-std-module/weak_ptr-dbg-info-content/TestDbgInfoContentWeakPtr.py (774 of 1785) UNSUPPORTED: lldb-shell :: SymbolFile/PDB/function-nested-block.test (775 of 1785) PASS: lldb-unit :: Utility/./UtilityTests/BinaryStreamTest.PutULEB128SevenBytes (776 of 1785) PASS: lldb-api :: tools/lldb-server/TestGdbRemoteHostInfo.py (777 of 1785) PASS: lldb-unit :: Utility/./UtilityTests/UriParserTest.LongPath (778 of 1785) PASS: lldb-api :: lang/objc/foundation/TestConstStrings.py (779 of 1785) PASS: lldb-unit :: Utility/./UtilityTests/StringListTest.LongestCommonPrefixEmpty (780 of 1785) PASS: lldb-unit :: Utility/./UtilityTests/RangeTest.Slide (781 of 1785) PASS: lldb-unit :: Utility/./UtilityTests/ArchSpecTest.Compatibility (782 of 1785) PASS: lldb-api :: commands/expression/call-function/TestCallStdStringFunction.py (783 of 1785) PASS: lldb-shell :: Breakpoint/case-sensitive.test (784 of 1785) PASS: lldb-api :: functionalities/gdb_remote_client/TestThreadSelectionBug.py (785 of 1785) PASS: lldb-api :: functionalities/data-formatter/data-formatter-stl/libcxx/list/loop/TestDataFormatterLibcxxListLoop.py (786 of 1785) PASS: lldb-shell :: SymbolFile/DWARF/find-function-regex.cpp (787 of 1785) UNSUPPORTED: lldb-api :: tools/lldb-vscode/attach/TestVSCode_attach.py (788 of 1785) PASS: lldb-unit :: ObjectFile/Breakpad/./ObjectFileBreakpadTests/FileRecord.parse (789 of 1785) PASS: lldb-api :: lang/objc/objc-new-syntax/TestObjCNewSyntaxLiteral.py (790 of 1785) PASS: lldb-unit :: ObjectFile/Breakpad/./ObjectFileBreakpadTests/StackCFIRecord.parse (791 of 1785) PASS: lldb-api :: lang/cpp/chained-calls/TestCppChainedCalls.py (792 of 1785) PASS: lldb-api :: functionalities/gdb_remote_client/TestGDBRemoteClient.py (793 of 1785) PASS: lldb-unit :: Utility/./UtilityTests/BinaryStreamTest.PutSLEB128SixBytes (794 of 1785) UNSUPPORTED: lldb-shell :: BuildScript/toolchain-clang-cl.test (795 of 1785) UNSUPPORTED: lldb-api :: benchmarks/continue/TestBenchmarkContinue.py (796 of 1785) PASS: lldb-api :: lang/c/forward/TestForwardDeclaration.py (797 of 1785) PASS: lldb-unit :: Host/./HostTests/NativeProcessProtocolTest.ReadMemoryWithoutTrap (798 of 1785) PASS: lldb-unit :: Expression/./ExpressionTests/DiagnosticManagerTest.AppendMessageAttachToLastDiag (799 of 1785) PASS: lldb-api :: functionalities/postmortem/netbsd-core/TestNetBSDCore.py (800 of 1785) PASS: lldb-unit :: Utility/./UtilityTests/StreamTest.PutRawBytesToMixedEndian (801 of 1785) PASS: lldb-unit :: Utility/./UtilityTests/RangeTest.SlideZero (802 of 1785) PASS: lldb-unit :: Utility/./UtilityTests/RangeTest.DoesAdjoinOrIntersect (803 of 1785) PASS: lldb-shell :: SymbolFile/Breakpad/symtab-macho.test (804 of 1785) PASS: lldb-unit :: ScriptInterpreter/Python/./ScriptInterpreterPythonTests/PythonDataObjectsTest.TestPythonIntegerToStructuredInteger (805 of 1785) PASS: lldb-unit :: Utility/./UtilityTests/TimerTest.CategoryTimes (806 of 1785) PASS: lldb-api :: functionalities/thread/concurrent_events/TestConcurrentDelaySignalBreak.py (807 of 1785) PASS: lldb-api :: functionalities/data-formatter/data-formatter-objc/nsindexpath/TestDataFormatterNSIndexPath.py (808 of 1785) PASS: lldb-unit :: Utility/./UtilityTests/LogChannelEnabledTest.log_options (809 of 1785) PASS: lldb-api :: functionalities/thread/concurrent_events/TestConcurrentCrashWithWatchpointBreakpointSignal.py (810 of 1785) PASS: lldb-unit :: Target/./TargetTests/ExecutionContextTest.GetByteOrderTarget (811 of 1785) PASS: lldb-unit :: Utility/./UtilityTests/RecordReplayTest.InstrumentedFooSameThis (812 of 1785) PASS: lldb-api :: lang/cpp/inlines/TestInlines.py (813 of 1785) PASS: lldb-api :: python_api/sbvalue_const_addrof/TestSBValueConstAddrOf.py (814 of 1785) PASS: lldb-api :: lang/cpp/namespace/TestNamespace.py (815 of 1785) UNSUPPORTED: lldb-api :: commands/expression/completion-crash1/TestCompletionCrash1.py (816 of 1785) PASS: lldb-shell :: Commands/command-backtrace.test (817 of 1785) PASS: lldb-api :: functionalities/thread/concurrent_events/TestConcurrentSignalWatchBreak.py (818 of 1785) PASS: lldb-api :: commands/expression/rdar42038760/TestScalarURem.py (819 of 1785) PASS: lldb-unit :: UnwindAssembly/x86/./UnwindAssemblyx86Tests/Testx86AssemblyInspectionEngine.TestStackRealignMSVC_i386 (820 of 1785) PASS: lldb-api :: lang/objc/objc-new-syntax/TestObjCNewSyntaxDictionary.py (821 of 1785) PASS: lldb-api :: macosx/indirect_symbol/TestIndirectSymbols.py (822 of 1785) PASS: lldb-api :: commands/expression/argument_passing_restrictions/TestArgumentPassingRestrictions.py (823 of 1785) UNSUPPORTED: lldb-api :: functionalities/data-formatter/data-formatter-stl/libstdcpp/string/TestDataFormatterStdString.py (824 of 1785) PASS: lldb-unit :: SymbolFile/NativePDB/./SymbolFileNativePDBTests/PDBFPOProgramToDWARFExpressionTests.SingleAssignmentRegisterRef (825 of 1785) PASS: lldb-unit :: Utility/./UtilityTests/VMRange.ContainsRange (826 of 1785) PASS: lldb-unit :: Host/./HostTests/SocketTest.DecodeHostAndPort (827 of 1785) PASS: lldb-shell :: SymbolFile/DWARF/debug-types-address-ranges.s (828 of 1785) PASS: lldb-unit :: Utility/./UtilityTests/SerializationRountripTest.SerializeDeserializePod (829 of 1785) PASS: lldb-unit :: UnwindAssembly/x86/./UnwindAssemblyx86Tests/Testx86AssemblyInspectionEngine.TestPushECX (830 of 1785) PASS: lldb-unit :: Utility/./UtilityTests/ScalarTest.GetBytes (831 of 1785) PASS: lldb-api :: functionalities/breakpoint/breakpoint_command/TestBreakpointCommandsFromPython.py (832 of 1785) PASS: lldb-api :: macosx/lc-note/kern-ver-str/TestKernVerStrLCNOTE.py (833 of 1785) PASS: lldb-shell :: SymbolFile/sizeless-symbol.test (834 of 1785) PASS: lldb-api :: lang/objc/global_ptrs/TestGlobalObjects.py (835 of 1785) PASS: lldb-api :: functionalities/thread/concurrent_events/TestConcurrentTwoWatchpointsOneSignal.py (836 of 1785) PASS: lldb-api :: python_api/function_symbol/TestSymbolAPI.py (837 of 1785) PASS: lldb-api :: functionalities/modern-type-lookup/basic-objc/TestBasicObjcModernTypeLookup.py (838 of 1785) PASS: lldb-unit :: Utility/./UtilityTests/StringExtractorTest.GetHexBytes_FullString (839 of 1785) PASS: lldb-unit :: ObjectFile/Breakpad/./ObjectFileBreakpadTests/ModuleRecord.parse (840 of 1785) PASS: lldb-api :: python_api/name_lookup/TestNameLookup.py (841 of 1785) PASS: lldb-unit :: SymbolFile/NativePDB/./SymbolFileNativePDBTests/PDBFPOProgramToDWARFExpressionTests.UnresolvedRegisterReference (842 of 1785) UNSUPPORTED: lldb-shell :: SymbolFile/PDB/class-layout.test (843 of 1785) PASS: lldb-unit :: Utility/./UtilityTests/ScalarTest.RightShiftOperator (844 of 1785) UNSUPPORTED: lldb-api :: commands/expression/call-restarts/TestCallThatRestarts.py (845 of 1785) UNSUPPORTED: lldb-shell :: BuildScript/toolchain-msvc.test (846 of 1785) PASS: lldb-shell :: Driver/TestFile.test (847 of 1785) UNSUPPORTED: lldb-shell :: SymbolFile/PDB/typedefs.test (848 of 1785) PASS: lldb-api :: commands/expression/import-std-module/stack/TestStack.py (849 of 1785) PASS: lldb-unit :: Utility/./UtilityTests/NameMatchesTest.Equals (850 of 1785) PASS: lldb-unit :: Utility/./UtilityTests/ArgsTest.TestSingleArgWithQuotedSpace (851 of 1785) UNSUPPORTED: lldb-api :: arm/breakpoint-it/TestBreakpointIt.py (852 of 1785) PASS: lldb-api :: commands/expression/char/TestExprsChar.py (853 of 1785) PASS: lldb-unit :: Utility/./UtilityTests/StringListTest.ShiftCString (854 of 1785) PASS: lldb-shell :: ObjectFile/ELF/PT_LOAD-overlap.yaml (855 of 1785) PASS: lldb-unit :: tools/lldb-server/tests/./LLDBServerTests/TestBase.LaunchModePreservesEnvironment (856 of 1785) PASS: lldb-api :: functionalities/data-formatter/type_summary_list_script/TestTypeSummaryListScript.py (857 of 1785) PASS: lldb-shell :: SymbolFile/DWARF/find-method.cpp (858 of 1785) PASS: lldb-unit :: Utility/./UtilityTests/Flags.IsClear (859 of 1785) PASS: lldb-shell :: ObjectFile/ELF/many-sections.s (860 of 1785) PASS: lldb-unit :: Utility/./UtilityTests/OptionsWithRawTest.SingleWordSuffix (861 of 1785) PASS: lldb-unit :: UnwindAssembly/x86/./UnwindAssemblyx86Tests/Testx86AssemblyInspectionEngine.TestPopEBP (862 of 1785) PASS: lldb-api :: functionalities/thread/concurrent_events/TestConcurrentWatchBreakDelay.py (863 of 1785) PASS: lldb-api :: functionalities/set-data/TestSetData.py (864 of 1785) PASS: lldb-api :: tools/lldb-server/commandline/TestStubReverseConnect.py (865 of 1785) PASS: lldb-api :: functionalities/data-formatter/format-propagation/TestFormatPropagation.py (866 of 1785) PASS: lldb-api :: functionalities/pre_run_dylibs/TestPreRunDylibs.py (867 of 1785) PASS: lldb-api :: lang/cpp/incomplete-types/TestCppIncompleteTypes.py (868 of 1785) PASS: lldb-shell :: SymbolFile/NativePDB/break-by-line.cpp (869 of 1785) PASS: lldb-unit :: Utility/./UtilityTests/StreamTest.PutHex64ByteOrderLittle (870 of 1785) PASS: lldb-unit :: Signals/./SignalsTests/UnixSignalsTest.GetInfo (871 of 1785) PASS: lldb-unit :: Language/Highlighting/./HighlighterTests/HighlighterTest.HighlighterSelectionType (872 of 1785) PASS: lldb-api :: python_api/function_symbol/TestDisasmAPI.py (873 of 1785) PASS: lldb-unit :: ObjectFile/Breakpad/./ObjectFileBreakpadTests/Record.classify (874 of 1785) PASS: lldb-shell :: ObjectFile/ELF/section-permissions.yaml (875 of 1785) PASS: lldb-api :: lang/objc/self/TestObjCSelf.py (876 of 1785) PASS: lldb-unit :: Utility/./UtilityTests/ProcessInfoTest.Constructor (877 of 1785) PASS: lldb-unit :: Utility/./UtilityTests/StringExtractorTest.GetHexBytesAvail_OddPair (878 of 1785) PASS: lldb-unit :: SymbolFile/NativePDB/./SymbolFileNativePDBTests/PDBFPOProgramToDWARFExpressionTests.UnresolvedRegisterAssignmentReference (879 of 1785) PASS: lldb-unit :: UnwindAssembly/x86/./UnwindAssemblyx86Tests/Testx86AssemblyInspectionEngine.TestPushEDI (880 of 1785) PASS: lldb-api :: functionalities/tail_call_frames/sbapi_support/TestTailCallFrameSBAPI.py (881 of 1785) PASS: lldb-api :: commands/quit/TestQuit.py (882 of 1785) PASS: lldb-unit :: Utility/./UtilityTests/NameMatchesTest.Contains (883 of 1785) PASS: lldb-api :: commands/expression/dollar-in-variable/TestDollarInVariable.py (884 of 1785) PASS: lldb-unit :: Utility/./UtilityTests/DataExtractorTest.GetCStrAtNullOffset (885 of 1785) UNSUPPORTED: lldb-api :: functionalities/data-formatter/data-formatter-stl/libstdcpp/smart_ptr/TestDataFormatterStdSmartPtr.py (886 of 1785) PASS: lldb-unit :: UnwindAssembly/x86/./UnwindAssemblyx86Tests/Testx86AssemblyInspectionEngine.TestPopEBX (887 of 1785) PASS: lldb-api :: commands/command/nested_alias/TestNestedAlias.py (888 of 1785) PASS: lldb-unit :: Utility/./UtilityTests/StringExtractorTest.DecodeHexU8_Exact (889 of 1785) PASS: lldb-unit :: Process/minidump/./LLDBMinidumpTests/MinidumpParserTest.InvalidMinidump (890 of 1785) PASS: lldb-unit :: Host/./HostTests/FileSystemTest.EnumerateDirectory (891 of 1785) PASS: lldb-unit :: Interpreter/./InterpreterTests/CompletionTest.DirCompletionAbsolute (892 of 1785) PASS: lldb-api :: macosx/find-dsym/deep-bundle/TestDeepBundle.py (893 of 1785) PASS: lldb-api :: functionalities/abbreviation/TestCommonShortSpellings.py (894 of 1785) PASS: lldb-unit :: Utility/./UtilityTests/StreamTest.PutChar (895 of 1785) PASS: lldb-unit :: Utility/./UtilityTests/Flags.Clear (896 of 1785) PASS: lldb-unit :: Utility/./UtilityTests/ArgsTest.TestTrailingBackslash (897 of 1785) PASS: lldb-unit :: Utility/./UtilityTests/RangeTest.Clear (898 of 1785) PASS: lldb-unit :: Language/Highlighting/./HighlighterTests/HighlighterTest.Colons (899 of 1785) PASS: lldb-unit :: Utility/./UtilityTests/VASprintfTest.NoBufferResize (900 of 1785) PASS: lldb-unit :: ScriptInterpreter/Python/./ScriptInterpreterPythonTests/PythonDataObjectsTest.TestPythonDictionaryManipulation (901 of 1785) PASS: lldb-unit :: Utility/./UtilityTests/StringListTest.LongestCommonPrefixNoPrefix (902 of 1785) PASS: lldb-api :: functionalities/postmortem/minidump-new/TestMiniDumpUUID.py (903 of 1785) PASS: lldb-api :: commands/expression/inline-namespace/TestInlineNamespace.py (904 of 1785) PASS: lldb-api :: python_api/watchpoint/TestWatchpointIgnoreCount.py (905 of 1785) PASS: lldb-unit :: Language/Highlighting/./HighlighterTests/HighlighterTest.Keywords (906 of 1785) PASS: lldb-unit :: Utility/./UtilityTests/StringExtractorTest.GetHexBytes_Underflow (907 of 1785) PASS: lldb-api :: commands/watchpoints/watchpoint_disable/TestWatchpointDisable.py (908 of 1785) PASS: lldb-api :: functionalities/deleted-executable/TestDeletedExecutable.py (909 of 1785) UNSUPPORTED: lldb-api :: commands/register/register/intel_xtended_registers/mpx_bound_violation/TestBoundViolation.py (910 of 1785) PASS: lldb-unit :: Utility/./UtilityTests/StringListTest.PopBack (911 of 1785) PASS: lldb-unit :: Utility/./UtilityTests/SerializationRountripTest.SerializeDeserializePodReferences (912 of 1785) PASS: lldb-unit :: Utility/./UtilityTests/UriParserTest.BracketedHostnameWithColon (913 of 1785) PASS: lldb-api :: python_api/watchpoint/watchlocation/TestSetWatchlocation.py (914 of 1785) PASS: lldb-unit :: Utility/./UtilityTests/FileSpecTest.FormatFileSpec (915 of 1785) UNSUPPORTED: lldb-shell :: SymbolFile/PDB/variables.test (916 of 1785) PASS: lldb-unit :: Utility/./UtilityTests/StreamTest.PutHex8 (917 of 1785) PASS: lldb-api :: lang/objc/modules/TestObjCModules.py (918 of 1785) PASS: lldb-unit :: Utility/./UtilityTests/TimeoutTest.Construction (919 of 1785) PASS: lldb-unit :: UnwindAssembly/x86/./UnwindAssemblyx86Tests/Testx86AssemblyInspectionEngine.TestPushR12 (920 of 1785) PASS: lldb-unit :: Host/./HostTests/ConnectionFileDescriptorTest.TCPGetURIv6 (921 of 1785) PASS: lldb-unit :: Utility/./UtilityTests/BinaryStreamTest.PutULEB128TwoBytes (922 of 1785) PASS: lldb-unit :: Utility/./UtilityTests/FileSpecTest.RemoveLastPathComponent (923 of 1785) PASS: lldb-api :: functionalities/history/TestHistoryRecall.py (924 of 1785) PASS: lldb-unit :: UnwindAssembly/x86/./UnwindAssemblyx86Tests/Testx86AssemblyInspectionEngine.TestPopR14 (925 of 1785) PASS: lldb-unit :: Utility/./UtilityTests/StreamTest.PutHex16ByteOrderLittle (926 of 1785) UNSUPPORTED: lldb-shell :: Register/x86-64-ymm16-read.test (927 of 1785) PASS: lldb-api :: functionalities/data-formatter/refpointer-recursion/TestDataFormatterRefPtrRecursion.py (928 of 1785) PASS: lldb-api :: macosx/find-app-in-bundle/TestFindAppInBundle.py (929 of 1785) PASS: lldb-unit :: Language/Highlighting/./HighlighterTests/HighlighterTest.ClangPPDirectives (930 of 1785) PASS: lldb-api :: python_api/sbvalue_persist/TestSBValuePersist.py (931 of 1785) UNSUPPORTED: lldb-api :: functionalities/process_save_core/TestProcessSaveCore.py (932 of 1785) PASS: lldb-unit :: Utility/./UtilityTests/DataExtractorTest.GetCStrAtEnd (933 of 1785) PASS: lldb-api :: tools/lldb-server/TestGdbRemoteKill.py (934 of 1785) PASS: lldb-unit :: Host/./HostTests/SocketTest.DomainGetConnectURI (935 of 1785) PASS: lldb-api :: python_api/file_handle/TestFileHandle.py (936 of 1785) PASS: lldb-api :: commands/target/create-no-such-arch/TestNoSuchArch.py (937 of 1785) UNSUPPORTED: lldb-shell :: Breakpoint/case-insensitive.test (938 of 1785) PASS: lldb-api :: commands/expression/test/TestExprs2.py (939 of 1785) PASS: lldb-api :: api/listeners/TestListener.py (940 of 1785) PASS: lldb-api :: functionalities/data-formatter/synthcapping/TestSyntheticCapping.py (941 of 1785) PASS: lldb-api :: functionalities/breakpoint/breakpoint_set_restart/TestBreakpointSetRestart.py (942 of 1785) PASS: lldb-shell :: SymbolFile/DWARF/dir-separator-posix.s (943 of 1785) PASS: lldb-shell :: Breakpoint/single-file-split-dwarf.test (944 of 1785) PASS: lldb-unit :: Utility/./UtilityTests/ScalarTest.ComparisonFloat (945 of 1785) PASS: lldb-unit :: Process/minidump/./LLDBMinidumpTests/MinidumpParserTest.GetPidWow64 (946 of 1785) PASS: lldb-shell :: SymbolFile/DWARF/find-variable-dwo.cpp (947 of 1785) PASS: lldb-api :: functionalities/show_location/TestShowLocationDwarf5.py (948 of 1785) UNSUPPORTED: lldb-api :: lang/c/typedef/Testtypedef.py (949 of 1785) PASS: lldb-api :: commands/expression/persistent_variables/TestPersistentVariables.py (950 of 1785) PASS: lldb-api :: lang/objc/foundation/TestObjCMethodsString.py (951 of 1785) PASS: lldb-unit :: Utility/./UtilityTests/ScalarTest.SetValueFromCString (952 of 1785) PASS: lldb-api :: functionalities/thread/concurrent_events/TestConcurrentSignalNWatchNBreak.py (953 of 1785) PASS: lldb-api :: functionalities/breakpoint/move_nearest/TestMoveNearest.py (954 of 1785) PASS: lldb-api :: python_api/process/TestProcessAPI.py (955 of 1785) PASS: lldb-api :: functionalities/thread/step_until/TestStepUntil.py (956 of 1785) PASS: lldb-api :: commands/register/register/register_command/TestRegisters.py (957 of 1785) PASS: lldb-unit :: Expression/./ExpressionTests/DiagnosticManagerTest.GetStringNoDiags (958 of 1785) PASS: lldb-api :: python_api/lldbutil/iter/TestLLDBIterator.py (959 of 1785) PASS: lldb-unit :: Utility/./UtilityTests/CompletionRequest.TryCompleteCurrentArgGood (960 of 1785) PASS: lldb-api :: lang/cpp/limit-debug-info/TestWithLimitDebugInfo.py (961 of 1785) PASS: lldb-shell :: SymbolFile/Breakpad/line-table-missing-file.test (962 of 1785) XFAIL: lldb-shell :: SymbolFile/DWARF/find-type-in-function.cpp (963 of 1785) PASS: lldb-unit :: Utility/./UtilityTests/StringExtractorTest.GetU32BigEndian (964 of 1785) PASS: lldb-unit :: Host/./HostTests/SocketTest.TCPListen0GetPort (965 of 1785) PASS: lldb-api :: functionalities/gdb_remote_client/TestRestartBug.py (966 of 1785) UNSUPPORTED: lldb-api :: python_api/event/TestEvents.py (967 of 1785) PASS: lldb-unit :: Process/gdb-remote/./ProcessGdbRemoteTests/GDBRemoteClientBaseTest.SendContinueAndAsyncSignal (968 of 1785) PASS: lldb-api :: commands/process/attach/TestProcessAttach.py (969 of 1785) UNSUPPORTED: lldb-api :: tools/lldb-vscode/step/TestVSCode_step.py (970 of 1785) PASS: lldb-unit :: UnwindAssembly/x86/./UnwindAssemblyx86Tests/Testx86AssemblyInspectionEngine.TestSimplex86_64Augmented (971 of 1785) PASS: lldb-unit :: Host/./HostTests/File.GetWaitableHandleFileno (972 of 1785) PASS: lldb-api :: lang/objc/orderedset/TestOrderedSet.py (973 of 1785) PASS: lldb-api :: python_api/sbdata/TestSBData.py (974 of 1785) PASS: lldb-api :: functionalities/data-formatter/data-formatter-skip-summary/TestDataFormatterSkipSummary.py (975 of 1785) PASS: lldb-unit :: ObjectFile/PECOFF/./ObjectFilePECOFFTests/PECallFrameInfoTest.Basic_eh (976 of 1785) PASS: lldb-unit :: Utility/./UtilityTests/RangeTest.DefaultConstructor (977 of 1785) PASS: lldb-api :: commands/expression/completion/TestExprCompletion.py (978 of 1785) PASS: lldb-unit :: Expression/./ExpressionTests/DWARFExpression.DW_OP_convert (979 of 1785) PASS: lldb-api :: functionalities/data-formatter/summary-string-onfail/Test-rdar-9974002.py (980 of 1785) PASS: lldb-unit :: Process/minidump/./LLDBMinidumpTests/MinidumpParserTest.FindMemoryRange (981 of 1785) PASS: lldb-unit :: Process/minidump/./LLDBMinidumpTests/MinidumpParserTest.GetThreadContext_x86_64 (982 of 1785) PASS: lldb-shell :: ObjectFile/Breakpad/breakpad-identification.test (983 of 1785) PASS: lldb-unit :: UnwindAssembly/x86/./UnwindAssemblyx86Tests/Testx86AssemblyInspectionEngine.Test64bitFramelessSmallStackFrame (984 of 1785) PASS: lldb-shell :: Driver/TestCore.test (985 of 1785) PASS: lldb-api :: functionalities/data-formatter/nssetsynth/TestNSSetSynthetic.py (986 of 1785) PASS: lldb-unit :: ScriptInterpreter/Python/./ScriptInterpreterPythonTests/PythonDataObjectsTest.TestPythonStringToStr (987 of 1785) PASS: lldb-unit :: Core/./LLDBCoreTests/RichManglingContextTest.FromCxxMethodName (988 of 1785) PASS: lldb-api :: lang/cpp/diamond/TestDiamond.py (989 of 1785) PASS: lldb-unit :: Utility/./UtilityTests/StringListTest.GetMaxStringLengthMixed (990 of 1785) PASS: lldb-unit :: Process/gdb-remote/./ProcessGdbRemoteTests/GDBRemoteCommunicationClientTest.SyncThreadState (991 of 1785) PASS: lldb-unit :: Utility/./UtilityTests/UriParserTest.Minimal (992 of 1785) PASS: lldb-api :: functionalities/float-display/TestFloatDisplay.py (993 of 1785) UNSUPPORTED: lldb-shell :: SymbolFile/DWARF/debug-types-expressions.test (994 of 1785) PASS: lldb-api :: commands/expression/entry-bp/TestExprEntryBP.py (995 of 1785) UNSUPPORTED: lldb-api :: commands/watchpoints/hello_watchlocation/TestWatchLocation.py (996 of 1785) PASS: lldb-api :: commands/expression/call-overridden-method/TestCallOverriddenMethod.py (997 of 1785) PASS: lldb-unit :: Utility/./UtilityTests/ConstStringTest.NullAndEmptyStates (998 of 1785) PASS: lldb-api :: lang/c/offsetof/TestOffsetof.py (999 of 1785) PASS: lldb-unit :: Utility/./UtilityTests/StringLexerTest.Peek (1000 of 1785) UNSUPPORTED: lldb-shell :: Register/x86-zmm-write.test (1001 of 1785) PASS: lldb-unit :: Utility/./UtilityTests/ScalarTest.CastOperations (1002 of 1785) PASS: lldb-unit :: UnwindAssembly/x86/./UnwindAssemblyx86Tests/Testx86AssemblyInspectionEngine.TestPush0 (1003 of 1785) UNSUPPORTED: lldb-api :: tools/lldb-server/TestGdbRemoteModuleInfo.py (1004 of 1785) PASS: lldb-shell :: SymbolFile/NativePDB/s_constant.cpp (1005 of 1785) PASS: lldb-api :: lang/objc/objc-stepping/TestObjCStepping.py (1006 of 1785) PASS: lldb-unit :: Target/./TargetTests/PathMappingListTest.AbsoluteTests (1007 of 1785) PASS: lldb-api :: lang/objc/modules-inline-functions/TestModulesInlineFunctions.py (1008 of 1785) PASS: lldb-unit :: Utility/./UtilityTests/UserIDResolver.GetGroupName (1009 of 1785) PASS: lldb-api :: commands/expression/import-std-module/deque-basic/TestBasicDeque.py (1010 of 1785) PASS: lldb-unit :: Language/Highlighting/./HighlighterTests/HighlighterTest.ClangCursorPosEndOfLine (1011 of 1785) PASS: lldb-unit :: ObjectFile/PECOFF/./ObjectFilePECOFFTests/PECallFrameInfoTest.Chained_eh (1012 of 1785) PASS: lldb-api :: python_api/module_section/TestModuleAndSection.py (1013 of 1785) PASS: lldb-api :: functionalities/fat_archives/TestFatArchives.py (1014 of 1785) PASS: lldb-unit :: Signals/./SignalsTests/UnixSignalsTest.GetFilteredSignals (1015 of 1785) PASS: lldb-unit :: Language/Highlighting/./HighlighterTests/HighlighterTest.DefaultHighlighterWithCursor (1016 of 1785) PASS: lldb-shell :: SymbolFile/NativePDB/globals-fundamental.cpp (1017 of 1785) PASS: lldb-shell :: SymbolFile/DWARF/debug-names-compressed.cpp (1018 of 1785) PASS: lldb-api :: commands/process/attach/attach_denied/TestAttachDenied.py (1019 of 1785) PASS: lldb-unit :: UnwindAssembly/x86/./UnwindAssemblyx86Tests/Testx86AssemblyInspectionEngine.TestSpillRegToStackViaMOVi386 (1020 of 1785) PASS: lldb-api :: commands/command/delete/TestCommandDelete.py (1021 of 1785) PASS: lldb-unit :: Utility/./UtilityTests/SerializationRountripTest.SerializeDeserializePodPointers (1022 of 1785) PASS: lldb-unit :: ScriptInterpreter/Python/./ScriptInterpreterPythonTests/PythonDataObjectsTest.TestPythonTupleInitializerList2 (1023 of 1785) PASS: lldb-unit :: Utility/./UtilityTests/RangeTest.NotEqual (1024 of 1785) PASS: lldb-api :: api/multiple-targets/TestMultipleTargets.py (1025 of 1785) UNSUPPORTED: lldb-api :: tools/lldb-server/libraries-svr4/TestGdbRemoteLibrariesSvr4Support.py (1026 of 1785) PASS: lldb-api :: functionalities/breakpoint/breakpoint_ids/TestBreakpointIDs.py (1027 of 1785) PASS: lldb-unit :: Process/gdb-remote/./ProcessGdbRemoteTests/GDBRemoteCommunicationClientTest.SendStopTracePacket (1028 of 1785) PASS: lldb-unit :: Expression/./ExpressionTests/CppModuleConfigurationTest.AmbiguousCLib (1029 of 1785) PASS: lldb-unit :: Utility/./UtilityTests/ArgsTest.GetQuotedCommandString (1030 of 1785) PASS: lldb-unit :: Host/./HostTests/TaskPoolTest.TaskMap (1031 of 1785) UNSUPPORTED: lldb-api :: functionalities/darwin_log/filter/regex/message/TestDarwinLogFilterRegexMessage.py (1032 of 1785) PASS: lldb-shell :: SymbolFile/DWARF/split-dwarf-multiple-cu.ll (1033 of 1785) PASS: lldb-api :: functionalities/multidebugger_commands/TestMultipleDebuggersCommands.py (1034 of 1785) PASS: lldb-unit :: Utility/./UtilityTests/GeneratorTest.GetOrCreate (1035 of 1785) PASS: lldb-api :: lang/c/function_types/TestFunctionTypes.py (1036 of 1785) PASS: lldb-api :: commands/watchpoints/multiple_threads/TestWatchpointMultipleThreads.py (1037 of 1785) PASS: lldb-api :: lang/cpp/modules-import/TestCXXModulesImport.py (1038 of 1785) PASS: lldb-api :: functionalities/data-formatter/data-formatter-objc/TestDataFormatterObjNSException.py (1039 of 1785) PASS: lldb-unit :: Utility/./UtilityTests/StringExtractorTest.GetHexBytes_Partial (1040 of 1785) PASS: lldb-api :: lang/c/set_values/TestSetValues.py (1041 of 1785) PASS: lldb-api :: types/TestIntegerTypesExpr.py (1042 of 1785) PASS: lldb-shell :: ObjectFile/Breakpad/discontiguous-sections.test (1043 of 1785) PASS: lldb-api :: commands/expression/import-std-module/forward_list-dbg-info-content/TestDbgInfoContentForwardList.py (1044 of 1785) PASS: lldb-api :: python_api/hello_world/TestHelloWorld.py (1045 of 1785) PASS: lldb-shell :: ObjectFile/PECOFF/subsections.yaml (1046 of 1785) PASS: lldb-unit :: UnwindAssembly/x86/./UnwindAssemblyx86Tests/Testx86AssemblyInspectionEngine.TestSubRSP (1047 of 1785) PASS: lldb-unit :: Language/Highlighting/./HighlighterTests/HighlighterTest.ClangIdentifiers (1048 of 1785) PASS: lldb-api :: lang/c/unions/TestUnionMembers.py (1049 of 1785) PASS: lldb-api :: commands/expression/timeout/TestCallWithTimeout.py (1050 of 1785) PASS: lldb-unit :: Process/gdb-remote/./ProcessGdbRemoteTests/GDBRemoteClientBaseTest.SendPacketAndReceiveResponseWithOutputSupport (1051 of 1785) PASS: lldb-api :: functionalities/process_group/TestChangeProcessGroup.py (1052 of 1785) PASS: lldb-unit :: Utility/./UtilityTests/StatusTest.Formatv (1053 of 1785) PASS: lldb-unit :: Host/./HostTests/TaskPoolTest.AddTask (1054 of 1785) PASS: lldb-unit :: Utility/./UtilityTests/StringLexerTest.AdvanceIf (1055 of 1785) PASS: lldb-unit :: tools/lldb-server/tests/./LLDBServerTests/StandardStartupTest.TestStopReplyContainsThreadPcs (1056 of 1785) PASS: lldb-unit :: Process/gdb-remote/./ProcessGdbRemoteTests/GDBRemoteCommunicationClientTest.GetMemoryRegionInfo (1057 of 1785) PASS: lldb-api :: commands/platform/basic/TestPlatformPython.py (1058 of 1785) PASS: lldb-unit :: Utility/./UtilityTests/StringListTest.JoinSingle (1059 of 1785) PASS: lldb-unit :: Utility/./UtilityTests/OptionsWithRawTest.EmptyArgsOnlySuffix (1060 of 1785) PASS: lldb-unit :: Breakpoint/./LLDBBreakpointTests/BreakpointIDTest.StringIsBreakpointName (1061 of 1785) PASS: lldb-unit :: Utility/./UtilityTests/BinaryStreamTest.PutSLEB128Zero (1062 of 1785) PASS: lldb-unit :: SymbolFile/DWARF/./SymbolFileDWARFTests/SymbolFileDWARFTests.TestAbbrevInvalidNULLTag (1063 of 1785) PASS: lldb-api :: functionalities/inline-stepping/TestInlineStepping.py (1064 of 1785) PASS: lldb-unit :: Utility/./UtilityTests/StreamTest.PutHex32ByteOrderBig (1065 of 1785) PASS: lldb-unit :: UnwindAssembly/x86/./UnwindAssemblyx86Tests/Testx86AssemblyInspectionEngine.TestStackRealign32BitDisp_x86_64 (1066 of 1785) PASS: lldb-unit :: Utility/./UtilityTests/StringExtractorTest.GetHexU8_Underflow_NoEof (1067 of 1785) PASS: lldb-api :: lang/objc/objc-runtime-ivars/TestRuntimeIvars.py (1068 of 1785) PASS: lldb-api :: commands/expression/test/TestExprs.py (1069 of 1785) PASS: lldb-api :: commands/add-dsym/uuid/TestAddDsymCommand.py (1070 of 1785) PASS: lldb-unit :: SymbolFile/NativePDB/./SymbolFileNativePDBTests/PDBFPOProgramToDWARFExpressionTests.UnresolvedDependentCyclicRegisterAssignmentReference (1071 of 1785) PASS: lldb-api :: functionalities/data-formatter/data-formatter-stl/libcxx/map/TestDataFormatterLibccMap.py (1072 of 1785) PASS: lldb-api :: functionalities/load_using_paths/TestLoadUsingPaths.py (1073 of 1785) PASS: lldb-unit :: UnwindAssembly/x86/./UnwindAssemblyx86Tests/Testx86AssemblyInspectionEngine.TestPushRBPWithREX (1074 of 1785) PASS: lldb-api :: lang/cpp/symbols/TestSymbols.py (1075 of 1785) PASS: lldb-unit :: Symbol/./SymbolTests/TestClangASTContext.TestRemoveFastQualifiers (1076 of 1785) PASS: lldb-unit :: Utility/./UtilityTests/StringExtractorTest.DecodeHexU8_InvalidHex2 (1077 of 1785) PASS: lldb-unit :: Symbol/./SymbolTests/TestClangASTContext.TestGetBasicTypeFromName (1078 of 1785) PASS: lldb-unit :: Utility/./UtilityTests/StreamTest.PutULEB128 (1079 of 1785) PASS: lldb-api :: lang/objc/foundation/TestRuntimeTypes.py (1080 of 1785) PASS: lldb-shell :: ObjectFile/MachO/lc_version_min.yaml (1081 of 1785) PASS: lldb-unit :: Utility/./UtilityTests/BinaryStreamTest.PutULEB128FiveBytes (1082 of 1785) PASS: lldb-api :: functionalities/breakpoint/breakpoint_ignore_count/TestBreakpointIgnoreCount.py (1083 of 1785) PASS: lldb-unit :: UnwindAssembly/x86/./UnwindAssemblyx86Tests/Testx86AssemblyInspectionEngine.TestPushEDX (1084 of 1785) PASS: lldb-unit :: Process/gdb-remote/./ProcessGdbRemoteTests/GDBRemoteClientBaseTest.SendContinueAndInterrupt2PacketBug (1085 of 1785) PASS: lldb-unit :: Utility/./UtilityTests/StreamTest.PutStringAsRawHex8 (1086 of 1785) XFAIL: lldb-shell :: Register/x86-mm-xmm-write.test (1087 of 1785) PASS: lldb-unit :: ScriptInterpreter/Python/./ScriptInterpreterPythonTests/PythonDataObjectsTest.TestPythonDictionaryToStructuredDictionary (1088 of 1785) PASS: lldb-unit :: UnwindAssembly/x86/./UnwindAssemblyx86Tests/Testx86AssemblyInspectionEngine.Test32BitOnlyInstruction (1089 of 1785) PASS: lldb-unit :: Utility/./UtilityTests/TimerTest.CategoryTimesStats (1090 of 1785) PASS: lldb-shell :: Quit/TestQuitExitCode30.test (1091 of 1785) PASS: lldb-api :: macosx/nslog/TestDarwinNSLogOutput.py (1092 of 1785) PASS: lldb-unit :: Utility/./UtilityTests/FileSpecTest.EqualSeparator (1093 of 1785) PASS: lldb-api :: functionalities/modern-type-lookup/libcxx/TestLibCxxModernTypeLookup.py (1094 of 1785) PASS: lldb-unit :: Utility/./UtilityTests/StringExtractorTest.GetHexU8_Underflow (1095 of 1785) PASS: lldb-unit :: Utility/./UtilityTests/StringListTest.ShiftStdString (1096 of 1785) PASS: lldb-unit :: Utility/./UtilityTests/TimerTest.CategoryTimes2 (1097 of 1785) PASS: lldb-unit :: Utility/./UtilityTests/ScalarTest.ExtractBitfield (1098 of 1785) PASS: lldb-api :: commands/expression/class_template_specialization_empty_pack/TestClassTemplateSpecializationParametersHandling.py (1099 of 1785) PASS: lldb-shell :: ObjectFile/ELF/PT_LOAD-overlap-PT_INTERP.yaml (1100 of 1785) PASS: lldb-shell :: Quit/TestQuitExitCode-30.test (1101 of 1785) UNSUPPORTED: lldb-shell :: Register/x86-zmm-read.test (1102 of 1785) PASS: lldb-shell :: SymbolFile/Breakpad/line-table-discontinuous-file-ids.test (1103 of 1785) PASS: lldb-api :: lang/cpp/trivial_abi/TestTrivialABI.py (1104 of 1785) PASS: lldb-shell :: SymbolFile/NativePDB/break-by-function.cpp (1105 of 1785) XFAIL: lldb-shell :: Register/x86-64-ymm-write.test (1106 of 1785) PASS: lldb-unit :: Expression/./ExpressionTests/DiagnosticManagerTest.GetStringMultiline (1107 of 1785) PASS: lldb-api :: macosx/order/TestOrderFile.py (1108 of 1785) PASS: lldb-shell :: SymbolFile/DWARF/array-sizes.s (1109 of 1785) PASS: lldb-shell :: Quit/TestQuitExitCodeTooManyArgs.test (1110 of 1785) PASS: lldb-api :: python_api/lldbutil/process/TestPrintStackTraces.py (1111 of 1785) PASS: lldb-unit :: UnwindAssembly/x86/./UnwindAssemblyx86Tests/Testx86AssemblyInspectionEngine.TestPushR15 (1112 of 1785) PASS: lldb-api :: commands/expression/radar_9531204/TestPrintfAfterUp.py (1113 of 1785) PASS: lldb-unit :: Utility/./UtilityTests/RangeTest.Constructor (1114 of 1785) PASS: lldb-api :: functionalities/data-formatter/data-formatter-objc/nsstring/TestDataFormatterNSString.py (1115 of 1785) UNSUPPORTED: lldb-shell :: Breakpoint/ppc64-localentry.test (1116 of 1785) PASS: lldb-unit :: Utility/./UtilityTests/AnsiTerminal.Basic (1117 of 1785) UNSUPPORTED: lldb-api :: tools/lldb-server/platform-process-connect/TestPlatformProcessConnect.py (1118 of 1785) PASS: lldb-unit :: SymbolFile/DWARF/./SymbolFileDWARFTests/SymbolFileDWARFTests.TestAbbrevMissingTerminator (1119 of 1785) PASS: lldb-unit :: Utility/./UtilityTests/ArchSpecTest.TestParseMachCPUDashSubtypeTripleSimple (1120 of 1785) PASS: lldb-unit :: UnwindAssembly/x86/./UnwindAssemblyx86Tests/Testx86AssemblyInspectionEngine.TestCALLNextInsn (1121 of 1785) PASS: lldb-api :: python_api/lldbutil/iter/TestRegistersIterator.py (1122 of 1785) UNSUPPORTED: lldb-api :: benchmarks/expression/TestExpressionCmd.py (1123 of 1785) PASS: lldb-api :: commands/expression/import-std-module/list-dbg-info-content/TestDbgInfoContentList.py (1124 of 1785) PASS: lldb-api :: functionalities/data-formatter/data-formatter-stl/libcxx/multimap/TestDataFormatterLibccMultiMap.py (1125 of 1785) PASS: lldb-unit :: UnwindAssembly/x86/./UnwindAssemblyx86Tests/Testx86AssemblyInspectionEngine.TestPushR14 (1126 of 1785) PASS: lldb-api :: functionalities/postmortem/minidump/TestMiniDump.py (1127 of 1785) PASS: lldb-unit :: Symbol/./SymbolTests/SymbolsTest.TerminateLocateExecutableSymbolFileForUnknownExecutableAndUnknownSymbolFile (1128 of 1785) UNSUPPORTED: lldb-api :: tools/lldb-server/TestGdbRemoteAuxvSupport.py (1129 of 1785) PASS: lldb-api :: commands/platform/basic/TestPlatformCommand.py (1130 of 1785) PASS: lldb-unit :: UnwindAssembly/x86/./UnwindAssemblyx86Tests/Testx86AssemblyInspectionEngine.TestPushEBX (1131 of 1785) PASS: lldb-shell :: SymbolFile/DWARF/childless-compile-unit.s (1132 of 1785) PASS: lldb-unit :: SymbolFile/NativePDB/./SymbolFileNativePDBTests/PDBFPOProgramToDWARFExpressionTests.InvalidOpBinary (1133 of 1785) PASS: lldb-unit :: Utility/./UtilityTests/VASprintfTest.BufferResize (1134 of 1785) PASS: lldb-unit :: Utility/./UtilityTests/StreamTest.PutCharNull (1135 of 1785) PASS: lldb-unit :: Host/./HostTests/MainLoopTest.Signal (1136 of 1785) PASS: lldb-api :: functionalities/thread/backtrace_limit/TestBacktraceLimit.py (1137 of 1785) PASS: lldb-unit :: Language/Highlighting/./HighlighterTests/HighlighterTest.HighlighterSelectionPath (1138 of 1785) PASS: lldb-unit :: Utility/./UtilityTests/FileSpecTest.CopyByAppendingPathComponent (1139 of 1785) PASS: lldb-unit :: tools/lldb-server/tests/./LLDBServerTests/TestBase.DebugserverEnv (1140 of 1785) PASS: lldb-unit :: Utility/./UtilityTests/StringListTest.ForRangeEmpty (1141 of 1785) PASS: lldb-shell :: SymbolFile/DWARF/debug_ranges_and_rnglists.test (1142 of 1785) PASS: lldb-unit :: Utility/./UtilityTests/LogTest.LLDB_LOG_nullptr (1143 of 1785) PASS: lldb-api :: lang/cpp/char1632_t/TestChar1632T.py (1144 of 1785) PASS: lldb-unit :: Utility/./UtilityTests/UUIDTest.SetFromStringRef (1145 of 1785) PASS: lldb-unit :: ObjectFile/ELF/./ObjectFileELFTests/ObjectFileELFTest.GetModuleSpecifications_EarlySectionHeaders (1146 of 1785) PASS: lldb-shell :: ObjectFile/ELF/compressed-sections.yaml (1147 of 1785) PASS: lldb-api :: lang/cpp/operators/TestCppOperators.py (1148 of 1785) PASS: lldb-unit :: ObjectFile/Breakpad/./ObjectFileBreakpadTests/FuncRecord.parse (1149 of 1785) PASS: lldb-api :: lang/cpp/exceptions/TestCPPExceptionBreakpoints.py (1150 of 1785) PASS: lldb-api :: commands/expression/namespace_local_var_same_name_cpp_and_c/TestNamespaceLocalVarSameNameCppAndC.py (1151 of 1785) PASS: lldb-unit :: Platform/./LLDBPlatformTests/PlatformDarwinTest.TestParseVersionBuildDir (1152 of 1785) PASS: lldb-api :: commands/expression/import-std-module/shared_ptr/TestSharedPtr.py (1153 of 1785) PASS: lldb-unit :: ScriptInterpreter/Python/./ScriptInterpreterPythonTests/PythonDataObjectsTest.TestPythonCallableCheck (1154 of 1785) PASS: lldb-shell :: Minidump/fb-dump.test (1155 of 1785) PASS: lldb-api :: functionalities/inferior-crashing/TestInferiorCrashing.py (1156 of 1785) PASS: lldb-api :: commands/expression/unicode-in-variable/TestUnicodeInVariable.py (1157 of 1785) PASS: lldb-api :: commands/disassemble/basic/TestFrameDisassemble.py (1158 of 1785) PASS: lldb-api :: tools/lldb-server/TestLldbGdbServer.py (1159 of 1785) PASS: lldb-shell :: ObjectFile/Breakpad/uuid-matching-mac.test (1160 of 1785) PASS: lldb-api :: api/check_public_api_headers/TestPublicAPIHeaders.py (1161 of 1785) PASS: lldb-unit :: Utility/./UtilityTests/StringExtractorTest.GetU64BigEndian (1162 of 1785) PASS: lldb-shell :: BuildScript/compiler-full-path.test (1163 of 1785) UNSUPPORTED: lldb-api :: functionalities/darwin_log/filter/regex/activity/TestDarwinLogFilterRegexActivity.py (1164 of 1785) PASS: lldb-api :: commands/expression/call-throws/TestCallThatThrows.py (1165 of 1785) PASS: lldb-api :: functionalities/data-formatter/data-formatter-synth/TestDataFormatterSynth.py (1166 of 1785) PASS: lldb-shell :: ObjectFile/ELF/minidebuginfo-corrupt-xz.yaml (1167 of 1785) PASS: lldb-api :: lang/objc/objc-checker/TestObjCCheckers.py (1168 of 1785) PASS: lldb-shell :: Reproducer/Functionalities/TestStepping.test (1169 of 1785) PASS: lldb-api :: functionalities/data-formatter/data-formatter-named-summaries/TestDataFormatterNamedSummaries.py (1170 of 1785) PASS: lldb-unit :: UnwindAssembly/x86/./UnwindAssemblyx86Tests/Testx86AssemblyInspectionEngine.Test32bitFramelessSmallStackFrame (1171 of 1785) PASS: lldb-unit :: Utility/./UtilityTests/StringExtractorTest.GetHexU8_Extra_NoEof (1172 of 1785) PASS: lldb-api :: tools/lldb-server/TestGdbRemoteProcessInfo.py (1173 of 1785) PASS: lldb-unit :: Utility/./UtilityTests/UUIDTest.StringConverion (1174 of 1785) PASS: lldb-api :: python_api/exprpath_synthetic/TestExprPathSynthetic.py (1175 of 1785) PASS: lldb-shell :: SymbolFile/NativePDB/source-list.cpp (1176 of 1785) PASS: lldb-unit :: SymbolFile/NativePDB/./SymbolFileNativePDBTests/PDBFPOProgramToDWARFExpressionTests.UnsupportedRASearch (1177 of 1785) PASS: lldb-unit :: Symbol/./SymbolTests/DWARFCallFrameInfoTest.Basic_dwarf3 (1178 of 1785) PASS: lldb-unit :: Host/./HostTests/SocketTest.UDPGetConnectURI (1179 of 1785) PASS: lldb-api :: commands/command/history/TestCommandHistory.py (1180 of 1785) UNSUPPORTED: lldb-api :: functionalities/longjmp/TestLongjmp.py (1181 of 1785) PASS: lldb-api :: functionalities/breakpoint/address_breakpoints/TestAddressBreakpoints.py (1182 of 1785) PASS: lldb-unit :: Utility/./UtilityTests/ArgsTest.AppendArguments (1183 of 1785) PASS: lldb-api :: commands/expression/formatters/TestFormatters.py (1184 of 1785) PASS: lldb-unit :: Utility/./UtilityTests/RangeTest.ContainsRangeStartingFromZero (1185 of 1785) PASS: lldb-shell :: ObjectFile/ELF/build-id-case.yaml (1186 of 1785) PASS: lldb-api :: lang/cpp/virtual-overload/TestVirtualOverload.py (1187 of 1785) PASS: lldb-api :: functionalities/target-new-solib-notifications/TestModuleLoadedNotifys.py (1188 of 1785) PASS: lldb-shell :: Minidump/breakpad-symbols.test (1189 of 1785) PASS: lldb-unit :: Utility/./UtilityTests/ArgsTest.ReplaceArgumentAtIndexFarOutOfRange (1190 of 1785) XFAIL: lldb-shell :: Register/x86-mm-xmm-read.test (1191 of 1785) PASS: lldb-unit :: Utility/./UtilityTests/StreamTest.PutRawBytesToBigEndian (1192 of 1785) PASS: lldb-api :: commands/frame/diagnose/dereference-function-return/TestDiagnoseDereferenceFunctionReturn.py (1193 of 1785) PASS: lldb-unit :: Utility/./UtilityTests/VMRange.IsValid (1194 of 1785) PASS: lldb-unit :: Signals/./SignalsTests/UnixSignalsTest.Iteration (1195 of 1785) UNSUPPORTED: lldb-api :: lang/cpp/static_members/TestCPPStaticMembers.py (1196 of 1785) PASS: lldb-shell :: SymbolFile/Breakpad/line-table.test (1197 of 1785) PASS: lldb-api :: lang/cpp/nested-class-other-compilation-unit/TestNestedClassWithParentInAnotherCU.py (1198 of 1785) PASS: lldb-api :: tools/lldb-server/TestGdbRemoteExitCode.py (1199 of 1785) PASS: lldb-api :: lang/cpp/const_this/TestConstThis.py (1200 of 1785) PASS: lldb-api :: functionalities/signal/handle-abrt/TestHandleAbort.py (1201 of 1785) PASS: lldb-shell :: Reproducer/TestSynchronous.test (1202 of 1785) PASS: lldb-unit :: Host/./HostTests/NativeProcessProtocolTest.SetBreakpointFailVerify (1203 of 1785) PASS: lldb-api :: lang/objc/objc-class-method/TestObjCClassMethod.py (1204 of 1785) PASS: lldb-api :: functionalities/data-formatter/parray/TestPrintArray.py (1205 of 1785) PASS: lldb-api :: commands/command/script/import/TestImport.py (1206 of 1785) UNSUPPORTED: lldb-api :: functionalities/data-formatter/data-formatter-stl/libstdcpp/unique_ptr/TestDataFormatterStdUniquePtr.py (1207 of 1785) PASS: lldb-api :: commands/expression/function_template_specialization_temp_args/TestFunctionTemplateSpecializationTempArgs.py (1208 of 1785) UNSUPPORTED: lldb-shell :: SymbolFile/PDB/type-quals.test (1209 of 1785) PASS: lldb-api :: macosx/duplicate-archive-members/TestDuplicateMembers.py (1210 of 1785) PASS: lldb-unit :: Process/minidump/./LLDBMinidumpTests/MinidumpParserTest.GetMemoryRegionInfoFromMemoryList (1211 of 1785) PASS: lldb-api :: functionalities/data-formatter/user-format-vs-summary/TestUserFormatVsSummary.py (1212 of 1785) PASS: lldb-api :: tools/lldb-server/commandline/TestStubSetSID.py (1213 of 1785) PASS: lldb-unit :: Utility/./UtilityTests/BinaryStreamTest.PutSLEB128MaxValue (1214 of 1785) PASS: lldb-api :: functionalities/inferior-changed/TestInferiorChanged.py (1215 of 1785) PASS: lldb-unit :: Process/gdb-remote/./ProcessGdbRemoteTests/GDBRemoteClientBaseTest.SendContinueDelegateInterface (1216 of 1785) PASS: lldb-unit :: Utility/./UtilityTests/UriParserTest.MinimalPortPath (1217 of 1785) PASS: lldb-unit :: Host/./HostTests/FileSystemTest.Resolve (1218 of 1785) PASS: lldb-api :: lang/objc/objc-ivar-offsets/TestObjCIvarOffsets.py (1219 of 1785) PASS: lldb-api :: functionalities/step-avoids-no-debug/TestStepNoDebug.py (1220 of 1785) PASS: lldb-unit :: UnwindAssembly/x86/./UnwindAssemblyx86Tests/Testx86AssemblyInspectionEngine.TestSimplei386ugmented (1221 of 1785) PASS: lldb-api :: commands/expression/cast_int_to_anonymous_enum/TestCastIntToAnonymousEnum.py (1222 of 1785) PASS: lldb-unit :: Utility/./UtilityTests/StreamTest.PutSLEB128 (1223 of 1785) PASS: lldb-unit :: Utility/./UtilityTests/EnvironmentTest.EnvpConversion (1224 of 1785) PASS: lldb-shell :: Register/x86-64-gp-read.test (1225 of 1785) PASS: lldb-unit :: Host/./HostTests/FileSystemTest.Readable (1226 of 1785) PASS: lldb-api :: functionalities/data-formatter/data-formatter-smart-array/TestDataFormatterSmartArray.py (1227 of 1785) PASS: lldb-shell :: ObjectFile/ELF/base-address.yaml (1228 of 1785) PASS: lldb-shell :: Commands/command-source.test (1229 of 1785) PASS: lldb-unit :: Utility/./UtilityTests/DataExtractorTest.GetCStrEmpty (1230 of 1785) PASS: lldb-unit :: Utility/./UtilityTests/UriParserTest.BadPort2 (1231 of 1785) PASS: lldb-api :: commands/platform/process/TestProcessList.py (1232 of 1785) PASS: lldb-unit :: Utility/./UtilityTests/UriParserTest.PortOverflow (1233 of 1785) UNSUPPORTED: lldb-shell :: SymbolFile/PDB/calling-conventions.test (1234 of 1785) PASS: lldb-unit :: Utility/./UtilityTests/StringExtractorTest.GetHexBytes_OddPair (1235 of 1785) UNSUPPORTED: lldb-api :: functionalities/darwin_log/filter/exact_match/activity/TestDarwinLogFilterMatchActivity.py (1236 of 1785) PASS: lldb-api :: functionalities/data-formatter/data-formatter-globals/TestDataFormatterGlobals.py (1237 of 1785) PASS: lldb-unit :: Process/gdb-remote/./ProcessGdbRemoteTests/GDBRemoteCommunicationClientTest.SendGetMetaDataPacket (1238 of 1785) PASS: lldb-unit :: Core/./LLDBCoreTests/RichManglingContextTest.Basic (1239 of 1785) PASS: lldb-unit :: Target/./TargetTests/ModuleCacheTest.GetAndPutStrangeHostname (1240 of 1785) PASS: lldb-unit :: Process/gdb-remote/./ProcessGdbRemoteTests/GDBRemoteCommunicationServerTest.SendErrorResponse_UnimplementedError (1241 of 1785) PASS: lldb-shell :: SymbolFile/DWARF/debug_ranges.s (1242 of 1785) PASS: lldb-api :: commands/command/script/TestCommandScript.py (1243 of 1785) PASS: lldb-api :: commands/expression/rdar44436068/Test128BitsInteger.py (1244 of 1785) PASS: lldb-shell :: ObjectFile/ELF/section-types-edgecases.yaml (1245 of 1785) PASS: lldb-unit :: Utility/./UtilityTests/ScalarTest.Scalar_512 (1246 of 1785) PASS: lldb-unit :: Expression/./ExpressionTests/DiagnosticManagerTest.PutStringSeverities (1247 of 1785) PASS: lldb-shell :: SymbolFile/DWARF/find-inline-method.s (1248 of 1785) PASS: lldb-api :: python_api/type/TestTypeList.py (1249 of 1785) PASS: lldb-api :: python_api/watchpoint/watchlocation/TestTargetWatchAddress.py (1250 of 1785) PASS: lldb-api :: lang/cpp/thread_local/TestThreadLocal.py (1251 of 1785) PASS: lldb-api :: commands/frame/var-scope/TestFrameVariableScope.py (1252 of 1785) PASS: lldb-api :: commands/expression/xvalue/TestXValuePrinting.py (1253 of 1785) PASS: lldb-api :: functionalities/data-formatter/data-formatter-advanced/TestDataFormatterAdv.py (1254 of 1785) PASS: lldb-unit :: Utility/./UtilityTests/StringListTest.DefaultConstructor (1255 of 1785) PASS: lldb-api :: lang/c/bitfields/TestBitfields.py (1256 of 1785) PASS: lldb-shell :: ObjectFile/PECOFF/basic-info.yaml (1257 of 1785) PASS: lldb-api :: lang/cpp/char8_t/TestCxxChar8_t.py (1258 of 1785) PASS: lldb-api :: commands/expression/vector_of_enums/TestVectorOfEnums.py (1259 of 1785) PASS: lldb-unit :: ScriptInterpreter/Python/./ScriptInterpreterPythonTests/PythonDataObjectsTest.TestExtractingUInt64ThroughStructuredData (1260 of 1785) PASS: lldb-api :: lang/mixed/TestMixedLanguages.py (1261 of 1785) PASS: lldb-api :: python_api/lldbutil/TestSwigVersion.py (1262 of 1785) UNSUPPORTED: lldb-api :: tools/lldb-vscode/stackTrace/TestVSCode_stackTrace.py (1263 of 1785) PASS: lldb-api :: commands/expression/context-object/TestContextObject.py (1264 of 1785) PASS: lldb-api :: functionalities/memory/read/TestMemoryRead.py (1265 of 1785) UNSUPPORTED: lldb-api :: tools/lldb-server/signal-filtering/TestGdbRemote_QPassSignals.py (1266 of 1785) PASS: lldb-unit :: Utility/./UtilityTests/ScalarTest.Comparison (1267 of 1785) PASS: lldb-shell :: SymbolFile/DWARF/debug_rnglists.s (1268 of 1785) PASS: lldb-unit :: Utility/./UtilityTests/FileSpecTest.AppendPathComponent (1269 of 1785) PASS: lldb-unit :: Utility/./UtilityTests/Flags.Reset (1270 of 1785) PASS: lldb-api :: functionalities/dynamic_value_child_count/TestDynamicValueChildCount.py (1271 of 1785) PASS: lldb-api :: lang/objc/forward-decl/TestForwardDecl.py (1272 of 1785) PASS: lldb-shell :: ObjectFile/PECOFF/dep-modules.yaml (1273 of 1785) PASS: lldb-api :: functionalities/breakpoint/breakpoint_language/TestBreakpointLanguage.py (1274 of 1785) PASS: lldb-unit :: Utility/./UtilityTests/ArgsTest.TestQuotedUnknownEscape (1275 of 1785) PASS: lldb-api :: tools/lldb-server/TestGdbRemoteAttach.py (1276 of 1785) PASS: lldb-api :: lang/objc/objc-static-method-stripped/TestObjCStaticMethodStripped.py (1277 of 1785) UNSUPPORTED: lldb-api :: functionalities/tty/TestTerminal.py (1278 of 1785) PASS: lldb-unit :: Process/gdb-remote/./ProcessGdbRemoteTests/GDBRemoteCommunicationClientTest.SaveRestoreRegistersNoSuffix (1279 of 1785) PASS: lldb-api :: functionalities/data-formatter/poarray/TestPrintObjectArray.py (1280 of 1785) PASS: lldb-unit :: Host/./HostTests/ProcessLaunchInfoTest.Constructor (1281 of 1785) PASS: lldb-unit :: Utility/./UtilityTests/FileSpecTest.GuessPathStyle (1282 of 1785) UNSUPPORTED: lldb-shell :: SymbolFile/target-symbols-add-unwind.test (1283 of 1785) PASS: lldb-api :: tools/lldb-server/TestGdbRemoteRegisterState.py (1284 of 1785) PASS: lldb-unit :: Utility/./UtilityTests/StringListTest.CopyListSingle (1285 of 1785) PASS: lldb-unit :: Utility/./UtilityTests/AnsiTerminal.WhiteSpace (1286 of 1785) PASS: lldb-unit :: Utility/./UtilityTests/StreamTeeTest.Constructor1Stream (1287 of 1785) PASS: lldb-unit :: ScriptInterpreter/Python/./ScriptInterpreterPythonTests/PythonExceptionStateTest.TestAutoRestoreSemantics (1288 of 1785) PASS: lldb-unit :: Symbol/./SymbolTests/PostfixExpression.ParseOneExpression (1289 of 1785) PASS: lldb-unit :: Utility/./UtilityTests/ArgsTest.ReplaceArgumentAtIndexLonger (1290 of 1785) PASS: lldb-unit :: Core/./LLDBCoreTests/MangledTest.NameIndexes_FindFunctionSymbols (1291 of 1785) PASS: lldb-api :: commands/expression/anonymous-struct/TestCallUserAnonTypedef.py (1292 of 1785) PASS: lldb-api :: lang/objc/foundation/TestObjCMethods.py (1293 of 1785) PASS: lldb-unit :: UnwindAssembly/x86/./UnwindAssemblyx86Tests/Testx86AssemblyInspectionEngine.TestPopRBP (1294 of 1785) PASS: lldb-unit :: Core/./LLDBCoreTests/RichManglingContextTest.SwitchProvider (1295 of 1785) PASS: lldb-unit :: ScriptInterpreter/Python/./ScriptInterpreterPythonTests/PythonExceptionStateTest.TestExceptionStateChecking (1296 of 1785) PASS: lldb-api :: functionalities/thread/concurrent_events/TestConcurrentBreakpointsDelayedBreakpointOneWatchpoint.py (1297 of 1785) PASS: lldb-unit :: UnwindAssembly/x86/./UnwindAssemblyx86Tests/Testx86AssemblyInspectionEngine.TestPopRBX (1298 of 1785) PASS: lldb-unit :: Utility/./UtilityTests/ArchSpecTest.MergeFromMachOUnknown (1299 of 1785) PASS: lldb-unit :: Utility/./UtilityTests/StringListTest.Join (1300 of 1785) PASS: lldb-api :: functionalities/var_path/TestVarPath.py (1301 of 1785) UNSUPPORTED: lldb-api :: functionalities/darwin_log/format/TestDarwinLogMessageFormat.py (1302 of 1785) PASS: lldb-api :: commands/frame/diagnose/bad-reference/TestBadReference.py (1303 of 1785) PASS: lldb-shell :: SymbolFile/DWARF/debug-line-basic.s (1304 of 1785) PASS: lldb-shell :: SymbolFile/DWARF/find-basic-namespace.cpp (1305 of 1785) PASS: lldb-api :: functionalities/ptr_refs/TestPtrRefs.py (1306 of 1785) PASS: lldb-shell :: ObjectFile/ELF/PT_LOAD-overlap-section.yaml (1307 of 1785) PASS: lldb-api :: commands/source/info/TestSourceInfo.py (1308 of 1785) PASS: lldb-shell :: SymbolFile/NativePDB/disassembly.cpp (1309 of 1785) PASS: lldb-api :: functionalities/data-formatter/data-formatter-stl/libcxx/set/TestDataFormatterLibcxxSet.py (1310 of 1785) PASS: lldb-unit :: Utility/./UtilityTests/StringExtractorTest.GetNameColonValueNoColon (1311 of 1785) PASS: lldb-api :: commands/expression/top-level/TestTopLevelExprs.py (1312 of 1785) PASS: lldb-shell :: SymbolFile/NativePDB/tag-types.cpp (1313 of 1785) PASS: lldb-api :: functionalities/data-formatter/data-formatter-stl/libcxx/forward_list/TestDataFormatterLibcxxForwardList.py (1314 of 1785) PASS: lldb-api :: commands/frame/var/TestFrameVar.py (1315 of 1785) PASS: lldb-api :: commands/statistics/basic/TestStats.py (1316 of 1785) PASS: lldb-api :: functionalities/asan/TestReportData.py (1317 of 1785) PASS: lldb-api :: macosx/add-dsym/TestAddDsymMidExecutionCommand.py (1318 of 1785) UNSUPPORTED: lldb-shell :: Register/x86-ymm-read.test (1319 of 1785) PASS: lldb-unit :: Utility/./UtilityTests/FileSpecTest.GetNormalizedPath (1320 of 1785) PASS: lldb-unit :: UnwindAssembly/x86/./UnwindAssemblyx86Tests/Testx86AssemblyInspectionEngine.TestPushRBX (1321 of 1785) PASS: lldb-api :: python_api/sbtype_typeclass/TestSBTypeTypeClass.py (1322 of 1785) PASS: lldb-api :: lang/c/tls_globals/TestTlsGlobals.py (1323 of 1785) PASS: lldb-api :: lang/objc/objc-builtin-types/TestObjCBuiltinTypes.py (1324 of 1785) PASS: lldb-shell :: Settings/TestFrameFormatNoColor.test (1325 of 1785) PASS: lldb-shell :: SymbolFile/NativePDB/ast-functions.cpp (1326 of 1785) PASS: lldb-api :: functionalities/target_var/TestTargetVar.py (1327 of 1785) UNSUPPORTED: lldb-shell :: SymbolFile/PDB/func-symbols.test (1328 of 1785) PASS: lldb-api :: lang/objc/foundation/TestObjCMethods2.py (1329 of 1785) PASS: lldb-api :: commands/expression/import-std-module/basic/TestImportStdModule.py (1330 of 1785) PASS: lldb-api :: python_api/signals/TestSignalsAPI.py (1331 of 1785) PASS: lldb-unit :: Utility/./UtilityTests/ListenerTest.GetEventImmediate (1332 of 1785) UNSUPPORTED: lldb-api :: functionalities/darwin_log/source/debug/TestDarwinLogSourceDebug.py (1333 of 1785) PASS: lldb-api :: lang/cpp/breakpoint_in_member_func_w_non_primitive_params/TestBreakpointInMemberFuncWNonPrimitiveParams.py (1334 of 1785) PASS: lldb-api :: functionalities/paths/TestPaths.py (1335 of 1785) PASS: lldb-api :: commands/command/script/import/rdar-12586188/TestRdar12586188.py (1336 of 1785) UNSUPPORTED: lldb-api :: functionalities/darwin_log/filter/exact_match/activity-chain/TestDarwinLogFilterMatchActivityChain.py (1337 of 1785) UNSUPPORTED: lldb-api :: linux/sepdebugsymlink/TestTargetSymbolsSepDebugSymlink.py (1338 of 1785) PASS: lldb-api :: commands/expression/call-function/TestCallBuiltinFunction.py (1339 of 1785) PASS: lldb-api :: types/TestRecursiveTypes.py (1340 of 1785) PASS: lldb-api :: functionalities/data-formatter/data-formatter-disabling/TestDataFormatterDisabling.py (1341 of 1785) PASS: lldb-unit :: SymbolFile/NativePDB/./SymbolFileNativePDBTests/PDBFPOProgramToDWARFExpressionTests.MultipleIndependentAssignments (1342 of 1785) PASS: lldb-unit :: ObjectFile/Breakpad/./ObjectFileBreakpadTests/InfoRecord.parse (1343 of 1785) PASS: lldb-unit :: ScriptInterpreter/Python/./ScriptInterpreterPythonTests/PythonDataObjectsTest.TestObjectAttributes (1344 of 1785) PASS: lldb-api :: python_api/process/io/TestProcessIO.py (1345 of 1785) PASS: lldb-api :: functionalities/thread/concurrent_events/TestConcurrentManyWatchpoints.py (1346 of 1785) PASS: lldb-api :: commands/expression/save_jit_objects/TestSaveJITObjects.py (1347 of 1785) PASS: lldb-unit :: Utility/./UtilityTests/ArgsTest.ReplaceArgumentAtIndexOutOfRange (1348 of 1785) PASS: lldb-unit :: UnwindAssembly/x86/./UnwindAssemblyx86Tests/Testx86AssemblyInspectionEngine.TestPushImm (1349 of 1785) PASS: lldb-shell :: SymbolFile/DWARF/dir-separator-no-comp-dir.s (1350 of 1785) PASS: lldb-unit :: Utility/./UtilityTests/StringListTest.SplitIntoLinesSingleTrailingCR (1351 of 1785) PASS: lldb-api :: lang/cpp/template/TestTemplateArgs.py (1352 of 1785) PASS: lldb-api :: functionalities/thread/thread_specific_break/TestThreadSpecificBreakpoint.py (1353 of 1785) PASS: lldb-api :: functionalities/breakpoint/debugbreak/TestDebugBreak.py (1354 of 1785) PASS: lldb-shell :: SymbolFile/Breakpad/unwind-via-stack-win.test (1355 of 1785) PASS: lldb-api :: lang/cpp/dynamic-value/TestDynamicValue.py (1356 of 1785) PASS: lldb-api :: functionalities/gdb_remote_client/TestStopPCs.py (1357 of 1785) PASS: lldb-api :: functionalities/breakpoint/breakpoint_conditions/TestBreakpointConditions.py (1358 of 1785) PASS: lldb-unit :: Process/minidump/./LLDBMinidumpTests/MinidumpParserTest.GetPid (1359 of 1785) PASS: lldb-shell :: ObjectFile/ELF/short-build-id.yaml (1360 of 1785) UNSUPPORTED: lldb-api :: benchmarks/stepping/TestSteppingSpeed.py (1361 of 1785) PASS: lldb-unit :: Utility/./UtilityTests/FileSpecTest.FileAndDirectoryComponents (1362 of 1785) PASS: lldb-unit :: Symbol/./SymbolTests/TestClangASTContext.TemplateArguments (1363 of 1785) PASS: lldb-api :: functionalities/breakpoint/global_constructor/TestBreakpointInGlobalConstructor.py (1364 of 1785) PASS: lldb-api :: functionalities/postmortem/mach-core/TestMachCore.py (1365 of 1785) PASS: lldb-api :: commands/help/TestHelp.py (1366 of 1785) PASS: lldb-api :: lang/cpp/this/TestCPPThis.py (1367 of 1785) PASS: lldb-unit :: Utility/./UtilityTests/AnsiTerminal.Unknown (1368 of 1785) PASS: lldb-api :: functionalities/backticks/TestBackticksWithoutATarget.py (1369 of 1785) PASS: lldb-api :: commands/expression/import-std-module/list-basic/TestBasicList.py (1370 of 1785) PASS: lldb-unit :: Utility/./UtilityTests/CompletionRequest.FakeLastArg (1371 of 1785) PASS: lldb-api :: lang/cpp/extern_c/TestExternCSymbols.py (1372 of 1785) PASS: lldb-unit :: Utility/./UtilityTests/VMRange.ContainsAddr (1373 of 1785) PASS: lldb-api :: functionalities/thread/exit_during_step/TestExitDuringStep.py (1374 of 1785) PASS: lldb-unit :: Utility/./UtilityTests/StringExtractorTest.GetU32LittleEndian (1375 of 1785) PASS: lldb-unit :: Utility/./UtilityTests/TimerTest.CategoryTimesNested (1376 of 1785) PASS: lldb-unit :: Utility/./UtilityTests/StringExtractorTest.GetHexU8_Underflow2 (1377 of 1785) PASS: lldb-shell :: SymbolFile/Breakpad/line-table-edgecases.test (1378 of 1785) PASS: lldb-unit :: Symbol/./SymbolTests/PostfixExpression.ParseFPOProgram (1379 of 1785) PASS: lldb-shell :: ObjectFile/PECOFF/export-dllfunc.yaml (1380 of 1785) PASS: lldb-shell :: Reproducer/TestDump.test (1381 of 1785) PASS: lldb-unit :: Host/./HostTests/MainLoopTest.TerminatesImmediately (1382 of 1785) PASS: lldb-api :: functionalities/breakpoint/objc/TestObjCBreakpoints.py (1383 of 1785) PASS: lldb-unit :: Utility/./UtilityTests/StringExtractorTest.GetNameColonValueContainsColon (1384 of 1785) PASS: lldb-shell :: Breakpoint/debug_addrx.test (1385 of 1785) PASS: lldb-unit :: Utility/./UtilityTests/StringExtractorTest.GetHexBytes (1386 of 1785) PASS: lldb-api :: macosx/version_zero/TestGetVersionZeroVersion.py (1387 of 1785) PASS: lldb-unit :: UnwindAssembly/x86/./UnwindAssemblyx86Tests/Testx86AssemblyInspectionEngine.TestSimple64bitFrameFunction (1388 of 1785) PASS: lldb-api :: functionalities/thread/crash_during_step/TestCrashDuringStep.py (1389 of 1785) PASS: lldb-unit :: Utility/./UtilityTests/RecordReplayTest.InstrumentedBar (1390 of 1785) PASS: lldb-unit :: Utility/./UtilityTests/StructuredDataTest.StringDump (1391 of 1785) PASS: lldb-unit :: Utility/./UtilityTests/StatusTest.ErrorConversion (1392 of 1785) PASS: lldb-api :: commands/process/launch/TestProcessLaunch.py (1393 of 1785) UNSUPPORTED: lldb-shell :: Register/x86-gp-read.test (1394 of 1785) PASS: lldb-api :: lang/c/local_types/TestUseClosestType.py (1395 of 1785) PASS: lldb-api :: python_api/class_members/TestSBTypeClassMembers.py (1396 of 1785) PASS: lldb-unit :: Host/./HostTests/TaskPoolTest.RunTasks (1397 of 1785) PASS: lldb-unit :: Process/minidump/./LLDBMinidumpTests/MinidumpParserTest.GetLinuxProcStatus_no_stream (1398 of 1785) PASS: lldb-api :: functionalities/tsan/thread_numbers/TestTsanThreadNumbers.py (1399 of 1785) UNSUPPORTED: lldb-api :: benchmarks/libcxxmap/TestBenchmarkLibcxxMap.py (1400 of 1785) PASS: lldb-shell :: SymbolFile/DWARF/dir-separator-no-comp-dir-relative-name.s (1401 of 1785) PASS: lldb-unit :: Utility/./UtilityTests/CompletionRequest.ShiftArguments (1402 of 1785) UNSUPPORTED: lldb-shell :: Process/Windows/exception_access_violation.cpp (1403 of 1785) PASS: lldb-api :: functionalities/breakpoint/breakpoint_by_line_and_column/TestBreakpointByLineAndColumn.py (1404 of 1785) PASS: lldb-api :: sanity/TestModuleCacheSanity.py (1405 of 1785) PASS: lldb-api :: lang/c/anonymous/TestAnonymous.py (1406 of 1785) PASS: lldb-unit :: Utility/./UtilityTests/RegularExpression.Valid (1407 of 1785) PASS: lldb-api :: lang/c/step-target/TestStepTarget.py (1408 of 1785) PASS: lldb-unit :: Symbol/./SymbolTests/PostfixExpression.ToDWARF (1409 of 1785) PASS: lldb-api :: functionalities/breakpoint/scripted_bkpt/TestScriptedResolver.py (1410 of 1785) PASS: lldb-api :: functionalities/data-formatter/nsarraysynth/TestNSArraySynthetic.py (1411 of 1785) PASS: lldb-api :: commands/expression/import-std-module/sysroot/TestStdModuleSysroot.py (1412 of 1785) PASS: lldb-unit :: Interpreter/./InterpreterTests/CompletionTest.DirCompletionUsername (1413 of 1785) PASS: lldb-api :: functionalities/load_unload/TestLoadUnload.py (1414 of 1785) PASS: lldb-unit :: Host/./HostTests/SocketAddressTest.Set (1415 of 1785) PASS: lldb-unit :: ScriptInterpreter/Python/./ScriptInterpreterPythonTests/PythonDataObjectsTest.TestModuleNameResolutionNoDot (1416 of 1785) PASS: lldb-api :: functionalities/modern-type-lookup/basic/TestBasicModernTypeLookup.py (1417 of 1785) PASS: lldb-unit :: Host/./HostTests/Host.GetEnvironment (1418 of 1785) PASS: lldb-unit :: Utility/./UtilityTests/LogTest.Unregister (1419 of 1785) PASS: lldb-api :: functionalities/data-formatter/setvaluefromcstring/TestSetValueFromCString.py (1420 of 1785) PASS: lldb-unit :: ObjectFile/PECOFF/./ObjectFilePECOFFTests/PECallFrameInfoTest.Frame_reg_eh (1421 of 1785) PASS: lldb-unit :: Utility/./UtilityTests/StatusTest.ErrorConstructor (1422 of 1785) PASS: lldb-unit :: Utility/./UtilityTests/ArgsTest.TestUnknownEscape (1423 of 1785) PASS: lldb-unit :: Expression/./ExpressionTests/DiagnosticManagerTest.PutString (1424 of 1785) PASS: lldb-api :: commands/settings/quoting/TestQuoting.py (1425 of 1785) PASS: lldb-api :: commands/expression/persistent_types/TestNestedPersistentTypes.py (1426 of 1785) UNSUPPORTED: lldb-shell :: Register/x86-ymm-write.test (1427 of 1785) PASS: lldb-api :: lang/c/register_variables/TestRegisterVariables.py (1428 of 1785) PASS: lldb-api :: functionalities/thread/concurrent_events/TestConcurrentDelayedCrashWithBreakpointSignal.py (1429 of 1785) PASS: lldb-api :: commands/expression/pr35310/TestExprsBug35310.py (1430 of 1785) PASS: lldb-unit :: Utility/./UtilityTests/Flags.AllClear (1431 of 1785) PASS: lldb-unit :: ScriptInterpreter/Python/./ScriptInterpreterPythonTests/PythonDataObjectsTest.TestResetting (1432 of 1785) PASS: lldb-api :: functionalities/inferior-crashing/recursive-inferior/TestRecursiveInferiorStep.py (1433 of 1785) PASS: lldb-shell :: ObjectFile/PECOFF/basic-info-arm64.yaml (1434 of 1785) PASS: lldb-shell :: ObjectFile/ELF/duplicate-section.yaml (1435 of 1785) PASS: lldb-api :: commands/watchpoints/multiple_hits/TestMultipleHits.py (1436 of 1785) PASS: lldb-unit :: Process/gdb-remote/./ProcessGdbRemoteTests/GDBRemoteCommunicationClientTest.SendGetDataPacket (1437 of 1785) PASS: lldb-unit :: Utility/./UtilityTests/Flags.AnySet (1438 of 1785) PASS: lldb-unit :: Utility/./UtilityTests/StreamTest.ShiftOperatorPtr (1439 of 1785) PASS: lldb-api :: lang/cpp/class_types/TestClassTypesDisassembly.py (1440 of 1785) PASS: lldb-api :: commands/watchpoints/watchpoint_size/TestWatchpointSizes.py (1441 of 1785) PASS: lldb-unit :: Utility/./UtilityTests/DataExtractorTest.GetCStr (1442 of 1785) PASS: lldb-shell :: Driver/TestCommands.test (1443 of 1785) PASS: lldb-unit :: Process/minidump/./LLDBMinidumpTests/MinidumpParserTest.GetArchitecture (1444 of 1785) PASS: lldb-api :: functionalities/breakpoint/breakpoint_hit_count/TestBreakpointHitCount.py (1445 of 1785) PASS: lldb-unit :: Process/minidump/./LLDBMinidumpTests/MinidumpParserTest.GetMiscInfoWindows (1446 of 1785) PASS: lldb-api :: functionalities/thread/jump/TestThreadJump.py (1447 of 1785) PASS: lldb-api :: lang/objcxx/hide-runtime-values/TestObjCXXHideRuntimeValues.py (1448 of 1785) PASS: lldb-unit :: Utility/./UtilityTests/ConstStringTest.MangledCounterpart (1449 of 1785) PASS: lldb-unit :: Utility/./UtilityTests/StringListTest.InsertStringAtIndexStart (1450 of 1785) PASS: lldb-unit :: Symbol/./SymbolTests/TestClangASTContext.TestRecordHasFields (1451 of 1785) PASS: lldb-unit :: Utility/./UtilityTests/BinaryStreamTest.PutSLEB128One (1452 of 1785) PASS: lldb-shell :: Host/TestCustomShell.test (1453 of 1785) PASS: lldb-unit :: Host/./HostTests/FileActionTest.Open (1454 of 1785) PASS: lldb-unit :: Host/./HostTests/MainLoopTest.DetectsEOF (1455 of 1785) PASS: lldb-api :: lang/cpp/dynamic-value/TestCppValueCast.py (1456 of 1785) PASS: lldb-unit :: Utility/./UtilityTests/StreamTest.PutMaxHex64ByteOrderLittle (1457 of 1785) PASS: lldb-api :: functionalities/data-formatter/data-formatter-stl/libcxx/unordered/TestDataFormatterUnordered.py (1458 of 1785) PASS: lldb-api :: functionalities/ubsan/basic/TestUbsanBasic.py (1459 of 1785) PASS: lldb-unit :: Utility/./UtilityTests/StringExtractorTest.InitEmpty (1460 of 1785) PASS: lldb-api :: lang/c/conflicting-symbol/TestConflictingSymbol.py (1461 of 1785) PASS: lldb-unit :: Utility/./UtilityTests/UriParserTest.Empty (1462 of 1785) PASS: lldb-unit :: ScriptInterpreter/Python/./ScriptInterpreterPythonTests/PythonExceptionStateTest.TestDiscardSemantics (1463 of 1785) PASS: lldb-unit :: Utility/./UtilityTests/RangeTest.ContainsAddrInvalid (1464 of 1785) PASS: lldb-unit :: Utility/./UtilityTests/StringExtractorTest.DecodeHexU8_Underflow (1465 of 1785) PASS: lldb-unit :: Utility/./UtilityTests/StringListTest.ForRange (1466 of 1785) UNSUPPORTED: lldb-shell :: SymbolFile/PDB/expressions.test (1467 of 1785) PASS: lldb-unit :: Utility/./UtilityTests/ArchSpecTest.TripleComponentsWereSpecified (1468 of 1785) PASS: lldb-shell :: SymbolFile/DWARF/find-basic-variable.cpp (1469 of 1785) UNSUPPORTED: lldb-api :: commands/watchpoints/multi_watchpoint_slots/TestWatchpointMultipleSlots.py (1470 of 1785) PASS: lldb-shell :: Commands/CommandScriptImmediateOutput/CommandScriptImmediateOutputFile.test (1471 of 1785) PASS: lldb-api :: functionalities/thread/concurrent_events/TestConcurrentSignalDelayBreak.py (1472 of 1785) PASS: lldb-unit :: Host/./HostTests/SocketTest.TCPListen0ConnectAccept (1473 of 1785) PASS: lldb-api :: functionalities/ubsan/user-expression/TestUbsanUserExpression.py (1474 of 1785) PASS: lldb-unit :: Expression/./ExpressionTests/DiagnosticManagerTest.FixedExpression (1475 of 1785) PASS: lldb-api :: lang/objc/blocks/TestObjCIvarsInBlocks.py (1476 of 1785) PASS: lldb-api :: functionalities/data-formatter/data-formatter-objc/TestDataFormatterObjCNSBundle.py (1477 of 1785) PASS: lldb-unit :: Utility/./UtilityTests/ArgsTest.GetArgumentArrayRef (1478 of 1785) PASS: lldb-api :: commands/reproducer/invalid-args/TestInvalidArgsReproducer.py (1479 of 1785) PASS: lldb-api :: functionalities/thread/concurrent_events/TestConcurrentDelayedCrashWithBreakpointWatchpoint.py (1480 of 1785) PASS: lldb-unit :: Utility/./UtilityTests/StringLexerTest.Next (1481 of 1785) PASS: lldb-unit :: UnwindAssembly/x86/./UnwindAssemblyx86Tests/Testx86AssemblyInspectionEngine.TestSpArithx86_64Augmented (1482 of 1785) PASS: lldb-unit :: Process/gdb-remote/./ProcessGdbRemoteTests/GDBRemoteCommunicationClientTest.SendStartTracePacket (1483 of 1785) PASS: lldb-unit :: Utility/./UtilityTests/IndexToObjectTest.ObjectForIndex (1484 of 1785) PASS: lldb-unit :: Core/./LLDBCoreTests/MangledTest.ResultForValidName (1485 of 1785) PASS: lldb-unit :: Utility/./UtilityTests/StreamTest.PutHex32ByteOrderLittle (1486 of 1785) PASS: lldb-shell :: SymbolFile/DWARF/debug-types-line-tables.s (1487 of 1785) PASS: lldb-api :: lang/objc/objc-new-syntax/TestObjCNewSyntaxArray.py (1488 of 1785) PASS: lldb-unit :: Utility/./UtilityTests/StringExtractorTest.GetHexBytesAvail_OddPair2 (1489 of 1785) PASS: lldb-shell :: Settings/TestDisassemblyFormat.test (1490 of 1785) PASS: lldb-unit :: Utility/./UtilityTests/StringListTest.AppendListCStringArrayEmpty (1491 of 1785) PASS: lldb-unit :: Utility/./UtilityTests/VMRange.Ordering (1492 of 1785) PASS: lldb-api :: functionalities/data-formatter/data-formatter-stl/libcxx/queue/TestDataFormatterLibcxxQueue.py (1493 of 1785) PASS: lldb-api :: functionalities/modern-type-lookup/objc-modules/TestObjModulesModernTypeLookup.py (1494 of 1785) PASS: lldb-api :: lang/cpp/unsigned_types/TestUnsignedTypes.py (1495 of 1785) PASS: lldb-shell :: Quit/TestQuitExitCode0.test (1496 of 1785) PASS: lldb-api :: commands/expression/po_verbosity/TestPoVerbosity.py (1497 of 1785) PASS: lldb-unit :: Utility/./UtilityTests/StringExtractorTest.GetHexBytesAvail_Partial (1498 of 1785) PASS: lldb-api :: python_api/formatters/TestFormattersSBAPI.py (1499 of 1785) PASS: lldb-shell :: SymbolFile/Breakpad/stack-cfi-parsing.test (1500 of 1785) UNSUPPORTED: lldb-api :: lang/objc/rdar-12408181/TestRdar12408181.py (1501 of 1785) PASS: lldb-api :: functionalities/data-formatter/data-formatter-stl/libcxx/variant/TestDataFormatterLibcxxVariant.py (1502 of 1785) PASS: lldb-unit :: Host/./HostTests/FileSystemTest.FileAndDirectoryComponents (1503 of 1785) PASS: lldb-unit :: Utility/./UtilityTests/StringListTest.GetMaxStringLengthEqualSize (1504 of 1785) PASS: lldb-api :: tools/lldb-server/TestGdbRemote_vCont.py (1505 of 1785) PASS: lldb-api :: functionalities/tail_call_frames/thread_step_out_or_return/TestSteppingOutWithArtificialFrames.py (1506 of 1785) PASS: lldb-shell :: Minidump/disassemble-no-module.yaml (1507 of 1785) PASS: lldb-api :: lang/objc/rdar-10967107/TestRdar10967107.py (1508 of 1785) PASS: lldb-unit :: UnwindAssembly/x86/./UnwindAssemblyx86Tests/Testx86AssemblyInspectionEngine.TestDisassemblyMidFunctionEpilogues (1509 of 1785) PASS: lldb-api :: functionalities/data-formatter/varscript_formatting/TestDataFormatterVarScriptFormatting.py (1510 of 1785) PASS: lldb-api :: commands/expression/scoped_enums/TestScopedEnumType.py (1511 of 1785) PASS: lldb-api :: functionalities/object-file/TestImageListMultiArchitecture.py (1512 of 1785) UNSUPPORTED: lldb-api :: functionalities/unwind/standard/TestStandardUnwind.py (1513 of 1785) PASS: lldb-shell :: SymbolFile/NativePDB/bitfields.cpp (1514 of 1785) PASS: lldb-api :: commands/expression/ir-interpreter-phi-nodes/TestIRInterpreterPHINodes.py (1515 of 1785) PASS: lldb-unit :: Utility/./UtilityTests/SerializationRountripTest.SerializeDeserializeObjectPointer (1516 of 1785) PASS: lldb-api :: tools/lldb-server/TestGdbRemote_qThreadStopInfo.py (1517 of 1785) PASS: lldb-unit :: Utility/./UtilityTests/BinaryStreamTest.PutULEB128FourBytes (1518 of 1785) PASS: lldb-shell :: SymbolFile/NativePDB/globals-bss.cpp (1519 of 1785) PASS: lldb-unit :: ScriptInterpreter/Python/./ScriptInterpreterPythonTests/PythonDataObjectsTest.TestPythonFile (1520 of 1785) PASS: lldb-unit :: Language/Highlighting/./HighlighterTests/HighlighterTest.ClangCursorOutOfBounds (1521 of 1785) PASS: lldb-unit :: Utility/./UtilityTests/RangeTest.Union (1522 of 1785) PASS: lldb-unit :: Utility/./UtilityTests/StringExtractorTest.GetNameColonValueSuccess (1523 of 1785) PASS: lldb-api :: functionalities/value_md5_crash/TestValueMD5Crash.py (1524 of 1785) PASS: lldb-shell :: Settings/TestModuleCacheSanity.test (1525 of 1785) PASS: lldb-unit :: Process/gdb-remote/./ProcessGdbRemoteTests/GDBRemoteCommunicationServerTest.SendErrorResponse_ErrorNumber (1526 of 1785) PASS: lldb-unit :: Host/./HostTests/SocketTest.TCPGetAddress (1527 of 1785) PASS: lldb-unit :: Process/gdb-remote/./ProcessGdbRemoteTests/GDBRemoteCommunicationClientTest.ReadRegister (1528 of 1785) PASS: lldb-unit :: Host/./HostTests/NativeProcessProtocolTest.ReadCStringFromMemory (1529 of 1785) PASS: lldb-api :: lang/objc/rdar-11355592/TestRdar11355592.py (1530 of 1785) PASS: lldb-unit :: Utility/./UtilityTests/NameMatchesTest.StartsWith (1531 of 1785) PASS: lldb-unit :: Utility/./UtilityTests/StringListTest.Assignment (1532 of 1785) PASS: lldb-api :: functionalities/thread/concurrent_events/TestConcurrentSignalDelayWatch.py (1533 of 1785) PASS: lldb-api :: lang/objc/foundation/TestObjCMethodsNSError.py (1534 of 1785) PASS: lldb-api :: commands/expression/completion-in-lambda-and-unnnamed-class/TestCompletionInLambdaAndUnnamedClass.py (1535 of 1785) PASS: lldb-api :: lang/c/shared_lib_stripped_symbols/TestSharedLibStrippedSymbols.py (1536 of 1785) PASS: lldb-api :: functionalities/tsan/basic/TestTsanBasic.py (1537 of 1785) PASS: lldb-unit :: UnwindAssembly/x86/./UnwindAssemblyx86Tests/Testx86AssemblyInspectionEngine.TestDisassemblyJunkBytes (1538 of 1785) PASS: lldb-api :: lang/objc/conflicting-definition/TestConflictingDefinition.py (1539 of 1785) PASS: lldb-api :: lang/cpp/accelerator-table/TestCPPAccelerator.py (1540 of 1785) PASS: lldb-shell :: BuildScript/script-args.test (1541 of 1785) PASS: lldb-api :: functionalities/data-formatter/data-formatter-stl/libcxx/initializerlist/TestInitializerList.py (1542 of 1785) PASS: lldb-api :: commands/expression/import-std-module/vector-dbg-info-content/TestDbgInfoContentVector.py (1543 of 1785) PASS: lldb-unit :: Utility/./UtilityTests/StreamTest.PutHex16ByteOrderBig (1544 of 1785) PASS: lldb-shell :: Minidump/Windows/Sigsegv/sigsegv.test (1545 of 1785) PASS: lldb-unit :: Utility/./UtilityTests/StringExtractorTest.GetHexU8_Underflow2_NoEof (1546 of 1785) PASS: lldb-api :: lang/cpp/global_operators/TestCppGlobalOperators.py (1547 of 1785) PASS: lldb-shell :: SymbolFile/DWARF/debug-types-dwarf5.s (1548 of 1785) PASS: lldb-unit :: Utility/./UtilityTests/BinaryStreamTest.PutULEB128MaxValue (1549 of 1785) PASS: lldb-api :: tools/lldb-server/TestGdbRemoteExpeditedRegisters.py (1550 of 1785) PASS: lldb-api :: lang/cpp/offsetof/TestOffsetofCpp.py (1551 of 1785) PASS: lldb-api :: python_api/default-constructor/TestDefaultConstructorForAPIObjects.py (1552 of 1785) PASS: lldb-unit :: ScriptInterpreter/Python/./ScriptInterpreterPythonTests/PythonDataObjectsTest.TestOwnedReferences (1553 of 1785) UNSUPPORTED: lldb-shell :: SymbolFile/NativePDB/local-variables.cpp (1554 of 1785) PASS: lldb-unit :: Utility/./UtilityTests/RangeTest.ContainsRange (1555 of 1785) UNSUPPORTED: lldb-api :: functionalities/unwind/ehframe/TestEhFrameUnwind.py (1556 of 1785) PASS: lldb-unit :: Utility/./UtilityTests/StringLexerTest.GetUnlexed (1557 of 1785) PASS: lldb-api :: functionalities/inferior-assert/TestInferiorAssert.py (1558 of 1785) PASS: lldb-unit :: Utility/./UtilityTests/StringListTest.SplitIntoLinesEmpty (1559 of 1785) PASS: lldb-unit :: Language/Highlighting/./HighlighterTests/HighlighterTest.ClangScalarLiterals (1560 of 1785) PASS: lldb-unit :: Utility/./UtilityTests/StreamTest.QuotedCString (1561 of 1785) PASS: lldb-api :: commands/disassemble/basic/TestDisassembleBreakpoint.py (1562 of 1785) UNSUPPORTED: lldb-api :: benchmarks/startup/TestStartupDelays.py (1563 of 1785) PASS: lldb-api :: python_api/frame/inlines/TestInlinedFrame.py (1564 of 1785) UNSUPPORTED: lldb-api :: arm/breakpoint-thumb-codesection/TestBreakpointThumbCodesection.py (1565 of 1785) PASS: lldb-unit :: Utility/./UtilityTests/NameMatchesTest.EndsWith (1566 of 1785) PASS: lldb-api :: functionalities/data-formatter/data-formatter-objc/TestDataFormatterObjCNSError.py (1567 of 1785) PASS: lldb-api :: functionalities/data-formatter/data-formatter-script/TestDataFormatterScript.py (1568 of 1785) PASS: lldb-api :: sample_test/TestSampleTest.py (1569 of 1785) PASS: lldb-unit :: Symbol/./SymbolTests/SymbolsTest.LocateExecutableSymbolFileForUnknownExecutableAndMissingSymbolFile (1570 of 1785) PASS: lldb-shell :: SymbolFile/DWARF/dwarf5-partial-index.cpp (1571 of 1785) PASS: lldb-unit :: SymbolFile/NativePDB/./SymbolFileNativePDBTests/PDBFPOProgramToDWARFExpressionTests.InvalidAssignmentMultiple (1572 of 1785) PASS: lldb-api :: lang/objc/radar-9691614/TestObjCMethodReturningBOOL.py (1573 of 1785) PASS: lldb-api :: functionalities/unwind/noreturn/module-end/TestNoReturnModuleEnd.py (1574 of 1785) UNSUPPORTED: lldb-api :: linux/thread/create_during_instruction_step/TestCreateDuringInstructionStep.py (1575 of 1785) PASS: lldb-unit :: Process/gdb-remote/./ProcessGdbRemoteTests/GDBRemoteCommunicationClientTest.GetModulesInfoInvalidResponse (1576 of 1785) PASS: lldb-unit :: Utility/./UtilityTests/StreamTeeTest.CopyConstructor (1577 of 1785) PASS: lldb-api :: functionalities/data-formatter/data-formatter-stl/libcxx/vbool/TestDataFormatterLibcxxVBool.py (1578 of 1785) UNSUPPORTED: lldb-api :: functionalities/darwin_log/filter/regex/category/TestDarwinLogFilterRegexCategory.py (1579 of 1785) PASS: lldb-unit :: Utility/./UtilityTests/StringExtractorTest.DecodeHexU8_Extra (1580 of 1785) PASS: lldb-unit :: Process/minidump/./LLDBMinidumpTests/MinidumpParserTest.GetThreadContext_x86_32 (1581 of 1785) PASS: lldb-api :: functionalities/step_scripted/TestStepScripted.py (1582 of 1785) PASS: lldb-api :: commands/process/launch-with-shellexpand/TestLaunchWithShellExpand.py (1583 of 1785) PASS: lldb-api :: commands/command/script_alias/TestCommandScriptAlias.py (1584 of 1785) PASS: lldb-shell :: Reproducer/Functionalities/TestImageList.test (1585 of 1785) PASS: lldb-unit :: Utility/./UtilityTests/ArgsTest.StringListConstructor (1586 of 1785) PASS: lldb-unit :: Utility/./UtilityTests/BroadcasterTest.EventTypeHasListeners (1587 of 1785) PASS: lldb-api :: functionalities/thread/step_out/TestThreadStepOut.py (1588 of 1785) PASS: lldb-unit :: Utility/./UtilityTests/OptionsWithRawTest.EmptySuffix (1589 of 1785) PASS: lldb-unit :: Process/minidump/./LLDBMinidumpTests/MinidumpParserTest.GetArchitectureWindows (1590 of 1785) UNSUPPORTED: lldb-api :: functionalities/darwin_log/filter/regex/activity-chain/TestDarwinLogFilterRegexActivityChain.py (1591 of 1785) PASS: lldb-unit :: ScriptInterpreter/Python/./ScriptInterpreterPythonTests/PythonDataObjectsTest.TestPythonTupleSize (1592 of 1785) PASS: lldb-unit :: Utility/./UtilityTests/ScalarTest.GetValue (1593 of 1785) PASS: lldb-unit :: Language/CPlusPlus/./LanguageCPlusPlusTests/CPlusPlusLanguage.MethodNameParsing (1594 of 1785) PASS: lldb-api :: commands/gui/invalid-args/TestInvalidArgsGui.py (1595 of 1785) UNSUPPORTED: lldb-shell :: SymbolFile/PDB/udt-layout.test (1596 of 1785) PASS: lldb-api :: functionalities/stats_api/TestStatisticsAPI.py (1597 of 1785) PASS: lldb-api :: functionalities/tsan/thread_leak/TestTsanThreadLeak.py (1598 of 1785) PASS: lldb-api :: commands/expression/import-std-module/shared_ptr-dbg-info-content/TestSharedPtrDbgInfoContent.py (1599 of 1785) PASS: lldb-shell :: ObjectFile/ELF/PT_LOAD.yaml (1600 of 1785) PASS: lldb-shell :: SymbolFile/NativePDB/ast-methods.cpp (1601 of 1785) PASS: lldb-api :: functionalities/non-overlapping-index-variable-i/TestIndexVariable.py (1602 of 1785) PASS: lldb-api :: api/command-return-object/TestSBCommandReturnObject.py (1603 of 1785) PASS: lldb-api :: commands/expression/diagnostics/TestExprDiagnostics.py (1604 of 1785) UNSUPPORTED: lldb-shell :: SymbolFile/NativePDB/ast-functions-msvc.cpp (1605 of 1785) PASS: lldb-api :: lang/objc/objc-dyn-sbtype/TestObjCDynamicSBType.py (1606 of 1785) PASS: lldb-unit :: Utility/./UtilityTests/LogChannelTest.Disable (1607 of 1785) PASS: lldb-api :: functionalities/data-formatter/data-formatter-stl/libcxx/string/TestDataFormatterLibcxxString.py (1608 of 1785) PASS: lldb-unit :: Utility/./UtilityTests/BinaryStreamTest.PutULEB128NineBytes (1609 of 1785) UNSUPPORTED: lldb-shell :: Unwind/eh-frame-small-fde.test (1610 of 1785) PASS: lldb-api :: functionalities/data-formatter/data-formatter-synthval/TestDataFormatterSynthVal.py (1611 of 1785) PASS: lldb-unit :: Utility/./UtilityTests/ArgsTest.TestMultipleArgs (1612 of 1785) PASS: lldb-api :: functionalities/breakpoint/source_regexp/TestSourceRegexBreakpoints.py (1613 of 1785) PASS: lldb-unit :: SymbolFile/DWARF/./SymbolFileDWARFTests/SymbolFileDWARFTests.TestAbbrevNullAttrValidForm (1614 of 1785) PASS: lldb-api :: functionalities/breakpoint/auto_continue/TestBreakpointAutoContinue.py (1615 of 1785) PASS: lldb-unit :: Utility/./UtilityTests/StructuredDataTest.ParseJSONFromFile (1616 of 1785) PASS: lldb-unit :: Utility/./UtilityTests/VMRange.SetEndAddress (1617 of 1785) PASS: lldb-api :: lang/cpp/rvalue-references/TestRvalueReferences.py (1618 of 1785) PASS: lldb-unit :: Utility/./UtilityTests/BinaryStreamTest.PutSLEB128NineBytes (1619 of 1785) PASS: lldb-api :: commands/expression/import-std-module/forward_list-basic/TestBasicForwardList.py (1620 of 1785) PASS: lldb-unit :: Utility/./UtilityTests/StringListTest.JoinMultiCharSeparator (1621 of 1785) PASS: lldb-unit :: Utility/./UtilityTests/FileSpecTest.PrependPathComponent (1622 of 1785) PASS: lldb-unit :: Utility/./UtilityTests/StreamTest.PutRawBytesToLittleEndian (1623 of 1785) PASS: lldb-unit :: UnwindAssembly/x86/./UnwindAssemblyx86Tests/Testx86AssemblyInspectionEngine.TestPopEDI (1624 of 1785) PASS: lldb-shell :: Register/x86-64-read.test (1625 of 1785) PASS: lldb-unit :: SymbolFile/NativePDB/./SymbolFileNativePDBTests/PDBFPOProgramToDWARFExpressionTests.DependencyChain (1626 of 1785) PASS: lldb-shell :: ObjectFile/Breakpad/sections.test (1627 of 1785) PASS: lldb-unit :: Symbol/./SymbolTests/Type.GetTypeScopeAndBasename (1628 of 1785) PASS: lldb-unit :: Utility/./UtilityTests/ProcessInstanceInfo.DumpTable (1629 of 1785) PASS: lldb-api :: lang/c/vla/TestVLA.py (1630 of 1785) PASS: lldb-shell :: SymbolFile/DWARF/split-dwarf-inlining.cpp (1631 of 1785) PASS: lldb-unit :: Utility/./UtilityTests/UriParserTest.BracketedHostname (1632 of 1785) UNSUPPORTED: lldb-shell :: SymbolFile/PDB/compilands.test (1633 of 1785) PASS: lldb-unit :: Utility/./UtilityTests/UriParserTest.MinimalPath (1634 of 1785) PASS: lldb-api :: functionalities/breakpoint/breakpoint_options/TestBreakpointOptions.py (1635 of 1785) PASS: lldb-api :: functionalities/data-formatter/data-formatter-ptr-to-array/TestPtrToArrayFormatting.py (1636 of 1785) PASS: lldb-unit :: Utility/./UtilityTests/StringListTest.RemoveBlankLines (1637 of 1785) PASS: lldb-shell :: BuildScript/toolchain-clang.test (1638 of 1785) PASS: lldb-api :: functionalities/dead-strip/TestDeadStrip.py (1639 of 1785) PASS: lldb-shell :: Commands/command-script-import.test (1640 of 1785) PASS: lldb-shell :: ObjectFile/MachO/symtab.yaml (1641 of 1785) PASS: lldb-unit :: Process/gdb-remote/./ProcessGdbRemoteTests/GDBRemoteCommunicationClientTest.WriteRegisterNoSuffix (1642 of 1785) PASS: lldb-unit :: Symbol/./SymbolTests/LineEntryTest.GetSameLineContiguousAddressRangeOneInline (1643 of 1785) PASS: lldb-unit :: UnwindAssembly/x86/./UnwindAssemblyx86Tests/Testx86AssemblyInspectionEngine.TestLEAVE (1644 of 1785) PASS: lldb-api :: lang/cpp/unique-types/TestUniqueTypes.py (1645 of 1785) PASS: lldb-unit :: Language/Highlighting/./HighlighterTests/HighlighterTest.ClangEmptyInput (1646 of 1785) PASS: lldb-shell :: Expr/TestTypeOfDeclTypeExpr.test (1647 of 1785) UNSUPPORTED: lldb-api :: api/multiple-debuggers/TestMultipleDebuggers.py (1648 of 1785) PASS: lldb-shell :: Breakpoint/split-dwarf5-debug-stroffsets.test (1649 of 1785) PASS: lldb-unit :: Utility/./UtilityTests/BinaryStreamTest.PutSLEB128EightBytes (1650 of 1785) PASS: lldb-unit :: Utility/./UtilityTests/ConstStringTest.format_provider (1651 of 1785) PASS: lldb-unit :: Utility/./UtilityTests/StringListTest.LongestCommonPrefixSingleElement (1652 of 1785) PASS: lldb-unit :: Utility/./UtilityTests/StreamTest.PutBytesAsRawHex8ToMixedEndian (1653 of 1785) PASS: lldb-unit :: Process/minidump/./LLDBMinidumpTests/MinidumpParserTest.GetMemoryRegionInfoFromMemory64List (1654 of 1785) PASS: lldb-api :: functionalities/data-formatter/data-formatter-stl/libcxx/iterator/TestDataFormatterLibccIterator.py (1655 of 1785) PASS: lldb-unit :: Utility/./UtilityTests/StringListTest.InsertStringAtIndexStdString (1656 of 1785) PASS: lldb-unit :: UnwindAssembly/x86/./UnwindAssemblyx86Tests/Testx86AssemblyInspectionEngine.TestPushRBP (1657 of 1785) PASS: lldb-unit :: Utility/./UtilityTests/VASprintfTest.EncodingError (1658 of 1785) PASS: lldb-unit :: Core/./LLDBCoreTests/RichManglingContextTest.IPDRealloc (1659 of 1785) PASS: lldb-api :: functionalities/memory/cache/TestMemoryCache.py (1660 of 1785) PASS: lldb-unit :: Utility/./UtilityTests/ArgsTest.ReplaceArgumentAtIndexEqual (1661 of 1785) PASS: lldb-unit :: UnwindAssembly/x86/./UnwindAssemblyx86Tests/Testx86AssemblyInspectionEngine.TestReturnDetect (1662 of 1785) PASS: lldb-unit :: UnwindAssembly/x86/./UnwindAssemblyx86Tests/Testx86AssemblyInspectionEngine.Test64bitFramelessBigStackFrame (1663 of 1785) PASS: lldb-api :: api/log/TestAPILog.py (1664 of 1785) PASS: lldb-api :: macosx/safe-to-func-call/TestSafeFuncCalls.py (1665 of 1785) PASS: lldb-api :: lang/objc/modules-auto-import/TestModulesAutoImport.py (1666 of 1785) PASS: lldb-api :: functionalities/thread/concurrent_events/TestConcurrentWatchpointDelayWatchpointOneBreakpoint.py (1667 of 1785) PASS: lldb-api :: commands/watchpoints/watchpoint_commands/command/TestWatchpointCommandLLDB.py (1668 of 1785) PASS: lldb-unit :: Utility/./UtilityTests/Flags.Test (1669 of 1785) PASS: lldb-unit :: Utility/./UtilityTests/StringExtractorTest.GetHexU8_Exact (1670 of 1785) PASS: lldb-unit :: Utility/./UtilityTests/RangeDataVector.FindEntryThatContains_Overlap (1671 of 1785) PASS: lldb-unit :: Utility/./UtilityTests/Flags.GetBitSize (1672 of 1785) PASS: lldb-unit :: SymbolFile/NativePDB/./SymbolFileNativePDBTests/PDBFPOProgramToDWARFExpressionTests.InvalidAssignmentSingle (1673 of 1785) PASS: lldb-unit :: UnwindAssembly/x86/./UnwindAssemblyx86Tests/Testx86AssemblyInspectionEngine.TestPushExtended (1674 of 1785) PASS: lldb-unit :: Utility/./UtilityTests/StringExtractorTest.DecodeHexU8_InvalidHex (1675 of 1785) PASS: lldb-api :: functionalities/data-formatter/data-formatter-objc/TestDataFormatterObjCExpr.py (1676 of 1785) PASS: lldb-unit :: Target/./TargetTests/ModuleCacheTest.GetAndPut (1677 of 1785) PASS: lldb-api :: commands/frame/diagnose/complicated-expression/TestComplicatedExpression.py (1678 of 1785) UNSUPPORTED: lldb-api :: commands/expression/completion-crash2/TestCompletionCrash2.py (1679 of 1785) PASS: lldb-unit :: Utility/./UtilityTests/StreamTest.ChangingByteOrder (1680 of 1785) UNSUPPORTED: lldb-api :: functionalities/data-formatter/data-formatter-stl/libstdcpp/tuple/TestDataFormatterStdTuple.py (1681 of 1785) PASS: lldb-unit :: Utility/./UtilityTests/StringListTest.CopyListEmpty (1682 of 1785) PASS: lldb-api :: functionalities/data-formatter/ostypeformatting/TestFormattersOsType.py (1683 of 1785) PASS: lldb-unit :: Process/minidump/./LLDBMinidumpTests/MinidumpParserTest.GetThreadContext_x86_32_wow64 (1684 of 1785) PASS: lldb-unit :: Host/./HostTests/NativeProcessProtocolTest.ReadCStringFromMemory_MaxSize (1685 of 1785) PASS: lldb-unit :: Utility/./UtilityTests/RangeTest.LessThanInvalid (1686 of 1785) PASS: lldb-api :: functionalities/archives/TestBSDArchives.py (1687 of 1785) UNSUPPORTED: lldb-api :: functionalities/darwin_log/source/info/TestDarwinLogSourceInfo.py (1688 of 1785) PASS: lldb-unit :: Utility/./UtilityTests/DataExtractorTest.GetCStrUnterminated (1689 of 1785) PASS: lldb-unit :: Process/gdb-remote/./ProcessGdbRemoteTests/GDBRemoteClientBaseTest.SendContinueAndAsyncPacket (1690 of 1785) PASS: lldb-unit :: Target/./TargetTests/PathMappingListTest.RelativeTests (1691 of 1785) PASS: lldb-api :: functionalities/gdb_remote_client/TestNestedRegDefinitions.py (1692 of 1785) PASS: lldb-unit :: Utility/./UtilityTests/ArgsTest.EscapeLLDBCommandArgument (1693 of 1785) PASS: lldb-unit :: UnwindAssembly/x86/./UnwindAssemblyx86Tests/Testx86AssemblyInspectionEngine.TestPopR13 (1694 of 1785) XFAIL: lldb-shell :: Unwind/prefer-debug-over-eh-frame.test (1695 of 1785) PASS: lldb-shell :: ObjectFile/PECOFF/uuid.yaml (1696 of 1785) PASS: lldb-unit :: Language/Highlighting/./HighlighterTests/HighlighterTest.DefaultHighlighter (1697 of 1785) PASS: lldb-shell :: ObjectFile/ELF/section-overlap.yaml (1698 of 1785) PASS: lldb-api :: functionalities/thread/concurrent_events/TestConcurrentWatchBreak.py (1699 of 1785) PASS: lldb-unit :: Utility/./UtilityTests/ArgsTest.ReplaceArgumentAtIndexShort (1700 of 1785) PASS: lldb-unit :: Utility/./UtilityTests/StateTest.Formatv (1701 of 1785) PASS: lldb-unit :: Utility/./UtilityTests/ArgsTest.TestSingleQuotedArgWithSpace (1702 of 1785) PASS: lldb-api :: functionalities/tsan/cpp_global_location/TestTsanCPPGlobalLocation.py (1703 of 1785) PASS: lldb-shell :: SymbolFile/DWARF/debug-types-dwo-cross-reference.cpp (1704 of 1785) PASS: lldb-api :: python_api/findvalue_duplist/TestSBFrameFindValue.py (1705 of 1785) PASS: lldb-unit :: SymbolFile/NativePDB/./SymbolFileNativePDBTests/PDBFPOProgramToDWARFExpressionTests.MissingTargetRegister (1706 of 1785) PASS: lldb-shell :: SymbolFile/DWARF/gnu-style-compression.cpp (1707 of 1785) UNSUPPORTED: lldb-api :: functionalities/exec/TestExec.py (1708 of 1785) PASS: lldb-api :: functionalities/thread/concurrent_events/TestConcurrentTwoBreakpointsOneSignal.py (1709 of 1785) PASS: lldb-unit :: Process/gdb-remote/./ProcessGdbRemoteTests/GDBRemoteCommunicationClientTest.SendSignalsToIgnore (1710 of 1785) PASS: lldb-shell :: SymbolFile/DWARF/apple-index-is-used.cpp (1711 of 1785) PASS: lldb-api :: lang/cpp/call-function/TestCallCPPFunction.py (1712 of 1785) PASS: lldb-unit :: Language/Highlighting/./HighlighterTests/HighlighterTest.FallbackHighlighter (1713 of 1785) PASS: lldb-api :: commands/watchpoints/watchpoint_commands/command/TestWatchpointCommandPython.py (1714 of 1785) PASS: lldb-unit :: Symbol/./SymbolTests/TestClangASTContext.TestBuiltinTypeForEncodingAndBitSize (1715 of 1785) PASS: lldb-unit :: Utility/./UtilityTests/StringExtractorTest.GetHexBytesAvail_Underflow (1716 of 1785) PASS: lldb-api :: functionalities/data-formatter/type_summary_list_arg/TestTypeSummaryListArg.py (1717 of 1785) PASS: lldb-api :: commands/expression/persist_objc_pointeetype/TestPersistObjCPointeeType.py (1718 of 1785) UNSUPPORTED: lldb-api :: functionalities/data-formatter/data-formatter-stl/libstdcpp/list/TestDataFormatterStdList.py (1719 of 1785) PASS: lldb-shell :: ObjectFile/ELF/PT_LOAD-empty.yaml (1720 of 1785) PASS: lldb-shell :: SymbolFile/NativePDB/global-classes.cpp (1721 of 1785) PASS: lldb-api :: commands/frame/diagnose/dereference-argument/TestDiagnoseDereferenceArgument.py (1722 of 1785) PASS: lldb-unit :: Host/./HostTests/SocketAddressTest.GetAddressInfo (1723 of 1785) PASS: lldb-api :: lang/cpp/gmodules-templates/TestGModules.py (1724 of 1785) PASS: lldb-unit :: Host/./HostTests/FileSystemTest.GetByteSize (1725 of 1785) PASS: lldb-api :: lang/cpp/std-function-step-into-callable/TestStdFunctionStepIntoCallable.py (1726 of 1785) PASS: lldb-unit :: Core/./LLDBCoreTests/StreamCallbackTest.Callback (1727 of 1785) PASS: lldb-unit :: Utility/./UtilityTests/SerializationRountripTest.SerializeDeserializeCString (1728 of 1785) PASS: lldb-unit :: Utility/./UtilityTests/Flags.AnyClear (1729 of 1785) UNSUPPORTED: lldb-api :: functionalities/thread/create_during_step/TestCreateDuringStep.py (1730 of 1785) PASS: lldb-shell :: Reproducer/TestReuseDirectory.test (1731 of 1785) PASS: lldb-api :: lang/objc/objc-foundation-dictionary-empty/TestNSDictionary0.py (1732 of 1785) PASS: lldb-unit :: Utility/./UtilityTests/StreamTeeTest.SetStreamAtIndexOutOfBounds (1733 of 1785) PASS: lldb-shell :: SymbolFile/NativePDB/function-types-builtins.cpp (1734 of 1785) PASS: lldb-unit :: Utility/./UtilityTests/VMRange.Reset (1735 of 1785) PASS: lldb-api :: commands/process/attach-resume/TestAttachResume.py (1736 of 1785) PASS: lldb-api :: commands/expression/persistent_ptr_update/TestPersistentPtrUpdate.py (1737 of 1785) UNSUPPORTED: lldb-shell :: Register/x86-64-gp-write.test (1738 of 1785) PASS: lldb-unit :: Utility/./UtilityTests/LogChannelEnabledTest.LogThread (1739 of 1785) PASS: lldb-api :: python_api/value/empty_class/TestValueAPIEmptyClass.py (1740 of 1785) PASS: lldb-unit :: Utility/./UtilityTests/StringListTest.AppendStringCString (1741 of 1785) PASS: lldb-unit :: Language/CPlusPlus/./LanguageCPlusPlusTests/CPlusPlusLanguage.ExtractContextAndIdentifier (1742 of 1785) PASS: lldb-api :: python_api/value/TestValueAPI.py (1743 of 1785) PASS: lldb-unit :: Process/minidump/./LLDBMinidumpTests/MinidumpParserTest.GetMiscInfo_no_stream (1744 of 1785) PASS: lldb-api :: functionalities/asan/TestMemoryHistory.py (1745 of 1785) PASS: lldb-api :: functionalities/avoids-fd-leak/TestFdLeak.py (1746 of 1785) PASS: lldb-api :: lang/objc/objc++/TestObjCXX.py (1747 of 1785) PASS: lldb-unit :: Utility/./UtilityTests/StreamTest.ShiftOperatorInts (1748 of 1785) PASS: lldb-api :: lang/objc/objc-ivar-protocols/TestIvarProtocols.py (1749 of 1785) PASS: lldb-api :: lang/cpp/stl/TestSTL.py (1750 of 1785) PASS: lldb-api :: commands/watchpoints/step_over_watchpoint/TestStepOverWatchpoint.py (1751 of 1785) PASS: lldb-api :: lang/objc/foundation/TestObjectDescriptionAPI.py (1752 of 1785) PASS: lldb-unit :: ScriptInterpreter/Python/./ScriptInterpreterPythonTests/PythonDataObjectsTest.TestPythonStringToStructuredString (1753 of 1785) PASS: lldb-api :: functionalities/gdb_remote_client/TestWriteMemory.py (1754 of 1785) PASS: lldb-unit :: Utility/./UtilityTests/StringListTest.Clear (1755 of 1785) PASS: lldb-unit :: Utility/./UtilityTests/StringExtractorTest.GetHexBytes_OddPair2 (1756 of 1785) PASS: lldb-api :: functionalities/data-formatter/data-formatter-cpp/TestDataFormatterCpp.py (1757 of 1785) PASS: lldb-unit :: Utility/./UtilityTests/StringListTest.JoinNonSpace (1758 of 1785) PASS: lldb-api :: python_api/debugger/TestDebuggerAPI.py (1759 of 1785) PASS: lldb-api :: commands/expression/import-std-module/empty-module/TestEmptyStdModule.py (1760 of 1785) PASS: lldb-shell :: ObjectFile/ELF/minidebuginfo-find-symbols.yaml (1761 of 1785) PASS: lldb-api :: lang/c/blocks/TestBlocks.py (1762 of 1785) PASS: lldb-api :: functionalities/data-formatter/data-formatter-synthtype/TestDataFormatterSynthType.py (1763 of 1785) PASS: lldb-unit :: Language/Highlighting/./HighlighterTests/HighlighterTest.ClangSquareBrackets (1764 of 1785) PASS: lldb-api :: lang/cpp/auto/TestCPPAuto.py (1765 of 1785) PASS: lldb-api :: lang/objc/objc-static-method/TestObjCStaticMethod.py (1766 of 1785) PASS: lldb-unit :: Utility/./UtilityTests/CompletionRequest.DuplicateFilteringWithComments (1767 of 1785) PASS: lldb-api :: functionalities/data-formatter/data-formatter-stl/libcxx/atomic/TestLibCxxAtomic.py (1768 of 1785) PASS: lldb-api :: lang/objcxx/class-name-clash/TestNameClash.py (1769 of 1785) PASS: lldb-unit :: UnwindAssembly/x86/./UnwindAssemblyx86Tests/Testx86AssemblyInspectionEngine.TestMovRSPtoRBP (1770 of 1785) PASS: lldb-api :: commands/expression/import-std-module/no-std-module/TestMissingStdModule.py (1771 of 1785) UNSUPPORTED: lldb-api :: functionalities/data-formatter/data-formatter-stl/libstdcpp/map/TestDataFormatterStdMap.py (1772 of 1785) PASS: lldb-shell :: SymbolFile/NativePDB/nested-types.cpp (1773 of 1785) PASS: lldb-api :: functionalities/data-formatter/ptr_ref_typedef/TestPtrRef2Typedef.py (1774 of 1785) PASS: lldb-api :: commands/watchpoints/watchpoint_set_command/TestWatchLocationWithWatchSet.py (1775 of 1785) UNSUPPORTED: lldb-api :: lang/cpp/printf/TestPrintf.py (1776 of 1785) PASS: lldb-api :: commands/expression/import-std-module/queue/TestQueue.py (1777 of 1785) PASS: lldb-api :: python_api/rdar-12481949/Test-rdar-12481949.py (1778 of 1785) PASS: lldb-api :: functionalities/thread/concurrent_events/TestConcurrentCrashWithWatchpoint.py (1779 of 1785) PASS: lldb-api :: functionalities/breakpoint/breakpoint_command/TestBreakpointCommand.py (1780 of 1785) PASS: lldb-api :: lang/cpp/llvm-style/TestLLVMStyle.py (1781 of 1785) PASS: lldb-api :: lang/objc/print-obj/TestPrintObj.py (1782 of 1785) PASS: lldb-api :: functionalities/data-formatter/data-formatter-objc/TestDataFormatterObjCKVO.py (1783 of 1785) PASS: lldb-api :: commands/expression/import-std-module/deque-dbg-info-content/TestDbgInfoContentDeque.py (1784 of 1785) PASS: lldb-api :: lang/objc/foundation/TestFoundationDisassembly.py (1785 of 1785) Testing Time: 1977.56s ******************** Failing Tests (1): lldb-api :: iohandler/completion/TestIOHandlerCompletion.py

Hide Details

Hide Details

Slowest Tests: -------------------------------------------------------------------------- 126.79s: lldb-api :: api/check_public_api_headers/TestPublicAPIHeaders.py 133.24s: lldb-api :: lang/objc/objc-new-syntax/TestObjCNewSyntaxDictionary.py 135.92s: lldb-api :: functionalities/data-formatter/synthupdate/TestSyntheticFilterRecompute.py 139.69s: lldb-api :: lang/c/anonymous/TestAnonymous.py 140.40s: lldb-api :: functionalities/recursion/TestValueObjectRecursion.py 148.73s: lldb-api :: lang/objc/objc-new-syntax/TestObjCNewSyntaxArray.py 155.54s: lldb-api :: commands/target/basic/TestTargetCommand.py 160.04s: lldb-api :: lang/objc/exceptions/TestObjCExceptions.py 177.89s: lldb-api :: lang/cpp/enum_types/TestCPP11EnumTypes.py 178.90s: lldb-api :: lang/objc/objc-new-syntax/TestObjCNewSyntaxLiteral.py 186.97s: lldb-api :: tools/lldb-server/TestLldbGdbServer.py 203.26s: lldb-api :: lang/objc/foundation/TestObjCMethods.py 209.23s: lldb-api :: functionalities/load_unload/TestLoadUnload.py 213.57s: lldb-api :: lang/cpp/namespace/TestNamespaceLookup.py 218.22s: lldb-api :: api/multithreaded/TestMultithreaded.py 221.20s: lldb-api :: functionalities/return-value/TestReturnValue.py 222.10s: lldb-api :: lang/objc/hidden-ivars/TestHiddenIvars.py 349.49s: lldb-api :: lang/objc/foundation/TestFoundationDisassembly.py 379.21s: lldb-api :: types/TestIntegerTypes.py 504.62s: lldb-api :: types/TestIntegerTypesExpr.py

Hide Details

Tests Times: -------------------------------------------------------------------------- [ Range ] :: [ Percentage ] :: [ Count ] -------------------------------------------------------------------------- [ 0s, 50s) :: [************************************ ] :: [1628/1785] [ 50s,100s) :: [** ] :: [ 126/1785] [100s,150s) :: [ ] :: [ 14/1785] [150s,200s) :: [ ] :: [ 7/1785] [200s,250s) :: [ ] :: [ 7/1785] [250s,300s) :: [ ] :: [ 0/1785] [300s,350s) :: [ ] :: [ 0/1785] [350s,400s) :: [ ] :: [ 1/1785] [400s,450s) :: [ ] :: [ 1/1785] [450s,500s) :: [ ] :: [ 0/1785] [500s,550s) :: [ ] :: [ 1/1785] Expected Passes : 1637 Expected Failures : 6 Unsupported Tests : 141 Unexpected Failures: 1 FAILED: tools/lldb/test/CMakeFiles/check-lldb-lit cd /Users/buildslave/jenkins/workspace/lldb-cmake-sanitized/lldb-build/tools/lldb/test && /usr/bin/python /Users/buildslave/jenkins/workspace/lldb-cmake-sanitized/lldb-build/./bin/llvm-lit -v --time-tests --shuffle --xunit-xml-output=/Users/buildslave/jenkins/workspace/lldb-cmake-sanitized/test/results.xml -v --timeout 1200 /Users/buildslave/jenkins/workspace/lldb-cmake-sanitized/lldb-build/tools/lldb/test ninja: build stopped: subcommand failed. Command failed Command: ['/usr/bin/env', 'TERM=vt100', '/usr/local/bin/ninja', '-v', 'check-lldb'] [Pipeline] } [Pipeline] // timeout [Pipeline] } [Pipeline] // stage [Pipeline] stage [Pipeline] { (Declarative: Post Actions) [Pipeline] scanForIssues No credentials specified [Clang (LLVM based)] Sleeping for 5 seconds due to JENKINS-32191... [Clang (LLVM based)] Parsing console log (workspace: '/Users/buildslave/jenkins/workspace/lldb-cmake-sanitized') [Pipeline] junit Recording test results [Pipeline] } [Pipeline] // stage [Pipeline] } [Pipeline] // withEnv [Pipeline] } [Pipeline] // node [Pipeline] End of Pipeline [BFA] Scanning build for known causes... [BFA] Found failure cause(s): [BFA] Regression test failed from category Test [BFA] Ninja target failed from category Compile [BFA] Done. 0s ERROR: script returned exit code 1 Finished: FAILURE