FailedConsole Output

Skipping 687 KB.. Full Log
utput: 

Hide Details

UNSUPPORTED: LLDB (/Users/buildslave/jenkins/workspace/lldb-cmake-sanitized/host-compiler/bin/clang-10-x86_64) :: test_thread_suffix_supported_llgs (TestLldbGdbServer.LldbGdbServerTestCase) (llgs tests) runCmd: settings set symbols.enable-external-lookup false output:

Hide Details

runCmd: settings set plugin.process.gdb-remote.packet-timeout 60 output:

Hide Details

runCmd: settings set symbols.clang-modules-cache-path "/Users/buildslave/jenkins/workspace/lldb-cmake-sanitized/lldb-build/tools/lldb/lldb-test-build.noindex/module-cache-lldb/lldb-api" output:

Hide Details

runCmd: settings set use-color false output:

Hide Details

Adding tearDown hook: def shutdown_named_pipe(): # Close the pipe. try: named_pipe.close() except: print("failed to close named pipe") None

Hide Details

# Delete the pipe. try: os.remove(named_pipe_path) except: print("failed to delete named pipe: {}".format(named_pipe_path)) None

Hide Details

# Delete the temp directory. try: os.rmdir(temp_dir) except: print( "failed to delete temp dir: {}, directory contents: '{}'".format( temp_dir, os.listdir(temp_dir))) None

Hide Details

Hide Details

Adding tearDown hook: def cleanupSubprocesses(self): # Ensure any subprocesses are cleaned up for p in self.subprocesses: p.terminate() del p del self.subprocesses[:] # Ensure any forked processes are cleaned up for pid in self.forkedProcessPids: if os.path.exists("/proc/" + str(pid)): os.kill(pid, signal.SIGTERM)

Hide Details

Hide Details

Adding tearDown hook: def shutdown_debug_monitor(): try: server.terminate() except: logger.warning( "failed to terminate server for debug monitor: {}; ignoring".format( sys.exc_info()[0]))

Hide Details

Hide Details

Adding tearDown hook: def shutdown_socket(): if sock: try: # send the kill packet so lldb-server shuts down gracefully sock.sendall(GdbRemoteTestCaseBase._GDBREMOTE_KILL_PACKET) except: logger.warning( "failed to send kill packet to debug monitor: {}; ignoring".format( sys.exc_info()[0]))

Hide Details

try: sock.close() except: logger.warning( "failed to close socket to debug monitor: {}; ignoring".format( sys.exc_info()[0]))

Hide Details

Hide Details

Executing tearDown hook: def shutdown_socket(): if sock: try: # send the kill packet so lldb-server shuts down gracefully sock.sendall(GdbRemoteTestCaseBase._GDBREMOTE_KILL_PACKET) except: logger.warning( "failed to send kill packet to debug monitor: {}; ignoring".format( sys.exc_info()[0]))

Hide Details

try: sock.close() except: logger.warning( "failed to close socket to debug monitor: {}; ignoring".format( sys.exc_info()[0]))

Hide Details

Hide Details

Executing tearDown hook: def shutdown_debug_monitor(): try: server.terminate() except: logger.warning( "failed to terminate server for debug monitor: {}; ignoring".format( sys.exc_info()[0]))

Hide Details

Hide Details

Executing tearDown hook: def cleanupSubprocesses(self): # Ensure any subprocesses are cleaned up for p in self.subprocesses: p.terminate() del p del self.subprocesses[:] # Ensure any forked processes are cleaned up for pid in self.forkedProcessPids: if os.path.exists("/proc/" + str(pid)): os.kill(pid, signal.SIGTERM)

Hide Details

Hide Details

Executing tearDown hook: def shutdown_named_pipe(): # Close the pipe. try: named_pipe.close() except: print("failed to close named pipe") None

Hide Details

# Delete the pipe. try: os.remove(named_pipe_path) except: print("failed to delete named pipe: {}".format(named_pipe_path)) None

Hide Details

# Delete the temp directory. try: os.rmdir(temp_dir) except: print( "failed to delete temp dir: {}, directory contents: '{}'".format( temp_dir, os.listdir(temp_dir))) None

Hide Details

Hide Details

PASS: LLDB (/Users/buildslave/jenkins/workspace/lldb-cmake-sanitized/host-compiler/bin/clang-10-x86_64) :: test_written_M_content_reads_back_correctly_debugserver (TestLldbGdbServer.LldbGdbServerTestCase) runCmd: settings set symbols.enable-external-lookup false output:

Hide Details

runCmd: settings set plugin.process.gdb-remote.packet-timeout 60 output:

Hide Details

runCmd: settings set symbols.clang-modules-cache-path "/Users/buildslave/jenkins/workspace/lldb-cmake-sanitized/lldb-build/tools/lldb/lldb-test-build.noindex/module-cache-lldb/lldb-api" output:

Hide Details

runCmd: settings set use-color false output:

Hide Details

UNSUPPORTED: LLDB (/Users/buildslave/jenkins/workspace/lldb-cmake-sanitized/host-compiler/bin/clang-10-x86_64) :: test_written_M_content_reads_back_correctly_llgs (TestLldbGdbServer.LldbGdbServerTestCase) (llgs tests) Restore dir to: /Users/buildslave/jenkins/workspace/lldb-cmake-sanitized/lldb-build/tools/lldb/test ====================================================================== FAIL: test_p_returns_correct_data_size_for_each_qRegisterInfo_attach_debugserver (TestLldbGdbServer.LldbGdbServerTestCase) ---------------------------------------------------------------------- Traceback (most recent call last): File "/Users/buildslave/jenkins/workspace/lldb-cmake-sanitized/llvm-project/lldb/packages/Python/lldbsuite/test/decorators.py", line 141, in wrapper func(*args, **kwargs) File "/Users/buildslave/jenkins/workspace/lldb-cmake-sanitized/llvm-project/lldb/packages/Python/lldbsuite/test/tools/lldb-server/TestLldbGdbServer.py", line 621, in test_p_returns_correct_data_size_for_each_qRegisterInfo_attach_debugserver self.p_returns_correct_data_size_for_each_qRegisterInfo() File "/Users/buildslave/jenkins/workspace/lldb-cmake-sanitized/llvm-project/lldb/packages/Python/lldbsuite/test/tools/lldb-server/TestLldbGdbServer.py", line 551, in p_returns_correct_data_size_for_each_qRegisterInfo procs = self.prep_debug_monitor_and_inferior() File "/Users/buildslave/jenkins/workspace/lldb-cmake-sanitized/llvm-project/lldb/packages/Python/lldbsuite/test/tools/lldb-server/gdbremote_testcase.py", line 583, in prep_debug_monitor_and_inferior server = self.connect_to_debug_monitor(attach_pid=attach_pid) File "/Users/buildslave/jenkins/workspace/lldb-cmake-sanitized/llvm-project/lldb/packages/Python/lldbsuite/test/tools/lldb-server/gdbremote_testcase.py", line 417, in connect_to_debug_monitor server = self.launch_debug_monitor(attach_pid=attach_pid) File "/Users/buildslave/jenkins/workspace/lldb-cmake-sanitized/llvm-project/lldb/packages/Python/lldbsuite/test/tools/lldb-server/gdbremote_testcase.py", line 410, in launch_debug_monitor self.port = self.get_stub_port_from_named_socket(self._READ_TIMEOUT) File "/Users/buildslave/jenkins/workspace/lldb-cmake-sanitized/llvm-project/lldb/packages/Python/lldbsuite/test/tools/lldb-server/gdbremote_testcase.py", line 216, in get_stub_port_from_named_socket "write side of pipe has not written anything - stub isn't writing to pipe.") AssertionError: 0 == 0 : write side of pipe has not written anything - stub isn't writing to pipe. Config=x86_64-/Users/buildslave/jenkins/workspace/lldb-cmake-sanitized/host-compiler/bin/clang-10 ---------------------------------------------------------------------- Ran 65 tests in 249.886s

Hide Details

RESULT: FAILED (29 passes, 1 failures, 0 errors, 34 skipped, 1 expected failures, 0 unexpected successes)

Hide Details

******************** UNSUPPORTED: lldb-api :: linux/thread/create_during_instruction_step/TestCreateDuringInstructionStep.py (482 of 1785) PASS: lldb-unit :: Host/./HostTests/FileSystemTest.GetPermissions (483 of 1785) PASS: lldb-api :: functionalities/breakpoint/breakpoint_ignore_count/TestBreakpointIgnoreCount.py (484 of 1785) PASS: lldb-unit :: ScriptInterpreter/Python/./ScriptInterpreterPythonTests/PythonDataObjectsTest.TestPythonTupleValues (485 of 1785) PASS: lldb-api :: lang/cpp/std-function-step-into-callable/TestStdFunctionStepIntoCallable.py (486 of 1785) PASS: lldb-unit :: Language/Highlighting/./HighlighterTests/HighlighterTest.ClangComments (487 of 1785) PASS: lldb-api :: functionalities/tail_call_frames/thread_step_out_message/TestArtificialFrameStepOutMessage.py (488 of 1785) PASS: lldb-unit :: Utility/./UtilityTests/BinaryStreamTest.PutSLEB128FourBytes (489 of 1785) PASS: lldb-unit :: Process/gdb-remote/./ProcessGdbRemoteTests/GDBRemoteCommunicationClientTest.SendGetMetaDataPacket (490 of 1785) PASS: lldb-shell :: SymbolFile/NativePDB/globals-bss.cpp (491 of 1785) PASS: lldb-api :: functionalities/data-formatter/data-formatter-globals/TestDataFormatterGlobals.py (492 of 1785) PASS: lldb-shell :: SymbolFile/DWARF/debug-types-line-tables.s (493 of 1785) PASS: lldb-unit :: ScriptInterpreter/Python/./ScriptInterpreterPythonTests/PythonDataObjectsTest.TestPythonFile (494 of 1785) PASS: lldb-api :: lang/cpp/class_static/TestStaticVariables.py (495 of 1785) PASS: lldb-unit :: Utility/./UtilityTests/ArgsTest.GetArgumentArrayRef (496 of 1785) PASS: lldb-api :: functionalities/thread/concurrent_events/TestConcurrentTwoWatchpointsOneDelayBreakpoint.py (497 of 1785) PASS: lldb-api :: tools/lldb-server/TestGdbRemoteExpeditedRegisters.py (498 of 1785) PASS: lldb-unit :: Utility/./UtilityTests/RangeTest.DoesIntersect (499 of 1785) PASS: lldb-unit :: Utility/./UtilityTests/StringListTest.AppendStringMove (500 of 1785) UNSUPPORTED: lldb-api :: functionalities/darwin_log/filter/regex/activity/TestDarwinLogFilterRegexActivity.py (501 of 1785) PASS: lldb-api :: functionalities/memory/find/TestMemoryFind.py (502 of 1785) PASS: lldb-unit :: Process/gdb-remote/./ProcessGdbRemoteTests/GDBRemoteClientBaseTest.SendContinueDelegateInterface (503 of 1785) PASS: lldb-unit :: UnwindAssembly/x86/./UnwindAssemblyx86Tests/Testx86AssemblyInspectionEngine.TestDisassemblyMidFunctionEpilogues (504 of 1785) PASS: lldb-unit :: Utility/./UtilityTests/ScalarTest.GetBytes (505 of 1785) PASS: lldb-unit :: ObjectFile/Breakpad/./ObjectFileBreakpadTests/InfoRecord.parse (506 of 1785) PASS: lldb-api :: functionalities/plugins/command_plugin/TestPluginCommands.py (507 of 1785) PASS: lldb-unit :: Utility/./UtilityTests/ArgsTest.TestSingleArgWithQuotedSpace (508 of 1785) PASS: lldb-api :: python_api/breakpoint/TestBreakpointAPI.py (509 of 1785) PASS: lldb-unit :: Utility/./UtilityTests/BinaryStreamTest.PutSLEB128EightBytes (510 of 1785) PASS: lldb-api :: python_api/symbol-context/two-files/TestSymbolContextTwoFiles.py (511 of 1785) PASS: lldb-api :: functionalities/breakpoint/breakpoint_conditions/TestBreakpointConditions.py (512 of 1785) PASS: lldb-unit :: Signals/./SignalsTests/UnixSignalsTest.GetFilteredSignals (513 of 1785) PASS: lldb-api :: commands/add-dsym/uuid/TestAddDsymCommand.py (514 of 1785) PASS: lldb-unit :: Utility/./UtilityTests/StringListTest.ShiftCString (515 of 1785) PASS: lldb-api :: functionalities/gdb_remote_client/TestTargetXMLArch.py (516 of 1785) PASS: lldb-api :: lang/objc/objc-baseclass-sbtype/TestObjCBaseClassSBType.py (517 of 1785) PASS: lldb-api :: commands/expression/test/TestExprs2.py (518 of 1785) PASS: lldb-unit :: Utility/./UtilityTests/StreamTest.PutCharNull (519 of 1785) PASS: lldb-api :: functionalities/load_using_paths/TestLoadUsingPaths.py (520 of 1785) PASS: lldb-shell :: Expr/TestIRMemoryMap.test (521 of 1785) PASS: lldb-unit :: UnwindAssembly/x86/./UnwindAssemblyx86Tests/Testx86AssemblyInspectionEngine.TestSpillRegToStackViaMOVi386 (522 of 1785) PASS: lldb-shell :: ObjectFile/ELF/netbsd-exec-8.99.30-amd64.yaml (523 of 1785) PASS: lldb-unit :: UnwindAssembly/x86/./UnwindAssemblyx86Tests/Testx86AssemblyInspectionEngine.TestPopEBP (524 of 1785) PASS: lldb-unit :: Utility/./UtilityTests/RangeTest.Clear (525 of 1785) PASS: lldb-unit :: Utility/./UtilityTests/Flags.Reset (526 of 1785) PASS: lldb-api :: lang/objc/foundation/TestConstStrings.py (527 of 1785) PASS: lldb-unit :: Process/minidump/./LLDBMinidumpTests/RegisterContextMinidump.ConvertMinidumpContext_x86_32 (528 of 1785) PASS: lldb-unit :: ScriptInterpreter/Python/./ScriptInterpreterPythonTests/PythonDataObjectsTest.TestPythonByteArray (529 of 1785) PASS: lldb-unit :: Utility/./UtilityTests/UriParserTest.SchemeHostSeparator4 (530 of 1785) PASS: lldb-unit :: Utility/./UtilityTests/StringLexerTest.GetUnlexed (531 of 1785) PASS: lldb-api :: functionalities/data-formatter/data-formatter-stl/libcxx/multimap/TestDataFormatterLibccMultiMap.py (532 of 1785) PASS: lldb-unit :: Utility/./UtilityTests/StringListTest.SplitIntoLinesEmpty (533 of 1785) PASS: lldb-unit :: Utility/./UtilityTests/VMRange.Comparison (534 of 1785) PASS: lldb-api :: functionalities/source-map/TestTargetSourceMap.py (535 of 1785) PASS: lldb-api :: functionalities/memory/read/TestMemoryRead.py (536 of 1785) PASS: lldb-unit :: Breakpoint/./LLDBBreakpointTests/BreakpointIDTest.StringIsBreakpointName (537 of 1785) PASS: lldb-unit :: Utility/./UtilityTests/StreamTest.PutMaxHex64ByteOrderBig (538 of 1785) UNSUPPORTED: lldb-api :: commands/expression/completion-crash-incomplete-record/TestCompletionCrashIncompleteRecord.py (539 of 1785) PASS: lldb-unit :: Utility/./UtilityTests/OptionsWithRawTest.UnterminatedQuote (540 of 1785) PASS: lldb-unit :: UnwindAssembly/x86/./UnwindAssemblyx86Tests/Testx86AssemblyInspectionEngine.TestSubRSP (541 of 1785) PASS: lldb-api :: lang/objc/objc-class-method/TestObjCClassMethod.py (542 of 1785) PASS: lldb-api :: functionalities/data-formatter/data-formatter-stl/libcxx/tuple/TestDataFormatterLibcxxTuple.py (543 of 1785) PASS: lldb-api :: lang/objc/objc-checker/TestObjCCheckers.py (544 of 1785) PASS: lldb-api :: functionalities/data-formatter/summary-string-onfail/Test-rdar-9974002.py (545 of 1785) UNSUPPORTED: lldb-shell :: SymbolFile/NativePDB/stack_unwinding01.cpp (546 of 1785) PASS: lldb-unit :: SymbolFile/DWARF/./SymbolFileDWARFTests/SymbolFileDWARFTests.TestAbbrevInvalidNULLTag (547 of 1785) PASS: lldb-unit :: Utility/./UtilityTests/StringListTest.CopyListEmpty (548 of 1785) PASS: lldb-unit :: Process/gdb-remote/./ProcessGdbRemoteTests/GDBRemoteCommunicationClientTest.SyncThreadState (549 of 1785) PASS: lldb-unit :: Utility/./UtilityTests/SerializationRountripTest.SerializeDeserializePod (550 of 1785) PASS: lldb-unit :: Utility/./UtilityTests/StringListTest.AppendListCStringArrayEmpty (551 of 1785) PASS: lldb-unit :: Host/./HostTests/HostInfoTest.GetAugmentedArchSpec (552 of 1785) PASS: lldb-api :: functionalities/breakpoint/consecutive_breakpoints/TestConsecutiveBreakpoints.py (553 of 1785) PASS: lldb-api :: lang/cpp/nested-class-other-compilation-unit/TestNestedClassWithParentInAnotherCU.py (554 of 1785) PASS: lldb-shell :: Driver/TestRepl.test (555 of 1785) PASS: lldb-api :: lang/objc/objc-stepping/TestObjCStepping.py (556 of 1785) PASS: lldb-api :: commands/expression/import-std-module/queue/TestQueue.py (557 of 1785) PASS: lldb-api :: functionalities/thread/concurrent_events/TestConcurrentDelayedCrashWithBreakpointWatchpoint.py (558 of 1785) PASS: lldb-api :: commands/process/launch-with-shellexpand/TestLaunchWithShellExpand.py (559 of 1785) PASS: lldb-api :: python_api/name_lookup/TestNameLookup.py (560 of 1785) PASS: lldb-api :: functionalities/thread/concurrent_events/TestConcurrentNWatchNBreak.py (561 of 1785) PASS: lldb-unit :: Utility/./UtilityTests/StringExtractorTest.GetHexBytes_FullString (562 of 1785) PASS: lldb-shell :: Reproducer/TestSynchronous.test (563 of 1785) PASS: lldb-shell :: Settings/TestFrameFormatColor.test (564 of 1785) UNSUPPORTED: lldb-api :: lang/cpp/static_members/TestCPPStaticMembers.py (565 of 1785) UNSUPPORTED: lldb-shell :: Register/x86-64-zmm-read.test (566 of 1785) PASS: lldb-api :: lang/objcxx/hide-runtime-values/TestObjCXXHideRuntimeValues.py (567 of 1785) PASS: lldb-unit :: Host/./HostTests/File.GetStreamFromDescriptor (568 of 1785) PASS: lldb-api :: lang/cpp/stl/TestSTL.py (569 of 1785) PASS: lldb-unit :: Utility/./UtilityTests/StringListTest.GetMaxStringLengthIncreasingSize (570 of 1785) PASS: lldb-api :: functionalities/gdb_remote_client/TestNestedRegDefinitions.py (571 of 1785) PASS: lldb-unit :: Utility/./UtilityTests/StreamTest.ShiftOperatorInts (572 of 1785) PASS: lldb-api :: commands/expression/invalid-args/TestInvalidArgsExpression.py (573 of 1785) PASS: lldb-api :: functionalities/postmortem/elf-core/gcore/TestGCore.py (574 of 1785) PASS: lldb-unit :: Utility/./UtilityTests/ProcessInfoTest.Constructor (575 of 1785) PASS: lldb-shell :: ObjectFile/PECOFF/export-dllfunc.yaml (576 of 1785) PASS: lldb-shell :: ObjectFile/ELF/minidebuginfo-find-symbols.yaml (577 of 1785) PASS: lldb-shell :: ObjectFile/PECOFF/uuid.yaml (578 of 1785) PASS: lldb-api :: commands/expression/import-std-module/vector-dbg-info-content/TestDbgInfoContentVector.py (579 of 1785) UNSUPPORTED: lldb-shell :: ObjectFile/ELF/minidebuginfo-no-lzma.yaml (580 of 1785) PASS: lldb-unit :: Core/./LLDBCoreTests/UniqueCStringMap.NoDefaultConstructor (581 of 1785) PASS: lldb-api :: functionalities/gdb_remote_client/TestGDBRemoteLoad.py (582 of 1785) PASS: lldb-unit :: Utility/./UtilityTests/StructuredDataTest.ParseJSONFromFile (583 of 1785) PASS: lldb-api :: functionalities/data-formatter/stringprinter/TestStringPrinter.py (584 of 1785) PASS: lldb-unit :: Host/./HostTests/FileActionTest.Open (585 of 1785) PASS: lldb-unit :: Symbol/./SymbolTests/TestClangASTContext.TestGetBasicTypeFromName (586 of 1785) PASS: lldb-unit :: Process/minidump/./LLDBMinidumpTests/MinidumpParserTest.GetThreadContext_x86_32_wow64 (587 of 1785) PASS: lldb-api :: functionalities/data-formatter/data-formatter-objc/TestDataFormatterObjCCF.py (588 of 1785) PASS: lldb-unit :: Utility/./UtilityTests/StringExtractorTest.GetNameColonValueSuccess (589 of 1785) UNSUPPORTED: lldb-api :: iohandler/completion/TestIOHandlerCompletion.py (590 of 1785) PASS: lldb-unit :: Utility/./UtilityTests/StreamTest.ShiftOperatorUInts (591 of 1785) PASS: lldb-unit :: ObjectFile/PECOFF/./ObjectFilePECOFFTests/PECallFrameInfoTest.Frame_reg_eh (592 of 1785) PASS: lldb-unit :: Process/gdb-remote/./ProcessGdbRemoteTests/GDBRemoteCommunicationTest.ReadPacket_checksum (593 of 1785) PASS: lldb-shell :: ObjectFile/ELF/section-types.yaml (594 of 1785) PASS: lldb-api :: commands/expression/timeout/TestCallWithTimeout.py (595 of 1785) PASS: lldb-unit :: Utility/./UtilityTests/StringListTest.DefaultConstructor (596 of 1785) PASS: lldb-unit :: Process/gdb-remote/./ProcessGdbRemoteTests/GDBRemoteClientBaseTest.InterruptNoResponse (597 of 1785) PASS: lldb-unit :: Utility/./UtilityTests/StreamTest.QuotedCString (598 of 1785) PASS: lldb-unit :: Utility/./UtilityTests/UUIDTest.Validity (599 of 1785) PASS: lldb-api :: python_api/value_var_update/TestValueVarUpdate.py (600 of 1785) PASS: lldb-api :: functionalities/breakpoint/breakpoint_language/TestBreakpointLanguage.py (601 of 1785) PASS: lldb-api :: functionalities/deleted-executable/TestDeletedExecutable.py (602 of 1785) PASS: lldb-unit :: Utility/./UtilityTests/BinaryStreamTest.PutSLEB128ThreeBytes (603 of 1785) PASS: lldb-api :: functionalities/data-formatter/hexcaps/TestDataFormatterHexCaps.py (604 of 1785) PASS: lldb-api :: functionalities/breakpoint/global_constructor/TestBreakpointInGlobalConstructor.py (605 of 1785) PASS: lldb-unit :: Language/Highlighting/./HighlighterTests/HighlighterTest.ClangCursorPosAfterOtherToken (606 of 1785) PASS: lldb-unit :: Language/Highlighting/./HighlighterTests/HighlighterTest.DefaultHighlighter (607 of 1785) UNSUPPORTED: lldb-api :: functionalities/thread/break_after_join/TestBreakAfterJoin.py (608 of 1785) PASS: lldb-api :: lang/cpp/signed_types/TestSignedTypes.py (609 of 1785) PASS: lldb-api :: commands/expression/import-std-module/unique_ptr-dbg-info-content/TestUniquePtrDbgInfoContent.py (610 of 1785) PASS: lldb-unit :: Utility/./UtilityTests/StringListTest.JoinEmpty (611 of 1785) PASS: lldb-unit :: Utility/./UtilityTests/StringExtractorTest.GetHexU8_Underflow (612 of 1785) PASS: lldb-api :: python_api/process/TestProcessAPI.py (613 of 1785) PASS: lldb-api :: commands/process/attach/TestProcessAttach.py (614 of 1785) PASS: lldb-unit :: Expression/./ExpressionTests/ClangHostTest.MacOSX (615 of 1785) PASS: lldb-api :: functionalities/breakpoint/auto_continue/TestBreakpointAutoContinue.py (616 of 1785) PASS: lldb-unit :: Utility/./UtilityTests/StringExtractorTest.GetHexBytes (617 of 1785) PASS: lldb-api :: functionalities/tsan/cpp_global_location/TestTsanCPPGlobalLocation.py (618 of 1785) PASS: lldb-api :: functionalities/inline-stepping/TestInlineStepping.py (619 of 1785) PASS: lldb-api :: lang/cpp/accelerator-table/TestCPPAccelerator.py (620 of 1785) PASS: lldb-shell :: Settings/TestFrameFormatNoColor.test (621 of 1785) PASS: lldb-shell :: ObjectFile/MachO/lc_build_version_notools.yaml (622 of 1785) PASS: lldb-api :: functionalities/return-value/TestReturnValue.py (623 of 1785) PASS: lldb-api :: lang/objc/objc-struct-return/TestObjCStructReturn.py (624 of 1785) PASS: lldb-unit :: Utility/./UtilityTests/FileSpecTest.AppendPathComponent (625 of 1785) PASS: lldb-unit :: Utility/./UtilityTests/FileSpecTest.FileAndDirectoryComponents (626 of 1785) PASS: lldb-unit :: Utility/./UtilityTests/BinaryStreamTest.PutULEB128SixBytes (627 of 1785) PASS: lldb-unit :: UnwindAssembly/x86/./UnwindAssemblyx86Tests/Testx86AssemblyInspectionEngine.TestPushRBP (628 of 1785) PASS: lldb-api :: python_api/value/linked_list/TestValueAPILinkedList.py (629 of 1785) PASS: lldb-api :: python_api/value/TestValueAPI.py (630 of 1785) PASS: lldb-unit :: Utility/./UtilityTests/StringExtractorTest.GetHexU8_Exact_NoEof (631 of 1785) PASS: lldb-unit :: Utility/./UtilityTests/OptionsWithRawTest.SingleWhitespaceInput (632 of 1785) PASS: lldb-api :: functionalities/tsan/thread_numbers/TestTsanThreadNumbers.py (633 of 1785) PASS: lldb-unit :: Process/gdb-remote/./ProcessGdbRemoteTests/GDBRemoteCommunicationClientTest.GetModulesInfo (634 of 1785) PASS: lldb-unit :: Utility/./UtilityTests/StreamTest.ShiftOperatorStrings (635 of 1785) PASS: lldb-unit :: Symbol/./SymbolTests/SymbolsTest.TerminateLocateExecutableSymbolFileForUnknownExecutableAndUnknownSymbolFile (636 of 1785) PASS: lldb-unit :: Utility/./UtilityTests/UriParserTest.Minimal (637 of 1785) UNSUPPORTED: lldb-api :: functionalities/thread/thread_specific_break_plus_condition/TestThreadSpecificBpPlusCondition.py (638 of 1785) PASS: lldb-api :: commands/expression/calculator_mode/TestCalculatorMode.py (639 of 1785) PASS: lldb-unit :: Utility/./UtilityTests/StringExtractorTest.DecodeHexU8_Underflow (640 of 1785) UNSUPPORTED: lldb-shell :: SymbolFile/dissassemble-entry-point.s (641 of 1785) PASS: lldb-api :: functionalities/breakpoint/cpp_exception/TestCPPExceptionBreakpoint.py (642 of 1785) PASS: lldb-api :: commands/expression/import-std-module/forward_list-dbg-info-content/TestDbgInfoContentForwardList.py (643 of 1785) PASS: lldb-shell :: Commands/CommandScriptImmediateOutput/CommandScriptImmediateOutputFile.test (644 of 1785) PASS: lldb-unit :: Host/./HostTests/SocketTest.TCPGetConnectURI (645 of 1785) PASS: lldb-shell :: SymbolFile/Breakpad/symtab.test (646 of 1785) PASS: lldb-api :: commands/expression/diagnostics/TestExprDiagnostics.py (647 of 1785) PASS: lldb-api :: functionalities/thread/concurrent_events/TestConcurrentSignalDelayBreak.py (648 of 1785) PASS: lldb-shell :: BuildScript/script-args.test (649 of 1785) PASS: lldb-api :: api/multithreaded/TestMultithreaded.py (650 of 1785) PASS: lldb-unit :: Process/gdb-remote/./ProcessGdbRemoteTests/GDBRemoteCommunicationClientTest.GetModulesInfo_UUID20 (651 of 1785) PASS: lldb-unit :: Interpreter/./InterpreterTests/OptionArgParserTest.toScriptLanguage (652 of 1785) PASS: lldb-unit :: Utility/./UtilityTests/StreamTeeTest.Assignment (653 of 1785) PASS: lldb-api :: lang/cpp/operator-overload/TestOperatorOverload.py (654 of 1785) PASS: lldb-unit :: Process/gdb-remote/./ProcessGdbRemoteTests/GDBRemoteCommunicationClientTest.TestPacketSpeedJSON (655 of 1785) PASS: lldb-unit :: Utility/./UtilityTests/StreamTest.ShiftOperatorPtr (656 of 1785) PASS: lldb-shell :: Commands/command-script-import.test (657 of 1785) PASS: lldb-api :: python_api/debugger/TestDebuggerAPI.py (658 of 1785) PASS: lldb-api :: python_api/default-constructor/TestDefaultConstructorForAPIObjects.py (659 of 1785) PASS: lldb-api :: functionalities/modern-type-lookup/basic-objc/TestBasicObjcModernTypeLookup.py (660 of 1785) PASS: lldb-shell :: SymbolFile/DWARF/dir-separator-windows.s (661 of 1785) PASS: lldb-api :: functionalities/paths/TestPaths.py (662 of 1785) PASS: lldb-api :: lang/cpp/diamond/TestDiamond.py (663 of 1785) PASS: lldb-shell :: Minidump/dump-all.test (664 of 1785) PASS: lldb-api :: functionalities/data-formatter/data-formatter-objc/TestDataFormatterObjCKVO.py (665 of 1785) PASS: lldb-api :: functionalities/modern-type-lookup/basic/TestBasicModernTypeLookup.py (666 of 1785) PASS: lldb-api :: functionalities/thread/concurrent_events/TestConcurrentTwoWatchpointsOneBreakpoint.py (667 of 1785) PASS: lldb-shell :: ObjectFile/ELF/section-addresses.yaml (668 of 1785) UNSUPPORTED: lldb-api :: functionalities/data-formatter/data-formatter-stl/libstdcpp/smart_ptr/TestDataFormatterStdSmartPtr.py (669 of 1785) PASS: lldb-unit :: Utility/./UtilityTests/ScalarTest.ComparisonFloat (670 of 1785) PASS: lldb-api :: lang/objc/variadic_methods/TestVariadicMethods.py (671 of 1785) PASS: lldb-api :: macosx/queues/TestQueues.py (672 of 1785) UNSUPPORTED: lldb-shell :: SymbolFile/NativePDB/local-variables.cpp (673 of 1785) PASS: lldb-api :: lang/cpp/namespace/TestNamespaceLookup.py (674 of 1785) PASS: lldb-api :: functionalities/data-formatter/data-formatter-stl/libcxx/initializerlist/TestInitializerList.py (675 of 1785) PASS: lldb-unit :: ObjectFile/Breakpad/./ObjectFileBreakpadTests/StackWinRecord.parse (676 of 1785) PASS: lldb-shell :: Settings/TestStopCommandSourceOnError.test (677 of 1785) PASS: lldb-unit :: Utility/./UtilityTests/ArgsTest.TestSingleArg (678 of 1785) PASS: lldb-unit :: Process/minidump/./LLDBMinidumpTests/MinidumpParserTest.GetArchitecture (679 of 1785) PASS: lldb-unit :: Process/gdb-remote/./ProcessGdbRemoteTests/GDBRemoteCommunicationServerTest.SendErrorResponse_Status (680 of 1785) PASS: lldb-unit :: Utility/./UtilityTests/StringExtractorTest.GetHexBytesAvail_OddPair (681 of 1785) PASS: lldb-unit :: Utility/./UtilityTests/RecordReplayTest.InstrumentedBarRef (682 of 1785) PASS: lldb-api :: commands/expression/argument_passing_restrictions/TestArgumentPassingRestrictions.py (683 of 1785) PASS: lldb-shell :: Quit/TestQuitExitCodeNonInt.test (684 of 1785) PASS: lldb-api :: functionalities/data-formatter/ostypeformatting/TestFormattersOsType.py (685 of 1785) PASS: lldb-unit :: Utility/./UtilityTests/ConstStringTest.CompareStringRef (686 of 1785) PASS: lldb-api :: lang/objc/foundation/TestObjCMethodsString.py (687 of 1785) PASS: lldb-unit :: Utility/./UtilityTests/RangeTest.SizeTypes (688 of 1785) PASS: lldb-unit :: Utility/./UtilityTests/StringListTest.GetMaxStringLengthMixed (689 of 1785) PASS: lldb-unit :: UnwindAssembly/x86/./UnwindAssemblyx86Tests/Testx86AssemblyInspectionEngine.TestPush0 (690 of 1785) PASS: lldb-unit :: UnwindAssembly/x86/./UnwindAssemblyx86Tests/Testx86AssemblyInspectionEngine.TestPopRBPWithREX (691 of 1785) PASS: lldb-api :: commands/expression/call-overridden-method/TestCallOverriddenMethod.py (692 of 1785) UNSUPPORTED: lldb-api :: commands/expression/multiline-completion/TestMultilineCompletion.py (693 of 1785) PASS: lldb-shell :: SymbolFile/NativePDB/function-types-classes.cpp (694 of 1785) PASS: lldb-api :: lang/objc/objc-ivar-offsets/TestObjCIvarOffsets.py (695 of 1785) PASS: lldb-api :: functionalities/conditional_break/TestConditionalBreak.py (696 of 1785) PASS: lldb-unit :: Utility/./UtilityTests/ArgsTest.TestOverwriteArgs (697 of 1785) PASS: lldb-unit :: Utility/./UtilityTests/ScalarTest.SetValueFromCString (698 of 1785) PASS: lldb-unit :: Expression/./ExpressionTests/ClangHostTest.ComputeClangResourceDirectory (699 of 1785) PASS: lldb-unit :: debugserver/./debugserverTests/RNBSocket.LoopBackConnectIPv4 (700 of 1785) PASS: lldb-unit :: Utility/./UtilityTests/StringListTest.CopyList (701 of 1785) PASS: lldb-unit :: Symbol/./SymbolTests/LineEntryTest.GetSameLineContiguousAddressRangeNestedInline (702 of 1785) PASS: lldb-unit :: Utility/./UtilityTests/UriParserTest.MinimalPort (703 of 1785) UNSUPPORTED: lldb-api :: benchmarks/startup/TestStartupDelays.py (704 of 1785) PASS: lldb-api :: commands/frame/diagnose/inheritance/TestDiagnoseInheritance.py (705 of 1785) PASS: lldb-unit :: Utility/./UtilityTests/LogChannelEnabledTest.LogGetLogThread (706 of 1785) UNSUPPORTED: lldb-shell :: Register/x86-zmm-read.test (707 of 1785) PASS: lldb-unit :: Process/minidump/./LLDBMinidumpTests/MinidumpParserTest.GetMemoryRegionInfoLinuxMaps (708 of 1785) UNSUPPORTED: lldb-shell :: Register/x86-64-ymm16-read.test (709 of 1785) PASS: lldb-unit :: Utility/./UtilityTests/RangeTest.DefaultConstructor (710 of 1785) PASS: lldb-api :: functionalities/thread/concurrent_events/TestConcurrentBreakpointsDelayedBreakpointOneWatchpoint.py (711 of 1785) PASS: lldb-api :: functionalities/data-formatter/data-formatter-synthval/TestDataFormatterSynthVal.py (712 of 1785) PASS: lldb-api :: commands/command/nested_alias/TestNestedAlias.py (713 of 1785) PASS: lldb-api :: commands/frame/recognizer/TestFrameRecognizer.py (714 of 1785) PASS: lldb-api :: lang/objc/single-entry-dictionary/TestObjCSingleEntryDictionary.py (715 of 1785) PASS: lldb-shell :: Register/x86-64-gp-read.test (716 of 1785) PASS: lldb-unit :: ObjectFile/Breakpad/./ObjectFileBreakpadTests/ModuleRecord.parse (717 of 1785) PASS: lldb-unit :: Utility/./UtilityTests/TimerTest.CategoryTimesStats (718 of 1785) PASS: lldb-api :: commands/statistics/basic/TestStats.py (719 of 1785) PASS: lldb-api :: lang/objc/foundation/TestObjCMethodsNSArray.py (720 of 1785) PASS: lldb-api :: functionalities/show_location/TestShowLocationDwarf5.py (721 of 1785) PASS: lldb-api :: functionalities/rerun/TestRerun.py (722 of 1785) PASS: lldb-api :: commands/expression/import-std-module/stack/TestStack.py (723 of 1785) PASS: lldb-unit :: Utility/./UtilityTests/RangeTest.ContainsEndInclusiveInvalid (724 of 1785) PASS: lldb-api :: functionalities/gdb_remote_client/TestNoWatchpointSupportInfo.py (725 of 1785) PASS: lldb-api :: functionalities/multidebugger_commands/TestMultipleDebuggersCommands.py (726 of 1785) PASS: lldb-unit :: Utility/./UtilityTests/ArgsTest.TestQuotedTrailingBackslash (727 of 1785) PASS: lldb-unit :: Utility/./UtilityTests/DataExtractorTest.GetCStrAtEnd (728 of 1785) PASS: lldb-shell :: Commands/command-source.test (729 of 1785) PASS: lldb-api :: functionalities/data-formatter/refpointer-recursion/TestDataFormatterRefPtrRecursion.py (730 of 1785) UNSUPPORTED: lldb-shell :: SymbolFile/PDB/ast-restore.test (731 of 1785) PASS: lldb-api :: functionalities/data-formatter/data-formatter-categories/TestDataFormatterCategories.py (732 of 1785) PASS: lldb-unit :: ScriptInterpreter/Python/./ScriptInterpreterPythonTests/PythonDataObjectsTest.TestTypeNameResolutionNoDot (733 of 1785) UNSUPPORTED: lldb-shell :: Register/x86-ymm-read.test (734 of 1785) PASS: lldb-unit :: Utility/./UtilityTests/ArchSpecTest.MergeFrom (735 of 1785) UNSUPPORTED: lldb-shell :: SymbolFile/PDB/vbases.test (736 of 1785) PASS: lldb-unit :: Utility/./UtilityTests/Flags.Clear (737 of 1785) PASS: lldb-unit :: Utility/./UtilityTests/StringListTest.Join (738 of 1785) PASS: lldb-api :: python_api/signals/TestSignalsAPI.py (739 of 1785) PASS: lldb-api :: lang/objc/radar-9691614/TestObjCMethodReturningBOOL.py (740 of 1785) PASS: lldb-unit :: ScriptInterpreter/Python/./ScriptInterpreterPythonTests/PythonDataObjectsTest.TestPythonDictionaryToStructuredDictionary (741 of 1785) PASS: lldb-api :: macosx/function-starts/TestFunctionStarts.py (742 of 1785) PASS: lldb-shell :: ObjectFile/PECOFF/basic-info-arm.yaml (743 of 1785) PASS: lldb-unit :: Process/minidump/./LLDBMinidumpTests/MinidumpParserTest.InvalidMinidump (744 of 1785) PASS: lldb-unit :: SymbolFile/NativePDB/./SymbolFileNativePDBTests/PDBFPOProgramToDWARFExpressionTests.InvalidAssignmentSingle (745 of 1785) PASS: lldb-shell :: SymbolFile/DWARF/compilercontext.ll (746 of 1785) UNSUPPORTED: lldb-shell :: SymbolFile/PDB/expressions.test (747 of 1785) PASS: lldb-api :: commands/frame/diagnose/local-variable/TestLocalVariable.py (748 of 1785) PASS: lldb-api :: lang/objc/exceptions/TestObjCExceptions.py (749 of 1785) PASS: lldb-unit :: Utility/./UtilityTests/StringListTest.Clear (750 of 1785) PASS: lldb-api :: functionalities/abbreviation/TestCommonShortSpellings.py (751 of 1785) PASS: lldb-unit :: Utility/./UtilityTests/RegularExpression.Valid (752 of 1785) PASS: lldb-api :: commands/expression/formatters/TestFormatters.py (753 of 1785) UNSUPPORTED: lldb-api :: macosx/macabi/TestMacABImacOSFramework.py (754 of 1785) PASS: lldb-api :: commands/register/register/register_command/TestRegisters.py (755 of 1785) PASS: lldb-api :: commands/expression/expr-in-syscall/TestExpressionInSyscall.py (756 of 1785) PASS: lldb-api :: functionalities/breakpoint/objc/TestObjCBreakpoints.py (757 of 1785) PASS: lldb-shell :: ObjectFile/MachO/lc_version_min.yaml (758 of 1785) PASS: lldb-unit :: Process/minidump/./LLDBMinidumpTests/MinidumpParserTest.GetThreadsAndGetThreadContext (759 of 1785) PASS: lldb-api :: commands/gui/invalid-args/TestInvalidArgsGui.py (760 of 1785) PASS: lldb-shell :: Minidump/disassemble-no-module.yaml (761 of 1785) UNSUPPORTED: lldb-api :: functionalities/tty/TestTerminal.py (762 of 1785) PASS: lldb-shell :: ObjectFile/ELF/duplicate-section.yaml (763 of 1785) UNSUPPORTED: lldb-api :: lang/c/typedef/Testtypedef.py (764 of 1785) PASS: lldb-unit :: Utility/./UtilityTests/StringExtractorTest.GetNameColonValueNoSemicolon (765 of 1785) PASS: lldb-api :: functionalities/breakpoint/breakpoint_hit_count/TestBreakpointHitCount.py (766 of 1785) PASS: lldb-unit :: Utility/./UtilityTests/FileSpecTest.GuessPathStyle (767 of 1785) PASS: lldb-api :: functionalities/load_unload/TestLoadUnload.py (768 of 1785) PASS: lldb-api :: commands/expression/anonymous-struct/TestCallUserAnonTypedef.py (769 of 1785) PASS: lldb-api :: python_api/lldbutil/iter/TestRegistersIterator.py (770 of 1785) PASS: lldb-unit :: Utility/./UtilityTests/StreamTest.PutHex32ByteOrderLittle (771 of 1785) PASS: lldb-unit :: Utility/./UtilityTests/RangeTest.EqualInvalid (772 of 1785) PASS: lldb-unit :: debugserver/./debugserverTests/RNBSocket.LoopBackListenIPv6 (773 of 1785) PASS: lldb-unit :: Utility/./UtilityTests/StringExtractorTest.DecodeHexU8_Underflow2 (774 of 1785) PASS: lldb-shell :: Breakpoint/debug_rnglist_offset_pair.test (775 of 1785) PASS: lldb-unit :: Language/Highlighting/./HighlighterTests/HighlighterTest.HighlighterSelectionType (776 of 1785) PASS: lldb-unit :: Utility/./UtilityTests/ArgsTest.StringListConstructor (777 of 1785) PASS: lldb-unit :: Core/./LLDBCoreTests/RichManglingContextTest.SwitchProvider (778 of 1785) PASS: lldb-api :: functionalities/data-formatter/vector-types/TestVectorTypesFormatting.py (779 of 1785) PASS: lldb-unit :: SymbolFile/DWARF/./SymbolFileDWARFTests/SymbolFileDWARFTests.TestAbbrevOrder1Start5 (780 of 1785) PASS: lldb-api :: functionalities/gdb_remote_client/TestRestartBug.py (781 of 1785) PASS: lldb-api :: types/TestIntegerTypesExpr.py (782 of 1785) PASS: lldb-shell :: Quit/TestQuitExitCodeHex0.test (783 of 1785) UNSUPPORTED: lldb-api :: functionalities/process_save_core/TestProcessSaveCore.py (784 of 1785) PASS: lldb-unit :: UnwindAssembly/x86/./UnwindAssemblyx86Tests/Testx86AssemblyInspectionEngine.TestSpArithx86_64Augmented (785 of 1785) PASS: lldb-unit :: Utility/./UtilityTests/RangeTest.DoesAdjoinOrIntersect (786 of 1785) PASS: lldb-unit :: Process/minidump/./LLDBMinidumpTests/MinidumpParserTest.GetArchitectureWindows (787 of 1785) PASS: lldb-api :: lang/c/global_variables/TestGlobalVariables.py (788 of 1785) PASS: lldb-unit :: UnwindAssembly/x86/./UnwindAssemblyx86Tests/Testx86AssemblyInspectionEngine.TestPushR14 (789 of 1785) PASS: lldb-api :: commands/expression/import-std-module/deque-basic/TestBasicDeque.py (790 of 1785) PASS: lldb-api :: lang/c/struct_types/TestStructTypes.py (791 of 1785) PASS: lldb-api :: functionalities/set-data/TestSetData.py (792 of 1785) PASS: lldb-shell :: SymbolFile/DWARF/find-basic-type.cpp (793 of 1785) PASS: lldb-api :: commands/watchpoints/watchpoint_commands/condition/TestWatchpointConditionCmd.py (794 of 1785) PASS: lldb-api :: lang/cpp/unicode-literals/TestUnicodeLiterals.py (795 of 1785) PASS: lldb-unit :: Utility/./UtilityTests/ArgsTest.TestQuotedUnknownEscape (796 of 1785) PASS: lldb-api :: functionalities/thread/concurrent_events/TestConcurrentSignalWatchBreak.py (797 of 1785) PASS: lldb-api :: functionalities/thread/concurrent_events/TestConcurrentWatchBreakDelay.py (798 of 1785) PASS: lldb-shell :: Reproducer/TestWorkingDir.test (799 of 1785) UNSUPPORTED: lldb-api :: functionalities/data-formatter/data-formatter-stl/libstdcpp/vbool/TestDataFormatterStdVBool.py (800 of 1785) PASS: lldb-api :: commands/frame/diagnose/dereference-argument/TestDiagnoseDereferenceArgument.py (801 of 1785) PASS: lldb-api :: lang/cpp/operators/TestCppOperators.py (802 of 1785) PASS: lldb-unit :: Process/gdb-remote/./ProcessGdbRemoteTests/GDBRemoteCommunicationClientTest.ReadRegister (803 of 1785) PASS: lldb-unit :: Utility/./UtilityTests/ScalarTest.Promotion (804 of 1785) PASS: lldb-shell :: Breakpoint/implicit_const_form_support.test (805 of 1785) PASS: lldb-unit :: tools/lldb-server/tests/./LLDBServerTests/TestBase.LaunchModePreservesEnvironment (806 of 1785) UNSUPPORTED: lldb-api :: functionalities/darwin_log/filter/exact_match/message/TestDarwinLogFilterMatchMessage.py (807 of 1785) PASS: lldb-shell :: SymbolFile/DWARF/childless-compile-unit.s (808 of 1785) PASS: lldb-api :: macosx/order/TestOrderFile.py (809 of 1785) PASS: lldb-api :: lang/cpp/extern_c/TestExternCSymbols.py (810 of 1785) PASS: lldb-shell :: ObjectFile/ELF/netbsd-core-amd64.test (811 of 1785) PASS: lldb-api :: python_api/process/io/TestProcessIO.py (812 of 1785) PASS: lldb-unit :: Process/minidump/./LLDBMinidumpTests/MinidumpParserTest.MinidumpDuplicateModuleMinAddress (813 of 1785) UNSUPPORTED: lldb-api :: functionalities/darwin_log/filter/exact_match/subsystem/TestDarwinLogFilterMatchSubsystem.py (814 of 1785) UNSUPPORTED: lldb-api :: arm/breakpoint-it/TestBreakpointIt.py (815 of 1785) PASS: lldb-unit :: Utility/./UtilityTests/ProcessInstanceInfo.DumpTable_invalidUID (816 of 1785) PASS: lldb-api :: lang/cpp/char1632_t/TestChar1632T.py (817 of 1785) PASS: lldb-api :: functionalities/thread/concurrent_events/TestConcurrentTwoBreakpointsOneSignal.py (818 of 1785) PASS: lldb-api :: lang/objcxx/objcxx-ivar-vector/TestIvarVector.py (819 of 1785) PASS: lldb-shell :: Reproducer/TestDriverOptions.test (820 of 1785) PASS: lldb-unit :: Utility/./UtilityTests/CompletionRequest.DuplicateFilteringWithComments (821 of 1785) PASS: lldb-api :: functionalities/data-formatter/data-formatter-python-synth/TestDataFormatterPythonSynth.py (822 of 1785) PASS: lldb-api :: tools/lldb-server/commandline/TestStubReverseConnect.py (823 of 1785) PASS: lldb-unit :: Language/Highlighting/./HighlighterTests/HighlighterTest.ClangEmptyInput (824 of 1785) PASS: lldb-api :: lang/c/stepping/TestThreadStepping.py (825 of 1785) PASS: lldb-api :: commands/expression/no-deadlock/TestExprDoesntBlock.py (826 of 1785) PASS: lldb-unit :: Utility/./UtilityTests/ArgsTest.TestInsertArg (827 of 1785) PASS: lldb-unit :: ScriptInterpreter/Python/./ScriptInterpreterPythonTests/PythonDataObjectsTest.TestPythonIntegerToStr (828 of 1785) PASS: lldb-shell :: SymbolFile/DWARF/deterministic-build.cpp (829 of 1785) PASS: lldb-api :: python_api/frame/TestFrames.py (830 of 1785) PASS: lldb-unit :: Utility/./UtilityTests/DataExtractorTest.GetCStrEmpty (831 of 1785) UNSUPPORTED: lldb-shell :: SymbolFile/PDB/variables-locations.test (832 of 1785) PASS: lldb-api :: functionalities/thread/concurrent_events/TestConcurrentManyCrash.py (833 of 1785) PASS: lldb-unit :: Symbol/./SymbolTests/LineEntryTest.GetSameLineContiguousAddressRangeOneInline (834 of 1785) XFAIL: lldb-shell :: Unwind/prefer-debug-over-eh-frame.test (835 of 1785) PASS: lldb-api :: functionalities/breakpoint/require_hw_breakpoints/TestRequireHWBreakpoints.py (836 of 1785) PASS: lldb-shell :: Breakpoint/debug_rnglistx_rlex.test (837 of 1785) PASS: lldb-api :: functionalities/tail_call_frames/disambiguate_call_site/TestDisambiguateCallSite.py (838 of 1785) PASS: lldb-unit :: Interpreter/./InterpreterTests/OptionArgParserTest.toChar (839 of 1785) PASS: lldb-api :: functionalities/param_entry_vals/basic_entry_values_x86_64/TestBasicEntryValuesX86_64.py (840 of 1785) PASS: lldb-api :: python_api/watchpoint/TestSetWatchpoint.py (841 of 1785) PASS: lldb-shell :: Expr/TestMultilineExpr.test (842 of 1785) PASS: lldb-unit :: ObjectFile/PECOFF/./ObjectFilePECOFFTests/PECallFrameInfoTest.Basic_eh (843 of 1785) PASS: lldb-unit :: Process/gdb-remote/./ProcessGdbRemoteTests/GDBRemoteClientBaseTest.SendPacketAndReceiveResponseWithOutputSupport (844 of 1785) PASS: lldb-unit :: UnwindAssembly/x86/./UnwindAssemblyx86Tests/Testx86AssemblyInspectionEngine.TestDisassemblyJunkBytes (845 of 1785) PASS: lldb-api :: lang/cpp/template-function/TestTemplateFunctions.py (846 of 1785) PASS: lldb-unit :: Process/gdb-remote/./ProcessGdbRemoteTests/GDBRemoteCommunicationClientTest.GetModulesInfoInvalidResponse (847 of 1785) PASS: lldb-shell :: SymbolFile/DWARF/find-inline-method.s (848 of 1785) PASS: lldb-unit :: Utility/./UtilityTests/StringListTest.PopBack (849 of 1785) PASS: lldb-unit :: Utility/./UtilityTests/ReproducerTest.SetCapture (850 of 1785) PASS: lldb-unit :: Language/Highlighting/./HighlighterTests/HighlighterTest.ClangCursorPos (851 of 1785) UNSUPPORTED: lldb-shell :: Process/Windows/exception_access_violation.cpp (852 of 1785) PASS: lldb-unit :: UnwindAssembly/x86/./UnwindAssemblyx86Tests/Testx86AssemblyInspectionEngine.TestPopEBX (853 of 1785) PASS: lldb-api :: tools/lldb-server/TestAppleSimulatorOSType.py (854 of 1785) PASS: lldb-api :: functionalities/data-formatter/frameformat_smallstruct/TestFrameFormatSmallStruct.py (855 of 1785) PASS: lldb-shell :: ObjectFile/ELF/aarch64-relocations.yaml (856 of 1785) PASS: lldb-api :: functionalities/thread/concurrent_events/TestConcurrentCrashWithWatchpointBreakpointSignal.py (857 of 1785) PASS: lldb-unit :: Utility/./UtilityTests/StreamTest.PutHex64ByteOrderBig (858 of 1785) PASS: lldb-unit :: Utility/./UtilityTests/StringExtractorTest.DecodeHexU8_InvalidHex2 (859 of 1785) UNSUPPORTED: lldb-api :: functionalities/darwin_log/basic/TestDarwinLogBasic.py (860 of 1785) UNSUPPORTED: lldb-api :: api/multiple-debuggers/TestMultipleDebuggers.py (861 of 1785) PASS: lldb-unit :: Utility/./UtilityTests/Flags.AnySet (862 of 1785) UNSUPPORTED: lldb-api :: android/platform/TestDefaultCacheLineSize.py (863 of 1785) PASS: lldb-api :: functionalities/breakpoint/breakpoint_command/TestBreakpointCommandsFromPython.py (864 of 1785) PASS: lldb-unit :: UnwindAssembly/x86/./UnwindAssemblyx86Tests/Testx86AssemblyInspectionEngine.TestPushR15 (865 of 1785) PASS: lldb-shell :: Driver/TestTarget.test (866 of 1785) PASS: lldb-api :: lang/cpp/breakpoint-commands/TestCPPBreakpointCommands.py (867 of 1785) PASS: lldb-api :: commands/expression/import-std-module/vector-of-vectors/TestVectorOfVectors.py (868 of 1785) PASS: lldb-api :: lang/objc/modules-incomplete/TestIncompleteModules.py (869 of 1785) PASS: lldb-unit :: Host/./HostTests/SocketTest.DomainGetConnectURI (870 of 1785) PASS: lldb-api :: functionalities/tsan/global_location/TestTsanGlobalLocation.py (871 of 1785) PASS: lldb-api :: functionalities/breakpoint/serialize/TestBreakpointSerialization.py (872 of 1785) PASS: lldb-unit :: ScriptInterpreter/Python/./ScriptInterpreterPythonTests/PythonDataObjectsTest.TestPythonCallableInvoke (873 of 1785) PASS: lldb-unit :: Host/./HostTests/FileSystemTest.EnumerateDirectory (874 of 1785) PASS: lldb-unit :: Utility/./UtilityTests/StringListTest.GetMaxStringLengthEmpty (875 of 1785) PASS: lldb-api :: functionalities/postmortem/elf-core/TestLinuxCore.py (876 of 1785) PASS: lldb-unit :: UnwindAssembly/x86/./UnwindAssemblyx86Tests/Testx86AssemblyInspectionEngine.Testi386IgnoredRegisters (877 of 1785) PASS: lldb-api :: api/check_public_api_headers/TestPublicAPIHeaders.py (878 of 1785) PASS: lldb-unit :: SymbolFile/DWARF/./SymbolFileDWARFTests/SymbolFileDWARFTests.TestAbilitiesForDWARF (879 of 1785) PASS: lldb-unit :: Utility/./UtilityTests/RangeTest.NotEqual (880 of 1785) PASS: lldb-unit :: SymbolFile/NativePDB/./SymbolFileNativePDBTests/PDBFPOProgramToDWARFExpressionTests.UnresolvedCyclicRegisterAssignmentReference (881 of 1785) PASS: lldb-api :: lang/cpp/namespace_definitions/TestNamespaceDefinitions.py (882 of 1785) PASS: lldb-shell :: ObjectFile/ELF/base-address.yaml (883 of 1785) PASS: lldb-unit :: SymbolFile/NativePDB/./SymbolFileNativePDBTests/PDBFPOProgramToDWARFExpressionTests.MultipleDependentAssignments (884 of 1785) PASS: lldb-unit :: UnwindAssembly/x86/./UnwindAssemblyx86Tests/Testx86AssemblyInspectionEngine.TestStackRealign32BitDisp_x86_64 (885 of 1785) PASS: lldb-unit :: SymbolFile/NativePDB/./SymbolFileNativePDBTests/PDBFPOProgramToDWARFExpressionTests.UnresolvedRegisterAssignmentReference (886 of 1785) PASS: lldb-unit :: Utility/./UtilityTests/AnsiTerminal.Twice (887 of 1785) PASS: lldb-shell :: ObjectFile/ELF/PT_LOAD-empty.yaml (888 of 1785) UNSUPPORTED: lldb-shell :: SymbolFile/PDB/func-symbols.test (889 of 1785) PASS: lldb-unit :: Utility/./UtilityTests/StringExtractorTest.GetNameColonValueNoColon (890 of 1785) PASS: lldb-unit :: Utility/./UtilityTests/RangeTest.Equal (891 of 1785) PASS: lldb-api :: lang/c/blocks/TestBlocks.py (892 of 1785) PASS: lldb-api :: python_api/process/read-mem-cstring/TestReadMemCString.py (893 of 1785) PASS: lldb-api :: lang/objc/objc-static-method/TestObjCStaticMethod.py (894 of 1785) PASS: lldb-api :: python_api/frame/inlines/TestInlinedFrame.py (895 of 1785) PASS: lldb-api :: functionalities/data-formatter/data-formatter-synth/TestDataFormatterSynth.py (896 of 1785) PASS: lldb-shell :: SymbolFile/DWARF/find-basic-variable.cpp (897 of 1785) UNSUPPORTED: lldb-api :: functionalities/darwin_log/filter/regex/category/TestDarwinLogFilterRegexCategory.py (898 of 1785) PASS: lldb-shell :: ObjectFile/ELF/section-overlap.yaml (899 of 1785) PASS: lldb-unit :: UnwindAssembly/x86/./UnwindAssemblyx86Tests/Testx86AssemblyInspectionEngine.TestSimplex86_64Augmented (900 of 1785) PASS: lldb-unit :: Interpreter/./InterpreterTests/OptionArgParserTest.toBoolean (901 of 1785) UNSUPPORTED: lldb-api :: functionalities/darwin_log/filter/regex/message/TestDarwinLogFilterRegexMessage.py (902 of 1785) PASS: lldb-unit :: ScriptInterpreter/Python/./ScriptInterpreterPythonTests/PythonDataObjectsTest.TestPythonStringToStructuredString (903 of 1785) PASS: lldb-unit :: UnwindAssembly/x86/./UnwindAssemblyx86Tests/Testx86AssemblyInspectionEngine.Test32bitFramelessSmallStackFrame (904 of 1785) PASS: lldb-api :: functionalities/thread/concurrent_events/TestConcurrentSignalBreak.py (905 of 1785) PASS: lldb-api :: functionalities/fat_archives/TestFatArchives.py (906 of 1785) PASS: lldb-unit :: Utility/./UtilityTests/StreamTest.PutPtr (907 of 1785) PASS: lldb-unit :: Symbol/./SymbolTests/DWARFCallFrameInfoTest.Basic_dwarf3 (908 of 1785) PASS: lldb-unit :: Utility/./UtilityTests/ArgsTest.GetQuotedCommandString (909 of 1785) PASS: lldb-shell :: Host/TestCustomShell.test (910 of 1785) UNSUPPORTED: lldb-shell :: SymbolFile/PDB/enums-layout.test (911 of 1785) UNSUPPORTED: lldb-api :: functionalities/data-formatter/data-formatter-stl/libstdcpp/vector/TestDataFormatterStdVector.py (912 of 1785) PASS: lldb-shell :: SymbolFile/DWARF/find-basic-function.cpp (913 of 1785) PASS: lldb-api :: commands/expression/pr35310/TestExprsBug35310.py (914 of 1785) UNSUPPORTED: lldb-shell :: SymbolFile/PDB/class-layout.test (915 of 1785) PASS: lldb-unit :: Utility/./UtilityTests/StreamTest.PutCharWhitespace (916 of 1785) PASS: lldb-api :: lang/c/step-target/TestStepTarget.py (917 of 1785) PASS: lldb-unit :: Host/./HostTests/MainLoopTest.ReadObject (918 of 1785) PASS: lldb-api :: tools/lldb-server/inferior-crash/TestGdbRemoteSegFault.py (919 of 1785) PASS: lldb-shell :: SymbolFile/DWARF/split-dwarf-multiple-cu.ll (920 of 1785) UNSUPPORTED: lldb-shell :: BuildScript/toolchain-clang-cl.test (921 of 1785) PASS: lldb-unit :: Utility/./UtilityTests/ConstStringTest.CompareConstString (922 of 1785) UNSUPPORTED: lldb-api :: tools/lldb-server/libraries-svr4/TestGdbRemoteLibrariesSvr4Support.py (923 of 1785) PASS: lldb-unit :: ObjectFile/ELF/./ObjectFileELFTests/ObjectFileELFTest.GetModuleSpecifications_EarlySectionHeaders (924 of 1785) PASS: lldb-unit :: Host/./HostTests/FileSystemTest.Readable (925 of 1785) PASS: lldb-unit :: Host/./HostTests/NativeProcessProtocolTest.SetBreakpointFailWrite (926 of 1785) PASS: lldb-api :: commands/expression/options/TestExprOptions.py (927 of 1785) PASS: lldb-api :: functionalities/thread/backtrace_all/TestBacktraceAll.py (928 of 1785) PASS: lldb-unit :: UnwindAssembly/x86/./UnwindAssemblyx86Tests/Testx86AssemblyInspectionEngine.TestPopR13 (929 of 1785) PASS: lldb-api :: lang/cpp/virtual/TestVirtual.py (930 of 1785) PASS: lldb-unit :: Process/gdb-remote/./ProcessGdbRemoteTests/GDBRemoteClientBaseTest.SendContinueAndAsyncPacket (931 of 1785) PASS: lldb-api :: commands/expression/class_template_specialization_empty_pack/TestClassTemplateSpecializationParametersHandling.py (932 of 1785) PASS: lldb-api :: commands/expression/persist_objc_pointeetype/TestPersistObjCPointeeType.py (933 of 1785) PASS: lldb-unit :: Utility/./UtilityTests/LogChannelEnabledTest.LLDB_LOG_ERROR (934 of 1785) PASS: lldb-unit :: Utility/./UtilityTests/Flags.GetBitSize (935 of 1785) PASS: lldb-api :: commands/source/info/TestSourceInfo.py (936 of 1785) PASS: lldb-unit :: Core/./LLDBCoreTests/RichManglingContextTest.FromCxxMethodName (937 of 1785) PASS: lldb-unit :: ScriptInterpreter/Python/./ScriptInterpreterPythonTests/PythonDataObjectsTest.TestPythonBoolean (938 of 1785) PASS: lldb-unit :: Process/gdb-remote/./ProcessGdbRemoteTests/GDBRemoteCommunicationClientTest.WriteRegister (939 of 1785) PASS: lldb-unit :: Expression/./ExpressionTests/CppModuleConfigurationTest.MissingUsrInclude (940 of 1785) PASS: lldb-unit :: Target/./TargetTests/ExecutionContextTest.GetByteOrderProcess (941 of 1785) PASS: lldb-api :: functionalities/asan/TestMemoryHistory.py (942 of 1785) PASS: lldb-unit :: Utility/./UtilityTests/StringExtractorTest.GetHexU8_Extra (943 of 1785) PASS: lldb-api :: functionalities/thread/concurrent_events/TestConcurrentBreakpointDelayBreakpointOneSignal.py (944 of 1785) UNSUPPORTED: lldb-api :: functionalities/thread/create_during_step/TestCreateDuringStep.py (945 of 1785) PASS: lldb-unit :: Expression/./ExpressionTests/DWARFExpression.DW_OP_pick (946 of 1785) PASS: lldb-unit :: Utility/./UtilityTests/VMRange.Reset (947 of 1785) PASS: lldb-api :: functionalities/data-formatter/data-formatter-named-summaries/TestDataFormatterNamedSummaries.py (948 of 1785) PASS: lldb-unit :: Utility/./UtilityTests/StringExtractorTest.GetHexBytes_OddPair2 (949 of 1785) UNSUPPORTED: lldb-api :: functionalities/data-formatter/data-formatter-stl/libstdcpp/unique_ptr/TestDataFormatterStdUniquePtr.py (950 of 1785) PASS: lldb-unit :: Utility/./UtilityTests/UserIDResolver.GetGroupName (951 of 1785) PASS: lldb-unit :: SymbolFile/DWARF/./SymbolFileDWARFTests/SymbolFileDWARFTests.TestAbbrevValidAttrNullForm (952 of 1785) PASS: lldb-unit :: Symbol/./SymbolTests/TestClangASTContext.TestConvertAccessTypeToAccessSpecifier (953 of 1785) PASS: lldb-unit :: Utility/./UtilityTests/ArgsTest.TestTrailingBackslash (954 of 1785) PASS: lldb-shell :: SymbolFile/Breakpad/unwind-via-stack-cfi.test (955 of 1785) PASS: lldb-unit :: UnwindAssembly/x86/./UnwindAssemblyx86Tests/Testx86AssemblyInspectionEngine.TestPopEDI (956 of 1785) PASS: lldb-unit :: Utility/./UtilityTests/StreamTest.PutSLEB128 (957 of 1785) UNSUPPORTED: lldb-api :: functionalities/signal/handle-segv/TestHandleSegv.py (958 of 1785) PASS: lldb-unit :: Utility/./UtilityTests/StreamTeeTest.Constructor1Stream (959 of 1785) PASS: lldb-unit :: Utility/./UtilityTests/StringListTest.LongestCommonPrefixNoPrefix (960 of 1785) PASS: lldb-unit :: Utility/./UtilityTests/ConstStringTest.format_provider (961 of 1785) PASS: lldb-api :: commands/expression/import-std-module/weak_ptr/TestWeakPtr.py (962 of 1785) PASS: lldb-api :: commands/version/TestVersion.py (963 of 1785) PASS: lldb-unit :: SymbolFile/NativePDB/./SymbolFileNativePDBTests/PDBFPOProgramToDWARFExpressionTests.DependencyChain (964 of 1785) PASS: lldb-unit :: Utility/./UtilityTests/GeneratorTest.GetOrCreate (965 of 1785) PASS: lldb-shell :: SymbolFile/DWARF/dir-separator-no-comp-dir-relative-name.s (966 of 1785) PASS: lldb-unit :: Utility/./UtilityTests/Flags.Test (967 of 1785) PASS: lldb-unit :: Utility/./UtilityTests/StateTest.Formatv (968 of 1785) PASS: lldb-api :: commands/command/script/TestCommandScript.py (969 of 1785) PASS: lldb-api :: functionalities/gdb_remote_client/TestThreadSelectionBug.py (970 of 1785) PASS: lldb-api :: commands/expression/ignore-artificial-constructors/TestIgnoreArtificialConstructors.py (971 of 1785) PASS: lldb-shell :: ObjectFile/ELF/short-build-id.yaml (972 of 1785) PASS: lldb-api :: lang/cpp/unsigned_types/TestUnsignedTypes.py (973 of 1785) PASS: lldb-unit :: UnwindAssembly/x86/./UnwindAssemblyx86Tests/Testx86AssemblyInspectionEngine.TestPushR13 (974 of 1785) PASS: lldb-api :: functionalities/thread/concurrent_events/TestConcurrentTwoBreakpointsOneDelaySignal.py (975 of 1785) PASS: lldb-shell :: ObjectFile/Breakpad/discontiguous-sections.test (976 of 1785) UNSUPPORTED: lldb-api :: functionalities/data-formatter/data-formatter-stl/libstdcpp/map/TestDataFormatterStdMap.py (977 of 1785) PASS: lldb-api :: python_api/function_symbol/TestDisasmAPI.py (978 of 1785) PASS: lldb-api :: commands/expression/radar_9673664/TestExprHelpExamples.py (979 of 1785) PASS: lldb-unit :: Utility/./UtilityTests/NameMatchesTest.RegularExpression (980 of 1785) PASS: lldb-api :: lang/cpp/offsetof/TestOffsetofCpp.py (981 of 1785) PASS: lldb-unit :: Utility/./UtilityTests/ScalarTest.ExtractBitfield (982 of 1785) PASS: lldb-unit :: Utility/./UtilityTests/StringExtractorTest.GetHexBytes_OddPair (983 of 1785) PASS: lldb-api :: macosx/thread-names/TestInterruptThreadNames.py (984 of 1785) PASS: lldb-api :: python_api/findvalue_duplist/TestSBFrameFindValue.py (985 of 1785) PASS: lldb-api :: tools/lldb-server/TestGdbRemote_qThreadStopInfo.py (986 of 1785) PASS: lldb-api :: lang/c/modules/TestCModules.py (987 of 1785) PASS: lldb-api :: lang/objc/foundation/TestFoundationDisassembly.py (988 of 1785) PASS: lldb-api :: commands/expression/rdar44436068/Test128BitsInteger.py (989 of 1785) PASS: lldb-shell :: Commands/command-backtrace.test (990 of 1785) PASS: lldb-unit :: Host/./HostTests/ProcessLaunchInfoTest.Constructor (991 of 1785) PASS: lldb-unit :: Symbol/./SymbolTests/LineEntryTest.GetSameLineContiguousAddressRangeNoInlines (992 of 1785) PASS: lldb-api :: commands/watchpoints/step_over_watchpoint/TestStepOverWatchpoint.py (993 of 1785) UNSUPPORTED: lldb-shell :: Register/x86-64-gp-write.test (994 of 1785) PASS: lldb-unit :: Utility/./UtilityTests/ArgsTest.TestUnknownEscape (995 of 1785) PASS: lldb-shell :: SymbolFile/Breakpad/line-table.test (996 of 1785) PASS: lldb-api :: functionalities/postmortem/minidump/TestMiniDump.py (997 of 1785) UNSUPPORTED: lldb-shell :: Register/aarch64-fp-read.test (998 of 1785) PASS: lldb-unit :: Utility/./UtilityTests/ArgsTest.BareSingleQuote (999 of 1785) PASS: lldb-unit :: Utility/./UtilityTests/SerializationRountripTest.SerializeDeserializePodReferences (1000 of 1785) PASS: lldb-api :: commands/settings/TestSettings.py (1001 of 1785) PASS: lldb-unit :: Utility/./UtilityTests/ArgsTest.TestArgv (1002 of 1785) PASS: lldb-api :: commands/expression/call-function/TestCallStdStringFunction.py (1003 of 1785) PASS: lldb-unit :: Expression/./ExpressionTests/CppModuleConfigurationTest.AmbiguousLibCpp (1004 of 1785) PASS: lldb-unit :: ScriptInterpreter/Python/./ScriptInterpreterPythonTests/PythonExceptionStateTest.TestAcquisitionSemantics (1005 of 1785) PASS: lldb-shell :: ExecControl/StopHook/stop-hook.test (1006 of 1785) PASS: lldb-shell :: SymbolFile/Breakpad/line-table-mixed-path-styles.test (1007 of 1785) PASS: lldb-unit :: UnwindAssembly/x86/./UnwindAssemblyx86Tests/Testx86AssemblyInspectionEngine.TestPushImm (1008 of 1785) PASS: lldb-unit :: Expression/./ExpressionTests/CppModuleConfigurationTest.UnrelatedLibrary (1009 of 1785) PASS: lldb-api :: functionalities/dynamic_value_child_count/TestDynamicValueChildCount.py (1010 of 1785) PASS: lldb-api :: commands/expression/entry-bp/TestExprEntryBP.py (1011 of 1785) PASS: lldb-unit :: Utility/./UtilityTests/NameMatchesTest.EndsWith (1012 of 1785) PASS: lldb-api :: commands/expression/import-std-module/sysroot/TestStdModuleSysroot.py (1013 of 1785) PASS: lldb-unit :: Process/minidump/./LLDBMinidumpTests/MinidumpParserTest.GetThreadContext_x86_32 (1014 of 1785) UNSUPPORTED: lldb-shell :: Register/x86-64-zmm-write.test (1015 of 1785) PASS: lldb-api :: lang/objc/rdar-11355592/TestRdar11355592.py (1016 of 1785) PASS: lldb-api :: functionalities/data-formatter/language_category_updates/TestDataFormatterLanguageCategoryUpdates.py (1017 of 1785) UNSUPPORTED: lldb-shell :: Unwind/eh-frame-small-fde.test (1018 of 1785) UNSUPPORTED: lldb-api :: commands/expression/completion-crash2/TestCompletionCrash2.py (1019 of 1785) PASS: lldb-api :: python_api/watchpoint/TestWatchpointIgnoreCount.py (1020 of 1785) PASS: lldb-api :: lang/objc/blocks/TestObjCIvarsInBlocks.py (1021 of 1785) PASS: lldb-api :: lang/cpp/function_refs/TestFunctionRefs.py (1022 of 1785) PASS: lldb-api :: lang/cpp/class-template-parameter-pack/TestClassTemplateParameterPack.py (1023 of 1785) PASS: lldb-unit :: Utility/./UtilityTests/StreamTest.PutMaxHex64ByteOrderLittle (1024 of 1785) PASS: lldb-api :: functionalities/tail_call_frames/inlining_and_tail_calls/TestInliningAndTailCalls.py (1025 of 1785) PASS: lldb-api :: functionalities/archives/TestBSDArchives.py (1026 of 1785) PASS: lldb-unit :: Utility/./UtilityTests/LogChannelEnabledTest.LogVerboseThread (1027 of 1785) PASS: lldb-shell :: Driver/TestSingleQuote.test (1028 of 1785) PASS: lldb-unit :: Utility/./UtilityTests/StringListTest.LongestCommonPrefixSingleElement (1029 of 1785) PASS: lldb-shell :: SymbolFile/DWARF/find-qualified-variable.cpp (1030 of 1785) PASS: lldb-api :: functionalities/target_var/TestTargetVar.py (1031 of 1785) PASS: lldb-api :: python_api/module_section/TestModuleAndSection.py (1032 of 1785) PASS: lldb-api :: commands/frame/diagnose/complicated-expression/TestComplicatedExpression.py (1033 of 1785) PASS: lldb-unit :: ScriptInterpreter/Python/./ScriptInterpreterPythonTests/PythonDataObjectsTest.TestPythonListToStructuredList (1034 of 1785) PASS: lldb-shell :: SymbolFile/Breakpad/symtab-macho.test (1035 of 1785) PASS: lldb-api :: lang/c/anonymous/TestAnonymous.py (1036 of 1785) PASS: lldb-unit :: Utility/./UtilityTests/OptionsWithRawTest.ArgsButNoDelimiter (1037 of 1785) PASS: lldb-unit :: Utility/./UtilityTests/StreamTeeTest.AppendStream (1038 of 1785) PASS: lldb-api :: lang/objcxx/class-name-clash/TestNameClash.py (1039 of 1785) PASS: lldb-shell :: Driver/TestProcessAttach.test (1040 of 1785) PASS: lldb-api :: functionalities/thread/concurrent_events/TestConcurrentCrashWithWatchpoint.py (1041 of 1785) PASS: lldb-api :: lang/cpp/unique-types/TestUniqueTypes.py (1042 of 1785) PASS: lldb-api :: functionalities/data-formatter/data-formatter-objc/TestDataFormatterObjCNSContainer.py (1043 of 1785) PASS: lldb-unit :: Utility/./UtilityTests/OptionsWithRawTest.ArgsButNoLeadingDash (1044 of 1785) PASS: lldb-api :: python_api/target/TestTargetAPI.py (1045 of 1785) PASS: lldb-shell :: ObjectFile/ELF/build-id-case.yaml (1046 of 1785) PASS: lldb-shell :: Reproducer/TestGDBRemoteRepro.test (1047 of 1785) PASS: lldb-api :: tools/lldb-server/TestGdbRemoteProcessInfo.py (1048 of 1785) PASS: lldb-api :: lang/c/enum_types/TestEnumTypes.py (1049 of 1785) PASS: lldb-unit :: Expression/./ExpressionTests/DiagnosticManagerTest.GetStringMultipleDiags (1050 of 1785) PASS: lldb-api :: commands/command/invalid-args/TestInvalidArgsCommand.py (1051 of 1785) UNSUPPORTED: lldb-api :: benchmarks/libcxxlist/TestBenchmarkLibcxxList.py (1052 of 1785) PASS: lldb-unit :: Utility/./UtilityTests/EnvironmentTest.EnvpConstruction (1053 of 1785) PASS: lldb-api :: python_api/interpreter/TestCommandInterpreterAPI.py (1054 of 1785) PASS: lldb-api :: sample_test/TestSampleTest.py (1055 of 1785) PASS: lldb-unit :: Utility/./UtilityTests/ArgsTest.ReplaceArgumentAtIndexOutOfRange (1056 of 1785) PASS: lldb-api :: lang/objc/orderedset/TestOrderedSet.py (1057 of 1785) PASS: lldb-api :: commands/expression/import-std-module/shared_ptr-dbg-info-content/TestSharedPtrDbgInfoContent.py (1058 of 1785) PASS: lldb-api :: functionalities/postmortem/netbsd-core/TestNetBSDCore.py (1059 of 1785) PASS: lldb-unit :: Utility/./UtilityTests/FileSpecTest.EqualDotsPosixRoot (1060 of 1785) PASS: lldb-api :: commands/command/delete/TestCommandDelete.py (1061 of 1785) PASS: lldb-api :: functionalities/tsan/basic/TestTsanBasic.py (1062 of 1785) PASS: lldb-unit :: Host/./HostTests/FileSystemTest.GetByteSize (1063 of 1785) PASS: lldb-api :: functionalities/data-formatter/data-formatter-stl/libcxx/vbool/TestDataFormatterLibcxxVBool.py (1064 of 1785) PASS: lldb-api :: functionalities/breakpoint/breakpoint_set_restart/TestBreakpointSetRestart.py (1065 of 1785) PASS: lldb-api :: macosx/indirect_symbol/TestIndirectSymbols.py (1066 of 1785) PASS: lldb-unit :: Symbol/./SymbolTests/TestClangASTContext.TemplateArguments (1067 of 1785) PASS: lldb-unit :: ScriptInterpreter/Python/./ScriptInterpreterPythonTests/PythonDataObjectsTest.TestGlobalNameResolutionWithDot (1068 of 1785) PASS: lldb-api :: lang/objc/objc-super/TestObjCSuper.py (1069 of 1785) PASS: lldb-shell :: Quit/TestQuitExitCode-30.test (1070 of 1785) PASS: lldb-api :: functionalities/data-formatter/data-formatter-stl/libcxx/multiset/TestDataFormatterLibcxxMultiSet.py (1071 of 1785) PASS: lldb-unit :: Symbol/./SymbolTests/TestClangASTContext.TestBuiltinTypeForEncodingAndBitSize (1072 of 1785) PASS: lldb-unit :: Target/./TargetTests/ExecutionContextTest.GetByteOrderTarget (1073 of 1785) PASS: lldb-unit :: Utility/./UtilityTests/StreamTest.PutHex32ByteOrderBig (1074 of 1785) PASS: lldb-unit :: Symbol/./SymbolTests/TestClangASTContext.TestRemoveFastQualifiers (1075 of 1785) PASS: lldb-unit :: Utility/./UtilityTests/StringExtractorTest.GetU32BigEndian (1076 of 1785) UNSUPPORTED: lldb-api :: functionalities/breakpoint/breakpoint_in_delayslot/TestAvoidBreakpointInDelaySlot.py (1077 of 1785) PASS: lldb-shell :: ObjectFile/Breakpad/breakpad-identification.test (1078 of 1785) PASS: lldb-unit :: Utility/./UtilityTests/StringListTest.ShiftMove (1079 of 1785) PASS: lldb-unit :: Symbol/./SymbolTests/TestClangASTContext.TestRecordHasFields (1080 of 1785) PASS: lldb-api :: functionalities/non-overlapping-index-variable-i/TestIndexVariable.py (1081 of 1785) PASS: lldb-api :: commands/frame/select/TestFrameSelect.py (1082 of 1785) PASS: lldb-shell :: ObjectFile/Breakpad/sections-trailing-func.test (1083 of 1785) PASS: lldb-api :: functionalities/thread/concurrent_events/TestConcurrentTwoWatchpointThreads.py (1084 of 1785) PASS: lldb-unit :: Expression/./ExpressionTests/DiagnosticManagerTest.HasFixits (1085 of 1785) PASS: lldb-unit :: UnwindAssembly/x86/./UnwindAssemblyx86Tests/Testx86AssemblyInspectionEngine.TestPushECX (1086 of 1785) PASS: lldb-api :: commands/expression/inline-namespace/TestInlineNamespace.py (1087 of 1785) PASS: lldb-api :: commands/apropos/basic/TestApropos.py (1088 of 1785) PASS: lldb-unit :: Process/gdb-remote/./ProcessGdbRemoteTests/GDBRemoteCommunicationClientTest.SendSignalsToIgnore (1089 of 1785) UNSUPPORTED: lldb-api :: functionalities/breakpoint/hardware_breakpoints/hardware_breakpoint_on_multiple_threads/TestHWBreakMultiThread.py (1090 of 1785) PASS: lldb-unit :: Utility/./UtilityTests/StringExtractorTest.GetU32LittleEndian (1091 of 1785) PASS: lldb-shell :: SymbolFile/Breakpad/line-table-missing-file.test (1092 of 1785) PASS: lldb-shell :: Minidump/fb-dump.test (1093 of 1785) PASS: lldb-api :: commands/watchpoints/multiple_threads/TestWatchpointMultipleThreads.py (1094 of 1785) PASS: lldb-api :: lang/cpp/template/TestTemplateArgs.py (1095 of 1785) PASS: lldb-unit :: Utility/./UtilityTests/OptionsWithRawTest.EmptyInput (1096 of 1785) PASS: lldb-api :: functionalities/pre_run_dylibs/TestPreRunDylibs.py (1097 of 1785) PASS: lldb-unit :: Utility/./UtilityTests/RegularExpression.Invalid (1098 of 1785) UNSUPPORTED: lldb-shell :: Register/aarch64-gp-read.test (1099 of 1785) PASS: lldb-api :: functionalities/data-formatter/data-formatter-smart-array/TestDataFormatterSmartArray.py (1100 of 1785) PASS: lldb-api :: functionalities/tail_call_frames/ambiguous_tail_call_seq1/TestAmbiguousTailCallSeq1.py (1101 of 1785) PASS: lldb-shell :: SymbolFile/sizeless-symbol.test (1102 of 1785) PASS: lldb-unit :: Utility/./UtilityTests/StringListTest.ShiftStdString (1103 of 1785) PASS: lldb-api :: commands/expression/namespace_local_var_same_name_cpp_and_c/TestNamespaceLocalVarSameNameCppAndC.py (1104 of 1785) PASS: lldb-unit :: Utility/./UtilityTests/EventTest.DumpEventDataBytes (1105 of 1785) PASS: lldb-unit :: UnwindAssembly/x86/./UnwindAssemblyx86Tests/Testx86AssemblyInspectionEngine.Test64bitFramelessSmallStackFrame (1106 of 1785) PASS: lldb-unit :: Symbol/./SymbolTests/SymbolsTest.LocateExecutableSymbolFileForUnknownExecutableAndMissingSymbolFile (1107 of 1785) UNSUPPORTED: lldb-shell :: SymbolFile/PDB/compilands.test (1108 of 1785) PASS: lldb-unit :: Host/./HostTests/SocketTest.TCPGetAddress (1109 of 1785) PASS: lldb-api :: macosx/nslog/TestDarwinNSLogOutput.py (1110 of 1785) PASS: lldb-api :: python_api/formatters/TestFormattersSBAPI.py (1111 of 1785) PASS: lldb-unit :: Process/gdb-remote/./ProcessGdbRemoteTests/GDBRemoteCommunicationClientTest.GetMemoryRegionInfo (1112 of 1785) PASS: lldb-unit :: Host/./HostTests/NativeProcessProtocolTest.SetBreakpoint (1113 of 1785) PASS: lldb-api :: commands/watchpoints/watchpoint_commands/command/TestWatchpointCommandPython.py (1114 of 1785) PASS: lldb-api :: functionalities/postmortem/wow64_minidump/TestWow64MiniDump.py (1115 of 1785) PASS: lldb-unit :: Host/./HostTests/SocketAddressTest.Set (1116 of 1785) PASS: lldb-unit :: Expression/./ExpressionTests/CppModuleConfigurationTest.UnknownLibCppFile (1117 of 1785) PASS: lldb-unit :: Process/gdb-remote/./ProcessGdbRemoteTests/GDBRemoteClientBaseTest.SendContinueAndInterrupt2PacketBug (1118 of 1785) PASS: lldb-unit :: Expression/./ExpressionTests/DiagnosticManagerTest.GetStringSeverityLabels (1119 of 1785) PASS: lldb-unit :: Utility/./UtilityTests/UriParserTest.MinimalPath (1120 of 1785) PASS: lldb-api :: commands/expression/ir-interpreter-phi-nodes/TestIRInterpreterPHINodes.py (1121 of 1785) PASS: lldb-api :: commands/expression/import-std-module/list-dbg-info-content/TestDbgInfoContentList.py (1122 of 1785) PASS: lldb-unit :: UnwindAssembly/x86/./UnwindAssemblyx86Tests/Testx86AssemblyInspectionEngine.TestPopR12 (1123 of 1785) PASS: lldb-shell :: ObjectFile/ELF/PT_LOAD-overlap-section.yaml (1124 of 1785) PASS: lldb-api :: functionalities/thread/step_out/TestThreadStepOut.py (1125 of 1785) PASS: lldb-shell :: Driver/TestNoUseColor.test (1126 of 1785) PASS: lldb-unit :: Utility/./UtilityTests/DataExtractorTest.GetMaxS64 (1127 of 1785) PASS: lldb-unit :: Utility/./UtilityTests/FileSpecTest.IsRelative (1128 of 1785) PASS: lldb-api :: functionalities/data-formatter/synthupdate/TestSyntheticFilterRecompute.py (1129 of 1785) PASS: lldb-unit :: Utility/./UtilityTests/DataExtractorTest.GetMaxU64 (1130 of 1785) PASS: lldb-api :: lang/c/offsetof/TestOffsetof.py (1131 of 1785) UNSUPPORTED: lldb-shell :: SymbolFile/PDB/udt-layout.test (1132 of 1785) PASS: lldb-unit :: Utility/./UtilityTests/StringExtractorTest.GetHexBytesAvail_FullString (1133 of 1785) PASS: lldb-unit :: Utility/./UtilityTests/StringExtractorTest.GetU64LittleEndian (1134 of 1785) PASS: lldb-api :: macosx/lc-note/kern-ver-str/TestKernVerStrLCNOTE.py (1135 of 1785) PASS: lldb-api :: lang/cpp/const_this/TestConstThis.py (1136 of 1785) PASS: lldb-unit :: Utility/./UtilityTests/FileSpecTest.EqualDotsWindows (1137 of 1785) PASS: lldb-api :: commands/target/create-no-such-arch/TestNoSuchArch.py (1138 of 1785) PASS: lldb-api :: functionalities/data-formatter/data-formatter-skip-summary/TestDataFormatterSkipSummary.py (1139 of 1785) UNSUPPORTED: lldb-api :: lang/objc/objc-dynamic-value/TestObjCDynamicValue.py (1140 of 1785) PASS: lldb-shell :: Unwind/trap_frame_sym_ctx.test (1141 of 1785) PASS: lldb-unit :: ObjectFile/Breakpad/./ObjectFileBreakpadTests/FileRecord.parse (1142 of 1785) PASS: lldb-api :: functionalities/data-formatter/data-formatter-objc/TestDataFormatterObjCNSData.py (1143 of 1785) PASS: lldb-shell :: SymbolFile/NativePDB/function-types-calling-conv.cpp (1144 of 1785) PASS: lldb-unit :: Utility/./UtilityTests/StringListTest.ForRangeEmpty (1145 of 1785) PASS: lldb-unit :: SymbolFile/DWARF/./SymbolFileDWARFTests/SymbolFileDWARFTests.TestAbbrevMissingTerminator (1146 of 1785) PASS: lldb-unit :: Target/./TargetTests/PathMappingListTest.RelativeTests (1147 of 1785) PASS: lldb-shell :: ObjectFile/PECOFF/basic-info-arm64.yaml (1148 of 1785) PASS: lldb-api :: commands/target/create-deps/TestTargetCreateDeps.py (1149 of 1785) PASS: lldb-api :: functionalities/thread/thread_specific_break/TestThreadSpecificBreakpoint.py (1150 of 1785) PASS: lldb-unit :: UnwindAssembly/x86/./UnwindAssemblyx86Tests/Testx86AssemblyInspectionEngine.TestPopRBX (1151 of 1785) PASS: lldb-unit :: Utility/./UtilityTests/CompletionRequest.TryCompleteCurrentArgGood (1152 of 1785) PASS: lldb-api :: commands/frame/diagnose/dereference-function-return/TestDiagnoseDereferenceFunctionReturn.py (1153 of 1785) PASS: lldb-api :: python_api/sbtype_typeclass/TestSBTypeTypeClass.py (1154 of 1785) PASS: lldb-shell :: BuildScript/compiler-full-path.test (1155 of 1785) PASS: lldb-unit :: ScriptInterpreter/Python/./ScriptInterpreterPythonTests/PythonExceptionStateTest.TestDiscardSemantics (1156 of 1785) PASS: lldb-unit :: Utility/./UtilityTests/StringListTest.RemoveBlankLines (1157 of 1785) PASS: lldb-unit :: Symbol/./SymbolTests/TestClangASTContext.TestIsClangType (1158 of 1785) PASS: lldb-api :: functionalities/thread/crash_during_step/TestCrashDuringStep.py (1159 of 1785) PASS: lldb-unit :: Utility/./UtilityTests/UUIDTest.SetFromStringRef (1160 of 1785) PASS: lldb-api :: commands/apropos/with-process/TestAproposWithProcess.py (1161 of 1785) PASS: lldb-api :: lang/cpp/class_types/TestClassTypes.py (1162 of 1785) PASS: lldb-api :: lang/objc/global_ptrs/TestGlobalObjects.py (1163 of 1785) PASS: lldb-api :: functionalities/data-formatter/setvaluefromcstring/TestSetValueFromCString.py (1164 of 1785) PASS: lldb-unit :: UnwindAssembly/x86/./UnwindAssemblyx86Tests/Testx86AssemblyInspectionEngine.TestAddESP (1165 of 1785) PASS: lldb-api :: functionalities/gdb_remote_client/TestArmRegisterDefinition.py (1166 of 1785) PASS: lldb-api :: arm/emulation/TestEmulations.py (1167 of 1785) PASS: lldb-api :: functionalities/data-formatter/data-formatter-script/TestDataFormatterScript.py (1168 of 1785) PASS: lldb-unit :: Expression/./ExpressionTests/DiagnosticManagerTest.GetStringPreserveOrder (1169 of 1785) PASS: lldb-unit :: Host/./HostTests/MainLoopTest.DetectsEOF (1170 of 1785) UNSUPPORTED: lldb-api :: functionalities/darwin_log/source/debug/TestDarwinLogSourceDebug.py (1171 of 1785) PASS: lldb-api :: types/TestDoubleTypes.py (1172 of 1785) PASS: lldb-api :: functionalities/data-formatter/nsarraysynth/TestNSArraySynthetic.py (1173 of 1785) PASS: lldb-unit :: Core/./LLDBCoreTests/StreamCallbackTest.Callback (1174 of 1785) PASS: lldb-unit :: Utility/./UtilityTests/BinaryStreamTest.PutSLEB128NineBytes (1175 of 1785) PASS: lldb-unit :: Utility/./UtilityTests/GeneratorTest.Create (1176 of 1785) PASS: lldb-unit :: Utility/./UtilityTests/TimerTest.CategoryTimes2 (1177 of 1785) PASS: lldb-api :: commands/expression/namespace_local_var_same_name_obj_c/TestNamespaceLocalVarSameNameObjC.py (1178 of 1785) PASS: lldb-api :: functionalities/data-formatter/data-formatter-objc/TestDataFormatterObjNSException.py (1179 of 1785) PASS: lldb-unit :: Utility/./UtilityTests/Flags.AllClear (1180 of 1785) PASS: lldb-unit :: Utility/./UtilityTests/RecordReplayTest.InstrumentedBar (1181 of 1785) PASS: lldb-unit :: Process/gdb-remote/./ProcessGdbRemoteTests/GDBRemoteClientBaseTest.SendContinueAndLateInterrupt (1182 of 1785) PASS: lldb-api :: commands/expression/import-std-module/empty-module/TestEmptyStdModule.py (1183 of 1785) PASS: lldb-unit :: Process/gdb-remote/./ProcessGdbRemoteTests/GDBRemoteCommunicationServerTest.SendErrorResponse_ErrorList (1184 of 1785) PASS: lldb-api :: functionalities/breakpoint/address_breakpoints/TestAddressBreakpoints.py (1185 of 1785) PASS: lldb-unit :: Process/minidump/./LLDBMinidumpTests/MinidumpParserTest.GetLinuxProcStatus_no_stream (1186 of 1785) PASS: lldb-unit :: Utility/./UtilityTests/SerializationRountripTest.SerializeDeserializeCString (1187 of 1785) PASS: lldb-unit :: Utility/./UtilityTests/UriParserTest.PortOverflow (1188 of 1785) PASS: lldb-unit :: Utility/./UtilityTests/StreamTeeTest.CopyConstructor (1189 of 1785) PASS: lldb-unit :: Utility/./UtilityTests/RangeTest.NotEqualInvalid (1190 of 1785) PASS: lldb-unit :: UnwindAssembly/x86/./UnwindAssemblyx86Tests/Testx86AssemblyInspectionEngine.TestPushR12 (1191 of 1785) PASS: lldb-api :: python_api/exprpath_synthetic/TestExprPathSynthetic.py (1192 of 1785) PASS: lldb-unit :: Utility/./UtilityTests/ScalarTest.RightShiftOperator (1193 of 1785) UNSUPPORTED: lldb-api :: functionalities/data-formatter/data-formatter-stl/libcxx/function/TestLibCxxFunction.py (1194 of 1785) PASS: lldb-api :: commands/command/script_alias/TestCommandScriptAlias.py (1195 of 1785) UNSUPPORTED: lldb-api :: benchmarks/stepping/TestSteppingSpeed.py (1196 of 1785) PASS: lldb-api :: functionalities/data-formatter/data-formatter-advanced/TestDataFormatterAdv.py (1197 of 1785) PASS: lldb-shell :: ObjectFile/ELF/many-sections.s (1198 of 1785) PASS: lldb-unit :: Utility/./UtilityTests/BinaryStreamTest.PutULEB128OneByte (1199 of 1785) UNSUPPORTED: lldb-shell :: Register/x86-zmm-write.test (1200 of 1785) PASS: lldb-shell :: Breakpoint/debug_rnglist_rlestartend.test (1201 of 1785) PASS: lldb-unit :: Process/minidump/./LLDBMinidumpTests/MinidumpParserTest.GetPidWindows (1202 of 1785) PASS: lldb-shell :: SymbolFile/DWARF/find-variable-dwo.cpp (1203 of 1785) PASS: lldb-api :: functionalities/breakpoint/breakpoint_locations/TestBreakpointLocations.py (1204 of 1785) PASS: lldb-unit :: Language/Highlighting/./HighlighterTests/HighlighterTest.HighlighterSelectionPath (1205 of 1785) PASS: lldb-api :: functionalities/backticks/TestBackticksWithoutATarget.py (1206 of 1785) PASS: lldb-shell :: SymbolFile/DWARF/debug-names-compressed.cpp (1207 of 1785) UNSUPPORTED: lldb-api :: functionalities/data-formatter/data-formatter-stl/libstdcpp/string/TestDataFormatterStdString.py (1208 of 1785) PASS: lldb-unit :: ScriptInterpreter/Python/./ScriptInterpreterPythonTests/PythonDataObjectsTest.TestPythonListManipulation (1209 of 1785) PASS: lldb-api :: functionalities/thread/concurrent_events/TestConcurrentSignalDelayWatch.py (1210 of 1785) PASS: lldb-unit :: Host/./HostTests/SocketTest.TCPListen0GetPort (1211 of 1785) PASS: lldb-api :: functionalities/recursion/TestValueObjectRecursion.py (1212 of 1785) PASS: lldb-unit :: Utility/./UtilityTests/StatusTest.Formatv (1213 of 1785) PASS: lldb-api :: functionalities/inferior-changed/TestInferiorChanged.py (1214 of 1785) UNSUPPORTED: lldb-api :: tools/lldb-vscode/breakpoint/TestVSCode_setFunctionBreakpoints.py (1215 of 1785) UNSUPPORTED: lldb-shell :: Register/x86-gp-write.test (1216 of 1785) PASS: lldb-unit :: Utility/./UtilityTests/BinaryStreamTest.PutULEB128Zero (1217 of 1785) PASS: lldb-unit :: Utility/./UtilityTests/StringExtractorTest.GetNameColonValueContainsColon (1218 of 1785) PASS: lldb-api :: commands/expression/issue_11588/Test11588.py (1219 of 1785) PASS: lldb-api :: lang/objc/objc-static-method-stripped/TestObjCStaticMethodStripped.py (1220 of 1785) PASS: lldb-api :: lang/cpp/bool/TestCPPBool.py (1221 of 1785) PASS: lldb-api :: functionalities/tail_call_frames/unambiguous_sequence/TestUnambiguousTailCalls.py (1222 of 1785) PASS: lldb-api :: commands/process/attach-resume/TestAttachResume.py (1223 of 1785) PASS: lldb-api :: commands/expression/radar_9531204/TestPrintfAfterUp.py (1224 of 1785) PASS: lldb-unit :: Utility/./UtilityTests/ArgsTest.EscapeLLDBCommandArgument (1225 of 1785) PASS: lldb-api :: functionalities/breakpoint/breakpoint_names/TestBreakpointNames.py (1226 of 1785) PASS: lldb-unit :: Utility/./UtilityTests/FileSpecTest.FormatFileSpec (1227 of 1785) UNSUPPORTED: lldb-api :: functionalities/data-formatter/data-formatter-stl/libstdcpp/list/TestDataFormatterStdList.py (1228 of 1785) PASS: lldb-api :: commands/expression/xvalue/TestXValuePrinting.py (1229 of 1785) FAIL: lldb-api :: tools/lldb-server/commandline/TestStubSetSID.py (1230 of 1785) ******************** TEST 'lldb-api :: tools/lldb-server/commandline/TestStubSetSID.py' FAILED ******************** lldb version 10.0.99 (http://labmaster3.local/git/llvm-project.git revision b5088aa9442fb610f452c5a6c93c1964962c4159) clang revision 722b61892454b3217d73ec486e52156c5a92b5b3 llvm revision 722b61892454b3217d73ec486e52156c5a92b5b3 LLDB library dir: /Users/buildslave/jenkins/workspace/lldb-cmake-sanitized/lldb-build/bin LLDB import library dir: /Users/buildslave/jenkins/workspace/lldb-cmake-sanitized/lldb-build/bin libstdcxx tests will not be run because: Don't know how to build with libstdcxx on macosx Skipping following debug info categories: ['dwo']

Hide Details

Session logs for test failures/errors/unexpected successes will go into directory '/Users/buildslave/jenkins/workspace/lldb-cmake-sanitized/test/logs' Command invoked: /Users/buildslave/jenkins/workspace/lldb-cmake-sanitized/llvm-project/lldb/test/API/dotest.py --arch=x86_64 -s /Users/buildslave/jenkins/workspace/lldb-cmake-sanitized/lldb-build/lldb-test-traces -S nm -u CXXFLAGS -u CFLAGS --executable /Users/buildslave/jenkins/workspace/lldb-cmake-sanitized/lldb-build/./bin/lldb --dsymutil /Users/buildslave/jenkins/workspace/lldb-cmake-sanitized/lldb-build/./bin/dsymutil --filecheck /Users/buildslave/jenkins/workspace/lldb-cmake-sanitized/lldb-build/./bin/FileCheck -C /Users/buildslave/jenkins/workspace/lldb-cmake-sanitized/host-compiler/bin/clang --codesign-identity lldb_codesign --server /Users/buildslave/jenkins/workspace/lldb-cmake-sanitized/lldb-build/./bin/debugserver --arch x86_64 --build-dir /Users/buildslave/jenkins/workspace/lldb-cmake-sanitized/lldb-build/lldb-test-build.noindex -s=/Users/buildslave/jenkins/workspace/lldb-cmake-sanitized/test/logs -t --env TERM=vt100 --env LLVM_LIBS_DIR=/Users/buildslave/jenkins/workspace/lldb-cmake-sanitized/lldb-build/./lib --build-dir /Users/buildslave/jenkins/workspace/lldb-cmake-sanitized/lldb-build/tools/lldb/lldb-test-build.noindex --lldb-module-cache-dir /Users/buildslave/jenkins/workspace/lldb-cmake-sanitized/lldb-build/tools/lldb/lldb-test-build.noindex/module-cache-lldb/lldb-api --clang-module-cache-dir /Users/buildslave/jenkins/workspace/lldb-cmake-sanitized/lldb-build/tools/lldb/lldb-test-build.noindex/module-cache-clang/lldb-api /Users/buildslave/jenkins/workspace/lldb-cmake-sanitized/llvm-project/lldb/packages/Python/lldbsuite/test/tools/lldb-server/commandline -p TestStubSetSID.py Change dir to: /Users/buildslave/jenkins/workspace/lldb-cmake-sanitized/llvm-project/lldb/packages/Python/lldbsuite/test/tools/lldb-server/commandline runCmd: settings set symbols.enable-external-lookup false output:

Hide Details

runCmd: settings set plugin.process.gdb-remote.packet-timeout 60 output:

Hide Details

runCmd: settings set symbols.clang-modules-cache-path "/Users/buildslave/jenkins/workspace/lldb-cmake-sanitized/lldb-build/tools/lldb/lldb-test-build.noindex/module-cache-lldb/lldb-api" output:

Hide Details

runCmd: settings set use-color false output:

Hide Details

Adding tearDown hook: def shutdown_named_pipe(): # Close the pipe. try: named_pipe.close() except: print("failed to close named pipe") None

Hide Details

# Delete the pipe. try: os.remove(named_pipe_path) except: print("failed to delete named pipe: {}".format(named_pipe_path)) None

Hide Details

# Delete the temp directory. try: os.rmdir(temp_dir) except: print( "failed to delete temp dir: {}, directory contents: '{}'".format( temp_dir, os.listdir(temp_dir))) None

Hide Details

Hide Details

Adding tearDown hook: def cleanupSubprocesses(self): # Ensure any subprocesses are cleaned up for p in self.subprocesses: p.terminate() del p del self.subprocesses[:] # Ensure any forked processes are cleaned up for pid in self.forkedProcessPids: if os.path.exists("/proc/" + str(pid)): os.kill(pid, signal.SIGTERM)

Hide Details

Hide Details

Executing tearDown hook: def cleanupSubprocesses(self): # Ensure any subprocesses are cleaned up for p in self.subprocesses: p.terminate() del p del self.subprocesses[:] # Ensure any forked processes are cleaned up for pid in self.forkedProcessPids: if os.path.exists("/proc/" + str(pid)): os.kill(pid, signal.SIGTERM)

Hide Details

Hide Details

Executing tearDown hook: def shutdown_named_pipe(): # Close the pipe. try: named_pipe.close() except: print("failed to close named pipe") None

Hide Details

# Delete the pipe. try: os.remove(named_pipe_path) except: print("failed to delete named pipe: {}".format(named_pipe_path)) None

Hide Details

# Delete the temp directory. try: os.rmdir(temp_dir) except: print( "failed to delete temp dir: {}, directory contents: '{}'".format( temp_dir, os.listdir(temp_dir))) None

Hide Details

Hide Details

PASS: LLDB (/Users/buildslave/jenkins/workspace/lldb-cmake-sanitized/host-compiler/bin/clang-10-x86_64) :: test_sid_is_different_with_S_debugserver (TestStubSetSID.TestStubSetSIDTestCase) runCmd: settings set symbols.enable-external-lookup false output:

Hide Details

runCmd: settings set plugin.process.gdb-remote.packet-timeout 60 output:

Hide Details

runCmd: settings set symbols.clang-modules-cache-path "/Users/buildslave/jenkins/workspace/lldb-cmake-sanitized/lldb-build/tools/lldb/lldb-test-build.noindex/module-cache-lldb/lldb-api" output:

Hide Details

runCmd: settings set use-color false output:

Hide Details

UNSUPPORTED: LLDB (/Users/buildslave/jenkins/workspace/lldb-cmake-sanitized/host-compiler/bin/clang-10-x86_64) :: test_sid_is_different_with_S_llgs (TestStubSetSID.TestStubSetSIDTestCase) (llgs tests) runCmd: settings set symbols.enable-external-lookup false output:

Hide Details

runCmd: settings set plugin.process.gdb-remote.packet-timeout 60 output:

Hide Details

runCmd: settings set symbols.clang-modules-cache-path "/Users/buildslave/jenkins/workspace/lldb-cmake-sanitized/lldb-build/tools/lldb/lldb-test-build.noindex/module-cache-lldb/lldb-api" output:

Hide Details

runCmd: settings set use-color false output:

Hide Details

Adding tearDown hook: def shutdown_named_pipe(): # Close the pipe. try: named_pipe.close() except: print("failed to close named pipe") None

Hide Details

# Delete the pipe. try: os.remove(named_pipe_path) except: print("failed to delete named pipe: {}".format(named_pipe_path)) None

Hide Details

# Delete the temp directory. try: os.rmdir(temp_dir) except: print( "failed to delete temp dir: {}, directory contents: '{}'".format( temp_dir, os.listdir(temp_dir))) None

Hide Details

Hide Details

Adding tearDown hook: def cleanupSubprocesses(self): # Ensure any subprocesses are cleaned up for p in self.subprocesses: p.terminate() del p del self.subprocesses[:] # Ensure any forked processes are cleaned up for pid in self.forkedProcessPids: if os.path.exists("/proc/" + str(pid)): os.kill(pid, signal.SIGTERM)

Hide Details

Hide Details

FAIL: LLDB (/Users/buildslave/jenkins/workspace/lldb-cmake-sanitized/host-compiler/bin/clang-10-x86_64) :: test_sid_is_different_with_setsid_debugserver (TestStubSetSID.TestStubSetSIDTestCase) Executing tearDown hook: def cleanupSubprocesses(self): # Ensure any subprocesses are cleaned up for p in self.subprocesses: p.terminate() del p del self.subprocesses[:] # Ensure any forked processes are cleaned up for pid in self.forkedProcessPids: if os.path.exists("/proc/" + str(pid)): os.kill(pid, signal.SIGTERM)

Hide Details

Hide Details

Executing tearDown hook: def shutdown_named_pipe(): # Close the pipe. try: named_pipe.close() except: print("failed to close named pipe") None

Hide Details

# Delete the pipe. try: os.remove(named_pipe_path) except: print("failed to delete named pipe: {}".format(named_pipe_path)) None

Hide Details

# Delete the temp directory. try: os.rmdir(temp_dir) except: print( "failed to delete temp dir: {}, directory contents: '{}'".format( temp_dir, os.listdir(temp_dir))) None

Hide Details

Hide Details

runCmd: settings set symbols.enable-external-lookup false output:

Hide Details

runCmd: settings set plugin.process.gdb-remote.packet-timeout 60 output:

Hide Details

runCmd: settings set symbols.clang-modules-cache-path "/Users/buildslave/jenkins/workspace/lldb-cmake-sanitized/lldb-build/tools/lldb/lldb-test-build.noindex/module-cache-lldb/lldb-api" output:

Hide Details

runCmd: settings set use-color false output:

Hide Details

UNSUPPORTED: LLDB (/Users/buildslave/jenkins/workspace/lldb-cmake-sanitized/host-compiler/bin/clang-10-x86_64) :: test_sid_is_different_with_setsid_llgs (TestStubSetSID.TestStubSetSIDTestCase) (llgs tests) runCmd: settings set symbols.enable-external-lookup false output:

Hide Details

runCmd: settings set plugin.process.gdb-remote.packet-timeout 60 output:

Hide Details

runCmd: settings set symbols.clang-modules-cache-path "/Users/buildslave/jenkins/workspace/lldb-cmake-sanitized/lldb-build/tools/lldb/lldb-test-build.noindex/module-cache-lldb/lldb-api" output:

Hide Details

runCmd: settings set use-color false output:

Hide Details

Adding tearDown hook: def shutdown_named_pipe(): # Close the pipe. try: named_pipe.close() except: print("failed to close named pipe") None

Hide Details

# Delete the pipe. try: os.remove(named_pipe_path) except: print("failed to delete named pipe: {}".format(named_pipe_path)) None

Hide Details

# Delete the temp directory. try: os.rmdir(temp_dir) except: print( "failed to delete temp dir: {}, directory contents: '{}'".format( temp_dir, os.listdir(temp_dir))) None

Hide Details

Hide Details

Adding tearDown hook: def cleanupSubprocesses(self): # Ensure any subprocesses are cleaned up for p in self.subprocesses: p.terminate() del p del self.subprocesses[:] # Ensure any forked processes are cleaned up for pid in self.forkedProcessPids: if os.path.exists("/proc/" + str(pid)): os.kill(pid, signal.SIGTERM)

Hide Details

Hide Details

Executing tearDown hook: def cleanupSubprocesses(self): # Ensure any subprocesses are cleaned up for p in self.subprocesses: p.terminate() del p del self.subprocesses[:] # Ensure any forked processes are cleaned up for pid in self.forkedProcessPids: if os.path.exists("/proc/" + str(pid)): os.kill(pid, signal.SIGTERM)

Hide Details

Hide Details

Executing tearDown hook: def shutdown_named_pipe(): # Close the pipe. try: named_pipe.close() except: print("failed to close named pipe") None

Hide Details

# Delete the pipe. try: os.remove(named_pipe_path) except: print("failed to delete named pipe: {}".format(named_pipe_path)) None

Hide Details

# Delete the temp directory. try: os.rmdir(temp_dir) except: print( "failed to delete temp dir: {}, directory contents: '{}'".format( temp_dir, os.listdir(temp_dir))) None

Hide Details

Hide Details

PASS: LLDB (/Users/buildslave/jenkins/workspace/lldb-cmake-sanitized/host-compiler/bin/clang-10-x86_64) :: test_sid_is_same_without_setsid_debugserver (TestStubSetSID.TestStubSetSIDTestCase) runCmd: settings set symbols.enable-external-lookup false output:

Hide Details

runCmd: settings set plugin.process.gdb-remote.packet-timeout 60 output:

Hide Details

runCmd: settings set symbols.clang-modules-cache-path "/Users/buildslave/jenkins/workspace/lldb-cmake-sanitized/lldb-build/tools/lldb/lldb-test-build.noindex/module-cache-lldb/lldb-api" output:

Hide Details

runCmd: settings set use-color false output:

Hide Details

UNSUPPORTED: LLDB (/Users/buildslave/jenkins/workspace/lldb-cmake-sanitized/host-compiler/bin/clang-10-x86_64) :: test_sid_is_same_without_setsid_llgs (TestStubSetSID.TestStubSetSIDTestCase) (llgs tests) Restore dir to: /Users/buildslave/jenkins/workspace/lldb-cmake-sanitized/lldb-build/tools/lldb/test ====================================================================== FAIL: test_sid_is_different_with_setsid_debugserver (TestStubSetSID.TestStubSetSIDTestCase) ---------------------------------------------------------------------- Traceback (most recent call last): File "/Users/buildslave/jenkins/workspace/lldb-cmake-sanitized/llvm-project/lldb/packages/Python/lldbsuite/test/decorators.py", line 141, in wrapper func(*args, **kwargs) File "/Users/buildslave/jenkins/workspace/lldb-cmake-sanitized/llvm-project/lldb/packages/Python/lldbsuite/test/decorators.py", line 141, in wrapper func(*args, **kwargs) File "/Users/buildslave/jenkins/workspace/lldb-cmake-sanitized/llvm-project/lldb/packages/Python/lldbsuite/test/tools/lldb-server/commandline/TestStubSetSID.py", line 64, in test_sid_is_different_with_setsid_debugserver self.sid_is_different_with_setsid() File "/Users/buildslave/jenkins/workspace/lldb-cmake-sanitized/llvm-project/lldb/packages/Python/lldbsuite/test/tools/lldb-server/commandline/TestStubSetSID.py", line 36, in sid_is_different_with_setsid stub_sid = self.get_stub_sid(["--setsid"]) File "/Users/buildslave/jenkins/workspace/lldb-cmake-sanitized/llvm-project/lldb/packages/Python/lldbsuite/test/tools/lldb-server/commandline/TestStubSetSID.py", line 26, in get_stub_sid server.pid, True)) AssertionError: False is not True Config=x86_64-/Users/buildslave/jenkins/workspace/lldb-cmake-sanitized/host-compiler/bin/clang-10 ---------------------------------------------------------------------- Ran 6 tests in 14.799s

Hide Details

RESULT: FAILED (2 passes, 1 failures, 0 errors, 3 skipped, 0 expected failures, 0 unexpected successes)

Hide Details

******************** PASS: lldb-unit :: Process/gdb-remote/./ProcessGdbRemoteTests/GDBRemoteCommunicationClientTest.SendStopTracePacket (1231 of 1785) PASS: lldb-api :: commands/watchpoints/watchpoint_disable/TestWatchpointDisable.py (1232 of 1785) PASS: lldb-api :: functionalities/thread/backtrace_limit/TestBacktraceLimit.py (1233 of 1785) PASS: lldb-api :: functionalities/wrong_commands/TestWrongCommands.py (1234 of 1785) PASS: lldb-unit :: Utility/./UtilityTests/ScalarTest.Division (1235 of 1785) PASS: lldb-unit :: Expression/./ExpressionTests/CppModuleConfigurationTest.Sysroot (1236 of 1785) PASS: lldb-api :: commands/watchpoints/watchpoint_commands/TestWatchpointCommands.py (1237 of 1785) PASS: lldb-unit :: Utility/./UtilityTests/DataExtractorTest.GetCStrAtNullOffset (1238 of 1785) PASS: lldb-api :: lang/cpp/breakpoint_in_member_func_w_non_primitive_params/TestBreakpointInMemberFuncWNonPrimitiveParams.py (1239 of 1785) PASS: lldb-unit :: Utility/./UtilityTests/TildeExpressionResolver.ResolveFullPath (1240 of 1785) PASS: lldb-api :: lang/objc/objc-builtin-types/TestObjCBuiltinTypes.py (1241 of 1785) PASS: lldb-unit :: UnwindAssembly/x86/./UnwindAssemblyx86Tests/Testx86AssemblyInspectionEngine.TestPushEDI (1242 of 1785) PASS: lldb-shell :: Watchpoint/SetErrorCases.test (1243 of 1785) PASS: lldb-api :: commands/expression/context-object/TestContextObject.py (1244 of 1785) PASS: lldb-unit :: Utility/./UtilityTests/IndexToObjectTest.ObjectForIndex (1245 of 1785) UNSUPPORTED: lldb-api :: python_api/event/TestEvents.py (1246 of 1785) PASS: lldb-api :: functionalities/jitloader_gdb/TestJITLoaderGDB.py (1247 of 1785) PASS: lldb-api :: python_api/thread/TestThreadAPI.py (1248 of 1785) PASS: lldb-unit :: Process/minidump/./LLDBMinidumpTests/MinidumpParserTest.GetMiscInfoWindows (1249 of 1785) UNSUPPORTED: lldb-api :: arm/breakpoint-thumb-codesection/TestBreakpointThumbCodesection.py (1250 of 1785) PASS: lldb-unit :: Utility/./UtilityTests/OptionsWithRawTest.SingleWordSuffix (1251 of 1785) PASS: lldb-api :: lang/cpp/stl/TestStdCXXDisassembly.py (1252 of 1785) XFAIL: lldb-shell :: SymbolFile/DWARF/find-type-in-function.cpp (1253 of 1785) PASS: lldb-api :: functionalities/data-formatter/parray/TestPrintArray.py (1254 of 1785) PASS: lldb-unit :: Core/./LLDBCoreTests/RichManglingContextTest.IPDRealloc (1255 of 1785) PASS: lldb-api :: commands/expression/import-std-module/no-std-module/TestMissingStdModule.py (1256 of 1785) PASS: lldb-api :: commands/command/source/TestCommandSource.py (1257 of 1785) PASS: lldb-api :: python_api/watchpoint/watchlocation/TestTargetWatchAddress.py (1258 of 1785) PASS: lldb-api :: functionalities/step-avoids-no-debug/TestStepNoDebug.py (1259 of 1785) PASS: lldb-unit :: Utility/./UtilityTests/DataExtractorTest.GetCStr (1260 of 1785) UNSUPPORTED: lldb-api :: benchmarks/turnaround/TestCompileRunToBreakpointTurnaround.py (1261 of 1785) UNSUPPORTED: lldb-api :: tools/lldb-server/TestGdbRemoteAuxvSupport.py (1262 of 1785) PASS: lldb-unit :: Host/./HostTests/File.GetWaitableHandleFileno (1263 of 1785) PASS: lldb-api :: lang/objc/foundation/TestObjCMethods.py (1264 of 1785) PASS: lldb-shell :: ObjectFile/ELF/PT_LOAD.yaml (1265 of 1785) UNSUPPORTED: lldb-api :: commands/register/register/intel_xtended_registers/mpx_bound_violation/TestBoundViolation.py (1266 of 1785) PASS: lldb-shell :: Reproducer/Functionalities/TestImageList.test (1267 of 1785) PASS: lldb-unit :: Utility/./UtilityTests/StringExtractorTest.GetHexU8_Underflow2_NoEof (1268 of 1785) UNSUPPORTED: lldb-api :: functionalities/thread/multi_break/TestMultipleBreakpoints.py (1269 of 1785) PASS: lldb-api :: sanity/TestModuleCacheSanity.py (1270 of 1785) PASS: lldb-unit :: Utility/./UtilityTests/StreamTest.ChangingByteOrder (1271 of 1785) PASS: lldb-api :: functionalities/data-formatter/data-formatter-stl/libstdcpp/unique_ptr/invalid/TestDataFormatterInvalidStdUniquePtr.py (1272 of 1785) PASS: lldb-unit :: Utility/./UtilityTests/StringExtractorTest.DecodeHexU8_Extra (1273 of 1785) PASS: lldb-unit :: Expression/./ExpressionTests/DWARFExpression.DW_OP_convert (1274 of 1785) PASS: lldb-shell :: Breakpoint/debug_addrx.test (1275 of 1785) UNSUPPORTED: lldb-api :: python_api/disassemble-raw-data/TestDisassemble_VST1_64.py (1276 of 1785) PASS: lldb-shell :: Settings/TestSettingsWrite.test (1277 of 1785) PASS: lldb-api :: functionalities/thread/concurrent_events/TestConcurrentBreakpointOneDelayBreakpointThreads.py (1278 of 1785) UNSUPPORTED: lldb-shell :: SymbolFile/PDB/type-quals.test (1279 of 1785) PASS: lldb-unit :: Utility/./UtilityTests/VMRange.Clear (1280 of 1785) PASS: lldb-unit :: Utility/./UtilityTests/ArgsTest.TestMultipleArgs (1281 of 1785) PASS: lldb-unit :: Expression/./ExpressionTests/CppModuleConfigurationTest.AmbiguousCLib (1282 of 1785) UNSUPPORTED: lldb-shell :: Register/x86-ymm-write.test (1283 of 1785) PASS: lldb-api :: lang/mixed/TestMixedLanguages.py (1284 of 1785) UNSUPPORTED: lldb-shell :: Breakpoint/case-insensitive.test (1285 of 1785) PASS: lldb-unit :: Utility/./UtilityTests/NameMatchesTest.Ignore (1286 of 1785) PASS: lldb-unit :: Language/Highlighting/./HighlighterTests/HighlighterTest.ClangScalarLiterals (1287 of 1785) PASS: lldb-api :: commands/expression/vector_of_enums/TestVectorOfEnums.py (1288 of 1785) PASS: lldb-shell :: SymbolFile/DWARF/dwarf5_locations.s (1289 of 1785) PASS: lldb-shell :: SymbolFile/DWARF/find-method.cpp (1290 of 1785) PASS: lldb-shell :: SymbolFile/DWARF/parallel-indexing-stress.s (1291 of 1785) PASS: lldb-shell :: SymbolFile/DWARF/debug_ranges-missing-section.s (1292 of 1785) PASS: lldb-api :: functionalities/data-formatter/data-formatter-disabling/TestDataFormatterDisabling.py (1293 of 1785) PASS: lldb-unit :: Utility/./UtilityTests/Flags.AllSet (1294 of 1785) PASS: lldb-shell :: SymbolFile/DWARF/debug-types-address-ranges.s (1295 of 1785) PASS: lldb-api :: commands/frame/diagnose/bad-reference/TestBadReference.py (1296 of 1785) PASS: lldb-unit :: Utility/./UtilityTests/StringListTest.SplitIntoLines (1297 of 1785) PASS: lldb-api :: functionalities/breakpoint/address_breakpoints/TestBadAddressBreakpoints.py (1298 of 1785) PASS: lldb-unit :: Host/./HostTests/NativeProcessProtocolTest.SetBreakpointFailRead (1299 of 1785) PASS: lldb-unit :: Utility/./UtilityTests/ArchSpecTest.TestParseMachCPUDashSubtypeTripleExtra (1300 of 1785) UNSUPPORTED: lldb-api :: benchmarks/libcxxmap/TestBenchmarkLibcxxMap.py (1301 of 1785) PASS: lldb-api :: commands/command/script/import/rdar-12586188/TestRdar12586188.py (1302 of 1785) PASS: lldb-unit :: Utility/./UtilityTests/StringListTest.LongestCommonPrefixDuplicateElement (1303 of 1785) PASS: lldb-unit :: Utility/./UtilityTests/StreamTest.ShiftOperatorChars (1304 of 1785) PASS: lldb-api :: commands/expression/completion-in-lambda-and-unnnamed-class/TestCompletionInLambdaAndUnnamedClass.py (1305 of 1785) PASS: lldb-unit :: Utility/./UtilityTests/BinaryStreamTest.PutULEB128MaxValue (1306 of 1785) PASS: lldb-unit :: Utility/./UtilityTests/StreamTest.PutHex16ByteOrderBig (1307 of 1785) PASS: lldb-unit :: UnwindAssembly/x86/./UnwindAssemblyx86Tests/Testx86AssemblyInspectionEngine.Test64bitFramelessBigStackFrame (1308 of 1785) UNSUPPORTED: lldb-api :: benchmarks/continue/TestBenchmarkContinue.py (1309 of 1785) PASS: lldb-unit :: Utility/./UtilityTests/ArchSpecTest.OperatorBool (1310 of 1785) PASS: lldb-unit :: ObjectFile/Breakpad/./ObjectFileBreakpadTests/StackCFIRecord.parse (1311 of 1785) PASS: lldb-unit :: SymbolFile/NativePDB/./SymbolFileNativePDBTests/PDBFPOProgramToDWARFExpressionTests.MultipleIndependentAssignments (1312 of 1785) PASS: lldb-unit :: Signals/./SignalsTests/UnixSignalsTest.GetInfo (1313 of 1785) PASS: lldb-unit :: Utility/./UtilityTests/CompletionRequest.Constructor (1314 of 1785) PASS: lldb-api :: functionalities/history/TestHistoryRecall.py (1315 of 1785) PASS: lldb-api :: python_api/sbdata/TestSBData.py (1316 of 1785) PASS: lldb-unit :: Language/Highlighting/./HighlighterTests/HighlighterTest.Colons (1317 of 1785) PASS: lldb-unit :: Expression/./ExpressionTests/DiagnosticManagerTest.AppendMessageNoDiag (1318 of 1785) PASS: lldb-unit :: Host/./HostTests/SocketTest.UDPGetConnectURI (1319 of 1785) PASS: lldb-unit :: Utility/./UtilityTests/FileSpecTest.PrependPathComponent (1320 of 1785) PASS: lldb-unit :: Utility/./UtilityTests/StringListTest.AppendListCStringArray (1321 of 1785) PASS: lldb-unit :: Utility/./UtilityTests/StringExtractorTest.GetU64BigEndian (1322 of 1785) UNSUPPORTED: lldb-shell :: SymbolFile/PDB/function-nested-block.test (1323 of 1785) PASS: lldb-api :: functionalities/target-new-solib-notifications/TestModuleLoadedNotifys.py (1324 of 1785) PASS: lldb-api :: lang/objc/foundation/TestSymbolTable.py (1325 of 1785) PASS: lldb-api :: commands/quit/TestQuit.py (1326 of 1785) PASS: lldb-unit :: Host/./HostTests/FileSystemTest.Exists (1327 of 1785) PASS: lldb-unit :: Signals/./SignalsTests/UnixSignalsTest.Iteration (1328 of 1785) PASS: lldb-api :: types/TestRecursiveTypes.py (1329 of 1785) PASS: lldb-unit :: Utility/./UtilityTests/VMRange.ContainsRange (1330 of 1785) PASS: lldb-unit :: Utility/./UtilityTests/UriParserTest.BadPort2 (1331 of 1785) PASS: lldb-unit :: SymbolFile/NativePDB/./SymbolFileNativePDBTests/PDBFPOProgramToDWARFExpressionTests.SingleAssignmentRegisterRef (1332 of 1785) PASS: lldb-unit :: UnwindAssembly/x86/./UnwindAssemblyx86Tests/Testx86AssemblyInspectionEngine.TestAddRSP (1333 of 1785) PASS: lldb-unit :: Utility/./UtilityTests/ArchSpecTest.Compatibility (1334 of 1785) PASS: lldb-unit :: Utility/./UtilityTests/StreamTeeTest.DefaultConstructor (1335 of 1785) PASS: lldb-api :: functionalities/data-formatter/data-formatter-stl/libcxx/variant/TestDataFormatterLibcxxVariant.py (1336 of 1785) PASS: lldb-shell :: Driver/TestFile.test (1337 of 1785) PASS: lldb-shell :: ObjectFile/MachO/lc_build_version.yaml (1338 of 1785) PASS: lldb-unit :: Utility/./UtilityTests/UUIDTest.RelationalOperators (1339 of 1785) PASS: lldb-api :: tools/lldb-server/TestGdbRemoteKill.py (1340 of 1785) UNSUPPORTED: lldb-shell :: Register/x86-64-ymm16-write.test (1341 of 1785) PASS: lldb-api :: functionalities/thread/concurrent_events/TestConcurrentTwoBreakpointThreads.py (1342 of 1785) PASS: lldb-unit :: Utility/./UtilityTests/FileSpecTest.EqualDotsPosix (1343 of 1785) PASS: lldb-unit :: SymbolFile/NativePDB/./SymbolFileNativePDBTests/PDBFPOProgramToDWARFExpressionTests.InvalidAssignmentMultiple (1344 of 1785) PASS: lldb-unit :: SymbolFile/NativePDB/./SymbolFileNativePDBTests/PDBFPOProgramToDWARFExpressionTests.InvalidOpUnary (1345 of 1785) PASS: lldb-unit :: Utility/./UtilityTests/RangeDataVector.FindEntryThatContains_Overlap (1346 of 1785) PASS: lldb-api :: functionalities/breakpoint/move_nearest/TestMoveNearest.py (1347 of 1785) PASS: lldb-shell :: SymbolFile/NativePDB/global-classes.cpp (1348 of 1785) PASS: lldb-api :: commands/watchpoints/multiple_hits/TestMultipleHits.py (1349 of 1785) PASS: lldb-shell :: Reproducer/TestReuseDirectory.test (1350 of 1785) PASS: lldb-shell :: Heap/heap-cstr.test (1351 of 1785) UNSUPPORTED: lldb-api :: functionalities/unwind/standard/TestStandardUnwind.py (1352 of 1785) PASS: lldb-api :: commands/expression/import-std-module/vector-bool/TestBoolVector.py (1353 of 1785) PASS: lldb-unit :: Utility/./UtilityTests/CompletionRequest.DuplicateFiltering (1354 of 1785) PASS: lldb-api :: functionalities/breakpoint/dummy_target_breakpoints/TestBreakpointsWithNoTargets.py (1355 of 1785) PASS: lldb-unit :: Utility/./UtilityTests/BinaryStreamTest.PutULEB128ThreeBytes (1356 of 1785) PASS: lldb-unit :: ScriptInterpreter/Python/./ScriptInterpreterPythonTests/PythonExceptionStateTest.TestAutoRestoreSemantics (1357 of 1785) PASS: lldb-api :: functionalities/thread/concurrent_events/TestConcurrentDelayWatchBreak.py (1358 of 1785) UNSUPPORTED: lldb-shell :: Unwind/unwind-plan-dwarf-dump.test (1359 of 1785) PASS: lldb-api :: commands/expression/test/TestExprs.py (1360 of 1785) PASS: lldb-api :: functionalities/data-formatter/data-formatter-objc/TestDataFormatterObjCPlain.py (1361 of 1785) PASS: lldb-unit :: Utility/./UtilityTests/StringListTest.LongestCommonPrefix (1362 of 1785) PASS: lldb-unit :: UnwindAssembly/x86/./UnwindAssemblyx86Tests/Testx86AssemblyInspectionEngine.Test32bitFramelessBigStackFrame (1363 of 1785) PASS: lldb-api :: commands/settings/quoting/TestQuoting.py (1364 of 1785) PASS: lldb-api :: functionalities/ubsan/user-expression/TestUbsanUserExpression.py (1365 of 1785) PASS: lldb-unit :: Expression/./ExpressionTests/DiagnosticManagerTest.GetStringBasic (1366 of 1785) PASS: lldb-unit :: tools/lldb-server/tests/./LLDBServerTests/StandardStartupTest.TestStopReplyContainsThreadPcs (1367 of 1785) PASS: lldb-unit :: Utility/./UtilityTests/StringListTest.InsertStringAtIndexStdString (1368 of 1785) UNSUPPORTED: lldb-shell :: SymbolFile/NativePDB/ast-functions-msvc.cpp (1369 of 1785) PASS: lldb-api :: functionalities/data-formatter/type_summary_list_script/TestTypeSummaryListScript.py (1370 of 1785) PASS: lldb-shell :: ObjectFile/ELF/gnu-debuglink.yaml (1371 of 1785) PASS: lldb-api :: python_api/watchpoint/condition/TestWatchpointConditionAPI.py (1372 of 1785) PASS: lldb-api :: commands/expression/two-files/TestObjCTypeQueryFromOtherCompileUnit.py (1373 of 1785) PASS: lldb-shell :: Settings/TestDisassemblyFormat.test (1374 of 1785) PASS: lldb-unit :: Symbol/./SymbolTests/PostfixExpression.ToDWARF (1375 of 1785) PASS: lldb-unit :: Utility/./UtilityTests/DataExtractorTest.PeekData (1376 of 1785) PASS: lldb-api :: functionalities/postmortem/mach-core/TestMachCore.py (1377 of 1785) PASS: lldb-api :: tools/lldb-server/TestGdbRemoteThreadsInStopReply.py (1378 of 1785) PASS: lldb-api :: python_api/lldbutil/frame/TestFrameUtils.py (1379 of 1785) PASS: lldb-shell :: SymbolFile/Breakpad/line-table-discontinuous-file-ids.test (1380 of 1785) PASS: lldb-api :: commands/watchpoints/watchpoint_size/TestWatchpointSizes.py (1381 of 1785) PASS: lldb-unit :: SymbolFile/NativePDB/./SymbolFileNativePDBTests/PDBFPOProgramToDWARFExpressionTests.InvalidOpBinary (1382 of 1785) UNSUPPORTED: lldb-api :: functionalities/darwin_log/source/info/TestDarwinLogSourceInfo.py (1383 of 1785) PASS: lldb-unit :: Utility/./UtilityTests/UriParserTest.BadPort (1384 of 1785) PASS: lldb-unit :: Host/./HostTests/HostInfoTest.GetHostname (1385 of 1785) PASS: lldb-api :: functionalities/data-formatter/user-format-vs-summary/TestUserFormatVsSummary.py (1386 of 1785) UNSUPPORTED: lldb-api :: functionalities/darwin_log/filter/exact_match/category/TestDarwinLogFilterMatchCategory.py (1387 of 1785) PASS: lldb-unit :: ScriptInterpreter/Python/./ScriptInterpreterPythonTests/PythonDataObjectsTest.TestOwnedReferences (1388 of 1785) PASS: lldb-unit :: Process/minidump/./LLDBMinidumpTests/MinidumpParserTest.GetThreadContext_x86_64 (1389 of 1785) PASS: lldb-api :: commands/platform/process/TestProcessList.py (1390 of 1785) PASS: lldb-unit :: UnwindAssembly/x86/./UnwindAssemblyx86Tests/Testx86AssemblyInspectionEngine.TestStackRealignMSVC_i386 (1391 of 1785) PASS: lldb-api :: lang/objc/self/TestObjCSelf.py (1392 of 1785) PASS: lldb-unit :: Utility/./UtilityTests/CompletionRequest.TryCompleteCurrentArgBad (1393 of 1785) PASS: lldb-unit :: Utility/./UtilityTests/StringLexerTest.AdvanceIf (1394 of 1785) PASS: lldb-unit :: Host/./HostTests/Host.GetEnvironment (1395 of 1785) PASS: lldb-shell :: SymbolFile/DWARF/find-basic-namespace.cpp (1396 of 1785) PASS: lldb-api :: functionalities/modern-type-lookup/libcxx/TestLibCxxModernTypeLookup.py (1397 of 1785) PASS: lldb-api :: commands/expression/import-std-module/forward_list-basic/TestBasicForwardList.py (1398 of 1785) PASS: lldb-unit :: Utility/./UtilityTests/StringExtractorTest.InitMisc (1399 of 1785) PASS: lldb-unit :: Utility/./UtilityTests/StringListTest.GetSize (1400 of 1785) PASS: lldb-unit :: Utility/./UtilityTests/DataExtractorTest.GetMaxU64_unchecked (1401 of 1785) PASS: lldb-unit :: ObjectFile/PECOFF/./ObjectFilePECOFFTests/PECallFrameInfoTest.Chained_eh (1402 of 1785) PASS: lldb-unit :: Language/Highlighting/./HighlighterTests/HighlighterTest.ClangCommas (1403 of 1785) PASS: lldb-api :: lang/cpp/call-function/TestCallCPPFunction.py (1404 of 1785) PASS: lldb-shell :: SymbolFile/NativePDB/s_constant.cpp (1405 of 1785) UNSUPPORTED: lldb-api :: commands/watchpoints/hello_watchlocation/TestWatchLocation.py (1406 of 1785) PASS: lldb-unit :: Host/./HostTests/TaskPoolTest.AddTask (1407 of 1785) PASS: lldb-api :: functionalities/data-formatter/data-formatter-objc/TestDataFormatterObjCNSURL.py (1408 of 1785) PASS: lldb-api :: lang/cpp/gmodules/TestWithModuleDebugging.py (1409 of 1785) PASS: lldb-unit :: Utility/./UtilityTests/RecordReplayTest.InstrumentedBarPtr (1410 of 1785) PASS: lldb-unit :: Host/./HostTests/SocketTest.UDPConnect (1411 of 1785) PASS: lldb-unit :: Symbol/./SymbolTests/Type.GetTypeScopeAndBasename (1412 of 1785) PASS: lldb-api :: lang/cpp/scope/TestCppScope.py (1413 of 1785) PASS: lldb-api :: lang/cpp/llvm-style/TestLLVMStyle.py (1414 of 1785) PASS: lldb-api :: commands/expression/import-std-module/deque-dbg-info-content/TestDbgInfoContentDeque.py (1415 of 1785) UNSUPPORTED: lldb-api :: tools/lldb-vscode/variables/TestVSCode_variables.py (1416 of 1785) PASS: lldb-api :: lang/objc/objc-ivar-protocols/TestIvarProtocols.py (1417 of 1785) UNSUPPORTED: lldb-shell :: SymbolFile/PDB/calling-conventions.test (1418 of 1785) PASS: lldb-unit :: Utility/./UtilityTests/BinaryStreamTest.PutSLEB128SevenBytes (1419 of 1785) PASS: lldb-api :: python_api/disassemble-raw-data/TestDisassembleRawData.py (1420 of 1785) PASS: lldb-unit :: Expression/./ExpressionTests/DiagnosticManagerTest.FixedExpression (1421 of 1785) PASS: lldb-api :: commands/expression/context-object-objc/TestContextObjectObjc.py (1422 of 1785) PASS: lldb-unit :: Utility/./UtilityTests/BinaryStreamTest.PutSLEB128MaxValue (1423 of 1785) PASS: lldb-unit :: Language/Highlighting/./HighlighterTests/HighlighterTest.FallbackHighlighter (1424 of 1785) PASS: lldb-unit :: Utility/./UtilityTests/RangeTest.ContainsAddr (1425 of 1785) PASS: lldb-api :: lang/objc/objc-dyn-sbtype/TestObjCDynamicSBType.py (1426 of 1785) PASS: lldb-unit :: Process/gdb-remote/./ProcessGdbRemoteTests/GDBRemoteCommunicationClientTest.SendGetTraceConfigPacket (1427 of 1785) PASS: lldb-api :: functionalities/data-formatter/nssetsynth/TestNSSetSynthetic.py (1428 of 1785) PASS: lldb-unit :: Utility/./UtilityTests/StringLexerTest.Next (1429 of 1785) XFAIL: lldb-shell :: Register/x86-mm-xmm-read.test (1430 of 1785) PASS: lldb-unit :: Utility/./UtilityTests/DeserializerTest.HasData (1431 of 1785) PASS: lldb-shell :: Commands/command-regex-unalias.test (1432 of 1785) UNSUPPORTED: lldb-shell :: ExecControl/StopHook/stop-hook-threads.test (1433 of 1785) PASS: lldb-unit :: Utility/./UtilityTests/ArgsTest.ReplaceArgumentAtIndexEqual (1434 of 1785) PASS: lldb-api :: functionalities/abbreviation/TestAbbreviations.py (1435 of 1785) PASS: lldb-api :: functionalities/step_scripted/TestStepScripted.py (1436 of 1785) PASS: lldb-unit :: UnwindAssembly/x86/./UnwindAssemblyx86Tests/Testx86AssemblyInspectionEngine.TestSpillRegToStackViaMOVx86_64 (1437 of 1785) PASS: lldb-api :: python_api/sbvalue_persist/TestSBValuePersist.py (1438 of 1785) PASS: lldb-api :: functionalities/thread/thread_exit/TestThreadExit.py (1439 of 1785) PASS: lldb-api :: terminal/TestSTTYBeforeAndAfter.py (1440 of 1785) PASS: lldb-unit :: Utility/./UtilityTests/StreamTest.PutRawBytesToLittleEndian (1441 of 1785) PASS: lldb-shell :: SymbolFile/Breakpad/stack-cfi-parsing.test (1442 of 1785) PASS: lldb-unit :: Process/minidump/./LLDBMinidumpTests/MinidumpParserTest.GetMemoryRegionInfoFromMemoryList (1443 of 1785) PASS: lldb-shell :: SymbolFile/NativePDB/globals-fundamental.cpp (1444 of 1785) PASS: lldb-api :: lang/c/forward/TestForwardDeclaration.py (1445 of 1785) PASS: lldb-unit :: Signals/./SignalsTests/UnixSignalsTest.VersionChange (1446 of 1785) PASS: lldb-unit :: Utility/./UtilityTests/BinaryStreamTest.PutULEB128SevenBytes (1447 of 1785) PASS: lldb-unit :: ScriptInterpreter/Python/./ScriptInterpreterPythonTests/PythonDataObjectsTest.TestPythonTupleInitializerList (1448 of 1785) PASS: lldb-unit :: Utility/./UtilityTests/RangeTest.Copy (1449 of 1785) PASS: lldb-api :: lang/objc/rdar-10967107/TestRdar10967107.py (1450 of 1785) PASS: lldb-unit :: Utility/./UtilityTests/SerializationRountripTest.SerializeDeserializeObjectReference (1451 of 1785) PASS: lldb-unit :: Utility/./UtilityTests/UriParserTest.Empty (1452 of 1785) UNSUPPORTED: lldb-shell :: SymbolFile/target-symbols-add-unwind.test (1453 of 1785) PASS: lldb-unit :: Utility/./UtilityTests/RangeTest.LessThan (1454 of 1785) PASS: lldb-api :: lang/c/set_values/TestSetValues.py (1455 of 1785) PASS: lldb-api :: lang/c/register_variables/TestRegisterVariables.py (1456 of 1785) PASS: lldb-api :: api/multiple-targets/TestMultipleTargets.py (1457 of 1785) PASS: lldb-shell :: Expr/TestTypeOfDeclTypeExpr.test (1458 of 1785) UNSUPPORTED: lldb-api :: functionalities/unwind/ehframe/TestEhFrameUnwind.py (1459 of 1785) PASS: lldb-api :: lang/cpp/frame-var-anon-unions/TestFrameVariableAnonymousUnions.py (1460 of 1785) PASS: lldb-api :: lang/cpp/static_methods/TestCPPStaticMethods.py (1461 of 1785) PASS: lldb-unit :: Process/gdb-remote/./ProcessGdbRemoteTests/GDBRemoteCommunicationClientTest.SendStartTracePacket (1462 of 1785) PASS: lldb-unit :: Utility/./UtilityTests/StringListTest.JoinSingle (1463 of 1785) PASS: lldb-unit :: UnwindAssembly/x86/./UnwindAssemblyx86Tests/Testx86AssemblyInspectionEngine.TestSimple64bitFrameFunction (1464 of 1785) PASS: lldb-api :: linux/builtin_trap/TestBuiltinTrap.py (1465 of 1785) PASS: lldb-unit :: Utility/./UtilityTests/StringListTest.ForRange (1466 of 1785) PASS: lldb-shell :: Minidump/Windows/Sigsegv/sigsegv.test (1467 of 1785) PASS: lldb-unit :: ObjectFile/Breakpad/./ObjectFileBreakpadTests/Record.classify (1468 of 1785) PASS: lldb-unit :: Utility/./UtilityTests/OptionsWithRawTest.QuotedSuffix (1469 of 1785) PASS: lldb-api :: functionalities/data-formatter/data-formatter-stl/libcxx/optional/TestDataFormatterLibcxxOptional.py (1470 of 1785) PASS: lldb-unit :: Interpreter/./InterpreterTests/CompletionTest.DirCompletionAbsolute (1471 of 1785) PASS: lldb-unit :: UnwindAssembly/x86/./UnwindAssemblyx86Tests/Testx86AssemblyInspectionEngine.TestPushEAX (1472 of 1785) PASS: lldb-api :: functionalities/thread/concurrent_events/TestConcurrentSignalNWatchNBreak.py (1473 of 1785) PASS: lldb-unit :: Process/gdb-remote/./ProcessGdbRemoteTests/GDBRemoteCommunicationClientTest.WriteRegisterNoSuffix (1474 of 1785) PASS: lldb-unit :: Utility/./UtilityTests/RangeDataVector.FindEntryThatContains (1475 of 1785) PASS: lldb-unit :: Host/./HostTests/FileSystemTest.FileAndDirectoryComponents (1476 of 1785) PASS: lldb-api :: commands/expression/char/TestExprsChar.py (1477 of 1785) PASS: lldb-shell :: Settings/TestDisableColor.test (1478 of 1785) PASS: lldb-unit :: ScriptInterpreter/Python/./ScriptInterpreterPythonTests/PythonDataObjectsTest.TestPythonTupleSize (1479 of 1785) PASS: lldb-api :: lang/objc/foundation/TestObjectDescriptionAPI.py (1480 of 1785) PASS: lldb-unit :: Utility/./UtilityTests/AnsiTerminal.Basic (1481 of 1785) UNSUPPORTED: lldb-shell :: SymbolFile/PDB/typedefs.test (1482 of 1785) PASS: lldb-api :: commands/expression/fixits/TestFixIts.py (1483 of 1785) PASS: lldb-shell :: SymbolFile/NativePDB/function-types-builtins.cpp (1484 of 1785) PASS: lldb-api :: lang/cpp/symbols/TestSymbols.py (1485 of 1785) PASS: lldb-api :: functionalities/data-formatter/data-formatter-stl/libcxx/list/TestDataFormatterLibcxxList.py (1486 of 1785) PASS: lldb-api :: types/TestFloatTypesExpr.py (1487 of 1785) PASS: lldb-shell :: ObjectFile/PECOFF/sections-names.yaml (1488 of 1785) PASS: lldb-api :: commands/expression/function_template_specialization_temp_args/TestFunctionTemplateSpecializationTempArgs.py (1489 of 1785) PASS: lldb-shell :: Breakpoint/split-dwarf-5-addrbase.test (1490 of 1785) PASS: lldb-unit :: Host/./HostTests/ConnectionFileDescriptorTest.TCPGetURIv6 (1491 of 1785) UNSUPPORTED: lldb-api :: tools/lldb-vscode/launch/TestVSCode_launch.py (1492 of 1785) PASS: lldb-shell :: Reproducer/TestRelativePath.test (1493 of 1785) UNSUPPORTED: lldb-api :: functionalities/darwin_log/filter/exact_match/activity-chain/TestDarwinLogFilterMatchActivityChain.py (1494 of 1785) PASS: lldb-unit :: Host/./HostTests/NativeProcessProtocolTest.ReadCStringFromMemory_CrossPageBoundary (1495 of 1785) PASS: lldb-api :: functionalities/thread/concurrent_events/TestConcurrentDelaySignalBreak.py (1496 of 1785) PASS: lldb-unit :: Utility/./UtilityTests/StreamTest.PutHex16ByteOrderLittle (1497 of 1785) PASS: lldb-api :: functionalities/memory/cache/TestMemoryCache.py (1498 of 1785) PASS: lldb-api :: lang/cpp/chained-calls/TestCppChainedCalls.py (1499 of 1785) PASS: lldb-shell :: Unwind/eh-frame-dwarf-unwind.test (1500 of 1785) PASS: lldb-unit :: Utility/./UtilityTests/ArgsTest.TestAppendArg (1501 of 1785) PASS: lldb-shell :: SymbolFile/NativePDB/ast-methods.cpp (1502 of 1785) PASS: lldb-shell :: Driver/TestCommands.test (1503 of 1785) PASS: lldb-api :: functionalities/gdb_remote_client/TestWriteMemory.py (1504 of 1785) PASS: lldb-unit :: ScriptInterpreter/Python/./ScriptInterpreterPythonTests/PythonDataObjectsTest.TestPythonListValueEquality (1505 of 1785) PASS: lldb-api :: commands/help/TestHelp.py (1506 of 1785) PASS: lldb-api :: lang/objc/forward-decl/TestForwardDecl.py (1507 of 1785) PASS: lldb-api :: lang/cpp/namespace/TestNamespace.py (1508 of 1785) PASS: lldb-unit :: Utility/./UtilityTests/StreamTest.PutNHex8 (1509 of 1785) PASS: lldb-unit :: ObjectFile/Breakpad/./ObjectFileBreakpadTests/PublicRecord.parse (1510 of 1785) PASS: lldb-api :: commands/frame/var-scope/TestFrameVariableScope.py (1511 of 1785) PASS: lldb-api :: functionalities/breakpoint/breakpoint_command/TestBreakpointCommand.py (1512 of 1785) PASS: lldb-unit :: Utility/./UtilityTests/StringListTest.InsertStringAtIndexEnd (1513 of 1785) PASS: lldb-unit :: Utility/./UtilityTests/BinaryStreamTest.PutSLEB128FiveBytes (1514 of 1785) PASS: lldb-api :: functionalities/data-formatter/data-formatter-stl/libcxx/forward_list/TestDataFormatterLibcxxForwardList.py (1515 of 1785) PASS: lldb-unit :: SymbolFile/NativePDB/./SymbolFileNativePDBTests/PDBFPOProgramToDWARFExpressionTests.UnresolvedDependentCyclicRegisterAssignmentReference (1516 of 1785) PASS: lldb-unit :: SymbolFile/DWARF/./SymbolFileDWARFTests/SymbolFileDWARFTests.TestAbbrevOutOfOrder (1517 of 1785) PASS: lldb-unit :: Utility/./UtilityTests/ListenerTest.GetEventWait (1518 of 1785) PASS: lldb-api :: commands/expression/save_jit_objects/TestSaveJITObjects.py (1519 of 1785) PASS: lldb-shell :: ObjectFile/ELF/minidebuginfo-corrupt-xz.yaml (1520 of 1785) PASS: lldb-api :: lang/c/find_struct_type/TestFindStructTypes.py (1521 of 1785) PASS: lldb-unit :: debugserver/./debugserverTests/RNBSocket.LoopBackListenIPv4 (1522 of 1785) PASS: lldb-shell :: SymbolFile/DWARF/debug_aranges-empty-section.s (1523 of 1785) PASS: lldb-unit :: Utility/./UtilityTests/ArgsTest.TestSingleQuotedArgWithSpace (1524 of 1785) PASS: lldb-api :: python_api/lldbutil/TestSwigVersion.py (1525 of 1785) PASS: lldb-api :: commands/expression/dont_allow_jit/TestAllowJIT.py (1526 of 1785) PASS: lldb-api :: functionalities/thread/concurrent_events/TestConcurrentTwoBreakpointsOneWatchpoint.py (1527 of 1785) PASS: lldb-unit :: ObjectFile/ELF/./ObjectFileELFTests/ObjectFileELFTest.GetSymtab_NoSymEntryPointArmThumbAddressClass (1528 of 1785) PASS: lldb-unit :: Process/minidump/./LLDBMinidumpTests/MinidumpParserTest.FindMemoryRange (1529 of 1785) PASS: lldb-unit :: Target/./TargetTests/MemoryRegionInfoTest.Formatv (1530 of 1785) PASS: lldb-api :: lang/cpp/global_operators/TestCppGlobalOperators.py (1531 of 1785) PASS: lldb-api :: api/command-return-object/TestSBCommandReturnObject.py (1532 of 1785) PASS: lldb-api :: functionalities/thread/step_until/TestStepUntil.py (1533 of 1785) PASS: lldb-shell :: SymbolFile/Breakpad/unwind-via-stack-win.test (1534 of 1785) PASS: lldb-unit :: ObjectFile/Breakpad/./ObjectFileBreakpadTests/LineRecord.parse (1535 of 1785) PASS: lldb-unit :: Utility/./UtilityTests/StringExtractorTest.GetHexU8_InvalidHex_NoEof (1536 of 1785) PASS: lldb-api :: commands/expression/import-std-module/unique_ptr/TestUniquePtr.py (1537 of 1785) PASS: lldb-unit :: Utility/./UtilityTests/StreamTeeTest.Flush (1538 of 1785) PASS: lldb-unit :: ScriptInterpreter/Python/./ScriptInterpreterPythonTests/PythonDataObjectsTest.TestInstanceNameResolutionNoDot (1539 of 1785) PASS: lldb-api :: lang/cpp/dynamic-value/TestDynamicValue.py (1540 of 1785) PASS: lldb-api :: python_api/rdar-12481949/Test-rdar-12481949.py (1541 of 1785) PASS: lldb-api :: functionalities/breakpoint/breakpoint_options/TestBreakpointOptions.py (1542 of 1785) PASS: lldb-unit :: Utility/./UtilityTests/StringListTest.AppendList (1543 of 1785) PASS: lldb-unit :: Utility/./UtilityTests/StringListTest.GetMaxStringLengthDecreasingSize (1544 of 1785) PASS: lldb-api :: lang/objc/ptr_refs/TestPtrRefsObjC.py (1545 of 1785) PASS: lldb-api :: functionalities/data-formatter/data-formatter-objc/nsindexpath/TestDataFormatterNSIndexPath.py (1546 of 1785) UNSUPPORTED: lldb-api :: functionalities/darwin_log/filter/exact_match/activity/TestDarwinLogFilterMatchActivity.py (1547 of 1785) PASS: lldb-api :: lang/cpp/thread_local/TestThreadLocal.py (1548 of 1785) PASS: lldb-shell :: SymbolFile/DWARF/dir-separator-posix.s (1549 of 1785) PASS: lldb-unit :: Utility/./UtilityTests/ScalarTest.Equality (1550 of 1785) PASS: lldb-unit :: Host/./HostTests/FileSystemTest.Resolve (1551 of 1785) PASS: lldb-unit :: Utility/./UtilityTests/RangeTest.Slide (1552 of 1785) PASS: lldb-api :: functionalities/object-file/TestImageListMultiArchitecture.py (1553 of 1785) PASS: lldb-unit :: UnwindAssembly/x86/./UnwindAssemblyx86Tests/Testx86AssemblyInspectionEngine.TestSimple32bitFrameFunction (1554 of 1785) PASS: lldb-api :: functionalities/tsan/thread_leak/TestTsanThreadLeak.py (1555 of 1785) UNSUPPORTED: lldb-api :: tools/lldb-vscode/attach/TestVSCode_attach.py (1556 of 1785) PASS: lldb-unit :: Utility/./UtilityTests/StreamTest.PutRawBytesToMixedEndian (1557 of 1785) PASS: lldb-unit :: Host/./HostTests/NativeProcessProtocolTest.ReadMemoryWithoutTrap (1558 of 1785) PASS: lldb-unit :: Utility/./UtilityTests/OptionsWithRawTest.WhitespaceInput (1559 of 1785) PASS: lldb-api :: python_api/sbvalue_const_addrof/TestSBValueConstAddrOf.py (1560 of 1785) PASS: lldb-unit :: Language/Highlighting/./HighlighterTests/HighlighterTest.Keywords (1561 of 1785) PASS: lldb-unit :: Utility/./UtilityTests/LogChannelTest.Disable (1562 of 1785) PASS: lldb-unit :: Utility/./UtilityTests/StringExtractorTest.GetHexU8_Underflow_NoEof (1563 of 1785) PASS: lldb-api :: lang/cpp/type_lookup/TestCppTypeLookup.py (1564 of 1785) PASS: lldb-unit :: SymbolFile/NativePDB/./SymbolFileNativePDBTests/PDBFPOProgramToDWARFExpressionTests.UnresolvedRegisterReference (1565 of 1785) UNSUPPORTED: lldb-api :: tools/lldb-vscode/breakpoint/TestVSCode_setExceptionBreakpoints.py (1566 of 1785) PASS: lldb-shell :: Quit/TestQuitExitCodeImplicit0.test (1567 of 1785) PASS: lldb-unit :: Utility/./UtilityTests/OptionsWithRawTest.LeadingSpaceArgs (1568 of 1785) UNSUPPORTED: lldb-shell :: Breakpoint/ppc64-localentry.test (1569 of 1785) PASS: lldb-unit :: Utility/./UtilityTests/StreamTeeTest.Constructor2Streams (1570 of 1785) PASS: lldb-unit :: Utility/./UtilityTests/RegisterValueTest.GetSet8 (1571 of 1785) PASS: lldb-unit :: Expression/./ExpressionTests/DiagnosticManagerTest.PutStringSeverities (1572 of 1785) PASS: lldb-unit :: UnwindAssembly/x86/./UnwindAssemblyx86Tests/Testx86AssemblyInspectionEngine.TestPushEBX (1573 of 1785) PASS: lldb-unit :: Utility/./UtilityTests/RegularExpression.Empty (1574 of 1785) PASS: lldb-unit :: Symbol/./SymbolTests/DWARFCallFrameInfoTest.Basic_dwarf4 (1575 of 1785) PASS: lldb-shell :: SymbolFile/DWARF/find-method-local-struct.cpp (1576 of 1785) PASS: lldb-unit :: Utility/./UtilityTests/ConstStringTest.FromMidOfBufferStringRef (1577 of 1785) PASS: lldb-unit :: Utility/./UtilityTests/UriParserTest.SchemeHostSeparator (1578 of 1785) PASS: lldb-api :: functionalities/tail_call_frames/ambiguous_tail_call_seq2/TestAmbiguousTailCallSeq2.py (1579 of 1785) PASS: lldb-unit :: Utility/./UtilityTests/LogChannelEnabledTest.log_options (1580 of 1785) PASS: lldb-api :: python_api/function_symbol/TestSymbolAPI.py (1581 of 1785) PASS: lldb-unit :: Utility/./UtilityTests/StringListTest.InsertStringAtIndexMove (1582 of 1785) PASS: lldb-api :: functionalities/data-formatter/dump_dynamic/TestDumpDynamic.py (1583 of 1785) PASS: lldb-api :: functionalities/modern-type-lookup/objc-modules/TestObjModulesModernTypeLookup.py (1584 of 1785) PASS: lldb-unit :: Utility/./UtilityTests/UriParserTest.MinimalPortPath (1585 of 1785) PASS: lldb-api :: commands/process/attach/attach_denied/TestAttachDenied.py (1586 of 1785) PASS: lldb-api :: functionalities/unwind/noreturn/TestNoreturnUnwind.py (1587 of 1785) PASS: lldb-unit :: Utility/./UtilityTests/StreamTest.PutHex8 (1588 of 1785) PASS: lldb-api :: lang/c/conflicting-symbol/TestConflictingSymbol.py (1589 of 1785) PASS: lldb-unit :: Utility/./UtilityTests/EnvironmentTest.EnvpConversion (1590 of 1785) PASS: lldb-api :: functionalities/data-formatter/data-formatter-proper-plurals/TestFormattersOneIsSingular.py (1591 of 1785) PASS: lldb-api :: tools/lldb-server/TestGdbRemoteHostInfo.py (1592 of 1785) PASS: lldb-api :: functionalities/dead-strip/TestDeadStrip.py (1593 of 1785) PASS: lldb-unit :: Utility/./UtilityTests/StringListTest.JoinThree (1594 of 1785) UNSUPPORTED: lldb-shell :: Register/x86-gp-read.test (1595 of 1785) PASS: lldb-api :: functionalities/thread/exit_during_break/TestExitDuringBreak.py (1596 of 1785) PASS: lldb-api :: python_api/value/change_values/TestChangeValueAPI.py (1597 of 1785) PASS: lldb-unit :: Utility/./UtilityTests/FileSpecTest.EqualSeparator (1598 of 1785) PASS: lldb-unit :: Language/Highlighting/./HighlighterTests/HighlighterTest.ClangCursorPosInOtherToken (1599 of 1785) PASS: lldb-unit :: Utility/./UtilityTests/StringExtractorTest.GetHexBytesAvail_Underflow (1600 of 1785) PASS: lldb-unit :: UnwindAssembly/x86/./UnwindAssemblyx86Tests/Testx86AssemblyInspectionEngine.TestStackRealign8BitDisp_i386 (1601 of 1785) PASS: lldb-shell :: Quit/TestQuitExitCode30.test (1602 of 1785) UNSUPPORTED: lldb-api :: linux/sepdebugsymlink/TestTargetSymbolsSepDebugSymlink.py (1603 of 1785) PASS: lldb-unit :: Utility/./UtilityTests/StreamTeeTest.GetStreamAtIndexOutOfBounds (1604 of 1785) PASS: lldb-unit :: Utility/./UtilityTests/StreamTest.PutBytesAsRawHex8ToLittleEndian (1605 of 1785) PASS: lldb-api :: python_api/value/empty_class/TestValueAPIEmptyClass.py (1606 of 1785) PASS: lldb-shell :: Minidump/breakpad-symbols.test (1607 of 1785) PASS: lldb-api :: lang/cpp/overloaded-functions/TestOverloadedFunctions.py (1608 of 1785) PASS: lldb-shell :: Quit/TestQuitExitCodeHexA.test (1609 of 1785) PASS: lldb-unit :: Utility/./UtilityTests/StringListTest.LongestCommonPrefixEmpty (1610 of 1785) PASS: lldb-unit :: Utility/./UtilityTests/StreamTeeTest.SetStreamAtIndexOverwrite (1611 of 1785) PASS: lldb-api :: functionalities/gdb_remote_client/TestRecognizeBreakpoint.py (1612 of 1785) PASS: lldb-api :: functionalities/type_lookup/TestTypeLookup.py (1613 of 1785) PASS: lldb-unit :: Utility/./UtilityTests/StringExtractorTest.InitEmpty (1614 of 1785) PASS: lldb-unit :: Utility/./UtilityTests/StreamTest.PutChar (1615 of 1785) PASS: lldb-api :: commands/disassemble/basic/TestDisassembleBreakpoint.py (1616 of 1785) PASS: lldb-unit :: Utility/./UtilityTests/ArchSpecTest.TestSetTriple (1617 of 1785) PASS: lldb-api :: functionalities/avoids-fd-leak/TestFdLeak.py (1618 of 1785) UNSUPPORTED: lldb-api :: commands/gui/basic/TestGuiBasic.py (1619 of 1785) PASS: lldb-api :: commands/expression/persistent_types/TestNestedPersistentTypes.py (1620 of 1785) PASS: lldb-unit :: Process/minidump/./LLDBMinidumpTests/MinidumpParserTest.GetExceptionStream (1621 of 1785) PASS: lldb-unit :: UnwindAssembly/x86/./UnwindAssemblyx86Tests/Testx86AssemblyInspectionEngine.TestMovRSPtoRBP (1622 of 1785) PASS: lldb-shell :: SymbolFile/DWARF/debug-types-missing-signature.test (1623 of 1785) UNSUPPORTED: lldb-api :: functionalities/data-formatter/data-formatter-stl/libstdcpp/iterator/TestDataFormatterStdIterator.py (1624 of 1785) PASS: lldb-unit :: ScriptInterpreter/Python/./ScriptInterpreterPythonTests/PythonExceptionStateTest.TestManualRestoreSemantics (1625 of 1785) PASS: lldb-unit :: Utility/./UtilityTests/BroadcasterTest.EventTypeHasListeners (1626 of 1785) UNSUPPORTED: lldb-api :: lang/objc/bitfield_ivars/TestBitfieldIvars.py (1627 of 1785) PASS: lldb-unit :: Utility/./UtilityTests/OptionsWithRawTest.EmptyArgsOnlySuffix (1628 of 1785) PASS: lldb-api :: functionalities/inferior-crashing/recursive-inferior/TestRecursiveInferior.py (1629 of 1785) PASS: lldb-unit :: Utility/./UtilityTests/ArgsTest.ReplaceArgumentAtIndexFarOutOfRange (1630 of 1785) PASS: lldb-api :: python_api/sblaunchinfo/TestSBLaunchInfo.py (1631 of 1785) PASS: lldb-unit :: Expression/./ExpressionTests/CppModuleConfigurationTest.MissingLibCpp (1632 of 1785) PASS: lldb-api :: commands/frame/diagnose/array/TestArray.py (1633 of 1785) PASS: lldb-api :: lang/objc/foundation/TestObjCMethods2.py (1634 of 1785) PASS: lldb-shell :: Register/x86-64-ymm-read.test (1635 of 1785) PASS: lldb-api :: lang/objc/objc-property/TestObjCProperty.py (1636 of 1785) PASS: lldb-api :: lang/objc/objc-runtime-ivars/TestRuntimeIvars.py (1637 of 1785) PASS: lldb-shell :: SymbolFile/DWARF/apple-index-is-used.cpp (1638 of 1785) PASS: lldb-api :: commands/expression/import-std-module/weak_ptr-dbg-info-content/TestDbgInfoContentWeakPtr.py (1639 of 1785) PASS: lldb-unit :: Utility/./UtilityTests/RangeTest.SlideZero (1640 of 1785) PASS: lldb-unit :: UnwindAssembly/x86/./UnwindAssemblyx86Tests/Testx86AssemblyInspectionEngine.TestReturnDetect (1641 of 1785) PASS: lldb-unit :: Utility/./UtilityTests/StringExtractorTest.DecodeHexU8_InvalidHex (1642 of 1785) PASS: lldb-api :: functionalities/gdb_remote_client/TestPlatformClient.py (1643 of 1785) PASS: lldb-unit :: ScriptInterpreter/Python/./ScriptInterpreterPythonTests/PythonDataObjectsTest.TestCallable (1644 of 1785) PASS: lldb-unit :: Editline/./EditlineTests/EditlineTestFixture.EditlineReceivesMultiLineText (1645 of 1785) PASS: lldb-api :: functionalities/tail_call_frames/sbapi_support/TestTailCallFrameSBAPI.py (1646 of 1785) PASS: lldb-unit :: Utility/./UtilityTests/StringListTest.CopyListSingle (1647 of 1785) PASS: lldb-unit :: ScriptInterpreter/Python/./ScriptInterpreterPythonTests/PythonDataObjectsTest.TestPythonCallableCheck (1648 of 1785) PASS: lldb-api :: lang/cpp/namespace_conflicts/TestNamespaceConflicts.py (1649 of 1785) PASS: lldb-api :: functionalities/data-formatter/data-formatter-objc/nsstring/TestDataFormatterNSString.py (1650 of 1785) PASS: lldb-unit :: Utility/./UtilityTests/TimerTest.CategoryTimesNested (1651 of 1785) PASS: lldb-unit :: Utility/./UtilityTests/ProcessInstanceInfoMatch.Name (1652 of 1785) PASS: lldb-api :: functionalities/unwind/noreturn/module-end/TestNoReturnModuleEnd.py (1653 of 1785) PASS: lldb-unit :: Core/./LLDBCoreTests/MangledTest.ResultForValidName (1654 of 1785) PASS: lldb-shell :: ObjectFile/ELF/basic-info.yaml (1655 of 1785) XFAIL: lldb-shell :: Register/x86-64-write.test (1656 of 1785) PASS: lldb-unit :: debugserver/./debugserverTests/RNBSocket.LoopBackConnectIPv6 (1657 of 1785) PASS: lldb-unit :: SymbolFile/DWARF/./SymbolFileDWARFTests/SymbolFileDWARFTests.TestAbbrevOrder1Start1 (1658 of 1785) UNSUPPORTED: lldb-api :: functionalities/darwin_log/filter/regex/activity-chain/TestDarwinLogFilterRegexActivityChain.py (1659 of 1785) PASS: lldb-api :: tools/lldb-server/TestGdbRemoteAttach.py (1660 of 1785) PASS: lldb-unit :: Process/gdb-remote/./ProcessGdbRemoteTests/GDBRemoteCommunicationClientTest.GetMemoryRegionInfoInvalidResponse (1661 of 1785) PASS: lldb-api :: functionalities/thread/concurrent_events/TestConcurrentTwoWatchpointsOneSignal.py (1662 of 1785) PASS: lldb-unit :: Utility/./UtilityTests/StringListTest.JoinNonSpace (1663 of 1785) PASS: lldb-unit :: Utility/./UtilityTests/RangeTest.ContainsRange (1664 of 1785) PASS: lldb-unit :: Utility/./UtilityTests/OptionsWithRawTest.WhitespaceSuffix (1665 of 1785) PASS: lldb-unit :: Utility/./UtilityTests/UriParserTest.SchemeHostSeparator3 (1666 of 1785) PASS: lldb-unit :: Utility/./UtilityTests/StringListTest.AppendStringCString (1667 of 1785) UNSUPPORTED: lldb-shell :: Register/x86-64-xmm16-write.test (1668 of 1785) PASS: lldb-api :: source-manager/TestSourceManager.py (1669 of 1785) PASS: lldb-unit :: Utility/./UtilityTests/UriParserTest.TypicalPortPath (1670 of 1785) PASS: lldb-shell :: ObjectFile/PECOFF/dep-modules.yaml (1671 of 1785) PASS: lldb-unit :: Utility/./UtilityTests/ProcessInstanceInfo.DumpTable (1672 of 1785) PASS: lldb-api :: lang/objc/ivar-IMP/TestObjCiVarIMP.py (1673 of 1785) UNSUPPORTED: lldb-api :: commands/watchpoints/multi_watchpoint_slots/TestWatchpointMultipleSlots.py (1674 of 1785) PASS: lldb-api :: functionalities/thread/concurrent_events/TestConcurrentWatchBreak.py (1675 of 1785) PASS: lldb-unit :: Host/./HostTests/MainLoopTest.UnmonitoredSignal (1676 of 1785) PASS: lldb-unit :: Utility/./UtilityTests/FileSpecTest.CopyByAppendingPathComponent (1677 of 1785) PASS: lldb-unit :: Symbol/./SymbolTests/PostfixExpression.ParseOneExpression (1678 of 1785) PASS: lldb-shell :: Reproducer/Functionalities/TestStepping.test (1679 of 1785) PASS: lldb-api :: commands/expression/import-std-module/basic/TestImportStdModule.py (1680 of 1785) PASS: lldb-api :: macosx/universal/TestUniversal.py (1681 of 1785) PASS: lldb-unit :: Utility/./UtilityTests/NameMatchesTest.Equals (1682 of 1785) PASS: lldb-unit :: Target/./TargetTests/ModuleCacheTest.GetAndPutUuidExists (1683 of 1785) PASS: lldb-api :: lang/objc/objc-new-syntax/TestObjCNewSyntaxArray.py (1684 of 1785) PASS: lldb-unit :: Host/./HostTests/SocketTest.TCPListen0ConnectAccept (1685 of 1785) PASS: lldb-unit :: Utility/./UtilityTests/SerializationRountripTest.SerializeDeserializePodPointers (1686 of 1785) PASS: lldb-unit :: Target/./TargetTests/ExecutionContextTest.GetByteOrder (1687 of 1785) PASS: lldb-api :: commands/expression/top-level/TestTopLevelExprs.py (1688 of 1785) UNSUPPORTED: lldb-api :: lang/cpp/printf/TestPrintf.py (1689 of 1785) PASS: lldb-unit :: Core/./LLDBCoreTests/RichManglingContextTest.Basic (1690 of 1785) PASS: lldb-unit :: Platform/./LLDBPlatformTests/PlatformDarwinTest.TestParseVersionBuildDir (1691 of 1785) PASS: lldb-unit :: ScriptInterpreter/Python/./ScriptInterpreterPythonTests/PythonDataObjectsTest.TestDictionaryResolutionWithDot (1692 of 1785) PASS: lldb-api :: functionalities/multiword-commands/TestMultiWordCommands.py (1693 of 1785) PASS: lldb-unit :: Utility/./UtilityTests/RangeTest.ContainsEndInclusive (1694 of 1785) PASS: lldb-unit :: Utility/./UtilityTests/StringListTest.AppendStringStdString (1695 of 1785) PASS: lldb-api :: functionalities/data-formatter/ptr_ref_typedef/TestPtrRef2Typedef.py (1696 of 1785) PASS: lldb-unit :: UnwindAssembly/x86/./UnwindAssemblyx86Tests/Testx86AssemblyInspectionEngine.TestSimplei386ugmented (1697 of 1785) PASS: lldb-unit :: Utility/./UtilityTests/OptionsWithRawTest.TerminatedQuote (1698 of 1785) PASS: lldb-unit :: Utility/./UtilityTests/StringListTest.InsertStringAtIndexOutOfBounds (1699 of 1785) PASS: lldb-unit :: Utility/./UtilityTests/Predicate.WaitForValueNotEqualTo (1700 of 1785) PASS: lldb-unit :: Utility/./UtilityTests/ProcessInstanceInfo.Dump (1701 of 1785) UNSUPPORTED: lldb-api :: functionalities/longjmp/TestLongjmp.py (1702 of 1785) PASS: lldb-unit :: ScriptInterpreter/Python/./ScriptInterpreterPythonTests/PythonDataObjectsTest.TestPythonInteger (1703 of 1785) PASS: lldb-unit :: Utility/./UtilityTests/UriParserTest.BracketedHostname (1704 of 1785) PASS: lldb-api :: lang/cpp/limit-debug-info/TestWithLimitDebugInfo.py (1705 of 1785) PASS: lldb-shell :: SymbolFile/DWARF/debug-types-basic.test (1706 of 1785) PASS: lldb-api :: functionalities/data-formatter/data-formatter-objc/TestDataFormatterObjCNSBundle.py (1707 of 1785) PASS: lldb-shell :: ObjectFile/MachO/subsections.yaml (1708 of 1785) PASS: lldb-unit :: ScriptInterpreter/Python/./ScriptInterpreterPythonTests/PythonDataObjectsTest.TestExtractingUInt64ThroughStructuredData (1709 of 1785) PASS: lldb-unit :: Utility/./UtilityTests/AnsiTerminal.AtEnd (1710 of 1785) PASS: lldb-unit :: ObjectFile/Breakpad/./ObjectFileBreakpadTests/FuncRecord.parse (1711 of 1785) PASS: lldb-api :: lang/cpp/rvalue-references/TestRvalueReferences.py (1712 of 1785) PASS: lldb-unit :: Host/./HostTests/MainLoopTest.Signal (1713 of 1785) PASS: lldb-api :: functionalities/thread/create_after_attach/TestCreateAfterAttach.py (1714 of 1785) PASS: lldb-unit :: Utility/./UtilityTests/StringLexerTest.NextIfList (1715 of 1785) PASS: lldb-api :: functionalities/thread/concurrent_events/TestConcurrentManyBreakpoints.py (1716 of 1785) PASS: lldb-unit :: UnwindAssembly/x86/./UnwindAssemblyx86Tests/Testx86AssemblyInspectionEngine.Test32BitOnlyInstruction (1717 of 1785) PASS: lldb-shell :: SymbolFile/NativePDB/break-by-line.cpp (1718 of 1785) PASS: lldb-unit :: Host/./HostTests/NativeProcessProtocolTest.ReadCStringFromMemory_MaxSize (1719 of 1785) PASS: lldb-api :: functionalities/completion/TestCompletion.py (1720 of 1785) PASS: lldb-api :: functionalities/breakpoint/cpp/TestCPPBreakpointLocations.py (1721 of 1785) PASS: lldb-api :: lang/objc/foundation/TestRuntimeTypes.py (1722 of 1785) PASS: lldb-unit :: UnwindAssembly/x86/./UnwindAssemblyx86Tests/Testx86AssemblyInspectionEngine.TestPushEDX (1723 of 1785) PASS: lldb-api :: lang/objc/objc++/TestObjCXX.py (1724 of 1785) UNSUPPORTED: lldb-shell :: SymbolFile/DWARF/debug-types-expressions.test (1725 of 1785) PASS: lldb-unit :: Utility/./UtilityTests/RangeTest.ClearWithStarAddress (1726 of 1785) PASS: lldb-unit :: Utility/./UtilityTests/TimeoutTest.Construction (1727 of 1785) PASS: lldb-unit :: Core/./LLDBCoreTests/MangledTest.EmptyForInvalidName (1728 of 1785) PASS: lldb-unit :: Host/./HostTests/SocketAddressTest.GetAddressInfo (1729 of 1785) PASS: lldb-api :: lang/objc/hidden-ivars/TestHiddenIvars.py (1730 of 1785) PASS: lldb-api :: functionalities/inferior-crashing/recursive-inferior/TestRecursiveInferiorStep.py (1731 of 1785) PASS: lldb-api :: commands/watchpoints/watchpoint_commands/command/TestWatchpointCommandLLDB.py (1732 of 1785) PASS: lldb-api :: lang/objc/objc-new-syntax/TestObjCNewSyntaxDictionary.py (1733 of 1785) PASS: lldb-shell :: Breakpoint/jitbp_elf.test (1734 of 1785) PASS: lldb-api :: commands/log/invalid-args/TestInvalidArgsLog.py (1735 of 1785) PASS: lldb-unit :: Utility/./UtilityTests/StringExtractorTest.GetHexBytesAvail_OddPair2 (1736 of 1785) PASS: lldb-api :: lang/cpp/trivial_abi/TestTrivialABI.py (1737 of 1785) PASS: lldb-unit :: Utility/./UtilityTests/ListenerTest.GetEventImmediate (1738 of 1785) UNSUPPORTED: lldb-api :: benchmarks/frame_variable/TestFrameVariableResponse.py (1739 of 1785) PASS: lldb-api :: functionalities/stats_api/TestStatisticsAPI.py (1740 of 1785) PASS: lldb-unit :: Utility/./UtilityTests/LogChannelEnabledTest.LogThread (1741 of 1785) PASS: lldb-unit :: ScriptInterpreter/Python/./ScriptInterpreterPythonTests/PythonDataObjectsTest.TestResetting (1742 of 1785) PASS: lldb-api :: functionalities/postmortem/minidump-new/TestMiniDumpUUID.py (1743 of 1785) PASS: lldb-api :: commands/frame/diagnose/dereference-this/TestDiagnoseDereferenceThis.py (1744 of 1785) PASS: lldb-api :: api/listeners/TestListener.py (1745 of 1785) PASS: lldb-shell :: SymbolFile/DWARF/debug_ranges.s (1746 of 1785) PASS: lldb-unit :: Utility/./UtilityTests/RangeTest.SetRangeBase (1747 of 1785) PASS: lldb-api :: commands/watchpoints/watchpoint_set_command/TestWatchLocationWithWatchSet.py (1748 of 1785) PASS: lldb-api :: functionalities/thread/concurrent_events/TestConcurrentCrashWithBreak.py (1749 of 1785) PASS: lldb-api :: functionalities/type_completion/TestTypeCompletion.py (1750 of 1785) PASS: lldb-shell :: Breakpoint/case-sensitive.test (1751 of 1785) PASS: lldb-unit :: Utility/./UtilityTests/BinaryStreamTest.PutSLEB128Zero (1752 of 1785) PASS: lldb-api :: lang/cpp/auto/TestCPPAuto.py (1753 of 1785) PASS: lldb-api :: commands/command/history/TestCommandHistory.py (1754 of 1785) PASS: lldb-api :: lang/cpp/virtual-overload/TestVirtualOverload.py (1755 of 1785) PASS: lldb-unit :: UnwindAssembly/x86/./UnwindAssemblyx86Tests/Testx86AssemblyInspectionEngine.TestPushESI (1756 of 1785) PASS: lldb-api :: lang/objc/print-obj/TestPrintObj.py (1757 of 1785) PASS: lldb-unit :: ScriptInterpreter/Python/./ScriptInterpreterPythonTests/PythonDataObjectsTest.TestPythonIntegerToStructuredInteger (1758 of 1785) PASS: lldb-api :: python_api/symbol-context/TestSymbolContext.py (1759 of 1785) PASS: lldb-unit :: Utility/./UtilityTests/StringListTest.SplitIntoLinesSingleTrailingCR (1760 of 1785) PASS: lldb-api :: python_api/interpreter/TestRunCommandInterpreterAPI.py (1761 of 1785) PASS: lldb-shell :: Register/x86-64-read.test (1762 of 1785) PASS: lldb-unit :: Utility/./UtilityTests/RangeTest.LessThanInvalid (1763 of 1785) UNSUPPORTED: lldb-api :: linux/mix-dwo-and-regular-objects/TestMixedDwarfBinary.py (1764 of 1785) PASS: lldb-api :: functionalities/thread/concurrent_events/TestConcurrentManyWatchpoints.py (1765 of 1785) PASS: lldb-api :: lang/c/unicode/TestUnicodeSymbols.py (1766 of 1785) PASS: lldb-api :: python_api/section/TestSectionAPI.py (1767 of 1785) PASS: lldb-unit :: Utility/./UtilityTests/VMRange.SetEndAddress (1768 of 1785) UNSUPPORTED: lldb-api :: tools/lldb-vscode/breakpoint/TestVSCode_setBreakpoints.py (1769 of 1785) PASS: lldb-unit :: UnwindAssembly/x86/./UnwindAssemblyx86Tests/Testx86AssemblyInspectionEngine.TestPopR15 (1770 of 1785) PASS: lldb-api :: functionalities/data-formatter/data-formatter-stl/libcxx/map/TestDataFormatterLibccMap.py (1771 of 1785) PASS: lldb-api :: python_api/frame/get-variables/TestGetVariables.py (1772 of 1785) PASS: lldb-api :: tools/lldb-server/inferior-crash/TestGdbRemoteAbort.py (1773 of 1785) PASS: lldb-api :: lang/objc/modules-cache/TestClangModulesCache.py (1774 of 1785) PASS: lldb-api :: functionalities/data-formatter/data-formatter-ptr-to-array/TestPtrToArrayFormatting.py (1775 of 1785) PASS: lldb-api :: functionalities/ptr_refs/TestPtrRefs.py (1776 of 1785) PASS: lldb-api :: functionalities/data-formatter/data-formatter-objc/TestDataFormatterObjCExpr.py (1777 of 1785) PASS: lldb-api :: functionalities/inferior-crashing/TestInferiorCrashing.py (1778 of 1785) PASS: lldb-api :: functionalities/inferior-assert/TestInferiorAssert.py (1779 of 1785) PASS: lldb-api :: python_api/lldbutil/iter/TestLLDBIterator.py (1780 of 1785) PASS: lldb-api :: functionalities/data-formatter/poarray/TestPrintObjectArray.py (1781 of 1785) PASS: lldb-api :: commands/expression/import-std-module/vector-basic/TestBasicVector.py (1782 of 1785) PASS: lldb-api :: functionalities/inferior-crashing/TestInferiorCrashingStep.py (1783 of 1785) PASS: lldb-api :: types/TestIntegerTypes.py (1784 of 1785) PASS: lldb-api :: lang/objc/objc-new-syntax/TestObjCNewSyntaxLiteral.py (1785 of 1785) Testing Time: 1639.05s ******************** Failing Tests (2): lldb-api :: tools/lldb-server/TestLldbGdbServer.py lldb-api :: tools/lldb-server/commandline/TestStubSetSID.py

Hide Details

Hide Details

Slowest Tests: -------------------------------------------------------------------------- 114.04s: lldb-api :: functionalities/return-value/TestReturnValue.py 126.39s: lldb-api :: api/check_public_api_headers/TestPublicAPIHeaders.py 126.70s: lldb-api :: functionalities/load_unload/TestLoadUnload.py 129.83s: lldb-api :: lang/c/anonymous/TestAnonymous.py 138.90s: lldb-api :: lang/objc/objc-new-syntax/TestObjCNewSyntaxLiteral.py 139.38s: lldb-api :: lang/objc/objc-new-syntax/TestObjCNewSyntaxDictionary.py 142.65s: lldb-api :: functionalities/recursion/TestValueObjectRecursion.py 143.13s: lldb-api :: lang/objc/foundation/TestObjCMethodsNSError.py 146.49s: lldb-api :: lang/objc/exceptions/TestObjCExceptions.py 147.17s: lldb-api :: lang/objc/objc-new-syntax/TestObjCNewSyntaxArray.py 149.91s: lldb-api :: commands/target/basic/TestTargetCommand.py 157.35s: lldb-api :: lang/cpp/namespace/TestNamespaceLookup.py 195.65s: lldb-api :: lang/cpp/enum_types/TestCPP11EnumTypes.py 208.05s: lldb-api :: lang/objc/foundation/TestObjCMethods.py 211.78s: lldb-api :: api/multithreaded/TestMultithreaded.py 223.81s: lldb-api :: lang/objc/hidden-ivars/TestHiddenIvars.py 259.86s: lldb-api :: tools/lldb-server/TestLldbGdbServer.py 296.63s: lldb-api :: types/TestIntegerTypes.py 491.52s: lldb-api :: types/TestIntegerTypesExpr.py 695.24s: lldb-api :: lang/objc/foundation/TestFoundationDisassembly.py

Hide Details

Tests Times: -------------------------------------------------------------------------- [ Range ] :: [ Percentage ] :: [ Count ] -------------------------------------------------------------------------- [ 0s, 50s) :: [************************************* ] :: [1672/1785] [ 50s,100s) :: [* ] :: [ 88/1785] [100s,150s) :: [ ] :: [ 15/1785] [150s,200s) :: [ ] :: [ 3/1785] [200s,250s) :: [ ] :: [ 3/1785] [250s,300s) :: [ ] :: [ 2/1785] [300s,350s) :: [ ] :: [ 0/1785] [350s,400s) :: [ ] :: [ 0/1785] [400s,450s) :: [ ] :: [ 0/1785] [450s,500s) :: [ ] :: [ 1/1785] [500s,550s) :: [ ] :: [ 0/1785] [550s,600s) :: [ ] :: [ 0/1785] [600s,650s) :: [ ] :: [ 0/1785] [650s,700s) :: [ ] :: [ 1/1785] Expected Passes : 1635 Expected Failures : 6 Unsupported Tests : 142 Unexpected Failures: 2 FAILED: tools/lldb/test/CMakeFiles/check-lldb-lit cd /Users/buildslave/jenkins/workspace/lldb-cmake-sanitized/lldb-build/tools/lldb/test && /usr/bin/python /Users/buildslave/jenkins/workspace/lldb-cmake-sanitized/lldb-build/./bin/llvm-lit -v --time-tests --shuffle --xunit-xml-output=/Users/buildslave/jenkins/workspace/lldb-cmake-sanitized/test/results.xml -v --timeout 1200 /Users/buildslave/jenkins/workspace/lldb-cmake-sanitized/lldb-build/tools/lldb/test ninja: build stopped: subcommand failed. Command failed Command: ['/usr/bin/env', 'TERM=vt100', '/usr/local/bin/ninja', '-v', 'check-lldb'] [Pipeline] } [Pipeline] // timeout [Pipeline] } [Pipeline] // stage [Pipeline] stage [Pipeline] { (Declarative: Post Actions) [Pipeline] scanForIssues No credentials specified [Clang (LLVM based)] Sleeping for 5 seconds due to JENKINS-32191... [Clang (LLVM based)] Parsing console log (workspace: '/Users/buildslave/jenkins/workspace/lldb-cmake-sanitized') [Pipeline] junit Recording test results [Pipeline] } [Pipeline] // stage [Pipeline] } [Pipeline] // withEnv [Pipeline] } [Pipeline] // node [Pipeline] End of Pipeline [BFA] Scanning build for known causes... [BFA] Found failure cause(s): [BFA] Regression test failed from category Test [BFA] Ninja target failed from category Compile [BFA] Done. 0s ERROR: script returned exit code 1 Finished: FAILURE