FailedConsole Output

Skipping 527 KB.. Full Log
ack/TestFunctionTemplateParameterPack.py (332 of 1785)
PASS: lldb-unit :: Utility/./UtilityTests/UriParserTest.MinimalPortPath (333 of 1785)
PASS: lldb-unit :: Process/gdb-remote/./ProcessGdbRemoteTests/GDBRemoteCommunicationClientTest.TestPacketSpeedJSON (334 of 1785)
PASS: lldb-api :: functionalities/float-display/TestFloatDisplay.py (335 of 1785)
PASS: lldb-api :: commands/expression/import-std-module/unique_ptr/TestUniquePtr.py (336 of 1785)
PASS: lldb-shell :: SymbolFile/DWARF/debug_ranges_and_rnglists.test (337 of 1785)
PASS: lldb-api :: commands/expression/persistent_types/TestNestedPersistentTypes.py (338 of 1785)
PASS: lldb-api :: python_api/watchpoint/watchlocation/TestTargetWatchAddress.py (339 of 1785)
PASS: lldb-unit :: Utility/./UtilityTests/BinaryStreamTest.PutSLEB128Zero (340 of 1785)
PASS: lldb-unit :: Utility/./UtilityTests/LogTest.LLDB_LOG_nullptr (341 of 1785)
PASS: lldb-unit :: Utility/./UtilityTests/StringListTest.ShiftStdString (342 of 1785)
PASS: lldb-unit :: Utility/./UtilityTests/BinaryStreamTest.PutULEB128FourBytes (343 of 1785)
UNSUPPORTED: lldb-api :: functionalities/exec/TestExec.py (344 of 1785)
PASS: lldb-unit :: debugserver/./debugserverTests/RNBSocket.AnyListen (345 of 1785)
PASS: lldb-unit :: Language/Highlighting/./HighlighterTests/HighlighterTest.FallbackHighlighter (346 of 1785)
PASS: lldb-unit :: Target/./TargetTests/PathMappingListTest.RelativeTests (347 of 1785)
PASS: lldb-shell :: ObjectFile/MachO/lc_build_version_notools.yaml (348 of 1785)
PASS: lldb-api :: lang/cpp/virtual/TestVirtual.py (349 of 1785)
PASS: lldb-api :: lang/objc/real-definition/TestRealDefinition.py (350 of 1785)
PASS: lldb-api :: commands/watchpoints/hello_watchpoint/TestMyFirstWatchpoint.py (351 of 1785)
PASS: lldb-api :: lang/objc/rdar-11355592/TestRdar11355592.py (352 of 1785)
PASS: lldb-unit :: Host/./HostTests/MainLoopTest.UnmonitoredSignal (353 of 1785)
UNSUPPORTED: lldb-api :: lang/objc/bitfield_ivars/TestBitfieldIvars.py (354 of 1785)
PASS: lldb-unit :: Symbol/./SymbolTests/Type.GetTypeScopeAndBasename (355 of 1785)
PASS: lldb-api :: lang/objc/variadic_methods/TestVariadicMethods.py (356 of 1785)
PASS: lldb-api :: functionalities/breakpoint/source_regexp/TestSourceRegexBreakpoints.py (357 of 1785)
PASS: lldb-api :: functionalities/breakpoint/step_over_breakpoint/TestStepOverBreakpoint.py (358 of 1785)
PASS: lldb-unit :: ObjectFile/PECOFF/./ObjectFilePECOFFTests/PECallFrameInfoTest.Basic_eh (359 of 1785)
PASS: lldb-unit :: Process/minidump/./LLDBMinidumpTests/MinidumpParserTest.GetThreadContext_x86_32_wow64 (360 of 1785)
PASS: lldb-unit :: Utility/./UtilityTests/OptionsWithRawTest.WhitespaceSuffix (361 of 1785)
PASS: lldb-unit :: Utility/./UtilityTests/ConstStringTest.format_provider (362 of 1785)
PASS: lldb-unit :: SymbolFile/NativePDB/./SymbolFileNativePDBTests/PDBFPOProgramToDWARFExpressionTests.UnresolvedCyclicRegisterAssignmentReference (363 of 1785)
PASS: lldb-api :: functionalities/data-formatter/data-formatter-stl/libcxx/list/TestDataFormatterLibcxxList.py (364 of 1785)
PASS: lldb-api :: functionalities/data-formatter/data-formatter-stl/libcxx/forward_list/TestDataFormatterLibcxxForwardList.py (365 of 1785)
PASS: lldb-unit :: Language/Highlighting/./HighlighterTests/HighlighterTest.ClangIdentifiers (366 of 1785)
PASS: lldb-unit :: Host/./HostTests/FileSystemTest.EnumerateDirectory (367 of 1785)
PASS: lldb-unit :: Utility/./UtilityTests/UriParserTest.BracketedHostnameWithColon (368 of 1785)
PASS: lldb-api :: functionalities/conditional_break/TestConditionalBreak.py (369 of 1785)
PASS: lldb-api :: functionalities/signal/handle-abrt/TestHandleAbort.py (370 of 1785)
PASS: lldb-unit :: Editline/./EditlineTests/EditlineTestFixture.EditlineReceivesMultiLineText (371 of 1785)
PASS: lldb-unit :: Language/Highlighting/./HighlighterTests/HighlighterTest.HighlighterSelectionPath (372 of 1785)
PASS: lldb-api :: commands/frame/diagnose/inheritance/TestDiagnoseInheritance.py (373 of 1785)
PASS: lldb-api :: functionalities/thread/concurrent_events/TestConcurrentManyCrash.py (374 of 1785)
PASS: lldb-unit :: Utility/./UtilityTests/StringListTest.Join (375 of 1785)
PASS: lldb-api :: lang/cpp/function_refs/TestFunctionRefs.py (376 of 1785)
PASS: lldb-unit :: Utility/./UtilityTests/StatusTest.ErrorConstructor (377 of 1785)
PASS: lldb-unit :: ScriptInterpreter/Python/./ScriptInterpreterPythonTests/PythonDataObjectsTest.TestPythonByteArray (378 of 1785)
PASS: lldb-shell :: ObjectFile/PECOFF/basic-info.yaml (379 of 1785)
PASS: lldb-unit :: Utility/./UtilityTests/RangeTest.Clear (380 of 1785)
PASS: lldb-api :: functionalities/thread/concurrent_events/TestConcurrentManyBreakpoints.py (381 of 1785)
PASS: lldb-unit :: Utility/./UtilityTests/FileSpecTest.PrependPathComponent (382 of 1785)
PASS: lldb-shell :: SymbolFile/DWARF/debug_rnglists.s (383 of 1785)
PASS: lldb-unit :: Utility/./UtilityTests/LogChannelTest.List (384 of 1785)
PASS: lldb-unit :: Utility/./UtilityTests/StreamTest.PutHex32ByteOrderBig (385 of 1785)
PASS: lldb-unit :: Host/./HostTests/Host.GetEnvironment (386 of 1785)
PASS: lldb-unit :: Utility/./UtilityTests/ConstStringTest.CompareConstString (387 of 1785)
PASS: lldb-api :: lang/cpp/signed_types/TestSignedTypes.py (388 of 1785)
PASS: lldb-unit :: UnwindAssembly/x86/./UnwindAssemblyx86Tests/Testx86AssemblyInspectionEngine.TestPopEDI (389 of 1785)
PASS: lldb-unit :: Utility/./UtilityTests/RangeTest.ContainsRangeStartingFromZero (390 of 1785)
PASS: lldb-unit :: Utility/./UtilityTests/StringExtractorTest.GetHexBytes_FullString (391 of 1785)
PASS: lldb-unit :: Utility/./UtilityTests/ArchSpecTest.Compatibility (392 of 1785)
PASS: lldb-unit :: Utility/./UtilityTests/DataExtractorTest.GetMaxS64 (393 of 1785)
PASS: lldb-shell :: Commands/CommandScriptImmediateOutput/CommandScriptImmediateOutputConsole.test (394 of 1785)
PASS: lldb-shell :: Process/TestEnvironment.test (395 of 1785)
PASS: lldb-api :: functionalities/breakpoint/cpp_exception/TestCPPExceptionBreakpoint.py (396 of 1785)
PASS: lldb-unit :: Symbol/./SymbolTests/TestClangASTContext.TestGetBasicTypeFromName (397 of 1785)
PASS: lldb-api :: commands/expression/entry-bp/TestExprEntryBP.py (398 of 1785)
PASS: lldb-shell :: SymbolFile/DWARF/forward-declarations.s (399 of 1785)
PASS: lldb-shell :: SymbolFile/DWARF/debug-types-basic.test (400 of 1785)
PASS: lldb-api :: functionalities/postmortem/elf-core/TestLinuxCore.py (401 of 1785)
PASS: lldb-api :: commands/frame/diagnose/dereference-argument/TestDiagnoseDereferenceArgument.py (402 of 1785)
UNSUPPORTED: lldb-api :: functionalities/darwin_log/filter/regex/activity-chain/TestDarwinLogFilterRegexActivityChain.py (403 of 1785)
PASS: lldb-shell :: ObjectFile/ELF/section-types-edgecases.yaml (404 of 1785)
PASS: lldb-api :: lang/c/shared_lib/TestSharedLib.py (405 of 1785)
PASS: lldb-shell :: SymbolFile/Breakpad/line-table-edgecases.test (406 of 1785)
PASS: lldb-unit :: UnwindAssembly/x86/./UnwindAssemblyx86Tests/Testx86AssemblyInspectionEngine.TestPushExtended (407 of 1785)
PASS: lldb-shell :: ObjectFile/ELF/duplicate-section.yaml (408 of 1785)
PASS: lldb-unit :: Utility/./UtilityTests/NameMatchesTest.Equals (409 of 1785)
PASS: lldb-shell :: Quit/TestQuitExitCode30.test (410 of 1785)
PASS: lldb-api :: python_api/class_members/TestSBTypeClassMembers.py (411 of 1785)
PASS: lldb-api :: commands/expression/import-std-module/deque-basic/TestBasicDeque.py (412 of 1785)
PASS: lldb-unit :: debugserver/./debugserverTests/RNBSocket.LoopBackListenIPv6 (413 of 1785)
PASS: lldb-unit :: Process/minidump/./LLDBMinidumpTests/MinidumpParserTest.GetLinuxProcStatus_no_stream (414 of 1785)
PASS: lldb-api :: functionalities/tail_call_frames/thread_step_out_or_return/TestSteppingOutWithArtificialFrames.py (415 of 1785)
PASS: lldb-unit :: Utility/./UtilityTests/StringListTest.JoinThree (416 of 1785)
PASS: lldb-api :: lang/cpp/template/TestTemplateArgs.py (417 of 1785)
PASS: lldb-shell :: Reproducer/TestReuseDirectory.test (418 of 1785)
UNSUPPORTED: lldb-api :: python_api/event/TestEvents.py (419 of 1785)
PASS: lldb-api :: functionalities/modern-type-lookup/objc-modules/TestObjModulesModernTypeLookup.py (420 of 1785)
PASS: lldb-unit :: Utility/./UtilityTests/ArgsTest.BareSingleQuote (421 of 1785)
PASS: lldb-shell :: SymbolFile/DWARF/find-function-regex.cpp (422 of 1785)
PASS: lldb-api :: commands/expression/unwind_expression/TestUnwindExpression.py (423 of 1785)
PASS: lldb-unit :: ScriptInterpreter/Python/./ScriptInterpreterPythonTests/PythonDataObjectsTest.TestResetting (424 of 1785)
PASS: lldb-unit :: UnwindAssembly/x86/./UnwindAssemblyx86Tests/Testx86AssemblyInspectionEngine.TestPopRBX (425 of 1785)
PASS: lldb-api :: tools/lldb-server/TestAppleSimulatorOSType.py (426 of 1785)
PASS: lldb-api :: python_api/process/read-mem-cstring/TestReadMemCString.py (427 of 1785)
PASS: lldb-api :: commands/expression/import-std-module/forward_list-basic/TestBasicForwardList.py (428 of 1785)
PASS: lldb-api :: functionalities/data-formatter/ptr_ref_typedef/TestPtrRef2Typedef.py (429 of 1785)
UNSUPPORTED: lldb-shell :: SymbolFile/PDB/class-layout.test (430 of 1785)
UNSUPPORTED: lldb-shell :: Register/x86-gp-read.test (431 of 1785)
PASS: lldb-unit :: ScriptInterpreter/Python/./ScriptInterpreterPythonTests/PythonDataObjectsTest.TestPythonFile (432 of 1785)
UNSUPPORTED: lldb-shell :: Register/x86-zmm-write.test (433 of 1785)
UNSUPPORTED: lldb-api :: iohandler/completion/TestIOHandlerCompletion.py (434 of 1785)
PASS: lldb-unit :: UnwindAssembly/x86/./UnwindAssemblyx86Tests/Testx86AssemblyInspectionEngine.TestSubESP (435 of 1785)
PASS: lldb-api :: commands/expression/call-function/TestCallBuiltinFunction.py (436 of 1785)
PASS: lldb-unit :: Utility/./UtilityTests/DataExtractorTest.GetCStr (437 of 1785)
UNSUPPORTED: lldb-api :: functionalities/thread/break_after_join/TestBreakAfterJoin.py (438 of 1785)
PASS: lldb-unit :: Symbol/./SymbolTests/TestClangASTContext.TestConvertAccessTypeToAccessSpecifier (439 of 1785)
PASS: lldb-unit :: Target/./TargetTests/PathMappingListTest.AbsoluteTests (440 of 1785)
PASS: lldb-api :: functionalities/thread/concurrent_events/TestConcurrentTwoWatchpointsOneBreakpoint.py (441 of 1785)
PASS: lldb-unit :: SymbolFile/NativePDB/./SymbolFileNativePDBTests/PDBFPOProgramToDWARFExpressionTests.UnresolvedDependentCyclicRegisterAssignmentReference (442 of 1785)
PASS: lldb-api :: commands/command/script/import/rdar-12586188/TestRdar12586188.py (443 of 1785)
PASS: lldb-api :: functionalities/data-formatter/boolreference/TestFormattersBoolRefPtr.py (444 of 1785)
PASS: lldb-unit :: Utility/./UtilityTests/StreamTest.PutHex64ByteOrderLittle (445 of 1785)
PASS: lldb-unit :: Core/./LLDBCoreTests/RichManglingContextTest.Basic (446 of 1785)
PASS: lldb-api :: lang/c/function_types/TestFunctionTypes.py (447 of 1785)
PASS: lldb-shell :: Driver/TestProcessAttach.test (448 of 1785)
PASS: lldb-api :: lang/cpp/dynamic-value/TestCppValueCast.py (449 of 1785)
PASS: lldb-unit :: Utility/./UtilityTests/StringExtractorTest.InitEmpty (450 of 1785)
PASS: lldb-shell :: SymbolFile/DWARF/dir-separator-no-comp-dir-relative-name.s (451 of 1785)
PASS: lldb-unit :: Host/./HostTests/MainLoopTest.ReadObject (452 of 1785)
PASS: lldb-unit :: Utility/./UtilityTests/UriParserTest.SchemeHostSeparator (453 of 1785)
PASS: lldb-api :: lang/objc/objc-property/TestObjCProperty.py (454 of 1785)
PASS: lldb-unit :: ScriptInterpreter/Python/./ScriptInterpreterPythonTests/PythonExceptionStateTest.TestExceptionStateChecking (455 of 1785)
PASS: lldb-api :: commands/expression/import-std-module/shared_ptr/TestSharedPtr.py (456 of 1785)
PASS: lldb-api :: commands/frame/var-scope/TestFrameVariableScope.py (457 of 1785)
PASS: lldb-unit :: Utility/./UtilityTests/AnsiTerminal.KnownPrefix (458 of 1785)
PASS: lldb-unit :: ScriptInterpreter/Python/./ScriptInterpreterPythonTests/PythonDataObjectsTest.TestPythonListValueEquality (459 of 1785)
PASS: lldb-api :: tools/lldb-server/TestLldbGdbServer.py (460 of 1785)
PASS: lldb-unit :: Utility/./UtilityTests/TildeExpressionResolver.ResolveFullPath (461 of 1785)
PASS: lldb-unit :: Utility/./UtilityTests/StringLexerTest.NextIfList (462 of 1785)
PASS: lldb-unit :: Utility/./UtilityTests/UUIDTest.StringConverion (463 of 1785)
PASS: lldb-api :: functionalities/data-formatter/data-formatter-categories/TestDataFormatterCategories.py (464 of 1785)
PASS: lldb-unit :: Utility/./UtilityTests/RangeTest.NotEqual (465 of 1785)
PASS: lldb-unit :: Signals/./SignalsTests/UnixSignalsTest.VersionChange (466 of 1785)
PASS: lldb-unit :: UnwindAssembly/x86/./UnwindAssemblyx86Tests/Testx86AssemblyInspectionEngine.TestPopR15 (467 of 1785)
PASS: lldb-unit :: Utility/./UtilityTests/CompletionRequest.DuplicateFiltering (468 of 1785)
PASS: lldb-api :: lang/c/stepping/TestThreadStepping.py (469 of 1785)
PASS: lldb-api :: functionalities/var_path/TestVarPath.py (470 of 1785)
PASS: lldb-api :: python_api/watchpoint/TestWatchpointIter.py (471 of 1785)
PASS: lldb-shell :: SymbolFile/NativePDB/ast-methods.cpp (472 of 1785)
PASS: lldb-api :: functionalities/thread/concurrent_events/TestConcurrentSignalBreak.py (473 of 1785)
PASS: lldb-unit :: Utility/./UtilityTests/StreamTest.PutCStringWithStringRef (474 of 1785)
PASS: lldb-shell :: SymbolFile/DWARF/dir-separator-posix.s (475 of 1785)
UNSUPPORTED: lldb-api :: functionalities/darwin_log/filter/regex/subsystem/TestDarwinLogFilterRegexSubsystem.py (476 of 1785)
PASS: lldb-api :: commands/expression/import-std-module/queue/TestQueue.py (477 of 1785)
PASS: lldb-unit :: Utility/./UtilityTests/ConstStringTest.UpdateMangledCounterpart (478 of 1785)
PASS: lldb-api :: functionalities/memory/cache/TestMemoryCache.py (479 of 1785)
PASS: lldb-unit :: Utility/./UtilityTests/ArgsTest.TestOverwriteArgs (480 of 1785)
PASS: lldb-unit :: Process/minidump/./LLDBMinidumpTests/MinidumpParserTest.GetMiscInfoWindows (481 of 1785)
PASS: lldb-api :: python_api/disassemble-raw-data/TestDisassembleRawData.py (482 of 1785)
PASS: lldb-shell :: ObjectFile/ELF/aarch64-relocations.yaml (483 of 1785)
UNSUPPORTED: lldb-api :: benchmarks/stepping/TestSteppingSpeed.py (484 of 1785)
PASS: lldb-unit :: Interpreter/./InterpreterTests/OptionArgParserTest.toChar (485 of 1785)
PASS: lldb-api :: lang/cpp/class_static/TestStaticVariables.py (486 of 1785)
PASS: lldb-api :: python_api/function_symbol/TestSymbolAPI.py (487 of 1785)
PASS: lldb-api :: commands/expression/weak_symbols/TestWeakSymbols.py (488 of 1785)
PASS: lldb-api :: lang/c/enum_types/TestEnumTypes.py (489 of 1785)
PASS: lldb-api :: functionalities/dead-strip/TestDeadStrip.py (490 of 1785)
PASS: lldb-unit :: UnwindAssembly/x86/./UnwindAssemblyx86Tests/Testx86AssemblyInspectionEngine.TestDisassemblyJunkBytes (491 of 1785)
UNSUPPORTED: lldb-api :: lang/c/typedef/Testtypedef.py (492 of 1785)
PASS: lldb-api :: commands/platform/process/TestProcessList.py (493 of 1785)
PASS: lldb-api :: types/TestFloatTypes.py (494 of 1785)
PASS: lldb-unit :: Expression/./ExpressionTests/CppModuleConfigurationTest.UnrelatedLibrary (495 of 1785)
PASS: lldb-shell :: Commands/command-regex-delete.test (496 of 1785)
PASS: lldb-unit :: UnwindAssembly/x86/./UnwindAssemblyx86Tests/Testx86AssemblyInspectionEngine.TestPopEBX (497 of 1785)
PASS: lldb-api :: lang/cpp/rvalue-references/TestRvalueReferences.py (498 of 1785)
PASS: lldb-unit :: Expression/./ExpressionTests/DiagnosticManagerTest.GetStringNoDiags (499 of 1785)
PASS: lldb-unit :: Target/./TargetTests/ExecutionContextTest.GetByteOrderProcess (500 of 1785)
PASS: lldb-api :: commands/apropos/basic/TestApropos.py (501 of 1785)
PASS: lldb-api :: commands/watchpoints/watchpoint_commands/command/TestWatchpointCommandPython.py (502 of 1785)
PASS: lldb-shell :: ObjectFile/ELF/PT_LOAD-empty.yaml (503 of 1785)
PASS: lldb-api :: commands/expression/namespace_local_var_same_name_obj_c/TestNamespaceLocalVarSameNameObjC.py (504 of 1785)
PASS: lldb-unit :: Utility/./UtilityTests/ArchSpecTest.MergeFromMachOUnknown (505 of 1785)
PASS: lldb-api :: commands/expression/completion/TestExprCompletion.py (506 of 1785)
PASS: lldb-shell :: SymbolFile/DWARF/dwarf5_locations.s (507 of 1785)
PASS: lldb-unit :: Utility/./UtilityTests/RangeTest.LessThan (508 of 1785)
UNSUPPORTED: lldb-shell :: SymbolFile/PDB/enums-layout.test (509 of 1785)
PASS: lldb-api :: lang/objc/exceptions/TestObjCExceptions.py (510 of 1785)
PASS: lldb-shell :: Minidump/breakpad-symbols.test (511 of 1785)
PASS: lldb-api :: python_api/frame/inlines/TestInlinedFrame.py (512 of 1785)
PASS: lldb-shell :: Commands/command-backtrace.test (513 of 1785)
PASS: lldb-api :: lang/cpp/breakpoint-commands/TestCPPBreakpointCommands.py (514 of 1785)
PASS: lldb-shell :: SymbolFile/DWARF/debug-types-line-tables.s (515 of 1785)
PASS: lldb-unit :: Utility/./UtilityTests/EventTest.DumpEventDataBytes (516 of 1785)
PASS: lldb-unit :: Utility/./UtilityTests/StringListTest.SplitIntoLinesSingleTrailingCR (517 of 1785)
PASS: lldb-api :: functionalities/data-formatter/data-formatter-objc/TestDataFormatterObjCKVO.py (518 of 1785)
PASS: lldb-api :: python_api/value/change_values/TestChangeValueAPI.py (519 of 1785)
PASS: lldb-unit :: Utility/./UtilityTests/Flags.AllSet (520 of 1785)
PASS: lldb-unit :: Target/./TargetTests/ModuleCacheTest.GetAndPutUuidExists (521 of 1785)
PASS: lldb-unit :: Utility/./UtilityTests/RangeDataVector.FindEntryThatContains_Overlap (522 of 1785)
PASS: lldb-unit :: Utility/./UtilityTests/FileSpecTest.RemoveLastPathComponent (523 of 1785)
PASS: lldb-api :: functionalities/wrong_commands/TestWrongCommands.py (524 of 1785)
PASS: lldb-unit :: UnwindAssembly/x86/./UnwindAssemblyx86Tests/Testx86AssemblyInspectionEngine.TestSimple32bitFrameFunction (525 of 1785)
PASS: lldb-unit :: Process/minidump/./LLDBMinidumpTests/MinidumpParserTest.GetMemoryRegionInfo (526 of 1785)
PASS: lldb-api :: driver/batch_mode/TestBatchMode.py (527 of 1785)
PASS: lldb-api :: commands/expression/xvalue/TestXValuePrinting.py (528 of 1785)
PASS: lldb-shell :: SymbolFile/DWARF/apple-index-is-used.cpp (529 of 1785)
PASS: lldb-unit :: Process/gdb-remote/./ProcessGdbRemoteTests/GDBRemoteCommunicationClientTest.ReadRegister (530 of 1785)
PASS: lldb-api :: types/TestDoubleTypes.py (531 of 1785)
PASS: lldb-api :: functionalities/data-formatter/data-formatter-stl/libcxx/string/TestDataFormatterLibcxxString.py (532 of 1785)
PASS: lldb-api :: functionalities/param_entry_vals/basic_entry_values_x86_64/TestBasicEntryValuesX86_64.py (533 of 1785)
PASS: lldb-unit :: Utility/./UtilityTests/StringLexerTest.Peek (534 of 1785)
PASS: lldb-shell :: Minidump/disassemble-no-module.yaml (535 of 1785)
PASS: lldb-unit :: Utility/./UtilityTests/RangeTest.Constructor (536 of 1785)
PASS: lldb-shell :: Breakpoint/single-file-split-dwarf.test (537 of 1785)
UNSUPPORTED: lldb-api :: arm/breakpoint-thumb-codesection/TestBreakpointThumbCodesection.py (538 of 1785)
PASS: lldb-unit :: Utility/./UtilityTests/Predicate.WaitForValueEqualTo (539 of 1785)
PASS: lldb-unit :: ScriptInterpreter/Python/./ScriptInterpreterPythonTests/PythonDataObjectsTest.TestPythonIntegerToStr (540 of 1785)
PASS: lldb-api :: api/multiple-targets/TestMultipleTargets.py (541 of 1785)
PASS: lldb-api :: functionalities/breakpoint/address_breakpoints/TestAddressBreakpoints.py (542 of 1785)
PASS: lldb-unit :: Core/./LLDBCoreTests/MangledTest.EmptyForInvalidName (543 of 1785)
PASS: lldb-api :: commands/quit/TestQuit.py (544 of 1785)
PASS: lldb-api :: functionalities/multidebugger_commands/TestMultipleDebuggersCommands.py (545 of 1785)
PASS: lldb-shell :: SymbolFile/NativePDB/tag-types.cpp (546 of 1785)
PASS: lldb-unit :: Utility/./UtilityTests/StringExtractorTest.GetHexBytes_Underflow (547 of 1785)
PASS: lldb-unit :: Expression/./ExpressionTests/DiagnosticManagerTest.AppendMessageAttachToLastDiag (548 of 1785)
PASS: lldb-api :: lang/cpp/type_lookup/TestCppTypeLookup.py (549 of 1785)
PASS: lldb-unit :: Utility/./UtilityTests/LogTest.Register (550 of 1785)
UNSUPPORTED: lldb-api :: commands/register/register/intel_xtended_registers/mpx_bound_violation/TestBoundViolation.py (551 of 1785)
PASS: lldb-unit :: Language/Highlighting/./HighlighterTests/HighlighterTest.ClangCommas (552 of 1785)
PASS: lldb-api :: functionalities/data-formatter/compactvectors/TestCompactVectors.py (553 of 1785)
PASS: lldb-api :: macosx/function-starts/TestFunctionStarts.py (554 of 1785)
PASS: lldb-shell :: Unwind/eh-frame-dwarf-unwind.test (555 of 1785)
PASS: lldb-unit :: Utility/./UtilityTests/EnvironmentTest.EnvpConstruction (556 of 1785)
PASS: lldb-unit :: Utility/./UtilityTests/StringListTest.Assignment (557 of 1785)
PASS: lldb-unit :: ScriptInterpreter/Python/./ScriptInterpreterPythonTests/PythonDataObjectsTest.TestPythonBoolean (558 of 1785)
PASS: lldb-api :: lang/objc/objc-struct-argument/TestObjCStructArgument.py (559 of 1785)
PASS: lldb-shell :: Reproducer/TestFileRepro.test (560 of 1785)
PASS: lldb-api :: types/TestRecursiveTypes.py (561 of 1785)
PASS: lldb-api :: commands/process/launch/TestProcessLaunch.py (562 of 1785)
PASS: lldb-api :: functionalities/data-formatter/data-formatter-python-synth/TestDataFormatterPythonSynth.py (563 of 1785)
PASS: lldb-api :: functionalities/thread/step_out/TestThreadStepOut.py (564 of 1785)
PASS: lldb-api :: commands/expression/context-object/TestContextObject.py (565 of 1785)
PASS: lldb-shell :: SymbolFile/DWARF/childless-compile-unit.s (566 of 1785)
PASS: lldb-api :: functionalities/inline-stepping/TestInlineStepping.py (567 of 1785)
PASS: lldb-shell :: Reproducer/TestDump.test (568 of 1785)
PASS: lldb-api :: lang/cpp/auto/TestCPPAuto.py (569 of 1785)
PASS: lldb-unit :: Process/minidump/./LLDBMinidumpTests/MinidumpParserTest.GetArchitectureWindows (570 of 1785)
PASS: lldb-api :: functionalities/gdb_remote_client/TestTargetXMLArch.py (571 of 1785)
PASS: lldb-api :: functionalities/target-new-solib-notifications/TestModuleLoadedNotifys.py (572 of 1785)
PASS: lldb-unit :: Utility/./UtilityTests/ScalarTest.RightShiftOperator (573 of 1785)
PASS: lldb-api :: functionalities/gdb_remote_client/TestGDBRemoteClient.py (574 of 1785)
PASS: lldb-api :: commands/watchpoints/watchpoint_disable/TestWatchpointDisable.py (575 of 1785)
PASS: lldb-unit :: Symbol/./SymbolTests/TestClangASTContext.TestIsClangType (576 of 1785)
UNSUPPORTED: lldb-api :: tools/lldb-server/TestGdbRemoteModuleInfo.py (577 of 1785)
PASS: lldb-shell :: ObjectFile/ELF/section-types.yaml (578 of 1785)
PASS: lldb-api :: commands/frame/var/TestFrameVar.py (579 of 1785)
PASS: lldb-unit :: ObjectFile/PECOFF/./ObjectFilePECOFFTests/PECallFrameInfoTest.Frame_reg_eh (580 of 1785)
PASS: lldb-unit :: Process/minidump/./LLDBMinidumpTests/MinidumpParserTest.FindMemoryRangeWithFullMemoryMinidump (581 of 1785)
PASS: lldb-unit :: Host/./HostTests/SocketTest.UDPConnect (582 of 1785)
PASS: lldb-unit :: ScriptInterpreter/Python/./ScriptInterpreterPythonTests/PythonDataObjectsTest.TestPythonTupleValues (583 of 1785)
PASS: lldb-unit :: Expression/./ExpressionTests/CppModuleConfigurationTest.LibCppV2 (584 of 1785)
PASS: lldb-unit :: Language/CPlusPlus/./LanguageCPlusPlusTests/CPlusPlusLanguage.CPlusPlusNameParser (585 of 1785)
PASS: lldb-api :: functionalities/data-formatter/format-propagation/TestFormatPropagation.py (586 of 1785)
PASS: lldb-shell :: Settings/TestFrameFormatNoColor.test (587 of 1785)
PASS: lldb-unit :: Utility/./UtilityTests/StreamTest.PutMaxHex64ByteOrderBig (588 of 1785)
PASS: lldb-unit :: Utility/./UtilityTests/ArgsTest.AppendArguments (589 of 1785)
PASS: lldb-unit :: Utility/./UtilityTests/RangeTest.Equal (590 of 1785)
UNSUPPORTED: lldb-shell :: SymbolFile/NativePDB/ast-functions-msvc.cpp (591 of 1785)
PASS: lldb-api :: functionalities/data-formatter/data-formatter-script/TestDataFormatterScript.py (592 of 1785)
PASS: lldb-api :: functionalities/data-formatter/type_summary_list_script/TestTypeSummaryListScript.py (593 of 1785)
PASS: lldb-shell :: SymbolFile/DWARF/gnu-style-compression.cpp (594 of 1785)
PASS: lldb-unit :: Utility/./UtilityTests/StreamTest.PutCString (595 of 1785)
PASS: lldb-api :: functionalities/data-formatter/data-formatter-proper-plurals/TestFormattersOneIsSingular.py (596 of 1785)
PASS: lldb-unit :: Target/./TargetTests/ModuleCacheTest.GetAndPut (597 of 1785)
PASS: lldb-unit :: Utility/./UtilityTests/RangeTest.ContainsRange (598 of 1785)
PASS: lldb-api :: functionalities/data-formatter/frameformat_smallstruct/TestFrameFormatSmallStruct.py (599 of 1785)
PASS: lldb-api :: lang/cpp/overloaded-functions/TestOverloadedFunctions.py (600 of 1785)
PASS: lldb-api :: lang/cpp/trivial_abi/TestTrivialABI.py (601 of 1785)
PASS: lldb-api :: functionalities/data-formatter/data-formatter-objc/TestDataFormatterObjNSException.py (602 of 1785)
PASS: lldb-shell :: Settings/TestDisassemblyFormat.test (603 of 1785)
PASS: lldb-unit :: Utility/./UtilityTests/VMRange.Clear (604 of 1785)
FAIL: lldb-api :: tools/lldb-server/TestGdbRemoteAttach.py (605 of 1785)
******************** TEST 'lldb-api :: tools/lldb-server/TestGdbRemoteAttach.py' FAILED ********************
lldb version 10.0.99 (http://labmaster3.local/git/llvm-project.git revision b5088aa9442fb610f452c5a6c93c1964962c4159)
  clang revision 722b61892454b3217d73ec486e52156c5a92b5b3
  llvm revision 722b61892454b3217d73ec486e52156c5a92b5b3
LLDB library dir: /Users/buildslave/jenkins/workspace/lldb-cmake-sanitized/lldb-build/bin
LLDB import library dir: /Users/buildslave/jenkins/workspace/lldb-cmake-sanitized/lldb-build/bin
libstdcxx tests will not be run because: Don't know how to build with libstdcxx on macosx
Skipping following debug info categories: ['dwo']

Hide Details

Session logs for test failures/errors/unexpected successes will go into directory '/Users/buildslave/jenkins/workspace/lldb-cmake-sanitized/test/logs' Command invoked: /Users/buildslave/jenkins/workspace/lldb-cmake-sanitized/llvm-project/lldb/test/API/dotest.py --arch=x86_64 -s /Users/buildslave/jenkins/workspace/lldb-cmake-sanitized/lldb-build/lldb-test-traces -S nm -u CXXFLAGS -u CFLAGS --executable /Users/buildslave/jenkins/workspace/lldb-cmake-sanitized/lldb-build/./bin/lldb --dsymutil /Users/buildslave/jenkins/workspace/lldb-cmake-sanitized/lldb-build/./bin/dsymutil --filecheck /Users/buildslave/jenkins/workspace/lldb-cmake-sanitized/lldb-build/./bin/FileCheck -C /Users/buildslave/jenkins/workspace/lldb-cmake-sanitized/host-compiler/bin/clang --codesign-identity lldb_codesign --server /Users/buildslave/jenkins/workspace/lldb-cmake-sanitized/lldb-build/./bin/debugserver --arch x86_64 --build-dir /Users/buildslave/jenkins/workspace/lldb-cmake-sanitized/lldb-build/lldb-test-build.noindex -s=/Users/buildslave/jenkins/workspace/lldb-cmake-sanitized/test/logs -t --env TERM=vt100 --env LLVM_LIBS_DIR=/Users/buildslave/jenkins/workspace/lldb-cmake-sanitized/lldb-build/./lib --build-dir /Users/buildslave/jenkins/workspace/lldb-cmake-sanitized/lldb-build/tools/lldb/lldb-test-build.noindex --lldb-module-cache-dir /Users/buildslave/jenkins/workspace/lldb-cmake-sanitized/lldb-build/tools/lldb/lldb-test-build.noindex/module-cache-lldb/lldb-api --clang-module-cache-dir /Users/buildslave/jenkins/workspace/lldb-cmake-sanitized/lldb-build/tools/lldb/lldb-test-build.noindex/module-cache-clang/lldb-api /Users/buildslave/jenkins/workspace/lldb-cmake-sanitized/llvm-project/lldb/packages/Python/lldbsuite/test/tools/lldb-server -p TestGdbRemoteAttach.py Change dir to: /Users/buildslave/jenkins/workspace/lldb-cmake-sanitized/llvm-project/lldb/packages/Python/lldbsuite/test/tools/lldb-server runCmd: settings set symbols.enable-external-lookup false output:

Hide Details

runCmd: settings set plugin.process.gdb-remote.packet-timeout 60 output:

Hide Details

runCmd: settings set symbols.clang-modules-cache-path "/Users/buildslave/jenkins/workspace/lldb-cmake-sanitized/lldb-build/tools/lldb/lldb-test-build.noindex/module-cache-lldb/lldb-api" output:

Hide Details

runCmd: settings set use-color false output:

Hide Details

Adding tearDown hook: def shutdown_named_pipe(): # Close the pipe. try: named_pipe.close() except: print("failed to close named pipe") None

Hide Details

# Delete the pipe. try: os.remove(named_pipe_path) except: print("failed to delete named pipe: {}".format(named_pipe_path)) None

Hide Details

# Delete the temp directory. try: os.rmdir(temp_dir) except: print( "failed to delete temp dir: {}, directory contents: '{}'".format( temp_dir, os.listdir(temp_dir))) None

Hide Details

Hide Details

Adding tearDown hook: def shutdown_process_for_attach(): try: inferior.terminate() except: logger.warning( "failed to terminate inferior process for attach: {}; ignoring".format( sys.exc_info()[0]))

Hide Details

Hide Details

Adding tearDown hook: def cleanupSubprocesses(self): # Ensure any subprocesses are cleaned up for p in self.subprocesses: p.terminate() del p del self.subprocesses[:] # Ensure any forked processes are cleaned up for pid in self.forkedProcessPids: if os.path.exists("/proc/" + str(pid)): os.kill(pid, signal.SIGTERM)

Hide Details

Hide Details

Adding tearDown hook: def shutdown_debug_monitor(): try: server.terminate() except: logger.warning( "failed to terminate server for debug monitor: {}; ignoring".format( sys.exc_info()[0]))

Hide Details

Hide Details

Adding tearDown hook: def shutdown_socket(): if sock: try: # send the kill packet so lldb-server shuts down gracefully sock.sendall(GdbRemoteTestCaseBase._GDBREMOTE_KILL_PACKET) except: logger.warning( "failed to send kill packet to debug monitor: {}; ignoring".format( sys.exc_info()[0]))

Hide Details

try: sock.close() except: logger.warning( "failed to close socket to debug monitor: {}; ignoring".format( sys.exc_info()[0]))

Hide Details

Hide Details

FAIL: LLDB (/Users/buildslave/jenkins/workspace/lldb-cmake-sanitized/host-compiler/bin/clang-10-x86_64) :: test_attach_with_vAttach_debugserver (TestGdbRemoteAttach.TestGdbRemoteAttach) Executing tearDown hook: def shutdown_socket(): if sock: try: # send the kill packet so lldb-server shuts down gracefully sock.sendall(GdbRemoteTestCaseBase._GDBREMOTE_KILL_PACKET) except: logger.warning( "failed to send kill packet to debug monitor: {}; ignoring".format( sys.exc_info()[0]))

Hide Details

try: sock.close() except: logger.warning( "failed to close socket to debug monitor: {}; ignoring".format( sys.exc_info()[0]))

Hide Details

Hide Details

Executing tearDown hook: def shutdown_debug_monitor(): try: server.terminate() except: logger.warning( "failed to terminate server for debug monitor: {}; ignoring".format( sys.exc_info()[0]))

Hide Details

Hide Details

Executing tearDown hook: def cleanupSubprocesses(self): # Ensure any subprocesses are cleaned up for p in self.subprocesses: p.terminate() del p del self.subprocesses[:] # Ensure any forked processes are cleaned up for pid in self.forkedProcessPids: if os.path.exists("/proc/" + str(pid)): os.kill(pid, signal.SIGTERM)

Hide Details

Hide Details

Executing tearDown hook: def shutdown_process_for_attach(): try: inferior.terminate() except: logger.warning( "failed to terminate inferior process for attach: {}; ignoring".format( sys.exc_info()[0]))

Hide Details

Hide Details

Executing tearDown hook: def shutdown_named_pipe(): # Close the pipe. try: named_pipe.close() except: print("failed to close named pipe") None

Hide Details

# Delete the pipe. try: os.remove(named_pipe_path) except: print("failed to delete named pipe: {}".format(named_pipe_path)) None

Hide Details

# Delete the temp directory. try: os.rmdir(temp_dir) except: print( "failed to delete temp dir: {}, directory contents: '{}'".format( temp_dir, os.listdir(temp_dir))) None

Hide Details

Hide Details

runCmd: settings set symbols.enable-external-lookup false output:

Hide Details

runCmd: settings set plugin.process.gdb-remote.packet-timeout 60 output:

Hide Details

runCmd: settings set symbols.clang-modules-cache-path "/Users/buildslave/jenkins/workspace/lldb-cmake-sanitized/lldb-build/tools/lldb/lldb-test-build.noindex/module-cache-lldb/lldb-api" output:

Hide Details

runCmd: settings set use-color false output:

Hide Details

UNSUPPORTED: LLDB (/Users/buildslave/jenkins/workspace/lldb-cmake-sanitized/host-compiler/bin/clang-10-x86_64) :: test_attach_with_vAttach_llgs (TestGdbRemoteAttach.TestGdbRemoteAttach) (llgs tests) Restore dir to: /Users/buildslave/jenkins/workspace/lldb-cmake-sanitized/lldb-build/tools/lldb/test ====================================================================== FAIL: test_attach_with_vAttach_debugserver (TestGdbRemoteAttach.TestGdbRemoteAttach) ---------------------------------------------------------------------- Traceback (most recent call last): File "/Users/buildslave/jenkins/workspace/lldb-cmake-sanitized/llvm-project/lldb/packages/Python/lldbsuite/test/decorators.py", line 141, in wrapper func(*args, **kwargs) File "/Users/buildslave/jenkins/workspace/lldb-cmake-sanitized/llvm-project/lldb/packages/Python/lldbsuite/test/tools/lldb-server/TestGdbRemoteAttach.py", line 60, in test_attach_with_vAttach_debugserver self.attach_with_vAttach() File "/Users/buildslave/jenkins/workspace/lldb-cmake-sanitized/llvm-project/lldb/packages/Python/lldbsuite/test/tools/lldb-server/TestGdbRemoteAttach.py", line 28, in attach_with_vAttach inferior.pid, True)) AssertionError: False is not True Config=x86_64-/Users/buildslave/jenkins/workspace/lldb-cmake-sanitized/host-compiler/bin/clang-10 ---------------------------------------------------------------------- Ran 2 tests in 9.622s

Hide Details

RESULT: FAILED (0 passes, 1 failures, 0 errors, 1 skipped, 0 expected failures, 0 unexpected successes)

Hide Details

******************** PASS: lldb-api :: functionalities/tail_call_frames/ambiguous_tail_call_seq1/TestAmbiguousTailCallSeq1.py (606 of 1785) PASS: lldb-unit :: Process/minidump/./LLDBMinidumpTests/MinidumpParserTest.GetThreadsAndGetThreadContext (607 of 1785) PASS: lldb-api :: lang/c/register_variables/TestRegisterVariables.py (608 of 1785) PASS: lldb-shell :: ObjectFile/MachO/lc_build_version.yaml (609 of 1785) PASS: lldb-unit :: Utility/./UtilityTests/ArgsTest.TestUnknownEscape (610 of 1785) PASS: lldb-api :: functionalities/breakpoint/breakpoint_command/TestBreakpointCommand.py (611 of 1785) PASS: lldb-unit :: Utility/./UtilityTests/NameMatchesTest.RegularExpression (612 of 1785) PASS: lldb-unit :: ScriptInterpreter/Python/./ScriptInterpreterPythonTests/PythonDataObjectsTest.TestPythonDictionaryManipulation (613 of 1785) PASS: lldb-unit :: Utility/./UtilityTests/OptionsWithRawTest.QuotedSuffix (614 of 1785) PASS: lldb-unit :: Expression/./ExpressionTests/CppModuleConfigurationTest.MissingUsrInclude (615 of 1785) PASS: lldb-api :: lang/c/local_types/TestUseClosestType.py (616 of 1785) PASS: lldb-unit :: Symbol/./SymbolTests/PostfixExpression.ParseOneExpression (617 of 1785) PASS: lldb-api :: lang/c/find_struct_type/TestFindStructTypes.py (618 of 1785) PASS: lldb-unit :: Utility/./UtilityTests/FileSpecTest.EqualSeparator (619 of 1785) PASS: lldb-unit :: Symbol/./SymbolTests/TestClangASTContext.TestBuiltinTypeForEncodingAndBitSize (620 of 1785) UNSUPPORTED: lldb-api :: tools/lldb-server/platform-process-connect/TestPlatformProcessConnect.py (621 of 1785) PASS: lldb-unit :: Process/gdb-remote/./ProcessGdbRemoteTests/GDBRemoteCommunicationClientTest.GetModulesInfo (622 of 1785) UNSUPPORTED: lldb-api :: functionalities/data-formatter/data-formatter-stl/libstdcpp/list/TestDataFormatterStdList.py (623 of 1785) PASS: lldb-shell :: SymbolFile/DWARF/find-basic-variable.cpp (624 of 1785) PASS: lldb-api :: python_api/sbstructureddata/TestStructuredDataAPI.py (625 of 1785) PASS: lldb-api :: commands/command/script_alias/TestCommandScriptAlias.py (626 of 1785) PASS: lldb-api :: lang/objc/modules-inline-functions/TestModulesInlineFunctions.py (627 of 1785) PASS: lldb-api :: commands/reproducer/invalid-args/TestInvalidArgsReproducer.py (628 of 1785) PASS: lldb-api :: functionalities/breakpoint/objc/TestObjCBreakpoints.py (629 of 1785) PASS: lldb-unit :: Core/./LLDBCoreTests/MangledTest.ResultForValidName (630 of 1785) PASS: lldb-unit :: Utility/./UtilityTests/BinaryStreamTest.PutSLEB128EightBytes (631 of 1785) PASS: lldb-unit :: Language/Highlighting/./HighlighterTests/HighlighterTest.ClangPPDirectives (632 of 1785) PASS: lldb-api :: functionalities/data-formatter/data-formatter-synthval/TestDataFormatterSynthVal.py (633 of 1785) PASS: lldb-api :: commands/expression/class_template_specialization_empty_pack/TestClassTemplateSpecializationParametersHandling.py (634 of 1785) PASS: lldb-unit :: ScriptInterpreter/Python/./ScriptInterpreterPythonTests/PythonDataObjectsTest.TestOwnedReferences (635 of 1785) PASS: lldb-unit :: Utility/./UtilityTests/StringListTest.PopBack (636 of 1785) UNSUPPORTED: lldb-api :: tools/lldb-vscode/breakpoint/TestVSCode_setBreakpoints.py (637 of 1785) PASS: lldb-api :: commands/expression/inline-namespace/TestInlineNamespace.py (638 of 1785) PASS: lldb-api :: lang/cpp/stl/TestStdCXXDisassembly.py (639 of 1785) PASS: lldb-api :: lang/cpp/namespace/TestNamespaceLookup.py (640 of 1785) PASS: lldb-unit :: Utility/./UtilityTests/Flags.GetBitSize (641 of 1785) PASS: lldb-api :: functionalities/data-formatter/data-formatter-synthtype/TestDataFormatterSynthType.py (642 of 1785) PASS: lldb-unit :: Utility/./UtilityTests/ScalarTest.ComparisonFloat (643 of 1785) PASS: lldb-api :: functionalities/gdb_remote_client/TestGDBRemoteLoad.py (644 of 1785) PASS: lldb-api :: lang/c/blocks/TestBlocks.py (645 of 1785) PASS: lldb-unit :: Utility/./UtilityTests/StringListTest.RemoveBlankLines (646 of 1785) PASS: lldb-unit :: Utility/./UtilityTests/StringExtractorTest.GetHexBytesAvail_OddPair2 (647 of 1785) PASS: lldb-api :: sanity/TestModuleCacheSanity.py (648 of 1785) PASS: lldb-api :: functionalities/gdb_remote_client/TestNoWatchpointSupportInfo.py (649 of 1785) PASS: lldb-unit :: Utility/./UtilityTests/FileSpecTest.GuessPathStyle (650 of 1785) PASS: lldb-unit :: Utility/./UtilityTests/RangeTest.Slide (651 of 1785) PASS: lldb-unit :: Core/./LLDBCoreTests/UniqueCStringMap.NoDefaultConstructor (652 of 1785) PASS: lldb-shell :: ObjectFile/PECOFF/subsections.yaml (653 of 1785) PASS: lldb-api :: functionalities/tail_call_frames/sbapi_support/TestTailCallFrameSBAPI.py (654 of 1785) PASS: lldb-api :: functionalities/breakpoint/breakpoint_set_restart/TestBreakpointSetRestart.py (655 of 1785) UNSUPPORTED: lldb-shell :: SymbolFile/PDB/type-quals.test (656 of 1785) PASS: lldb-api :: commands/expression/po_verbosity/TestPoVerbosity.py (657 of 1785) PASS: lldb-api :: functionalities/data-formatter/data-formatter-stl/libcxx/queue/TestDataFormatterLibcxxQueue.py (658 of 1785) PASS: lldb-unit :: Utility/./UtilityTests/ScalarTest.CastOperations (659 of 1785) PASS: lldb-api :: macosx/load-kext/TestLoadKext.py (660 of 1785) PASS: lldb-api :: python_api/hello_world/TestHelloWorld.py (661 of 1785) UNSUPPORTED: lldb-api :: tools/lldb-vscode/stackTrace/TestVSCode_stackTrace.py (662 of 1785) PASS: lldb-unit :: Utility/./UtilityTests/UriParserTest.SchemeHostSeparator2 (663 of 1785) PASS: lldb-api :: functionalities/breakpoint/comp_dir_symlink/TestCompDirSymLink.py (664 of 1785) PASS: lldb-unit :: Process/gdb-remote/./ProcessGdbRemoteTests/GDBRemoteCommunicationClientTest.WriteRegisterNoSuffix (665 of 1785) PASS: lldb-shell :: Commands/CommandScriptImmediateOutput/CommandScriptImmediateOutputFile.test (666 of 1785) PASS: lldb-api :: python_api/type/TestTypeList.py (667 of 1785) PASS: lldb-api :: tools/lldb-server/inferior-crash/TestGdbRemoteAbort.py (668 of 1785) XFAIL: lldb-shell :: Register/x86-64-write.test (669 of 1785) PASS: lldb-unit :: Process/gdb-remote/./ProcessGdbRemoteTests/GDBRemoteCommunicationClientTest.GetModulesInfo_UUID20 (670 of 1785) PASS: lldb-unit :: ScriptInterpreter/Python/./ScriptInterpreterPythonTests/PythonDataObjectsTest.TestPythonTupleToStructuredList (671 of 1785) PASS: lldb-unit :: Utility/./UtilityTests/StringListTest.InsertStringAtIndexStart (672 of 1785) UNSUPPORTED: lldb-api :: functionalities/darwin_log/filter/regex/activity/TestDarwinLogFilterRegexActivity.py (673 of 1785) PASS: lldb-api :: functionalities/data-formatter/data-formatter-stl/libcxx/multiset/TestDataFormatterLibcxxMultiSet.py (674 of 1785) PASS: lldb-api :: commands/expression/issue_11588/Test11588.py (675 of 1785) PASS: lldb-unit :: Utility/./UtilityTests/ArgsTest.TestMultipleArgs (676 of 1785) PASS: lldb-unit :: Utility/./UtilityTests/StringExtractorTest.GetHexU8_Exact (677 of 1785) PASS: lldb-api :: lang/c/modules/TestCModules.py (678 of 1785) PASS: lldb-unit :: Utility/./UtilityTests/TimerTest.CategoryTimesStats (679 of 1785) PASS: lldb-shell :: ObjectFile/ELF/section-overlap.yaml (680 of 1785) PASS: lldb-api :: functionalities/data-formatter/data-formatter-cpp/TestDataFormatterCpp.py (681 of 1785) PASS: lldb-shell :: Expr/TestTypeOfDeclTypeExpr.test (682 of 1785) PASS: lldb-shell :: Breakpoint/debug_rnglist_offset_pair.test (683 of 1785) PASS: lldb-unit :: Utility/./UtilityTests/StatusTest.ErrorConversion (684 of 1785) PASS: lldb-unit :: Symbol/./SymbolTests/LineEntryTest.GetSameLineContiguousAddressRangeNoInlines (685 of 1785) PASS: lldb-unit :: ScriptInterpreter/Python/./ScriptInterpreterPythonTests/PythonDataObjectsTest.TestPythonTupleInitializerList (686 of 1785) PASS: lldb-unit :: SymbolFile/DWARF/./SymbolFileDWARFTests/SymbolFileDWARFTests.TestAbbrevOrder1Start5 (687 of 1785) PASS: lldb-unit :: Utility/./UtilityTests/UUIDTest.SetFromStringRef (688 of 1785) PASS: lldb-unit :: Expression/./ExpressionTests/DiagnosticManagerTest.GetStringSeverityLabels (689 of 1785) PASS: lldb-api :: functionalities/asan/TestMemoryHistory.py (690 of 1785) PASS: lldb-api :: functionalities/data-formatter/setvaluefromcstring/TestSetValueFromCString.py (691 of 1785) PASS: lldb-api :: functionalities/breakpoint/breakpoint_by_line_and_column/TestBreakpointByLineAndColumn.py (692 of 1785) PASS: lldb-api :: lang/objc/unicode-string/TestUnicodeString.py (693 of 1785) PASS: lldb-api :: macosx/safe-to-func-call/TestSafeFuncCalls.py (694 of 1785) PASS: lldb-shell :: Driver/LocalLLDBInit.test (695 of 1785) PASS: lldb-shell :: Breakpoint/split-dwarf-5-addrbase.test (696 of 1785) PASS: lldb-api :: commands/log/basic/TestLogging.py (697 of 1785) PASS: lldb-api :: lang/objc/objc-builtin-types/TestObjCBuiltinTypes.py (698 of 1785) PASS: lldb-api :: lang/cpp/global_operators/TestCppGlobalOperators.py (699 of 1785) PASS: lldb-shell :: ObjectFile/ELF/PT_LOAD-overlap-section.yaml (700 of 1785) PASS: lldb-api :: lang/cpp/inlines/TestInlines.py (701 of 1785) UNSUPPORTED: lldb-api :: commands/expression/completion-crash1/TestCompletionCrash1.py (702 of 1785) PASS: lldb-api :: commands/expression/timeout/TestCallWithTimeout.py (703 of 1785) PASS: lldb-unit :: Utility/./UtilityTests/StreamTest.ShiftOperatorStrings (704 of 1785) PASS: lldb-api :: commands/source/info/TestSourceInfo.py (705 of 1785) PASS: lldb-unit :: SymbolFile/DWARF/./SymbolFileDWARFTests/SymbolFileDWARFTests.TestAbbrevOutOfOrder (706 of 1785) PASS: lldb-unit :: Utility/./UtilityTests/ArgsTest.TestInsertArg (707 of 1785) UNSUPPORTED: lldb-api :: api/multiple-debuggers/TestMultipleDebuggers.py (708 of 1785) PASS: lldb-unit :: Utility/./UtilityTests/ProcessInstanceInfoMatch.Name (709 of 1785) PASS: lldb-api :: lang/objc/single-entry-dictionary/TestObjCSingleEntryDictionary.py (710 of 1785) PASS: lldb-shell :: ObjectFile/PECOFF/dep-modules.yaml (711 of 1785) PASS: lldb-api :: tools/lldb-server/TestGdbRemoteExitCode.py (712 of 1785) PASS: lldb-unit :: Utility/./UtilityTests/CompletionRequest.Constructor (713 of 1785) PASS: lldb-unit :: Process/gdb-remote/./ProcessGdbRemoteTests/GDBRemoteCommunicationClientTest.SyncThreadState (714 of 1785) PASS: lldb-api :: functionalities/unwind/sigtramp/TestSigtrampUnwind.py (715 of 1785) PASS: lldb-shell :: SymbolFile/DWARF/find-method.cpp (716 of 1785) PASS: lldb-api :: lang/cpp/breakpoint_in_member_func_w_non_primitive_params/TestBreakpointInMemberFuncWNonPrimitiveParams.py (717 of 1785) PASS: lldb-api :: lang/c/inlines/TestRedefinitionsInInlines.py (718 of 1785) PASS: lldb-shell :: ObjectFile/Breakpad/uuid-matching-mac.test (719 of 1785) PASS: lldb-api :: functionalities/abbreviation/TestCommonShortSpellings.py (720 of 1785) PASS: lldb-unit :: UnwindAssembly/x86/./UnwindAssemblyx86Tests/Testx86AssemblyInspectionEngine.TestPushR15 (721 of 1785) PASS: lldb-api :: functionalities/pre_run_dylibs/TestPreRunDylibs.py (722 of 1785) PASS: lldb-unit :: Utility/./UtilityTests/ArgsTest.TestSingleArgWithQuotedSpace (723 of 1785) PASS: lldb-unit :: Host/./HostTests/File.GetStreamFromDescriptor (724 of 1785) PASS: lldb-shell :: ObjectFile/ELF/short-build-id.yaml (725 of 1785) PASS: lldb-unit :: UnwindAssembly/x86/./UnwindAssemblyx86Tests/Testx86AssemblyInspectionEngine.TestPush0 (726 of 1785) PASS: lldb-api :: commands/expression/completion-in-lambda-and-unnnamed-class/TestCompletionInLambdaAndUnnamedClass.py (727 of 1785) PASS: lldb-api :: functionalities/backticks/TestBackticksWithoutATarget.py (728 of 1785) UNSUPPORTED: lldb-shell :: BuildScript/toolchain-msvc.test (729 of 1785) PASS: lldb-unit :: Utility/./UtilityTests/ProcessInstanceInfo.DumpTable_invalidUID (730 of 1785) PASS: lldb-unit :: Utility/./UtilityTests/ArchSpecTest.TestParseMachCPUDashSubtypeTripleSimple (731 of 1785) PASS: lldb-shell :: Reproducer/Modules/TestModuleCXX.test (732 of 1785) PASS: lldb-shell :: ObjectFile/ELF/PT_LOAD-overlap.yaml (733 of 1785) PASS: lldb-api :: commands/expression/persistent_ptr_update/TestPersistentPtrUpdate.py (734 of 1785) PASS: lldb-api :: lang/objc/radar-9691614/TestObjCMethodReturningBOOL.py (735 of 1785) PASS: lldb-shell :: Python/crashlog.test (736 of 1785) PASS: lldb-api :: functionalities/thread/concurrent_events/TestConcurrentSignalDelayWatch.py (737 of 1785) PASS: lldb-shell :: SymbolFile/NativePDB/function-types-classes.cpp (738 of 1785) PASS: lldb-api :: functionalities/gdb_remote_client/TestRestartBug.py (739 of 1785) PASS: lldb-api :: types/TestIntegerTypesExpr.py (740 of 1785) UNSUPPORTED: lldb-shell :: Register/x86-64-gp-write.test (741 of 1785) PASS: lldb-unit :: Expression/./ExpressionTests/DiagnosticManagerTest.FixedExpression (742 of 1785) UNSUPPORTED: lldb-shell :: Register/x86-64-zmm-write.test (743 of 1785) PASS: lldb-unit :: Expression/./ExpressionTests/CppModuleConfigurationTest.Sysroot (744 of 1785) PASS: lldb-unit :: Utility/./UtilityTests/VMRange.SetEndAddress (745 of 1785) PASS: lldb-unit :: Host/./HostTests/SocketTest.TCPGetConnectURI (746 of 1785) PASS: lldb-api :: commands/command/script/TestCommandScript.py (747 of 1785) PASS: lldb-unit :: Utility/./UtilityTests/StringListTest.CopyListEmpty (748 of 1785) PASS: lldb-api :: functionalities/signal/raise/TestRaise.py (749 of 1785) PASS: lldb-api :: commands/expression/cast_int_to_anonymous_enum/TestCastIntToAnonymousEnum.py (750 of 1785) PASS: lldb-shell :: Driver/TestRepl.test (751 of 1785) PASS: lldb-api :: functionalities/breakpoint/breakpoint_names/TestBreakpointNames.py (752 of 1785) UNSUPPORTED: lldb-api :: functionalities/data-formatter/data-formatter-stl/libstdcpp/vbool/TestDataFormatterStdVBool.py (753 of 1785) PASS: lldb-unit :: Utility/./UtilityTests/CompletionRequest.TryCompleteCurrentArgMode (754 of 1785) UNSUPPORTED: lldb-api :: tools/lldb-vscode/variables/TestVSCode_variables.py (755 of 1785) UNSUPPORTED: lldb-api :: functionalities/darwin_log/filter/exact_match/message/TestDarwinLogFilterMatchMessage.py (756 of 1785) PASS: lldb-unit :: UnwindAssembly/x86/./UnwindAssemblyx86Tests/Testx86AssemblyInspectionEngine.TestPopR13 (757 of 1785) PASS: lldb-api :: commands/disassemble/basic/TestDisassembleBreakpoint.py (758 of 1785) PASS: lldb-api :: functionalities/thread/concurrent_events/TestConcurrentCrashWithWatchpoint.py (759 of 1785) PASS: lldb-unit :: Utility/./UtilityTests/UriParserTest.BracketedHostname (760 of 1785) PASS: lldb-shell :: SymbolFile/DWARF/parallel-indexing-stress.s (761 of 1785) PASS: lldb-api :: functionalities/postmortem/elf-core/gcore/TestGCore.py (762 of 1785) UNSUPPORTED: lldb-shell :: Register/x86-64-ymm16-read.test (763 of 1785) PASS: lldb-shell :: Settings/TestSettingsSet.test (764 of 1785) PASS: lldb-api :: functionalities/data-formatter/typedef_array/TestTypedefArray.py (765 of 1785) PASS: lldb-unit :: Utility/./UtilityTests/RecordReplayTest.InstrumentedBar (766 of 1785) PASS: lldb-unit :: ObjectFile/Breakpad/./ObjectFileBreakpadTests/FuncRecord.parse (767 of 1785) PASS: lldb-shell :: SymbolFile/DWARF/debug_loc.s (768 of 1785) PASS: lldb-api :: commands/expression/calculator_mode/TestCalculatorMode.py (769 of 1785) PASS: lldb-api :: commands/frame/diagnose/virtual-method-call/TestDiagnoseDereferenceVirtualMethodCall.py (770 of 1785) PASS: lldb-api :: sample_test/TestSampleInlineTest.py (771 of 1785) PASS: lldb-api :: python_api/target/TestTargetAPI.py (772 of 1785) PASS: lldb-unit :: Utility/./UtilityTests/VMRange.ContainsRange (773 of 1785) PASS: lldb-api :: python_api/sbdata/TestSBData.py (774 of 1785) PASS: lldb-unit :: Utility/./UtilityTests/RangeTest.ContainsAddrInvalid (775 of 1785) PASS: lldb-unit :: Language/Highlighting/./HighlighterTests/HighlighterTest.Keywords (776 of 1785) PASS: lldb-api :: lang/cpp/bool/TestCPPBool.py (777 of 1785) PASS: lldb-shell :: SymbolFile/DWARF/debug-types-signature-loop.s (778 of 1785) PASS: lldb-unit :: ObjectFile/PECOFF/./ObjectFilePECOFFTests/PECallFrameInfoTest.Chained_eh (779 of 1785) PASS: lldb-api :: commands/frame/diagnose/dereference-function-return/TestDiagnoseDereferenceFunctionReturn.py (780 of 1785) XFAIL: lldb-shell :: SymbolFile/DWARF/find-type-in-function.cpp (781 of 1785) PASS: lldb-shell :: SymbolFile/DWARF/find-variable-dwo.cpp (782 of 1785) PASS: lldb-unit :: UnwindAssembly/x86/./UnwindAssemblyx86Tests/Testx86AssemblyInspectionEngine.TestPushR13 (783 of 1785) PASS: lldb-api :: commands/settings/quoting/TestQuoting.py (784 of 1785) PASS: lldb-unit :: Interpreter/./InterpreterTests/CompletionTest.DirCompletionAbsolute (785 of 1785) UNSUPPORTED: lldb-api :: commands/watchpoints/multi_watchpoint_slots/TestWatchpointMultipleSlots.py (786 of 1785) PASS: lldb-api :: lang/cpp/char1632_t/TestChar1632T.py (787 of 1785) PASS: lldb-unit :: Utility/./UtilityTests/AnsiTerminal.Empty (788 of 1785) PASS: lldb-api :: commands/expression/vector_of_enums/TestVectorOfEnums.py (789 of 1785) PASS: lldb-shell :: ObjectFile/MachO/subsections.yaml (790 of 1785) PASS: lldb-api :: lang/cpp/lambdas/TestLambdas.py (791 of 1785) PASS: lldb-api :: lang/objc/objc-class-method/TestObjCClassMethod.py (792 of 1785) PASS: lldb-unit :: Utility/./UtilityTests/StringExtractorTest.DecodeHexU8_Underflow2 (793 of 1785) UNSUPPORTED: lldb-api :: functionalities/data-formatter/data-formatter-stl/libstdcpp/smart_ptr/TestDataFormatterStdSmartPtr.py (794 of 1785) PASS: lldb-unit :: Utility/./UtilityTests/RegularExpression.Match (795 of 1785) PASS: lldb-shell :: Quit/TestQuitExitCodeTooManyArgs.test (796 of 1785) PASS: lldb-shell :: Minidump/fb-dump.test (797 of 1785) PASS: lldb-api :: lang/c/set_values/TestSetValues.py (798 of 1785) PASS: lldb-unit :: Utility/./UtilityTests/FileSpecTest.EqualDotsPosixRoot (799 of 1785) PASS: lldb-unit :: Target/./TargetTests/PathMappingListTest.RemapRoot (800 of 1785) PASS: lldb-unit :: Target/./TargetTests/ModuleCacheTest.GetAndPutStrangeHostname (801 of 1785) PASS: lldb-unit :: ScriptInterpreter/Python/./ScriptInterpreterPythonTests/PythonDataObjectsTest.TestDictionaryResolutionWithDot (802 of 1785) PASS: lldb-api :: functionalities/inferior-crashing/TestInferiorCrashing.py (803 of 1785) PASS: lldb-api :: functionalities/stats_api/TestStatisticsAPI.py (804 of 1785) UNSUPPORTED: lldb-api :: functionalities/process_save_core/TestProcessSaveCore.py (805 of 1785) PASS: lldb-shell :: SymbolFile/DWARF/find-basic-function.cpp (806 of 1785) PASS: lldb-api :: python_api/lldbutil/process/TestPrintStackTraces.py (807 of 1785) PASS: lldb-api :: commands/process/attach/TestProcessAttach.py (808 of 1785) PASS: lldb-unit :: Utility/./UtilityTests/ScalarTest.GetValue (809 of 1785) PASS: lldb-unit :: Utility/./UtilityTests/ScalarTest.Equality (810 of 1785) UNSUPPORTED: lldb-api :: commands/expression/completion-crash2/TestCompletionCrash2.py (811 of 1785) PASS: lldb-api :: python_api/frame/TestFrames.py (812 of 1785) PASS: lldb-api :: commands/expression/radar_9531204/TestPrintfAfterUp.py (813 of 1785) PASS: lldb-shell :: Reproducer/Functionalities/TestDataFormatter.test (814 of 1785) UNSUPPORTED: lldb-shell :: ObjectFile/ELF/minidebuginfo-no-lzma.yaml (815 of 1785) UNSUPPORTED: lldb-shell :: SymbolFile/PDB/calling-conventions.test (816 of 1785) PASS: lldb-unit :: Utility/./UtilityTests/OptionsWithRawTest.EmptyInput (817 of 1785) PASS: lldb-unit :: ObjectFile/Breakpad/./ObjectFileBreakpadTests/FileRecord.parse (818 of 1785) UNSUPPORTED: lldb-api :: benchmarks/libcxxlist/TestBenchmarkLibcxxList.py (819 of 1785) PASS: lldb-api :: commands/watchpoints/watchpoint_commands/TestWatchpointCommands.py (820 of 1785) PASS: lldb-unit :: ScriptInterpreter/Python/./ScriptInterpreterPythonTests/PythonExceptionStateTest.TestDiscardSemantics (821 of 1785) PASS: lldb-unit :: Utility/./UtilityTests/OptionsWithRawTest.UnterminatedQuote (822 of 1785) PASS: lldb-shell :: Expr/TestIRMemoryMap.test (823 of 1785) PASS: lldb-unit :: ScriptInterpreter/Python/./ScriptInterpreterPythonTests/PythonDataObjectsTest.TestModuleNameResolutionNoDot (824 of 1785) PASS: lldb-shell :: SymbolFile/DWARF/debug-types-missing-signature.test (825 of 1785) PASS: lldb-api :: commands/expression/import-std-module/vector-dbg-info-content/TestDbgInfoContentVector.py (826 of 1785) PASS: lldb-api :: lang/mixed/TestMixedLanguages.py (827 of 1785) PASS: lldb-api :: functionalities/testid/TestTestId.py (828 of 1785) PASS: lldb-api :: lang/cpp/operators/TestCppOperators.py (829 of 1785) PASS: lldb-unit :: Utility/./UtilityTests/ArgsTest.EscapeLLDBCommandArgument (830 of 1785) PASS: lldb-unit :: Utility/./UtilityTests/FileSpecTest.FileAndDirectoryComponents (831 of 1785) PASS: lldb-unit :: Utility/./UtilityTests/LogChannelEnabledTest.LogGetLogThread (832 of 1785) PASS: lldb-unit :: Utility/./UtilityTests/ArgsTest.TestSingleQuotedArgWithSpace (833 of 1785) PASS: lldb-shell :: SymbolFile/DWARF/dwarf5-partial-index.cpp (834 of 1785) PASS: lldb-unit :: Language/Highlighting/./HighlighterTests/HighlighterTest.ClangCursorPos (835 of 1785) PASS: lldb-unit :: Process/minidump/./LLDBMinidumpTests/MinidumpParserTest.GetExceptionStream (836 of 1785) PASS: lldb-shell :: Breakpoint/split-dwarf5-debug-stroffsets.test (837 of 1785) PASS: lldb-unit :: Utility/./UtilityTests/StringListTest.ShiftMove (838 of 1785) PASS: lldb-api :: lang/cpp/accelerator-table/TestCPPAccelerator.py (839 of 1785) PASS: lldb-api :: functionalities/thread/concurrent_events/TestConcurrentCrashWithBreak.py (840 of 1785) PASS: lldb-api :: functionalities/data-formatter/data-formatter-globals/TestDataFormatterGlobals.py (841 of 1785) PASS: lldb-api :: functionalities/breakpoint/breakpoint_ignore_count/TestBreakpointIgnoreCount.py (842 of 1785) PASS: lldb-unit :: UnwindAssembly/x86/./UnwindAssemblyx86Tests/Testx86AssemblyInspectionEngine.TestStackRealignMSVC_i386 (843 of 1785) PASS: lldb-unit :: SymbolFile/NativePDB/./SymbolFileNativePDBTests/PDBFPOProgramToDWARFExpressionTests.UnresolvedRegisterReference (844 of 1785) UNSUPPORTED: lldb-api :: commands/register/register/intel_xtended_registers/TestMPXRegisters.py (845 of 1785) PASS: lldb-unit :: Signals/./SignalsTests/UnixSignalsTest.GetFilteredSignals (846 of 1785) PASS: lldb-unit :: Utility/./UtilityTests/StreamTest.QuotedCString (847 of 1785) PASS: lldb-unit :: UnwindAssembly/x86/./UnwindAssemblyx86Tests/Testx86AssemblyInspectionEngine.TestPushEBP (848 of 1785) PASS: lldb-unit :: Utility/./UtilityTests/RangeTest.LessThanInvalid (849 of 1785) PASS: lldb-api :: functionalities/thread/concurrent_events/TestConcurrentCrashWithWatchpointBreakpointSignal.py (850 of 1785) PASS: lldb-unit :: Target/./TargetTests/MemoryRegionInfoTest.Formatv (851 of 1785) PASS: lldb-api :: lang/objc/ptr_refs/TestPtrRefsObjC.py (852 of 1785) PASS: lldb-api :: python_api/value/TestValueAPI.py (853 of 1785) PASS: lldb-api :: functionalities/data-formatter/data-formatter-enum-format/TestDataFormatterEnumFormat.py (854 of 1785) XFAIL: lldb-shell :: Register/x86-mm-xmm-read.test (855 of 1785) PASS: lldb-unit :: Utility/./UtilityTests/StreamTest.ShiftOperatorInts (856 of 1785) PASS: lldb-api :: lang/cpp/extern_c/TestExternCSymbols.py (857 of 1785) PASS: lldb-api :: lang/cpp/call-function/TestCallCPPFunction.py (858 of 1785) PASS: lldb-unit :: Host/./HostTests/FileSystemTest.OpenErrno (859 of 1785) PASS: lldb-unit :: UnwindAssembly/x86/./UnwindAssemblyx86Tests/Testx86AssemblyInspectionEngine.TestPushRBX (860 of 1785) PASS: lldb-api :: commands/frame/diagnose/array/TestArray.py (861 of 1785) UNSUPPORTED: lldb-api :: functionalities/thread/state/TestThreadStates.py (862 of 1785) PASS: lldb-api :: functionalities/ubsan/user-expression/TestUbsanUserExpression.py (863 of 1785) PASS: lldb-shell :: Settings/TestModuleCacheSanity.test (864 of 1785) PASS: lldb-unit :: UnwindAssembly/x86/./UnwindAssemblyx86Tests/Testx86AssemblyInspectionEngine.TestPushEBX (865 of 1785) PASS: lldb-api :: commands/expression/top-level/TestTopLevelExprs.py (866 of 1785) PASS: lldb-unit :: Process/gdb-remote/./ProcessGdbRemoteTests/GDBRemoteClientBaseTest.SendContinueAndLateInterrupt (867 of 1785) PASS: lldb-unit :: Utility/./UtilityTests/AnsiTerminal.AtStart (868 of 1785) PASS: lldb-api :: functionalities/data-formatter/data-formatter-stl/libcxx/multimap/TestDataFormatterLibccMultiMap.py (869 of 1785) PASS: lldb-shell :: SymbolFile/NativePDB/ast-functions.cpp (870 of 1785) PASS: lldb-unit :: Host/./HostTests/FileSystemTest.Exists (871 of 1785) PASS: lldb-unit :: Utility/./UtilityTests/StringExtractorTest.GetNameColonValueNoColon (872 of 1785) PASS: lldb-api :: functionalities/thread/concurrent_events/TestConcurrentDelaySignalWatch.py (873 of 1785) PASS: lldb-unit :: Utility/./UtilityTests/AnsiTerminal.Unknown (874 of 1785) PASS: lldb-api :: functionalities/data-formatter/data-formatter-named-summaries/TestDataFormatterNamedSummaries.py (875 of 1785) PASS: lldb-api :: terminal/TestSTTYBeforeAndAfter.py (876 of 1785) PASS: lldb-api :: functionalities/thread/thread_specific_break/TestThreadSpecificBreakpoint.py (877 of 1785) PASS: lldb-unit :: Utility/./UtilityTests/RangeTest.DefaultConstructor (878 of 1785) PASS: lldb-api :: functionalities/thread/concurrent_events/TestConcurrentBreakpointDelayBreakpointOneSignal.py (879 of 1785) PASS: lldb-api :: tools/lldb-server/inferior-crash/TestGdbRemoteSegFault.py (880 of 1785) PASS: lldb-shell :: SymbolFile/NativePDB/bitfields.cpp (881 of 1785) UNSUPPORTED: lldb-api :: benchmarks/libcxxmap/TestBenchmarkLibcxxMap.py (882 of 1785) PASS: lldb-api :: functionalities/non-overlapping-index-variable-i/TestIndexVariable.py (883 of 1785) PASS: lldb-api :: functionalities/data-formatter/poarray/TestPrintObjectArray.py (884 of 1785) PASS: lldb-unit :: Utility/./UtilityTests/BinaryStreamTest.PutSLEB128ThreeBytes (885 of 1785) PASS: lldb-unit :: debugserver/./debugserverTests/RNBSocket.LoopBackConnectIPv6 (886 of 1785) PASS: lldb-shell :: Unwind/trap_frame_sym_ctx.test (887 of 1785) PASS: lldb-api :: functionalities/breakpoint/breakpoint_ids/TestBreakpointIDs.py (888 of 1785) PASS: lldb-unit :: Host/./HostTests/SocketTest.DomainGetConnectURI (889 of 1785) PASS: lldb-api :: functionalities/data-formatter/data-formatter-stl/libcxx/list/loop/TestDataFormatterLibcxxListLoop.py (890 of 1785) PASS: lldb-unit :: Symbol/./SymbolTests/PostfixExpression.ParseFPOProgram (891 of 1785) PASS: lldb-unit :: UnwindAssembly/x86/./UnwindAssemblyx86Tests/Testx86AssemblyInspectionEngine.TestSpillRegToStackViaMOVi386 (892 of 1785) PASS: lldb-unit :: Symbol/./SymbolTests/DWARFCallFrameInfoTest.Basic_eh (893 of 1785) PASS: lldb-unit :: Utility/./UtilityTests/Flags.Reset (894 of 1785) PASS: lldb-api :: commands/frame/diagnose/dereference-this/TestDiagnoseDereferenceThis.py (895 of 1785) PASS: lldb-api :: commands/expression/import-std-module/deque-dbg-info-content/TestDbgInfoContentDeque.py (896 of 1785) PASS: lldb-api :: functionalities/modern-type-lookup/libcxx/TestLibCxxModernTypeLookup.py (897 of 1785) PASS: lldb-unit :: Utility/./UtilityTests/ListenerTest.GetEventImmediate (898 of 1785) PASS: lldb-api :: functionalities/recursion/TestValueObjectRecursion.py (899 of 1785) PASS: lldb-unit :: Utility/./UtilityTests/StreamTeeTest.SetStreamAtIndexOverwrite (900 of 1785) PASS: lldb-shell :: ObjectFile/ELF/compressed-sections.yaml (901 of 1785) PASS: lldb-api :: python_api/lldbutil/iter/TestLLDBIterator.py (902 of 1785) PASS: lldb-api :: functionalities/data-formatter/data-formatter-objc/nsstring/TestDataFormatterNSString.py (903 of 1785) PASS: lldb-unit :: Utility/./UtilityTests/UUIDTest.RelationalOperators (904 of 1785) PASS: lldb-unit :: Utility/./UtilityTests/StringLexerTest.Next (905 of 1785) PASS: lldb-unit :: ScriptInterpreter/Python/./ScriptInterpreterPythonTests/PythonDataObjectsTest.TestExtractingUInt64ThroughStructuredData (906 of 1785) PASS: lldb-shell :: SymbolFile/DWARF/debug-types-dwarf5.s (907 of 1785) UNSUPPORTED: lldb-api :: functionalities/darwin_log/source/debug/TestDarwinLogSourceDebug.py (908 of 1785) PASS: lldb-api :: python_api/interpreter/TestRunCommandInterpreterAPI.py (909 of 1785) UNSUPPORTED: lldb-shell :: SymbolFile/DWARF/debug-types-expressions.test (910 of 1785) PASS: lldb-unit :: Utility/./UtilityTests/LogChannelEnabledTest.log_options (911 of 1785) PASS: lldb-unit :: Expression/./ExpressionTests/CppModuleConfigurationTest.IgnoreLibStdCpp (912 of 1785) PASS: lldb-unit :: Utility/./UtilityTests/DataExtractorTest.GetCStrAtNullOffset (913 of 1785) PASS: lldb-shell :: SymbolFile/DWARF/find-basic-namespace.cpp (914 of 1785) PASS: lldb-shell :: SymbolFile/Breakpad/line-table-mixed-path-styles.test (915 of 1785) PASS: lldb-api :: functionalities/thread/concurrent_events/TestConcurrentDelayedCrashWithBreakpointWatchpoint.py (916 of 1785) UNSUPPORTED: lldb-shell :: Unwind/eh-frame-small-fde.test (917 of 1785) PASS: lldb-unit :: Utility/./UtilityTests/StringExtractorTest.GetHexBytesAvail_Partial (918 of 1785) PASS: lldb-api :: commands/expression/import_builtin_fileid/TestImportBuiltinFileID.py (919 of 1785) PASS: lldb-unit :: Utility/./UtilityTests/StringListTest.LongestCommonPrefixNoPrefix (920 of 1785) PASS: lldb-unit :: Host/./HostTests/SocketAddressTest.GetAddressInfo (921 of 1785) PASS: lldb-unit :: Utility/./UtilityTests/OptionsWithRawTest.SingleWhitespaceInput (922 of 1785) PASS: lldb-api :: functionalities/step-avoids-no-debug/TestStepNoDebug.py (923 of 1785) PASS: lldb-shell :: Register/x86-64-gp-read.test (924 of 1785) UNSUPPORTED: lldb-api :: functionalities/darwin_log/filter/exact_match/category/TestDarwinLogFilterMatchCategory.py (925 of 1785) PASS: lldb-shell :: ObjectFile/Breakpad/breakpad-identification.test (926 of 1785) PASS: lldb-api :: functionalities/breakpoint/breakpoint_hit_count/TestBreakpointHitCount.py (927 of 1785) PASS: lldb-unit :: ScriptInterpreter/Python/./ScriptInterpreterPythonTests/PythonExceptionStateTest.TestManualRestoreSemantics (928 of 1785) PASS: lldb-api :: commands/expression/persistent_variables/TestPersistentVariables.py (929 of 1785) PASS: lldb-api :: tools/lldb-server/TestGdbRemoteExpeditedRegisters.py (930 of 1785) PASS: lldb-api :: python_api/rdar-12481949/Test-rdar-12481949.py (931 of 1785) PASS: lldb-unit :: Utility/./UtilityTests/StringExtractorTest.GetHexU8_Underflow2 (932 of 1785) PASS: lldb-unit :: UnwindAssembly/x86/./UnwindAssemblyx86Tests/Testx86AssemblyInspectionEngine.TestPopESI (933 of 1785) PASS: lldb-unit :: Utility/./UtilityTests/UriParserTest.SchemeHostSeparator4 (934 of 1785) PASS: lldb-unit :: Utility/./UtilityTests/ScalarTest.SetValueFromCString (935 of 1785) PASS: lldb-api :: lang/c/vla/TestVLA.py (936 of 1785) PASS: lldb-unit :: SymbolFile/NativePDB/./SymbolFileNativePDBTests/PDBFPOProgramToDWARFExpressionTests.InvalidAssignmentMultiple (937 of 1785) PASS: lldb-unit :: UnwindAssembly/x86/./UnwindAssemblyx86Tests/Testx86AssemblyInspectionEngine.Testi386IgnoredRegisters (938 of 1785) UNSUPPORTED: lldb-api :: functionalities/data-formatter/data-formatter-stl/libcxx/function/TestLibCxxFunction.py (939 of 1785) PASS: lldb-unit :: ObjectFile/Breakpad/./ObjectFileBreakpadTests/ModuleRecord.parse (940 of 1785) PASS: lldb-api :: functionalities/thread/backtrace_limit/TestBacktraceLimit.py (941 of 1785) PASS: lldb-api :: functionalities/thread/concurrent_events/TestConcurrentCrashWithSignal.py (942 of 1785) UNSUPPORTED: lldb-api :: tools/lldb-server/thread-name/TestGdbRemoteThreadName.py (943 of 1785) PASS: lldb-api :: functionalities/type_completion/TestTypeCompletion.py (944 of 1785) PASS: lldb-unit :: Symbol/./SymbolTests/TestClangASTContext.TestUnifyAccessSpecifiers (945 of 1785) PASS: lldb-unit :: Utility/./UtilityTests/StringListTest.GetMaxStringLengthDecreasingSize (946 of 1785) PASS: lldb-unit :: Utility/./UtilityTests/StreamTeeTest.Flush (947 of 1785) PASS: lldb-api :: functionalities/thread/exit_during_step/TestExitDuringStep.py (948 of 1785) PASS: lldb-api :: functionalities/thread/concurrent_events/TestConcurrentTwoBreakpointsOneWatchpoint.py (949 of 1785) PASS: lldb-api :: functionalities/breakpoint/serialize/TestBreakpointSerialization.py (950 of 1785) PASS: lldb-unit :: Utility/./UtilityTests/ListenerTest.GetEventWait (951 of 1785) PASS: lldb-unit :: UnwindAssembly/x86/./UnwindAssemblyx86Tests/Testx86AssemblyInspectionEngine.TestPushRBPWithREX (952 of 1785) PASS: lldb-api :: functionalities/inferior-assert/TestInferiorAssert.py (953 of 1785) PASS: lldb-shell :: SymbolFile/Breakpad/unwind-via-stack-win.test (954 of 1785) PASS: lldb-shell :: ObjectFile/MachO/symtab.yaml (955 of 1785) UNSUPPORTED: lldb-api :: commands/expression/multiline-completion/TestMultilineCompletion.py (956 of 1785) PASS: lldb-unit :: Utility/./UtilityTests/StateTest.Formatv (957 of 1785) PASS: lldb-unit :: Language/Highlighting/./HighlighterTests/HighlighterTest.HighlighterSelectionType (958 of 1785) PASS: lldb-shell :: Quit/TestQuitExitCodeHexA.test (959 of 1785) PASS: lldb-api :: functionalities/tail_call_frames/inlining_and_tail_calls/TestInliningAndTailCalls.py (960 of 1785) PASS: lldb-unit :: UnwindAssembly/x86/./UnwindAssemblyx86Tests/Testx86AssemblyInspectionEngine.Test32BitOnlyInstruction (961 of 1785) PASS: lldb-unit :: Expression/./ExpressionTests/DWARFExpression.DW_OP_pick (962 of 1785) PASS: lldb-shell :: Driver/TestTarget.test (963 of 1785) PASS: lldb-shell :: Commands/command-regex-unalias.test (964 of 1785) PASS: lldb-unit :: Utility/./UtilityTests/SerializationRountripTest.SerializeDeserializePodReferences (965 of 1785) PASS: lldb-shell :: SymbolFile/Breakpad/symtab.test (966 of 1785) PASS: lldb-unit :: SymbolFile/DWARF/./SymbolFileDWARFTests/SymbolFileDWARFTests.TestAbbrevValidAttrNullForm (967 of 1785) UNSUPPORTED: lldb-api :: android/platform/TestDefaultCacheLineSize.py (968 of 1785) PASS: lldb-api :: functionalities/data-formatter/synthupdate/TestSyntheticFilterRecompute.py (969 of 1785) PASS: lldb-unit :: Utility/./UtilityTests/LogChannelTest.Disable (970 of 1785) PASS: lldb-api :: python_api/function_symbol/TestDisasmAPI.py (971 of 1785) PASS: lldb-api :: lang/objc/objc-baseclass-sbtype/TestObjCBaseClassSBType.py (972 of 1785) PASS: lldb-api :: macosx/lc-note/kern-ver-str/TestKernVerStrLCNOTE.py (973 of 1785) PASS: lldb-api :: functionalities/inferior-crashing/TestInferiorCrashingStep.py (974 of 1785) PASS: lldb-api :: functionalities/data-formatter/data-formatter-smart-array/TestDataFormatterSmartArray.py (975 of 1785) PASS: lldb-unit :: Utility/./UtilityTests/StringListTest.JoinEmpty (976 of 1785) PASS: lldb-unit :: SymbolFile/DWARF/./SymbolFileDWARFTests/SymbolFileDWARFTests.TestAbbrevNullAttrValidForm (977 of 1785) PASS: lldb-unit :: Utility/./UtilityTests/ScalarTest.GetBytes (978 of 1785) PASS: lldb-unit :: ObjectFile/Breakpad/./ObjectFileBreakpadTests/StackWinRecord.parse (979 of 1785) PASS: lldb-unit :: Utility/./UtilityTests/UriParserTest.MinimalPort (980 of 1785) PASS: lldb-api :: python_api/value/linked_list/TestValueAPILinkedList.py (981 of 1785) PASS: lldb-api :: python_api/objc_type/TestObjCType.py (982 of 1785) PASS: lldb-unit :: Host/./HostTests/FileSystemTest.Readable (983 of 1785) PASS: lldb-unit :: Utility/./UtilityTests/StringExtractorTest.GetHexU8_Extra_NoEof (984 of 1785) PASS: lldb-unit :: Utility/./UtilityTests/FileSpecTest.FormatFileSpec (985 of 1785) PASS: lldb-shell :: SymbolFile/DWARF/array-sizes.s (986 of 1785) PASS: lldb-unit :: Language/Highlighting/./HighlighterTests/HighlighterTest.ClangSquareBrackets (987 of 1785) PASS: lldb-unit :: Utility/./UtilityTests/UriParserTest.BadPort (988 of 1785) PASS: lldb-unit :: Utility/./UtilityTests/StringExtractorTest.GetHexBytes_OddPair2 (989 of 1785) PASS: lldb-shell :: Settings/TestEchoCommands.test (990 of 1785) PASS: lldb-api :: functionalities/breakpoint/scripted_bkpt/TestScriptedResolver.py (991 of 1785) PASS: lldb-unit :: Utility/./UtilityTests/Predicate.WaitForValueNotEqualTo (992 of 1785) PASS: lldb-unit :: Utility/./UtilityTests/RegularExpression.Empty (993 of 1785) PASS: lldb-unit :: Symbol/./SymbolTests/SymbolsTest.LocateExecutableSymbolFileForUnknownExecutableAndMissingSymbolFile (994 of 1785) UNSUPPORTED: lldb-api :: functionalities/thread/create_during_step/TestCreateDuringStep.py (995 of 1785) PASS: lldb-unit :: Utility/./UtilityTests/StreamTest.PutBytesAsRawHex8ToMixedEndian (996 of 1785) PASS: lldb-api :: lang/c/const_variables/TestConstVariables.py (997 of 1785) PASS: lldb-unit :: Symbol/./SymbolTests/SymbolsTest.TerminateLocateExecutableSymbolFileForUnknownExecutableAndUnknownSymbolFile (998 of 1785) PASS: lldb-unit :: ScriptInterpreter/Python/./ScriptInterpreterPythonTests/PythonDataObjectsTest.TestPythonInteger (999 of 1785) PASS: lldb-unit :: Utility/./UtilityTests/StreamTest.PutHex16ByteOrderBig (1000 of 1785) PASS: lldb-unit :: Utility/./UtilityTests/UriParserTest.LongPath (1001 of 1785) PASS: lldb-api :: tools/lldb-server/TestGdbRemoteRegisterState.py (1002 of 1785) PASS: lldb-unit :: Process/gdb-remote/./ProcessGdbRemoteTests/GDBRemoteCommunicationClientTest.SendGetMetaDataPacket (1003 of 1785) PASS: lldb-api :: commands/watchpoints/watchpoint_commands/command/TestWatchpointCommandLLDB.py (1004 of 1785) PASS: lldb-unit :: Utility/./UtilityTests/StringListTest.LongestCommonPrefixEmpty (1005 of 1785) PASS: lldb-unit :: Core/./LLDBCoreTests/RichManglingContextTest.SwitchProvider (1006 of 1785) PASS: lldb-unit :: Utility/./UtilityTests/StringExtractorTest.GetHexBytes (1007 of 1785) PASS: lldb-unit :: Host/./HostTests/HostInfoTest.GetHostname (1008 of 1785) PASS: lldb-shell :: SymbolFile/NativePDB/disassembly.cpp (1009 of 1785) PASS: lldb-api :: source-manager/TestSourceManager.py (1010 of 1785) PASS: lldb-unit :: Utility/./UtilityTests/StringLexerTest.GetUnlexed (1011 of 1785) PASS: lldb-unit :: Process/gdb-remote/./ProcessGdbRemoteTests/GDBRemoteCommunicationClientTest.WriteRegister (1012 of 1785) PASS: lldb-api :: functionalities/tsan/thread_leak/TestTsanThreadLeak.py (1013 of 1785) PASS: lldb-api :: lang/cpp/incomplete-types/TestCppIncompleteTypes.py (1014 of 1785) UNSUPPORTED: lldb-shell :: Register/x86-zmm-read.test (1015 of 1785) PASS: lldb-shell :: ObjectFile/Breakpad/sections.test (1016 of 1785) PASS: lldb-api :: functionalities/data-formatter/data-formatter-objc/TestDataFormatterObjCCF.py (1017 of 1785) PASS: lldb-api :: functionalities/breakpoint/breakpoint_language/TestBreakpointLanguage.py (1018 of 1785) PASS: lldb-api :: functionalities/multiword-commands/TestMultiWordCommands.py (1019 of 1785) XFAIL: lldb-shell :: Unwind/prefer-debug-over-eh-frame.test (1020 of 1785) PASS: lldb-api :: commands/expression/diagnostics/TestExprDiagnostics.py (1021 of 1785) PASS: lldb-unit :: Process/gdb-remote/./ProcessGdbRemoteTests/GDBRemoteClientBaseTest.SendContinueDelegateStructuredDataReceipt (1022 of 1785) PASS: lldb-unit :: ScriptInterpreter/Python/./ScriptInterpreterPythonTests/PythonDataObjectsTest.TestPythonString (1023 of 1785) PASS: lldb-api :: lang/objc/modules-cache/TestClangModulesCache.py (1024 of 1785) PASS: lldb-shell :: Breakpoint/jitbp_elf.test (1025 of 1785) PASS: lldb-api :: lang/objc/foundation/TestSymbolTable.py (1026 of 1785) PASS: lldb-shell :: SymbolFile/DWARF/find-inline-method.s (1027 of 1785) UNSUPPORTED: lldb-api :: tools/lldb-vscode/step/TestVSCode_step.py (1028 of 1785) PASS: lldb-unit :: ObjectFile/ELF/./ObjectFileELFTests/ObjectFileELFTest.SectionsResolveConsistently (1029 of 1785) PASS: lldb-unit :: UnwindAssembly/x86/./UnwindAssemblyx86Tests/Testx86AssemblyInspectionEngine.TestPopR14 (1030 of 1785) PASS: lldb-unit :: Core/./LLDBCoreTests/StreamCallbackTest.Callback (1031 of 1785) PASS: lldb-unit :: Host/./HostTests/MainLoopTest.TerminatesImmediately (1032 of 1785) PASS: lldb-api :: lang/objc/rdar-10967107/TestRdar10967107.py (1033 of 1785) UNSUPPORTED: lldb-api :: functionalities/longjmp/TestLongjmp.py (1034 of 1785) PASS: lldb-api :: functionalities/tsan/cpp_global_location/TestTsanCPPGlobalLocation.py (1035 of 1785) PASS: lldb-shell :: BuildScript/script-args.test (1036 of 1785) PASS: lldb-api :: commands/expression/import-std-module/empty-module/TestEmptyStdModule.py (1037 of 1785) PASS: lldb-api :: lang/c/offsetof/TestOffsetof.py (1038 of 1785) PASS: lldb-api :: commands/command/delete/TestCommandDelete.py (1039 of 1785) PASS: lldb-unit :: UnwindAssembly/x86/./UnwindAssemblyx86Tests/Testx86AssemblyInspectionEngine.TestPushESI (1040 of 1785) PASS: lldb-unit :: SymbolFile/NativePDB/./SymbolFileNativePDBTests/PDBFPOProgramToDWARFExpressionTests.DependencyChain (1041 of 1785) PASS: lldb-unit :: Utility/./UtilityTests/RecordReplayTest.InstrumentedFooSameThis (1042 of 1785) PASS: lldb-api :: commands/process/launch-with-shellexpand/TestLaunchWithShellExpand.py (1043 of 1785) PASS: lldb-unit :: Language/Highlighting/./HighlighterTests/HighlighterTest.ClangStringLiterals (1044 of 1785) PASS: lldb-shell :: ObjectFile/PECOFF/uuid.yaml (1045 of 1785) PASS: lldb-unit :: Utility/./UtilityTests/BinaryStreamTest.PutSLEB128FourBytes (1046 of 1785) UNSUPPORTED: lldb-api :: functionalities/data-formatter/data-formatter-stl/libstdcpp/iterator/TestDataFormatterStdIterator.py (1047 of 1785) PASS: lldb-unit :: Utility/./UtilityTests/VMRange.Ordering (1048 of 1785) PASS: lldb-unit :: Host/./HostTests/FileSystemTest.FileAndDirectoryComponents (1049 of 1785) PASS: lldb-unit :: Process/minidump/./LLDBMinidumpTests/MinidumpParserTest.GetMiscInfo_no_stream (1050 of 1785) PASS: lldb-api :: lang/objc/objc-checker/TestObjCCheckers.py (1051 of 1785) PASS: lldb-unit :: Utility/./UtilityTests/Flags.AnySet (1052 of 1785) PASS: lldb-api :: commands/expression/radar_9673664/TestExprHelpExamples.py (1053 of 1785) PASS: lldb-unit :: Expression/./ExpressionTests/DiagnosticManagerTest.GetStringPreserveOrder (1054 of 1785) PASS: lldb-api :: commands/gui/invalid-args/TestInvalidArgsGui.py (1055 of 1785) PASS: lldb-api :: macosx/thread-names/TestInterruptThreadNames.py (1056 of 1785) PASS: lldb-unit :: Utility/./UtilityTests/StringLexerTest.PutBack (1057 of 1785) PASS: lldb-api :: commands/expression/ir-interpreter-phi-nodes/TestIRInterpreterPHINodes.py (1058 of 1785) PASS: lldb-unit :: Expression/./ExpressionTests/DiagnosticManagerTest.AppendMessageSubsequentDiags (1059 of 1785) PASS: lldb-unit :: Utility/./UtilityTests/FileSpecTest.EqualDotsPosix (1060 of 1785) PASS: lldb-api :: functionalities/tsan/thread_numbers/TestTsanThreadNumbers.py (1061 of 1785) PASS: lldb-unit :: Utility/./UtilityTests/ArgsTest.GetQuotedCommandString (1062 of 1785) PASS: lldb-api :: lang/cpp/chained-calls/TestCppChainedCalls.py (1063 of 1785) UNSUPPORTED: lldb-api :: lang/objc/rdar-12408181/TestRdar12408181.py (1064 of 1785) UNSUPPORTED: lldb-api :: tools/lldb-vscode/launch/TestVSCode_launch.py (1065 of 1785) PASS: lldb-unit :: Utility/./UtilityTests/StringListTest.AppendList (1066 of 1785) PASS: lldb-shell :: ObjectFile/ELF/gnu-debuglink.yaml (1067 of 1785) UNSUPPORTED: lldb-api :: functionalities/darwin_log/filter/regex/message/TestDarwinLogFilterRegexMessage.py (1068 of 1785) PASS: lldb-api :: commands/expression/rdar42038760/TestScalarURem.py (1069 of 1785) UNSUPPORTED: lldb-shell :: Register/x86-ymm-write.test (1070 of 1785) PASS: lldb-unit :: UnwindAssembly/x86/./UnwindAssemblyx86Tests/Testx86AssemblyInspectionEngine.TestLEAVE (1071 of 1785) PASS: lldb-unit :: Utility/./UtilityTests/FileSpecTest.GetNormalizedPath (1072 of 1785) PASS: lldb-unit :: Host/./HostTests/File.GetWaitableHandleFileno (1073 of 1785) PASS: lldb-shell :: SymbolFile/NativePDB/break-by-function.cpp (1074 of 1785) PASS: lldb-unit :: Utility/./UtilityTests/ArgsTest.DoubleQuotedItem (1075 of 1785) PASS: lldb-unit :: ObjectFile/ELF/./ObjectFileELFTests/ObjectFileELFTest.GetModuleSpecifications_EarlySectionHeaders (1076 of 1785) PASS: lldb-unit :: Utility/./UtilityTests/StringListTest.GetMaxStringLengthEmpty (1077 of 1785) PASS: lldb-unit :: Utility/./UtilityTests/OptionsWithRawTest.TerminatedQuote (1078 of 1785) PASS: lldb-shell :: SymbolFile/DWARF/debug-types-address-ranges.s (1079 of 1785) PASS: lldb-unit :: UnwindAssembly/x86/./UnwindAssemblyx86Tests/Testx86AssemblyInspectionEngine.TestSubRSP (1080 of 1785) PASS: lldb-shell :: ObjectFile/ELF/minidebuginfo-corrupt-xz.yaml (1081 of 1785) UNSUPPORTED: lldb-shell :: Breakpoint/ppc64-localentry.test (1082 of 1785) PASS: lldb-unit :: SymbolFile/NativePDB/./SymbolFileNativePDBTests/PDBFPOProgramToDWARFExpressionTests.InvalidOpBinary (1083 of 1785) PASS: lldb-unit :: Utility/./UtilityTests/OptionsWithRawTest.EmptyArgsOnlySuffix (1084 of 1785) PASS: lldb-unit :: Utility/./UtilityTests/StringListTest.InsertStringAtIndexOutOfBounds (1085 of 1785) PASS: lldb-api :: commands/statistics/basic/TestStats.py (1086 of 1785) PASS: lldb-unit :: Utility/./UtilityTests/SerializationRountripTest.SerializeDeserializeObjectPointer (1087 of 1785) PASS: lldb-api :: functionalities/modern-type-lookup/basic-objc/TestBasicObjcModernTypeLookup.py (1088 of 1785) PASS: lldb-api :: functionalities/tsan/multiple/TestTsanMultiple.py (1089 of 1785) PASS: lldb-api :: functionalities/unwind/noreturn/TestNoreturnUnwind.py (1090 of 1785) PASS: lldb-unit :: Target/./TargetTests/ExecutionContextTest.GetByteOrderTarget (1091 of 1785) PASS: lldb-unit :: Process/gdb-remote/./ProcessGdbRemoteTests/GDBRemoteClientBaseTest.SendContinueAndAsyncPacket (1092 of 1785) PASS: lldb-unit :: UnwindAssembly/x86/./UnwindAssemblyx86Tests/Testx86AssemblyInspectionEngine.TestSimplei386ugmented (1093 of 1785) PASS: lldb-unit :: Utility/./UtilityTests/BinaryStreamTest.PutSLEB128One (1094 of 1785) PASS: lldb-shell :: Breakpoint/debug_addrx.test (1095 of 1785) PASS: lldb-unit :: Process/gdb-remote/./ProcessGdbRemoteTests/GDBRemoteCommunicationClientTest.GetMemoryRegionInfoInvalidResponse (1096 of 1785) PASS: lldb-api :: lang/cpp/gmodules-templates/TestGModules.py (1097 of 1785) PASS: lldb-unit :: Interpreter/./InterpreterTests/OptionArgParserTest.toBoolean (1098 of 1785) PASS: lldb-api :: lang/cpp/std-function-step-into-callable/TestStdFunctionStepIntoCallable.py (1099 of 1785) PASS: lldb-unit :: Expression/./ExpressionTests/DWARFExpression.DW_OP_convert (1100 of 1785) PASS: lldb-api :: functionalities/plugins/python_os_plugin/TestPythonOSPlugin.py (1101 of 1785) PASS: lldb-api :: functionalities/mtc/simple/TestMTCSimple.py (1102 of 1785) PASS: lldb-api :: lang/objc/ivar-IMP/TestObjCiVarIMP.py (1103 of 1785) PASS: lldb-api :: functionalities/breakpoint/breakpoint_conditions/TestBreakpointConditions.py (1104 of 1785) PASS: lldb-api :: python_api/sblaunchinfo/TestSBLaunchInfo.py (1105 of 1785) PASS: lldb-unit :: Process/minidump/./LLDBMinidumpTests/MinidumpParserTest.FindMemoryRange (1106 of 1785) UNSUPPORTED: lldb-api :: functionalities/tty/TestTerminal.py (1107 of 1785) PASS: lldb-unit :: Utility/./UtilityTests/StreamTest.PutStringAsRawHex8 (1108 of 1785) PASS: lldb-unit :: Utility/./UtilityTests/StringListTest.DefaultConstructor (1109 of 1785) PASS: lldb-unit :: SymbolFile/NativePDB/./SymbolFileNativePDBTests/PDBFPOProgramToDWARFExpressionTests.SingleAssignmentRegisterRef (1110 of 1785) PASS: lldb-unit :: Host/./HostTests/NativeProcessProtocolTest.SetBreakpointFailWrite (1111 of 1785) UNSUPPORTED: lldb-shell :: Register/x86-64-zmm-read.test (1112 of 1785) PASS: lldb-api :: commands/expression/test/TestExprs2.py (1113 of 1785) PASS: lldb-shell :: SymbolFile/DWARF/split-dwarf-multiple-cu.ll (1114 of 1785) PASS: lldb-api :: functionalities/thread/jump/TestThreadJump.py (1115 of 1785) PASS: lldb-unit :: Utility/./UtilityTests/OptionsWithRawTest.ArgsButNoDelimiter (1116 of 1785) PASS: lldb-api :: lang/objc/foundation/TestObjCMethods.py (1117 of 1785) PASS: lldb-unit :: Utility/./UtilityTests/ScalarTest.Promotion (1118 of 1785) PASS: lldb-api :: functionalities/breakpoint/dummy_target_breakpoints/TestBreakpointsWithNoTargets.py (1119 of 1785) PASS: lldb-api :: functionalities/thread/backtrace_all/TestBacktraceAll.py (1120 of 1785) PASS: lldb-api :: commands/target/create-no-such-arch/TestNoSuchArch.py (1121 of 1785) PASS: lldb-unit :: ObjectFile/Breakpad/./ObjectFileBreakpadTests/LineRecord.parse (1122 of 1785) PASS: lldb-api :: commands/expression/formatters/TestFormatters.py (1123 of 1785) PASS: lldb-unit :: Symbol/./SymbolTests/DWARFCallFrameInfoTest.Basic_dwarf3 (1124 of 1785) PASS: lldb-api :: lang/cpp/class-template-parameter-pack/TestClassTemplateParameterPack.py (1125 of 1785) PASS: lldb-unit :: Host/./HostTests/Host.WaitStatusFormat (1126 of 1785) PASS: lldb-unit :: ScriptInterpreter/Python/./ScriptInterpreterPythonTests/PythonDataObjectsTest.TestTypeNameResolutionNoDot (1127 of 1785) PASS: lldb-unit :: Utility/./UtilityTests/RecordReplayTest.InstrumentedBarPtr (1128 of 1785) PASS: lldb-shell :: SymbolFile/DWARF/deterministic-build.cpp (1129 of 1785) PASS: lldb-api :: lang/objc/modules-auto-import/TestModulesAutoImport.py (1130 of 1785) PASS: lldb-unit :: Utility/./UtilityTests/ProcessInfoTest.Constructor (1131 of 1785) PASS: lldb-unit :: ScriptInterpreter/Python/./ScriptInterpreterPythonTests/PythonDataObjectsTest.TestPythonIntegerToStructuredInteger (1132 of 1785) PASS: lldb-unit :: Utility/./UtilityTests/StreamTest.ShiftOperatorPtr (1133 of 1785) PASS: lldb-unit :: UnwindAssembly/x86/./UnwindAssemblyx86Tests/Testx86AssemblyInspectionEngine.Test32bitFramelessBigStackFrame (1134 of 1785) PASS: lldb-unit :: Utility/./UtilityTests/BinaryStreamTest.PutSLEB128SevenBytes (1135 of 1785) PASS: lldb-shell :: Watchpoint/SetErrorCases.test (1136 of 1785) PASS: lldb-api :: functionalities/inferior-crashing/recursive-inferior/TestRecursiveInferiorStep.py (1137 of 1785) PASS: lldb-unit :: Utility/./UtilityTests/StringExtractorTest.GetNameColonValueSuccess (1138 of 1785) PASS: lldb-api :: functionalities/thread/concurrent_events/TestConcurrentSignalWatchBreak.py (1139 of 1785) PASS: lldb-shell :: BuildScript/compiler-full-path.test (1140 of 1785) PASS: lldb-unit :: Utility/./UtilityTests/NameMatchesTest.EndsWith (1141 of 1785) PASS: lldb-api :: lang/cpp/class_types/TestClassTypesDisassembly.py (1142 of 1785) PASS: lldb-api :: lang/objc/objc-new-syntax/TestObjCNewSyntaxLiteral.py (1143 of 1785) PASS: lldb-unit :: Utility/./UtilityTests/Flags.Test (1144 of 1785) PASS: lldb-api :: functionalities/data-formatter/data-formatter-stl/libcxx/bitset/TestDataFormatterLibcxxBitset.py (1145 of 1785) PASS: lldb-unit :: Process/gdb-remote/./ProcessGdbRemoteTests/GDBRemoteCommunicationServerTest.SendErrorResponse_ErrorNumber (1146 of 1785) PASS: lldb-shell :: ObjectFile/PECOFF/basic-info-arm64.yaml (1147 of 1785) PASS: lldb-unit :: Utility/./UtilityTests/StreamTeeTest.GetStreamAtIndexOutOfBounds (1148 of 1785) PASS: lldb-api :: functionalities/tsan/global_location/TestTsanGlobalLocation.py (1149 of 1785) PASS: lldb-unit :: Symbol/./SymbolTests/LineEntryTest.GetSameLineContiguousAddressRangeOneInline (1150 of 1785) PASS: lldb-unit :: Expression/./ExpressionTests/DiagnosticManagerTest.PutStringSeverities (1151 of 1785) PASS: lldb-unit :: Utility/./UtilityTests/StringExtractorTest.DecodeHexU8_Exact (1152 of 1785) PASS: lldb-api :: api/log/TestAPILog.py (1153 of 1785) PASS: lldb-api :: lang/c/bitfields/TestBitfields.py (1154 of 1785) PASS: lldb-api :: commands/expression/rdar44436068/Test128BitsInteger.py (1155 of 1785) UNSUPPORTED: lldb-shell :: SymbolFile/target-symbols-add-unwind.test (1156 of 1785) PASS: lldb-unit :: Host/./HostTests/SocketTest.TCPListen0GetPort (1157 of 1785) PASS: lldb-unit :: Utility/./UtilityTests/StringExtractorTest.GetHexBytes_Partial (1158 of 1785) PASS: lldb-unit :: Expression/./ExpressionTests/CppModuleConfigurationTest.LinuxLocalLibCpp (1159 of 1785) UNSUPPORTED: lldb-shell :: SymbolFile/PDB/pointers.test (1160 of 1785) PASS: lldb-api :: commands/expression/namespace_local_var_same_name_cpp_and_c/TestNamespaceLocalVarSameNameCppAndC.py (1161 of 1785) PASS: lldb-shell :: ObjectFile/ELF/many-sections.s (1162 of 1785) PASS: lldb-api :: functionalities/thread/concurrent_events/TestConcurrentTwoWatchpointsOneDelayBreakpoint.py (1163 of 1785) PASS: lldb-api :: commands/expression/ignore-artificial-constructors/TestIgnoreArtificialConstructors.py (1164 of 1785) PASS: lldb-shell :: ObjectFile/ELF/PT_LOAD-overlap-PT_TLS.yaml (1165 of 1785) PASS: lldb-api :: lang/objc/foundation/TestObjCMethods2.py (1166 of 1785) PASS: lldb-api :: functionalities/breakpoint/require_hw_breakpoints/TestRequireHWBreakpoints.py (1167 of 1785) PASS: lldb-api :: python_api/breakpoint/TestBreakpointAPI.py (1168 of 1785) PASS: lldb-shell :: SymbolFile/DWARF/find-variable-file.cpp (1169 of 1785) PASS: lldb-api :: functionalities/paths/TestPaths.py (1170 of 1785) PASS: lldb-api :: lang/c/stepping/TestStepAndBreakpoints.py (1171 of 1785) UNSUPPORTED: lldb-shell :: Register/x86-64-xmm16-read.test (1172 of 1785) PASS: lldb-api :: lang/objc/objc-foundation-dictionary-empty/TestNSDictionary0.py (1173 of 1785) PASS: lldb-api :: commands/target/create-deps/TestTargetCreateDeps.py (1174 of 1785) PASS: lldb-unit :: Utility/./UtilityTests/VMRange.IsValid (1175 of 1785) UNSUPPORTED: lldb-api :: commands/watchpoints/hello_watchlocation/TestWatchLocation.py (1176 of 1785) PASS: lldb-api :: python_api/watchpoint/watchlocation/TestSetWatchlocation.py (1177 of 1785) PASS: lldb-unit :: UnwindAssembly/x86/./UnwindAssemblyx86Tests/Testx86AssemblyInspectionEngine.Test32bitFramelessSmallStackFrame (1178 of 1785) UNSUPPORTED: lldb-api :: functionalities/thread/thread_specific_break_plus_condition/TestThreadSpecificBpPlusCondition.py (1179 of 1785) PASS: lldb-api :: functionalities/thread/num_threads/TestNumThreads.py (1180 of 1785) PASS: lldb-unit :: Target/./TargetTests/ExecutionContextTest.GetByteOrder (1181 of 1785) PASS: lldb-unit :: SymbolFile/DWARF/./SymbolFileDWARFTests/SymbolFileDWARFTests.TestAbilitiesForDWARF (1182 of 1785) PASS: lldb-unit :: Host/./HostTests/SocketTest.DomainListenConnectAccept (1183 of 1785) PASS: lldb-unit :: Language/Highlighting/./HighlighterTests/HighlighterTest.ClangUnterminatedString (1184 of 1785) PASS: lldb-shell :: Reproducer/Functionalities/TestStepping.test (1185 of 1785) PASS: lldb-unit :: UnwindAssembly/x86/./UnwindAssemblyx86Tests/Testx86AssemblyInspectionEngine.TestPushEAX (1186 of 1785) PASS: lldb-unit :: Utility/./UtilityTests/RangeTest.DoesAdjoinOrIntersect (1187 of 1785) PASS: lldb-api :: functionalities/history/TestHistoryRecall.py (1188 of 1785) PASS: lldb-unit :: Utility/./UtilityTests/DataExtractorTest.GetCStrEmpty (1189 of 1785) PASS: lldb-unit :: SymbolFile/DWARF/./SymbolFileDWARFTests/SymbolFileDWARFTests.TestAbbrevMissingTerminator (1190 of 1785) PASS: lldb-api :: commands/expression/function_template_specialization_temp_args/TestFunctionTemplateSpecializationTempArgs.py (1191 of 1785) PASS: lldb-unit :: Expression/./ExpressionTests/ClangHostTest.MacOSX (1192 of 1785) PASS: lldb-unit :: Utility/./UtilityTests/RecordReplayTest.InstrumentedBarRef (1193 of 1785) PASS: lldb-shell :: Reproducer/TestRelativePath.test (1194 of 1785) PASS: lldb-unit :: Utility/./UtilityTests/FileSpecTest.CopyByAppendingPathComponent (1195 of 1785) PASS: lldb-unit :: Utility/./UtilityTests/ArgsTest.ReplaceArgumentAtIndexEqual (1196 of 1785) PASS: lldb-unit :: Expression/./ExpressionTests/DiagnosticManagerTest.GetStringMultipleDiags (1197 of 1785) PASS: lldb-api :: functionalities/breakpoint/move_nearest/TestMoveNearest.py (1198 of 1785) PASS: lldb-unit :: Process/minidump/./LLDBMinidumpTests/MinidumpParserTest.GetPidWindows (1199 of 1785) PASS: lldb-api :: lang/cpp/namespace/TestNamespace.py (1200 of 1785) PASS: lldb-unit :: Utility/./UtilityTests/BinaryStreamTest.PutULEB128Zero (1201 of 1785) PASS: lldb-api :: functionalities/data-formatter/stringprinter/TestStringPrinter.py (1202 of 1785) PASS: lldb-api :: python_api/lldbutil/iter/TestRegistersIterator.py (1203 of 1785) PASS: lldb-api :: lang/cpp/scope/TestCppScope.py (1204 of 1785) PASS: lldb-unit :: Utility/./UtilityTests/BinaryStreamTest.PutSLEB128MaxValue (1205 of 1785) PASS: lldb-unit :: Utility/./UtilityTests/StringExtractorTest.GetHexU8_Underflow2_NoEof (1206 of 1785) PASS: lldb-shell :: SymbolFile/NativePDB/global-classes.cpp (1207 of 1785) PASS: lldb-api :: functionalities/modern-type-lookup/basic/TestBasicModernTypeLookup.py (1208 of 1785) UNSUPPORTED: lldb-api :: functionalities/breakpoint/breakpoint_in_delayslot/TestAvoidBreakpointInDelaySlot.py (1209 of 1785) PASS: lldb-api :: lang/cpp/llvm-style/TestLLVMStyle.py (1210 of 1785) PASS: lldb-api :: lang/objc/objc-new-syntax/TestObjCNewSyntaxArray.py (1211 of 1785) PASS: lldb-api :: lang/objc/objc-optimized/TestObjcOptimized.py (1212 of 1785) PASS: lldb-api :: lang/cpp/dynamic-value/TestDynamicValue.py (1213 of 1785) PASS: lldb-api :: commands/frame/diagnose/local-variable/TestLocalVariable.py (1214 of 1785) PASS: lldb-unit :: Utility/./UtilityTests/ArgsTest.TestSingleArg (1215 of 1785) PASS: lldb-api :: lang/cpp/exceptions/TestCPPExceptionBreakpoints.py (1216 of 1785) PASS: lldb-api :: python_api/lldbutil/frame/TestFrameUtils.py (1217 of 1785) PASS: lldb-unit :: Utility/./UtilityTests/VASprintfTest.NoBufferResize (1218 of 1785) PASS: lldb-api :: functionalities/data-formatter/nsarraysynth/TestNSArraySynthetic.py (1219 of 1785) PASS: lldb-unit :: Host/./HostTests/ConnectionFileDescriptorTest.TCPGetURIv6 (1220 of 1785) PASS: lldb-api :: lang/objc/print-obj/TestPrintObj.py (1221 of 1785) PASS: lldb-unit :: Utility/./UtilityTests/TimerTest.CategoryTimesNested (1222 of 1785) PASS: lldb-api :: functionalities/data-formatter/data-formatter-objc/TestDataFormatterObjCNSURL.py (1223 of 1785) PASS: lldb-unit :: Utility/./UtilityTests/RangeTest.Copy (1224 of 1785) PASS: lldb-unit :: Utility/./UtilityTests/StreamTeeTest.Constructor1Stream (1225 of 1785) PASS: lldb-api :: functionalities/postmortem/minidump-new/TestMiniDumpUUID.py (1226 of 1785) PASS: lldb-shell :: Commands/command-source.test (1227 of 1785) PASS: lldb-api :: functionalities/load_unload/TestLoadUnload.py (1228 of 1785) PASS: lldb-api :: functionalities/data-formatter/data-formatter-objc/nsindexpath/TestDataFormatterNSIndexPath.py (1229 of 1785) PASS: lldb-shell :: Minidump/Windows/Sigsegv/sigsegv.test (1230 of 1785) PASS: lldb-unit :: Utility/./UtilityTests/StringListTest.AppendStringMove (1231 of 1785) UNSUPPORTED: lldb-api :: benchmarks/expression/TestExpressionCmd.py (1232 of 1785) UNSUPPORTED: lldb-api :: macosx/macabi/TestMacABImacOSFramework.py (1233 of 1785) PASS: lldb-api :: commands/expression/import-std-module/list-dbg-info-content/TestDbgInfoContentList.py (1234 of 1785) PASS: lldb-unit :: Process/gdb-remote/./ProcessGdbRemoteTests/GDBRemoteCommunicationClientTest.GetModulesInfoInvalidResponse (1235 of 1785) PASS: lldb-unit :: Process/gdb-remote/./ProcessGdbRemoteTests/GDBRemoteCommunicationClientTest.SendStopTracePacket (1236 of 1785) PASS: lldb-unit :: SymbolFile/DWARF/./SymbolFileDWARFTests/DWARFASTParserClangTests.EnsureAllDIEsInDeclContextHaveBeenParsedParsesOnlyMatchingEntries (1237 of 1785) PASS: lldb-unit :: debugserver/./debugserverTests/RNBSocket.LoopBackConnectIPv4 (1238 of 1785) PASS: lldb-shell :: Minidump/dump-all.test (1239 of 1785) PASS: lldb-unit :: Expression/./ExpressionTests/CppModuleConfigurationTest.UnknownLibCppFile (1240 of 1785) PASS: lldb-api :: commands/frame/recognizer/TestFrameRecognizer.py (1241 of 1785) PASS: lldb-api :: commands/watchpoints/watchpoint_commands/condition/TestWatchpointConditionCmd.py (1242 of 1785) PASS: lldb-unit :: Utility/./UtilityTests/BinaryStreamTest.PutULEB128EightBytes (1243 of 1785) PASS: lldb-api :: lang/c/forward/TestForwardDeclaration.py (1244 of 1785) PASS: lldb-unit :: Utility/./UtilityTests/StreamTest.PutRawBytesToBigEndian (1245 of 1785) PASS: lldb-api :: functionalities/data-formatter/data-formatter-disabling/TestDataFormatterDisabling.py (1246 of 1785) PASS: lldb-unit :: Utility/./UtilityTests/VASprintfTest.EncodingError (1247 of 1785) PASS: lldb-unit :: Process/minidump/./LLDBMinidumpTests/MinidumpParserTest.InvalidMinidump (1248 of 1785) PASS: lldb-unit :: Utility/./UtilityTests/StringListTest.AppendStringStdString (1249 of 1785) PASS: lldb-unit :: Utility/./UtilityTests/CompletionRequest.TryCompleteCurrentArgGood (1250 of 1785) PASS: lldb-unit :: Utility/./UtilityTests/StringListTest.JoinSingle (1251 of 1785) PASS: lldb-unit :: Utility/./UtilityTests/StatusTest.Formatv (1252 of 1785) PASS: lldb-api :: commands/expression/call-function/TestCallStdStringFunction.py (1253 of 1785) PASS: lldb-api :: commands/platform/basic/TestPlatformCommand.py (1254 of 1785) PASS: lldb-unit :: Utility/./UtilityTests/StringListTest.GetMaxStringLengthMixed (1255 of 1785) PASS: lldb-shell :: Driver/TestCore.test (1256 of 1785) PASS: lldb-shell :: Breakpoint/debug_rnglistx_rlex.test (1257 of 1785) PASS: lldb-unit :: Interpreter/./InterpreterTests/CompletionTest.FileCompletionAbsolute (1258 of 1785) PASS: lldb-shell :: Breakpoint/implicit_const_form_support.test (1259 of 1785) PASS: lldb-unit :: Utility/./UtilityTests/StreamTest.PutULEB128 (1260 of 1785) PASS: lldb-api :: functionalities/data-formatter/data-formatter-skip-summary/TestDataFormatterSkipSummary.py (1261 of 1785) PASS: lldb-api :: functionalities/thread/concurrent_events/TestConcurrentWatchpointDelayWatchpointOneBreakpoint.py (1262 of 1785) PASS: lldb-unit :: ObjectFile/Breakpad/./ObjectFileBreakpadTests/InfoRecord.parse (1263 of 1785) PASS: lldb-unit :: Utility/./UtilityTests/StreamTeeTest.Write (1264 of 1785) PASS: lldb-api :: lang/cpp/symbols/TestSymbols.py (1265 of 1785) PASS: lldb-unit :: Utility/./UtilityTests/StringExtractorTest.DecodeHexU8_InvalidHex2 (1266 of 1785) PASS: lldb-unit :: ScriptInterpreter/Python/./ScriptInterpreterPythonTests/PythonDataObjectsTest.TestPythonDictionaryValueEquality (1267 of 1785) PASS: lldb-unit :: Utility/./UtilityTests/VMRange.Reset (1268 of 1785) PASS: lldb-api :: commands/expression/call-overridden-method/TestCallOverriddenMethod.py (1269 of 1785) PASS: lldb-api :: functionalities/data-formatter/data-formatter-stl/libstdcpp/unique_ptr/invalid/TestDataFormatterInvalidStdUniquePtr.py (1270 of 1785) PASS: lldb-api :: lang/cpp/unique-types/TestUniqueTypes.py (1271 of 1785) PASS: lldb-api :: macosx/find-dsym/bundle-with-dot-in-filename/TestBundleWithDotInFilename.py (1272 of 1785) PASS: lldb-unit :: Utility/./UtilityTests/UserIDResolver.GetUserName (1273 of 1785) UNSUPPORTED: lldb-api :: functionalities/signal/handle-segv/TestHandleSegv.py (1274 of 1785) PASS: lldb-unit :: ScriptInterpreter/Python/./ScriptInterpreterPythonTests/PythonDataObjectsTest.TestObjectAttributes (1275 of 1785) PASS: lldb-unit :: Utility/./UtilityTests/StringListTest.SplitIntoLinesEmpty (1276 of 1785) PASS: lldb-unit :: Utility/./UtilityTests/StringListTest.ForRangeEmpty (1277 of 1785) PASS: lldb-unit :: Process/gdb-remote/./ProcessGdbRemoteTests/GDBRemoteCommunicationServerTest.SendErrorResponse_Status (1278 of 1785) PASS: lldb-shell :: ObjectFile/Breakpad/sections-trailing-func.test (1279 of 1785) PASS: lldb-api :: functionalities/ubsan/basic/TestUbsanBasic.py (1280 of 1785) PASS: lldb-api :: tools/lldb-server/TestGdbRemote_qThreadStopInfo.py (1281 of 1785) PASS: lldb-api :: lang/cpp/modules-import/TestCXXModulesImport.py (1282 of 1785) UNSUPPORTED: lldb-api :: functionalities/breakpoint/hardware_breakpoints/hardware_breakpoint_on_multiple_threads/TestHWBreakMultiThread.py (1283 of 1785) UNSUPPORTED: lldb-api :: benchmarks/frame_variable/TestFrameVariableResponse.py (1284 of 1785) UNSUPPORTED: lldb-api :: commands/watchpoints/variable_out_of_scope/TestWatchedVarHitWhenInScope.py (1285 of 1785) PASS: lldb-api :: functionalities/thread/concurrent_events/TestConcurrentWatchBreak.py (1286 of 1785) PASS: lldb-unit :: ObjectFile/ELF/./ObjectFileELFTests/ObjectFileELFTest.GetSymtab_NoSymEntryPointArmAddressClass (1287 of 1785) PASS: lldb-api :: python_api/sbvalue_const_addrof/TestSBValueConstAddrOf.py (1288 of 1785) PASS: lldb-unit :: Utility/./UtilityTests/ArchSpecTest.OperatorBool (1289 of 1785) PASS: lldb-unit :: Host/./HostTests/SocketTest.UDPGetConnectURI (1290 of 1785) PASS: lldb-api :: functionalities/thread/concurrent_events/TestConcurrentTwoBreakpointThreads.py (1291 of 1785) PASS: lldb-unit :: Utility/./UtilityTests/FileSpecTest.IsRelative (1292 of 1785) PASS: lldb-api :: commands/frame/language/TestGuessLanguage.py (1293 of 1785) UNSUPPORTED: lldb-shell :: SymbolFile/NativePDB/local-variables.cpp (1294 of 1785) PASS: lldb-api :: functionalities/thread/concurrent_events/TestConcurrentNWatchNBreak.py (1295 of 1785) PASS: lldb-unit :: ScriptInterpreter/Python/./ScriptInterpreterPythonTests/PythonDataObjectsTest.TestPythonTupleInitializerList2 (1296 of 1785) PASS: lldb-api :: functionalities/data-formatter/summary-string-onfail/Test-rdar-9974002.py (1297 of 1785) PASS: lldb-api :: functionalities/postmortem/netbsd-core/TestNetBSDCore.py (1298 of 1785) PASS: lldb-unit :: Expression/./ExpressionTests/DiagnosticManagerTest.HasFixits (1299 of 1785) PASS: lldb-unit :: UnwindAssembly/x86/./UnwindAssemblyx86Tests/Testx86AssemblyInspectionEngine.TestPopEBP (1300 of 1785) UNSUPPORTED: lldb-api :: python_api/disassemble-raw-data/TestDisassemble_VST1_64.py (1301 of 1785) PASS: lldb-unit :: Utility/./UtilityTests/UserIDResolver.GetGroupName (1302 of 1785) PASS: lldb-unit :: Process/gdb-remote/./ProcessGdbRemoteTests/GDBRemoteClientBaseTest.SendContinueAndWait (1303 of 1785) PASS: lldb-unit :: Utility/./UtilityTests/TimerTest.CategoryTimes2 (1304 of 1785) PASS: lldb-api :: functionalities/data-formatter/hexcaps/TestDataFormatterHexCaps.py (1305 of 1785) PASS: lldb-api :: commands/expression/import-std-module/forward_list-dbg-info-content/TestDbgInfoContentForwardList.py (1306 of 1785) XFAIL: lldb-shell :: Register/x86-mm-xmm-write.test (1307 of 1785) PASS: lldb-unit :: Utility/./UtilityTests/BroadcasterTest.BroadcastEvent (1308 of 1785) PASS: lldb-unit :: Utility/./UtilityTests/ArgsTest.ReplaceArgumentAtIndexFarOutOfRange (1309 of 1785) PASS: lldb-unit :: Interpreter/./InterpreterTests/OptionArgParserTest.toScriptLanguage (1310 of 1785) PASS: lldb-unit :: Utility/./UtilityTests/ProcessInstanceInfo.DumpTable (1311 of 1785) PASS: lldb-unit :: Process/gdb-remote/./ProcessGdbRemoteTests/GDBRemoteClientBaseTest.InterruptNoResponse (1312 of 1785) PASS: lldb-unit :: Utility/./UtilityTests/StreamTest.PutHex64ByteOrderBig (1313 of 1785) PASS: lldb-shell :: BuildScript/modes.test (1314 of 1785) PASS: lldb-api :: lang/objc/self/TestObjCSelf.py (1315 of 1785) PASS: lldb-shell :: Settings/TestStopCommandSourceOnError.test (1316 of 1785) PASS: lldb-api :: lang/objcxx/objcxx-ivar-vector/TestIvarVector.py (1317 of 1785) PASS: lldb-unit :: Utility/./UtilityTests/StreamTeeTest.Constructor2Streams (1318 of 1785) PASS: lldb-api :: python_api/file_handle/TestFileHandle.py (1319 of 1785) PASS: lldb-unit :: Utility/./UtilityTests/RangeTest.SizeTypes (1320 of 1785) PASS: lldb-api :: commands/watchpoints/multiple_hits/TestMultipleHits.py (1321 of 1785) UNSUPPORTED: lldb-api :: tools/lldb-vscode/attach/TestVSCode_attach.py (1322 of 1785) PASS: lldb-unit :: ScriptInterpreter/Python/./ScriptInterpreterPythonTests/PythonDataObjectsTest.TestPythonTupleSize (1323 of 1785) PASS: lldb-api :: lang/c/unicode/TestUnicodeSymbols.py (1324 of 1785) PASS: lldb-unit :: Utility/./UtilityTests/RangeTest.SetRangeBase (1325 of 1785) PASS: lldb-api :: lang/objc/objc-ivar-stripped/TestObjCIvarStripped.py (1326 of 1785) PASS: lldb-unit :: Utility/./UtilityTests/StreamTest.ShiftOperatorChars (1327 of 1785) PASS: lldb-unit :: Utility/./UtilityTests/StreamTest.ShiftOperatorUInts (1328 of 1785) PASS: lldb-api :: lang/cpp/char8_t/TestCxxChar8_t.py (1329 of 1785) PASS: lldb-unit :: ScriptInterpreter/Python/./ScriptInterpreterPythonTests/PythonDataObjectsTest.TestPythonBytes (1330 of 1785) PASS: lldb-api :: functionalities/rerun/TestRerun.py (1331 of 1785) PASS: lldb-unit :: UnwindAssembly/x86/./UnwindAssemblyx86Tests/Testx86AssemblyInspectionEngine.TestSpillRegToStackViaMOVx86_64 (1332 of 1785) UNSUPPORTED: lldb-api :: functionalities/data-formatter/data-formatter-stl/libstdcpp/unique_ptr/TestDataFormatterStdUniquePtr.py (1333 of 1785) PASS: lldb-api :: functionalities/postmortem/minidump-new/TestMiniDumpNew.py (1334 of 1785) PASS: lldb-api :: commands/expression/import-std-module/no-std-module/TestMissingStdModule.py (1335 of 1785) PASS: lldb-api :: python_api/watchpoint/TestWatchpointIgnoreCount.py (1336 of 1785) PASS: lldb-unit :: Process/gdb-remote/./ProcessGdbRemoteTests/GDBRemoteCommunicationClientTest.SendStartTracePacket (1337 of 1785) UNSUPPORTED: lldb-api :: functionalities/darwin_log/filter/exact_match/activity-chain/TestDarwinLogFilterMatchActivityChain.py (1338 of 1785) PASS: lldb-unit :: Utility/./UtilityTests/SerializationRountripTest.SerializeDeserializeObjectReference (1339 of 1785) UNSUPPORTED: lldb-shell :: SymbolFile/PDB/ast-restore.test (1340 of 1785) PASS: lldb-unit :: Core/./LLDBCoreTests/RichManglingContextTest.IPDRealloc (1341 of 1785) PASS: lldb-api :: python_api/frame/get-variables/TestGetVariables.py (1342 of 1785) PASS: lldb-api :: lang/objc/orderedset/TestOrderedSet.py (1343 of 1785) PASS: lldb-api :: python_api/default-constructor/TestDefaultConstructorForAPIObjects.py (1344 of 1785) PASS: lldb-api :: functionalities/breakpoint/cpp/TestCPPBreakpointLocations.py (1345 of 1785) PASS: lldb-unit :: Utility/./UtilityTests/StreamTest.PutBytesAsRawHex8ToBigEndian (1346 of 1785) PASS: lldb-api :: lang/cpp/unsigned_types/TestUnsignedTypes.py (1347 of 1785) PASS: lldb-unit :: Host/./HostTests/TaskPoolTest.TaskMap (1348 of 1785) PASS: lldb-shell :: SymbolFile/DWARF/debug_ranges.s (1349 of 1785) PASS: lldb-unit :: UnwindAssembly/x86/./UnwindAssemblyx86Tests/Testx86AssemblyInspectionEngine.TestReturnDetect (1350 of 1785) UNSUPPORTED: lldb-api :: linux/add-symbols/TestTargetSymbolsAddCommand.py (1351 of 1785) PASS: lldb-api :: functionalities/thread/concurrent_events/TestConcurrentBreakpointsDelayedBreakpointOneWatchpoint.py (1352 of 1785) PASS: lldb-api :: functionalities/thread/concurrent_events/TestConcurrentWatchpointWithDelayWatchpointThreads.py (1353 of 1785) PASS: lldb-unit :: Process/minidump/./LLDBMinidumpTests/MinidumpParserTest.GetMemoryRegionInfoFromMemory64List (1354 of 1785) PASS: lldb-shell :: Driver/TestConvenienceVariables.test (1355 of 1785) PASS: lldb-unit :: Utility/./UtilityTests/RangeTest.DoesIntersect (1356 of 1785) PASS: lldb-unit :: ScriptInterpreter/Python/./ScriptInterpreterPythonTests/PythonExceptionStateTest.TestAutoRestoreChanged (1357 of 1785) PASS: lldb-unit :: ScriptInterpreter/Python/./ScriptInterpreterPythonTests/PythonExceptionStateTest.TestResetSemantics (1358 of 1785) PASS: lldb-api :: functionalities/data-formatter/data-formatter-stl/libcxx/tuple/TestDataFormatterLibcxxTuple.py (1359 of 1785) UNSUPPORTED: lldb-api :: functionalities/darwin_log/filter/exact_match/subsystem/TestDarwinLogFilterMatchSubsystem.py (1360 of 1785) UNSUPPORTED: lldb-api :: arm/breakpoint-it/TestBreakpointIt.py (1361 of 1785) PASS: lldb-unit :: Utility/./UtilityTests/ArgsTest.TestQuotedUnknownEscape (1362 of 1785) PASS: lldb-api :: functionalities/tail_call_frames/ambiguous_tail_call_seq2/TestAmbiguousTailCallSeq2.py (1363 of 1785) PASS: lldb-shell :: Driver/TestSingleQuote.test (1364 of 1785) PASS: lldb-api :: lang/objc/hidden-ivars/TestHiddenIvars.py (1365 of 1785) PASS: lldb-unit :: Utility/./UtilityTests/RangeTest.ContainsEndInclusive (1366 of 1785) PASS: lldb-api :: functionalities/breakpoint/global_constructor/TestBreakpointInGlobalConstructor.py (1367 of 1785) PASS: lldb-shell :: Driver/TestFile.test (1368 of 1785) PASS: lldb-unit :: Utility/./UtilityTests/DataExtractorTest.GetCStrUnterminated (1369 of 1785) PASS: lldb-unit :: Process/gdb-remote/./ProcessGdbRemoteTests/GDBRemoteClientBaseTest.SendContinueAndInterrupt2PacketBug (1370 of 1785) PASS: lldb-unit :: Language/Highlighting/./HighlighterTests/HighlighterTest.DefaultHighlighterWithCursorOutOfBounds (1371 of 1785) PASS: lldb-api :: functionalities/data-formatter/varscript_formatting/TestDataFormatterVarScriptFormatting.py (1372 of 1785) PASS: lldb-unit :: Language/Highlighting/./HighlighterTests/HighlighterTest.DefaultHighlighter (1373 of 1785) PASS: lldb-unit :: UnwindAssembly/x86/./UnwindAssemblyx86Tests/Testx86AssemblyInspectionEngine.TestPopRBPWithREX (1374 of 1785) PASS: lldb-unit :: Host/./HostTests/NativeProcessProtocolTest.ReadCStringFromMemory_MaxSize (1375 of 1785) PASS: lldb-unit :: UnwindAssembly/x86/./UnwindAssemblyx86Tests/Testx86AssemblyInspectionEngine.TestAddESP (1376 of 1785) UNSUPPORTED: lldb-shell :: Register/x86-gp-write.test (1377 of 1785) PASS: lldb-unit :: Utility/./UtilityTests/CompletionRequest.TryCompleteCurrentArgBad (1378 of 1785) PASS: lldb-api :: macosx/add-dsym/TestAddDsymMidExecutionCommand.py (1379 of 1785) PASS: lldb-unit :: Utility/./UtilityTests/ReproducerTest.SetReplay (1380 of 1785) PASS: lldb-unit :: Utility/./UtilityTests/ScalarTest.Scalar_512 (1381 of 1785) PASS: lldb-unit :: UnwindAssembly/x86/./UnwindAssemblyx86Tests/Testx86AssemblyInspectionEngine.TestPushRBP (1382 of 1785) PASS: lldb-unit :: Utility/./UtilityTests/StreamTest.PutCharNull (1383 of 1785) PASS: lldb-api :: functionalities/thread/exit_during_break/TestExitDuringBreak.py (1384 of 1785) PASS: lldb-api :: functionalities/gdb_remote_client/TestPlatformClient.py (1385 of 1785) PASS: lldb-api :: commands/expression/expr-in-syscall/TestExpressionInSyscall.py (1386 of 1785) PASS: lldb-api :: functionalities/breakpoint/address_breakpoints/TestBadAddressBreakpoints.py (1387 of 1785) UNSUPPORTED: lldb-shell :: SymbolFile/PDB/function-level-linking.test (1388 of 1785) PASS: lldb-api :: functionalities/data-formatter/data-formatter-objc/TestDataFormatterObjCPlain.py (1389 of 1785) PASS: lldb-unit :: ObjectFile/Breakpad/./ObjectFileBreakpadTests/StackCFIRecord.parse (1390 of 1785) PASS: lldb-unit :: Utility/./UtilityTests/BinaryStreamTest.PutULEB128FiveBytes (1391 of 1785) PASS: lldb-api :: commands/expression/two-files/TestObjCTypeQueryFromOtherCompileUnit.py (1392 of 1785) PASS: lldb-unit :: Host/./HostTests/NativeProcessProtocolTest.SetBreakpoint (1393 of 1785) PASS: lldb-api :: commands/expression/call-function/TestCallUserDefinedFunction.py (1394 of 1785) PASS: lldb-unit :: Utility/./UtilityTests/NameMatchesTest.Ignore (1395 of 1785) PASS: lldb-api :: lang/cpp/wchar_t/TestCxxWCharT.py (1396 of 1785) PASS: lldb-api :: lang/cpp/gmodules/TestWithModuleDebugging.py (1397 of 1785) PASS: lldb-api :: lang/objc/objc-stepping/TestObjCStepping.py (1398 of 1785) PASS: lldb-unit :: UnwindAssembly/x86/./UnwindAssemblyx86Tests/Testx86AssemblyInspectionEngine.TestPushR12 (1399 of 1785) PASS: lldb-api :: lang/cpp/limit-debug-info/TestWithLimitDebugInfo.py (1400 of 1785) PASS: lldb-api :: lang/objc/objc-ivar-offsets/TestObjCIvarOffsets.py (1401 of 1785) PASS: lldb-api :: commands/frame/select/TestFrameSelect.py (1402 of 1785) PASS: lldb-shell :: ObjectFile/ELF/base-address.yaml (1403 of 1785) PASS: lldb-unit :: Utility/./UtilityTests/BinaryStreamTest.PutULEB128NineBytes (1404 of 1785) UNSUPPORTED: lldb-shell :: SymbolFile/PDB/compilands.test (1405 of 1785) PASS: lldb-unit :: Utility/./UtilityTests/OptionsWithRawTest.SingleWordSuffix (1406 of 1785) PASS: lldb-unit :: Language/Highlighting/./HighlighterTests/HighlighterTest.ClangCursorPosEndOfLine (1407 of 1785) PASS: lldb-unit :: Utility/./UtilityTests/UriParserTest.Minimal (1408 of 1785) PASS: lldb-shell :: Register/x86-64-read.test (1409 of 1785) PASS: lldb-api :: functionalities/data-formatter/data-formatter-stl/libcxx/unordered/TestDataFormatterUnordered.py (1410 of 1785) PASS: lldb-unit :: Language/Highlighting/./HighlighterTests/HighlighterTest.ClangComments (1411 of 1785) PASS: lldb-shell :: Expr/TestMultilineExpr.test (1412 of 1785) PASS: lldb-unit :: SymbolFile/NativePDB/./SymbolFileNativePDBTests/PDBFPOProgramToDWARFExpressionTests.MultipleDependentAssignments (1413 of 1785) PASS: lldb-unit :: Utility/./UtilityTests/StringListTest.CopyListSingle (1414 of 1785) PASS: lldb-unit :: Utility/./UtilityTests/SerializationRountripTest.SerializeDeserializeCString (1415 of 1785) UNSUPPORTED: lldb-api :: functionalities/unwind/standard/TestStandardUnwind.py (1416 of 1785) PASS: lldb-unit :: Utility/./UtilityTests/ConstStringTest.FromMidOfBufferStringRef (1417 of 1785) PASS: lldb-api :: commands/watchpoints/watchpoint_set_command/TestWatchLocationWithWatchSet.py (1418 of 1785) PASS: lldb-api :: lang/c/step-target/TestStepTarget.py (1419 of 1785) PASS: lldb-api :: commands/expression/anonymous-struct/TestCallUserAnonTypedef.py (1420 of 1785) XFAIL: lldb-shell :: Register/x86-64-ymm-write.test (1421 of 1785) PASS: lldb-api :: tools/lldb-server/commandline/TestStubReverseConnect.py (1422 of 1785) PASS: lldb-api :: python_api/watchpoint/TestSetWatchpoint.py (1423 of 1785) PASS: lldb-api :: lang/c/local_variables/TestLocalVariables.py (1424 of 1785) PASS: lldb-unit :: Language/Highlighting/./HighlighterTests/HighlighterTest.ClangCursorPosInOtherToken (1425 of 1785) PASS: lldb-api :: lang/c/unions/TestUnionMembers.py (1426 of 1785) PASS: lldb-unit :: Core/./LLDBCoreTests/RichManglingContextTest.FromCxxMethodName (1427 of 1785) PASS: lldb-unit :: Utility/./UtilityTests/UUIDTest.Validity (1428 of 1785) PASS: lldb-unit :: Utility/./UtilityTests/BinaryStreamTest.PutSLEB128TwoBytes (1429 of 1785) PASS: lldb-api :: lang/objcxx/hide-runtime-values/TestObjCXXHideRuntimeValues.py (1430 of 1785) PASS: lldb-unit :: Utility/./UtilityTests/RegisterValueTest.GetSet8 (1431 of 1785) PASS: lldb-api :: lang/objc/modules-incomplete/TestIncompleteModules.py (1432 of 1785) PASS: lldb-unit :: Language/Highlighting/./HighlighterTests/HighlighterTest.ClangOperators (1433 of 1785) PASS: lldb-api :: lang/objc/conflicting-definition/TestConflictingDefinition.py (1434 of 1785) PASS: lldb-unit :: ScriptInterpreter/Python/./ScriptInterpreterPythonTests/PythonDataObjectsTest.TestCallable (1435 of 1785) PASS: lldb-api :: lang/c/strings/TestCStrings.py (1436 of 1785) PASS: lldb-unit :: UnwindAssembly/x86/./UnwindAssemblyx86Tests/Testx86AssemblyInspectionEngine.TestAddRSP (1437 of 1785) PASS: lldb-api :: macosx/find-app-in-bundle/TestFindAppInBundle.py (1438 of 1785) UNSUPPORTED: lldb-shell :: BuildScript/toolchain-clang-cl.test (1439 of 1785) UNSUPPORTED: lldb-api :: lang/objc/objc-dynamic-value/TestObjCDynamicValue.py (1440 of 1785) PASS: lldb-api :: functionalities/return-value/TestReturnValue.py (1441 of 1785) PASS: lldb-api :: tools/lldb-server/TestGdbRemoteProcessInfo.py (1442 of 1785) PASS: lldb-api :: functionalities/data-formatter/data-formatter-stl/libcxx/iterator/TestDataFormatterLibccIterator.py (1443 of 1785) PASS: lldb-unit :: Utility/./UtilityTests/ArchSpecTest.TestParseMachCPUDashSubtypeTripleExtra (1444 of 1785) PASS: lldb-api :: functionalities/jitloader_gdb/TestJITLoaderGDB.py (1445 of 1785) PASS: lldb-api :: functionalities/thread/step_until/TestStepUntil.py (1446 of 1785) PASS: lldb-unit :: SymbolFile/NativePDB/./SymbolFileNativePDBTests/PDBFPOProgramToDWARFExpressionTests.MissingTargetRegister (1447 of 1785) PASS: lldb-shell :: SymbolFile/Breakpad/unwind-via-stack-cfi.test (1448 of 1785) PASS: lldb-shell :: Reproducer/TestSynchronous.test (1449 of 1785) UNSUPPORTED: lldb-api :: commands/expression/completion-crash-incomplete-record/TestCompletionCrashIncompleteRecord.py (1450 of 1785) PASS: lldb-api :: functionalities/breakpoint/debugbreak/TestDebugBreak.py (1451 of 1785) PASS: lldb-unit :: Process/minidump/./LLDBMinidumpTests/MinidumpParserTest.GetMemory (1452 of 1785) PASS: lldb-unit :: Utility/./UtilityTests/LogChannelTest.EnableOptions (1453 of 1785) PASS: lldb-unit :: Utility/./UtilityTests/StringExtractorTest.GetHexU8_InvalidHex_NoEof (1454 of 1785) PASS: lldb-api :: functionalities/asan/TestReportData.py (1455 of 1785) PASS: lldb-api :: python_api/sbtype_typeclass/TestSBTypeTypeClass.py (1456 of 1785) PASS: lldb-shell :: SymbolFile/Breakpad/symtab-macho.test (1457 of 1785) PASS: lldb-api :: functionalities/avoids-fd-leak/TestFdLeak.py (1458 of 1785) PASS: lldb-unit :: Host/./HostTests/MainLoopTest.Signal (1459 of 1785) PASS: lldb-unit :: Breakpoint/./LLDBBreakpointTests/BreakpointIDTest.StringIsBreakpointName (1460 of 1785) PASS: lldb-unit :: UnwindAssembly/x86/./UnwindAssemblyx86Tests/Testx86AssemblyInspectionEngine.TestPopR12 (1461 of 1785) PASS: lldb-unit :: Signals/./SignalsTests/UnixSignalsTest.GetInfo (1462 of 1785) PASS: lldb-unit :: Utility/./UtilityTests/UriParserTest.SchemeHostSeparator3 (1463 of 1785) PASS: lldb-api :: types/TestIntegerTypes.py (1464 of 1785) PASS: lldb-api :: functionalities/data-formatter/data-formatter-stl/libcxx/set/TestDataFormatterLibcxxSet.py (1465 of 1785) PASS: lldb-api :: lang/c/tls_globals/TestTlsGlobals.py (1466 of 1785) PASS: lldb-unit :: Symbol/./SymbolTests/TestClangASTContext.TestGetBasicTypeFromEnum (1467 of 1785) PASS: lldb-unit :: Utility/./UtilityTests/StringListTest.AppendListCStringArrayEmpty (1468 of 1785) PASS: lldb-api :: lang/cpp/class_types/TestClassTypes.py (1469 of 1785) UNSUPPORTED: lldb-shell :: Register/aarch64-gp-read.test (1470 of 1785) PASS: lldb-unit :: Utility/./UtilityTests/AnsiTerminal.AtEnd (1471 of 1785) PASS: lldb-unit :: Expression/./ExpressionTests/DiagnosticManagerTest.AddDiagnostic (1472 of 1785) PASS: lldb-unit :: Utility/./UtilityTests/StreamTeeTest.DefaultConstructor (1473 of 1785) PASS: lldb-shell :: SymbolFile/DWARF/debug_aranges-empty-section.s (1474 of 1785) PASS: lldb-api :: functionalities/postmortem/minidump/TestMiniDump.py (1475 of 1785) PASS: lldb-api :: commands/target/basic/TestTargetCommand.py (1476 of 1785) PASS: lldb-unit :: Utility/./UtilityTests/StreamTeeTest.Assignment (1477 of 1785) PASS: lldb-unit :: Expression/./ExpressionTests/CppModuleConfigurationTest.MissingLibCpp (1478 of 1785) PASS: lldb-unit :: Utility/./UtilityTests/ArgsTest.ReplaceArgumentAtIndexShort (1479 of 1785) PASS: lldb-unit :: Utility/./UtilityTests/RangeTest.ContainsAddr (1480 of 1785) PASS: lldb-shell :: ObjectFile/ELF/netbsd-exec-8.99.30-amd64.yaml (1481 of 1785) PASS: lldb-unit :: Process/gdb-remote/./ProcessGdbRemoteTests/GDBRemoteClientBaseTest.SendContinueDelegateInterface (1482 of 1785) PASS: lldb-unit :: Utility/./UtilityTests/RangeTest.ContainsEndInclusiveInvalid (1483 of 1785) PASS: lldb-unit :: Utility/./UtilityTests/StringLexerTest.HasAtLeast (1484 of 1785) UNSUPPORTED: lldb-api :: tools/lldb-vscode/breakpoint/TestVSCode_setFunctionBreakpoints.py (1485 of 1785) PASS: lldb-unit :: Symbol/./SymbolTests/Type.CompilerContextPattern (1486 of 1785) PASS: lldb-unit :: Utility/./UtilityTests/BinaryStreamTest.PutSLEB128OneByte (1487 of 1785) PASS: lldb-api :: commands/apropos/with-process/TestAproposWithProcess.py (1488 of 1785) PASS: lldb-unit :: Language/Highlighting/./HighlighterTests/HighlighterTest.Colons (1489 of 1785) PASS: lldb-api :: commands/watchpoints/multiple_threads/TestWatchpointMultipleThreads.py (1490 of 1785) PASS: lldb-shell :: Settings/TestDisableColor.test (1491 of 1785) PASS: lldb-unit :: Symbol/./SymbolTests/DWARFCallFrameInfoTest.Basic_dwarf4 (1492 of 1785) PASS: lldb-api :: lang/cpp/operator-overload/TestOperatorOverload.py (1493 of 1785) PASS: lldb-unit :: SymbolFile/DWARF/./SymbolFileDWARFTests/SymbolFileDWARFTests.TestAbbrevOrder1Start1 (1494 of 1785) PASS: lldb-api :: lang/objc/objc-runtime-ivars/TestRuntimeIvars.py (1495 of 1785) PASS: lldb-api :: commands/watchpoints/watchpoint_on_vectors/TestValueOfVectorVariable.py (1496 of 1785) PASS: lldb-api :: functionalities/data-formatter/dump_dynamic/TestDumpDynamic.py (1497 of 1785) PASS: lldb-api :: commands/expression/radar_8638051/Test8638051.py (1498 of 1785) PASS: lldb-api :: functionalities/data-formatter/user-format-vs-summary/TestUserFormatVsSummary.py (1499 of 1785) PASS: lldb-unit :: Utility/./UtilityTests/StringListTest.ForRange (1500 of 1785) PASS: lldb-api :: lang/c/anonymous/TestAnonymous.py (1501 of 1785) PASS: lldb-api :: linux/builtin_trap/TestBuiltinTrap.py (1502 of 1785) PASS: lldb-api :: commands/command/nested_alias/TestNestedAlias.py (1503 of 1785) UNSUPPORTED: lldb-api :: functionalities/darwin_log/filter/exact_match/activity/TestDarwinLogFilterMatchActivity.py (1504 of 1785) PASS: lldb-shell :: ObjectFile/ELF/minidebuginfo-find-symbols.yaml (1505 of 1785) PASS: lldb-unit :: Utility/./UtilityTests/BinaryStreamTest.PutULEB128SevenBytes (1506 of 1785) PASS: lldb-shell :: ObjectFile/ELF/section-addresses.yaml (1507 of 1785) PASS: lldb-api :: types/TestFloatTypesExpr.py (1508 of 1785) PASS: lldb-unit :: Utility/./UtilityTests/BinaryStreamTest.PutULEB128OneByte (1509 of 1785) PASS: lldb-api :: functionalities/data-formatter/data-formatter-stl/libcxx/vbool/TestDataFormatterLibcxxVBool.py (1510 of 1785) PASS: lldb-unit :: Host/./HostTests/FileSystemTest.Resolve (1511 of 1785) PASS: lldb-api :: functionalities/breakpoint/breakpoint_command/TestRegexpBreakCommand.py (1512 of 1785) PASS: lldb-unit :: Utility/./UtilityTests/StreamTeeTest.GetStreamAtIndexOutOfBoundsEmpty (1513 of 1785) PASS: lldb-api :: api/command-return-object/TestSBCommandReturnObject.py (1514 of 1785) PASS: lldb-unit :: Host/./HostTests/SocketTest.DecodeHostAndPort (1515 of 1785) PASS: lldb-unit :: Expression/./ExpressionTests/DiagnosticManagerTest.GetStringBasic (1516 of 1785) PASS: lldb-api :: tools/lldb-server/TestGdbRemoteSingleStep.py (1517 of 1785) PASS: lldb-api :: functionalities/gdb_remote_client/TestWriteMemory.py (1518 of 1785) PASS: lldb-api :: lang/cpp/static_methods/TestCPPStaticMethods.py (1519 of 1785) PASS: lldb-unit :: Utility/./UtilityTests/CompletionRequest.TestCompletionOwnership (1520 of 1785) PASS: lldb-api :: functionalities/gdb_remote_client/TestRecognizeBreakpoint.py (1521 of 1785) PASS: lldb-unit :: UnwindAssembly/x86/./UnwindAssemblyx86Tests/Testx86AssemblyInspectionEngine.TestSimple64bitFrameFunction (1522 of 1785) PASS: lldb-unit :: Utility/./UtilityTests/BinaryStreamTest.PutULEB128ThreeBytes (1523 of 1785) PASS: lldb-unit :: Utility/./UtilityTests/Flags.IsClear (1524 of 1785) PASS: lldb-unit :: Host/./HostTests/NativeProcessProtocolTest.ReadCStringFromMemory (1525 of 1785) PASS: lldb-unit :: Utility/./UtilityTests/BinaryStreamTest.PutSLEB128FiveBytes (1526 of 1785) PASS: lldb-api :: functionalities/type_lookup/TestTypeLookup.py (1527 of 1785) PASS: lldb-unit :: ScriptInterpreter/Python/./ScriptInterpreterPythonTests/PythonDataObjectsTest.TestPythonDictionaryToStructuredDictionary (1528 of 1785) PASS: lldb-unit :: Process/gdb-remote/./ProcessGdbRemoteTests/GDBRemoteClientBaseTest.SendContinueAndAsyncSignal (1529 of 1785) PASS: lldb-unit :: Expression/./ExpressionTests/CppModuleConfigurationTest.AmbiguousLibCpp (1530 of 1785) PASS: lldb-unit :: Language/Highlighting/./HighlighterTests/HighlighterTest.ClangEmptyInput (1531 of 1785) PASS: lldb-api :: lang/objcxx/cxx-bridged-po/TestObjCXXBridgedPO.py (1532 of 1785) PASS: lldb-api :: functionalities/thread/concurrent_events/TestConcurrentDelayedCrashWithBreakpointSignal.py (1533 of 1785) PASS: lldb-api :: functionalities/data-formatter/data-formatter-objc/TestDataFormatterObjCNSBundle.py (1534 of 1785) PASS: lldb-unit :: UnwindAssembly/x86/./UnwindAssemblyx86Tests/Testx86AssemblyInspectionEngine.TestCALLNextInsn (1535 of 1785) UNSUPPORTED: lldb-shell :: SymbolFile/PDB/expressions.test (1536 of 1785) PASS: lldb-unit :: Utility/./UtilityTests/ReproducerTest.SetCapture (1537 of 1785) UNSUPPORTED: lldb-api :: functionalities/darwin_log/format/TestDarwinLogMessageFormat.py (1538 of 1785) PASS: lldb-unit :: Process/gdb-remote/./ProcessGdbRemoteTests/GDBRemoteCommunicationClientTest.GetMemoryRegionInfo (1539 of 1785) PASS: lldb-unit :: Utility/./UtilityTests/StructuredDataTest.ParseJSONFromFile (1540 of 1785) PASS: lldb-api :: functionalities/fat_archives/TestFatArchives.py (1541 of 1785) PASS: lldb-unit :: Utility/./UtilityTests/ConstStringTest.CompareStringRef (1542 of 1785) PASS: lldb-unit :: ScriptInterpreter/Python/./ScriptInterpreterPythonTests/PythonDataObjectsTest.TestBorrowedReferences (1543 of 1785) PASS: lldb-api :: macosx/nslog/TestDarwinNSLogOutput.py (1544 of 1785) PASS: lldb-api :: commands/expression/char/TestExprsChar.py (1545 of 1785) PASS: lldb-api :: lang/objc/forward-decl/TestForwardDecl.py (1546 of 1785) PASS: lldb-shell :: SymbolFile/NativePDB/nested-types.cpp (1547 of 1785) PASS: lldb-shell :: Quit/TestQuitExitCode0.test (1548 of 1785) PASS: lldb-api :: arm/emulation/TestEmulations.py (1549 of 1785) PASS: lldb-api :: functionalities/inferior-crashing/recursive-inferior/TestRecursiveInferior.py (1550 of 1785) PASS: lldb-unit :: Symbol/./SymbolTests/LineEntryTest.GetSameLineContiguousAddressRangeNestedInline (1551 of 1785) UNSUPPORTED: lldb-api :: functionalities/unwind/ehframe/TestEhFrameUnwind.py (1552 of 1785) PASS: lldb-api :: tools/lldb-server/TestGdbRemote_vCont.py (1553 of 1785) PASS: lldb-api :: commands/expression/no-deadlock/TestExprDoesntBlock.py (1554 of 1785) PASS: lldb-unit :: Utility/./UtilityTests/ArgsTest.TestQuotedTrailingBackslash (1555 of 1785) PASS: lldb-api :: functionalities/data-formatter/ostypeformatting/TestFormattersOsType.py (1556 of 1785) PASS: lldb-unit :: Symbol/./SymbolTests/TestClangASTContext.TestRemoveFastQualifiers (1557 of 1785) PASS: lldb-shell :: SymbolFile/DWARF/compilercontext.ll (1558 of 1785) PASS: lldb-api :: lang/objc/objc-static-method/TestObjCStaticMethod.py (1559 of 1785) UNSUPPORTED: lldb-api :: commands/expression/call-restarts/TestCallThatRestarts.py (1560 of 1785) PASS: lldb-api :: functionalities/process_group/TestChangeProcessGroup.py (1561 of 1785) PASS: lldb-api :: functionalities/source-map/TestTargetSourceMap.py (1562 of 1785) UNSUPPORTED: lldb-api :: functionalities/darwin_log/source/info/TestDarwinLogSourceInfo.py (1563 of 1785) UNSUPPORTED: lldb-shell :: Process/Windows/exception_access_violation.cpp (1564 of 1785) PASS: lldb-unit :: Utility/./UtilityTests/StringListTest.JoinMultiCharSeparator (1565 of 1785) PASS: lldb-api :: commands/register/register/register_command/TestRegisters.py (1566 of 1785) PASS: lldb-unit :: Utility/./UtilityTests/GeneratorTest.GetOrCreate (1567 of 1785) PASS: lldb-api :: tools/lldb-server/commandline/TestStubSetSID.py (1568 of 1785) PASS: lldb-shell :: ObjectFile/ELF/netbsd-core-amd64.test (1569 of 1785) PASS: lldb-api :: lang/objc/objc-dyn-sbtype/TestObjCDynamicSBType.py (1570 of 1785) PASS: lldb-unit :: Utility/./UtilityTests/StringExtractorTest.GetHexU8_InvalidHex (1571 of 1785) PASS: lldb-unit :: Utility/./UtilityTests/DataExtractorTest.PeekData (1572 of 1785) PASS: lldb-api :: commands/process/attach/attach_denied/TestAttachDenied.py (1573 of 1785) PASS: lldb-api :: macosx/duplicate-archive-members/TestDuplicateMembers.py (1574 of 1785) PASS: lldb-api :: functionalities/breakpoint/breakpoint_locations/TestBreakpointLocations.py (1575 of 1785) PASS: lldb-shell :: Reproducer/TestWorkingDir.test (1576 of 1785) PASS: lldb-unit :: ScriptInterpreter/Python/./ScriptInterpreterPythonTests/PythonDataObjectsTest.TestPythonListToStructuredList (1577 of 1785) PASS: lldb-shell :: BuildScript/toolchain-clang.test (1578 of 1785) PASS: lldb-unit :: Utility/./UtilityTests/StringExtractorTest.GetNameColonValueContainsColon (1579 of 1785) PASS: lldb-api :: lang/cpp/diamond/TestDiamond.py (1580 of 1785) PASS: lldb-unit :: Process/minidump/./LLDBMinidumpTests/MinidumpParserTest.MinidumpDuplicateModuleMinAddress (1581 of 1785) PASS: lldb-unit :: ScriptInterpreter/Python/./ScriptInterpreterPythonTests/PythonDataObjectsTest.TestPythonCallableCheck (1582 of 1785) PASS: lldb-unit :: ScriptInterpreter/Python/./ScriptInterpreterPythonTests/PythonDataObjectsTest.TestGlobalNameResolutionNoDot (1583 of 1785) PASS: lldb-unit :: Expression/./ExpressionTests/CppModuleConfigurationTest.Linux (1584 of 1785) PASS: lldb-api :: lang/objc/global_ptrs/TestGlobalObjects.py (1585 of 1785) PASS: lldb-shell :: Host/TestCustomShell.test (1586 of 1785) PASS: lldb-unit :: Utility/./UtilityTests/StringListTest.CopyList (1587 of 1785) PASS: lldb-unit :: Utility/./UtilityTests/Flags.AnyClear (1588 of 1785) PASS: lldb-unit :: Utility/./UtilityTests/RangeTest.EqualInvalid (1589 of 1785) PASS: lldb-api :: lang/objc/foundation/TestRuntimeTypes.py (1590 of 1785) PASS: lldb-unit :: Utility/./UtilityTests/DataExtractorTest.GetMaxU64_unchecked (1591 of 1785) PASS: lldb-unit :: Utility/./UtilityTests/StreamTest.PutChar (1592 of 1785) PASS: lldb-api :: functionalities/gdb_remote_client/TestArmRegisterDefinition.py (1593 of 1785) PASS: lldb-api :: lang/cpp/unicode-literals/TestUnicodeLiterals.py (1594 of 1785) PASS: lldb-unit :: Process/minidump/./LLDBMinidumpTests/MinidumpParserTest.GetMemoryRegionInfoLinuxMaps (1595 of 1785) PASS: lldb-unit :: Utility/./UtilityTests/StringExtractorTest.GetHexU8_Exact_NoEof (1596 of 1785) UNSUPPORTED: lldb-shell :: ObjectFile/ELF/minidebuginfo-set-and-hit-breakpoint.test (1597 of 1785) PASS: lldb-shell :: SymbolFile/NativePDB/s_constant.cpp (1598 of 1785) PASS: lldb-unit :: Utility/./UtilityTests/RangeTest.ClearWithStarAddress (1599 of 1785) PASS: lldb-unit :: Utility/./UtilityTests/StringListTest.InsertStringAtIndexMove (1600 of 1785) PASS: lldb-unit :: Process/gdb-remote/./ProcessGdbRemoteTests/GDBRemoteCommunicationServerTest.SendErrorResponse_ErrorList (1601 of 1785) PASS: lldb-unit :: Platform/./LLDBPlatformTests/PlatformDarwinTest.TestParseVersionBuildDir (1602 of 1785) PASS: lldb-unit :: Utility/./UtilityTests/StreamTest.PutRawBytesToMixedEndian (1603 of 1785) PASS: lldb-unit :: Language/Highlighting/./HighlighterTests/HighlighterTest.ClangScalarLiterals (1604 of 1785) PASS: lldb-unit :: Process/gdb-remote/./ProcessGdbRemoteTests/GDBRemoteCommunicationServerTest.SendErrorResponse_StringError (1605 of 1785) PASS: lldb-api :: functionalities/gdb_remote_client/TestThreadSelectionBug.py (1606 of 1785) PASS: lldb-unit :: Expression/./ExpressionTests/ClangHostTest.ComputeClangResourceDirectory (1607 of 1785) PASS: lldb-unit :: Host/./HostTests/NativeProcessProtocolTest.ReadMemoryWithoutTrap (1608 of 1785) PASS: lldb-unit :: Utility/./UtilityTests/StringExtractorTest.GetU64LittleEndian (1609 of 1785) PASS: lldb-shell :: SymbolFile/DWARF/split-dwarf-inlining.cpp (1610 of 1785) PASS: lldb-shell :: ObjectFile/ELF/basic-info.yaml (1611 of 1785) UNSUPPORTED: lldb-api :: tools/lldb-server/TestGdbRemoteAuxvSupport.py (1612 of 1785) PASS: lldb-api :: functionalities/inferior-changed/TestInferiorChanged.py (1613 of 1785) PASS: lldb-unit :: ObjectFile/Breakpad/./ObjectFileBreakpadTests/Record.classify (1614 of 1785) PASS: lldb-api :: commands/command/source/TestCommandSource.py (1615 of 1785) PASS: lldb-api :: commands/expression/persistent_types/TestPersistentTypes.py (1616 of 1785) PASS: lldb-api :: api/listeners/TestListener.py (1617 of 1785) PASS: lldb-unit :: Utility/./UtilityTests/UriParserTest.BadPort2 (1618 of 1785) UNSUPPORTED: lldb-shell :: SymbolFile/PDB/func-symbols.test (1619 of 1785) PASS: lldb-unit :: UnwindAssembly/x86/./UnwindAssemblyx86Tests/Testx86AssemblyInspectionEngine.TestPushImm (1620 of 1785) PASS: lldb-api :: commands/expression/save_jit_objects/TestSaveJITObjects.py (1621 of 1785) PASS: lldb-api :: commands/expression/scoped_enums/TestScopedEnumType.py (1622 of 1785) PASS: lldb-shell :: ObjectFile/Breakpad/discontiguous-sections.test (1623 of 1785) PASS: lldb-unit :: Utility/./UtilityTests/StringExtractorTest.GetHexBytesAvail_OddPair (1624 of 1785) PASS: lldb-shell :: SymbolFile/DWARF/debug-names-compressed.cpp (1625 of 1785) PASS: lldb-api :: functionalities/postmortem/elf-core/thread_crash/TestLinuxCoreThreads.py (1626 of 1785) PASS: lldb-unit :: Utility/./UtilityTests/ProcessInstanceInfo.Dump (1627 of 1785) PASS: lldb-unit :: ScriptInterpreter/Python/./ScriptInterpreterPythonTests/PythonDataObjectsTest.TestPythonCallableInvoke (1628 of 1785) PASS: lldb-unit :: UnwindAssembly/x86/./UnwindAssemblyx86Tests/Testx86AssemblyInspectionEngine.TestSimplex86_64Augmented (1629 of 1785) PASS: lldb-shell :: SymbolFile/DWARF/find-method-local-struct.cpp (1630 of 1785) UNSUPPORTED: lldb-shell :: SymbolFile/NativePDB/typedefs.cpp (1631 of 1785) PASS: lldb-unit :: Utility/./UtilityTests/OptionsWithRawTest.EmptySuffixSingleWhitespace (1632 of 1785) PASS: lldb-api :: python_api/findvalue_duplist/TestSBFrameFindValue.py (1633 of 1785) PASS: lldb-unit :: Utility/./UtilityTests/StringListTest.LongestCommonPrefixSingleElement (1634 of 1785) PASS: lldb-unit :: Language/Highlighting/./HighlighterTests/HighlighterTest.ClangCursorPosAfterOtherToken (1635 of 1785) PASS: lldb-shell :: SymbolFile/DWARF/debug-types-dwo-cross-reference.cpp (1636 of 1785) PASS: lldb-api :: functionalities/abbreviation/TestAbbreviations.py (1637 of 1785) PASS: lldb-api :: lang/objc/blocks/TestObjCIvarsInBlocks.py (1638 of 1785) PASS: lldb-unit :: Utility/./UtilityTests/StringExtractorTest.GetU32LittleEndian (1639 of 1785) UNSUPPORTED: lldb-api :: lang/cpp/static_members/TestCPPStaticMembers.py (1640 of 1785) UNSUPPORTED: lldb-api :: benchmarks/startup/TestStartupDelays.py (1641 of 1785) PASS: lldb-api :: functionalities/data-formatter/data-formatter-ptr-to-array/TestPtrToArrayFormatting.py (1642 of 1785) PASS: lldb-unit :: Utility/./UtilityTests/AnsiTerminal.Incomplete (1643 of 1785) PASS: lldb-api :: functionalities/data-formatter/data-formatter-stl/libcxx/optional/TestDataFormatterLibcxxOptional.py (1644 of 1785) PASS: lldb-unit :: Process/gdb-remote/./ProcessGdbRemoteTests/GDBRemoteClientBaseTest.SendContinueAndInterrupt (1645 of 1785) PASS: lldb-api :: lang/objc/objc-super/TestObjCSuper.py (1646 of 1785) PASS: lldb-api :: functionalities/data-formatter/data-formatter-stl/libcxx/map/TestDataFormatterLibccMap.py (1647 of 1785) PASS: lldb-api :: commands/target/stop-hooks/TestStopHooks.py (1648 of 1785) PASS: lldb-unit :: ScriptInterpreter/Python/./ScriptInterpreterPythonTests/PythonDataObjectsTest.TestPythonStringToStr (1649 of 1785) UNSUPPORTED: lldb-api :: benchmarks/expression/TestRepeatedExprs.py (1650 of 1785) PASS: lldb-api :: functionalities/data-formatter/data-formatter-objc/TestDataFormatterObjCNSDate.py (1651 of 1785) PASS: lldb-api :: functionalities/gdb_remote_client/TestNestedRegDefinitions.py (1652 of 1785) UNSUPPORTED: lldb-api :: tools/lldb-server/libraries-svr4/TestGdbRemoteLibrariesSvr4Support.py (1653 of 1785) PASS: lldb-api :: python_api/symbol-context/TestSymbolContext.py (1654 of 1785) PASS: lldb-api :: python_api/process/io/TestProcessIO.py (1655 of 1785) PASS: lldb-unit :: Utility/./UtilityTests/ArgsTest.TestTrailingBackslash (1656 of 1785) PASS: lldb-unit :: Utility/./UtilityTests/ArgsTest.ReplaceArgumentAtIndexOutOfRange (1657 of 1785) PASS: lldb-api :: lang/objc/objc++/TestObjCXX.py (1658 of 1785) PASS: lldb-api :: functionalities/tail_call_frames/thread_step_out_message/TestArtificialFrameStepOutMessage.py (1659 of 1785) PASS: lldb-unit :: Language/Highlighting/./HighlighterTests/HighlighterTest.ClangBraces (1660 of 1785) UNSUPPORTED: lldb-shell :: Breakpoint/case-insensitive.test (1661 of 1785) PASS: lldb-api :: macosx/queues/TestQueues.py (1662 of 1785) PASS: lldb-shell :: SymbolFile/Breakpad/line-table-discontinuous-file-ids.test (1663 of 1785) PASS: lldb-unit :: Utility/./UtilityTests/TimerTest.CategoryTimes (1664 of 1785) PASS: lldb-api :: commands/expression/argument_passing_restrictions/TestArgumentPassingRestrictions.py (1665 of 1785) PASS: lldb-api :: lang/objc/objc-new-syntax/TestObjCNewSyntaxDictionary.py (1666 of 1785) PASS: lldb-shell :: ObjectFile/MachO/lc_version_min.yaml (1667 of 1785) PASS: lldb-unit :: Utility/./UtilityTests/VASprintfTest.BufferResize (1668 of 1785) PASS: lldb-unit :: UnwindAssembly/x86/./UnwindAssemblyx86Tests/Testx86AssemblyInspectionEngine.TestPushR14 (1669 of 1785) PASS: lldb-unit :: Utility/./UtilityTests/RegularExpression.CopyAssignment (1670 of 1785) PASS: lldb-api :: commands/expression/call-throws/TestCallThatThrows.py (1671 of 1785) PASS: lldb-unit :: Utility/./UtilityTests/StringExtractorTest.GetU64BigEndian (1672 of 1785) PASS: lldb-unit :: Utility/./UtilityTests/ArgsTest.ReplaceArgumentAtIndexLonger (1673 of 1785) PASS: lldb-api :: commands/expression/ir-interpreter/TestIRInterpreter.py (1674 of 1785) PASS: lldb-api :: commands/command/history/TestCommandHistory.py (1675 of 1785) PASS: lldb-unit :: Utility/./UtilityTests/StringListTest.LongestCommonPrefixDuplicateElement (1676 of 1785) PASS: lldb-unit :: Utility/./UtilityTests/StreamTest.ChangingByteOrder (1677 of 1785) PASS: lldb-unit :: Utility/./UtilityTests/ArgsTest.GetArgumentArrayRef (1678 of 1785) PASS: lldb-unit :: Utility/./UtilityTests/BinaryStreamTest.PutSLEB128NineBytes (1679 of 1785) PASS: lldb-api :: functionalities/thread/concurrent_events/TestConcurrentTwoBreakpointsOneDelaySignal.py (1680 of 1785) PASS: lldb-api :: commands/command/invalid-args/TestInvalidArgsCommand.py (1681 of 1785) PASS: lldb-unit :: Utility/./UtilityTests/LogChannelTest.Enable (1682 of 1785) PASS: lldb-shell :: Heap/heap-cstr.test (1683 of 1785) PASS: lldb-shell :: Minidump/Windows/find-module.test (1684 of 1785) PASS: lldb-api :: tools/lldb-server/TestGdbRemoteKill.py (1685 of 1785) PASS: lldb-shell :: SymbolFile/NativePDB/function-types-calling-conv.cpp (1686 of 1785) PASS: lldb-api :: python_api/symbol-context/two-files/TestSymbolContextTwoFiles.py (1687 of 1785) PASS: lldb-api :: macosx/indirect_symbol/TestIndirectSymbols.py (1688 of 1785) PASS: lldb-unit :: Utility/./UtilityTests/RangeTest.SlideZero (1689 of 1785) PASS: lldb-api :: functionalities/data-formatter/synthcapping/TestSyntheticCapping.py (1690 of 1785) PASS: lldb-shell :: SymbolFile/DWARF/dwarf5-index-is-used.cpp (1691 of 1785) PASS: lldb-api :: functionalities/tail_call_frames/unambiguous_sequence/TestUnambiguousTailCalls.py (1692 of 1785) PASS: lldb-unit :: Utility/./UtilityTests/OptionsWithRawTest.MultiWordSuffix (1693 of 1785) PASS: lldb-api :: functionalities/data-formatter/data-formatter-stl/libcxx/vector/TestDataFormatterLibcxxVector.py (1694 of 1785) PASS: lldb-api :: python_api/signals/TestSignalsAPI.py (1695 of 1785) PASS: lldb-unit :: Utility/./UtilityTests/StringListTest.AppendStringCString (1696 of 1785) PASS: lldb-api :: commands/watchpoints/step_over_watchpoint/TestStepOverWatchpoint.py (1697 of 1785) PASS: lldb-unit :: Utility/./UtilityTests/StringLexerTest.AdvanceIf (1698 of 1785) PASS: lldb-api :: lang/objcxx/class-name-clash/TestNameClash.py (1699 of 1785) PASS: lldb-unit :: Language/CPlusPlus/./LanguageCPlusPlusTests/CPlusPlusLanguage.ExtractContextAndIdentifier (1700 of 1785) PASS: lldb-api :: functionalities/data-formatter/refpointer-recursion/TestDataFormatterRefPtrRecursion.py (1701 of 1785) PASS: lldb-unit :: Utility/./UtilityTests/BinaryStreamTest.PutULEB128SixBytes (1702 of 1785) PASS: lldb-unit :: Utility/./UtilityTests/StringListTest.InsertStringAtIndexStdString (1703 of 1785) PASS: lldb-api :: lang/cpp/stl/TestSTL.py (1704 of 1785) PASS: lldb-unit :: Host/./HostTests/SocketTest.TCPListen0ConnectAccept (1705 of 1785) PASS: lldb-api :: functionalities/archives/TestBSDArchives.py (1706 of 1785) PASS: lldb-unit :: Utility/./UtilityTests/StringExtractorTest.InitMisc (1707 of 1785) PASS: lldb-unit :: Utility/./UtilityTests/VMRange.Comparison (1708 of 1785) PASS: lldb-unit :: Process/minidump/./LLDBMinidumpTests/MinidumpParserTest.GetArchitecture (1709 of 1785) PASS: lldb-unit :: Utility/./UtilityTests/ScalarTest.ExtractBitfield (1710 of 1785) PASS: lldb-unit :: Utility/./UtilityTests/StructuredDataTest.StringDump (1711 of 1785) PASS: lldb-unit :: debugserver/./debugserverTests/RNBSocket.LoopBackListenIPv4 (1712 of 1785) PASS: lldb-unit :: Language/CPlusPlus/./LanguageCPlusPlusTests/CPlusPlusLanguage.MethodNameParsing (1713 of 1785) PASS: lldb-unit :: Utility/./UtilityTests/UriParserTest.PortOverflow (1714 of 1785) PASS: lldb-unit :: SymbolFile/NativePDB/./SymbolFileNativePDBTests/PDBFPOProgramToDWARFExpressionTests.UnknownOp (1715 of 1785) PASS: lldb-unit :: tools/lldb-server/tests/./LLDBServerTests/TestBase.DebugserverEnv (1716 of 1785) PASS: lldb-shell :: Register/x86-64-ymm-read.test (1717 of 1785) PASS: lldb-shell :: SymbolFile/NativePDB/function-types-builtins.cpp (1718 of 1785) UNSUPPORTED: lldb-shell :: SymbolFile/PDB/function-nested-block.test (1719 of 1785) PASS: lldb-api :: functionalities/data-formatter/vector-types/TestVectorTypesFormatting.py (1720 of 1785) PASS: lldb-api :: commands/expression/import-std-module/vector-basic/TestBasicVector.py (1721 of 1785) PASS: lldb-unit :: Utility/./UtilityTests/RangeDataVector.FindEntryThatContains (1722 of 1785) PASS: lldb-api :: commands/expression/import-std-module/vector-of-vectors/TestVectorOfVectors.py (1723 of 1785) PASS: lldb-unit :: Utility/./UtilityTests/StreamTest.PutHex8 (1724 of 1785) PASS: lldb-unit :: Process/gdb-remote/./ProcessGdbRemoteTests/GDBRemoteCommunicationClientTest.SendGetDataPacket (1725 of 1785) PASS: lldb-api :: macosx/version_zero/TestGetVersionZeroVersion.py (1726 of 1785) PASS: lldb-unit :: UnwindAssembly/x86/./UnwindAssemblyx86Tests/Testx86AssemblyInspectionEngine.Test64bitFramelessSmallStackFrame (1727 of 1785) PASS: lldb-api :: commands/expression/options/TestExprOptions.py (1728 of 1785) PASS: lldb-api :: commands/expression/import-std-module/basic/TestImportStdModule.py (1729 of 1785) PASS: lldb-unit :: UnwindAssembly/x86/./UnwindAssemblyx86Tests/Testx86AssemblyInspectionEngine.Test64bitFramelessBigStackFrame (1730 of 1785) PASS: lldb-api :: python_api/section/TestSectionAPI.py (1731 of 1785) PASS: lldb-api :: functionalities/thread/concurrent_events/TestConcurrentTwoWatchpointsOneSignal.py (1732 of 1785) PASS: lldb-unit :: Utility/./UtilityTests/SerializationRountripTest.SerializeDeserializePod (1733 of 1785) PASS: lldb-unit :: Utility/./UtilityTests/StringExtractorTest.DecodeHexU8_InvalidHex (1734 of 1785) UNSUPPORTED: lldb-shell :: SymbolFile/PDB/variables-locations.test (1735 of 1785) PASS: lldb-unit :: Host/./HostTests/SocketTest.TCPGetAddress (1736 of 1785) PASS: lldb-unit :: Process/minidump/./LLDBMinidumpTests/MinidumpParserTest.GetFilteredModuleList (1737 of 1785) UNSUPPORTED: lldb-shell :: Unwind/unwind-plan-dwarf-dump.test (1738 of 1785) PASS: lldb-unit :: Utility/./UtilityTests/StringListTest.AppendListCStringArray (1739 of 1785) PASS: lldb-api :: lang/c/struct_types/TestStructTypes.py (1740 of 1785) PASS: lldb-api :: python_api/watchpoint/condition/TestWatchpointConditionAPI.py (1741 of 1785) PASS: lldb-api :: commands/disassemble/basic/TestFrameDisassemble.py (1742 of 1785) PASS: lldb-api :: functionalities/thread/concurrent_events/TestConcurrentWatchBreakDelay.py (1743 of 1785) PASS: lldb-api :: lang/objc/foundation/TestConstStrings.py (1744 of 1785) PASS: lldb-api :: lang/cpp/nsimport/TestCppNsImport.py (1745 of 1785) PASS: lldb-api :: functionalities/data-formatter/nsdictionarysynth/TestNSDictionarySynthetic.py (1746 of 1785) PASS: lldb-unit :: Utility/./UtilityTests/ConstStringTest.NullAndEmptyStates (1747 of 1785) PASS: lldb-unit :: Utility/./UtilityTests/BinaryStreamTest.PutULEB128TwoBytes (1748 of 1785) PASS: lldb-api :: lang/cpp/nested-class-other-compilation-unit/TestNestedClassWithParentInAnotherCU.py (1749 of 1785) PASS: lldb-api :: functionalities/dynamic_value_child_count/TestDynamicValueChildCount.py (1750 of 1785) PASS: lldb-api :: commands/watchpoints/watchpoint_size/TestWatchpointSizes.py (1751 of 1785) PASS: lldb-unit :: Utility/./UtilityTests/StreamTest.PutNHex8 (1752 of 1785) PASS: lldb-api :: commands/expression/import-std-module/stack/TestStack.py (1753 of 1785) PASS: lldb-shell :: SymbolFile/NativePDB/break-by-line.cpp (1754 of 1785) PASS: lldb-shell :: Reproducer/TestDriverOptions.test (1755 of 1785) PASS: lldb-unit :: Utility/./UtilityTests/StringExtractorTest.GetHexU8_Underflow_NoEof (1756 of 1785) PASS: lldb-api :: functionalities/thread/concurrent_events/TestConcurrentSignalNWatchNBreak.py (1757 of 1785) PASS: lldb-shell :: Driver/TestNoUseColor.test (1758 of 1785) PASS: lldb-api :: lang/cpp/frame-var-anon-unions/TestFrameVariableAnonymousUnions.py (1759 of 1785) PASS: lldb-api :: lang/objc/modules/TestObjCModules.py (1760 of 1785) PASS: lldb-api :: functionalities/deleted-executable/TestDeletedExecutable.py (1761 of 1785) PASS: lldb-api :: functionalities/thread/concurrent_events/TestConcurrentManyWatchpoints.py (1762 of 1785) PASS: lldb-unit :: UnwindAssembly/x86/./UnwindAssemblyx86Tests/Testx86AssemblyInspectionEngine.TestPushECX (1763 of 1785) PASS: lldb-api :: commands/frame/diagnose/bad-reference/TestBadReference.py (1764 of 1785) PASS: lldb-unit :: Utility/./UtilityTests/RegularExpression.Invalid (1765 of 1785) PASS: lldb-shell :: SymbolFile/Breakpad/stack-cfi-parsing.test (1766 of 1785) PASS: lldb-shell :: SymbolFile/DWARF/debug-line-basic.s (1767 of 1785) PASS: lldb-api :: commands/expression/import-std-module/weak_ptr/TestWeakPtr.py (1768 of 1785) PASS: lldb-api :: commands/log/invalid-args/TestInvalidArgsLog.py (1769 of 1785) PASS: lldb-api :: commands/expression/test/TestExprs.py (1770 of 1785) PASS: lldb-api :: python_api/sbvalue_persist/TestSBValuePersist.py (1771 of 1785) PASS: lldb-unit :: Utility/./UtilityTests/StringListTest.GetMaxStringLengthEqualSize (1772 of 1785) PASS: lldb-api :: functionalities/thread/create_after_attach/TestCreateAfterAttach.py (1773 of 1785) PASS: lldb-api :: lang/cpp/member-and-local-vars-with-same-name/TestMembersAndLocalsWithSameName.py (1774 of 1785) PASS: lldb-api :: functionalities/data-formatter/var-in-aggregate-misuse/TestVarInAggregateMisuse.py (1775 of 1785) PASS: lldb-api :: python_api/formatters/TestFormattersSBAPI.py (1776 of 1785) PASS: lldb-api :: functionalities/unwind/noreturn/module-end/TestNoReturnModuleEnd.py (1777 of 1785) PASS: lldb-api :: functionalities/memory/read/TestMemoryRead.py (1778 of 1785) PASS: lldb-api :: functionalities/plugins/command_plugin/TestPluginCommands.py (1779 of 1785) PASS: lldb-api :: python_api/thread/TestThreadAPI.py (1780 of 1785) PASS: lldb-api :: functionalities/data-formatter/nssetsynth/TestNSSetSynthetic.py (1781 of 1785) PASS: lldb-api :: lang/cpp/enum_types/TestCPP11EnumTypes.py (1782 of 1785) PASS: lldb-api :: api/check_public_api_headers/TestPublicAPIHeaders.py (1783 of 1785) PASS: lldb-api :: api/multithreaded/TestMultithreaded.py (1784 of 1785) PASS: lldb-api :: lang/objc/foundation/TestFoundationDisassembly.py (1785 of 1785) Testing Time: 1835.71s ******************** Failing Tests (1): lldb-api :: tools/lldb-server/TestGdbRemoteAttach.py

Hide Details

Hide Details

Slowest Tests: -------------------------------------------------------------------------- 123.51s: lldb-api :: commands/target/basic/TestTargetCommand.py 124.13s: lldb-api :: lang/c/anonymous/TestAnonymous.py 126.48s: lldb-api :: functionalities/data-formatter/data-formatter-objc/TestDataFormatterObjCNSContainer.py 130.05s: lldb-api :: functionalities/inferior-crashing/TestInferiorCrashingStep.py 132.26s: lldb-api :: lang/objc/objc-new-syntax/TestObjCNewSyntaxDictionary.py 138.97s: lldb-api :: lang/cpp/enum_types/TestCPP11EnumTypes.py 140.13s: lldb-api :: api/multithreaded/TestMultithreaded.py 144.62s: lldb-api :: lang/objc/objc-new-syntax/TestObjCNewSyntaxArray.py 160.35s: lldb-api :: functionalities/recursion/TestValueObjectRecursion.py 172.44s: lldb-api :: lang/objc/exceptions/TestObjCExceptions.py 179.76s: lldb-api :: functionalities/load_unload/TestLoadUnload.py 182.37s: lldb-api :: functionalities/return-value/TestReturnValue.py 193.45s: lldb-api :: tools/lldb-server/TestLldbGdbServer.py 194.67s: lldb-api :: lang/objc/objc-new-syntax/TestObjCNewSyntaxLiteral.py 211.27s: lldb-api :: lang/cpp/namespace/TestNamespaceLookup.py 215.11s: lldb-api :: lang/objc/foundation/TestObjCMethods.py 246.17s: lldb-api :: lang/objc/hidden-ivars/TestHiddenIvars.py 414.34s: lldb-api :: types/TestIntegerTypes.py 495.01s: lldb-api :: lang/objc/foundation/TestFoundationDisassembly.py 551.77s: lldb-api :: types/TestIntegerTypesExpr.py

Hide Details

Tests Times: -------------------------------------------------------------------------- [ Range ] :: [ Percentage ] :: [ Count ] -------------------------------------------------------------------------- [ 0s, 50s) :: [************************************ ] :: [1638/1785] [ 50s,100s) :: [** ] :: [ 115/1785] [100s,150s) :: [ ] :: [ 17/1785] [150s,200s) :: [ ] :: [ 7/1785] [200s,250s) :: [ ] :: [ 4/1785] [250s,300s) :: [ ] :: [ 1/1785] [300s,350s) :: [ ] :: [ 0/1785] [350s,400s) :: [ ] :: [ 0/1785] [400s,450s) :: [ ] :: [ 0/1785] [450s,500s) :: [ ] :: [ 1/1785] [500s,550s) :: [ ] :: [ 1/1785] [550s,600s) :: [ ] :: [ 1/1785] Expected Passes : 1636 Expected Failures : 6 Unsupported Tests : 142 Unexpected Failures: 1 FAILED: tools/lldb/test/CMakeFiles/check-lldb-lit cd /Users/buildslave/jenkins/workspace/lldb-cmake-sanitized/lldb-build/tools/lldb/test && /usr/bin/python /Users/buildslave/jenkins/workspace/lldb-cmake-sanitized/lldb-build/./bin/llvm-lit -v --time-tests --shuffle --xunit-xml-output=/Users/buildslave/jenkins/workspace/lldb-cmake-sanitized/test/results.xml -v --timeout 1200 /Users/buildslave/jenkins/workspace/lldb-cmake-sanitized/lldb-build/tools/lldb/test ninja: build stopped: subcommand failed. Command failed Command: ['/usr/bin/env', 'TERM=vt100', '/usr/local/bin/ninja', '-v', 'check-lldb'] [Pipeline] } [Pipeline] // timeout [Pipeline] } [Pipeline] // stage [Pipeline] stage [Pipeline] { (Declarative: Post Actions) [Pipeline] scanForIssues No credentials specified [Clang (LLVM based)] Sleeping for 5 seconds due to JENKINS-32191... [Clang (LLVM based)] Parsing console log (workspace: '/Users/buildslave/jenkins/workspace/lldb-cmake-sanitized') [Pipeline] junit Recording test results [Pipeline] } [Pipeline] // stage [Pipeline] } [Pipeline] // withEnv [Pipeline] } [Pipeline] // node [Pipeline] End of Pipeline [BFA] Scanning build for known causes... [BFA] Found failure cause(s): [BFA] Regression test failed from category Test [BFA] Ninja target failed from category Compile [BFA] Done. 0s ERROR: script returned exit code 1 Finished: FAILURE