FailedConsole Output

Skipping 8,130 KB.. Full Log
redset/TestOrderedSet.py (350 of 1785)
PASS: lldb-unit :: Utility/./UtilityTests/Predicate.WaitForValueNotEqualTo (351 of 1785)
PASS: lldb-unit :: Expression/./ExpressionTests/DiagnosticManagerTest.PutStringSeverities (352 of 1785)
PASS: lldb-api :: python_api/interpreter/TestCommandInterpreterAPI.py (353 of 1785)
PASS: lldb-api :: functionalities/breakpoint/objc/TestObjCBreakpoints.py (354 of 1785)
PASS: lldb-unit :: Utility/./UtilityTests/StateTest.Formatv (355 of 1785)
PASS: lldb-unit :: Utility/./UtilityTests/RegularExpression.Invalid (356 of 1785)
PASS: lldb-unit :: Target/./TargetTests/ExecutionContextTest.GetByteOrder (357 of 1785)
UNSUPPORTED: lldb-api :: benchmarks/turnaround/TestCompileRunToBreakpointTurnaround.py (358 of 1785)
PASS: lldb-shell :: Minidump/disassemble-no-module.yaml (359 of 1785)
PASS: lldb-unit :: UnwindAssembly/x86/./UnwindAssemblyx86Tests/Testx86AssemblyInspectionEngine.TestPushR15 (360 of 1785)
PASS: lldb-api :: lang/c/register_variables/TestRegisterVariables.py (361 of 1785)
PASS: lldb-unit :: Utility/./UtilityTests/Flags.AllClear (362 of 1785)
PASS: lldb-unit :: Utility/./UtilityTests/StringListTest.GetMaxStringLengthDecreasingSize (363 of 1785)
PASS: lldb-unit :: Host/./HostTests/FileSystemTest.MakeAbsolute (364 of 1785)
PASS: lldb-unit :: Process/minidump/./LLDBMinidumpTests/MinidumpParserTest.GetThreadContext_x86_32_wow64 (365 of 1785)
PASS: lldb-api :: functionalities/breakpoint/cpp_exception/TestCPPExceptionBreakpoint.py (366 of 1785)
PASS: lldb-unit :: Utility/./UtilityTests/StringExtractorTest.GetHexBytes_FullString (367 of 1785)
PASS: lldb-api :: functionalities/param_entry_vals/basic_entry_values_x86_64/TestBasicEntryValuesX86_64.py (368 of 1785)
UNSUPPORTED: lldb-shell :: SymbolFile/PDB/function-level-linking.test (369 of 1785)
PASS: lldb-unit :: UnwindAssembly/x86/./UnwindAssemblyx86Tests/Testx86AssemblyInspectionEngine.TestPopEBP (370 of 1785)
UNSUPPORTED: lldb-api :: functionalities/data-formatter/data-formatter-stl/libstdcpp/map/TestDataFormatterStdMap.py (371 of 1785)
PASS: lldb-unit :: Host/./HostTests/FileSystemTest.FileAndDirectoryComponents (372 of 1785)
PASS: lldb-unit :: Utility/./UtilityTests/StringLexerTest.Next (373 of 1785)
PASS: lldb-unit :: Utility/./UtilityTests/StreamTeeTest.GetStreamAtIndexOutOfBounds (374 of 1785)
PASS: lldb-unit :: Utility/./UtilityTests/ArgsTest.DoubleQuotedItem (375 of 1785)
PASS: lldb-unit :: Utility/./UtilityTests/ArgsTest.GetQuotedCommandString (376 of 1785)
PASS: lldb-api :: commands/expression/import-std-module/queue/TestQueue.py (377 of 1785)
PASS: lldb-unit :: debugserver/./debugserverTests/RNBSocket.LoopBackConnectIPv6 (378 of 1785)
PASS: lldb-unit :: UnwindAssembly/x86/./UnwindAssemblyx86Tests/Testx86AssemblyInspectionEngine.TestPushESI (379 of 1785)
PASS: lldb-unit :: Utility/./UtilityTests/StringExtractorTest.DecodeHexU8_Underflow2 (380 of 1785)
PASS: lldb-unit :: Utility/./UtilityTests/FileSpecTest.EqualDotsPosixRoot (381 of 1785)
UNSUPPORTED: lldb-api :: tools/lldb-server/libraries-svr4/TestGdbRemoteLibrariesSvr4Support.py (382 of 1785)
PASS: lldb-unit :: Core/./LLDBCoreTests/MangledTest.EmptyForInvalidName (383 of 1785)
PASS: lldb-api :: api/multiple-targets/TestMultipleTargets.py (384 of 1785)
PASS: lldb-unit :: Utility/./UtilityTests/RegularExpression.Match (385 of 1785)
PASS: lldb-api :: lang/objc/modules-inline-functions/TestModulesInlineFunctions.py (386 of 1785)
PASS: lldb-api :: commands/expression/dollar-in-variable/TestDollarInVariable.py (387 of 1785)
PASS: lldb-api :: commands/process/attach/attach_denied/TestAttachDenied.py (388 of 1785)
PASS: lldb-api :: functionalities/data-formatter/data-formatter-stl/libcxx/variant/TestDataFormatterLibcxxVariant.py (389 of 1785)
UNSUPPORTED: lldb-shell :: SymbolFile/DWARF/debug-types-expressions.test (390 of 1785)
UNSUPPORTED: lldb-shell :: SymbolFile/target-symbols-add-unwind.test (391 of 1785)
PASS: lldb-unit :: Process/gdb-remote/./ProcessGdbRemoteTests/GDBRemoteClientBaseTest.SendContinueAndInterrupt (392 of 1785)
UNSUPPORTED: lldb-api :: macosx/macabi/TestMacABImacOSFramework.py (393 of 1785)
PASS: lldb-unit :: Utility/./UtilityTests/UriParserTest.BracketedHostname (394 of 1785)
PASS: lldb-unit :: Expression/./ExpressionTests/DiagnosticManagerTest.GetStringMultiline (395 of 1785)
PASS: lldb-api :: functionalities/breakpoint/inlined_breakpoints/TestInlinedBreakpoints.py (396 of 1785)
PASS: lldb-api :: functionalities/data-formatter/data-formatter-disabling/TestDataFormatterDisabling.py (397 of 1785)
PASS: lldb-api :: commands/expression/completion-in-lambda-and-unnnamed-class/TestCompletionInLambdaAndUnnamedClass.py (398 of 1785)
UNSUPPORTED: lldb-shell :: Register/x86-64-xmm16-read.test (399 of 1785)
PASS: lldb-api :: functionalities/data-formatter/data-formatter-stl/libcxx/set/TestDataFormatterLibcxxSet.py (400 of 1785)
UNSUPPORTED: lldb-api :: commands/watchpoints/hello_watchlocation/TestWatchLocation.py (401 of 1785)
PASS: lldb-api :: functionalities/plugins/python_os_plugin/TestPythonOSPlugin.py (402 of 1785)
PASS: lldb-unit :: Process/minidump/./LLDBMinidumpTests/MinidumpParserTest.GetFilteredModuleList (403 of 1785)
PASS: lldb-unit :: ObjectFile/ELF/./ObjectFileELFTests/ObjectFileELFTest.GetModuleSpecifications_EarlySectionHeaders (404 of 1785)
PASS: lldb-unit :: Utility/./UtilityTests/BinaryStreamTest.PutULEB128TwoBytes (405 of 1785)
PASS: lldb-unit :: Host/./HostTests/FileSystemTest.Exists (406 of 1785)
UNSUPPORTED: lldb-shell :: Register/x86-gp-write.test (407 of 1785)
PASS: lldb-unit :: ObjectFile/Breakpad/./ObjectFileBreakpadTests/FuncRecord.parse (408 of 1785)
PASS: lldb-api :: functionalities/breakpoint/require_hw_breakpoints/TestRequireHWBreakpoints.py (409 of 1785)
UNSUPPORTED: lldb-api :: functionalities/darwin_log/filter/exact_match/subsystem/TestDarwinLogFilterMatchSubsystem.py (410 of 1785)
UNSUPPORTED: lldb-api :: functionalities/thread/multi_break/TestMultipleBreakpoints.py (411 of 1785)
PASS: lldb-api :: functionalities/data-formatter/setvaluefromcstring/TestSetValueFromCString.py (412 of 1785)
PASS: lldb-api :: functionalities/breakpoint/consecutive_breakpoints/TestConsecutiveBreakpoints.py (413 of 1785)
PASS: lldb-unit :: Utility/./UtilityTests/UriParserTest.SchemeHostSeparator2 (414 of 1785)
PASS: lldb-unit :: Utility/./UtilityTests/ArchSpecTest.TestParseMachCPUDashSubtypeTripleSimple (415 of 1785)
PASS: lldb-unit :: Utility/./UtilityTests/RangeTest.SetRangeBase (416 of 1785)
PASS: lldb-api :: api/command-return-object/TestSBCommandReturnObject.py (417 of 1785)
PASS: lldb-api :: lang/objc/exceptions/TestObjCExceptions.py (418 of 1785)
PASS: lldb-api :: lang/cpp/unsigned_types/TestUnsignedTypes.py (419 of 1785)
PASS: lldb-api :: functionalities/target-new-solib-notifications/TestModuleLoadedNotifys.py (420 of 1785)
PASS: lldb-unit :: Expression/./ExpressionTests/CppModuleConfigurationTest.MissingLibCpp (421 of 1785)
PASS: lldb-api :: types/TestDoubleTypes.py (422 of 1785)
PASS: lldb-api :: macosx/find-dsym/bundle-with-dot-in-filename/TestBundleWithDotInFilename.py (423 of 1785)
PASS: lldb-shell :: ObjectFile/ELF/many-sections.s (424 of 1785)
PASS: lldb-api :: commands/command/script/import/TestImport.py (425 of 1785)
PASS: lldb-unit :: Utility/./UtilityTests/StringExtractorTest.DecodeHexU8_Exact (426 of 1785)
PASS: lldb-shell :: ObjectFile/ELF/PT_LOAD-overlap.yaml (427 of 1785)
PASS: lldb-unit :: Utility/./UtilityTests/StringExtractorTest.GetHexU8_Extra (428 of 1785)
PASS: lldb-shell :: ObjectFile/ELF/section-types-edgecases.yaml (429 of 1785)
PASS: lldb-api :: commands/command/script/import/rdar-12586188/TestRdar12586188.py (430 of 1785)
PASS: lldb-unit :: Language/Highlighting/./HighlighterTests/HighlighterTest.HighlighterSelectionPath (431 of 1785)
PASS: lldb-unit :: ScriptInterpreter/Python/./ScriptInterpreterPythonTests/PythonDataObjectsTest.TestPythonStringToStr (432 of 1785)
PASS: lldb-unit :: Utility/./UtilityTests/OptionsWithRawTest.WhitespaceSuffix (433 of 1785)
UNSUPPORTED: lldb-api :: functionalities/tty/TestTerminal.py (434 of 1785)
PASS: lldb-unit :: Process/gdb-remote/./ProcessGdbRemoteTests/GDBRemoteClientBaseTest.SendContinueDelegateInterface (435 of 1785)
PASS: lldb-api :: commands/disassemble/basic/TestDisassembleBreakpoint.py (436 of 1785)
PASS: lldb-unit :: Utility/./UtilityTests/CompletionRequest.TryCompleteCurrentArgMode (437 of 1785)
PASS: lldb-api :: functionalities/data-formatter/data-formatter-objc/TestDataFormatterObjCExpr.py (438 of 1785)
PASS: lldb-unit :: Utility/./UtilityTests/UUIDTest.SetFromStringRef (439 of 1785)
PASS: lldb-api :: functionalities/target_var/TestTargetVar.py (440 of 1785)
PASS: lldb-shell :: Commands/CommandScriptImmediateOutput/CommandScriptImmediateOutputConsole.test (441 of 1785)
PASS: lldb-api :: functionalities/breakpoint/dummy_target_breakpoints/TestBreakpointsWithNoTargets.py (442 of 1785)
PASS: lldb-api :: lang/objc/objc-optimized/TestObjcOptimized.py (443 of 1785)
PASS: lldb-api :: commands/expression/import-std-module/list-basic/TestBasicList.py (444 of 1785)
PASS: lldb-api :: functionalities/data-formatter/stringprinter/TestStringPrinter.py (445 of 1785)
PASS: lldb-shell :: ObjectFile/ELF/netbsd-core-amd64.test (446 of 1785)
UNSUPPORTED: lldb-shell :: Register/aarch64-gp-read.test (447 of 1785)
UNSUPPORTED: lldb-api :: functionalities/darwin_log/filter/regex/subsystem/TestDarwinLogFilterRegexSubsystem.py (448 of 1785)
PASS: lldb-shell :: SymbolFile/DWARF/dir-separator-posix.s (449 of 1785)
PASS: lldb-unit :: Utility/./UtilityTests/CompletionRequest.TryCompleteCurrentArgBad (450 of 1785)
PASS: lldb-unit :: Utility/./UtilityTests/ScalarTest.Comparison (451 of 1785)
PASS: lldb-unit :: Host/./HostTests/FileSystemTest.GetByteSize (452 of 1785)
PASS: lldb-api :: functionalities/data-formatter/frameformat_smallstruct/TestFrameFormatSmallStruct.py (453 of 1785)
PASS: lldb-shell :: SymbolFile/DWARF/split-dwarf-inlining.cpp (454 of 1785)
PASS: lldb-api :: commands/expression/import-std-module/sysroot/TestStdModuleSysroot.py (455 of 1785)
PASS: lldb-api :: functionalities/thread/concurrent_events/TestConcurrentDelaySignalWatch.py (456 of 1785)
UNSUPPORTED: lldb-shell :: Register/x86-ymm-read.test (457 of 1785)
UNSUPPORTED: lldb-api :: benchmarks/continue/TestBenchmarkContinue.py (458 of 1785)
PASS: lldb-api :: python_api/lldbutil/iter/TestRegistersIterator.py (459 of 1785)
PASS: lldb-unit :: Utility/./UtilityTests/StringListTest.LongestCommonPrefix (460 of 1785)
PASS: lldb-unit :: Utility/./UtilityTests/StreamTest.PutCharNull (461 of 1785)
PASS: lldb-unit :: Utility/./UtilityTests/RangeTest.NotEqual (462 of 1785)
PASS: lldb-unit :: Utility/./UtilityTests/ProcessInstanceInfoMatch.Name (463 of 1785)
PASS: lldb-unit :: Host/./HostTests/FileSystemTest.EnumerateDirectory (464 of 1785)
PASS: lldb-shell :: Expr/TestMultilineExpr.test (465 of 1785)
PASS: lldb-api :: python_api/exprpath_synthetic/TestExprPathSynthetic.py (466 of 1785)
PASS: lldb-api :: commands/expression/rdar44436068/Test128BitsInteger.py (467 of 1785)
PASS: lldb-shell :: SymbolFile/DWARF/debug-line-basic.s (468 of 1785)
PASS: lldb-unit :: Host/./HostTests/HostInfoTest.GetHostname (469 of 1785)
PASS: lldb-unit :: Utility/./UtilityTests/UriParserTest.BadPort2 (470 of 1785)
PASS: lldb-unit :: Host/./HostTests/FileSystemTest.Readable (471 of 1785)
UNSUPPORTED: lldb-api :: functionalities/signal/handle-segv/TestHandleSegv.py (472 of 1785)
UNSUPPORTED: lldb-api :: commands/expression/completion-crash-incomplete-record/TestCompletionCrashIncompleteRecord.py (473 of 1785)
PASS: lldb-shell :: Driver/TestConvenienceVariables.test (474 of 1785)
PASS: lldb-unit :: UnwindAssembly/x86/./UnwindAssemblyx86Tests/Testx86AssemblyInspectionEngine.TestSubRSP (475 of 1785)
PASS: lldb-unit :: Utility/./UtilityTests/TimerTest.CategoryTimesNested (476 of 1785)
PASS: lldb-unit :: UnwindAssembly/x86/./UnwindAssemblyx86Tests/Testx86AssemblyInspectionEngine.TestPushECX (477 of 1785)
PASS: lldb-unit :: Utility/./UtilityTests/ArgsTest.AppendArguments (478 of 1785)
UNSUPPORTED: lldb-api :: commands/expression/completion-crash2/TestCompletionCrash2.py (479 of 1785)
PASS: lldb-api :: functionalities/breakpoint/breakpoint_hit_count/TestBreakpointHitCount.py (480 of 1785)
PASS: lldb-api :: functionalities/thread/crash_during_step/TestCrashDuringStep.py (481 of 1785)
PASS: lldb-unit :: Utility/./UtilityTests/StringListTest.RemoveBlankLines (482 of 1785)
PASS: lldb-unit :: Utility/./UtilityTests/IndexToObjectTest.ObjectForIndex (483 of 1785)
PASS: lldb-api :: python_api/formatters/TestFormattersSBAPI.py (484 of 1785)
PASS: lldb-unit :: ObjectFile/Breakpad/./ObjectFileBreakpadTests/StackCFIRecord.parse (485 of 1785)
PASS: lldb-api :: lang/cpp/modules-import/TestCXXModulesImport.py (486 of 1785)
PASS: lldb-api :: functionalities/thread/backtrace_all/TestBacktraceAll.py (487 of 1785)
PASS: lldb-unit :: Utility/./UtilityTests/OptionsWithRawTest.EmptyArgsOnlySuffix (488 of 1785)
PASS: lldb-api :: functionalities/tsan/basic/TestTsanBasic.py (489 of 1785)
PASS: lldb-api :: python_api/function_symbol/TestDisasmAPI.py (490 of 1785)
PASS: lldb-unit :: Host/./HostTests/NativeProcessProtocolTest.ReadMemoryWithoutTrap (491 of 1785)
PASS: lldb-unit :: Language/CPlusPlus/./LanguageCPlusPlusTests/CPlusPlusLanguage.CPlusPlusNameParser (492 of 1785)
PASS: lldb-shell :: Quit/TestQuitExitCodeHexA.test (493 of 1785)
PASS: lldb-api :: functionalities/tail_call_frames/sbapi_support/TestTailCallFrameSBAPI.py (494 of 1785)
PASS: lldb-api :: python_api/interpreter/TestRunCommandInterpreterAPI.py (495 of 1785)
PASS: lldb-unit :: Utility/./UtilityTests/VMRange.IsValid (496 of 1785)
PASS: lldb-unit :: Language/Highlighting/./HighlighterTests/HighlighterTest.FallbackHighlighter (497 of 1785)
PASS: lldb-api :: functionalities/modern-type-lookup/libcxx/TestLibCxxModernTypeLookup.py (498 of 1785)
PASS: lldb-unit :: ScriptInterpreter/Python/./ScriptInterpreterPythonTests/PythonDataObjectsTest.TestPythonTupleSize (499 of 1785)
PASS: lldb-api :: functionalities/fat_archives/TestFatArchives.py (500 of 1785)
PASS: lldb-shell :: SymbolFile/Breakpad/line-table-edgecases.test (501 of 1785)
PASS: lldb-api :: functionalities/data-formatter/data-formatter-skip-summary/TestDataFormatterSkipSummary.py (502 of 1785)
PASS: lldb-shell :: Reproducer/Functionalities/TestDataFormatter.test (503 of 1785)
PASS: lldb-unit :: Utility/./UtilityTests/DataExtractorTest.GetCStr (504 of 1785)
PASS: lldb-api :: types/TestFloatTypes.py (505 of 1785)
PASS: lldb-shell :: SymbolFile/sizeless-symbol.test (506 of 1785)
PASS: lldb-shell :: Settings/TestEchoCommands.test (507 of 1785)
PASS: lldb-unit :: Utility/./UtilityTests/StringExtractorTest.GetU32BigEndian (508 of 1785)
PASS: lldb-api :: functionalities/thread/concurrent_events/TestConcurrentManyBreakpoints.py (509 of 1785)
PASS: lldb-unit :: ObjectFile/Breakpad/./ObjectFileBreakpadTests/PublicRecord.parse (510 of 1785)
PASS: lldb-unit :: Utility/./UtilityTests/VMRange.Ordering (511 of 1785)
PASS: lldb-shell :: ObjectFile/MachO/subsections.yaml (512 of 1785)
PASS: lldb-api :: functionalities/breakpoint/address_breakpoints/TestAddressBreakpoints.py (513 of 1785)
PASS: lldb-unit :: ObjectFile/Breakpad/./ObjectFileBreakpadTests/InfoRecord.parse (514 of 1785)
PASS: lldb-api :: commands/target/basic/TestTargetCommand.py (515 of 1785)
PASS: lldb-api :: lang/cpp/namespace/TestNamespaceLookup.py (516 of 1785)
PASS: lldb-unit :: Utility/./UtilityTests/RangeTest.Equal (517 of 1785)
PASS: lldb-unit :: SymbolFile/NativePDB/./SymbolFileNativePDBTests/PDBFPOProgramToDWARFExpressionTests.UnresolvedDependentCyclicRegisterAssignmentReference (518 of 1785)
PASS: lldb-api :: lang/cpp/incomplete-types/TestCppIncompleteTypes.py (519 of 1785)
PASS: lldb-api :: commands/expression/radar_9673664/TestExprHelpExamples.py (520 of 1785)
PASS: lldb-api :: functionalities/data-formatter/data-formatter-stl/libcxx/multimap/TestDataFormatterLibccMultiMap.py (521 of 1785)
PASS: lldb-shell :: Expr/TestTypeOfDeclTypeExpr.test (522 of 1785)
PASS: lldb-api :: functionalities/thread/concurrent_events/TestConcurrentBreakpointsDelayedBreakpointOneWatchpoint.py (523 of 1785)
PASS: lldb-shell :: ObjectFile/PECOFF/dep-modules.yaml (524 of 1785)
PASS: lldb-unit :: Utility/./UtilityTests/BinaryStreamTest.PutSLEB128SixBytes (525 of 1785)
PASS: lldb-shell :: Breakpoint/split-dwarf-5-addrbase.test (526 of 1785)
PASS: lldb-unit :: SymbolFile/DWARF/./SymbolFileDWARFTests/SymbolFileDWARFTests.TestAbbrevInvalidNULLTag (527 of 1785)
PASS: lldb-api :: functionalities/data-formatter/data-formatter-objc/TestDataFormatterObjCNSBundle.py (528 of 1785)
PASS: lldb-unit :: UnwindAssembly/x86/./UnwindAssemblyx86Tests/Testx86AssemblyInspectionEngine.TestPopEBX (529 of 1785)
PASS: lldb-unit :: Utility/./UtilityTests/StreamTeeTest.Flush (530 of 1785)
PASS: lldb-unit :: Utility/./UtilityTests/StringListTest.AppendListCStringArray (531 of 1785)
PASS: lldb-api :: functionalities/thread/concurrent_events/TestConcurrentManyCrash.py (532 of 1785)
UNSUPPORTED: lldb-shell :: Register/x86-64-gp-write.test (533 of 1785)
PASS: lldb-api :: functionalities/thread/concurrent_events/TestConcurrentSignalWatch.py (534 of 1785)
PASS: lldb-shell :: Quit/TestQuitExitCodeHex0.test (535 of 1785)
PASS: lldb-unit :: Utility/./UtilityTests/StringExtractorTest.GetHexU8_InvalidHex_NoEof (536 of 1785)
PASS: lldb-unit :: Utility/./UtilityTests/StreamTest.ShiftOperatorInts (537 of 1785)
PASS: lldb-api :: commands/settings/quoting/TestQuoting.py (538 of 1785)
PASS: lldb-api :: macosx/find-app-in-bundle/TestFindAppInBundle.py (539 of 1785)
PASS: lldb-api :: lang/cpp/accelerator-table/TestCPPAccelerator.py (540 of 1785)
PASS: lldb-unit :: Utility/./UtilityTests/BinaryStreamTest.PutSLEB128Zero (541 of 1785)
PASS: lldb-api :: lang/cpp/call-function/TestCallCPPFunction.py (542 of 1785)
PASS: lldb-shell :: SymbolFile/DWARF/debug-types-signature-loop.s (543 of 1785)
PASS: lldb-unit :: Utility/./UtilityTests/StatusTest.ErrorConversion (544 of 1785)
PASS: lldb-shell :: ObjectFile/ELF/section-addresses.yaml (545 of 1785)
PASS: lldb-unit :: Utility/./UtilityTests/BinaryStreamTest.PutULEB128MaxValue (546 of 1785)
PASS: lldb-unit :: Utility/./UtilityTests/StringExtractorTest.GetHexU8_Exact (547 of 1785)
PASS: lldb-api :: commands/expression/po_verbosity/TestPoVerbosity.py (548 of 1785)
PASS: lldb-unit :: Utility/./UtilityTests/RangeTest.Union (549 of 1785)
PASS: lldb-api :: functionalities/thread/thread_exit/TestThreadExit.py (550 of 1785)
PASS: lldb-api :: functionalities/wrong_commands/TestWrongCommands.py (551 of 1785)
PASS: lldb-shell :: Register/x86-64-ymm-read.test (552 of 1785)
PASS: lldb-api :: macosx/lc-note/kern-ver-str/TestKernVerStrLCNOTE.py (553 of 1785)
PASS: lldb-unit :: Expression/./ExpressionTests/CppModuleConfigurationTest.UnknownLibCppFile (554 of 1785)
PASS: lldb-api :: python_api/sbstructureddata/TestStructuredDataAPI.py (555 of 1785)
PASS: lldb-api :: python_api/process/read-mem-cstring/TestReadMemCString.py (556 of 1785)
PASS: lldb-unit :: Core/./LLDBCoreTests/RichManglingContextTest.IPDRealloc (557 of 1785)
UNSUPPORTED: lldb-api :: tools/lldb-server/thread-name/TestGdbRemoteThreadName.py (558 of 1785)
UNSUPPORTED: lldb-shell :: SymbolFile/PDB/function-nested-block.test (559 of 1785)
PASS: lldb-api :: functionalities/thread/step_until/TestStepUntil.py (560 of 1785)
PASS: lldb-api :: lang/objc/foundation/TestObjCMethods2.py (561 of 1785)
PASS: lldb-api :: commands/expression/options/TestExprOptions.py (562 of 1785)
PASS: lldb-shell :: ObjectFile/Breakpad/uuid-matching-mac.test (563 of 1785)
PASS: lldb-shell :: Reproducer/TestGDBRemoteRepro.test (564 of 1785)
PASS: lldb-unit :: Utility/./UtilityTests/StreamTest.PutBytesAsRawHex8ToBigEndian (565 of 1785)
PASS: lldb-api :: lang/cpp/stl/TestSTL.py (566 of 1785)
PASS: lldb-unit :: Host/./HostTests/Host.GetEnvironment (567 of 1785)
PASS: lldb-api :: lang/cpp/extern_c/TestExternCSymbols.py (568 of 1785)
PASS: lldb-api :: functionalities/breakpoint/comp_dir_symlink/TestCompDirSymLink.py (569 of 1785)
PASS: lldb-api :: functionalities/thread/concurrent_events/TestConcurrentTwoWatchpointThreads.py (570 of 1785)
PASS: lldb-shell :: Register/x86-64-gp-read.test (571 of 1785)
PASS: lldb-unit :: ScriptInterpreter/Python/./ScriptInterpreterPythonTests/PythonDataObjectsTest.TestModuleNameResolutionNoDot (572 of 1785)
PASS: lldb-unit :: Symbol/./SymbolTests/TestClangASTContext.TestRemoveFastQualifiers (573 of 1785)
PASS: lldb-unit :: Utility/./UtilityTests/RangeTest.ContainsEndInclusiveInvalid (574 of 1785)
PASS: lldb-api :: lang/cpp/virtual-overload/TestVirtualOverload.py (575 of 1785)
PASS: lldb-api :: commands/expression/import-std-module/vector-dbg-info-content/TestDbgInfoContentVector.py (576 of 1785)
PASS: lldb-shell :: ObjectFile/ELF/PT_LOAD-overlap-PT_TLS.yaml (577 of 1785)
PASS: lldb-api :: functionalities/inferior-crashing/TestInferiorCrashingStep.py (578 of 1785)
XFAIL: lldb-shell :: Register/x86-mm-xmm-write.test (579 of 1785)
PASS: lldb-unit :: Utility/./UtilityTests/UriParserTest.BadPort (580 of 1785)
PASS: lldb-shell :: ObjectFile/ELF/gnu-debuglink.yaml (581 of 1785)
PASS: lldb-unit :: Utility/./UtilityTests/Flags.GetBitSize (582 of 1785)
PASS: lldb-unit :: Utility/./UtilityTests/StreamTeeTest.Assignment (583 of 1785)
PASS: lldb-unit :: Expression/./ExpressionTests/DiagnosticManagerTest.AppendMessageNoDiag (584 of 1785)
PASS: lldb-unit :: Utility/./UtilityTests/RangeTest.Copy (585 of 1785)
PASS: lldb-unit :: Utility/./UtilityTests/TimerTest.CategoryTimesStats (586 of 1785)
PASS: lldb-shell :: Reproducer/TestRelativePath.test (587 of 1785)
PASS: lldb-unit :: Utility/./UtilityTests/DataExtractorTest.GetCStrUnterminated (588 of 1785)
PASS: lldb-unit :: UnwindAssembly/x86/./UnwindAssemblyx86Tests/Testx86AssemblyInspectionEngine.TestSpArithx86_64Augmented (589 of 1785)
PASS: lldb-unit :: Expression/./ExpressionTests/DiagnosticManagerTest.GetStringNoDiags (590 of 1785)
PASS: lldb-api :: functionalities/thread/jump/TestThreadJump.py (591 of 1785)
PASS: lldb-unit :: Utility/./UtilityTests/StringLexerTest.HasAtLeast (592 of 1785)
PASS: lldb-unit :: Utility/./UtilityTests/ArgsTest.ReplaceArgumentAtIndexShort (593 of 1785)
PASS: lldb-unit :: Process/gdb-remote/./ProcessGdbRemoteTests/GDBRemoteClientBaseTest.SendContinueAndAsyncPacket (594 of 1785)
PASS: lldb-shell :: Quit/TestQuitExitCode0.test (595 of 1785)
PASS: lldb-api :: lang/cpp/class-template-parameter-pack/TestClassTemplateParameterPack.py (596 of 1785)
PASS: lldb-api :: tools/lldb-server/TestGdbRemoteSingleStep.py (597 of 1785)
PASS: lldb-unit :: Utility/./UtilityTests/RecordReplayTest.InstrumentedBarRef (598 of 1785)
PASS: lldb-api :: lang/cpp/signed_types/TestSignedTypes.py (599 of 1785)
PASS: lldb-api :: python_api/watchpoint/watchlocation/TestTargetWatchAddress.py (600 of 1785)
PASS: lldb-unit :: Language/Highlighting/./HighlighterTests/HighlighterTest.ClangCursorPosInOtherToken (601 of 1785)
PASS: lldb-unit :: Utility/./UtilityTests/StringExtractorTest.InitMisc (602 of 1785)
UNSUPPORTED: lldb-api :: benchmarks/libcxxmap/TestBenchmarkLibcxxMap.py (603 of 1785)
PASS: lldb-unit :: Utility/./UtilityTests/RegularExpression.Valid (604 of 1785)
PASS: lldb-shell :: SymbolFile/DWARF/debug-types-basic.test (605 of 1785)
PASS: lldb-api :: lang/c/tls_globals/TestTlsGlobals.py (606 of 1785)
PASS: lldb-api :: lang/objc/ivar-IMP/TestObjCiVarIMP.py (607 of 1785)
PASS: lldb-unit :: Language/Highlighting/./HighlighterTests/HighlighterTest.ClangCommas (608 of 1785)
PASS: lldb-api :: functionalities/pre_run_dylibs/TestPreRunDylibs.py (609 of 1785)
PASS: lldb-unit :: UnwindAssembly/x86/./UnwindAssemblyx86Tests/Testx86AssemblyInspectionEngine.TestSimplex86_64Augmented (610 of 1785)
PASS: lldb-unit :: Utility/./UtilityTests/StringExtractorTest.DecodeHexU8_InvalidHex2 (611 of 1785)
PASS: lldb-shell :: SymbolFile/DWARF/debug-types-line-tables.s (612 of 1785)
UNSUPPORTED: lldb-shell :: Process/Windows/exception_access_violation.cpp (613 of 1785)
PASS: lldb-api :: commands/expression/dont_allow_jit/TestAllowJIT.py (614 of 1785)
PASS: lldb-api :: commands/expression/char/TestExprsChar.py (615 of 1785)
PASS: lldb-unit :: Utility/./UtilityTests/StreamTeeTest.DefaultConstructor (616 of 1785)
PASS: lldb-unit :: Utility/./UtilityTests/LogChannelTest.Enable (617 of 1785)
PASS: lldb-api :: functionalities/breakpoint/breakpoint_ids/TestBreakpointIDs.py (618 of 1785)
PASS: lldb-shell :: SymbolFile/DWARF/find-method-local-struct.cpp (619 of 1785)
PASS: lldb-unit :: ScriptInterpreter/Python/./ScriptInterpreterPythonTests/PythonDataObjectsTest.TestInstanceNameResolutionNoDot (620 of 1785)
PASS: lldb-unit :: Expression/./ExpressionTests/CppModuleConfigurationTest.LinuxLocalLibCpp (621 of 1785)
PASS: lldb-unit :: UnwindAssembly/x86/./UnwindAssemblyx86Tests/Testx86AssemblyInspectionEngine.Testi386IgnoredRegisters (622 of 1785)
PASS: lldb-shell :: SymbolFile/NativePDB/function-types-calling-conv.cpp (623 of 1785)
PASS: lldb-unit :: Utility/./UtilityTests/UriParserTest.MinimalPort (624 of 1785)
PASS: lldb-api :: commands/expression/namespace_local_var_same_name_cpp_and_c/TestNamespaceLocalVarSameNameCppAndC.py (625 of 1785)
PASS: lldb-shell :: ObjectFile/ELF/base-address.yaml (626 of 1785)
PASS: lldb-shell :: BuildScript/modes.test (627 of 1785)
PASS: lldb-unit :: Utility/./UtilityTests/BinaryStreamTest.PutSLEB128FiveBytes (628 of 1785)
PASS: lldb-unit :: SymbolFile/NativePDB/./SymbolFileNativePDBTests/PDBFPOProgramToDWARFExpressionTests.InvalidOpBinary (629 of 1785)
PASS: lldb-api :: commands/expression/function_template_specialization_temp_args/TestFunctionTemplateSpecializationTempArgs.py (630 of 1785)
PASS: lldb-api :: python_api/frame/inlines/TestInlinedFrame.py (631 of 1785)
PASS: lldb-unit :: Utility/./UtilityTests/StringExtractorTest.GetHexU8_Exact_NoEof (632 of 1785)
PASS: lldb-unit :: Host/./HostTests/File.GetWaitableHandleFileno (633 of 1785)
PASS: lldb-unit :: ObjectFile/Breakpad/./ObjectFileBreakpadTests/StackWinRecord.parse (634 of 1785)
PASS: lldb-api :: python_api/value/linked_list/TestValueAPILinkedList.py (635 of 1785)
PASS: lldb-unit :: Utility/./UtilityTests/EventTest.DumpEventDataBytes (636 of 1785)
PASS: lldb-api :: functionalities/jitloader_gdb/TestJITLoaderGDB.py (637 of 1785)
PASS: lldb-unit :: Utility/./UtilityTests/StreamTest.PutBytesAsRawHex8ToMixedEndian (638 of 1785)
PASS: lldb-shell :: Register/x86-64-read.test (639 of 1785)
PASS: lldb-api :: functionalities/data-formatter/data-formatter-stl/libcxx/list/TestDataFormatterLibcxxList.py (640 of 1785)
PASS: lldb-unit :: Utility/./UtilityTests/StringListTest.SplitIntoLinesEmpty (641 of 1785)
PASS: lldb-unit :: SymbolFile/NativePDB/./SymbolFileNativePDBTests/PDBFPOProgramToDWARFExpressionTests.UnresolvedRegisterReference (642 of 1785)
PASS: lldb-api :: functionalities/dynamic_value_child_count/TestDynamicValueChildCount.py (643 of 1785)
PASS: lldb-unit :: Utility/./UtilityTests/StreamTeeTest.SetStreamAtIndexOutOfBounds (644 of 1785)
PASS: lldb-api :: lang/objc/single-entry-dictionary/TestObjCSingleEntryDictionary.py (645 of 1785)
PASS: lldb-api :: functionalities/gdb_remote_client/TestPlatformClient.py (646 of 1785)
PASS: lldb-unit :: Symbol/./SymbolTests/TestClangASTContext.TemplateArguments (647 of 1785)
PASS: lldb-unit :: ObjectFile/Breakpad/./ObjectFileBreakpadTests/FileRecord.parse (648 of 1785)
PASS: lldb-api :: commands/command/invalid-args/TestInvalidArgsCommand.py (649 of 1785)
PASS: lldb-unit :: Utility/./UtilityTests/UriParserTest.Empty (650 of 1785)
UNSUPPORTED: lldb-api :: functionalities/thread/state/TestThreadStates.py (651 of 1785)
PASS: lldb-api :: lang/objc/ptr_refs/TestPtrRefsObjC.py (652 of 1785)
PASS: lldb-unit :: Utility/./UtilityTests/RangeTest.ContainsRange (653 of 1785)
PASS: lldb-api :: types/TestFloatTypesExpr.py (654 of 1785)
UNSUPPORTED: lldb-api :: python_api/event/TestEvents.py (655 of 1785)
UNSUPPORTED: lldb-api :: functionalities/data-formatter/data-formatter-stl/libstdcpp/iterator/TestDataFormatterStdIterator.py (656 of 1785)
PASS: lldb-unit :: UnwindAssembly/x86/./UnwindAssemblyx86Tests/Testx86AssemblyInspectionEngine.TestSpillRegToStackViaMOVx86_64 (657 of 1785)
PASS: lldb-unit :: Utility/./UtilityTests/VASprintfTest.NoBufferResize (658 of 1785)
PASS: lldb-unit :: Utility/./UtilityTests/OptionsWithRawTest.QuotedSuffix (659 of 1785)
PASS: lldb-api :: functionalities/thread/concurrent_events/TestConcurrentSignalBreak.py (660 of 1785)
PASS: lldb-api :: commands/expression/cast_int_to_anonymous_enum/TestCastIntToAnonymousEnum.py (661 of 1785)
UNSUPPORTED: lldb-api :: api/multiple-debuggers/TestMultipleDebuggers.py (662 of 1785)
PASS: lldb-unit :: Utility/./UtilityTests/StringExtractorTest.GetHexU8_Underflow_NoEof (663 of 1785)
PASS: lldb-shell :: Settings/TestFrameFormatColor.test (664 of 1785)
PASS: lldb-unit :: Utility/./UtilityTests/StringListTest.AppendList (665 of 1785)
PASS: lldb-unit :: Process/gdb-remote/./ProcessGdbRemoteTests/GDBRemoteCommunicationServerTest.SendErrorResponse_ErrorNumber (666 of 1785)
PASS: lldb-unit :: Utility/./UtilityTests/ProcessInstanceInfo.DumpTable (667 of 1785)
PASS: lldb-api :: functionalities/data-formatter/data-formatter-globals/TestDataFormatterGlobals.py (668 of 1785)
PASS: lldb-api :: lang/c/unions/TestUnionMembers.py (669 of 1785)
PASS: lldb-unit :: Utility/./UtilityTests/VMRange.Clear (670 of 1785)
PASS: lldb-api :: functionalities/thread/backtrace_limit/TestBacktraceLimit.py (671 of 1785)
PASS: lldb-api :: functionalities/thread/concurrent_events/TestConcurrentSignalNWatchNBreak.py (672 of 1785)
PASS: lldb-api :: commands/expression/persistent_types/TestNestedPersistentTypes.py (673 of 1785)
PASS: lldb-shell :: ObjectFile/MachO/lc_version_min.yaml (674 of 1785)
PASS: lldb-unit :: Utility/./UtilityTests/StreamTest.PutRawBytesToLittleEndian (675 of 1785)
PASS: lldb-unit :: Interpreter/./InterpreterTests/CompletionTest.DirCompletionUsername (676 of 1785)
PASS: lldb-api :: functionalities/breakpoint/serialize/TestBreakpointSerialization.py (677 of 1785)
PASS: lldb-api :: python_api/value_var_update/TestValueVarUpdate.py (678 of 1785)
PASS: lldb-unit :: ObjectFile/ELF/./ObjectFileELFTests/ObjectFileELFTest.GetSymtab_NoSymEntryPointArmAddressClass (679 of 1785)
PASS: lldb-api :: functionalities/process_group/TestChangeProcessGroup.py (680 of 1785)
PASS: lldb-unit :: Utility/./UtilityTests/BinaryStreamTest.PutSLEB128EightBytes (681 of 1785)
PASS: lldb-api :: lang/objc/conflicting-definition/TestConflictingDefinition.py (682 of 1785)
PASS: lldb-api :: functionalities/data-formatter/data-formatter-named-summaries/TestDataFormatterNamedSummaries.py (683 of 1785)
PASS: lldb-unit :: Language/Highlighting/./HighlighterTests/HighlighterTest.DefaultHighlighter (684 of 1785)
PASS: lldb-shell :: SymbolFile/DWARF/debug_rnglists.s (685 of 1785)
PASS: lldb-unit :: Utility/./UtilityTests/RangeTest.Slide (686 of 1785)
PASS: lldb-api :: tools/lldb-server/inferior-crash/TestGdbRemoteAbort.py (687 of 1785)
PASS: lldb-api :: functionalities/gdb_remote_client/TestNestedRegDefinitions.py (688 of 1785)
PASS: lldb-shell :: SymbolFile/DWARF/dwarf5-index-is-used.cpp (689 of 1785)
PASS: lldb-unit :: Symbol/./SymbolTests/DWARFCallFrameInfoTest.Basic_dwarf4 (690 of 1785)
PASS: lldb-shell :: SymbolFile/DWARF/split-dwarf-multiple-cu.ll (691 of 1785)
PASS: lldb-unit :: Utility/./UtilityTests/AnsiTerminal.Basic (692 of 1785)
PASS: lldb-shell :: SymbolFile/DWARF/debug-types-missing-signature.test (693 of 1785)
PASS: lldb-api :: functionalities/postmortem/wow64_minidump/TestWow64MiniDump.py (694 of 1785)
PASS: lldb-unit :: Interpreter/./InterpreterTests/OptionArgParserTest.toBoolean (695 of 1785)
PASS: lldb-shell :: SymbolFile/NativePDB/ast-functions.cpp (696 of 1785)
PASS: lldb-api :: functionalities/data-formatter/data-formatter-proper-plurals/TestFormattersOneIsSingular.py (697 of 1785)
UNSUPPORTED: lldb-shell :: Unwind/unwind-plan-dwarf-dump.test (698 of 1785)
PASS: lldb-unit :: UnwindAssembly/x86/./UnwindAssemblyx86Tests/Testx86AssemblyInspectionEngine.TestPushRBP (699 of 1785)
UNSUPPORTED: lldb-shell :: Register/x86-ymm-write.test (700 of 1785)
UNSUPPORTED: lldb-api :: benchmarks/startup/TestStartupDelays.py (701 of 1785)
PASS: lldb-unit :: Utility/./UtilityTests/Flags.Reset (702 of 1785)
PASS: lldb-api :: commands/watchpoints/watchpoint_commands/TestWatchpointCommands.py (703 of 1785)
PASS: lldb-api :: functionalities/inferior-crashing/recursive-inferior/TestRecursiveInferiorStep.py (704 of 1785)
UNSUPPORTED: lldb-api :: functionalities/data-formatter/data-formatter-stl/libstdcpp/list/TestDataFormatterStdList.py (705 of 1785)
PASS: lldb-unit :: Utility/./UtilityTests/StreamTest.PutCString (706 of 1785)
PASS: lldb-unit :: ObjectFile/Breakpad/./ObjectFileBreakpadTests/ModuleRecord.parse (707 of 1785)
PASS: lldb-unit :: Utility/./UtilityTests/VMRange.CollectionContains (708 of 1785)
PASS: lldb-unit :: Utility/./UtilityTests/DataExtractorTest.GetMaxS64 (709 of 1785)
PASS: lldb-unit :: Symbol/./SymbolTests/TestClangASTContext.TestIsClangType (710 of 1785)
UNSUPPORTED: lldb-api :: functionalities/darwin_log/source/info/TestDarwinLogSourceInfo.py (711 of 1785)
UNSUPPORTED: lldb-shell :: Register/x86-64-ymm16-write.test (712 of 1785)
PASS: lldb-unit :: ScriptInterpreter/Python/./ScriptInterpreterPythonTests/PythonDataObjectsTest.TestPythonCallableCheck (713 of 1785)
PASS: lldb-unit :: SymbolFile/DWARF/./SymbolFileDWARFTests/SymbolFileDWARFTests.TestAbbrevOrder1Start5 (714 of 1785)
PASS: lldb-api :: commands/expression/inline-namespace/TestInlineNamespace.py (715 of 1785)
PASS: lldb-unit :: Process/gdb-remote/./ProcessGdbRemoteTests/GDBRemoteCommunicationClientTest.GetMemoryRegionInfoInvalidResponse (716 of 1785)
PASS: lldb-unit :: Host/./HostTests/SocketAddressTest.Set (717 of 1785)
PASS: lldb-unit :: SymbolFile/NativePDB/./SymbolFileNativePDBTests/PDBFPOProgramToDWARFExpressionTests.InvalidAssignmentMultiple (718 of 1785)
PASS: lldb-api :: commands/frame/diagnose/bad-reference/TestBadReference.py (719 of 1785)
PASS: lldb-unit :: Host/./HostTests/NativeProcessProtocolTest.SetBreakpointFailWrite (720 of 1785)
UNSUPPORTED: lldb-api :: commands/expression/completion-crash1/TestCompletionCrash1.py (721 of 1785)
PASS: lldb-api :: functionalities/tsan/global_location/TestTsanGlobalLocation.py (722 of 1785)
PASS: lldb-api :: lang/cpp/symbols/TestSymbols.py (723 of 1785)
PASS: lldb-unit :: ScriptInterpreter/Python/./ScriptInterpreterPythonTests/PythonExceptionStateTest.TestResetSemantics (724 of 1785)
PASS: lldb-shell :: Commands/command-regex-unalias.test (725 of 1785)
PASS: lldb-api :: functionalities/gdb_remote_client/TestRecognizeBreakpoint.py (726 of 1785)
PASS: lldb-api :: lang/cpp/class_types/TestClassTypesDisassembly.py (727 of 1785)
PASS: lldb-shell :: SymbolFile/DWARF/find-variable-dwo.cpp (728 of 1785)
PASS: lldb-api :: lang/objc/objc-dyn-sbtype/TestObjCDynamicSBType.py (729 of 1785)
PASS: lldb-api :: lang/cpp/lambdas/TestLambdas.py (730 of 1785)
PASS: lldb-api :: functionalities/memory/read/TestMemoryRead.py (731 of 1785)
PASS: lldb-api :: functionalities/thread/concurrent_events/TestConcurrentTwoBreakpointsOneWatchpoint.py (732 of 1785)
PASS: lldb-unit :: Utility/./UtilityTests/StreamTest.PutHex32ByteOrderBig (733 of 1785)
PASS: lldb-unit :: Utility/./UtilityTests/StringExtractorTest.GetU64BigEndian (734 of 1785)
PASS: lldb-api :: tools/lldb-server/TestGdbRemoteExpeditedRegisters.py (735 of 1785)
PASS: lldb-api :: python_api/debugger/TestDebuggerAPI.py (736 of 1785)
PASS: lldb-unit :: Utility/./UtilityTests/StringListTest.JoinMultiCharSeparator (737 of 1785)
PASS: lldb-api :: commands/frame/recognizer/TestFrameRecognizer.py (738 of 1785)
PASS: lldb-api :: functionalities/data-formatter/vector-types/TestVectorTypesFormatting.py (739 of 1785)
PASS: lldb-shell :: SymbolFile/DWARF/debug-types-address-ranges.s (740 of 1785)
PASS: lldb-unit :: ObjectFile/PECOFF/./ObjectFilePECOFFTests/PECallFrameInfoTest.Frame_reg_eh (741 of 1785)
PASS: lldb-api :: lang/mixed/TestMixedLanguages.py (742 of 1785)
PASS: lldb-api :: lang/cpp/diamond/TestDiamond.py (743 of 1785)
PASS: lldb-api :: lang/objc/forward-decl/TestForwardDecl.py (744 of 1785)
PASS: lldb-shell :: SymbolFile/DWARF/dir-separator-no-comp-dir.s (745 of 1785)
PASS: lldb-shell :: SymbolFile/DWARF/debug-types-dwo-cross-reference.cpp (746 of 1785)
UNSUPPORTED: lldb-api :: tools/lldb-vscode/breakpoint/TestVSCode_setBreakpoints.py (747 of 1785)
PASS: lldb-unit :: Utility/./UtilityTests/ListenerTest.GetEventImmediate (748 of 1785)
PASS: lldb-api :: commands/watchpoints/hello_watchpoint/TestMyFirstWatchpoint.py (749 of 1785)
PASS: lldb-unit :: Utility/./UtilityTests/RegularExpression.Empty (750 of 1785)
PASS: lldb-unit :: Process/gdb-remote/./ProcessGdbRemoteTests/GDBRemoteCommunicationClientTest.TestPacketSpeedJSON (751 of 1785)
PASS: lldb-unit :: Utility/./UtilityTests/DataExtractorTest.GetBitfield (752 of 1785)
UNSUPPORTED: lldb-api :: linux/add-symbols/TestTargetSymbolsAddCommand.py (753 of 1785)
PASS: lldb-unit :: Expression/./ExpressionTests/CppModuleConfigurationTest.Linux (754 of 1785)
PASS: lldb-api :: python_api/sblaunchinfo/TestSBLaunchInfo.py (755 of 1785)
PASS: lldb-api :: commands/expression/persistent_types/TestPersistentTypes.py (756 of 1785)
PASS: lldb-unit :: Utility/./UtilityTests/OptionsWithRawTest.SingleWhitespaceInput (757 of 1785)
PASS: lldb-unit :: Utility/./UtilityTests/Predicate.WaitForValueEqualTo (758 of 1785)
PASS: lldb-api :: functionalities/data-formatter/format-propagation/TestFormatPropagation.py (759 of 1785)
PASS: lldb-api :: functionalities/data-formatter/type_summary_list_arg/TestTypeSummaryListArg.py (760 of 1785)
PASS: lldb-unit :: Utility/./UtilityTests/ProcessInfoTest.Constructor (761 of 1785)
PASS: lldb-unit :: Host/./HostTests/NativeProcessProtocolTest.ReadCStringFromMemory_MaxSize (762 of 1785)
PASS: lldb-unit :: Utility/./UtilityTests/FileSpecTest.IsRelative (763 of 1785)
UNSUPPORTED: lldb-shell :: Breakpoint/ppc64-localentry.test (764 of 1785)
PASS: lldb-api :: commands/expression/call-throws/TestCallThatThrows.py (765 of 1785)
PASS: lldb-unit :: Utility/./UtilityTests/VMRange.ContainsRange (766 of 1785)
PASS: lldb-unit :: Process/gdb-remote/./ProcessGdbRemoteTests/GDBRemoteCommunicationServerTest.SendErrorResponse_UnimplementedError (767 of 1785)
UNSUPPORTED: lldb-api :: functionalities/darwin_log/filter/exact_match/category/TestDarwinLogFilterMatchCategory.py (768 of 1785)
PASS: lldb-unit :: Utility/./UtilityTests/ScalarTest.ExtractBitfield (769 of 1785)
PASS: lldb-api :: commands/watchpoints/step_over_watchpoint/TestStepOverWatchpoint.py (770 of 1785)
PASS: lldb-api :: functionalities/data-formatter/parray/TestPrintArray.py (771 of 1785)
PASS: lldb-api :: functionalities/object-file/TestImageListMultiArchitecture.py (772 of 1785)
PASS: lldb-api :: lang/cpp/member-and-local-vars-with-same-name/TestMembersAndLocalsWithSameName.py (773 of 1785)
PASS: lldb-unit :: Process/gdb-remote/./ProcessGdbRemoteTests/GDBRemoteClientBaseTest.SendContinueAndWait (774 of 1785)
PASS: lldb-unit :: ScriptInterpreter/Python/./ScriptInterpreterPythonTests/PythonDataObjectsTest.TestPythonByteArray (775 of 1785)
PASS: lldb-shell :: SymbolFile/NativePDB/global-classes.cpp (776 of 1785)
PASS: lldb-unit :: Utility/./UtilityTests/EnvironmentTest.EnvpConversion (777 of 1785)
PASS: lldb-unit :: Process/minidump/./LLDBMinidumpTests/MinidumpParserTest.GetLinuxProcStatus (778 of 1785)
PASS: lldb-unit :: Utility/./UtilityTests/StringListTest.LongestCommonPrefixNoPrefix (779 of 1785)
PASS: lldb-shell :: SymbolFile/NativePDB/break-by-function.cpp (780 of 1785)
PASS: lldb-api :: types/TestDoubleTypesExpr.py (781 of 1785)
PASS: lldb-unit :: Utility/./UtilityTests/RangeTest.EqualInvalid (782 of 1785)
PASS: lldb-api :: lang/objcxx/cxx-bridged-po/TestObjCXXBridgedPO.py (783 of 1785)
PASS: lldb-unit :: Utility/./UtilityTests/StreamTest.PutMaxHex64ByteOrderLittle (784 of 1785)
PASS: lldb-unit :: Utility/./UtilityTests/StringExtractorTest.GetNameColonValueNoSemicolon (785 of 1785)
PASS: lldb-unit :: UnwindAssembly/x86/./UnwindAssemblyx86Tests/Testx86AssemblyInspectionEngine.TestPushR13 (786 of 1785)
PASS: lldb-api :: lang/objc/foundation/TestRuntimeTypes.py (787 of 1785)
PASS: lldb-api :: python_api/objc_type/TestObjCType.py (788 of 1785)
PASS: lldb-shell :: Python/crashlog.test (789 of 1785)
PASS: lldb-unit :: Process/gdb-remote/./ProcessGdbRemoteTests/GDBRemoteCommunicationClientTest.SendGetTraceConfigPacket (790 of 1785)
PASS: lldb-api :: python_api/function_symbol/TestSymbolAPI.py (791 of 1785)
PASS: lldb-unit :: Language/Highlighting/./HighlighterTests/HighlighterTest.ClangComments (792 of 1785)
PASS: lldb-api :: functionalities/data-formatter/data-formatter-stl/libstdcpp/unique_ptr/invalid/TestDataFormatterInvalidStdUniquePtr.py (793 of 1785)
PASS: lldb-api :: lang/cpp/dynamic-value/TestDynamicValue.py (794 of 1785)
PASS: lldb-api :: commands/frame/var-scope/TestFrameVariableScope.py (795 of 1785)
PASS: lldb-api :: functionalities/source-map/TestTargetSourceMap.py (796 of 1785)
PASS: lldb-unit :: Utility/./UtilityTests/ArgsTest.TestInsertArg (797 of 1785)
PASS: lldb-unit :: Utility/./UtilityTests/StreamTest.PutChar (798 of 1785)
PASS: lldb-api :: functionalities/thread/concurrent_events/TestConcurrentTwoBreakpointsOneSignal.py (799 of 1785)
PASS: lldb-api :: commands/process/launch/TestProcessLaunch.py (800 of 1785)
PASS: lldb-unit :: Utility/./UtilityTests/Flags.AnySet (801 of 1785)
PASS: lldb-api :: functionalities/memory-region/TestMemoryRegion.py (802 of 1785)
PASS: lldb-api :: functionalities/float-display/TestFloatDisplay.py (803 of 1785)
PASS: lldb-api :: lang/c/unicode/TestUnicodeSymbols.py (804 of 1785)
PASS: lldb-api :: functionalities/step_scripted/TestStepScripted.py (805 of 1785)
PASS: lldb-unit :: Utility/./UtilityTests/BroadcasterTest.BroadcastEvent (806 of 1785)
PASS: lldb-api :: functionalities/thread/exit_during_step/TestExitDuringStep.py (807 of 1785)
PASS: lldb-unit :: ScriptInterpreter/Python/./ScriptInterpreterPythonTests/PythonDataObjectsTest.TestExtractingUInt64ThroughStructuredData (808 of 1785)
PASS: lldb-unit :: Utility/./UtilityTests/StringListTest.Join (809 of 1785)
PASS: lldb-shell :: ObjectFile/PECOFF/basic-info-arm64.yaml (810 of 1785)
PASS: lldb-api :: functionalities/abbreviation/TestCommonShortSpellings.py (811 of 1785)
PASS: lldb-unit :: Utility/./UtilityTests/StringLexerTest.Peek (812 of 1785)
PASS: lldb-api :: functionalities/breakpoint/breakpoint_ignore_count/TestBreakpointIgnoreCount.py (813 of 1785)
PASS: lldb-unit :: Utility/./UtilityTests/NameMatchesTest.StartsWith (814 of 1785)
PASS: lldb-api :: functionalities/data-formatter/data-formatter-enum-format/TestDataFormatterEnumFormat.py (815 of 1785)
UNSUPPORTED: lldb-api :: tools/lldb-vscode/attach/TestVSCode_attach.py (816 of 1785)
PASS: lldb-unit :: Symbol/./SymbolTests/TestClangASTContext.TestRecordHasFields (817 of 1785)
PASS: lldb-api :: functionalities/modern-type-lookup/basic-objc/TestBasicObjcModernTypeLookup.py (818 of 1785)
PASS: lldb-api :: functionalities/tsan/multiple/TestTsanMultiple.py (819 of 1785)
PASS: lldb-unit :: UnwindAssembly/x86/./UnwindAssemblyx86Tests/Testx86AssemblyInspectionEngine.TestSpillRegToStackViaMOVi386 (820 of 1785)
PASS: lldb-unit :: Process/minidump/./LLDBMinidumpTests/MinidumpParserTest.GetMemoryRegionInfoFromMemory64List (821 of 1785)
PASS: lldb-unit :: Process/gdb-remote/./ProcessGdbRemoteTests/GDBRemoteCommunicationClientTest.SendGetDataPacket (822 of 1785)
PASS: lldb-api :: commands/expression/import-std-module/stack/TestStack.py (823 of 1785)
PASS: lldb-api :: functionalities/breakpoint/breakpoint_locations/TestBreakpointLocations.py (824 of 1785)
PASS: lldb-api :: commands/expression/unwind_expression/TestUnwindExpression.py (825 of 1785)
PASS: lldb-api :: lang/c/forward/TestForwardDeclaration.py (826 of 1785)
PASS: lldb-unit :: Utility/./UtilityTests/StringExtractorTest.GetHexBytesAvail_FullString (827 of 1785)
PASS: lldb-unit :: Symbol/./SymbolTests/TestClangASTContext.TestGetBasicTypeFromEnum (828 of 1785)
PASS: lldb-api :: lang/cpp/offsetof/TestOffsetofCpp.py (829 of 1785)
PASS: lldb-unit :: Utility/./UtilityTests/ArgsTest.EscapeLLDBCommandArgument (830 of 1785)
PASS: lldb-api :: python_api/module_section/TestModuleAndSection.py (831 of 1785)
PASS: lldb-api :: macosx/version_zero/TestGetVersionZeroVersion.py (832 of 1785)
PASS: lldb-unit :: Utility/./UtilityTests/StreamTest.ShiftOperatorChars (833 of 1785)
PASS: lldb-unit :: Target/./TargetTests/ExecutionContextTest.GetByteOrderProcess (834 of 1785)
PASS: lldb-unit :: Utility/./UtilityTests/StringLexerTest.AdvanceIf (835 of 1785)
PASS: lldb-api :: functionalities/data-formatter/data-formatter-stl/libcxx/vbool/TestDataFormatterLibcxxVBool.py (836 of 1785)
PASS: lldb-unit :: Utility/./UtilityTests/RangeTest.ClearWithStarAddress (837 of 1785)
PASS: lldb-unit :: Utility/./UtilityTests/DataExtractorTest.GetMaxU64_unchecked (838 of 1785)
PASS: lldb-unit :: Process/minidump/./LLDBMinidumpTests/MinidumpParserTest.InvalidMinidump (839 of 1785)
PASS: lldb-unit :: Host/./HostTests/FileSystemTest.GetPermissions (840 of 1785)
PASS: lldb-unit :: Language/Highlighting/./HighlighterTests/HighlighterTest.ClangStringLiterals (841 of 1785)
PASS: lldb-unit :: Utility/./UtilityTests/StringListTest.ShiftMove (842 of 1785)
PASS: lldb-unit :: Utility/./UtilityTests/ScalarTest.GetValue (843 of 1785)
PASS: lldb-api :: commands/frame/diagnose/complicated-expression/TestComplicatedExpression.py (844 of 1785)
PASS: lldb-unit :: Utility/./UtilityTests/OptionsWithRawTest.LeadingSpaceArgs (845 of 1785)
PASS: lldb-api :: commands/expression/persistent_variables/TestPersistentVariables.py (846 of 1785)
PASS: lldb-api :: functionalities/gdb_remote_client/TestRestartBug.py (847 of 1785)
PASS: lldb-unit :: Utility/./UtilityTests/StringListTest.CopyListSingle (848 of 1785)
PASS: lldb-api :: commands/expression/import-std-module/unique_ptr-dbg-info-content/TestUniquePtrDbgInfoContent.py (849 of 1785)
PASS: lldb-unit :: Utility/./UtilityTests/FileSpecTest.FormatFileSpec (850 of 1785)
PASS: lldb-api :: commands/watchpoints/watchpoint_commands/condition/TestWatchpointConditionCmd.py (851 of 1785)
PASS: lldb-shell :: Reproducer/TestReuseDirectory.test (852 of 1785)
PASS: lldb-api :: lang/objc/foundation/TestSymbolTable.py (853 of 1785)
PASS: lldb-unit :: Utility/./UtilityTests/ArchSpecTest.TripleComponentsWereSpecified (854 of 1785)
PASS: lldb-unit :: Utility/./UtilityTests/OptionsWithRawTest.TerminatedQuote (855 of 1785)
PASS: lldb-unit :: UnwindAssembly/x86/./UnwindAssemblyx86Tests/Testx86AssemblyInspectionEngine.TestPopR13 (856 of 1785)
PASS: lldb-unit :: Expression/./ExpressionTests/CppModuleConfigurationTest.IgnoreLibStdCpp (857 of 1785)
PASS: lldb-api :: commands/expression/import-std-module/vector-of-vectors/TestVectorOfVectors.py (858 of 1785)
UNSUPPORTED: lldb-api :: lang/objc/objc-dynamic-value/TestObjCDynamicValue.py (859 of 1785)
PASS: lldb-unit :: Utility/./UtilityTests/CompletionRequest.DuplicateFiltering (860 of 1785)
PASS: lldb-api :: commands/reproducer/invalid-args/TestInvalidArgsReproducer.py (861 of 1785)
PASS: lldb-api :: lang/c/array_types/TestArrayTypes.py (862 of 1785)
UNSUPPORTED: lldb-shell :: Register/x86-zmm-write.test (863 of 1785)
PASS: lldb-shell :: Breakpoint/case-sensitive.test (864 of 1785)
PASS: lldb-unit :: Utility/./UtilityTests/SerializationRountripTest.SerializeDeserializePod (865 of 1785)
PASS: lldb-api :: functionalities/postmortem/elf-core/gcore/TestGCore.py (866 of 1785)
PASS: lldb-unit :: Utility/./UtilityTests/NameMatchesTest.EndsWith (867 of 1785)
PASS: lldb-api :: lang/c/strings/TestCStrings.py (868 of 1785)
PASS: lldb-api :: commands/expression/persist_objc_pointeetype/TestPersistObjCPointeeType.py (869 of 1785)
PASS: lldb-api :: tools/lldb-server/TestGdbRemoteHostInfo.py (870 of 1785)
PASS: lldb-api :: functionalities/inferior-crashing/recursive-inferior/TestRecursiveInferior.py (871 of 1785)
PASS: lldb-unit :: Utility/./UtilityTests/StringListTest.JoinEmpty (872 of 1785)
PASS: lldb-shell :: SymbolFile/NativePDB/nested-types.cpp (873 of 1785)
PASS: lldb-unit :: Utility/./UtilityTests/ScalarTest.Division (874 of 1785)
PASS: lldb-api :: api/listeners/TestListener.py (875 of 1785)
UNSUPPORTED: lldb-api :: iohandler/completion/TestIOHandlerCompletion.py (876 of 1785)
PASS: lldb-api :: lang/cpp/overloaded-functions/TestOverloadedFunctions.py (877 of 1785)
PASS: lldb-api :: functionalities/data-formatter/data-formatter-smart-array/TestDataFormatterSmartArray.py (878 of 1785)
PASS: lldb-unit :: Utility/./UtilityTests/StructuredDataTest.StringDump (879 of 1785)
UNSUPPORTED: lldb-api :: functionalities/thread/create_during_step/TestCreateDuringStep.py (880 of 1785)
PASS: lldb-unit :: Utility/./UtilityTests/BinaryStreamTest.PutULEB128Zero (881 of 1785)
PASS: lldb-unit :: Symbol/./SymbolTests/DWARFCallFrameInfoTest.Basic_dwarf3 (882 of 1785)
PASS: lldb-unit :: ScriptInterpreter/Python/./ScriptInterpreterPythonTests/PythonDataObjectsTest.TestPythonIntegerToStructuredInteger (883 of 1785)
PASS: lldb-shell :: Driver/TestCommands.test (884 of 1785)
PASS: lldb-unit :: Utility/./UtilityTests/RangeTest.DefaultConstructor (885 of 1785)
PASS: lldb-unit :: Utility/./UtilityTests/StructuredDataTest.ParseJSONFromFile (886 of 1785)
PASS: lldb-api :: commands/process/attach/TestProcessAttach.py (887 of 1785)
PASS: lldb-unit :: Utility/./UtilityTests/LogChannelTest.EnableOptions (888 of 1785)
PASS: lldb-unit :: SymbolFile/NativePDB/./SymbolFileNativePDBTests/PDBFPOProgramToDWARFExpressionTests.UnsupportedRASearch (889 of 1785)
PASS: lldb-unit :: Process/gdb-remote/./ProcessGdbRemoteTests/GDBRemoteCommunicationClientTest.SendStartTracePacket (890 of 1785)
PASS: lldb-unit :: Utility/./UtilityTests/TimeoutTest.Construction (891 of 1785)
PASS: lldb-unit :: Host/./HostTests/FileActionTest.Open (892 of 1785)
PASS: lldb-api :: python_api/watchpoint/TestWatchpointIgnoreCount.py (893 of 1785)
PASS: lldb-unit :: Utility/./UtilityTests/ArchSpecTest.MergeFrom (894 of 1785)
PASS: lldb-api :: functionalities/breakpoint/breakpoint_set_restart/TestBreakpointSetRestart.py (895 of 1785)
PASS: lldb-shell :: Commands/command-script-import.test (896 of 1785)
PASS: lldb-api :: functionalities/thread/concurrent_events/TestConcurrentSignalDelayWatch.py (897 of 1785)
PASS: lldb-api :: functionalities/breakpoint/source_regexp/TestSourceRegexBreakpoints.py (898 of 1785)
PASS: lldb-api :: lang/objcxx/hide-runtime-values/TestObjCXXHideRuntimeValues.py (899 of 1785)
PASS: lldb-unit :: Utility/./UtilityTests/TimeoutTest.Format (900 of 1785)
PASS: lldb-api :: api/log/TestAPILog.py (901 of 1785)
UNSUPPORTED: lldb-api :: functionalities/data-formatter/data-formatter-stl/libstdcpp/vector/TestDataFormatterStdVector.py (902 of 1785)
PASS: lldb-unit :: Utility/./UtilityTests/StreamTest.PutBytesAsRawHex8ToLittleEndian (903 of 1785)
PASS: lldb-unit :: ObjectFile/Breakpad/./ObjectFileBreakpadTests/Record.classify (904 of 1785)
PASS: lldb-unit :: ScriptInterpreter/Python/./ScriptInterpreterPythonTests/PythonExceptionStateTest.TestAutoRestoreSemantics (905 of 1785)
PASS: lldb-api :: functionalities/thread/concurrent_events/TestConcurrentSignalWatchBreak.py (906 of 1785)
PASS: lldb-unit :: ScriptInterpreter/Python/./ScriptInterpreterPythonTests/PythonDataObjectsTest.TestPythonTupleToStructuredList (907 of 1785)
PASS: lldb-unit :: Utility/./UtilityTests/StreamTest.PutCharWhitespace (908 of 1785)
PASS: lldb-unit :: Utility/./UtilityTests/LogChannelEnabledTest.log_options (909 of 1785)
PASS: lldb-api :: commands/frame/select/TestFrameSelect.py (910 of 1785)
PASS: lldb-unit :: Utility/./UtilityTests/Flags.IsClear (911 of 1785)
PASS: lldb-api :: lang/objc/objc-runtime-ivars/TestRuntimeIvars.py (912 of 1785)
UNSUPPORTED: lldb-api :: commands/watchpoints/multi_watchpoint_slots/TestWatchpointMultipleSlots.py (913 of 1785)
PASS: lldb-shell :: Heap/heap-cstr.test (914 of 1785)
PASS: lldb-unit :: Utility/./UtilityTests/ScalarTest.Promotion (915 of 1785)
PASS: lldb-unit :: UnwindAssembly/x86/./UnwindAssemblyx86Tests/Testx86AssemblyInspectionEngine.TestPopR15 (916 of 1785)
PASS: lldb-api :: tools/lldb-server/TestGdbRemoteAttach.py (917 of 1785)
PASS: lldb-api :: commands/expression/import-std-module/shared_ptr/TestSharedPtr.py (918 of 1785)
PASS: lldb-api :: lang/cpp/exceptions/TestCPPExceptionBreakpoints.py (919 of 1785)
PASS: lldb-unit :: Utility/./UtilityTests/ProcessInstanceInfo.Dump (920 of 1785)
UNSUPPORTED: lldb-api :: functionalities/thread/concurrent_events/TestConcurrentManySignals.py (921 of 1785)
PASS: lldb-api :: commands/expression/import-std-module/basic/TestImportStdModule.py (922 of 1785)
PASS: lldb-shell :: ObjectFile/Breakpad/sections.test (923 of 1785)
PASS: lldb-api :: functionalities/tail_call_frames/disambiguate_tail_call_seq/TestDisambiguateTailCallSeq.py (924 of 1785)
PASS: lldb-api :: commands/expression/radar_9531204/TestPrintfAfterUp.py (925 of 1785)
PASS: lldb-unit :: SymbolFile/NativePDB/./SymbolFileNativePDBTests/PDBFPOProgramToDWARFExpressionTests.MissingTargetRegister (926 of 1785)
PASS: lldb-api :: commands/frame/diagnose/dereference-function-return/TestDiagnoseDereferenceFunctionReturn.py (927 of 1785)
PASS: lldb-api :: functionalities/memory/find/TestMemoryFind.py (928 of 1785)
UNSUPPORTED: lldb-api :: functionalities/data-formatter/data-formatter-stl/libstdcpp/unique_ptr/TestDataFormatterStdUniquePtr.py (929 of 1785)
PASS: lldb-unit :: Utility/./UtilityTests/StreamTest.PutHex8 (930 of 1785)
PASS: lldb-unit :: Host/./HostTests/MainLoopTest.ReadObject (931 of 1785)
PASS: lldb-api :: lang/cpp/type_lookup/TestCppTypeLookup.py (932 of 1785)
PASS: lldb-api :: tools/lldb-server/commandline/TestStubSetSID.py (933 of 1785)
PASS: lldb-api :: lang/cpp/frame-var-anon-unions/TestFrameVariableAnonymousUnions.py (934 of 1785)
PASS: lldb-api :: functionalities/data-formatter/compactvectors/TestCompactVectors.py (935 of 1785)
PASS: lldb-shell :: SymbolFile/DWARF/find-variable-file.cpp (936 of 1785)
PASS: lldb-unit :: Process/gdb-remote/./ProcessGdbRemoteTests/GDBRemoteCommunicationClientTest.SendSignalsToIgnore (937 of 1785)
PASS: lldb-unit :: tools/lldb-server/tests/./LLDBServerTests/TestBase.LaunchModePreservesEnvironment (938 of 1785)
PASS: lldb-unit :: Utility/./UtilityTests/StringExtractorTest.GetU64LittleEndian (939 of 1785)
PASS: lldb-unit :: Utility/./UtilityTests/BinaryStreamTest.PutSLEB128MaxValue (940 of 1785)
PASS: lldb-unit :: Utility/./UtilityTests/RangeTest.NotEqualInvalid (941 of 1785)
PASS: lldb-unit :: Utility/./UtilityTests/BinaryStreamTest.PutSLEB128ThreeBytes (942 of 1785)
PASS: lldb-api :: functionalities/gdb_remote_client/TestGDBRemoteLoad.py (943 of 1785)
PASS: lldb-api :: macosx/duplicate-archive-members/TestDuplicateMembers.py (944 of 1785)
PASS: lldb-unit :: Utility/./UtilityTests/ScalarTest.Equality (945 of 1785)
PASS: lldb-unit :: Utility/./UtilityTests/FileSpecTest.EqualSeparator (946 of 1785)
PASS: lldb-unit :: Utility/./UtilityTests/StringExtractorTest.GetHexU8_Underflow (947 of 1785)
PASS: lldb-api :: functionalities/breakpoint/address_breakpoints/TestBadAddressBreakpoints.py (948 of 1785)
PASS: lldb-api :: functionalities/data-formatter/data-formatter-categories/TestDataFormatterCategories.py (949 of 1785)
PASS: lldb-unit :: Process/minidump/./LLDBMinidumpTests/MinidumpParserTest.GetExceptionStream (950 of 1785)
PASS: lldb-api :: functionalities/return-value/TestReturnValue.py (951 of 1785)
PASS: lldb-shell :: Driver/TestProcessAttach.test (952 of 1785)
PASS: lldb-unit :: Symbol/./SymbolTests/SymbolsTest.TerminateLocateExecutableSymbolFileForUnknownExecutableAndUnknownSymbolFile (953 of 1785)
PASS: lldb-api :: functionalities/tsan/thread_leak/TestTsanThreadLeak.py (954 of 1785)
PASS: lldb-unit :: Process/gdb-remote/./ProcessGdbRemoteTests/GDBRemoteCommunicationServerTest.SendErrorResponse_Status (955 of 1785)
PASS: lldb-api :: lang/c/offsetof/TestOffsetof.py (956 of 1785)
UNSUPPORTED: lldb-api :: benchmarks/frame_variable/TestFrameVariableResponse.py (957 of 1785)
PASS: lldb-unit :: Host/./HostTests/SocketTest.TCPListen0ConnectAccept (958 of 1785)
PASS: lldb-api :: functionalities/data-formatter/data-formatter-stl/libcxx/unordered/TestDataFormatterUnordered.py (959 of 1785)
PASS: lldb-unit :: Utility/./UtilityTests/StringExtractorTest.GetHexU8_Underflow2_NoEof (960 of 1785)
PASS: lldb-shell :: ObjectFile/ELF/minidebuginfo-corrupt-xz.yaml (961 of 1785)
PASS: lldb-api :: functionalities/modern-type-lookup/basic/TestBasicModernTypeLookup.py (962 of 1785)
PASS: lldb-api :: functionalities/gdb_remote_client/TestNoWatchpointSupportInfo.py (963 of 1785)
PASS: lldb-api :: functionalities/thread/concurrent_events/TestConcurrentTwoBreakpointsOneDelaySignal.py (964 of 1785)
PASS: lldb-api :: commands/expression/fixits/TestFixIts.py (965 of 1785)
PASS: lldb-unit :: ScriptInterpreter/Python/./ScriptInterpreterPythonTests/PythonDataObjectsTest.TestOwnedReferences (966 of 1785)
PASS: lldb-unit :: Host/./HostTests/ConnectionFileDescriptorTest.TCPGetURIv6 (967 of 1785)
PASS: lldb-api :: functionalities/dead-strip/TestDeadStrip.py (968 of 1785)
PASS: lldb-shell :: ObjectFile/Breakpad/sections-trailing-func.test (969 of 1785)
PASS: lldb-api :: commands/expression/two-files/TestObjCTypeQueryFromOtherCompileUnit.py (970 of 1785)
PASS: lldb-unit :: Utility/./UtilityTests/LogChannelTest.List (971 of 1785)
PASS: lldb-api :: commands/frame/language/TestGuessLanguage.py (972 of 1785)
PASS: lldb-unit :: Language/Highlighting/./HighlighterTests/HighlighterTest.ClangEmptyInput (973 of 1785)
PASS: lldb-unit :: Utility/./UtilityTests/NameMatchesTest.Contains (974 of 1785)
PASS: lldb-api :: python_api/lldbutil/TestSwigVersion.py (975 of 1785)
PASS: lldb-unit :: Process/minidump/./LLDBMinidumpTests/MinidumpParserTest.GetArchitectureWindows (976 of 1785)
PASS: lldb-shell :: Reproducer/Modules/TestModuleCXX.test (977 of 1785)
PASS: lldb-unit :: Utility/./UtilityTests/StringListTest.ShiftStdString (978 of 1785)
PASS: lldb-api :: linux/builtin_trap/TestBuiltinTrap.py (979 of 1785)
PASS: lldb-shell :: SymbolFile/DWARF/dwarf5-partial-index.cpp (980 of 1785)
PASS: lldb-unit :: Utility/./UtilityTests/DataExtractorTest.GetCStrAtNullOffset (981 of 1785)
PASS: lldb-api :: lang/c/shared_lib_stripped_symbols/TestSharedLibStrippedSymbols.py (982 of 1785)
PASS: lldb-unit :: Expression/./ExpressionTests/CppModuleConfigurationTest.Xcode (983 of 1785)
PASS: lldb-shell :: SymbolFile/NativePDB/globals-bss.cpp (984 of 1785)
PASS: lldb-shell :: Settings/TestSettingsWrite.test (985 of 1785)
PASS: lldb-shell :: SymbolFile/Breakpad/unwind-via-stack-cfi.test (986 of 1785)
PASS: lldb-api :: python_api/value/TestValueAPI.py (987 of 1785)
PASS: lldb-unit :: Utility/./UtilityTests/FileSpecTest.CopyByAppendingPathComponent (988 of 1785)
UNSUPPORTED: lldb-shell :: BuildScript/toolchain-msvc.test (989 of 1785)
PASS: lldb-shell :: ObjectFile/PECOFF/basic-info-arm.yaml (990 of 1785)
PASS: lldb-api :: lang/objc/objc-ivar-protocols/TestIvarProtocols.py (991 of 1785)
PASS: lldb-unit :: Expression/./ExpressionTests/DiagnosticManagerTest.PutStringMultiple (992 of 1785)
PASS: lldb-api :: functionalities/data-formatter/data-formatter-cpp/TestDataFormatterCpp.py (993 of 1785)
PASS: lldb-unit :: Process/gdb-remote/./ProcessGdbRemoteTests/GDBRemoteCommunicationClientTest.WriteRegisterNoSuffix (994 of 1785)
PASS: lldb-shell :: SymbolFile/DWARF/dwarf5_locations.s (995 of 1785)
PASS: lldb-api :: lang/cpp/stl/TestStdCXXDisassembly.py (996 of 1785)
PASS: lldb-api :: functionalities/data-formatter/poarray/TestPrintObjectArray.py (997 of 1785)
PASS: lldb-api :: functionalities/data-formatter/data-formatter-synthval/TestDataFormatterSynthVal.py (998 of 1785)
PASS: lldb-unit :: Utility/./UtilityTests/DeserializerTest.HasData (999 of 1785)
PASS: lldb-unit :: Utility/./UtilityTests/VASprintfTest.EncodingError (1000 of 1785)
PASS: lldb-unit :: Utility/./UtilityTests/LogTest.LLDB_LOG_nullptr (1001 of 1785)
PASS: lldb-shell :: SymbolFile/Breakpad/unwind-via-stack-win.test (1002 of 1785)
PASS: lldb-shell :: Minidump/fb-dump.test (1003 of 1785)
PASS: lldb-unit :: Utility/./UtilityTests/StreamTest.PutHex64ByteOrderBig (1004 of 1785)
PASS: lldb-unit :: Utility/./UtilityTests/BinaryStreamTest.PutSLEB128One (1005 of 1785)
PASS: lldb-api :: functionalities/data-formatter/data-formatter-advanced/TestDataFormatterAdv.py (1006 of 1785)
UNSUPPORTED: lldb-shell :: BuildScript/toolchain-clang-cl.test (1007 of 1785)
PASS: lldb-unit :: Core/./LLDBCoreTests/MangledTest.NameIndexes_FindFunctionSymbols (1008 of 1785)
PASS: lldb-unit :: ScriptInterpreter/Python/./ScriptInterpreterPythonTests/PythonExceptionStateTest.TestAcquisitionSemantics (1009 of 1785)
PASS: lldb-api :: functionalities/inferior-crashing/TestInferiorCrashing.py (1010 of 1785)
PASS: lldb-unit :: Utility/./UtilityTests/StringExtractorTest.GetHexU8_InvalidHex (1011 of 1785)
PASS: lldb-unit :: Utility/./UtilityTests/Flags.Clear (1012 of 1785)
PASS: lldb-shell :: Quit/TestQuitExitCodeImplicit0.test (1013 of 1785)
PASS: lldb-shell :: ObjectFile/ELF/netbsd-exec-8.99.30-amd64.yaml (1014 of 1785)
PASS: lldb-api :: lang/objc/modules-auto-import/TestModulesAutoImport.py (1015 of 1785)
PASS: lldb-unit :: Utility/./UtilityTests/LogChannelEnabledTest.LogThread (1016 of 1785)
PASS: lldb-shell :: Reproducer/TestDriverOptions.test (1017 of 1785)
PASS: lldb-api :: api/check_public_api_headers/TestPublicAPIHeaders.py (1018 of 1785)
PASS: lldb-unit :: Utility/./UtilityTests/RangeTest.Constructor (1019 of 1785)
PASS: lldb-api :: commands/command/history/TestCommandHistory.py (1020 of 1785)
PASS: lldb-api :: functionalities/tail_call_frames/unambiguous_sequence/TestUnambiguousTailCalls.py (1021 of 1785)
PASS: lldb-api :: tools/lldb-server/commandline/TestStubReverseConnect.py (1022 of 1785)
PASS: lldb-unit :: ScriptInterpreter/Python/./ScriptInterpreterPythonTests/PythonDataObjectsTest.TestPythonStringToStructuredString (1023 of 1785)
PASS: lldb-api :: functionalities/gdb_remote_client/TestWriteMemory.py (1024 of 1785)
PASS: lldb-unit :: Utility/./UtilityTests/StreamTest.PutPtr (1025 of 1785)
UNSUPPORTED: lldb-api :: functionalities/thread/break_after_join/TestBreakAfterJoin.py (1026 of 1785)
PASS: lldb-api :: lang/objc/foundation/TestObjCMethods.py (1027 of 1785)
PASS: lldb-api :: functionalities/data-formatter/data-formatter-objc/TestDataFormatterObjCNSContainer.py (1028 of 1785)
PASS: lldb-api :: macosx/find-dsym/deep-bundle/TestDeepBundle.py (1029 of 1785)
PASS: lldb-unit :: Utility/./UtilityTests/RangeTest.Clear (1030 of 1785)
PASS: lldb-shell :: Breakpoint/implicit_const_form_support.test (1031 of 1785)
PASS: lldb-shell :: SymbolFile/DWARF/find-basic-namespace.cpp (1032 of 1785)
PASS: lldb-unit :: Utility/./UtilityTests/NameMatchesTest.Ignore (1033 of 1785)
PASS: lldb-api :: commands/command/script/TestCommandScript.py (1034 of 1785)
PASS: lldb-api :: lang/objc/objc-new-syntax/TestObjCNewSyntaxDictionary.py (1035 of 1785)
PASS: lldb-api :: functionalities/postmortem/mach-core/TestMachCore.py (1036 of 1785)
PASS: lldb-api :: lang/cpp/template-function/TestTemplateFunctions.py (1037 of 1785)
UNSUPPORTED: lldb-api :: functionalities/darwin_log/filter/exact_match/activity/TestDarwinLogFilterMatchActivity.py (1038 of 1785)
PASS: lldb-api :: commands/expression/context-object-objc/TestContextObjectObjc.py (1039 of 1785)
PASS: lldb-api :: commands/add-dsym/uuid/TestAddDsymCommand.py (1040 of 1785)
PASS: lldb-unit :: Core/./LLDBCoreTests/MangledTest.ResultForValidName (1041 of 1785)
UNSUPPORTED: lldb-api :: functionalities/thread/thread_specific_break_plus_condition/TestThreadSpecificBpPlusCondition.py (1042 of 1785)
PASS: lldb-api :: lang/objc/objc-static-method-stripped/TestObjCStaticMethodStripped.py (1043 of 1785)
PASS: lldb-unit :: Utility/./UtilityTests/Flags.Test (1044 of 1785)
PASS: lldb-api :: functionalities/breakpoint/breakpoint_command/TestBreakpointCommandsFromPython.py (1045 of 1785)
PASS: lldb-unit :: Process/gdb-remote/./ProcessGdbRemoteTests/GDBRemoteClientBaseTest.SendContinueAndInterrupt2PacketBug (1046 of 1785)
PASS: lldb-unit :: Utility/./UtilityTests/ListenerTest.GetEventWait (1047 of 1785)
PASS: lldb-unit :: Host/./HostTests/SocketTest.DecodeHostAndPort (1048 of 1785)
PASS: lldb-api :: commands/frame/diagnose/array/TestArray.py (1049 of 1785)
PASS: lldb-api :: lang/objc/objc-stepping/TestObjCStepping.py (1050 of 1785)
PASS: lldb-shell :: Host/TestCustomShell.test (1051 of 1785)
PASS: lldb-unit :: Utility/./UtilityTests/RangeTest.LessThan (1052 of 1785)
PASS: lldb-unit :: Utility/./UtilityTests/StringLexerTest.GetUnlexed (1053 of 1785)
PASS: lldb-unit :: UnwindAssembly/x86/./UnwindAssemblyx86Tests/Testx86AssemblyInspectionEngine.TestStackRealign8BitDisp_i386 (1054 of 1785)
PASS: lldb-api :: commands/expression/import-std-module/forward_list-basic/TestBasicForwardList.py (1055 of 1785)
PASS: lldb-unit :: Utility/./UtilityTests/SerializationRountripTest.SerializeDeserializeObjectReference (1056 of 1785)
PASS: lldb-api :: functionalities/thread/thread_specific_break/TestThreadSpecificBreakpoint.py (1057 of 1785)
PASS: lldb-api :: commands/frame/diagnose/local-variable/TestLocalVariable.py (1058 of 1785)
PASS: lldb-api :: commands/source/info/TestSourceInfo.py (1059 of 1785)
PASS: lldb-unit :: Utility/./UtilityTests/ArgsTest.TestArgv (1060 of 1785)
PASS: lldb-api :: lang/c/shared_lib/TestSharedLib.py (1061 of 1785)
PASS: lldb-api :: functionalities/completion/TestCompletion.py (1062 of 1785)
PASS: lldb-unit :: Utility/./UtilityTests/StreamTest.PutNHex8 (1063 of 1785)
PASS: lldb-api :: lang/objc/blocks/TestObjCIvarsInBlocks.py (1064 of 1785)
PASS: lldb-api :: functionalities/ubsan/user-expression/TestUbsanUserExpression.py (1065 of 1785)
XFAIL: lldb-shell :: Unwind/prefer-debug-over-eh-frame.test (1066 of 1785)
PASS: lldb-api :: commands/expression/timeout/TestCallWithTimeout.py (1067 of 1785)
PASS: lldb-unit :: Process/gdb-remote/./ProcessGdbRemoteTests/GDBRemoteClientBaseTest.SendContinueAndLateInterrupt (1068 of 1785)
PASS: lldb-unit :: Utility/./UtilityTests/RangeTest.DoesIntersect (1069 of 1785)
PASS: lldb-api :: python_api/name_lookup/TestNameLookup.py (1070 of 1785)
UNSUPPORTED: lldb-api :: tools/lldb-vscode/variables/TestVSCode_variables.py (1071 of 1785)
PASS: lldb-unit :: Process/gdb-remote/./ProcessGdbRemoteTests/GDBRemoteCommunicationTest.ReadPacket_checksum (1072 of 1785)
PASS: lldb-api :: commands/statistics/basic/TestStats.py (1073 of 1785)
PASS: lldb-unit :: Utility/./UtilityTests/ArgsTest.StringListConstructor (1074 of 1785)
PASS: lldb-unit :: Language/Highlighting/./HighlighterTests/HighlighterTest.ClangSquareBrackets (1075 of 1785)
PASS: lldb-shell :: Reproducer/Functionalities/TestStepping.test (1076 of 1785)
UNSUPPORTED: lldb-api :: lang/objc/bitfield_ivars/TestBitfieldIvars.py (1077 of 1785)
PASS: lldb-unit :: Expression/./ExpressionTests/DiagnosticManagerTest.GetStringBasic (1078 of 1785)
PASS: lldb-api :: tools/lldb-server/TestGdbRemoteThreadsInStopReply.py (1079 of 1785)
PASS: lldb-shell :: Commands/CommandScriptImmediateOutput/CommandScriptImmediateOutputFile.test (1080 of 1785)
PASS: lldb-unit :: ScriptInterpreter/Python/./ScriptInterpreterPythonTests/PythonDataObjectsTest.TestPythonTupleInitializerList (1081 of 1785)
PASS: lldb-unit :: Utility/./UtilityTests/StringListTest.JoinSingle (1082 of 1785)
PASS: lldb-unit :: Utility/./UtilityTests/StringListTest.PopBack (1083 of 1785)
PASS: lldb-unit :: SymbolFile/NativePDB/./SymbolFileNativePDBTests/PDBFPOProgramToDWARFExpressionTests.UnresolvedRegisterAssignmentReference (1084 of 1785)
PASS: lldb-unit :: Utility/./UtilityTests/StringExtractorTest.GetHexBytesAvail (1085 of 1785)
PASS: lldb-shell :: BuildScript/toolchain-clang.test (1086 of 1785)
PASS: lldb-api :: functionalities/set-data/TestSetData.py (1087 of 1785)
PASS: lldb-shell :: SymbolFile/DWARF/find-basic-function.cpp (1088 of 1785)
PASS: lldb-shell :: BuildScript/script-args.test (1089 of 1785)
PASS: lldb-api :: lang/cpp/auto/TestCPPAuto.py (1090 of 1785)
PASS: lldb-api :: functionalities/thread/concurrent_events/TestConcurrentTwoWatchpointsOneSignal.py (1091 of 1785)
FAIL: lldb-api :: tools/lldb-server/register-reading/TestGdbRemoteGPacket.py (1092 of 1785)
******************** TEST 'lldb-api :: tools/lldb-server/register-reading/TestGdbRemoteGPacket.py' FAILED ********************
lldb version 10.0.99 (http://labmaster3.local/git/llvm-project.git revision e6125fc0ec3418d6529b52f15853a06e000d478d)
  clang revision e6125fc0ec3418d6529b52f15853a06e000d478d
  llvm revision e6125fc0ec3418d6529b52f15853a06e000d478d
LLDB library dir: /Users/buildslave/jenkins/workspace/lldb-cmake-sanitized/lldb-build/bin
LLDB import library dir: /Users/buildslave/jenkins/workspace/lldb-cmake-sanitized/lldb-build/bin
libstdcxx tests will not be run because: Don't know how to build with libstdcxx on macosx
Skipping following debug info categories: ['dwo']

Hide Details

Session logs for test failures/errors/unexpected successes will go into directory '/Users/buildslave/jenkins/workspace/lldb-cmake-sanitized/test/logs' Command invoked: /Users/buildslave/jenkins/workspace/lldb-cmake-sanitized/llvm-project/lldb/test/API/dotest.py --arch=x86_64 -s /Users/buildslave/jenkins/workspace/lldb-cmake-sanitized/lldb-build/lldb-test-traces -S nm -u CXXFLAGS -u CFLAGS --executable /Users/buildslave/jenkins/workspace/lldb-cmake-sanitized/lldb-build/./bin/lldb --dsymutil /Users/buildslave/jenkins/workspace/lldb-cmake-sanitized/lldb-build/./bin/dsymutil --filecheck /Users/buildslave/jenkins/workspace/lldb-cmake-sanitized/lldb-build/./bin/FileCheck -C /Users/buildslave/jenkins/workspace/lldb-cmake-sanitized/host-compiler/bin/clang --codesign-identity lldb_codesign --server /Users/buildslave/jenkins/workspace/lldb-cmake-sanitized/lldb-build/./bin/debugserver --arch x86_64 --build-dir /Users/buildslave/jenkins/workspace/lldb-cmake-sanitized/lldb-build/lldb-test-build.noindex -s=/Users/buildslave/jenkins/workspace/lldb-cmake-sanitized/test/logs -t --env TERM=vt100 --env LLVM_LIBS_DIR=/Users/buildslave/jenkins/workspace/lldb-cmake-sanitized/lldb-build/./lib --build-dir /Users/buildslave/jenkins/workspace/lldb-cmake-sanitized/lldb-build/tools/lldb/lldb-test-build.noindex --lldb-module-cache-dir /Users/buildslave/jenkins/workspace/lldb-cmake-sanitized/lldb-build/tools/lldb/lldb-test-build.noindex/module-cache-lldb/lldb-api --clang-module-cache-dir /Users/buildslave/jenkins/workspace/lldb-cmake-sanitized/lldb-build/tools/lldb/lldb-test-build.noindex/module-cache-clang/lldb-api /Users/buildslave/jenkins/workspace/lldb-cmake-sanitized/llvm-project/lldb/packages/Python/lldbsuite/test/tools/lldb-server/register-reading -p TestGdbRemoteGPacket.py Change dir to: /Users/buildslave/jenkins/workspace/lldb-cmake-sanitized/llvm-project/lldb/packages/Python/lldbsuite/test/tools/lldb-server/register-reading runCmd: settings set symbols.enable-external-lookup false output:

Hide Details

runCmd: settings set plugin.process.gdb-remote.packet-timeout 60 output:

Hide Details

runCmd: settings set symbols.clang-modules-cache-path "/Users/buildslave/jenkins/workspace/lldb-cmake-sanitized/lldb-build/tools/lldb/lldb-test-build.noindex/module-cache-lldb/lldb-api" output:

Hide Details

runCmd: settings set use-color false output:

Hide Details

Adding tearDown hook: def shutdown_named_pipe(): # Close the pipe. try: named_pipe.close() except: print("failed to close named pipe") None

Hide Details

# Delete the pipe. try: os.remove(named_pipe_path) except: print("failed to delete named pipe: {}".format(named_pipe_path)) None

Hide Details

# Delete the temp directory. try: os.rmdir(temp_dir) except: print( "failed to delete temp dir: {}, directory contents: '{}'".format( temp_dir, os.listdir(temp_dir))) None

Hide Details

Hide Details

Adding tearDown hook: def cleanupSubprocesses(self): # Ensure any subprocesses are cleaned up for p in self.subprocesses: p.terminate() del p del self.subprocesses[:] # Ensure any forked processes are cleaned up for pid in self.forkedProcessPids: if os.path.exists("/proc/" + str(pid)): os.kill(pid, signal.SIGTERM)

Hide Details

Hide Details

Adding tearDown hook: def shutdown_debug_monitor(): try: server.terminate() except: logger.warning( "failed to terminate server for debug monitor: {}; ignoring".format( sys.exc_info()[0]))

Hide Details

Hide Details

Adding tearDown hook: def shutdown_socket(): if sock: try: # send the kill packet so lldb-server shuts down gracefully sock.sendall(GdbRemoteTestCaseBase._GDBREMOTE_KILL_PACKET) except: logger.warning( "failed to send kill packet to debug monitor: {}; ignoring".format( sys.exc_info()[0]))

Hide Details

try: sock.close() except: logger.warning( "failed to close socket to debug monitor: {}; ignoring".format( sys.exc_info()[0]))

Hide Details

Hide Details

Adding tearDown hook: def cleanupSubprocesses(self): # Ensure any subprocesses are cleaned up for p in self.subprocesses: p.terminate() del p del self.subprocesses[:] # Ensure any forked processes are cleaned up for pid in self.forkedProcessPids: if os.path.exists("/proc/" + str(pid)): os.kill(pid, signal.SIGTERM)

Hide Details

Hide Details

FAIL: LLDB (/Users/buildslave/jenkins/workspace/lldb-cmake-sanitized/host-compiler/bin/clang-10-x86_64) :: test_g_packet_debugserver (TestGdbRemoteGPacket.TestGdbRemoteGPacket) Executing tearDown hook: def cleanupSubprocesses(self): # Ensure any subprocesses are cleaned up for p in self.subprocesses: p.terminate() del p del self.subprocesses[:] # Ensure any forked processes are cleaned up for pid in self.forkedProcessPids: if os.path.exists("/proc/" + str(pid)): os.kill(pid, signal.SIGTERM)

Hide Details

Hide Details

Executing tearDown hook: def shutdown_socket(): if sock: try: # send the kill packet so lldb-server shuts down gracefully sock.sendall(GdbRemoteTestCaseBase._GDBREMOTE_KILL_PACKET) except: logger.warning( "failed to send kill packet to debug monitor: {}; ignoring".format( sys.exc_info()[0]))

Hide Details

try: sock.close() except: logger.warning( "failed to close socket to debug monitor: {}; ignoring".format( sys.exc_info()[0]))

Hide Details

Hide Details

Executing tearDown hook: def shutdown_debug_monitor(): try: server.terminate() except: logger.warning( "failed to terminate server for debug monitor: {}; ignoring".format( sys.exc_info()[0]))

Hide Details

Hide Details

Executing tearDown hook: def cleanupSubprocesses(self): # Ensure any subprocesses are cleaned up for p in self.subprocesses: p.terminate() del p del self.subprocesses[:] # Ensure any forked processes are cleaned up for pid in self.forkedProcessPids: if os.path.exists("/proc/" + str(pid)): os.kill(pid, signal.SIGTERM)

Hide Details

Hide Details

Executing tearDown hook: def shutdown_named_pipe(): # Close the pipe. try: named_pipe.close() except: print("failed to close named pipe") None

Hide Details

# Delete the pipe. try: os.remove(named_pipe_path) except: print("failed to delete named pipe: {}".format(named_pipe_path)) None

Hide Details

# Delete the temp directory. try: os.rmdir(temp_dir) except: print( "failed to delete temp dir: {}, directory contents: '{}'".format( temp_dir, os.listdir(temp_dir))) None

Hide Details

Hide Details

runCmd: settings set symbols.enable-external-lookup false output:

Hide Details

runCmd: settings set plugin.process.gdb-remote.packet-timeout 60 output:

Hide Details

runCmd: settings set symbols.clang-modules-cache-path "/Users/buildslave/jenkins/workspace/lldb-cmake-sanitized/lldb-build/tools/lldb/lldb-test-build.noindex/module-cache-lldb/lldb-api" output:

Hide Details

runCmd: settings set use-color false output:

Hide Details

UNSUPPORTED: LLDB (/Users/buildslave/jenkins/workspace/lldb-cmake-sanitized/host-compiler/bin/clang-10-x86_64) :: test_g_returns_correct_data_no_suffix_llgs (TestGdbRemoteGPacket.TestGdbRemoteGPacket) (llgs tests) runCmd: settings set symbols.enable-external-lookup false output:

Hide Details

runCmd: settings set plugin.process.gdb-remote.packet-timeout 60 output:

Hide Details

runCmd: settings set symbols.clang-modules-cache-path "/Users/buildslave/jenkins/workspace/lldb-cmake-sanitized/lldb-build/tools/lldb/lldb-test-build.noindex/module-cache-lldb/lldb-api" output:

Hide Details

runCmd: settings set use-color false output:

Hide Details

UNSUPPORTED: LLDB (/Users/buildslave/jenkins/workspace/lldb-cmake-sanitized/host-compiler/bin/clang-10-x86_64) :: test_g_returns_correct_data_with_suffix_llgs (TestGdbRemoteGPacket.TestGdbRemoteGPacket) (llgs tests) Restore dir to: /Users/buildslave/jenkins/workspace/lldb-cmake-sanitized/lldb-build/tools/lldb/test ====================================================================== FAIL: test_g_packet_debugserver (TestGdbRemoteGPacket.TestGdbRemoteGPacket) ---------------------------------------------------------------------- Traceback (most recent call last): File "/Users/buildslave/jenkins/workspace/lldb-cmake-sanitized/llvm-project/lldb/packages/Python/lldbsuite/test/decorators.py", line 141, in wrapper func(*args, **kwargs) File "/Users/buildslave/jenkins/workspace/lldb-cmake-sanitized/llvm-project/lldb/packages/Python/lldbsuite/test/decorators.py", line 141, in wrapper func(*args, **kwargs) File "/Users/buildslave/jenkins/workspace/lldb-cmake-sanitized/llvm-project/lldb/packages/Python/lldbsuite/test/tools/lldb-server/register-reading/TestGdbRemoteGPacket.py", line 59, in test_g_packet_debugserver self.run_test_g_packet() File "/Users/buildslave/jenkins/workspace/lldb-cmake-sanitized/llvm-project/lldb/packages/Python/lldbsuite/test/tools/lldb-server/register-reading/TestGdbRemoteGPacket.py", line 41, in run_test_g_packet self.connect_to_debug_monitor() File "/Users/buildslave/jenkins/workspace/lldb-cmake-sanitized/llvm-project/lldb/packages/Python/lldbsuite/test/tools/lldb-server/gdbremote_testcase.py", line 417, in connect_to_debug_monitor server = self.launch_debug_monitor(attach_pid=attach_pid) File "/Users/buildslave/jenkins/workspace/lldb-cmake-sanitized/llvm-project/lldb/packages/Python/lldbsuite/test/tools/lldb-server/gdbremote_testcase.py", line 410, in launch_debug_monitor self.port = self.get_stub_port_from_named_socket(self._READ_TIMEOUT) File "/Users/buildslave/jenkins/workspace/lldb-cmake-sanitized/llvm-project/lldb/packages/Python/lldbsuite/test/tools/lldb-server/gdbremote_testcase.py", line 224, in get_stub_port_from_named_socket "no content to read on pipe") AssertionError: 0 == 0 : no content to read on pipe Config=x86_64-/Users/buildslave/jenkins/workspace/lldb-cmake-sanitized/host-compiler/bin/clang-10 ---------------------------------------------------------------------- Ran 3 tests in 3.499s

Hide Details

RESULT: FAILED (0 passes, 1 failures, 0 errors, 2 skipped, 0 expected failures, 0 unexpected successes)

Hide Details

******************** PASS: lldb-unit :: Utility/./UtilityTests/StringExtractorTest.GetHexU8_Extra_NoEof (1093 of 1785) PASS: lldb-unit :: UnwindAssembly/x86/./UnwindAssemblyx86Tests/Testx86AssemblyInspectionEngine.TestPopRBP (1094 of 1785) PASS: lldb-unit :: Utility/./UtilityTests/AnsiTerminal.AtStart (1095 of 1785) PASS: lldb-unit :: Utility/./UtilityTests/StringListTest.InsertStringAtIndexStart (1096 of 1785) PASS: lldb-unit :: Utility/./UtilityTests/StringListTest.SetSize (1097 of 1785) PASS: lldb-unit :: Expression/./ExpressionTests/CppModuleConfigurationTest.MissingUsrInclude (1098 of 1785) PASS: lldb-unit :: Utility/./UtilityTests/ArgsTest.TestUnknownEscape (1099 of 1785) PASS: lldb-api :: commands/expression/test/TestExprs.py (1100 of 1785) PASS: lldb-api :: functionalities/data-formatter/summary-string-onfail/Test-rdar-9974002.py (1101 of 1785) PASS: lldb-unit :: Host/./HostTests/NativeProcessProtocolTest.SetBreakpointFailRead (1102 of 1785) PASS: lldb-shell :: SymbolFile/DWARF/find-inline-method.s (1103 of 1785) PASS: lldb-api :: macosx/function-starts/TestFunctionStarts.py (1104 of 1785) UNSUPPORTED: lldb-shell :: SymbolFile/PDB/func-symbols.test (1105 of 1785) UNSUPPORTED: lldb-api :: functionalities/data-formatter/data-formatter-stl/libstdcpp/tuple/TestDataFormatterStdTuple.py (1106 of 1785) XFAIL: lldb-shell :: Register/x86-64-write.test (1107 of 1785) PASS: lldb-api :: tools/lldb-server/TestGdbRemoteExitCode.py (1108 of 1785) PASS: lldb-api :: commands/expression/namespace_local_var_same_name_obj_c/TestNamespaceLocalVarSameNameObjC.py (1109 of 1785) PASS: lldb-unit :: Utility/./UtilityTests/StringListTest.LongestCommonPrefixDuplicateElement (1110 of 1785) PASS: lldb-api :: functionalities/avoids-fd-leak/TestFdLeak.py (1111 of 1785) PASS: lldb-unit :: SymbolFile/NativePDB/./SymbolFileNativePDBTests/PDBFPOProgramToDWARFExpressionTests.MultipleDependentAssignments (1112 of 1785) PASS: lldb-api :: functionalities/modern-type-lookup/objc-modules/TestObjModulesModernTypeLookup.py (1113 of 1785) PASS: lldb-unit :: Utility/./UtilityTests/ScalarTest.CastOperations (1114 of 1785) PASS: lldb-shell :: SymbolFile/DWARF/find-qualified-variable.cpp (1115 of 1785) PASS: lldb-unit :: Process/minidump/./LLDBMinidumpTests/MinidumpParserTest.GetLinuxProcStatus_no_stream (1116 of 1785) PASS: lldb-api :: functionalities/data-formatter/data-formatter-stl/libcxx/forward_list/TestDataFormatterLibcxxForwardList.py (1117 of 1785) PASS: lldb-unit :: Symbol/./SymbolTests/LineEntryTest.GetSameLineContiguousAddressRangeOneInline (1118 of 1785) PASS: lldb-unit :: Utility/./UtilityTests/BinaryStreamTest.PutSLEB128NineBytes (1119 of 1785) PASS: lldb-unit :: Target/./TargetTests/MemoryRegionInfoTest.Formatv (1120 of 1785) PASS: lldb-unit :: Host/./HostTests/SocketTest.DomainListenConnectAccept (1121 of 1785) PASS: lldb-api :: lang/objc/objc-struct-return/TestObjCStructReturn.py (1122 of 1785) PASS: lldb-shell :: SymbolFile/DWARF/parallel-indexing-stress.s (1123 of 1785) PASS: lldb-unit :: Process/minidump/./LLDBMinidumpTests/MinidumpParserTest.GetMemoryRegionInfoFromMemoryList (1124 of 1785) PASS: lldb-api :: lang/cpp/const_this/TestConstThis.py (1125 of 1785) PASS: lldb-unit :: Process/minidump/./LLDBMinidumpTests/MinidumpParserTest.GetPidWindows (1126 of 1785) PASS: lldb-api :: lang/objc/objc-ivar-offsets/TestObjCIvarOffsets.py (1127 of 1785) PASS: lldb-api :: functionalities/abbreviation/TestAbbreviations.py (1128 of 1785) PASS: lldb-unit :: Target/./TargetTests/ModuleCacheTest.GetAndPut (1129 of 1785) PASS: lldb-unit :: UnwindAssembly/x86/./UnwindAssemblyx86Tests/Testx86AssemblyInspectionEngine.TestCALLNextInsn (1130 of 1785) PASS: lldb-unit :: Utility/./UtilityTests/BinaryStreamTest.PutULEB128ThreeBytes (1131 of 1785) PASS: lldb-unit :: Utility/./UtilityTests/StreamTest.PutHex16ByteOrderLittle (1132 of 1785) UNSUPPORTED: lldb-api :: commands/register/register/intel_xtended_registers/mpx_bound_violation/TestBoundViolation.py (1133 of 1785) PASS: lldb-unit :: Utility/./UtilityTests/BinaryStreamTest.PutSLEB128TwoBytes (1134 of 1785) PASS: lldb-unit :: Utility/./UtilityTests/OptionsWithRawTest.ArgsButNoDelimiter (1135 of 1785) PASS: lldb-api :: functionalities/inferior-changed/TestInferiorChanged.py (1136 of 1785) PASS: lldb-api :: functionalities/thread/concurrent_events/TestConcurrentWatchBreak.py (1137 of 1785) PASS: lldb-unit :: Target/./TargetTests/PathMappingListTest.RemapRoot (1138 of 1785) PASS: lldb-api :: lang/objc/foundation/TestObjCMethodsNSError.py (1139 of 1785) PASS: lldb-unit :: Core/./LLDBCoreTests/RichManglingContextTest.Basic (1140 of 1785) PASS: lldb-api :: commands/expression/diagnostics/TestExprDiagnostics.py (1141 of 1785) PASS: lldb-unit :: Process/gdb-remote/./ProcessGdbRemoteTests/GDBRemoteCommunicationClientTest.GetModulesInfo (1142 of 1785) PASS: lldb-shell :: Commands/command-backtrace.test (1143 of 1785) PASS: lldb-unit :: Process/minidump/./LLDBMinidumpTests/MinidumpParserTest.FindMemoryRangeWithFullMemoryMinidump (1144 of 1785) PASS: lldb-api :: commands/watchpoints/watchpoint_commands/command/TestWatchpointCommandLLDB.py (1145 of 1785) PASS: lldb-unit :: Utility/./UtilityTests/BinaryStreamTest.PutULEB128EightBytes (1146 of 1785) PASS: lldb-shell :: SymbolFile/NativePDB/tag-types.cpp (1147 of 1785) PASS: lldb-api :: functionalities/tail_call_frames/inlining_and_tail_calls/TestInliningAndTailCalls.py (1148 of 1785) PASS: lldb-api :: lang/objc/unicode-string/TestUnicodeString.py (1149 of 1785) PASS: lldb-api :: lang/objc/objc-new-syntax/TestObjCNewSyntaxLiteral.py (1150 of 1785) PASS: lldb-unit :: ScriptInterpreter/Python/./ScriptInterpreterPythonTests/PythonDataObjectsTest.TestPythonInteger (1151 of 1785) PASS: lldb-api :: python_api/signals/TestSignalsAPI.py (1152 of 1785) PASS: lldb-unit :: Utility/./UtilityTests/StringListTest.InsertStringAtIndexEnd (1153 of 1785) PASS: lldb-api :: functionalities/backticks/TestBackticksWithoutATarget.py (1154 of 1785) PASS: lldb-api :: lang/cpp/dynamic-value/TestCppValueCast.py (1155 of 1785) PASS: lldb-unit :: Utility/./UtilityTests/StringLexerTest.NextIfList (1156 of 1785) PASS: lldb-api :: commands/process/launch-with-shellexpand/TestLaunchWithShellExpand.py (1157 of 1785) PASS: lldb-unit :: Language/Highlighting/./HighlighterTests/HighlighterTest.ClangCursorOutOfBounds (1158 of 1785) PASS: lldb-api :: functionalities/tail_call_frames/thread_step_out_message/TestArtificialFrameStepOutMessage.py (1159 of 1785) PASS: lldb-unit :: Utility/./UtilityTests/StringListTest.ShiftCString (1160 of 1785) PASS: lldb-shell :: SymbolFile/NativePDB/ast-types.cpp (1161 of 1785) PASS: lldb-api :: lang/cpp/trivial_abi/TestTrivialABI.py (1162 of 1785) PASS: lldb-unit :: Utility/./UtilityTests/StringListTest.ForRangeEmpty (1163 of 1785) PASS: lldb-api :: functionalities/data-formatter/synthcapping/TestSyntheticCapping.py (1164 of 1785) PASS: lldb-unit :: Symbol/./SymbolTests/TestClangASTContext.TestGetBasicTypeFromName (1165 of 1785) PASS: lldb-unit :: Utility/./UtilityTests/BinaryStreamTest.PutULEB128SixBytes (1166 of 1785) PASS: lldb-unit :: Utility/./UtilityTests/SerializationRountripTest.SerializeDeserializeObjectPointer (1167 of 1785) PASS: lldb-unit :: Utility/./UtilityTests/StringListTest.InsertStringAtIndexMove (1168 of 1785) PASS: lldb-unit :: Utility/./UtilityTests/StringListTest.AppendStringMove (1169 of 1785) UNSUPPORTED: lldb-shell :: SymbolFile/NativePDB/local-variables.cpp (1170 of 1785) PASS: lldb-unit :: ObjectFile/PECOFF/./ObjectFilePECOFFTests/PECallFrameInfoTest.Chained_eh (1171 of 1785) UNSUPPORTED: lldb-shell :: Register/x86-64-xmm16-write.test (1172 of 1785) UNSUPPORTED: lldb-shell :: SymbolFile/PDB/variables.test (1173 of 1785) PASS: lldb-unit :: Utility/./UtilityTests/StreamTest.PutSLEB128 (1174 of 1785) UNSUPPORTED: lldb-shell :: SymbolFile/PDB/ast-restore.test (1175 of 1785) PASS: lldb-api :: functionalities/data-formatter/user-format-vs-summary/TestUserFormatVsSummary.py (1176 of 1785) PASS: lldb-unit :: UnwindAssembly/x86/./UnwindAssemblyx86Tests/Testx86AssemblyInspectionEngine.TestMovRSPtoRBP (1177 of 1785) PASS: lldb-unit :: SymbolFile/NativePDB/./SymbolFileNativePDBTests/PDBFPOProgramToDWARFExpressionTests.DependencyChain (1178 of 1785) PASS: lldb-api :: python_api/value/empty_class/TestValueAPIEmptyClass.py (1179 of 1785) PASS: lldb-unit :: Host/./HostTests/ConnectionFileDescriptorTest.TCPGetURIv4 (1180 of 1785) PASS: lldb-api :: functionalities/postmortem/netbsd-core/TestNetBSDCore.py (1181 of 1785) PASS: lldb-unit :: Utility/./UtilityTests/ArgsTest.ReplaceArgumentAtIndexEqual (1182 of 1785) PASS: lldb-api :: lang/objcxx/objcxx-ivar-vector/TestIvarVector.py (1183 of 1785) PASS: lldb-unit :: Utility/./UtilityTests/UserIDResolver.GetUserName (1184 of 1785) PASS: lldb-api :: lang/cpp/std-function-step-into-callable/TestStdFunctionStepIntoCallable.py (1185 of 1785) PASS: lldb-unit :: Utility/./UtilityTests/StreamTest.PutHex16ByteOrderBig (1186 of 1785) PASS: lldb-api :: python_api/findvalue_duplist/TestSBFrameFindValue.py (1187 of 1785) PASS: lldb-api :: lang/c/global_variables/TestGlobalVariables.py (1188 of 1785) PASS: lldb-unit :: Signals/./SignalsTests/UnixSignalsTest.VersionChange (1189 of 1785) PASS: lldb-api :: commands/command/nested_alias/TestNestedAlias.py (1190 of 1785) PASS: lldb-shell :: Quit/TestQuitExitCode30.test (1191 of 1785) PASS: lldb-api :: functionalities/data-formatter/nsdictionarysynth/TestNSDictionarySynthetic.py (1192 of 1785) UNSUPPORTED: lldb-api :: python_api/disassemble-raw-data/TestDisassemble_VST1_64.py (1193 of 1785) PASS: lldb-api :: functionalities/thread/concurrent_events/TestConcurrentDelayedCrashWithBreakpointSignal.py (1194 of 1785) PASS: lldb-unit :: Utility/./UtilityTests/VASprintfTest.BufferResize (1195 of 1785) PASS: lldb-api :: commands/command/delete/TestCommandDelete.py (1196 of 1785) PASS: lldb-api :: lang/cpp/thread_local/TestThreadLocal.py (1197 of 1785) PASS: lldb-shell :: ObjectFile/ELF/PT_LOAD-overlap-section.yaml (1198 of 1785) PASS: lldb-api :: functionalities/paths/TestPaths.py (1199 of 1785) PASS: lldb-shell :: ObjectFile/ELF/compressed-sections.yaml (1200 of 1785) PASS: lldb-unit :: Utility/./UtilityTests/ArgsTest.ReplaceArgumentAtIndexLonger (1201 of 1785) PASS: lldb-shell :: BuildScript/compiler-full-path.test (1202 of 1785) PASS: lldb-api :: lang/cpp/limit-debug-info/TestWithLimitDebugInfo.py (1203 of 1785) PASS: lldb-unit :: Utility/./UtilityTests/StringListTest.SplitIntoLinesSingleTrailingCR (1204 of 1785) PASS: lldb-shell :: Minidump/breakpad-symbols.test (1205 of 1785) PASS: lldb-api :: functionalities/thread/exit_during_break/TestExitDuringBreak.py (1206 of 1785) PASS: lldb-api :: lang/objc/objc-foundation-dictionary-empty/TestNSDictionary0.py (1207 of 1785) PASS: lldb-api :: macosx/queues/TestQueues.py (1208 of 1785) PASS: lldb-unit :: Process/minidump/./LLDBMinidumpTests/MinidumpParserTest.GetPidWow64 (1209 of 1785) PASS: lldb-unit :: Utility/./UtilityTests/ArgsTest.TestQuotedUnknownEscape (1210 of 1785) PASS: lldb-unit :: ScriptInterpreter/Python/./ScriptInterpreterPythonTests/PythonDataObjectsTest.TestPythonBoolean (1211 of 1785) PASS: lldb-api :: types/TestIntegerTypes.py (1212 of 1785) PASS: lldb-shell :: Commands/command-source.test (1213 of 1785) PASS: lldb-unit :: Expression/./ExpressionTests/DiagnosticManagerTest.GetStringPreserveOrder (1214 of 1785) PASS: lldb-api :: functionalities/breakpoint/breakpoint_names/TestBreakpointNames.py (1215 of 1785) PASS: lldb-unit :: Process/gdb-remote/./ProcessGdbRemoteTests/GDBRemoteCommunicationServerTest.SendErrorResponse_StringError (1216 of 1785) PASS: lldb-unit :: Utility/./UtilityTests/RecordReplayTest.InstrumentedBarPtr (1217 of 1785) PASS: lldb-unit :: Utility/./UtilityTests/StreamTeeTest.Constructor2Streams (1218 of 1785) PASS: lldb-unit :: Utility/./UtilityTests/UriParserTest.BracketedHostnameWithColon (1219 of 1785) UNSUPPORTED: lldb-api :: functionalities/exec/TestExec.py (1220 of 1785) PASS: lldb-unit :: Symbol/./SymbolTests/Type.GetTypeScopeAndBasename (1221 of 1785) PASS: lldb-api :: commands/help/TestHelp.py (1222 of 1785) PASS: lldb-unit :: Utility/./UtilityTests/RangeTest.ContainsEndInclusive (1223 of 1785) PASS: lldb-api :: python_api/lldbutil/frame/TestFrameUtils.py (1224 of 1785) PASS: lldb-api :: functionalities/thread/concurrent_events/TestConcurrentCrashWithSignal.py (1225 of 1785) PASS: lldb-api :: commands/expression/import-std-module/list-dbg-info-content/TestDbgInfoContentList.py (1226 of 1785) PASS: lldb-unit :: Utility/./UtilityTests/StreamTest.PutStringAsRawHex8 (1227 of 1785) PASS: lldb-unit :: Utility/./UtilityTests/RegularExpression.CopyAssignment (1228 of 1785) PASS: lldb-api :: lang/cpp/function_refs/TestFunctionRefs.py (1229 of 1785) PASS: lldb-unit :: Process/gdb-remote/./ProcessGdbRemoteTests/GDBRemoteClientBaseTest.SendContinueDelegateStructuredDataReceipt (1230 of 1785) PASS: lldb-unit :: ObjectFile/ELF/./ObjectFileELFTests/ObjectFileELFTest.SectionsResolveConsistently (1231 of 1785) PASS: lldb-unit :: Utility/./UtilityTests/BinaryStreamTest.PutSLEB128SevenBytes (1232 of 1785) PASS: lldb-shell :: SymbolFile/NativePDB/ast-methods.cpp (1233 of 1785) PASS: lldb-api :: functionalities/data-formatter/boolreference/TestFormattersBoolRefPtr.py (1234 of 1785) PASS: lldb-unit :: Editline/./EditlineTests/EditlineTestFixture.EditlineReceivesSingleLineText (1235 of 1785) PASS: lldb-api :: lang/objc/foundation/TestObjCMethodsString.py (1236 of 1785) PASS: lldb-api :: functionalities/conditional_break/TestConditionalBreak.py (1237 of 1785) PASS: lldb-unit :: UnwindAssembly/x86/./UnwindAssemblyx86Tests/Testx86AssemblyInspectionEngine.TestPopRBPWithREX (1238 of 1785) PASS: lldb-api :: lang/cpp/wchar_t/TestCxxWCharT.py (1239 of 1785) PASS: lldb-unit :: Utility/./UtilityTests/StringListTest.GetSize (1240 of 1785) PASS: lldb-unit :: Target/./TargetTests/ExecutionContextTest.GetByteOrderTarget (1241 of 1785) UNSUPPORTED: lldb-shell :: SymbolFile/NativePDB/ast-functions-msvc.cpp (1242 of 1785) PASS: lldb-api :: python_api/section/TestSectionAPI.py (1243 of 1785) PASS: lldb-unit :: Utility/./UtilityTests/StreamTest.PutCStringWithStringRef (1244 of 1785) PASS: lldb-api :: tools/lldb-server/TestGdbRemote_qThreadStopInfo.py (1245 of 1785) PASS: lldb-api :: lang/objc/objc-checker/TestObjCCheckers.py (1246 of 1785) PASS: lldb-unit :: Utility/./UtilityTests/AnsiTerminal.Incomplete (1247 of 1785) PASS: lldb-unit :: Utility/./UtilityTests/StringExtractorTest.GetHexBytesAvail_OddPair (1248 of 1785) PASS: lldb-api :: functionalities/data-formatter/nsarraysynth/TestNSArraySynthetic.py (1249 of 1785) PASS: lldb-api :: functionalities/thread/concurrent_events/TestConcurrentTwoWatchpointsOneBreakpoint.py (1250 of 1785) PASS: lldb-unit :: Target/./TargetTests/PathMappingListTest.RelativeTests (1251 of 1785) PASS: lldb-api :: commands/expression/issue_11588/Test11588.py (1252 of 1785) PASS: lldb-shell :: ObjectFile/ELF/PT_LOAD.yaml (1253 of 1785) PASS: lldb-api :: commands/expression/formatters/TestFormatters.py (1254 of 1785) PASS: lldb-api :: commands/expression/anonymous-struct/TestCallUserAnonTypedef.py (1255 of 1785) PASS: lldb-api :: commands/watchpoints/watchpoint_set_command/TestWatchLocationWithWatchSet.py (1256 of 1785) PASS: lldb-api :: functionalities/thread/concurrent_events/TestConcurrentCrashWithWatchpointBreakpointSignal.py (1257 of 1785) PASS: lldb-unit :: SymbolFile/DWARF/./SymbolFileDWARFTests/DWARFASTParserClangTests.EnsureAllDIEsInDeclContextHaveBeenParsedParsesOnlyMatchingEntries (1258 of 1785) PASS: lldb-unit :: Process/gdb-remote/./ProcessGdbRemoteTests/GDBRemoteCommunicationClientTest.SaveRestoreRegistersNoSuffix (1259 of 1785) PASS: lldb-unit :: Utility/./UtilityTests/StatusTest.Formatv (1260 of 1785) PASS: lldb-api :: commands/register/register/register_command/TestRegisters.py (1261 of 1785) PASS: lldb-unit :: Symbol/./SymbolTests/LineEntryTest.GetSameLineContiguousAddressRangeNoInlines (1262 of 1785) PASS: lldb-unit :: Utility/./UtilityTests/DataExtractorTest.PeekData (1263 of 1785) PASS: lldb-api :: lang/cpp/namespace_definitions/TestNamespaceDefinitions.py (1264 of 1785) PASS: lldb-api :: lang/c/struct_types/TestStructTypes.py (1265 of 1785) PASS: lldb-shell :: ObjectFile/ELF/PT_TLS-overlap-PT_LOAD.yaml (1266 of 1785) PASS: lldb-api :: lang/c/find_struct_type/TestFindStructTypes.py (1267 of 1785) PASS: lldb-unit :: Utility/./UtilityTests/ArgsTest.TestTrailingBackslash (1268 of 1785) PASS: lldb-unit :: Utility/./UtilityTests/ScalarTest.ComparisonFloat (1269 of 1785) PASS: lldb-api :: lang/c/vla/TestVLA.py (1270 of 1785) PASS: lldb-shell :: SymbolFile/DWARF/childless-compile-unit.s (1271 of 1785) PASS: lldb-unit :: Utility/./UtilityTests/StringListTest.LongestCommonPrefixSingleElement (1272 of 1785) PASS: lldb-api :: tools/lldb-server/TestGdbRemoteRegisterState.py (1273 of 1785) PASS: lldb-unit :: Utility/./UtilityTests/BroadcasterTest.EventTypeHasListeners (1274 of 1785) PASS: lldb-unit :: Utility/./UtilityTests/LogTest.Register (1275 of 1785) PASS: lldb-api :: commands/expression/ir-interpreter/TestIRInterpreter.py (1276 of 1785) PASS: lldb-unit :: ScriptInterpreter/Python/./ScriptInterpreterPythonTests/PythonDataObjectsTest.TestPythonDictionaryValueEquality (1277 of 1785) PASS: lldb-unit :: Utility/./UtilityTests/StreamTest.ShiftOperatorUInts (1278 of 1785) PASS: lldb-unit :: UnwindAssembly/x86/./UnwindAssemblyx86Tests/Testx86AssemblyInspectionEngine.TestSimplei386ugmented (1279 of 1785) UNSUPPORTED: lldb-shell :: SymbolFile/PDB/calling-conventions.test (1280 of 1785) UNSUPPORTED: lldb-api :: arm/breakpoint-thumb-codesection/TestBreakpointThumbCodesection.py (1281 of 1785) PASS: lldb-api :: commands/expression/context-object/TestContextObject.py (1282 of 1785) UNSUPPORTED: lldb-shell :: ObjectFile/ELF/minidebuginfo-set-and-hit-breakpoint.test (1283 of 1785) PASS: lldb-unit :: Utility/./UtilityTests/StreamTest.PutHex64ByteOrderLittle (1284 of 1785) PASS: lldb-shell :: SymbolFile/DWARF/compilercontext.ll (1285 of 1785) PASS: lldb-unit :: Utility/./UtilityTests/ArchSpecTest.TestSetTriple (1286 of 1785) PASS: lldb-unit :: Utility/./UtilityTests/StreamTeeTest.Write (1287 of 1785) PASS: lldb-unit :: UnwindAssembly/x86/./UnwindAssemblyx86Tests/Testx86AssemblyInspectionEngine.TestPopESI (1288 of 1785) PASS: lldb-unit :: Host/./HostTests/TaskPoolTest.RunTasks (1289 of 1785) PASS: lldb-unit :: Utility/./UtilityTests/UriParserTest.MinimalPortPath (1290 of 1785) PASS: lldb-api :: functionalities/data-formatter/language_category_updates/TestDataFormatterLanguageCategoryUpdates.py (1291 of 1785) PASS: lldb-unit :: ScriptInterpreter/Python/./ScriptInterpreterPythonTests/PythonDataObjectsTest.TestPythonDictionaryManipulation (1292 of 1785) PASS: lldb-unit :: Utility/./UtilityTests/ArgsTest.TestSingleArg (1293 of 1785) PASS: lldb-unit :: Utility/./UtilityTests/FileSpecTest.GuessPathStyle (1294 of 1785) PASS: lldb-api :: functionalities/thread/concurrent_events/TestConcurrentWatchpointWithDelayWatchpointThreads.py (1295 of 1785) PASS: lldb-api :: functionalities/deleted-executable/TestDeletedExecutable.py (1296 of 1785) PASS: lldb-unit :: Utility/./UtilityTests/UUIDTest.Validity (1297 of 1785) PASS: lldb-api :: commands/expression/entry-bp/TestExprEntryBP.py (1298 of 1785) PASS: lldb-unit :: debugserver/./debugserverTests/RNBSocket.LoopBackListenIPv6 (1299 of 1785) PASS: lldb-api :: commands/command/script_alias/TestCommandScriptAlias.py (1300 of 1785) PASS: lldb-api :: functionalities/multidebugger_commands/TestMultipleDebuggersCommands.py (1301 of 1785) PASS: lldb-api :: functionalities/data-formatter/pyobjsynthprovider/TestPyObjSynthProvider.py (1302 of 1785) PASS: lldb-shell :: ObjectFile/ELF/aarch64-relocations.yaml (1303 of 1785) UNSUPPORTED: lldb-api :: lang/c/typedef/Testtypedef.py (1304 of 1785) PASS: lldb-api :: lang/cpp/bool/TestCPPBool.py (1305 of 1785) PASS: lldb-shell :: ObjectFile/Breakpad/discontiguous-sections.test (1306 of 1785) PASS: lldb-shell :: Reproducer/TestFileRepro.test (1307 of 1785) PASS: lldb-shell :: SymbolFile/DWARF/debug_aranges-empty-section.s (1308 of 1785) PASS: lldb-api :: functionalities/var_path/TestVarPath.py (1309 of 1785) PASS: lldb-shell :: Settings/TestDisassemblyFormat.test (1310 of 1785) PASS: lldb-unit :: Utility/./UtilityTests/UriParserTest.TypicalPortPath (1311 of 1785) UNSUPPORTED: lldb-api :: functionalities/process_save_core/TestProcessSaveCore.py (1312 of 1785) PASS: lldb-shell :: ObjectFile/MachO/lc_build_version.yaml (1313 of 1785) PASS: lldb-api :: sanity/TestModuleCacheSanity.py (1314 of 1785) PASS: lldb-unit :: Utility/./UtilityTests/RecordReplayTest.InstrumentedBar (1315 of 1785) PASS: lldb-unit :: UnwindAssembly/x86/./UnwindAssemblyx86Tests/Testx86AssemblyInspectionEngine.TestPopRBX (1316 of 1785) PASS: lldb-api :: lang/objc/objc-class-method/TestObjCClassMethod.py (1317 of 1785) PASS: lldb-unit :: ScriptInterpreter/Python/./ScriptInterpreterPythonTests/PythonDataObjectsTest.TestGlobalNameResolutionNoDot (1318 of 1785) PASS: lldb-unit :: Expression/./ExpressionTests/DiagnosticManagerTest.HasFixits (1319 of 1785) PASS: lldb-api :: lang/cpp/chained-calls/TestCppChainedCalls.py (1320 of 1785) PASS: lldb-shell :: Settings/TestDisableColor.test (1321 of 1785) PASS: lldb-unit :: Symbol/./SymbolTests/TestClangASTContext.TestBuiltinTypeForEncodingAndBitSize (1322 of 1785) UNSUPPORTED: lldb-api :: functionalities/darwin_log/filter/regex/activity-chain/TestDarwinLogFilterRegexActivityChain.py (1323 of 1785) UNSUPPORTED: lldb-api :: arm/breakpoint-it/TestBreakpointIt.py (1324 of 1785) PASS: lldb-unit :: UnwindAssembly/x86/./UnwindAssemblyx86Tests/Testx86AssemblyInspectionEngine.TestSimple64bitFrameFunction (1325 of 1785) PASS: lldb-api :: commands/watchpoints/watchpoint_disable/TestWatchpointDisable.py (1326 of 1785) PASS: lldb-unit :: Utility/./UtilityTests/StringListTest.SplitIntoLines (1327 of 1785) PASS: lldb-unit :: Utility/./UtilityTests/StreamTest.QuotedCString (1328 of 1785) PASS: lldb-unit :: Host/./HostTests/TaskPoolTest.AddTask (1329 of 1785) PASS: lldb-api :: functionalities/ptr_refs/TestPtrRefs.py (1330 of 1785) PASS: lldb-api :: commands/gui/invalid-args/TestInvalidArgsGui.py (1331 of 1785) PASS: lldb-unit :: Utility/./UtilityTests/EnvironmentTest.EnvpConstruction (1332 of 1785) PASS: lldb-unit :: Utility/./UtilityTests/VMRange.Reset (1333 of 1785) PASS: lldb-unit :: Utility/./UtilityTests/ArchSpecTest.OperatorBool (1334 of 1785) PASS: lldb-shell :: Driver/TestRepl.test (1335 of 1785) PASS: lldb-shell :: Quit/TestQuitExitCodeNonInt.test (1336 of 1785) UNSUPPORTED: lldb-api :: commands/watchpoints/variable_out_of_scope/TestWatchedVarHitWhenInScope.py (1337 of 1785) PASS: lldb-unit :: Host/./HostTests/SocketTest.TCPGetConnectURI (1338 of 1785) PASS: lldb-shell :: ObjectFile/PECOFF/sections-names.yaml (1339 of 1785) UNSUPPORTED: lldb-shell :: SymbolFile/PDB/compilands.test (1340 of 1785) PASS: lldb-unit :: Utility/./UtilityTests/StreamTest.ShiftOperatorStrings (1341 of 1785) PASS: lldb-unit :: Utility/./UtilityTests/StringListTest.JoinThree (1342 of 1785) PASS: lldb-api :: functionalities/mtc/simple/TestMTCSimple.py (1343 of 1785) PASS: lldb-shell :: SymbolFile/NativePDB/s_constant.cpp (1344 of 1785) PASS: lldb-api :: macosx/safe-to-func-call/TestSafeFuncCalls.py (1345 of 1785) PASS: lldb-unit :: Language/Highlighting/./HighlighterTests/HighlighterTest.ClangIdentifiers (1346 of 1785) PASS: lldb-unit :: Language/Highlighting/./HighlighterTests/HighlighterTest.ClangScalarLiterals (1347 of 1785) PASS: lldb-unit :: Language/Highlighting/./HighlighterTests/HighlighterTest.Colons (1348 of 1785) PASS: lldb-unit :: ScriptInterpreter/Python/./ScriptInterpreterPythonTests/PythonDataObjectsTest.TestPythonListManipulation (1349 of 1785) UNSUPPORTED: lldb-api :: functionalities/breakpoint/breakpoint_in_delayslot/TestAvoidBreakpointInDelaySlot.py (1350 of 1785) PASS: lldb-api :: python_api/sbdata/TestSBData.py (1351 of 1785) PASS: lldb-shell :: ObjectFile/ELF/duplicate-section.yaml (1352 of 1785) PASS: lldb-api :: macosx/load-kext/TestLoadKext.py (1353 of 1785) PASS: lldb-shell :: SymbolFile/Breakpad/line-table-discontinuous-file-ids.test (1354 of 1785) PASS: lldb-unit :: Signals/./SignalsTests/UnixSignalsTest.Iteration (1355 of 1785) PASS: lldb-unit :: Interpreter/./InterpreterTests/CompletionTest.FileCompletionAbsolute (1356 of 1785) PASS: lldb-api :: types/TestIntegerTypesExpr.py (1357 of 1785) UNSUPPORTED: lldb-api :: functionalities/darwin_log/filter/regex/category/TestDarwinLogFilterRegexCategory.py (1358 of 1785) PASS: lldb-unit :: Target/./TargetTests/PathMappingListTest.AbsoluteTests (1359 of 1785) PASS: lldb-unit :: debugserver/./debugserverTests/RNBSocket.AnyListen (1360 of 1785) PASS: lldb-api :: lang/objc/modules-cache/TestClangModulesCache.py (1361 of 1785) PASS: lldb-unit :: UnwindAssembly/x86/./UnwindAssemblyx86Tests/Testx86AssemblyInspectionEngine.TestAddESP (1362 of 1785) PASS: lldb-unit :: Process/minidump/./LLDBMinidumpTests/MinidumpParserTest.GetMemoryRegionInfo (1363 of 1785) PASS: lldb-unit :: Utility/./UtilityTests/StringExtractorTest.GetNameColonValueSuccess (1364 of 1785) PASS: lldb-api :: macosx/indirect_symbol/TestIndirectSymbols.py (1365 of 1785) PASS: lldb-api :: functionalities/data-formatter/data-formatter-objc/TestDataFormatterObjCNSURL.py (1366 of 1785) PASS: lldb-unit :: Utility/./UtilityTests/FileSpecTest.GetNormalizedPath (1367 of 1785) PASS: lldb-unit :: Language/Highlighting/./HighlighterTests/HighlighterTest.ClangUnterminatedString (1368 of 1785) PASS: lldb-api :: functionalities/inline-stepping/TestInlineStepping.py (1369 of 1785) PASS: lldb-unit :: Breakpoint/./LLDBBreakpointTests/BreakpointIDTest.StringIsBreakpointName (1370 of 1785) PASS: lldb-api :: commands/expression/scoped_enums/TestScopedEnumType.py (1371 of 1785) PASS: lldb-api :: lang/c/enum_types/TestEnumTypes.py (1372 of 1785) PASS: lldb-shell :: Minidump/dump-all.test (1373 of 1785) PASS: lldb-unit :: Utility/./UtilityTests/StreamTest.ChangingByteOrder (1374 of 1785) PASS: lldb-api :: commands/expression/ignore-artificial-constructors/TestIgnoreArtificialConstructors.py (1375 of 1785) PASS: lldb-unit :: Utility/./UtilityTests/VMRange.SetEndAddress (1376 of 1785) PASS: lldb-api :: lang/cpp/global_variables/TestCPPGlobalVariables.py (1377 of 1785) PASS: lldb-unit :: Core/./LLDBCoreTests/RichManglingContextTest.FromCxxMethodName (1378 of 1785) PASS: lldb-unit :: Editline/./EditlineTests/EditlineTestFixture.EditlineReceivesMultiLineText (1379 of 1785) PASS: lldb-api :: python_api/type/TestTypeList.py (1380 of 1785) PASS: lldb-unit :: Utility/./UtilityTests/StringExtractorTest.GetHexBytes_Partial (1381 of 1785) PASS: lldb-shell :: Reproducer/TestDump.test (1382 of 1785) PASS: lldb-api :: functionalities/thread/step_out/TestThreadStepOut.py (1383 of 1785) PASS: lldb-unit :: Host/./HostTests/TaskPoolTest.TaskMap (1384 of 1785) PASS: lldb-api :: commands/expression/import-std-module/vector-basic/TestBasicVector.py (1385 of 1785) PASS: lldb-unit :: Utility/./UtilityTests/UriParserTest.LongPath (1386 of 1785) PASS: lldb-unit :: Utility/./UtilityTests/StreamTest.PutULEB128 (1387 of 1785) PASS: lldb-shell :: ObjectFile/ELF/section-overlap.yaml (1388 of 1785) PASS: lldb-unit :: Utility/./UtilityTests/GeneratorTest.GetOrCreate (1389 of 1785) PASS: lldb-unit :: Utility/./UtilityTests/NameMatchesTest.Equals (1390 of 1785) PASS: lldb-unit :: Utility/./UtilityTests/StringListTest.ForRange (1391 of 1785) UNSUPPORTED: lldb-api :: lang/cpp/function-template-parameter-pack/TestFunctionTemplateParameterPack.py (1392 of 1785) PASS: lldb-unit :: Host/./HostTests/SocketTest.UDPConnect (1393 of 1785) PASS: lldb-unit :: Process/gdb-remote/./ProcessGdbRemoteTests/GDBRemoteCommunicationClientTest.GetModulesInfoInvalidResponse (1394 of 1785) PASS: lldb-unit :: Process/minidump/./LLDBMinidumpTests/MinidumpParserTest.GetArchitecture (1395 of 1785) PASS: lldb-unit :: UnwindAssembly/x86/./UnwindAssemblyx86Tests/Testx86AssemblyInspectionEngine.TestPushExtended (1396 of 1785) PASS: lldb-api :: commands/expression/import-std-module/conflicts/TestStdModuleWithConflicts.py (1397 of 1785) PASS: lldb-unit :: Host/./HostTests/MainLoopTest.UnmonitoredSignal (1398 of 1785) PASS: lldb-unit :: Utility/./UtilityTests/ArgsTest.BareSingleQuote (1399 of 1785) PASS: lldb-unit :: Utility/./UtilityTests/StringListTest.LongestCommonPrefixEmpty (1400 of 1785) PASS: lldb-shell :: SymbolFile/Breakpad/stack-cfi-parsing.test (1401 of 1785) PASS: lldb-api :: functionalities/rerun/TestRerun.py (1402 of 1785) UNSUPPORTED: lldb-api :: commands/expression/macros/TestMacros.py (1403 of 1785) PASS: lldb-shell :: SymbolFile/Breakpad/symtab.test (1404 of 1785) PASS: lldb-api :: lang/objc/objc-ivar-stripped/TestObjCIvarStripped.py (1405 of 1785) UNSUPPORTED: lldb-shell :: SymbolFile/PDB/expressions.test (1406 of 1785) PASS: lldb-unit :: Utility/./UtilityTests/RecordReplayTest.InstrumentedFooSameThis (1407 of 1785) PASS: lldb-api :: commands/expression/invalid-args/TestInvalidArgsExpression.py (1408 of 1785) PASS: lldb-api :: functionalities/data-formatter/data-formatter-script/TestDataFormatterScript.py (1409 of 1785) PASS: lldb-api :: functionalities/gdb_remote_client/TestGDBRemoteClient.py (1410 of 1785) PASS: lldb-unit :: Language/CPlusPlus/./LanguageCPlusPlusTests/CPlusPlusLanguage.FindAlternateFunctionManglings (1411 of 1785) PASS: lldb-unit :: Utility/./UtilityTests/DataExtractorTest.GetCStrEmpty (1412 of 1785) PASS: lldb-unit :: Utility/./UtilityTests/AnsiTerminal.Unknown (1413 of 1785) PASS: lldb-unit :: Utility/./UtilityTests/StringExtractorTest.GetHexBytes_Underflow (1414 of 1785) PASS: lldb-shell :: ObjectFile/ELF/minidebuginfo-find-symbols.yaml (1415 of 1785) PASS: lldb-unit :: Utility/./UtilityTests/ArgsTest.TestSingleArgWithQuotedSpace (1416 of 1785) PASS: lldb-unit :: Utility/./UtilityTests/Flags.AnyClear (1417 of 1785) PASS: lldb-unit :: Utility/./UtilityTests/StringListTest.AppendListCStringArrayEmpty (1418 of 1785) PASS: lldb-api :: functionalities/signal/raise/TestRaise.py (1419 of 1785) PASS: lldb-unit :: Language/Highlighting/./HighlighterTests/HighlighterTest.ClangCursorPos (1420 of 1785) PASS: lldb-unit :: Utility/./UtilityTests/OptionsWithRawTest.ArgsButNoLeadingDash (1421 of 1785) PASS: lldb-unit :: ScriptInterpreter/Python/./ScriptInterpreterPythonTests/PythonDataObjectsTest.TestPythonTupleInitializerList2 (1422 of 1785) PASS: lldb-unit :: Host/./HostTests/NativeProcessProtocolTest.SetBreakpoint (1423 of 1785) PASS: lldb-shell :: ObjectFile/ELF/PT_LOAD-overlap-PT_INTERP.yaml (1424 of 1785) PASS: lldb-shell :: SymbolFile/NativePDB/function-types-classes.cpp (1425 of 1785) UNSUPPORTED: lldb-shell :: SymbolFile/NativePDB/stack_unwinding01.cpp (1426 of 1785) PASS: lldb-unit :: Utility/./UtilityTests/LogChannelEnabledTest.LLDB_LOG_ERROR (1427 of 1785) PASS: lldb-api :: lang/c/function_types/TestFunctionTypes.py (1428 of 1785) UNSUPPORTED: lldb-shell :: SymbolFile/PDB/enums-layout.test (1429 of 1785) PASS: lldb-shell :: Quit/TestQuitExitCode-30.test (1430 of 1785) PASS: lldb-api :: functionalities/data-formatter/data-formatter-objc/nsstring/TestDataFormatterNSString.py (1431 of 1785) PASS: lldb-api :: functionalities/postmortem/minidump-new/TestMiniDumpUUID.py (1432 of 1785) PASS: lldb-unit :: Utility/./UtilityTests/Flags.AllSet (1433 of 1785) PASS: lldb-api :: functionalities/data-formatter/data-formatter-stl/libcxx/optional/TestDataFormatterLibcxxOptional.py (1434 of 1785) PASS: lldb-unit :: Utility/./UtilityTests/SerializationRountripTest.SerializeDeserializePodPointers (1435 of 1785) PASS: lldb-api :: python_api/symbol-context/two-files/TestSymbolContextTwoFiles.py (1436 of 1785) PASS: lldb-unit :: Symbol/./SymbolTests/PostfixExpression.ParseOneExpression (1437 of 1785) PASS: lldb-shell :: SymbolFile/DWARF/find-function-regex.cpp (1438 of 1785) PASS: lldb-api :: lang/c/step-target/TestStepTarget.py (1439 of 1785) PASS: lldb-api :: commands/expression/test/TestExprs2.py (1440 of 1785) PASS: lldb-api :: lang/cpp/operator-overload/TestOperatorOverload.py (1441 of 1785) PASS: lldb-unit :: UnwindAssembly/x86/./UnwindAssemblyx86Tests/Testx86AssemblyInspectionEngine.TestPopEDI (1442 of 1785) PASS: lldb-api :: lang/c/conflicting-symbol/TestConflictingSymbol.py (1443 of 1785) PASS: lldb-api :: functionalities/breakpoint/breakpoint_command/TestBreakpointCommand.py (1444 of 1785) PASS: lldb-api :: functionalities/gdb_remote_client/TestArmRegisterDefinition.py (1445 of 1785) PASS: lldb-unit :: Utility/./UtilityTests/StringListTest.AppendStringCString (1446 of 1785) PASS: lldb-api :: functionalities/load_unload/TestLoadUnload.py (1447 of 1785) PASS: lldb-unit :: Core/./LLDBCoreTests/UniqueCStringMap.NoDefaultConstructor (1448 of 1785) UNSUPPORTED: lldb-api :: functionalities/darwin_log/filter/exact_match/message/TestDarwinLogFilterMatchMessage.py (1449 of 1785) PASS: lldb-unit :: Utility/./UtilityTests/ArgsTest.TestSingleQuotedArgWithSpace (1450 of 1785) PASS: lldb-api :: commands/expression/expr-in-syscall/TestExpressionInSyscall.py (1451 of 1785) UNSUPPORTED: lldb-api :: functionalities/data-formatter/data-formatter-stl/libcxx/function/TestLibCxxFunction.py (1452 of 1785) PASS: lldb-api :: commands/apropos/basic/TestApropos.py (1453 of 1785) PASS: lldb-shell :: Breakpoint/jitbp_elf.test (1454 of 1785) PASS: lldb-api :: functionalities/thread/concurrent_events/TestConcurrentTwoBreakpointThreads.py (1455 of 1785) PASS: lldb-unit :: Utility/./UtilityTests/StringListTest.Assignment (1456 of 1785) PASS: lldb-api :: functionalities/unwind/noreturn/module-end/TestNoReturnModuleEnd.py (1457 of 1785) PASS: lldb-unit :: SymbolFile/NativePDB/./SymbolFileNativePDBTests/PDBFPOProgramToDWARFExpressionTests.SingleAssignmentRegisterRef (1458 of 1785) PASS: lldb-unit :: Utility/./UtilityTests/TimerTest.CategoryTimes2 (1459 of 1785) PASS: lldb-unit :: ScriptInterpreter/Python/./ScriptInterpreterPythonTests/PythonDataObjectsTest.TestTypeNameResolutionNoDot (1460 of 1785) PASS: lldb-unit :: Host/./HostTests/Host.WaitStatusFormat (1461 of 1785) PASS: lldb-unit :: UnwindAssembly/x86/./UnwindAssemblyx86Tests/Testx86AssemblyInspectionEngine.Test64bitFramelessBigStackFrame (1462 of 1785) UNSUPPORTED: lldb-shell :: SymbolFile/PDB/pointers.test (1463 of 1785) PASS: lldb-unit :: Host/./HostTests/NativeProcessProtocolTest.SetBreakpointFailVerify (1464 of 1785) PASS: lldb-unit :: Utility/./UtilityTests/ConstStringTest.UpdateMangledCounterpart (1465 of 1785) PASS: lldb-shell :: Commands/command-regex-delete.test (1466 of 1785) PASS: lldb-unit :: Utility/./UtilityTests/StreamTest.PutHex32ByteOrderLittle (1467 of 1785) PASS: lldb-unit :: SymbolFile/DWARF/./SymbolFileDWARFTests/SymbolFileDWARFTests.TestAbbrevOrder1Start1 (1468 of 1785) PASS: lldb-api :: lang/cpp/char1632_t/TestChar1632T.py (1469 of 1785) UNSUPPORTED: lldb-api :: functionalities/breakpoint/hardware_breakpoints/hardware_breakpoint_on_multiple_threads/TestHWBreakMultiThread.py (1470 of 1785) PASS: lldb-api :: python_api/watchpoint/watchlocation/TestSetWatchlocation.py (1471 of 1785) PASS: lldb-unit :: SymbolFile/NativePDB/./SymbolFileNativePDBTests/PDBFPOProgramToDWARFExpressionTests.MultipleIndependentAssignments (1472 of 1785) PASS: lldb-api :: functionalities/gdb_remote_client/TestThreadSelectionBug.py (1473 of 1785) PASS: lldb-unit :: UnwindAssembly/x86/./UnwindAssemblyx86Tests/Testx86AssemblyInspectionEngine.TestDisassemblyJunkBytes (1474 of 1785) PASS: lldb-unit :: Interpreter/./InterpreterTests/OptionArgParserTest.toChar (1475 of 1785) PASS: lldb-shell :: ObjectFile/ELF/section-permissions.yaml (1476 of 1785) PASS: lldb-api :: commands/expression/argument_passing_restrictions/TestArgumentPassingRestrictions.py (1477 of 1785) PASS: lldb-unit :: UnwindAssembly/x86/./UnwindAssemblyx86Tests/Testx86AssemblyInspectionEngine.TestDisassemblyMidFunctionEpilogues (1478 of 1785) PASS: lldb-unit :: Utility/./UtilityTests/StringExtractorTest.DecodeHexU8_Underflow (1479 of 1785) UNSUPPORTED: lldb-api :: commands/expression/multiline-completion/TestMultilineCompletion.py (1480 of 1785) PASS: lldb-unit :: Language/Highlighting/./HighlighterTests/HighlighterTest.HighlighterSelectionType (1481 of 1785) PASS: lldb-api :: functionalities/tail_call_frames/thread_step_out_or_return/TestSteppingOutWithArtificialFrames.py (1482 of 1785) PASS: lldb-api :: python_api/hello_world/TestHelloWorld.py (1483 of 1785) PASS: lldb-unit :: Expression/./ExpressionTests/CppModuleConfigurationTest.AmbiguousCLib (1484 of 1785) PASS: lldb-unit :: UnwindAssembly/x86/./UnwindAssemblyx86Tests/Testx86AssemblyInspectionEngine.TestPushR14 (1485 of 1785) PASS: lldb-unit :: Target/./TargetTests/ModuleCacheTest.GetAndPutUuidExists (1486 of 1785) PASS: lldb-unit :: ScriptInterpreter/Python/./ScriptInterpreterPythonTests/PythonExceptionStateTest.TestManualRestoreSemantics (1487 of 1785) PASS: lldb-unit :: Utility/./UtilityTests/RegisterValueTest.GetSet8 (1488 of 1785) PASS: lldb-api :: commands/watchpoints/watchpoint_commands/command/TestWatchpointCommandPython.py (1489 of 1785) PASS: lldb-unit :: Utility/./UtilityTests/StreamTest.PutRawBytesToBigEndian (1490 of 1785) PASS: lldb-unit :: Utility/./UtilityTests/BinaryStreamTest.PutULEB128NineBytes (1491 of 1785) PASS: lldb-api :: python_api/frame/TestFrames.py (1492 of 1785) PASS: lldb-unit :: UnwindAssembly/x86/./UnwindAssemblyx86Tests/Testx86AssemblyInspectionEngine.Test32bitFramelessSmallStackFrame (1493 of 1785) PASS: lldb-api :: functionalities/plugins/command_plugin/TestPluginCommands.py (1494 of 1785) PASS: lldb-unit :: Utility/./UtilityTests/FileSpecTest.EqualDotsPosix (1495 of 1785) PASS: lldb-shell :: SymbolFile/DWARF/debug_ranges_and_rnglists.test (1496 of 1785) PASS: lldb-unit :: Process/minidump/./LLDBMinidumpTests/MinidumpParserTest.GetPid (1497 of 1785) PASS: lldb-shell :: SymbolFile/NativePDB/break-by-line.cpp (1498 of 1785) PASS: lldb-api :: driver/batch_mode/TestBatchMode.py (1499 of 1785) PASS: lldb-api :: commands/quit/TestQuit.py (1500 of 1785) UNSUPPORTED: lldb-api :: functionalities/darwin_log/basic/TestDarwinLogBasic.py (1501 of 1785) PASS: lldb-shell :: ExecControl/StopHook/stop-hook.test (1502 of 1785) PASS: lldb-unit :: Symbol/./SymbolTests/DWARFCallFrameInfoTest.Basic_eh (1503 of 1785) PASS: lldb-api :: functionalities/data-formatter/data-formatter-synth/TestDataFormatterSynth.py (1504 of 1785) PASS: lldb-unit :: Utility/./UtilityTests/UriParserTest.SchemeHostSeparator3 (1505 of 1785) PASS: lldb-shell :: Quit/TestQuitExitCodeTooManyArgs.test (1506 of 1785) PASS: lldb-unit :: Utility/./UtilityTests/RangeTest.ContainsAddrInvalid (1507 of 1785) PASS: lldb-api :: functionalities/signal/handle-abrt/TestHandleAbort.py (1508 of 1785) PASS: lldb-unit :: Utility/./UtilityTests/StringLexerTest.PutBack (1509 of 1785) PASS: lldb-unit :: Host/./HostTests/MainLoopTest.Signal (1510 of 1785) PASS: lldb-unit :: UnwindAssembly/x86/./UnwindAssemblyx86Tests/Testx86AssemblyInspectionEngine.TestPushEBX (1511 of 1785) PASS: lldb-api :: commands/expression/vector_of_enums/TestVectorOfEnums.py (1512 of 1785) UNSUPPORTED: lldb-api :: functionalities/darwin_log/filter/regex/activity/TestDarwinLogFilterRegexActivity.py (1513 of 1785) PASS: lldb-unit :: Utility/./UtilityTests/StringExtractorTest.GetHexBytes_OddPair2 (1514 of 1785) UNSUPPORTED: lldb-api :: functionalities/darwin_log/format/TestDarwinLogMessageFormat.py (1515 of 1785) PASS: lldb-unit :: Utility/./UtilityTests/RangeDataVector.FindEntryThatContains (1516 of 1785) PASS: lldb-shell :: SymbolFile/DWARF/deterministic-build.cpp (1517 of 1785) UNSUPPORTED: lldb-shell :: SymbolFile/PDB/udt-layout.test (1518 of 1785) UNSUPPORTED: lldb-api :: functionalities/data-formatter/data-formatter-stl/libstdcpp/smart_ptr/TestDataFormatterStdSmartPtr.py (1519 of 1785) PASS: lldb-api :: python_api/rdar-12481949/Test-rdar-12481949.py (1520 of 1785) PASS: lldb-unit :: Utility/./UtilityTests/FileSpecTest.PrependPathComponent (1521 of 1785) PASS: lldb-unit :: Host/./HostTests/MainLoopTest.DetectsEOF (1522 of 1785) UNSUPPORTED: lldb-shell :: SymbolFile/NativePDB/typedefs.cpp (1523 of 1785) PASS: lldb-api :: lang/objc/foundation/TestConstStrings.py (1524 of 1785) PASS: lldb-shell :: SymbolFile/DWARF/debug-types-dwarf5.s (1525 of 1785) PASS: lldb-unit :: Utility/./UtilityTests/BinaryStreamTest.PutULEB128SevenBytes (1526 of 1785) PASS: lldb-api :: functionalities/data-formatter/data-formatter-stl/libcxx/iterator/TestDataFormatterLibccIterator.py (1527 of 1785) PASS: lldb-api :: functionalities/signal/TestSendSignal.py (1528 of 1785) PASS: lldb-api :: functionalities/value_md5_crash/TestValueMD5Crash.py (1529 of 1785) PASS: lldb-unit :: Expression/./ExpressionTests/CppModuleConfigurationTest.AmbiguousLibCpp (1530 of 1785) PASS: lldb-unit :: Utility/./UtilityTests/FileSpecTest.RemoveLastPathComponent (1531 of 1785) PASS: lldb-api :: functionalities/asan/TestReportData.py (1532 of 1785) PASS: lldb-api :: commands/frame/diagnose/dereference-this/TestDiagnoseDereferenceThis.py (1533 of 1785) PASS: lldb-unit :: UnwindAssembly/x86/./UnwindAssemblyx86Tests/Testx86AssemblyInspectionEngine.Test32bitFramelessBigStackFrame (1534 of 1785) PASS: lldb-unit :: Expression/./ExpressionTests/DiagnosticManagerTest.GetStringSeverityLabels (1535 of 1785) PASS: lldb-api :: lang/cpp/char8_t/TestCxxChar8_t.py (1536 of 1785) UNSUPPORTED: lldb-shell :: SymbolFile/PDB/class-layout.test (1537 of 1785) PASS: lldb-api :: functionalities/data-formatter/data-formatter-objc/TestDataFormatterObjCNSDate.py (1538 of 1785) PASS: lldb-api :: functionalities/inferior-assert/TestInferiorAssert.py (1539 of 1785) UNSUPPORTED: lldb-api :: functionalities/longjmp/TestLongjmp.py (1540 of 1785) PASS: lldb-unit :: Host/./HostTests/File.GetStreamFromDescriptor (1541 of 1785) PASS: lldb-unit :: Core/./LLDBCoreTests/StreamCallbackTest.Callback (1542 of 1785) PASS: lldb-api :: commands/target/create-deps/TestTargetCreateDeps.py (1543 of 1785) PASS: lldb-unit :: ScriptInterpreter/Python/./ScriptInterpreterPythonTests/PythonDataObjectsTest.TestPythonListValueEquality (1544 of 1785) PASS: lldb-api :: lang/cpp/breakpoint_in_member_func_w_non_primitive_params/TestBreakpointInMemberFuncWNonPrimitiveParams.py (1545 of 1785) PASS: lldb-api :: commands/expression/ir-interpreter-phi-nodes/TestIRInterpreterPHINodes.py (1546 of 1785) PASS: lldb-api :: functionalities/tail_call_frames/disambiguate_paths_to_common_sink/TestDisambiguatePathsToCommonSink.py (1547 of 1785) PASS: lldb-api :: functionalities/breakpoint/breakpoint_language/TestBreakpointLanguage.py (1548 of 1785) UNSUPPORTED: lldb-shell :: Breakpoint/case-insensitive.test (1549 of 1785) PASS: lldb-shell :: Process/TestEnvironment.test (1550 of 1785) PASS: lldb-api :: functionalities/data-formatter/refpointer-recursion/TestDataFormatterRefPtrRecursion.py (1551 of 1785) PASS: lldb-unit :: Utility/./UtilityTests/NameMatchesTest.RegularExpression (1552 of 1785) PASS: lldb-api :: functionalities/data-formatter/data-formatter-ptr-to-array/TestPtrToArrayFormatting.py (1553 of 1785) PASS: lldb-api :: lang/objc/foundation/TestObjectDescriptionAPI.py (1554 of 1785) PASS: lldb-api :: commands/watchpoints/watchpoint_events/TestWatchpointEvents.py (1555 of 1785) PASS: lldb-shell :: ObjectFile/ELF/PT_LOAD-empty.yaml (1556 of 1785) PASS: lldb-shell :: ObjectFile/ELF/short-build-id.yaml (1557 of 1785) PASS: lldb-shell :: Breakpoint/debug_rnglistx_rlex.test (1558 of 1785) PASS: lldb-shell :: Driver/TestCore.test (1559 of 1785) PASS: lldb-unit :: ScriptInterpreter/Python/./ScriptInterpreterPythonTests/PythonExceptionStateTest.TestDiscardSemantics (1560 of 1785) PASS: lldb-api :: python_api/disassemble-raw-data/TestDisassembleRawData.py (1561 of 1785) PASS: lldb-unit :: UnwindAssembly/x86/./UnwindAssemblyx86Tests/Testx86AssemblyInspectionEngine.TestStackRealignMSVC_i386 (1562 of 1785) PASS: lldb-api :: commands/platform/process/TestProcessList.py (1563 of 1785) PASS: lldb-api :: commands/target/create-no-such-arch/TestNoSuchArch.py (1564 of 1785) PASS: lldb-unit :: Utility/./UtilityTests/DataExtractorTest.GetCStrAtEnd (1565 of 1785) PASS: lldb-shell :: Driver/LocalLLDBInit.test (1566 of 1785) PASS: lldb-unit :: Utility/./UtilityTests/ArgsTest.ReplaceArgumentAtIndexFarOutOfRange (1567 of 1785) PASS: lldb-unit :: Expression/./ExpressionTests/CppModuleConfigurationTest.LibCppV2 (1568 of 1785) PASS: lldb-api :: lang/cpp/operators/TestCppOperators.py (1569 of 1785) PASS: lldb-api :: python_api/default-constructor/TestDefaultConstructorForAPIObjects.py (1570 of 1785) PASS: lldb-unit :: SymbolFile/DWARF/./SymbolFileDWARFTests/SymbolFileDWARFTests.TestAbbrevMissingTerminator (1571 of 1785) PASS: lldb-api :: commands/expression/import-std-module/deque-dbg-info-content/TestDbgInfoContentDeque.py (1572 of 1785) UNSUPPORTED: lldb-shell :: Unwind/eh-frame-small-fde.test (1573 of 1785) PASS: lldb-api :: commands/expression/no-deadlock/TestExprDoesntBlock.py (1574 of 1785) PASS: lldb-unit :: UnwindAssembly/x86/./UnwindAssemblyx86Tests/Testx86AssemblyInspectionEngine.TestPushRBX (1575 of 1785) UNSUPPORTED: lldb-api :: linux/sepdebugsymlink/TestTargetSymbolsSepDebugSymlink.py (1576 of 1785) PASS: lldb-api :: functionalities/data-formatter/data-formatter-objc/TestDataFormatterObjCCF.py (1577 of 1785) PASS: lldb-unit :: Utility/./UtilityTests/OptionsWithRawTest.EmptySuffixSingleWhitespace (1578 of 1785) PASS: lldb-unit :: Symbol/./SymbolTests/TestClangASTContext.TestConvertAccessTypeToAccessSpecifier (1579 of 1785) PASS: lldb-unit :: Utility/./UtilityTests/ReproducerTest.SetCapture (1580 of 1785) PASS: lldb-api :: lang/cpp/namespace/TestNamespace.py (1581 of 1785) PASS: lldb-api :: lang/cpp/class_static/TestStaticVariables.py (1582 of 1785) PASS: lldb-unit :: Utility/./UtilityTests/ConstStringTest.FromMidOfBufferStringRef (1583 of 1785) PASS: lldb-unit :: UnwindAssembly/x86/./UnwindAssemblyx86Tests/Testx86AssemblyInspectionEngine.TestReturnDetect (1584 of 1785) PASS: lldb-unit :: Utility/./UtilityTests/BinaryStreamTest.PutULEB128One (1585 of 1785) UNSUPPORTED: lldb-shell :: Expr/TestIRMemoryMapWindows.test (1586 of 1785) PASS: lldb-unit :: Expression/./ExpressionTests/DWARFExpression.DW_OP_pick (1587 of 1785) PASS: lldb-shell :: Driver/TestFile.test (1588 of 1785) PASS: lldb-shell :: Reproducer/TestSynchronous.test (1589 of 1785) PASS: lldb-unit :: Expression/./ExpressionTests/DWARFExpression.DW_OP_convert (1590 of 1785) PASS: lldb-unit :: UnwindAssembly/x86/./UnwindAssemblyx86Tests/Testx86AssemblyInspectionEngine.TestSimple32bitFrameFunction (1591 of 1785) PASS: lldb-api :: lang/cpp/static_methods/TestCPPStaticMethods.py (1592 of 1785) UNSUPPORTED: lldb-shell :: Register/x86-gp-read.test (1593 of 1785) PASS: lldb-shell :: ObjectFile/ELF/basic-info.yaml (1594 of 1785) PASS: lldb-unit :: Process/gdb-remote/./ProcessGdbRemoteTests/GDBRemoteCommunicationServerTest.SendErrorResponse_ErrorList (1595 of 1785) PASS: lldb-unit :: Utility/./UtilityTests/GeneratorTest.Get (1596 of 1785) PASS: lldb-api :: lang/objc/objc-static-method/TestObjCStaticMethod.py (1597 of 1785) PASS: lldb-unit :: Utility/./UtilityTests/CompletionRequest.DuplicateFilteringWithComments (1598 of 1785) PASS: lldb-unit :: Language/Highlighting/./HighlighterTests/HighlighterTest.ClangPPDirectives (1599 of 1785) PASS: lldb-api :: functionalities/data-formatter/type_summary_list_script/TestTypeSummaryListScript.py (1600 of 1785) PASS: lldb-api :: lang/cpp/llvm-style/TestLLVMStyle.py (1601 of 1785) PASS: lldb-unit :: UnwindAssembly/x86/./UnwindAssemblyx86Tests/Testx86AssemblyInspectionEngine.Test32BitOnlyInstruction (1602 of 1785) PASS: lldb-shell :: Settings/TestStopCommandSourceOnError.test (1603 of 1785) PASS: lldb-unit :: Utility/./UtilityTests/RangeTest.LessThanInvalid (1604 of 1785) PASS: lldb-api :: lang/cpp/nested-class-other-compilation-unit/TestNestedClassWithParentInAnotherCU.py (1605 of 1785) PASS: lldb-api :: functionalities/breakpoint/debugbreak/TestDebugBreak.py (1606 of 1785) PASS: lldb-unit :: Utility/./UtilityTests/StringListTest.CopyListEmpty (1607 of 1785) PASS: lldb-unit :: Symbol/./SymbolTests/PostfixExpression.ToDWARF (1608 of 1785) PASS: lldb-api :: commands/expression/import-std-module/forward_list-dbg-info-content/TestDbgInfoContentForwardList.py (1609 of 1785) UNSUPPORTED: lldb-api :: benchmarks/expression/TestRepeatedExprs.py (1610 of 1785) PASS: lldb-shell :: SymbolFile/DWARF/debug_loc.s (1611 of 1785) PASS: lldb-api :: lang/objc/radar-9691614/TestObjCMethodReturningBOOL.py (1612 of 1785) PASS: lldb-api :: macosx/thread-names/TestInterruptThreadNames.py (1613 of 1785) PASS: lldb-api :: python_api/process/io/TestProcessIO.py (1614 of 1785) PASS: lldb-api :: python_api/lldbutil/iter/TestLLDBIterator.py (1615 of 1785) PASS: lldb-api :: lang/c/set_values/TestSetValues.py (1616 of 1785) UNSUPPORTED: lldb-api :: functionalities/data-formatter/data-formatter-stl/libstdcpp/string/TestDataFormatterStdString.py (1617 of 1785) PASS: lldb-unit :: Utility/./UtilityTests/ScalarTest.GetBytes (1618 of 1785) PASS: lldb-unit :: Utility/./UtilityTests/StreamTeeTest.GetStreamAtIndexOutOfBoundsEmpty (1619 of 1785) PASS: lldb-unit :: SymbolFile/DWARF/./SymbolFileDWARFTests/SymbolFileDWARFTests.TestAbbrevNullAttrValidForm (1620 of 1785) UNSUPPORTED: lldb-api :: benchmarks/libcxxlist/TestBenchmarkLibcxxList.py (1621 of 1785) PASS: lldb-api :: commands/expression/import-std-module/deque-basic/TestBasicDeque.py (1622 of 1785) PASS: lldb-api :: commands/version/TestVersion.py (1623 of 1785) PASS: lldb-api :: commands/expression/call-function/TestCallBuiltinFunction.py (1624 of 1785) PASS: lldb-api :: lang/objc/objc++/TestObjCXX.py (1625 of 1785) PASS: lldb-unit :: Process/minidump/./LLDBMinidumpTests/MinidumpParserTest.GetMemoryRegionInfoLinuxMaps (1626 of 1785) UNSUPPORTED: lldb-api :: commands/expression/call-restarts/TestCallThatRestarts.py (1627 of 1785) PASS: lldb-unit :: Utility/./UtilityTests/UriParserTest.BracketedHostnamePort (1628 of 1785) PASS: lldb-unit :: Process/gdb-remote/./ProcessGdbRemoteTests/GDBRemoteCommunicationClientTest.SyncThreadState (1629 of 1785) UNSUPPORTED: lldb-api :: tools/lldb-server/signal-filtering/TestGdbRemote_QPassSignals.py (1630 of 1785) PASS: lldb-api :: python_api/sbvalue_const_addrof/TestSBValueConstAddrOf.py (1631 of 1785) UNSUPPORTED: lldb-api :: tools/lldb-server/platform-process-connect/TestPlatformProcessConnect.py (1632 of 1785) UNSUPPORTED: lldb-api :: tools/lldb-server/TestGdbRemoteModuleInfo.py (1633 of 1785) PASS: lldb-api :: functionalities/thread/concurrent_events/TestConcurrentNWatchNBreak.py (1634 of 1785) PASS: lldb-shell :: Watchpoint/SetErrorCases.test (1635 of 1785) PASS: lldb-api :: python_api/file_handle/TestFileHandle.py (1636 of 1785) PASS: lldb-api :: lang/c/anonymous/TestAnonymous.py (1637 of 1785) PASS: lldb-api :: tools/lldb-server/TestGdbRemote_vCont.py (1638 of 1785) PASS: lldb-api :: lang/objc/hidden-ivars/TestHiddenIvars.py (1639 of 1785) PASS: lldb-unit :: Utility/./UtilityTests/ArchSpecTest.TestParseMachCPUDashSubtypeTripleExtra (1640 of 1785) PASS: lldb-api :: functionalities/data-formatter/data-formatter-stl/libcxx/bitset/TestDataFormatterLibcxxBitset.py (1641 of 1785) PASS: lldb-api :: python_api/value/change_values/TestChangeValueAPI.py (1642 of 1785) PASS: lldb-shell :: Minidump/Windows/Sigsegv/sigsegv.test (1643 of 1785) PASS: lldb-unit :: Process/minidump/./LLDBMinidumpTests/MinidumpParserTest.GetMiscInfo_no_stream (1644 of 1785) PASS: lldb-unit :: Expression/./ExpressionTests/DiagnosticManagerTest.PutString (1645 of 1785) PASS: lldb-api :: lang/cpp/unique-types/TestUniqueTypes.py (1646 of 1785) UNSUPPORTED: lldb-api :: functionalities/data-formatter/data-formatter-stl/libstdcpp/vbool/TestDataFormatterStdVBool.py (1647 of 1785) PASS: lldb-shell :: SymbolFile/DWARF/gnu-style-compression.cpp (1648 of 1785) PASS: lldb-api :: functionalities/breakpoint/auto_continue/TestBreakpointAutoContinue.py (1649 of 1785) PASS: lldb-api :: tools/lldb-server/TestLldbGdbServer.py (1650 of 1785) PASS: lldb-shell :: SymbolFile/DWARF/dir-separator-windows.s (1651 of 1785) PASS: lldb-shell :: SymbolFile/DWARF/find-basic-type.cpp (1652 of 1785) PASS: lldb-api :: python_api/watchpoint/condition/TestWatchpointConditionAPI.py (1653 of 1785) PASS: lldb-unit :: Utility/./UtilityTests/ConstStringTest.CompareConstString (1654 of 1785) PASS: lldb-api :: functionalities/tsan/cpp_global_location/TestTsanCPPGlobalLocation.py (1655 of 1785) PASS: lldb-shell :: ObjectFile/ELF/build-id-case.yaml (1656 of 1785) PASS: lldb-api :: lang/c/stepping/TestStepAndBreakpoints.py (1657 of 1785) PASS: lldb-api :: python_api/target/TestTargetAPI.py (1658 of 1785) PASS: lldb-api :: commands/expression/import-std-module/shared_ptr-dbg-info-content/TestSharedPtrDbgInfoContent.py (1659 of 1785) PASS: lldb-api :: functionalities/data-formatter/var-in-aggregate-misuse/TestVarInAggregateMisuse.py (1660 of 1785) PASS: lldb-api :: lang/cpp/namespace_conflicts/TestNamespaceConflicts.py (1661 of 1785) PASS: lldb-unit :: Expression/./ExpressionTests/DiagnosticManagerTest.FixedExpression (1662 of 1785) PASS: lldb-unit :: UnwindAssembly/x86/./UnwindAssemblyx86Tests/Testx86AssemblyInspectionEngine.TestPushEBP (1663 of 1785) PASS: lldb-unit :: Utility/./UtilityTests/StringListTest.GetMaxStringLengthIncreasingSize (1664 of 1785) PASS: lldb-unit :: UnwindAssembly/x86/./UnwindAssemblyx86Tests/Testx86AssemblyInspectionEngine.TestSubESP (1665 of 1785) PASS: lldb-unit :: ObjectFile/ELF/./ObjectFileELFTests/ObjectFileELFTest.GetSymtab_NoSymEntryPointArmThumbAddressClass (1666 of 1785) PASS: lldb-unit :: Utility/./UtilityTests/CompletionRequest.ShiftArguments (1667 of 1785) PASS: lldb-unit :: Utility/./UtilityTests/CompletionRequest.TestCompletionOwnership (1668 of 1785) PASS: lldb-unit :: Process/gdb-remote/./ProcessGdbRemoteTests/GDBRemoteCommunicationClientTest.ReadRegister (1669 of 1785) PASS: lldb-unit :: Utility/./UtilityTests/StringLexerTest.NextIf (1670 of 1785) PASS: lldb-unit :: Utility/./UtilityTests/UUIDTest.StringConverion (1671 of 1785) PASS: lldb-unit :: Utility/./UtilityTests/RangeTest.ContainsAddr (1672 of 1785) PASS: lldb-api :: lang/objc/foundation/TestFoundationDisassembly.py (1673 of 1785) PASS: lldb-unit :: Process/minidump/./LLDBMinidumpTests/MinidumpParserTest.MinidumpModuleOrder (1674 of 1785) PASS: lldb-unit :: Utility/./UtilityTests/BinaryStreamTest.PutULEB128OneByte (1675 of 1785) PASS: lldb-unit :: Utility/./UtilityTests/StreamTeeTest.AppendStream (1676 of 1785) PASS: lldb-unit :: Utility/./UtilityTests/RangeDataVector.FindEntryThatContains_Overlap (1677 of 1785) PASS: lldb-unit :: Host/./HostTests/HostInfoTest.GetAugmentedArchSpec (1678 of 1785) PASS: lldb-api :: lang/cpp/global_operators/TestCppGlobalOperators.py (1679 of 1785) PASS: lldb-unit :: Utility/./UtilityTests/BinaryStreamTest.PutULEB128FiveBytes (1680 of 1785) PASS: lldb-api :: lang/c/blocks/TestBlocks.py (1681 of 1785) PASS: lldb-api :: functionalities/stats_api/TestStatisticsAPI.py (1682 of 1785) PASS: lldb-api :: functionalities/thread/concurrent_events/TestConcurrentBreakpointDelayBreakpointOneSignal.py (1683 of 1785) PASS: lldb-shell :: SymbolFile/DWARF/dir-separator-no-comp-dir-relative-name.s (1684 of 1785) PASS: lldb-unit :: Utility/./UtilityTests/StringExtractorTest.GetHexBytesAvail_Underflow (1685 of 1785) PASS: lldb-unit :: Utility/./UtilityTests/TimerTest.CategoryTimes (1686 of 1785) UNSUPPORTED: lldb-api :: benchmarks/expression/TestExpressionCmd.py (1687 of 1785) PASS: lldb-api :: api/multithreaded/TestMultithreaded.py (1688 of 1785) PASS: lldb-api :: commands/expression/save_jit_objects/TestSaveJITObjects.py (1689 of 1785) PASS: lldb-api :: lang/cpp/nsimport/TestCppNsImport.py (1690 of 1785) PASS: lldb-api :: lang/cpp/dynamic-value-same-basename/TestDynamicValueSameBase.py (1691 of 1785) PASS: lldb-unit :: Utility/./UtilityTests/VMRange.Comparison (1692 of 1785) PASS: lldb-shell :: SymbolFile/NativePDB/bitfields.cpp (1693 of 1785) PASS: lldb-api :: commands/frame/diagnose/inheritance/TestDiagnoseInheritance.py (1694 of 1785) PASS: lldb-api :: functionalities/data-formatter/data-formatter-stl/libcxx/tuple/TestDataFormatterLibcxxTuple.py (1695 of 1785) PASS: lldb-api :: lang/objc/print-obj/TestPrintObj.py (1696 of 1785) PASS: lldb-api :: python_api/lldbutil/process/TestPrintStackTraces.py (1697 of 1785) UNSUPPORTED: lldb-api :: functionalities/unwind/standard/TestStandardUnwind.py (1698 of 1785) PASS: lldb-shell :: ObjectFile/ELF/section-types.yaml (1699 of 1785) PASS: lldb-unit :: Host/./HostTests/SocketTest.TCPListen0GetPort (1700 of 1785) PASS: lldb-api :: lang/c/local_variables/TestLocalVariables.py (1701 of 1785) PASS: lldb-unit :: Utility/./UtilityTests/AnsiTerminal.WhiteSpace (1702 of 1785) PASS: lldb-unit :: Utility/./UtilityTests/ConstStringTest.NullAndEmptyStates (1703 of 1785) PASS: lldb-unit :: Process/gdb-remote/./ProcessGdbRemoteTests/GDBRemoteCommunicationClientTest.WriteRegister (1704 of 1785) PASS: lldb-unit :: Utility/./UtilityTests/RangeTest.ContainsRangeStartingFromZero (1705 of 1785) UNSUPPORTED: lldb-api :: tools/lldb-vscode/step/TestVSCode_step.py (1706 of 1785) PASS: lldb-unit :: Utility/./UtilityTests/StringListTest.AppendStringStdString (1707 of 1785) PASS: lldb-api :: lang/cpp/scope/TestCppScope.py (1708 of 1785) PASS: lldb-api :: functionalities/breakpoint/cpp/TestCPPBreakpointLocations.py (1709 of 1785) PASS: lldb-api :: functionalities/data-formatter/data-formatter-objc/TestDataFormatterObjCPlain.py (1710 of 1785) UNSUPPORTED: lldb-api :: benchmarks/stepping/TestSteppingSpeed.py (1711 of 1785) PASS: lldb-shell :: ObjectFile/MachO/symtab.yaml (1712 of 1785) UNSUPPORTED: lldb-api :: functionalities/darwin_log/filter/regex/message/TestDarwinLogFilterRegexMessage.py (1713 of 1785) PASS: lldb-api :: commands/expression/call-function/TestCallStdStringFunction.py (1714 of 1785) PASS: lldb-unit :: UnwindAssembly/x86/./UnwindAssemblyx86Tests/Testx86AssemblyInspectionEngine.TestAddRSP (1715 of 1785) PASS: lldb-api :: macosx/universal/TestUniversal.py (1716 of 1785) PASS: lldb-unit :: Host/./HostTests/FileSystemTest.OpenErrno (1717 of 1785) PASS: lldb-unit :: Utility/./UtilityTests/StringListTest.GetMaxStringLengthEqualSize (1718 of 1785) PASS: lldb-api :: functionalities/postmortem/minidump/TestMiniDump.py (1719 of 1785) PASS: lldb-api :: lang/objc/rdar-10967107/TestRdar10967107.py (1720 of 1785) PASS: lldb-unit :: Utility/./UtilityTests/ConstStringTest.format_provider (1721 of 1785) PASS: lldb-api :: functionalities/data-formatter/ptr_ref_typedef/TestPtrRef2Typedef.py (1722 of 1785) PASS: lldb-unit :: Interpreter/./InterpreterTests/OptionArgParserTest.toScriptLanguage (1723 of 1785) PASS: lldb-unit :: Utility/./UtilityTests/StringExtractorTest.DecodeHexU8_InvalidHex (1724 of 1785) PASS: lldb-shell :: SymbolFile/Breakpad/unwind-via-raSearch.test (1725 of 1785) PASS: lldb-unit :: ScriptInterpreter/Python/./ScriptInterpreterPythonTests/PythonDataObjectsTest.TestBorrowedReferences (1726 of 1785) PASS: lldb-api :: commands/expression/rdar42038760/TestScalarURem.py (1727 of 1785) PASS: lldb-api :: python_api/sbtype_typeclass/TestSBTypeTypeClass.py (1728 of 1785) PASS: lldb-api :: commands/expression/persistent_ptr_update/TestPersistentPtrUpdate.py (1729 of 1785) PASS: lldb-unit :: Utility/./UtilityTests/ScalarTest.Scalar_512 (1730 of 1785) PASS: lldb-unit :: ScriptInterpreter/Python/./ScriptInterpreterPythonTests/PythonDataObjectsTest.TestObjectAttributes (1731 of 1785) PASS: lldb-api :: functionalities/thread/concurrent_events/TestConcurrentCrashWithBreak.py (1732 of 1785) PASS: lldb-unit :: Utility/./UtilityTests/ConstStringTest.MangledCounterpart (1733 of 1785) PASS: lldb-api :: functionalities/data-formatter/synthupdate/TestSyntheticFilterRecompute.py (1734 of 1785) UNSUPPORTED: lldb-api :: tools/lldb-vscode/launch/TestVSCode_launch.py (1735 of 1785) PASS: lldb-api :: python_api/symbol-context/TestSymbolContext.py (1736 of 1785) PASS: lldb-unit :: Utility/./UtilityTests/ArgsTest.TestMultipleArgs (1737 of 1785) PASS: lldb-api :: commands/frame/var/TestFrameVar.py (1738 of 1785) PASS: lldb-api :: lang/cpp/gmodules/TestWithModuleDebugging.py (1739 of 1785) PASS: lldb-api :: commands/expression/completion/TestExprCompletion.py (1740 of 1785) PASS: lldb-shell :: SymbolFile/Breakpad/line-table.test (1741 of 1785) PASS: lldb-unit :: Language/Highlighting/./HighlighterTests/HighlighterTest.ClangBraces (1742 of 1785) PASS: lldb-unit :: Utility/./UtilityTests/StreamTeeTest.SetStreamAtIndexOverwrite (1743 of 1785) XFAIL: lldb-shell :: Register/x86-mm-xmm-read.test (1744 of 1785) PASS: lldb-unit :: Signals/./SignalsTests/UnixSignalsTest.GetFilteredSignals (1745 of 1785) PASS: lldb-api :: tools/lldb-server/TestAppleSimulatorOSType.py (1746 of 1785) PASS: lldb-unit :: Process/gdb-remote/./ProcessGdbRemoteTests/GDBRemoteCommunicationClientTest.SendStopTracePacket (1747 of 1785) PASS: lldb-shell :: SymbolFile/Breakpad/line-table-missing-file.test (1748 of 1785) PASS: lldb-unit :: Utility/./UtilityTests/StringListTest.Clear (1749 of 1785) PASS: lldb-unit :: Process/gdb-remote/./ProcessGdbRemoteTests/GDBRemoteClientBaseTest.SendContinueAndAsyncSignal (1750 of 1785) XFAIL: lldb-shell :: Register/x86-64-ymm-write.test (1751 of 1785) PASS: lldb-shell :: ObjectFile/Breakpad/breakpad-identification.test (1752 of 1785) PASS: lldb-unit :: Process/minidump/./LLDBMinidumpTests/MinidumpParserTest.GetThreadsAndGetThreadContext (1753 of 1785) PASS: lldb-shell :: Reproducer/TestWorkingDir.test (1754 of 1785) PASS: lldb-unit :: Utility/./UtilityTests/UriParserTest.SchemeHostSeparator4 (1755 of 1785) PASS: lldb-api :: functionalities/tail_call_frames/disambiguate_call_site/TestDisambiguateCallSite.py (1756 of 1785) PASS: lldb-unit :: Utility/./UtilityTests/GeneratorTest.Create (1757 of 1785) PASS: lldb-unit :: Utility/./UtilityTests/OptionsWithRawTest.MultiWordSuffix (1758 of 1785) UNSUPPORTED: lldb-api :: linux/thread/create_during_instruction_step/TestCreateDuringInstructionStep.py (1759 of 1785) PASS: lldb-unit :: Utility/./UtilityTests/AnsiTerminal.Twice (1760 of 1785) PASS: lldb-api :: commands/expression/unicode-in-variable/TestUnicodeInVariable.py (1761 of 1785) PASS: lldb-api :: functionalities/thread/concurrent_events/TestConcurrentWatchpointDelayWatchpointOneBreakpoint.py (1762 of 1785) PASS: lldb-unit :: Utility/./UtilityTests/BinaryStreamTest.PutSLEB128OneByte (1763 of 1785) UNSUPPORTED: lldb-api :: lang/cpp/static_members/TestCPPStaticMembers.py (1764 of 1785) PASS: lldb-api :: functionalities/data-formatter/data-formatter-objc/TestDataFormatterObjCNSError.py (1765 of 1785) PASS: lldb-shell :: Settings/TestModuleCacheSanity.test (1766 of 1785) PASS: lldb-api :: lang/cpp/enum_types/TestCPP11EnumTypes.py (1767 of 1785) PASS: lldb-api :: arm/emulation/TestEmulations.py (1768 of 1785) PASS: lldb-api :: functionalities/history/TestHistoryRecall.py (1769 of 1785) PASS: lldb-unit :: ScriptInterpreter/Python/./ScriptInterpreterPythonTests/PythonDataObjectsTest.TestPythonFile (1770 of 1785) PASS: lldb-unit :: Utility/./UtilityTests/ScalarTest.SetValueFromCString (1771 of 1785) PASS: lldb-api :: python_api/watchpoint/TestSetWatchpoint.py (1772 of 1785) PASS: lldb-api :: functionalities/type_lookup/TestTypeLookup.py (1773 of 1785) PASS: lldb-api :: commands/watchpoints/multiple_hits/TestMultipleHits.py (1774 of 1785) PASS: lldb-api :: functionalities/load_using_paths/TestLoadUsingPaths.py (1775 of 1785) PASS: lldb-api :: python_api/thread/TestThreadAPI.py (1776 of 1785) PASS: lldb-api :: commands/watchpoints/multiple_threads/TestWatchpointMultipleThreads.py (1777 of 1785) PASS: lldb-api :: commands/expression/call-function/TestCallUserDefinedFunction.py (1778 of 1785) PASS: lldb-api :: functionalities/data-formatter/data-formatter-stl/libcxx/initializerlist/TestInitializerList.py (1779 of 1785) PASS: lldb-api :: commands/expression/call-overridden-method/TestCallOverriddenMethod.py (1780 of 1785) PASS: lldb-api :: functionalities/data-formatter/nssetsynth/TestNSSetSynthetic.py (1781 of 1785) PASS: lldb-api :: lang/objc/objc-super/TestObjCSuper.py (1782 of 1785) PASS: lldb-api :: functionalities/data-formatter/data-formatter-objc/TestDataFormatterObjNSException.py (1783 of 1785) PASS: lldb-api :: lang/objc/objc-new-syntax/TestObjCNewSyntaxArray.py (1784 of 1785) PASS: lldb-api :: lang/objc/real-definition/TestRealDefinition.py (1785 of 1785) Testing Time: 1626.76s ******************** Failing Tests (1): lldb-api :: tools/lldb-server/register-reading/TestGdbRemoteGPacket.py

Hide Details

******************** Unresolved Tests (1): lldb-api :: functionalities/memory/cache/TestMemoryCache.py

Hide Details

Hide Details

Slowest Tests: -------------------------------------------------------------------------- 117.38s: lldb-api :: lang/objc/objc-new-syntax/TestObjCNewSyntaxArray.py 120.65s: lldb-api :: commands/expression/import-std-module/stack/TestStack.py 127.62s: lldb-api :: api/check_public_api_headers/TestPublicAPIHeaders.py 131.81s: lldb-api :: commands/target/basic/TestTargetCommand.py 135.79s: lldb-api :: lang/objc/objc-new-syntax/TestObjCNewSyntaxDictionary.py 146.75s: lldb-api :: functionalities/inferior-crashing/TestInferiorCrashingStep.py 147.70s: lldb-api :: functionalities/recursion/TestValueObjectRecursion.py 156.02s: lldb-api :: lang/objc/exceptions/TestObjCExceptions.py 169.65s: lldb-api :: tools/lldb-server/TestLldbGdbServer.py 171.58s: lldb-api :: lang/objc/objc-new-syntax/TestObjCNewSyntaxLiteral.py 172.85s: lldb-api :: functionalities/return-value/TestReturnValue.py 189.26s: lldb-api :: lang/cpp/enum_types/TestCPP11EnumTypes.py 198.61s: lldb-api :: lang/cpp/namespace/TestNamespaceLookup.py 202.68s: lldb-api :: lang/objc/foundation/TestObjCMethods.py 207.48s: lldb-api :: functionalities/load_unload/TestLoadUnload.py 221.30s: lldb-api :: lang/objc/hidden-ivars/TestHiddenIvars.py 224.64s: lldb-api :: api/multithreaded/TestMultithreaded.py 317.03s: lldb-api :: types/TestIntegerTypes.py 506.36s: lldb-api :: types/TestIntegerTypesExpr.py 697.35s: lldb-api :: lang/objc/foundation/TestFoundationDisassembly.py

Hide Details

Tests Times: -------------------------------------------------------------------------- [ Range ] :: [ Percentage ] :: [ Count ] -------------------------------------------------------------------------- [ 0s, 50s) :: [************************************* ] :: [1673/1785] [ 50s,100s) :: [* ] :: [ 88/1785] [100s,150s) :: [ ] :: [ 11/1785] [150s,200s) :: [ ] :: [ 6/1785] [200s,250s) :: [ ] :: [ 4/1785] [250s,300s) :: [ ] :: [ 0/1785] [300s,350s) :: [ ] :: [ 1/1785] [350s,400s) :: [ ] :: [ 0/1785] [400s,450s) :: [ ] :: [ 0/1785] [450s,500s) :: [ ] :: [ 0/1785] [500s,550s) :: [ ] :: [ 1/1785] [550s,600s) :: [ ] :: [ 0/1785] [600s,650s) :: [ ] :: [ 0/1785] [650s,700s) :: [ ] :: [ 1/1785] Expected Passes : 1635 Expected Failures : 6 Unsupported Tests : 142 Unresolved Tests : 1 Unexpected Failures: 1 FAILED: tools/lldb/test/CMakeFiles/check-lldb-lit cd /Users/buildslave/jenkins/workspace/lldb-cmake-sanitized/lldb-build/tools/lldb/test && /usr/bin/python /Users/buildslave/jenkins/workspace/lldb-cmake-sanitized/lldb-build/./bin/llvm-lit -v --time-tests --shuffle --xunit-xml-output=/Users/buildslave/jenkins/workspace/lldb-cmake-sanitized/test/results.xml -v --timeout 1200 /Users/buildslave/jenkins/workspace/lldb-cmake-sanitized/lldb-build/tools/lldb/test ninja: build stopped: subcommand failed. Command failed Command: ['/usr/bin/env', 'TERM=vt100', '/usr/local/bin/ninja', '-v', 'check-lldb'] [Pipeline] } [Pipeline] // timeout [Pipeline] } [Pipeline] // stage [Pipeline] stage [Pipeline] { (Declarative: Post Actions) [Pipeline] scanForIssues No credentials specified [Clang (LLVM based)] Sleeping for 5 seconds due to JENKINS-32191... [Clang (LLVM based)] Parsing console log (workspace: '/Users/buildslave/jenkins/workspace/lldb-cmake-sanitized') [Pipeline] junit Recording test results [Pipeline] } [Pipeline] // stage [Pipeline] } [Pipeline] // withEnv [Pipeline] } [Pipeline] // node [Pipeline] End of Pipeline [BFA] Scanning build for known causes... [BFA] Found failure cause(s): [BFA] Regression test failed from category Test [BFA] Ninja target failed from category Compile [BFA] Done. 1s ERROR: script returned exit code 1 Finished: FAILURE